FailedConsole Output

Skipping 16,969 KB.. Full Log
gjmp.py (988 of 1228)
PASS: lldb-api :: functionalities/thread/backtrace_all/TestBacktraceAll.py (989 of 1228)
PASS: lldb-api :: functionalities/process_crash_info/TestProcessCrashInfo.py (990 of 1228)
PASS: lldb-api :: lang/objc/global_ptrs/TestGlobalObjects.py (991 of 1228)
UNSUPPORTED: lldb-shell :: SymbolFile/NativePDB/globals-fundamental.cpp (992 of 1228)
PASS: lldb-api :: commands/target/basic/TestTargetCommand.py (993 of 1228)
PASS: lldb-api :: functionalities/data-formatter/data-formatter-skip-summary/TestDataFormatterSkipSummary.py (994 of 1228)
PASS: lldb-api :: functionalities/asan/TestReportData.py (995 of 1228)
PASS: lldb-api :: commands/expression/call-function/TestCallUserDefinedFunction.py (996 of 1228)
PASS: lldb-shell :: ObjectFile/ELF/section-addresses.yaml (997 of 1228)
PASS: lldb-api :: python_api/signals/TestSignalsAPI.py (998 of 1228)
PASS: lldb-api :: functionalities/thread/concurrent_events/TestConcurrentDelaySignalBreak.py (999 of 1228)
PASS: lldb-api :: python_api/watchpoint/condition/TestWatchpointConditionAPI.py (1000 of 1228)
PASS: lldb-api :: lang/c/set_values/TestSetValues.py (1001 of 1228)
PASS: lldb-api :: lang/cpp/extern_c/TestExternCSymbols.py (1002 of 1228)
PASS: lldb-api :: lang/objc/foundation/TestObjCMethodsNSError.py (1003 of 1228)
PASS: lldb-shell :: ObjectFile/ELF/PT_LOAD-empty.yaml (1004 of 1228)
UNSUPPORTED: lldb-api :: tools/lldb-vscode/coreFile/TestVSCode_coreFile.py (1005 of 1228)
PASS: lldb-api :: lang/cpp/covariant-return-types/TestCovariantReturnTypes.py (1006 of 1228)
PASS: lldb-api :: functionalities/tail_call_frames/disambiguate_call_site/TestDisambiguateCallSite.py (1007 of 1228)
PASS: lldb-api :: functionalities/breakpoint/breakpoint_command/TestRegexpBreakCommand.py (1008 of 1228)
PASS: lldb-api :: sample_test/TestSampleTest.py (1009 of 1228)
PASS: lldb-shell :: SymbolFile/DWARF/parallel-indexing-stress.s (1010 of 1228)
UNSUPPORTED: lldb-shell :: Quit/TestQuitExitCodeHexA.test (1011 of 1228)
PASS: lldb-api :: functionalities/data-formatter/nssetsynth/TestNSSetSynthetic.py (1012 of 1228)
PASS: lldb-shell :: Settings/TestEchoCommands.test (1013 of 1228)
PASS: lldb-api :: python_api/lldbutil/TestSwigVersion.py (1014 of 1228)
UNSUPPORTED: lldb-api :: commands/expression/import-std-module/shared_ptr/TestSharedPtrFromStdModule.py (1015 of 1228)
PASS: lldb-api :: functionalities/recursion/TestValueObjectRecursion.py (1016 of 1228)
UNSUPPORTED: lldb-api :: functionalities/data-formatter/data-formatter-stl/libstdcpp/smart_ptr/TestDataFormatterStdSmartPtr.py (1017 of 1228)
PASS: lldb-api :: lang/objc/modules-non-objc-target/TestObjCModulesNonObjCTarget.py (1018 of 1228)
PASS: lldb-shell :: SymbolFile/DWARF/debug_loc-aslr.s (1019 of 1228)
PASS: lldb-api :: iohandler/autosuggestion/TestAutosuggestion.py (1020 of 1228)
PASS: lldb-api :: types/TestFloatTypes.py (1021 of 1228)
PASS: lldb-shell :: Settings/TestSettingsSet.test (1022 of 1228)
UNSUPPORTED: lldb-api :: functionalities/darwin_log/filter/exact_match/activity-chain/TestDarwinLogFilterMatchActivityChain.py (1023 of 1228)
UNSUPPORTED: lldb-api :: benchmarks/continue/TestBenchmarkContinue.py (1024 of 1228)
PASS: lldb-api :: lang/objc/foundation/TestConstStrings.py (1025 of 1228)
UNSUPPORTED: lldb-api :: commands/expression/completion-crash-invalid-iterator/TestInvalidIteratorCompletionCrash.py (1026 of 1228)
PASS: lldb-api :: commands/thread/select/TestThreadSelect.py (1027 of 1228)
PASS: lldb-shell :: Recognizer/assert.test (1028 of 1228)
PASS: lldb-api :: lang/objc/bitfield_ivars/TestBitfieldIvars.py (1029 of 1228)
PASS: lldb-api :: functionalities/postmortem/minidump-new/TestMiniDumpUUID.py (1030 of 1228)
PASS: lldb-api :: commands/watchpoints/multiple_hits/TestMultipleHits.py (1031 of 1228)
PASS: lldb-shell :: SymbolFile/DWARF/dir-separator-no-comp-dir-relative-name.s (1032 of 1228)
UNSUPPORTED: lldb-shell :: SymbolFile/NativePDB/break-by-line.cpp (1033 of 1228)
PASS: lldb-api :: commands/expression/anonymous-struct/TestCallUserAnonTypedef.py (1034 of 1228)
PASS: lldb-api :: tools/lldb-server/TestGdbRemote_qThreadStopInfo.py (1035 of 1228)
PASS: lldb-api :: functionalities/memory/cache/TestMemoryCache.py (1036 of 1228)
PASS: lldb-api :: functionalities/tail_call_frames/ambiguous_tail_call_seq2/TestAmbiguousTailCallSeq2.py (1037 of 1228)
PASS: lldb-api :: functionalities/data-formatter/varscript_formatting/TestDataFormatterVarScriptFormatting.py (1038 of 1228)
PASS: lldb-api :: functionalities/data-formatter/data-formatter-stl/libcxx/multimap/TestDataFormatterLibccMultiMap.py (1039 of 1228)
PASS: lldb-api :: functionalities/unwind/noreturn/module-end/TestNoReturnModuleEnd.py (1040 of 1228)
PASS: lldb-shell :: SymbolFile/DWARF/clang-ast-from-dwarf-objc-property.m (1041 of 1228)
PASS: lldb-api :: functionalities/postmortem/elf-core/gcore/TestGCore.py (1042 of 1228)
PASS: lldb-api :: functionalities/data-formatter/data-formatter-objc/TestDataFormatterObjCNSData.py (1043 of 1228)
UNSUPPORTED: lldb-api :: tools/lldb-vscode/variables/TestVSCode_variables.py (1044 of 1228)
UNSUPPORTED: lldb-api :: python_api/file_handle/TestFileHandle.py (1045 of 1228)
PASS: lldb-api :: functionalities/breakpoint/breakpoint_ignore_count/TestBreakpointIgnoreCount.py (1046 of 1228)
PASS: lldb-api :: lang/cpp/gmodules/TestWithModuleDebugging.py (1047 of 1228)
XFAIL: lldb-shell :: Register/x86-mm-xmm-read.test (1048 of 1228)
PASS: lldb-api :: lang/c/find_struct_type/TestFindStructTypes.py (1049 of 1228)
PASS: lldb-shell :: SymbolFile/DWARF/find-function-regex.cpp (1050 of 1228)
PASS: lldb-api :: python_api/objc_type/TestObjCType.py (1051 of 1228)
PASS: lldb-api :: functionalities/inferior-crashing/recursive-inferior/TestRecursiveInferiorStep.py (1052 of 1228)
PASS: lldb-api :: commands/target/stop-hook/delete/TestTargetStopHookDelete.py (1053 of 1228)
PASS: lldb-api :: lang/objc/objc-new-syntax/TestObjCNewSyntaxLiteral.py (1054 of 1228)
PASS: lldb-api :: lang/objc/objc-property/TestObjCProperty.py (1055 of 1228)
PASS: lldb-api :: functionalities/breakpoint/breakpoint_locations/TestBreakpointLocations.py (1056 of 1228)
UNSUPPORTED: lldb-api :: tools/intel-features/intel-pt/test/TestIntelPTSimpleBinary.py (1057 of 1228)
PASS: lldb-api :: commands/frame/diagnose/dereference-function-return/TestDiagnoseDereferenceFunctionReturn.py (1058 of 1228)
PASS: lldb-shell :: Minidump/no-process-id.yaml (1059 of 1228)
PASS: lldb-api :: functionalities/gdb_remote_client/TestGDBRemoteClient.py (1060 of 1228)
PASS: lldb-api :: api/command-return-object/TestSBCommandReturnObject.py (1061 of 1228)
PASS: lldb-api :: lang/objc/conflicting-definition/TestConflictingDefinition.py (1062 of 1228)
PASS: lldb-api :: functionalities/thread/concurrent_events/TestConcurrentBreakpointDelayBreakpointOneSignal.py (1063 of 1228)
PASS: lldb-shell :: Quit/TestQuitExitCodeHex0.test (1064 of 1228)
PASS: lldb-api :: functionalities/data-formatter/data-formatter-objc/TestDataFormatterObjCNSContainer.py (1065 of 1228)
PASS: lldb-api :: lang/c/function_types/TestFunctionTypes.py (1066 of 1228)
UNSUPPORTED: lldb-shell :: SymbolFile/NativePDB/source-list.cpp (1067 of 1228)
UNSUPPORTED: lldb-shell :: ScriptInterpreter/Lua/independent_state.test (1068 of 1228)
PASS: lldb-api :: commands/watchpoints/watchpoint_count/TestWatchpointCount.py (1069 of 1228)
UNSUPPORTED: lldb-api :: functionalities/data-formatter/data-formatter-stl/libstdcpp/map/TestDataFormatterStdMap.py (1070 of 1228)
UNSUPPORTED: lldb-shell :: SymbolFile/DWARF/debug_loc.s (1071 of 1228)
UNSUPPORTED: lldb-shell :: Reproducer/TestRelativePath.test (1072 of 1228)
UNSUPPORTED: lldb-api :: functionalities/darwin_log/filter/regex/activity/TestDarwinLogFilterRegexActivity.py (1073 of 1228)
XFAIL: lldb-shell :: Register/x86-mm-xmm-write.test (1074 of 1228)
PASS: lldb-api :: functionalities/data-formatter/frameformat_smallstruct/TestFrameFormatSmallStruct.py (1075 of 1228)
PASS: lldb-api :: lang/cpp/call-function/TestCallCPPFunction.py (1076 of 1228)
PASS: lldb-shell :: SymbolFile/DWARF/debug-types-basic.test (1077 of 1228)
UNSUPPORTED: lldb-api :: python_api/disassemble-raw-data/TestDisassembleRawData.py (1078 of 1228)
PASS: lldb-api :: commands/command/nested_alias/TestNestedAlias.py (1079 of 1228)
PASS: lldb-shell :: SymbolFile/DWARF/dwp-debug-types.s (1080 of 1228)
PASS: lldb-shell :: Minidump/Windows/Sigsegv/sigsegv.test (1081 of 1228)
UNSUPPORTED: lldb-shell :: SymbolFile/PDB/calling-conventions.test (1082 of 1228)
UNSUPPORTED: lldb-shell :: Register/x86-ymm-read.test (1083 of 1228)
PASS: lldb-shell :: SymbolFile/DWARF/find-variable-file.cpp (1084 of 1228)
PASS: lldb-shell :: SymbolFile/DWARF/deterministic-build.cpp (1085 of 1228)
PASS: lldb-shell :: BuildScript/compiler-full-path.test (1086 of 1228)
UNSUPPORTED: lldb-api :: tools/lldb-server/platform-process-connect/TestPlatformProcessConnect.py (1087 of 1228)
PASS: lldb-shell :: Watchpoint/SetErrorCases.test (1088 of 1228)
PASS: lldb-api :: functionalities/breakpoint/scripted_bkpt/TestScriptedResolver.py (1089 of 1228)
PASS: lldb-api :: functionalities/data-formatter/poarray/TestPrintObjectArray.py (1090 of 1228)
UNSUPPORTED: lldb-api :: tools/lldb-server/libraries-svr4/TestGdbRemoteLibrariesSvr4Support.py (1091 of 1228)
UNSUPPORTED: lldb-api :: lang/objc/print-obj/TestPrintObj.py (1092 of 1228)
PASS: lldb-api :: types/TestLongTypesExpr.py (1093 of 1228)
PASS: lldb-shell :: SymbolFile/DWARF/dwarf5-debug_line.s (1094 of 1228)
PASS: lldb-api :: functionalities/thread/concurrent_events/TestConcurrentDelaySignalWatch.py (1095 of 1228)
PASS: lldb-shell :: Driver/TestNoUseColor.test (1096 of 1228)
PASS: lldb-api :: macosx/save_crashlog/TestSaveCrashlog.py (1097 of 1228)
PASS: lldb-api :: functionalities/breakpoint/comp_dir_symlink/TestCompDirSymLink.py (1098 of 1228)
PASS: lldb-api :: functionalities/data-formatter/dump_dynamic/TestDumpDynamic.py (1099 of 1228)
PASS: lldb-api :: commands/expression/radar_9673664/TestExprHelpExamples.py (1100 of 1228)
PASS: lldb-api :: commands/target/stop-hook/disable/TestTargetStopHookDisable.py (1101 of 1228)
PASS: lldb-api :: commands/reproducer/invalid-args/TestInvalidArgsReproducer.py (1102 of 1228)
UNSUPPORTED: lldb-shell :: ExecControl/StopHook/stop-hook-threads.test (1103 of 1228)
PASS: lldb-api :: functionalities/backticks/TestBackticksWithoutATarget.py (1104 of 1228)
PASS: lldb-api :: lang/cpp/this_class_type_mixing/TestThisClassTypeMixing.py (1105 of 1228)
UNSUPPORTED: lldb-shell :: Driver/TestPositionalArgs.test (1106 of 1228)
PASS: lldb-api :: commands/expression/dont_allow_jit/TestAllowJIT.py (1107 of 1228)
UNSUPPORTED: lldb-shell :: SymbolFile/DWARF/debug-types-expressions.test (1108 of 1228)
PASS: lldb-api :: macosx/load-kext/TestLoadKext.py (1109 of 1228)
PASS: lldb-api :: types/TestDoubleTypes.py (1110 of 1228)
PASS: lldb-shell :: ObjectFile/ELF/PT_LOAD-overlap.yaml (1111 of 1228)
PASS: lldb-api :: commands/apropos/basic/TestApropos.py (1112 of 1228)
PASS: lldb-api :: python_api/frame/TestFrames.py (1113 of 1228)
PASS: lldb-api :: functionalities/abbreviation/TestAbbreviations.py (1114 of 1228)
UNSUPPORTED: lldb-api :: commands/expression/import-std-module/shared_ptr-dbg-info-content/TestSharedPtrDbgInfoContentFromStdModule.py (1115 of 1228)
UNSUPPORTED: lldb-api :: commands/expression/import-std-module/forward_decl_from_module/TestForwardDeclFromStdModule.py (1116 of 1228)
PASS: lldb-shell :: Breakpoint/jitbp_elf.test (1117 of 1228)
PASS: lldb-shell :: ObjectFile/PECOFF/basic-info-arm.yaml (1118 of 1228)
PASS: lldb-shell :: Breakpoint/debug_rnglist_basic.test (1119 of 1228)
UNSUPPORTED: lldb-api :: commands/register/register/aarch64_sve_registers/rw_access_static_config/TestSVERegisters.py (1120 of 1228)
UNSUPPORTED: lldb-api :: functionalities/breakpoint/hardware_breakpoints/hardware_breakpoint_on_multiple_threads/TestHWBreakMultiThread.py (1121 of 1228)
PASS: lldb-api :: lang/objc/objc++/TestObjCXX.py (1122 of 1228)
PASS: lldb-api :: functionalities/data-formatter/data-formatter-stl/libcxx/list/TestDataFormatterLibcxxList.py (1123 of 1228)
PASS: lldb-api :: lang/objc/ivar-IMP/TestObjCiVarIMP.py (1124 of 1228)
PASS: lldb-api :: commands/frame/var-scope/TestFrameVariableScope.py (1125 of 1228)
PASS: lldb-shell :: BuildScript/toolchain-clang.test (1126 of 1228)
PASS: lldb-api :: api/multiple-targets/TestMultipleTargets.py (1127 of 1228)
PASS: lldb-api :: functionalities/type_lookup/TestTypeLookup.py (1128 of 1228)
PASS: lldb-api :: commands/expression/result_numbering/TestResultNumbering.py (1129 of 1228)
PASS: lldb-api :: lang/objc/objc-ivar-protocols/TestIvarProtocols.py (1130 of 1228)
PASS: lldb-api :: commands/apropos/with-process/TestAproposWithProcess.py (1131 of 1228)
UNSUPPORTED: lldb-shell :: SymbolFile/PDB/func-symbols.test (1132 of 1228)
PASS: lldb-api :: commands/expression/test/TestExprs2.py (1133 of 1228)
PASS: lldb-shell :: SymbolFile/DWARF/debug_loclists-dwo.s (1134 of 1228)
PASS: lldb-api :: functionalities/wrong_commands/TestWrongCommands.py (1135 of 1228)
UNSUPPORTED: lldb-api :: commands/expression/no-deadlock/TestExprDoesntBlock.py (1136 of 1228)
PASS: lldb-api :: functionalities/thread/concurrent_events/TestConcurrentWatchpointDelayWatchpointOneBreakpoint.py (1137 of 1228)
UNSUPPORTED: lldb-api :: commands/expression/import-std-module/vector-dbg-info-content/TestDbgInfoContentVectorFromStdModule.py (1138 of 1228)
UNSUPPORTED: lldb-shell :: Reproducer/Modules/TestModuleCXX.test (1139 of 1228)
PASS: lldb-shell :: Driver/TestTarget.test (1140 of 1228)
PASS: lldb-api :: commands/settings/TestSettings.py (1141 of 1228)
PASS: lldb-api :: functionalities/data-formatter/data-formatter-objc/TestDataFormatterObjCNSError.py (1142 of 1228)
PASS: lldb-api :: commands/target/select/TestTargetSelect.py (1143 of 1228)
PASS: lldb-api :: tools/lldb-server/TestGdbRemoteSingleStep.py (1144 of 1228)
UNSUPPORTED: lldb-shell :: Expr/TestIRMemoryMapWindows.test (1145 of 1228)
PASS: lldb-api :: functionalities/data-formatter/data-formatter-stl/libcxx/unique_ptr/TestDataFormatterLibcxxUniquePtr.py (1146 of 1228)
UNSUPPORTED: lldb-api :: commands/expression/import-std-module/no-std-module/TestMissingStdModule.py (1147 of 1228)
PASS: lldb-shell :: SymbolFile/Breakpad/line-table-missing-file.test (1148 of 1228)
PASS: lldb-api :: functionalities/paths/TestPaths.py (1149 of 1228)
UNSUPPORTED: lldb-shell :: Register/x86-gp-write.test (1150 of 1228)
UNSUPPORTED: lldb-api :: tools/lldb-vscode/console/TestVSCode_console.py (1151 of 1228)
PASS: lldb-api :: types/TestRecursiveTypes.py (1152 of 1228)
PASS: lldb-api :: lang/objc/objc-static-method/TestObjCStaticMethod.py (1153 of 1228)
PASS: lldb-shell :: Settings/TestLineMarkerColor.test (1154 of 1228)
PASS: lldb-api :: commands/command/invalid-args/TestInvalidArgsCommand.py (1155 of 1228)
UNSUPPORTED: lldb-shell :: Breakpoint/case-insensitive.test (1156 of 1228)
PASS: lldb-api :: functionalities/data-formatter/data-formatter-ptr-to-array/TestPtrToArrayFormatting.py (1157 of 1228)
PASS: lldb-shell :: SymbolFile/DWARF/compilercontext.ll (1158 of 1228)
UNSUPPORTED: lldb-api :: lang/cpp/static_members/TestCPPStaticMembers.py (1159 of 1228)
PASS: lldb-api :: functionalities/thread/concurrent_events/TestConcurrentTwoWatchpointThreads.py (1160 of 1228)
PASS: lldb-api :: commands/session/history/TestSessionHistory.py (1161 of 1228)
PASS: lldb-api :: functionalities/data-formatter/nsarraysynth/TestNSArraySynthetic.py (1162 of 1228)
UNSUPPORTED: lldb-api :: commands/watchpoints/variable_out_of_scope/TestWatchedVarHitWhenInScope.py (1163 of 1228)
UNSUPPORTED: lldb-api :: lang/objc/modules/TestObjCModules.py (1164 of 1228)
PASS: lldb-api :: types/TestIntegerType.py (1165 of 1228)
UNSUPPORTED: lldb-api :: commands/watchpoints/hello_watchlocation/TestWatchLocation.py (1166 of 1228)
PASS: lldb-shell :: ObjectFile/ELF/base-address.yaml (1167 of 1228)
UNSUPPORTED: lldb-shell :: ScriptInterpreter/Lua/lua-python.test (1168 of 1228)
PASS: lldb-api :: functionalities/breakpoint/breakpoint_conditions/TestBreakpointConditions.py (1169 of 1228)
PASS: lldb-api :: lang/c/enum_types/TestEnumTypes.py (1170 of 1228)
PASS: lldb-api :: python_api/function_symbol/TestSymbolAPI.py (1171 of 1228)
UNSUPPORTED: lldb-api :: commands/expression/import-std-module/list/TestListFromStdModule.py (1172 of 1228)
PASS: lldb-api :: types/TestDoubleTypesExpr.py (1173 of 1228)
PASS: lldb-api :: functionalities/breakpoint/objc/TestObjCBreakpoints.py (1174 of 1228)
PASS: lldb-api :: tools/lldb-server/TestLldbGdbServer.py (1175 of 1228)
PASS: lldb-api :: lang/c/record_decl_in_expr/TestRecordDeclInExpr.py (1176 of 1228)
PASS: lldb-shell :: ObjectFile/ELF/section-types.yaml (1177 of 1228)
PASS: lldb-api :: lang/objc/exceptions/TestObjCExceptions.py (1178 of 1228)
PASS: lldb-api :: python_api/exprpath_synthetic/TestExprPathSynthetic.py (1179 of 1228)
PASS: lldb-api :: lang/cpp/inlines/TestInlines.py (1180 of 1228)
PASS: lldb-api :: functionalities/thread/num_threads/TestNumThreads.py (1181 of 1228)
PASS: lldb-api :: python_api/module_section/TestModuleAndSection.py (1182 of 1228)
PASS: lldb-api :: commands/expression/ignore-artificial-constructors/TestIgnoreArtificialConstructors.py (1183 of 1228)
UNSUPPORTED: lldb-shell :: Register/x86-64-ymm-read.test (1184 of 1228)
PASS: lldb-shell :: SymbolFile/DWARF/split-dwarf-inlining.cpp (1185 of 1228)
PASS: lldb-api :: functionalities/plugins/python_os_plugin/TestPythonOSPlugin.py (1186 of 1228)
PASS: lldb-api :: commands/statistics/basic/TestStats.py (1187 of 1228)
PASS: lldb-api :: commands/breakpoint/set/func-regex/TestBreakpointRegexError.py (1188 of 1228)
PASS: lldb-shell :: ObjectFile/wasm/embedded-debug-sections.yaml (1189 of 1228)
PASS: lldb-shell :: SymbolFile/DWARF/inline-function-address-shared.test (1190 of 1228)
PASS: lldb-shell :: SymbolFile/DWARF/module-ownership.mm (1191 of 1228)
PASS: lldb-api :: lang/cpp/accelerator-table/TestCPPAccelerator.py (1192 of 1228)
UNSUPPORTED: lldb-shell :: SymbolFile/PDB/variables.test (1193 of 1228)
PASS: lldb-shell :: ObjectFile/ELF/PT_LOAD-overlap-section.yaml (1194 of 1228)
PASS: lldb-shell :: SymbolFile/DWARF/debug-types-dwarf5.s (1195 of 1228)
UNSUPPORTED: lldb-api :: lang/objc/objc-dynamic-value/TestObjCDynamicValue.py (1196 of 1228)
PASS: lldb-api :: tools/lldb-server/TestGdbRemoteThreadsInStopReply.py (1197 of 1228)
UNSUPPORTED: lldb-api :: functionalities/darwin_log/filter/exact_match/subsystem/TestDarwinLogFilterMatchSubsystem.py (1198 of 1228)
PASS: lldb-api :: commands/watchpoints/watchpoint_disable/TestWatchpointDisable.py (1199 of 1228)
PASS: lldb-api :: python_api/type/TestTypeList.py (1200 of 1228)
PASS: lldb-api :: lang/objcxx/class-name-clash/TestNameClash.py (1201 of 1228)
PASS: lldb-api :: commands/frame/diagnose/dereference-this/TestDiagnoseDereferenceThis.py (1202 of 1228)
PASS: lldb-shell :: SymbolFile/DWARF/DW_AT_location-DW_AT_const_value.s (1203 of 1228)
UNSUPPORTED: lldb-api :: tools/lldb-server/signal-filtering/TestGdbRemote_QPassSignals.py (1204 of 1228)
PASS: lldb-api :: functionalities/data-formatter/data-formatter-script/TestDataFormatterScript.py (1205 of 1228)
PASS: lldb-shell :: Breakpoint/dummy-target.test (1206 of 1228)
UNSUPPORTED: lldb-api :: lang/objc/foundation/TestRuntimeTypes.py (1207 of 1228)
PASS: lldb-api :: functionalities/type_completion/TestTypeCompletion.py (1208 of 1228)
UNSUPPORTED: lldb-shell :: ScriptInterpreter/Python/scripted_breakpoint.test (1209 of 1228)
PASS: lldb-api :: functionalities/ubsan/basic/TestUbsanBasic.py (1210 of 1228)
PASS: lldb-shell :: SymbolFile/DWARF/debug-types-dwo-cross-reference.cpp (1211 of 1228)
UNSUPPORTED: lldb-api :: functionalities/gdb_remote_client/TestIOSSimulator.py (1212 of 1228)
UNSUPPORTED: lldb-shell :: Register/x86-gp-read.test (1213 of 1228)
PASS: lldb-shell :: SymbolFile/DWARF/dir-separator-no-comp-dir.s (1214 of 1228)
UNSUPPORTED: lldb-api :: tools/lldb-vscode/completions/TestVSCode_completions.py (1215 of 1228)
PASS: lldb-api :: lang/cpp/stl/TestStdCXXDisassembly.py (1216 of 1228)
PASS: lldb-api :: functionalities/data-formatter/hexcaps/TestDataFormatterHexCaps.py (1217 of 1228)
PASS: lldb-api :: commands/expression/char/TestExprsChar.py (1218 of 1228)
PASS: lldb-api :: functionalities/thread/concurrent_events/TestConcurrentCrashWithWatchpoint.py (1219 of 1228)
PASS: lldb-api :: functionalities/thread/step_out/TestThreadStepOut.py (1220 of 1228)
PASS: lldb-api :: commands/add-dsym/uuid/TestAddDsymCommand.py (1221 of 1228)
PASS: lldb-api :: functionalities/breakpoint/consecutive_breakpoints/TestConsecutiveBreakpoints.py (1222 of 1228)
PASS: lldb-api :: functionalities/data-formatter/data-formatter-caching/TestDataFormatterCaching.py (1223 of 1228)
PASS: lldb-api :: python_api/class_members/TestSBTypeClassMembers.py (1224 of 1228)
PASS: lldb-api :: lang/cpp/operators/TestCppOperators.py (1225 of 1228)
UNSUPPORTED: lldb-api :: functionalities/thread/create_during_step/TestCreateDuringStep.py (1226 of 1228)
PASS: lldb-api :: python_api/watchpoint/watchlocation/TestTargetWatchAddress.py (1227 of 1228)
PASS: lldb-api :: lang/objc/foundation/TestFoundationDisassembly.py (1228 of 1228)
Slowest Tests:
--------------------------------------------------------------------------
117.54s: lldb-api :: tools/lldb-server/TestLldbGdbServer.py
67.33s: lldb-api :: lang/objc/foundation/TestObjCMethods.py
63.62s: lldb-api :: api/multithreaded/TestMultithreaded.py
62.84s: lldb-api :: lang/objc/exceptions/TestObjCExceptions.py
56.88s: lldb-api :: lang/objc/foundation/TestFoundationDisassembly.py
54.18s: lldb-api :: types/TestLongTypesExpr.py
52.46s: lldb-api :: lang/cpp/namespace/TestNamespaceLookup.py
51.78s: lldb-api :: lang/objc/objc-new-syntax/TestObjCNewSyntaxLiteral.py
51.10s: lldb-api :: lang/objc/hidden-ivars/TestHiddenIvars.py
49.67s: lldb-api :: functionalities/completion/TestCompletion.py
44.01s: lldb-api :: lang/objc/real-definition/TestRealDefinition.py
39.94s: lldb-api :: lang/objc/objc-new-syntax/TestObjCNewSyntaxDictionary.py
39.37s: lldb-api :: lang/objc/objc-new-syntax/TestObjCNewSyntaxArray.py
38.49s: lldb-api :: lang/objc/foundation/TestObjCMethodsString.py
38.22s: lldb-api :: lang/objc/foundation/TestObjCMethodsNSError.py
36.52s: lldb-api :: types/TestLongTypes.py
34.03s: lldb-api :: types/TestCharType.py
33.40s: lldb-api :: types/TestIntegerTypeExpr.py
33.12s: lldb-api :: tools/lldb-server/TestGdbRemoteThreadsInStopReply.py
29.98s: lldb-api :: commands/target/basic/TestTargetCommand.py

Hide Details

Tests Times: -------------------------------------------------------------------------- [ Range ] :: [ Percentage ] :: [ Count ] -------------------------------------------------------------------------- [110s,120s) :: [ ] :: [ 1/1228] [100s,110s) :: [ ] :: [ 0/1228] [ 90s,100s) :: [ ] :: [ 0/1228] [ 80s, 90s) :: [ ] :: [ 0/1228] [ 70s, 80s) :: [ ] :: [ 0/1228] [ 60s, 70s) :: [ ] :: [ 3/1228] [ 50s, 60s) :: [ ] :: [ 6/1228] [ 40s, 50s) :: [ ] :: [ 3/1228] [ 30s, 40s) :: [ ] :: [ 7/1228] [ 20s, 30s) :: [ ] :: [ 22/1228] [ 10s, 20s) :: [**** ] :: [ 137/1228] [ 0s, 10s) :: [********************************** ] :: [1049/1228] --------------------------------------------------------------------------

Hide Details

Testing Time: 389.08s Unsupported : 295 Passed : 927 Expectedly Failed: 6 [182/183] cd /Users/buildslave/jenkins/workspace/lldb-cmake-reproducers/lldb-build/tools/lldb/test && /usr/local/Frameworks/Python.framework/Versions/3.7/bin/python3.7 /Users/buildslave/jenkins/workspace/lldb-cmake-reproducers/lldb-build/./bin/llvm-lit -v --time-tests --shuffle --xunit-xml-output=/Users/buildslave/jenkins/workspace/lldb-cmake-reproducers/test/results.xml -v --param lldb-run-with-repro=replay /Users/buildslave/jenkins/workspace/lldb-cmake-reproducers/lldb-build/tools/lldb/test/API /Users/buildslave/jenkins/workspace/lldb-cmake-reproducers/lldb-build/tools/lldb/test/Shell Deleting module cache at /Users/buildslave/jenkins/workspace/lldb-cmake-reproducers/lldb-build/lldb-test-build.noindex/module-cache-lldb/lldb-api. Deleting module cache at /Users/buildslave/jenkins/workspace/lldb-cmake-reproducers/lldb-build/lldb-test-build.noindex/module-cache-clang/lldb-api. -- Testing: 1228 tests, 16 workers -- llvm-lit: /Users/buildslave/jenkins/workspace/lldb-cmake-reproducers/llvm-project/lldb/test/API/lit.cfg.py:142: note: Running API tests in replay mode. llvm-lit: /Users/buildslave/jenkins/workspace/lldb-cmake-reproducers/llvm-project/lldb/test/Shell/lit.cfg.py:52: note: Running Shell tests in replay mode. llvm-lit: /Users/buildslave/jenkins/workspace/lldb-cmake-reproducers/llvm-project/lldb/test/Shell/helper/toolchain.py:117: note: using SDKROOT: '/Applications/Xcode.app/Contents/Developer/Platforms/MacOSX.platform/Developer/SDKs/MacOSX.sdk' llvm-lit: /Users/buildslave/jenkins/workspace/lldb-cmake-reproducers/lldb-build/bin/../../llvm-project/llvm/utils/lit/lit/llvm/config.py:347: note: using clang: /Users/buildslave/jenkins/workspace/lldb-cmake-reproducers/lldb-build/bin/clang llvm-lit: /Users/buildslave/jenkins/workspace/lldb-cmake-reproducers/lldb-build/bin/../../llvm-project/llvm/utils/lit/lit/llvm/config.py:347: note: using ld.lld: /Users/buildslave/jenkins/workspace/lldb-cmake-reproducers/lldb-build/bin/ld.lld llvm-lit: /Users/buildslave/jenkins/workspace/lldb-cmake-reproducers/lldb-build/bin/../../llvm-project/llvm/utils/lit/lit/llvm/config.py:347: note: using lld-link: /Users/buildslave/jenkins/workspace/lldb-cmake-reproducers/lldb-build/bin/lld-link llvm-lit: /Users/buildslave/jenkins/workspace/lldb-cmake-reproducers/lldb-build/bin/../../llvm-project/llvm/utils/lit/lit/llvm/config.py:347: note: using ld64.lld: /Users/buildslave/jenkins/workspace/lldb-cmake-reproducers/lldb-build/bin/ld64.lld llvm-lit: /Users/buildslave/jenkins/workspace/lldb-cmake-reproducers/lldb-build/bin/../../llvm-project/llvm/utils/lit/lit/llvm/config.py:347: note: using wasm-ld: /Users/buildslave/jenkins/workspace/lldb-cmake-reproducers/lldb-build/bin/wasm-ld PASS: lldb-shell :: Quit/TestQuitExitCodeNonInt.test (1 of 1228) PASS: lldb-shell :: SymbolFile/Breakpad/line-table-missing-file.test (2 of 1228) PASS: lldb-shell :: ObjectFile/Breakpad/breakpad-identification.test (3 of 1228) UNSUPPORTED: lldb-api :: lang/objc/print-obj/TestPrintObj.py (4 of 1228) UNSUPPORTED: lldb-api :: commands/watchpoints/multi_watchpoint_slots/TestWatchpointMultipleSlots.py (5 of 1228) PASS: lldb-api :: commands/command/invalid-args/TestInvalidArgsCommand.py (6 of 1228) UNSUPPORTED: lldb-api :: python_api/disassemble-raw-data/TestDisassemble_VST1_64.py (7 of 1228) UNSUPPORTED: lldb-shell :: Driver/TestPositionalArgs.test (8 of 1228) PASS: lldb-api :: tools/lldb-server/inferior-crash/TestGdbRemoteAbort.py (9 of 1228) PASS: lldb-api :: python_api/interpreter/TestCommandInterpreterAPI.py (10 of 1228) UNSUPPORTED: lldb-shell :: Reproducer/TestWorkingDir.test (11 of 1228) PASS: lldb-api :: macosx/save_crashlog/TestSaveCrashlog.py (12 of 1228) PASS: lldb-shell :: Quit/TestQuitExitCodeTooManyArgs.test (13 of 1228) PASS: lldb-api :: functionalities/postmortem/minidump/TestMiniDump.py (14 of 1228) PASS: lldb-api :: sample_test/TestSampleTest.py (15 of 1228) UNSUPPORTED: lldb-shell :: Register/aarch64-fp-read.test (16 of 1228) PASS: lldb-api :: functionalities/breakpoint/source_regexp/TestSourceRegexBreakpoints.py (17 of 1228) PASS: lldb-api :: lang/cpp/unsigned_types/TestUnsignedTypes.py (18 of 1228) PASS: lldb-api :: functionalities/data-formatter/format-propagation/TestFormatPropagation.py (19 of 1228) UNSUPPORTED: lldb-shell :: SymbolFile/DWARF/DW_TAG_GNU_call_site-DW_AT_low_pc.s (20 of 1228) PASS: lldb-api :: sample_test/TestSampleInlineTest.py (21 of 1228) PASS: lldb-api :: python_api/lldbutil/frame/TestFrameUtils.py (22 of 1228) PASS: lldb-api :: lang/cpp/namespace_conflicts/TestNamespaceConflicts.py (23 of 1228) PASS: lldb-api :: lang/c/unions/TestUnionMembers.py (24 of 1228) PASS: lldb-api :: tools/lldb-server/TestGdbRemoteSingleStep.py (25 of 1228) PASS: lldb-api :: python_api/sbvalue_const_addrof/TestSBValueConstAddrOf.py (26 of 1228) PASS: lldb-shell :: SymbolFile/DWARF/static_scope.s (27 of 1228) PASS: lldb-api :: commands/apropos/with-process/TestAproposWithProcess.py (28 of 1228) UNSUPPORTED: lldb-shell :: SymbolFile/target-symbols-add-unwind.test (29 of 1228) UNSUPPORTED: lldb-shell :: SymbolFile/NativePDB/break-by-line.cpp (30 of 1228) PASS: lldb-api :: functionalities/data-formatter/data-formatter-stl/libcxx/optional/TestDataFormatterLibcxxOptional.py (31 of 1228) PASS: lldb-api :: lang/cpp/type_lookup/TestCppTypeLookup.py (32 of 1228) PASS: lldb-api :: functionalities/data-formatter/data-formatter-stl/libstdcpp/unique_ptr/invalid/TestDataFormatterInvalidStdUniquePtr.py (33 of 1228) PASS: lldb-api :: driver/batch_mode/TestBatchMode.py (34 of 1228) PASS: lldb-api :: functionalities/breakpoint/move_nearest/TestMoveNearest.py (35 of 1228) PASS: lldb-api :: functionalities/data-formatter/data-formatter-objc/TestDataFormatterObjCPlain.py (36 of 1228) PASS: lldb-shell :: SymbolFile/DWARF/debug-types-dwarf5.s (37 of 1228) PASS: lldb-shell :: SymbolFile/DWARF/win-i386-line-table.s (38 of 1228) PASS: lldb-shell :: SymbolFile/DWARF/debug-types-dwo-cross-reference.cpp (39 of 1228) UNSUPPORTED: lldb-shell :: Register/x86-gp-read.test (40 of 1228) PASS: lldb-api :: functionalities/thread/concurrent_events/TestConcurrentTwoBreakpointsOneDelaySignal.py (41 of 1228) PASS: lldb-api :: functionalities/gdb_remote_client/TestArmRegisterDefinition.py (42 of 1228) PASS: lldb-api :: functionalities/gdb_remote_client/TestQemuAArch64TargetXml.py (43 of 1228) PASS: lldb-api :: commands/command/source/TestCommandSource.py (44 of 1228) PASS: lldb-api :: functionalities/thread/concurrent_events/TestConcurrentCrashWithSignal.py (45 of 1228) PASS: lldb-api :: lang/c/tls_globals/TestTlsGlobals.py (46 of 1228) PASS: lldb-api :: commands/frame/diagnose/local-variable/TestLocalVariable.py (47 of 1228) PASS: lldb-api :: api/log/TestAPILog.py (48 of 1228) UNSUPPORTED: lldb-shell :: ScriptInterpreter/Lua/breakpoint_callback.test (49 of 1228) PASS: lldb-api :: commands/gui/basic/TestGuiBasic.py (50 of 1228) PASS: lldb-api :: commands/expression/pr35310/TestExprsBug35310.py (51 of 1228) UNSUPPORTED: lldb-shell :: SymbolFile/DWARF/debug-types-expressions.test (52 of 1228) UNSUPPORTED: lldb-shell :: SymbolFile/DWARF/split-dwarf-expression-eval-bug.cpp (53 of 1228) PASS: lldb-api :: python_api/watchpoint/TestSetWatchpoint.py (54 of 1228) PASS: lldb-shell :: SymbolFile/DWARF/childless-compile-unit.s (55 of 1228) PASS: lldb-api :: lang/objc/objc++/TestObjCXX.py (56 of 1228) UNSUPPORTED: lldb-api :: functionalities/gdb_remote_client/TestWriteMemory.py (57 of 1228) PASS: lldb-api :: functionalities/breakpoint/breakpoint_by_file_colon_line/TestBreakpointByFileColonLine.py (58 of 1228) PASS: lldb-api :: tools/lldb-server/TestGdbRemote_vCont.py (59 of 1228) UNSUPPORTED: lldb-shell :: SymbolFile/PDB/typedefs.test (60 of 1228) UNSUPPORTED: lldb-api :: python_api/symbol-context/TestSymbolContext.py (61 of 1228) UNSUPPORTED: lldb-shell :: Register/arm-fp-read.test (62 of 1228) UNSUPPORTED: lldb-shell :: Driver/TestHelp.test (63 of 1228) PASS: lldb-api :: python_api/frame/get-variables/TestGetVariables.py (64 of 1228) UNSUPPORTED: lldb-shell :: SymbolFile/PDB/expressions.test (65 of 1228) PASS: lldb-api :: macosx/safe-to-func-call/TestSafeFuncCalls.py (66 of 1228) PASS: lldb-api :: commands/expression/call-function/TestCallStdStringFunction.py (67 of 1228) PASS: lldb-api :: functionalities/process_crash_info/TestProcessCrashInfo.py (68 of 1228) PASS: lldb-api :: functionalities/mtc/simple/TestMTCSimple.py (69 of 1228) UNSUPPORTED: lldb-api :: functionalities/thread/concurrent_events/TestConcurrentManySignals.py (70 of 1228) PASS: lldb-api :: lang/cpp/lambdas/TestLambdas.py (71 of 1228) PASS: lldb-shell :: Breakpoint/debug_rnglist_basic.test (72 of 1228) PASS: lldb-api :: commands/log/basic/TestLogging.py (73 of 1228) PASS: lldb-api :: python_api/objc_type/TestObjCType.py (74 of 1228) PASS: lldb-shell :: ObjectFile/PECOFF/uuid.yaml (75 of 1228) PASS: lldb-api :: functionalities/unwind/noreturn/TestNoreturnUnwind.py (76 of 1228) PASS: lldb-api :: commands/expression/po_verbosity/TestPoVerbosity.py (77 of 1228) PASS: lldb-api :: lang/objc/global_ptrs/TestGlobalObjects.py (78 of 1228) PASS: lldb-api :: functionalities/data-formatter/poarray/TestPrintObjectArray.py (79 of 1228) PASS: lldb-shell :: Driver/TestCommands.test (80 of 1228) PASS: lldb-api :: functionalities/thread/step_out/TestThreadStepOut.py (81 of 1228) UNSUPPORTED: lldb-api :: functionalities/darwin_log/source/debug/TestDarwinLogSourceDebug.py (82 of 1228) UNSUPPORTED: lldb-shell :: SymbolFile/NativePDB/ast-methods.cpp (83 of 1228) PASS: lldb-shell :: Quit/TestQuitExitCodeHex0.test (84 of 1228) PASS: lldb-api :: lang/cpp/this_class_type_mixing/TestThisClassTypeMixing.py (85 of 1228) PASS: lldb-api :: functionalities/data-formatter/data-formatter-stl/libcxx/initializerlist/TestInitializerList.py (86 of 1228) PASS: lldb-shell :: Breakpoint/ppc64-localentry.test (87 of 1228) PASS: lldb-shell :: SymbolFile/DWARF/debug_rnglists-dwo.s (88 of 1228) UNSUPPORTED: lldb-shell :: SymbolFile/NativePDB/ast-functions.cpp (89 of 1228) UNSUPPORTED: lldb-api :: python_api/disassemble-raw-data/TestDisassembleRawData.py (90 of 1228) UNSUPPORTED: lldb-api :: macosx/macCatalyst/TestMacCatalyst.py (91 of 1228) PASS: lldb-shell :: SymbolFile/Breakpad/unwind-via-stack-win-no-memory-info.yaml (92 of 1228) UNSUPPORTED: lldb-api :: functionalities/unwind/standard/TestStandardUnwind.py (93 of 1228) PASS: lldb-api :: commands/watchpoints/watchpoint_set_command/TestWatchLocationWithWatchSet.py (94 of 1228) PASS: lldb-api :: lang/cpp/char1632_t/TestChar1632T.py (95 of 1228) UNSUPPORTED: lldb-api :: lang/cpp/printf/TestPrintf.py (96 of 1228) UNSUPPORTED: lldb-shell :: Reproducer/TestMultipleTargets.test (97 of 1228) UNSUPPORTED: lldb-shell :: ScriptInterpreter/Lua/nested_sessions.test (98 of 1228) PASS: lldb-api :: lang/cpp/incomplete-types/TestCppIncompleteTypes.py (99 of 1228) PASS: lldb-api :: commands/breakpoint/command/list/TestBreakpointCommandList.py (100 of 1228) PASS: lldb-shell :: Breakpoint/debug_rnglist_offset_pair.test (101 of 1228) PASS: lldb-shell :: SymbolFile/DWARF/dwarf5-atomic.s (102 of 1228) PASS: lldb-shell :: Breakpoint/dummy-target.test (103 of 1228) UNSUPPORTED: lldb-shell :: BuildScript/toolchain-clang-cl.test (104 of 1228) UNSUPPORTED: lldb-api :: benchmarks/turnaround/TestCompileRunToBreakpointTurnaround.py (105 of 1228) PASS: lldb-api :: commands/expression/call-function/TestCallBuiltinFunction.py (106 of 1228) UNSUPPORTED: lldb-api :: lang/cpp/function-template-parameter-pack/TestFunctionTemplateParameterPack.py (107 of 1228) PASS: lldb-shell :: SymbolFile/DWARF/dir-separator-no-comp-dir-relative-name.s (108 of 1228) UNSUPPORTED: lldb-shell :: Reproducer/Functionalities/TestStepping.test (109 of 1228) PASS: lldb-api :: python_api/type/TestTypeList.py (110 of 1228) PASS: lldb-api :: lang/cpp/breakpoint-commands/TestCPPBreakpointCommands.py (111 of 1228) PASS: lldb-api :: functionalities/breakpoint/breakpoint_ids/TestBreakpointIDs.py (112 of 1228) PASS: lldb-api :: functionalities/type_completion/TestTypeCompletion.py (113 of 1228) PASS: lldb-api :: commands/expression/save_jit_objects/TestSaveJITObjects.py (114 of 1228) PASS: lldb-api :: iohandler/unicode/TestUnicode.py (115 of 1228) UNSUPPORTED: lldb-api :: functionalities/data-formatter/data-formatter-stl/libstdcpp/map/TestDataFormatterStdMap.py (116 of 1228) UNSUPPORTED: lldb-api :: commands/process/attach/attach_denied/TestAttachDenied.py (117 of 1228) PASS: lldb-shell :: SymbolFile/DWARF/DW_AT_const_value.s (118 of 1228) PASS: lldb-api :: commands/expression/namespace_local_var_same_name_cpp_and_c/TestNamespaceLocalVarSameNameCppAndC.py (119 of 1228) UNSUPPORTED: lldb-shell :: Register/x86-ymm-read.test (120 of 1228) UNSUPPORTED: lldb-api :: commands/expression/import-std-module/conflicts/TestStdModuleWithConflicts.py (121 of 1228) PASS: lldb-api :: functionalities/data-formatter/data-formatter-stl/libcxx/vector/TestDataFormatterLibcxxVector.py (122 of 1228) UNSUPPORTED: lldb-api :: macosx/function-starts/TestFunctionStarts.py (123 of 1228) PASS: lldb-api :: lang/objc/orderedset/TestOrderedSet.py (124 of 1228) UNSUPPORTED: lldb-shell :: Register/x86-ymm-write.test (125 of 1228) UNSUPPORTED: lldb-shell :: SymbolFile/PDB/vbases.test (126 of 1228) PASS: lldb-shell :: Driver/TestNoUseColor.test (127 of 1228) PASS: lldb-api :: lang/c/global_variables/TestGlobalVariables.py (128 of 1228) PASS: lldb-api :: lang/objcxx/hide-runtime-values/TestObjCXXHideRuntimeValues.py (129 of 1228) UNSUPPORTED: lldb-api :: functionalities/data-formatter/data-formatter-stl/libstdcpp/smart_ptr/TestDataFormatterStdSmartPtr.py (130 of 1228) PASS: lldb-api :: functionalities/data-formatter/data-formatter-stl/libcxx/bitset/TestDataFormatterLibcxxBitset.py (131 of 1228) PASS: lldb-api :: functionalities/data-formatter/data-formatter-objc/TestDataFormatterObjNSException.py (132 of 1228) PASS: lldb-api :: commands/platform/file/close/TestPlatformFileClose.py (133 of 1228) PASS: lldb-api :: functionalities/gdb_remote_client/TestThreadSelectionBug.py (134 of 1228) PASS: lldb-api :: commands/platform/file/read/TestPlatformFileRead.py (135 of 1228) PASS: lldb-api :: lang/cpp/gmodules-templates/TestGModules.py (136 of 1228) PASS: lldb-shell :: VSCode/TestOptions.test (137 of 1228) PASS: lldb-shell :: Driver/TestTarget.test (138 of 1228) PASS: lldb-api :: functionalities/tail_call_frames/sbapi_support/TestTailCallFrameSBAPI.py (139 of 1228) PASS: lldb-api :: functionalities/postmortem/wow64_minidump/TestWow64MiniDump.py (140 of 1228) PASS: lldb-shell :: ObjectFile/MachO/lc_version_min.yaml (141 of 1228) PASS: lldb-api :: functionalities/thread/concurrent_events/TestConcurrentWatchpointDelayWatchpointOneBreakpoint.py (142 of 1228) PASS: lldb-api :: functionalities/unwind/noreturn/module-end/TestNoReturnModuleEnd.py (143 of 1228) UNSUPPORTED: lldb-api :: commands/expression/import-std-module/empty-module/TestEmptyStdModule.py (144 of 1228) PASS: lldb-api :: functionalities/postmortem/minidump-new/TestMiniDumpNew.py (145 of 1228) PASS: lldb-shell :: Register/x86-64-gp-read.test (146 of 1228) UNSUPPORTED: lldb-api :: commands/register/register/aarch64_sve_registers/rw_access_static_config/TestSVERegisters.py (147 of 1228) UNSUPPORTED: lldb-api :: benchmarks/libcxxmap/TestBenchmarkLibcxxMap.py (148 of 1228) PASS: lldb-api :: functionalities/data-formatter/data-formatter-objc/nsstring/TestDataFormatterNSString.py (149 of 1228) PASS: lldb-api :: functionalities/data-formatter/data-formatter-objc/nsindexpath/TestDataFormatterNSIndexPath.py (150 of 1228) PASS: lldb-shell :: Breakpoint/case-sensitive.test (151 of 1228) PASS: lldb-api :: types/TestFloatTypesExpr.py (152 of 1228) PASS: lldb-api :: functionalities/data-formatter/summary-string-onfail/Test-rdar-9974002.py (153 of 1228) PASS: lldb-api :: commands/register/register/register_command/TestRegisters.py (154 of 1228) PASS: lldb-api :: functionalities/data-formatter/data-formatter-objc/TestDataFormatterObjCCF.py (155 of 1228) PASS: lldb-api :: commands/expression/result_numbering/TestResultNumbering.py (156 of 1228) PASS: lldb-api :: commands/target/basic/TestTargetCommand.py (157 of 1228) PASS: lldb-api :: python_api/breakpoint/TestBreakpointAPI.py (158 of 1228) PASS: lldb-api :: functionalities/thread/concurrent_events/TestConcurrentWatchBreakDelay.py (159 of 1228) PASS: lldb-shell :: SymbolFile/DWARF/debug-types-signature-loop.s (160 of 1228) PASS: lldb-api :: functionalities/inline-stepping/TestInlineStepping.py (161 of 1228) UNSUPPORTED: lldb-api :: tools/lldb-server/registers-target-xml-reading/TestGdbRemoteTargetXmlPacket.py (162 of 1228) PASS: lldb-api :: python_api/symbol-context/two-files/TestSymbolContextTwoFiles.py (163 of 1228) PASS: lldb-api :: commands/gui/invalid-args/TestInvalidArgsGui.py (164 of 1228) PASS: lldb-api :: lang/cpp/exceptions/TestCPPExceptionBreakpoints.py (165 of 1228) PASS: lldb-shell :: BuildScript/compiler-full-path.test (166 of 1228) PASS: lldb-api :: lang/cpp/frame-var-anon-unions/TestFrameVariableAnonymousUnions.py (167 of 1228) PASS: lldb-api :: python_api/lldbutil/iter/TestRegistersIterator.py (168 of 1228) PASS: lldb-api :: functionalities/postmortem/elf-core/gcore/TestGCore.py (169 of 1228) PASS: lldb-shell :: SymbolFile/DWARF/debug-types-address-ranges.s (170 of 1228) PASS: lldb-api :: commands/session/history/TestSessionHistory.py (171 of 1228) UNSUPPORTED: lldb-shell :: Driver/TestCore.test (172 of 1228) PASS: lldb-api :: api/multiple-targets/TestMultipleTargets.py (173 of 1228) PASS: lldb-shell :: SymbolFile/DWARF/debug_line-relative_path.s (174 of 1228) PASS: lldb-shell :: SymbolFile/symbol-binding.test (175 of 1228) UNSUPPORTED: lldb-shell :: Quit/TestQuitExitCode30.test (176 of 1228) PASS: lldb-api :: lang/cpp/operators/TestCppOperators.py (177 of 1228) PASS: lldb-api :: functionalities/breakpoint/breakpoint_hit_count/TestBreakpointHitCount.py (178 of 1228) PASS: lldb-api :: functionalities/thread/ignore_suspended/TestIgnoreSuspendedThread.py (179 of 1228) PASS: lldb-api :: functionalities/data-formatter/data-formatter-objc/TestDataFormatterObjCNSData.py (180 of 1228) PASS: lldb-api :: commands/expression/cast_int_to_anonymous_enum/TestCastIntToAnonymousEnum.py (181 of 1228) UNSUPPORTED: lldb-shell :: SymbolFile/NativePDB/typedefs.cpp (182 of 1228) PASS: lldb-api :: lang/objc/direct-dispatch-step/TestObjCDirectDispatchStepping.py (183 of 1228) PASS: lldb-api :: lang/c/step_over_no_deadlock/TestStepOverDoesntBlock.py (184 of 1228) UNSUPPORTED: lldb-shell :: Unwind/eh-frame-small-fde.test (185 of 1228) PASS: lldb-api :: lang/c/const_variables/TestConstVariables.py (186 of 1228) PASS: lldb-api :: lang/c/vla/TestVLA.py (187 of 1228) UNSUPPORTED: lldb-api :: functionalities/thread/exit_during_expression/TestExitDuringExpression.py (188 of 1228) UNSUPPORTED: lldb-api :: functionalities/breakpoint/breakpoint_set_restart/TestBreakpointSetRestart.py (189 of 1228) PASS: lldb-api :: lang/c/inlines/TestRedefinitionsInInlines.py (190 of 1228) PASS: lldb-api :: functionalities/thread/concurrent_events/TestConcurrentDelayedCrashWithBreakpointWatchpoint.py (191 of 1228) PASS: lldb-shell :: SymbolFile/DWARF/debug-line-basic.s (192 of 1228) UNSUPPORTED: lldb-shell :: BuildScript/toolchain-msvc.test (193 of 1228) PASS: lldb-shell :: Driver/TestConvenienceVariables.test (194 of 1228) PASS: lldb-shell :: Minidump/fb-dump.test (195 of 1228) PASS: lldb-api :: functionalities/breakpoint/breakpoint_by_line_and_column/TestBreakpointByLineAndColumn.py (196 of 1228) PASS: lldb-api :: commands/watchpoints/watchpoint_commands/TestWatchpointCommands.py (197 of 1228) PASS: lldb-api :: macosx/nslog/TestDarwinNSLogOutput.py (198 of 1228) PASS: lldb-api :: functionalities/data-formatter/data-formatter-stl/libcxx/unique_ptr/TestDataFormatterLibcxxUniquePtr.py (199 of 1228) PASS: lldb-shell :: ObjectFile/PECOFF/disassemble-thumb.yaml (200 of 1228) UNSUPPORTED: lldb-shell :: SymbolFile/PDB/enums-layout.test (201 of 1228) UNSUPPORTED: lldb-shell :: Driver/LocalLLDBInit.test (202 of 1228) PASS: lldb-shell :: ObjectFile/ELF/PT_LOAD-empty.yaml (203 of 1228) PASS: lldb-api :: functionalities/thread/concurrent_events/TestConcurrentCrashWithWatchpoint.py (204 of 1228) PASS: lldb-api :: functionalities/data-formatter/data-formatter-stl/libcxx/unordered/TestDataFormatterUnordered.py (205 of 1228) PASS: lldb-api :: functionalities/breakpoint/step_over_breakpoint/TestStepOverBreakpoint.py (206 of 1228) PASS: lldb-api :: functionalities/memory/read/TestMemoryRead.py (207 of 1228) PASS: lldb-api :: commands/expression/invalid-args/TestInvalidArgsExpression.py (208 of 1228) PASS: lldb-api :: functionalities/value_md5_crash/TestValueMD5Crash.py (209 of 1228) PASS: lldb-api :: functionalities/breakpoint/cpp/TestCPPBreakpointLocations.py (210 of 1228) PASS: lldb-api :: lang/objc/modules-incomplete/TestIncompleteModules.py (211 of 1228) UNSUPPORTED: lldb-api :: functionalities/darwin_log/basic/TestDarwinLogBasic.py (212 of 1228) PASS: lldb-shell :: SymbolFile/DWARF/find-function-regex.cpp (213 of 1228) UNSUPPORTED: lldb-shell :: Unwind/eh-frame-augment-noop.test (214 of 1228) PASS: lldb-shell :: SymbolFile/DWARF/debug_line-tombstone.s (215 of 1228) PASS: lldb-shell :: Settings/TestModuleCacheSanity.test (216 of 1228) UNSUPPORTED: lldb-api :: functionalities/process_group/TestChangeProcessGroup.py (217 of 1228) PASS: lldb-api :: lang/cpp/inlines/TestInlines.py (218 of 1228) UNSUPPORTED: lldb-shell :: SymbolFile/PDB/pointers.test (219 of 1228) PASS: lldb-api :: functionalities/target-new-solib-notifications/TestModuleLoadedNotifys.py (220 of 1228) PASS: lldb-api :: functionalities/data-formatter/array_typedef/TestArrayTypedef.py (221 of 1228) UNSUPPORTED: lldb-api :: iohandler/resize/TestIOHandlerResizeNoEditline.py (222 of 1228) PASS: lldb-api :: lang/objc/foundation/TestObjCMethods.py (223 of 1228) PASS: lldb-api :: lang/objc/objc-super/TestObjCSuper.py (224 of 1228) PASS: lldb-shell :: SymbolFile/Breakpad/symtab-macho.test (225 of 1228) PASS: lldb-api :: api/check_public_api_headers/TestPublicAPIHeaders.py (226 of 1228) PASS: lldb-api :: commands/expression/anonymous-struct/TestCallUserAnonTypedef.py (227 of 1228) PASS: lldb-api :: functionalities/breakpoint/breakpoint_callback_command_source/TestBreakpointCallbackCommandSource.py (228 of 1228) PASS: lldb-api :: commands/target/stop-hook/enable/TestTargetStopHookEnable.py (229 of 1228) PASS: lldb-shell :: Commands/command-disassemble.s (230 of 1228) PASS: lldb-api :: tools/lldb-server/TestGdbRemoteRegisterState.py (231 of 1228) PASS: lldb-shell :: ObjectFile/ELF/short-build-id.yaml (232 of 1228) PASS: lldb-api :: lang/c/step-target/TestStepTarget.py (233 of 1228) PASS: lldb-api :: functionalities/show_location/TestShowLocationDwarf5.py (234 of 1228) PASS: lldb-shell :: ObjectFile/MachO/lc_build_version_notools.yaml (235 of 1228) PASS: lldb-api :: lang/objc/conflicting-definition/TestConflictingDefinition.py (236 of 1228) PASS: lldb-api :: functionalities/data-formatter/data-formatter-stl/libcxx/map/TestDataFormatterLibccMap.py (237 of 1228) PASS: lldb-api :: functionalities/breakpoint/dummy_target_breakpoints/TestBreakpointsWithNoTargets.py (238 of 1228) UNSUPPORTED: lldb-api :: functionalities/breakpoint/breakpoint_in_delayslot/TestAvoidBreakpointInDelaySlot.py (239 of 1228) PASS: lldb-api :: functionalities/thread/concurrent_events/TestConcurrentSignalDelayBreak.py (240 of 1228) UNSUPPORTED: lldb-api :: commands/session/save/TestSessionSave.py (241 of 1228) PASS: lldb-api :: functionalities/inferior-crashing/recursive-inferior/TestRecursiveInferiorStep.py (242 of 1228) PASS: lldb-shell :: SymbolFile/DWARF/compilercontext.ll (243 of 1228) UNSUPPORTED: lldb-shell :: SymbolFile/NativePDB/break-by-function.cpp (244 of 1228) PASS: lldb-shell :: ObjectFile/Breakpad/sections.test (245 of 1228) PASS: lldb-shell :: ObjectFile/PECOFF/basic-info-arm64.yaml (246 of 1228) UNSUPPORTED: lldb-api :: commands/target/auto-install-main-executable/TestAutoInstallMainExecutable.py (247 of 1228) PASS: lldb-api :: functionalities/data-formatter/boolreference/TestFormattersBoolRefPtr.py (248 of 1228) PASS: lldb-api :: lang/cpp/class_types/TestClassTypesDisassembly.py (249 of 1228) PASS: lldb-api :: types/TestShortTypeExpr.py (250 of 1228) FAIL: lldb-api :: functionalities/postmortem/minidump-new/TestMiniDumpUUID.py (251 of 1228) ******************** TEST 'lldb-api :: functionalities/postmortem/minidump-new/TestMiniDumpUUID.py' FAILED ******************** Script: -- /usr/local/Frameworks/Python.framework/Versions/3.7/bin/python3.7 /Users/buildslave/jenkins/workspace/lldb-cmake-reproducers/llvm-project/lldb/test/API/dotest.py -s /Users/buildslave/jenkins/workspace/lldb-cmake-reproducers/lldb-build/lldb-test-traces -S nm -u CXXFLAGS -u CFLAGS --codesign-identity lldb_codesign --server /Users/buildslave/jenkins/workspace/lldb-cmake-reproducers/lldb-build/./bin/debugserver --arch x86_64 --build-dir /Users/buildslave/jenkins/workspace/lldb-cmake-reproducers/lldb-build/lldb-test-build.noindex -s=/Users/buildslave/jenkins/workspace/lldb-cmake-reproducers/test/logs -t --env TERM=vt100 --env LLVM_LIBS_DIR=/Users/buildslave/jenkins/workspace/lldb-cmake-reproducers/lldb-build/./lib --arch x86_64 --build-dir /Users/buildslave/jenkins/workspace/lldb-cmake-reproducers/lldb-build/lldb-test-build.noindex --lldb-module-cache-dir /Users/buildslave/jenkins/workspace/lldb-cmake-reproducers/lldb-build/lldb-test-build.noindex/module-cache-lldb/lldb-api --clang-module-cache-dir /Users/buildslave/jenkins/workspace/lldb-cmake-reproducers/lldb-build/lldb-test-build.noindex/module-cache-clang/lldb-api --executable /Users/buildslave/jenkins/workspace/lldb-cmake-reproducers/lldb-build/./bin/lldb --compiler /Users/buildslave/jenkins/workspace/lldb-cmake-reproducers/lldb-build/./bin/clang --dsymutil /Users/buildslave/jenkins/workspace/lldb-cmake-reproducers/lldb-build/./bin/dsymutil --filecheck /Users/buildslave/jenkins/workspace/lldb-cmake-reproducers/lldb-build/./bin/FileCheck --yaml2obj /Users/buildslave/jenkins/workspace/lldb-cmake-reproducers/lldb-build/./bin/yaml2obj --lldb-libs-dir /Users/buildslave/jenkins/workspace/lldb-cmake-reproducers/lldb-build/./lib --skip-category=lldb-vscode --skip-category=std-module /Users/buildslave/jenkins/workspace/lldb-cmake-reproducers/llvm-project/lldb/test/API/functionalities/postmortem/minidump-new -p TestMiniDumpUUID.py --replay-path /Users/buildslave/jenkins/workspace/lldb-cmake-reproducers/lldb-build/lldb-test-build.noindex/reproducers/TestMiniDumpUUID.py -- Exit Code: -6

Hide Details

Command Output (stdout): -- lldb version 12.0.99 clang revision e30371d99d5157ac9718c803dd1101f9cbb1b224 llvm revision e30371d99d5157ac9718c803dd1101f9cbb1b224

Hide Details

-- Command Output (stderr): -- Unable to retrieve process ID from minidump file, setting process ID to 1. Unable to retrieve process ID from minidump file, setting process ID to 1. Unable to retrieve process ID from minidump file, setting process ID to 1. Unable to retrieve process ID from minidump file, setting process ID to 1. Unable to retrieve process ID from minidump file, setting process ID to 1. Reproducer expected signature 921: 'const char * SBModule::GetUUIDString()' Reproducer actual signature 487: 'uint32_t SBDebugger::GetNumTargets()' LLVM ERROR: Detected reproducer replay divergence. Refusing to continue. Fatal Python error: Aborted

Hide Details

Current thread 0x00000001167a0dc0 (most recent call first): File "/Users/buildslave/jenkins/workspace/lldb-cmake-reproducers/lldb-build/lib/python3.7/site-packages/lldb/__init__.py", line 4305 in GetNumTargets File "/Users/buildslave/jenkins/workspace/lldb-cmake-reproducers/lldb-build/lib/python3.7/site-packages/lldb/__init__.py", line 143 in lldb_iter File "/Users/buildslave/jenkins/workspace/lldb-cmake-reproducers/llvm-project/lldb/packages/Python/lldbsuite/test/lldbtest.py", line 2074 in tearDown File "/Users/buildslave/jenkins/workspace/lldb-cmake-reproducers/llvm-project/lldb/third_party/Python/module/unittest2/unittest2/case.py", line 386 in run File "/Users/buildslave/jenkins/workspace/lldb-cmake-reproducers/llvm-project/lldb/third_party/Python/module/unittest2/unittest2/case.py", line 458 in __call__ File "/Users/buildslave/jenkins/workspace/lldb-cmake-reproducers/llvm-project/lldb/third_party/Python/module/unittest2/unittest2/suite.py", line 117 in _wrapped_run File "/Users/buildslave/jenkins/workspace/lldb-cmake-reproducers/llvm-project/lldb/third_party/Python/module/unittest2/unittest2/suite.py", line 115 in _wrapped_run File "/Users/buildslave/jenkins/workspace/lldb-cmake-reproducers/llvm-project/lldb/third_party/Python/module/unittest2/unittest2/suite.py", line 85 in run File "/Users/buildslave/jenkins/workspace/lldb-cmake-reproducers/llvm-project/lldb/third_party/Python/module/unittest2/unittest2/suite.py", line 66 in __call__ File "/Users/buildslave/jenkins/workspace/lldb-cmake-reproducers/llvm-project/lldb/third_party/Python/module/unittest2/unittest2/runner.py", line 165 in run File "/Users/buildslave/jenkins/workspace/lldb-cmake-reproducers/llvm-project/lldb/packages/Python/lldbsuite/test/dotest.py", line 1038 in run_suite File "/Users/buildslave/jenkins/workspace/lldb-cmake-reproducers/llvm-project/lldb/test/API/dotest.py", line 7 in <module>

Hide Details

--

Hide Details

******************** UNSUPPORTED: lldb-api :: commands/process/attach-resume/TestAttachResume.py (252 of 1228) UNSUPPORTED: lldb-api :: functionalities/gdb_remote_client/TestRestartBug.py (253 of 1228) PASS: lldb-shell :: SymbolFile/Breakpad/unwind-via-raSearch.test (254 of 1228) UNSUPPORTED: lldb-api :: commands/register/register/intel_xtended_registers/mpx_bound_violation/TestBoundViolation.py (255 of 1228) PASS: lldb-api :: tools/lldb-server/TestGdbRemoteProcessInfo.py (256 of 1228) UNSUPPORTED: lldb-api :: commands/expression/import-std-module/list/TestListFromStdModule.py (257 of 1228) PASS: lldb-api :: functionalities/avoids-fd-leak/TestFdLeak.py (258 of 1228) UNSUPPORTED: lldb-api :: commands/register/register/intel_xtended_registers/TestMPXRegisters.py (259 of 1228) PASS: lldb-api :: functionalities/data-formatter/data-formatter-script/TestDataFormatterScript.py (260 of 1228) PASS: lldb-api :: iohandler/resize/TestIOHandlerResize.py (261 of 1228) PASS: lldb-api :: functionalities/exec/TestExec.py (262 of 1228) UNSUPPORTED: lldb-api :: tools/lldb-vscode/stackTrace/TestVSCode_stackTrace.py (263 of 1228) PASS: lldb-api :: functionalities/pointer_num_children/TestPointerNumChildren.py (264 of 1228) PASS: lldb-api :: functionalities/thread/concurrent_events/TestConcurrentManyWatchpoints.py (265 of 1228) PASS: lldb-api :: functionalities/source-map/TestTargetSourceMap.py (266 of 1228) PASS: lldb-api :: lang/objc/modules-compile-error/TestModulesCompileError.py (267 of 1228) PASS: lldb-shell :: SymbolFile/DWARF/DW_AT_location-DW_AT_const_value.s (268 of 1228) PASS: lldb-api :: commands/frame/diagnose/complicated-expression/TestComplicatedExpression.py (269 of 1228) PASS: lldb-api :: functionalities/memory-region/TestMemoryRegion.py (270 of 1228) PASS: lldb-api :: lang/cpp/this/TestCPPThis.py (271 of 1228) UNSUPPORTED: lldb-api :: tools/lldb-server/TestGdbRemoteCompletion.py (272 of 1228) PASS: lldb-api :: functionalities/dlopen_other_executable/TestDlopenOtherExecutable.py (273 of 1228) PASS: lldb-shell :: Settings/TestFrameFormatColor.test (274 of 1228) PASS: lldb-shell :: ObjectFile/ELF/aarch64-relocations.yaml (275 of 1228) PASS: lldb-shell :: SymbolFile/DWARF/DW_TAG_variable-DW_AT_const_value.s (276 of 1228) UNSUPPORTED: lldb-api :: functionalities/thread/multi_break/TestMultipleBreakpoints.py (277 of 1228) PASS: lldb-shell :: Commands/command-regex-unalias.test (278 of 1228) PASS: lldb-api :: functionalities/breakpoint/scripted_bkpt/TestScriptedResolver.py (279 of 1228) PASS: lldb-api :: functionalities/data-formatter/data-formatter-named-summaries/TestDataFormatterNamedSummaries.py (280 of 1228) PASS: lldb-shell :: ObjectFile/MachO/subsections.yaml (281 of 1228) UNSUPPORTED: lldb-shell :: Register/x86-64-xmm16-read.test (282 of 1228) PASS: lldb-api :: functionalities/tail_call_frames/cross_dso/TestCrossDSOTailCalls.py (283 of 1228) UNSUPPORTED: lldb-api :: commands/expression/macros/TestMacros.py (284 of 1228) PASS: lldb-api :: functionalities/plugins/python_os_plugin/stepping_plugin_threads/TestOSPluginStepping.py (285 of 1228) PASS: lldb-api :: lang/objc/modules-cache/TestClangModulesCache.py (286 of 1228) PASS: lldb-api :: lang/objc/unicode-string/TestUnicodeString.py (287 of 1228) UNSUPPORTED: lldb-api :: tools/lldb-vscode/breakpoint/TestVSCode_setExceptionBreakpoints.py (288 of 1228) PASS: lldb-api :: lang/cpp/class_static/TestStaticVariables.py (289 of 1228) PASS: lldb-api :: commands/frame/diagnose/bad-reference/TestBadReference.py (290 of 1228) PASS: lldb-shell :: SymbolFile/DWARF/dir-separator-posix.s (291 of 1228) PASS: lldb-api :: lang/cpp/constructors/TestCppConstructors.py (292 of 1228) PASS: lldb-api :: macosx/find-app-in-bundle/TestFindAppInBundle.py (293 of 1228) UNSUPPORTED: lldb-api :: benchmarks/startup/TestStartupDelays.py (294 of 1228) PASS: lldb-shell :: Host/TestCustomShell.test (295 of 1228) PASS: lldb-api :: functionalities/breakpoint/breakpoint_language/TestBreakpointLanguage.py (296 of 1228) UNSUPPORTED: lldb-api :: macosx/macCatalystAppMacOSFramework/TestMacCatalystAppWithMacOSFramework.py (297 of 1228) PASS: lldb-api :: functionalities/thread/concurrent_events/TestConcurrentWatchBreak.py (298 of 1228) UNSUPPORTED: lldb-api :: python_api/process/io/TestProcessIO.py (299 of 1228) PASS: lldb-api :: lang/cpp/extern_c/TestExternCSymbols.py (300 of 1228) UNSUPPORTED: lldb-api :: python_api/process/read-mem-cstring/TestReadMemCString.py (301 of 1228) UNSUPPORTED: lldb-shell :: SymbolFile/DWARF/debug_loc.s (302 of 1228) PASS: lldb-api :: lang/cpp/limit-debug-info/TestWithLimitDebugInfo.py (303 of 1228) UNSUPPORTED: lldb-shell :: Reproducer/Functionalities/TestDataFormatter.test (304 of 1228) PASS: lldb-api :: commands/expression/import_builtin_fileid/TestImportBuiltinFileID.py (305 of 1228) UNSUPPORTED: lldb-shell :: ScriptInterpreter/Python/scripted_breakpoint.test (306 of 1228) PASS: lldb-shell :: Minidump/Windows/find-module.test (307 of 1228) PASS: lldb-api :: commands/frame/recognizer/TestFrameRecognizer.py (308 of 1228) PASS: lldb-api :: lang/cpp/trivial_abi/TestTrivialABI.py (309 of 1228) PASS: lldb-api :: python_api/watchpoint/watchlocation/TestSetWatchlocation.py (310 of 1228) PASS: lldb-api :: functionalities/unwind/sigtramp/TestSigtrampUnwind.py (311 of 1228) PASS: lldb-api :: commands/expression/completion/TestExprCompletion.py (312 of 1228) PASS: lldb-api :: functionalities/breakpoint/serialize/TestBreakpointSerialization.py (313 of 1228) PASS: lldb-api :: functionalities/lazy-loading/TestLazyLoading.py (314 of 1228) PASS: lldb-api :: functionalities/data-formatter/data-formatter-enum-format/TestDataFormatterEnumFormat.py (315 of 1228) PASS: lldb-api :: functionalities/data-formatter/nsdictionarysynth/TestNSDictionarySynthetic.py (316 of 1228) PASS: lldb-api :: tools/lldb-server/commandline/TestStubSetSID.py (317 of 1228) PASS: lldb-api :: python_api/thread/TestThreadAPI.py (318 of 1228) PASS: lldb-api :: functionalities/thread/concurrent_events/TestConcurrentManyCrash.py (319 of 1228) PASS: lldb-api :: functionalities/limit-debug-info/TestLimitDebugInfo.py (320 of 1228) PASS: lldb-api :: functionalities/data-formatter/data-formatter-stl/libcxx/iterator/TestDataFormatterLibccIterator.py (321 of 1228) PASS: lldb-api :: lang/cpp/function-qualifiers/TestCppFunctionQualifiers.py (322 of 1228) PASS: lldb-shell :: ObjectFile/ELF/section-types-edgecases.yaml (323 of 1228) PASS: lldb-api :: commands/command/script/import/TestImport.py (324 of 1228) PASS: lldb-shell :: SymbolFile/Breakpad/line-table-edgecases.test (325 of 1228) PASS: lldb-shell :: ObjectFile/PECOFF/dep-modules.yaml (326 of 1228) UNSUPPORTED: lldb-api :: arm/breakpoint-thumb-codesection/TestBreakpointThumbCodesection.py (327 of 1228) PASS: lldb-api :: functionalities/asan/TestReportData.py (328 of 1228) PASS: lldb-api :: functionalities/conditional_break/TestConditionalBreak.py (329 of 1228) PASS: lldb-api :: lang/cpp/chained-calls/TestCppChainedCalls.py (330 of 1228) PASS: lldb-api :: python_api/watchpoint/TestWatchpointIter.py (331 of 1228) UNSUPPORTED: lldb-api :: functionalities/step_scripted/TestStepScripted.py (332 of 1228) PASS: lldb-api :: lang/c/find_struct_type/TestFindStructTypes.py (333 of 1228) PASS: lldb-api :: functionalities/data-formatter/data-formatter-stl/libcxx/multiset/TestDataFormatterLibcxxMultiSet.py (334 of 1228) PASS: lldb-api :: lang/objc/modules-app-update/TestClangModulesAppUpdate.py (335 of 1228) UNSUPPORTED: lldb-shell :: Register/x86-64-gp-write.test (336 of 1228) PASS: lldb-api :: python_api/value/empty_class/TestValueAPIEmptyClass.py (337 of 1228) PASS: lldb-api :: lang/objc/modules-non-objc-target/TestObjCModulesNonObjCTarget.py (338 of 1228) PASS: lldb-api :: lang/objc/foundation/TestConstStrings.py (339 of 1228) PASS: lldb-api :: functionalities/tsan/multiple/TestTsanMultiple.py (340 of 1228) UNSUPPORTED: lldb-api :: functionalities/data-formatter/data-formatter-stl/libstdcpp/list/TestDataFormatterStdList.py (341 of 1228) PASS: lldb-api :: functionalities/tsan/thread_numbers/TestTsanThreadNumbers.py (342 of 1228) UNSUPPORTED: lldb-api :: python_api/event/TestEvents.py (343 of 1228) PASS: lldb-api :: functionalities/thread/concurrent_events/TestConcurrentSignalDelayWatch.py (344 of 1228) PASS: lldb-shell :: SymbolFile/DWARF/debug_aranges-empty-section.s (345 of 1228) PASS: lldb-shell :: Unwind/trap_frame_sym_ctx.test (346 of 1228) PASS: lldb-api :: python_api/get-value-32bit-int/TestGetValue32BitInt.py (347 of 1228) PASS: lldb-api :: functionalities/data-formatter/nsarraysynth/TestNSArraySynthetic.py (348 of 1228) PASS: lldb-api :: lang/cpp/operator-overload/TestOperatorOverload.py (349 of 1228) UNSUPPORTED: lldb-api :: commands/expression/import-std-module/vector-dbg-info-content/TestDbgInfoContentVectorFromStdModule.py (350 of 1228) PASS: lldb-shell :: SymbolFile/DWARF/debug_ranges.s (351 of 1228) PASS: lldb-api :: functionalities/thread/backtrace_all/TestBacktraceAll.py (352 of 1228) PASS: lldb-api :: python_api/sbplatform/TestSBPlatform.py (353 of 1228) UNSUPPORTED: lldb-api :: linux/sepdebugsymlink/TestTargetSymbolsSepDebugSymlink.py (354 of 1228) PASS: lldb-api :: functionalities/tail_call_frames/cross_object/TestCrossObjectTailCalls.py (355 of 1228) PASS: lldb-api :: functionalities/data-formatter/refpointer-recursion/TestDataFormatterRefPtrRecursion.py (356 of 1228) PASS: lldb-api :: functionalities/return-value/TestReturnValue.py (357 of 1228) PASS: lldb-api :: functionalities/tsan/thread_leak/TestTsanThreadLeak.py (358 of 1228) PASS: lldb-api :: functionalities/breakpoint/breakpoint_locations/TestBreakpointLocations.py (359 of 1228) PASS: lldb-api :: functionalities/tsan/global_location/TestTsanGlobalLocation.py (360 of 1228) UNSUPPORTED: lldb-shell :: ScriptInterpreter/Lua/command_script_import.test (361 of 1228) PASS: lldb-api :: functionalities/data-formatter/var-in-aggregate-misuse/TestVarInAggregateMisuse.py (362 of 1228) UNSUPPORTED: lldb-api :: tools/lldb-vscode/breakpoint-events/TestVSCode_breakpointEvents.py (363 of 1228) PASS: lldb-api :: commands/watchpoints/watchpoint_commands/command/TestWatchpointCommandPython.py (364 of 1228) PASS: lldb-api :: macosx/duplicate-archive-members/TestDuplicateMembers.py (365 of 1228) PASS: lldb-api :: lang/cpp/template-specialization-type/TestTemplateSpecializationType.py (366 of 1228) PASS: lldb-api :: commands/expression/completion-crash-incomplete-record/TestCompletionCrashIncompleteRecord.py (367 of 1228) PASS: lldb-api :: lang/objc/objc-runtime-ivars/TestRuntimeIvars.py (368 of 1228) PASS: lldb-shell :: SymbolFile/DWARF/DW_AT_loclists_base.s (369 of 1228) PASS: lldb-api :: functionalities/data-formatter/data-formatter-objc/TestDataFormatterObjCNSError.py (370 of 1228) PASS: lldb-api :: types/TestIntegerTypeExpr.py (371 of 1228) PASS: lldb-api :: lang/cpp/offsetof/TestOffsetofCpp.py (372 of 1228) PASS: lldb-api :: lang/objc/objc-property/TestObjCProperty.py (373 of 1228) UNSUPPORTED: lldb-api :: tools/lldb-vscode/runInTerminal/TestVSCode_runInTerminal.py (374 of 1228) UNSUPPORTED: lldb-shell :: Register/x86-64-ymm16-read.test (375 of 1228) PASS: lldb-api :: functionalities/plugins/python_os_plugin/TestPythonOSPlugin.py (376 of 1228) PASS: lldb-api :: python_api/lldbutil/TestSwigVersion.py (377 of 1228) PASS: lldb-api :: types/TestDoubleTypes.py (378 of 1228) PASS: lldb-api :: macosx/thread_suspend/TestInternalThreadSuspension.py (379 of 1228) PASS: lldb-shell :: SymbolFile/DWARF/DW_AT_declaration-with-children.s (380 of 1228) UNSUPPORTED: lldb-api :: tools/lldb-server/thread-name/TestGdbRemoteThreadName.py (381 of 1228) UNSUPPORTED: lldb-api :: commands/expression/import-std-module/vector-bool/TestVectorBoolFromStdModule.py (382 of 1228) PASS: lldb-api :: functionalities/thread/concurrent_events/TestConcurrentDelayedCrashWithBreakpointSignal.py (383 of 1228) PASS: lldb-api :: functionalities/multidebugger_commands/TestMultipleDebuggersCommands.py (384 of 1228) UNSUPPORTED: lldb-api :: commands/expression/completion-crash-invalid-iterator/TestInvalidIteratorCompletionCrash.py (385 of 1228) PASS: lldb-api :: functionalities/thread/concurrent_events/TestConcurrentDelaySignalWatch.py (386 of 1228) PASS: lldb-api :: lang/cpp/static_methods/TestCPPStaticMethods.py (387 of 1228) PASS: lldb-api :: tools/lldb-server/TestLldbGdbServer.py (388 of 1228) UNSUPPORTED: lldb-api :: benchmarks/libcxxlist/TestBenchmarkLibcxxList.py (389 of 1228) PASS: lldb-api :: tools/lldb-server/register-reading/TestGdbRemoteGPacket.py (390 of 1228) PASS: lldb-api :: commands/watchpoints/watchpoint_size/TestWatchpointSizes.py (391 of 1228) PASS: lldb-api :: lang/cpp/diamond/TestDiamond.py (392 of 1228) PASS: lldb-api :: api/multiple-debuggers/TestMultipleDebuggers.py (393 of 1228) PASS: lldb-api :: commands/watchpoints/hello_watchpoint/TestMyFirstWatchpoint.py (394 of 1228) UNSUPPORTED: lldb-shell :: ObjectFile/ELF/minidebuginfo-no-lzma.yaml (395 of 1228) PASS: lldb-api :: functionalities/breakpoint/auto_continue/TestBreakpointAutoContinue.py (396 of 1228) PASS: lldb-shell :: SymbolFile/DWARF/debug_ranges-missing-section.s (397 of 1228) UNSUPPORTED: lldb-shell :: Reproducer/TestDump.test (398 of 1228) PASS: lldb-api :: commands/expression/persistent_types/TestPersistentTypes.py (399 of 1228) PASS: lldb-api :: functionalities/data-formatter/data-formatter-synth/TestDataFormatterSynth.py (400 of 1228) UNSUPPORTED: lldb-api :: commands/expression/import-std-module/shared_ptr/TestSharedPtrFromStdModule.py (401 of 1228) PASS: lldb-api :: lang/objc/ivar-IMP/TestObjCiVarIMP.py (402 of 1228) PASS: lldb-api :: lang/c/stepping/TestStepAndBreakpoints.py (403 of 1228) XFAIL: lldb-shell :: Register/x86-mm-xmm-write.test (404 of 1228) PASS: lldb-api :: functionalities/data-formatter/data-formatter-synthtype/TestDataFormatterSynthType.py (405 of 1228) PASS: lldb-api :: lang/cpp/function_refs/TestFunctionRefs.py (406 of 1228) PASS: lldb-shell :: ScriptInterpreter/None/import_module.test (407 of 1228) UNSUPPORTED: lldb-shell :: Reproducer/TestCrash.test (408 of 1228) PASS: lldb-api :: functionalities/thread/concurrent_events/TestConcurrentBreakpointDelayBreakpointOneSignal.py (409 of 1228) PASS: lldb-api :: functionalities/data-formatter/data-formatter-objc/cmtime/TestDataFormatterCMTime.py (410 of 1228) PASS: lldb-api :: python_api/debugger/TestDebuggerAPI.py (411 of 1228) PASS: lldb-api :: commands/watchpoints/multiple_hits/TestMultipleHits.py (412 of 1228) PASS: lldb-shell :: Breakpoint/debug_addrx.test (413 of 1228) PASS: lldb-api :: functionalities/thread/concurrent_events/TestConcurrentTwoBreakpointsOneSignal.py (414 of 1228) PASS: lldb-api :: functionalities/data-formatter/data-formatter-objc/TestDataFormatterObjCNSDate.py (415 of 1228) PASS: lldb-api :: lang/c/array_types/TestArrayTypes.py (416 of 1228) UNSUPPORTED: lldb-api :: tools/lldb-vscode/console/TestVSCode_console.py (417 of 1228) PASS: lldb-api :: types/TestRecursiveTypes.py (418 of 1228) PASS: lldb-api :: commands/expression/radar_8638051/Test8638051.py (419 of 1228) UNSUPPORTED: lldb-api :: functionalities/darwin_log/filter/regex/subsystem/TestDarwinLogFilterRegexSubsystem.py (420 of 1228) UNSUPPORTED: lldb-api :: benchmarks/expression/TestRepeatedExprs.py (421 of 1228) PASS: lldb-api :: commands/platform/basic/TestPlatformPython.py (422 of 1228) PASS: lldb-api :: lang/mixed/TestMixedLanguages.py (423 of 1228) PASS: lldb-api :: functionalities/tail_call_frames/disambiguate_paths_to_common_sink/TestDisambiguatePathsToCommonSink.py (424 of 1228) PASS: lldb-shell :: ObjectFile/PECOFF/invalid-export-table.yaml (425 of 1228) PASS: lldb-api :: commands/expression/inline-namespace/TestInlineNamespace.py (426 of 1228) PASS: lldb-shell :: SymbolFile/DWARF/clang-ast-from-dwarf-unamed-and-anon-structs.cpp (427 of 1228) XFAIL: lldb-shell :: Register/x86-64-write.test (428 of 1228) UNSUPPORTED: lldb-api :: commands/expression/import-std-module/weak_ptr/TestWeakPtrFromStdModule.py (429 of 1228) PASS: lldb-api :: functionalities/data-formatter/pyobjsynthprovider/TestPyObjSynthProvider.py (430 of 1228) PASS: lldb-api :: functionalities/tail_call_frames/ambiguous_tail_call_seq1/TestAmbiguousTailCallSeq1.py (431 of 1228) PASS: lldb-shell :: Breakpoint/split-dwarf-5-addrbase.test (432 of 1228) PASS: lldb-api :: functionalities/data-formatter/nssetsynth/TestNSSetSynthetic.py (433 of 1228) PASS: lldb-api :: functionalities/data-formatter/data-formatter-categories/TestDataFormatterCategories.py (434 of 1228) PASS: lldb-api :: commands/expression/weak_symbols/TestWeakSymbols.py (435 of 1228) PASS: lldb-api :: functionalities/rerun/TestRerun.py (436 of 1228) PASS: lldb-api :: commands/breakpoint/set/func-regex/TestBreakpointRegexError.py (437 of 1228) PASS: lldb-api :: functionalities/thread/concurrent_events/TestConcurrentSignalWatch.py (438 of 1228) PASS: lldb-api :: python_api/section/TestSectionAPI.py (439 of 1228) PASS: lldb-api :: functionalities/data-formatter/stringprinter/TestStringPrinter.py (440 of 1228) UNSUPPORTED: lldb-api :: functionalities/data-formatter/data-formatter-stl/libstdcpp/vbool/TestDataFormatterStdVBool.py (441 of 1228) UNSUPPORTED: lldb-shell :: Expr/TestIRMemoryMapWindows.test (442 of 1228) PASS: lldb-api :: lang/cpp/dynamic-value-same-basename/TestDynamicValueSameBase.py (443 of 1228) UNSUPPORTED: lldb-api :: commands/command/script/TestCommandScript.py (444 of 1228) PASS: lldb-api :: lang/objc/objc-class-method/TestObjCClassMethod.py (445 of 1228) PASS: lldb-api :: lang/objc/objc-builtin-types/TestObjCBuiltinTypes.py (446 of 1228) UNSUPPORTED: lldb-shell :: SymbolFile/NativePDB/locate-pdb.cpp (447 of 1228) PASS: lldb-api :: commands/command/nested_alias/TestNestedAlias.py (448 of 1228) PASS: lldb-api :: functionalities/data-formatter/data-formatter-globals/TestDataFormatterGlobals.py (449 of 1228) PASS: lldb-shell :: SymbolFile/DWARF/inline-function-address.ll (450 of 1228) PASS: lldb-shell :: Settings/TestFrameFormatMangling.test (451 of 1228) PASS: lldb-api :: functionalities/gdb_remote_client/TestNoWatchpointSupportInfo.py (452 of 1228) UNSUPPORTED: lldb-api :: functionalities/thread/state/TestThreadStates.py (453 of 1228) PASS: lldb-api :: functionalities/stats_api/TestStatisticsAPI.py (454 of 1228) PASS: lldb-api :: commands/target/dump-symtab-demangle/TestDumpSymtabDemangle.py (455 of 1228) UNSUPPORTED: lldb-api :: functionalities/data-formatter/data-formatter-stl/libstdcpp/string/TestDataFormatterStdString.py (456 of 1228) PASS: lldb-api :: types/TestFloatTypes.py (457 of 1228) PASS: lldb-api :: lang/objc/modules-auto-import/TestModulesAutoImport.py (458 of 1228) PASS: lldb-shell :: SymbolFile/DWARF/clang-ast-from-dwarf-objc-property.m (459 of 1228) UNSUPPORTED: lldb-shell :: ScriptInterpreter/Lua/persistent_state.test (460 of 1228) UNSUPPORTED: lldb-api :: commands/expression/import-std-module/pair/TestPairFromStdModule.py (461 of 1228) PASS: lldb-api :: functionalities/breakpoint/global_constructor/TestBreakpointInGlobalConstructor.py (462 of 1228) UNSUPPORTED: lldb-shell :: Register/x86-64-xmm16-write.test (463 of 1228) PASS: lldb-shell :: ScriptInterpreter/None/none.test (464 of 1228) UNSUPPORTED: lldb-api :: functionalities/load_using_paths/TestLoadUsingPaths.py (465 of 1228) UNSUPPORTED: lldb-shell :: SymbolFile/NativePDB/source-list.cpp (466 of 1228) UNSUPPORTED: lldb-api :: tools/lldb-vscode/variables/TestVSCode_variables.py (467 of 1228) PASS: lldb-api :: functionalities/inferior-crashing/TestInferiorCrashingStep.py (468 of 1228) PASS: lldb-api :: terminal/TestSTTYBeforeAndAfter.py (469 of 1228) PASS: lldb-api :: lang/cpp/bitfields/TestCppBitfields.py (470 of 1228) PASS: lldb-api :: lang/cpp/overloaded-functions/TestOverloadedFunctions.py (471 of 1228) PASS: lldb-api :: functionalities/tsan/basic/TestTsanBasic.py (472 of 1228) PASS: lldb-api :: functionalities/signal/raise/TestRaise.py (473 of 1228) PASS: lldb-api :: functionalities/gdb_remote_client/TestStopPCs.py (474 of 1228) PASS: lldb-shell :: Minidump/no-process-id.yaml (475 of 1228) PASS: lldb-shell :: Minidump/dump-all.test (476 of 1228) UNSUPPORTED: lldb-api :: tools/lldb-vscode/module/TestVSCode_module.py (477 of 1228) PASS: lldb-api :: lang/c/struct_types/TestStructTypes.py (478 of 1228) UNSUPPORTED: lldb-shell :: Reproducer/TestVerify.test (479 of 1228) PASS: lldb-api :: commands/expression/namespace_local_var_same_name_obj_c/TestNamespaceLocalVarSameNameObjC.py (480 of 1228) PASS: lldb-api :: lang/cpp/dynamic-value/TestDynamicValue.py (481 of 1228) UNSUPPORTED: lldb-shell :: ScriptInterpreter/Python/sb_address_exception.test (482 of 1228) UNSUPPORTED: lldb-api :: functionalities/data-formatter/data-formatter-stl/libstdcpp/vector/TestDataFormatterStdVector.py (483 of 1228) PASS: lldb-api :: functionalities/breakpoint/hardware_breakpoints/require_hw_breakpoints/TestRequireHWBreakpoints.py (484 of 1228) PASS: lldb-shell :: Commands/command-breakpoint-col.test (485 of 1228) PASS: lldb-api :: macosx/order/TestOrderFile.py (486 of 1228) PASS: lldb-api :: functionalities/breakpoint/objc/TestObjCBreakpoints.py (487 of 1228) PASS: lldb-api :: lang/objc/exceptions/TestObjCExceptions.py (488 of 1228) PASS: lldb-api :: commands/frame/diagnose/inheritance/TestDiagnoseInheritance.py (489 of 1228) PASS: lldb-api :: lang/cpp/unicode-literals/TestUnicodeLiterals.py (490 of 1228) PASS: lldb-api :: functionalities/data-formatter/frameformat_smallstruct/TestFrameFormatSmallStruct.py (491 of 1228) PASS: lldb-api :: functionalities/data-formatter/varscript_formatting/TestDataFormatterVarScriptFormatting.py (492 of 1228) PASS: lldb-api :: functionalities/abbreviation/TestCommonShortSpellings.py (493 of 1228) UNSUPPORTED: lldb-api :: tools/lldb-vscode/attach/TestVSCode_attach.py (494 of 1228) PASS: lldb-api :: iohandler/autosuggestion/TestAutosuggestion.py (495 of 1228) PASS: lldb-api :: functionalities/inferior-crashing/recursive-inferior/TestRecursiveInferior.py (496 of 1228) PASS: lldb-shell :: SymbolFile/DWARF/inline-function-address-shared.test (497 of 1228) UNSUPPORTED: lldb-shell :: Reproducer/Modules/TestModuleCXX.test (498 of 1228) PASS: lldb-shell :: Commands/command-script-import.test (499 of 1228) PASS: lldb-api :: lang/objc/foundation/TestSymbolTable.py (500 of 1228) PASS: lldb-api :: lang/c/shared_lib/TestSharedLib.py (501 of 1228) PASS: lldb-api :: functionalities/multiword-commands/TestMultiWordCommands.py (502 of 1228) PASS: lldb-api :: commands/watchpoints/watchpoint_disable/TestWatchpointDisable.py (503 of 1228) PASS: lldb-shell :: SymbolFile/Breakpad/stack-cfi-arm.yaml (504 of 1228) PASS: lldb-shell :: ObjectFile/ELF/PT_TLS-overlap-PT_LOAD.yaml (505 of 1228) UNSUPPORTED: lldb-shell :: SymbolFile/PDB/compilands.test (506 of 1228) PASS: lldb-api :: commands/thread/select/TestThreadSelect.py (507 of 1228) PASS: lldb-api :: functionalities/ubsan/basic/TestUbsanBasic.py (508 of 1228) PASS: lldb-api :: commands/frame/var/TestFrameVar.py (509 of 1228) PASS: lldb-shell :: SymbolFile/DWARF/debug-types-missing-signature.test (510 of 1228) PASS: lldb-shell :: SymbolFile/DWARF/array-sizes.s (511 of 1228) PASS: lldb-shell :: SymbolFile/DWARF/debug-names-compressed.cpp (512 of 1228) PASS: lldb-shell :: Unwind/eh-frame-dwarf-unwind.test (513 of 1228) PASS: lldb-api :: lang/objc/forward-decl/TestForwardDecl.py (514 of 1228) PASS: lldb-api :: commands/expression/regression-access-function-template-in-record/TestRegressionAccessFunctionTemplateInRecord.py (515 of 1228) PASS: lldb-api :: commands/expression/context-object/TestContextObject.py (516 of 1228) PASS: lldb-api :: commands/help/TestHelp.py (517 of 1228) UNSUPPORTED: lldb-shell :: Reproducer/TestFileRepro.test (518 of 1228) PASS: lldb-api :: functionalities/testid/TestTestId.py (519 of 1228) PASS: lldb-shell :: SymbolFile/DWARF/dwp-debug-types.s (520 of 1228) PASS: lldb-api :: functionalities/postmortem/elf-core/TestLinuxCore.py (521 of 1228) PASS: lldb-api :: commands/expression/persist_objc_pointeetype/TestPersistObjCPointeeType.py (522 of 1228) UNSUPPORTED: lldb-shell :: Driver/TestRepl.test (523 of 1228) PASS: lldb-shell :: Settings/TestEchoCommands.test (524 of 1228) UNSUPPORTED: lldb-shell :: Register/x86-64-zmm-read.test (525 of 1228) UNSUPPORTED: lldb-api :: functionalities/darwin_log/filter/regex/activity/TestDarwinLogFilterRegexActivity.py (526 of 1228) PASS: lldb-api :: commands/watchpoints/step_over_watchpoint/TestStepOverWatchpoint.py (527 of 1228) PASS: lldb-shell :: Recognizer/assert.test (528 of 1228) PASS: lldb-shell :: Expr/TestIRMemoryMap.test (529 of 1228) PASS: lldb-api :: functionalities/data-formatter/data-formatter-stl/libcxx/set/TestDataFormatterLibcxxSet.py (530 of 1228) PASS: lldb-api :: lang/objc/self/TestObjCSelf.py (531 of 1228) PASS: lldb-api :: lang/c/shared_lib_stripped_symbols/TestSharedLibStrippedSymbols.py (532 of 1228) PASS: lldb-shell :: SymbolFile/DWARF/find-basic-variable.cpp (533 of 1228) PASS: lldb-api :: lang/cpp/auto/TestCPPAuto.py (534 of 1228) PASS: lldb-api :: terminal/TestEditline.py (535 of 1228) PASS: lldb-shell :: Process/TestAbortExitCode.test (536 of 1228) UNSUPPORTED: lldb-shell :: Register/x86-64-ymm16-write.test (537 of 1228) PASS: lldb-api :: functionalities/thread/thread_exit/TestThreadExit.py (538 of 1228) PASS: lldb-shell :: ObjectFile/ELF/build-id-case.yaml (539 of 1228) PASS: lldb-api :: commands/expression/formatters/TestFormatters.py (540 of 1228) PASS: lldb-api :: functionalities/breakpoint/breakpoint_conditions/TestBreakpointConditions.py (541 of 1228) PASS: lldb-api :: functionalities/data-formatter/data-formatter-ptr-to-array/TestPtrToArrayFormatting.py (542 of 1228) PASS: lldb-api :: api/listeners/TestListener.py (543 of 1228) PASS: lldb-shell :: ObjectFile/PECOFF/section-types.yaml (544 of 1228) UNSUPPORTED: lldb-api :: functionalities/breakpoint/hardware_breakpoints/hardware_breakpoint_on_multiple_threads/TestHWBreakMultiThread.py (545 of 1228) PASS: lldb-api :: lang/cpp/bool/TestCPPBool.py (546 of 1228) PASS: lldb-api :: functionalities/data-formatter/data-formatter-objc/TestDataFormatterObjCNSBundle.py (547 of 1228) PASS: lldb-api :: python_api/module_section/TestModuleAndSection.py (548 of 1228) PASS: lldb-api :: tools/lldb-server/inferior-crash/TestGdbRemoteSegFault.py (549 of 1228) PASS: lldb-api :: commands/expression/import_base_class_when_class_has_derived_member/TestImportBaseClassWhenClassHasDerivedMember.py (550 of 1228) PASS: lldb-api :: lang/objc/rdar-11355592/TestRdar11355592.py (551 of 1228) UNSUPPORTED: lldb-api :: commands/expression/import-std-module/deque-basic/TestDequeFromStdModule.py (552 of 1228) PASS: lldb-api :: commands/expression/dont_allow_jit/TestAllowJIT.py (553 of 1228) PASS: lldb-api :: python_api/watchpoint/condition/TestWatchpointConditionAPI.py (554 of 1228) UNSUPPORTED: lldb-api :: functionalities/darwin_log/filter/regex/category/TestDarwinLogFilterRegexCategory.py (555 of 1228) PASS: lldb-shell :: Breakpoint/debug_rnglistx_rlex.test (556 of 1228) PASS: lldb-api :: python_api/sbvalue_persist/TestSBValuePersist.py (557 of 1228) PASS: lldb-api :: functionalities/data-formatter/data-formatter-synthval/TestDataFormatterSynthVal.py (558 of 1228) PASS: lldb-shell :: Breakpoint/jitbp_elf.test (559 of 1228) PASS: lldb-api :: commands/expression/ir-interpreter-phi-nodes/TestIRInterpreterPHINodes.py (560 of 1228) UNSUPPORTED: lldb-api :: commands/expression/issue_11588/Test11588.py (561 of 1228) PASS: lldb-api :: commands/expression/vector_of_enums/TestVectorOfEnums.py (562 of 1228) UNSUPPORTED: lldb-api :: macosx/profile_vrs_detach/TestDetachVrsProfile.py (563 of 1228) PASS: lldb-shell :: SymbolFile/DWARF/dwarf5_locations.s (564 of 1228) PASS: lldb-api :: lang/c/anonymous/TestAnonymous.py (565 of 1228) PASS: lldb-api :: functionalities/breakpoint/comp_dir_symlink/TestCompDirSymLink.py (566 of 1228) PASS: lldb-shell :: ObjectFile/wasm/basic.yaml (567 of 1228) UNSUPPORTED: lldb-api :: functionalities/longjmp/TestLongjmp.py (568 of 1228) PASS: lldb-shell :: ObjectFile/ELF/duplicate-section.yaml (569 of 1228) UNSUPPORTED: lldb-shell :: SymbolFile/NativePDB/globals-fundamental.cpp (570 of 1228) UNSUPPORTED: lldb-api :: lang/objc/foundation/TestRuntimeTypes.py (571 of 1228) PASS: lldb-api :: functionalities/thread/concurrent_events/TestConcurrentManyBreakpoints.py (572 of 1228) UNSUPPORTED: lldb-shell :: Unwind/unwind-plan-dwarf-dump.test (573 of 1228) PASS: lldb-shell :: Expr/TestMultilineExpr.test (574 of 1228) PASS: lldb-api :: lang/objc/objc-struct-return/TestObjCStructReturn.py (575 of 1228) PASS: lldb-api :: lang/cpp/typedef/TestCppTypedef.py (576 of 1228) PASS: lldb-api :: commands/expression/persistent_types/TestNestedPersistentTypes.py (577 of 1228) PASS: lldb-api :: functionalities/data-formatter/data-formatter-stl/libcxx/queue/TestDataFormatterLibcxxQueue.py (578 of 1228) PASS: lldb-api :: functionalities/thread/state_after_expression/TestStateAfterExpression.py (579 of 1228) UNSUPPORTED: lldb-shell :: SymbolFile/NativePDB/global-classes.cpp (580 of 1228) XFAIL: lldb-shell :: Unwind/prefer-debug-over-eh-frame.test (581 of 1228) PASS: lldb-api :: functionalities/wrong_commands/TestWrongCommands.py (582 of 1228) UNSUPPORTED: lldb-shell :: SymbolFile/NativePDB/disassembly.cpp (583 of 1228) UNSUPPORTED: lldb-api :: android/platform/TestDefaultCacheLineSize.py (584 of 1228) PASS: lldb-shell :: Settings/TestSettingsSet.test (585 of 1228) PASS: lldb-shell :: ScriptInterpreter/Python/eof.test (586 of 1228) PASS: lldb-api :: functionalities/step-avoids-no-debug/TestStepNoDebug.py (587 of 1228) PASS: lldb-api :: python_api/value/linked_list/TestValueAPILinkedList.py (588 of 1228) UNSUPPORTED: lldb-api :: benchmarks/expression/TestExpressionCmd.py (589 of 1228) PASS: lldb-api :: lang/c/forward/TestForwardDeclaration.py (590 of 1228) PASS: lldb-api :: types/TestLongTypes.py (591 of 1228) PASS: lldb-api :: functionalities/data-formatter/data-formatter-stl/libcxx/vbool/TestDataFormatterLibcxxVBool.py (592 of 1228) UNSUPPORTED: lldb-api :: macosx/thread-names/TestInterruptThreadNames.py (593 of 1228) PASS: lldb-api :: lang/c/stepping/TestThreadStepping.py (594 of 1228) PASS: lldb-api :: commands/apropos/basic/TestApropos.py (595 of 1228) PASS: lldb-api :: functionalities/data-formatter/hexcaps/TestDataFormatterHexCaps.py (596 of 1228) PASS: lldb-api :: macosx/dyld-trie-symbols/TestDyldTrieSymbols.py (597 of 1228) UNSUPPORTED: lldb-api :: commands/expression/import-std-module/forward_list-dbg-info-content/TestDbgInfoContentForwardListFromStdModule.py (598 of 1228) PASS: lldb-shell :: SymbolFile/DWARF/split-dwarf-multiple-cu.ll (599 of 1228) PASS: lldb-shell :: SymbolFile/Breakpad/line-table-mixed-path-styles.test (600 of 1228) PASS: lldb-shell :: SymbolFile/DWARF/find-basic-type.cpp (601 of 1228) PASS: lldb-api :: commands/expression/static-initializers/TestStaticInitializers.py (602 of 1228) UNSUPPORTED: lldb-shell :: Reproducer/TestGDBRemoteRepro.test (603 of 1228) PASS: lldb-api :: lang/cpp/stl/TestStdCXXDisassembly.py (604 of 1228) PASS: lldb-shell :: ObjectFile/ELF/many-sections.s (605 of 1228) PASS: lldb-api :: functionalities/param_entry_vals/basic_entry_values/TestBasicEntryValues.py (606 of 1228) UNSUPPORTED: lldb-shell :: Process/TestEnvironment.test (607 of 1228) PASS: lldb-shell :: ObjectFile/ELF/gnu-debuglink.yaml (608 of 1228) PASS: lldb-api :: functionalities/postmortem/mach-core/TestMachCore.py (609 of 1228) PASS: lldb-api :: functionalities/gdb_remote_client/TestPlatformClient.py (610 of 1228) PASS: lldb-api :: functionalities/breakpoint/debugbreak/TestDebugBreak.py (611 of 1228) PASS: lldb-api :: lang/cpp/rvalue-references/TestRvalueReferences.py (612 of 1228) PASS: lldb-api :: commands/frame/language/TestGuessLanguage.py (613 of 1228) UNSUPPORTED: lldb-api :: commands/expression/import-std-module/no-std-module/TestMissingStdModule.py (614 of 1228) UNSUPPORTED: lldb-shell :: Register/x86-zmm-write.test (615 of 1228) PASS: lldb-shell :: Process/Optimization.test (616 of 1228) PASS: lldb-api :: functionalities/paths/TestPaths.py (617 of 1228) PASS: lldb-api :: lang/c/function_types/TestFunctionTypes.py (618 of 1228) UNSUPPORTED: lldb-api :: tools/lldb-vscode/breakpoint/TestVSCode_setBreakpoints.py (619 of 1228) PASS: lldb-api :: functionalities/data-formatter/data-formatter-smart-array/TestDataFormatterSmartArray.py (620 of 1228) PASS: lldb-shell :: ObjectFile/PECOFF/export-dllfunc.yaml (621 of 1228) PASS: lldb-api :: python_api/sbtype_typeclass/TestSBTypeTypeClass.py (622 of 1228) PASS: lldb-shell :: SymbolFile/DWARF/dwarf5-index-is-used.cpp (623 of 1228) PASS: lldb-shell :: SymbolFile/DWARF/debug_loclists-dwo.s (624 of 1228) PASS: lldb-api :: commands/frame/var-scope/TestFrameVariableScope.py (625 of 1228) PASS: lldb-api :: lang/c/local_variables/TestLocalVariables.py (626 of 1228) PASS: lldb-api :: commands/expression/class_template_specialization_empty_pack/TestClassTemplateSpecializationParametersHandling.py (627 of 1228) UNSUPPORTED: lldb-shell :: SymbolFile/PDB/variables-locations.test (628 of 1228) UNSUPPORTED: lldb-api :: lang/objc/modules/TestObjCModules.py (629 of 1228) PASS: lldb-api :: functionalities/dead-strip/TestDeadStrip.py (630 of 1228) PASS: lldb-api :: functionalities/data-formatter/builtin-formats/TestBuiltinFormats.py (631 of 1228) PASS: lldb-shell :: SymbolFile/DWARF/dwarf5-debug_line.s (632 of 1228) PASS: lldb-shell :: SymbolFile/Breakpad/symtab.test (633 of 1228) XFAIL: lldb-shell :: Register/x86-64-ymm-write.test (634 of 1228) UNSUPPORTED: lldb-shell :: Driver/TestError.test (635 of 1228) PASS: lldb-shell :: Commands/command-source.test (636 of 1228) PASS: lldb-api :: lang/c/record_decl_in_expr/TestRecordDeclInExpr.py (637 of 1228) UNSUPPORTED: lldb-api :: benchmarks/frame_variable/TestFrameVariableResponse.py (638 of 1228) PASS: lldb-shell :: SymbolFile/DWARF/module-ownership.mm (639 of 1228) PASS: lldb-shell :: ObjectFile/wasm/stripped-debug-sections.yaml (640 of 1228) UNSUPPORTED: lldb-api :: commands/expression/timeout/TestCallWithTimeout.py (641 of 1228) PASS: lldb-api :: functionalities/data-formatter/vector-types/TestVectorTypesFormatting.py (642 of 1228) UNSUPPORTED: lldb-api :: commands/expression/import-std-module/basic/TestImportStdModule.py (643 of 1228) PASS: lldb-api :: functionalities/thread/create_after_attach/TestCreateAfterAttach.py (644 of 1228) PASS: lldb-shell :: Settings/TestDisableColor.test (645 of 1228) PASS: lldb-api :: functionalities/data-formatter/typedef_array/TestTypedefArray.py (646 of 1228) PASS: lldb-shell :: SymbolFile/DWARF/find-variable-file.cpp (647 of 1228) UNSUPPORTED: lldb-api :: tools/lldb-server/TestGdbRemoteAuxvSupport.py (648 of 1228) PASS: lldb-shell :: SymbolFile/DWARF/find-basic-function.cpp (649 of 1228) UNSUPPORTED: lldb-shell :: Register/aarch64-gp-read.test (650 of 1228) PASS: lldb-shell :: ObjectFile/MachO/symtab.yaml (651 of 1228) PASS: lldb-api :: lang/objc/objc-optimized/TestObjcOptimized.py (652 of 1228) PASS: lldb-api :: functionalities/data-formatter/setvaluefromcstring/TestSetValueFromCString.py (653 of 1228) PASS: lldb-api :: python_api/lldbutil/process/TestPrintStackTraces.py (654 of 1228) PASS: lldb-shell :: SymbolFile/Breakpad/unwind-via-stack-cfi.test (655 of 1228) UNSUPPORTED: lldb-api :: functionalities/reproducers/attach/TestReproducerAttach.py (656 of 1228) PASS: lldb-api :: functionalities/ptr_refs/TestPtrRefs.py (657 of 1228) PASS: lldb-api :: commands/target/create-deps/TestTargetCreateDeps.py (658 of 1228) PASS: lldb-shell :: ObjectFile/Breakpad/uuid-matching-mac.test (659 of 1228) PASS: lldb-api :: commands/log/invalid-args/TestInvalidArgsLog.py (660 of 1228) UNSUPPORTED: lldb-api :: tools/lldb-server/TestGdbRemote_vContThreads.py (661 of 1228) UNSUPPORTED: lldb-api :: functionalities/data-formatter/data-formatter-stl/libstdcpp/iterator/TestDataFormatterStdIterator.py (662 of 1228) PASS: lldb-api :: functionalities/abbreviation/TestAbbreviations.py (663 of 1228) UNSUPPORTED: lldb-shell :: ScriptInterpreter/Lua/watchpoint_callback.test (664 of 1228) PASS: lldb-api :: functionalities/tail_call_frames/disambiguate_call_site/TestDisambiguateCallSite.py (665 of 1228) PASS: lldb-api :: functionalities/data-formatter/data-formatter-disabling/TestDataFormatterDisabling.py (666 of 1228) UNSUPPORTED: lldb-api :: commands/settings/quoting/TestQuoting.py (667 of 1228) PASS: lldb-api :: python_api/sblaunchinfo/TestSBLaunchInfo.py (668 of 1228) PASS: lldb-api :: types/TestLongTypesExpr.py (669 of 1228) UNSUPPORTED: lldb-api :: functionalities/darwin_log/filter/exact_match/subsystem/TestDarwinLogFilterMatchSubsystem.py (670 of 1228) UNSUPPORTED: lldb-api :: commands/expression/import-std-module/weak_ptr-dbg-info-content/TestDbgInfoContentWeakPtrFromStdModule.py (671 of 1228) PASS: lldb-api :: python_api/function_symbol/TestSymbolAPI.py (672 of 1228) PASS: lldb-api :: functionalities/fat_archives/TestFatArchives.py (673 of 1228) PASS: lldb-api :: lang/cpp/member-and-local-vars-with-same-name/TestMembersAndLocalsWithSameName.py (674 of 1228) PASS: lldb-api :: lang/objc/foundation/TestObjectDescriptionAPI.py (675 of 1228) PASS: lldb-api :: lang/objc/blocks/TestObjCIvarsInBlocks.py (676 of 1228) UNSUPPORTED: lldb-shell :: SymbolFile/NativePDB/local-variables.cpp (677 of 1228) PASS: lldb-api :: types/TestDoubleTypesExpr.py (678 of 1228) PASS: lldb-api :: lang/cpp/global_variables/TestCPPGlobalVariables.py (679 of 1228) PASS: lldb-shell :: SymbolFile/DWARF/find-qualified-variable.cpp (680 of 1228) PASS: lldb-api :: python_api/formatters/TestFormattersSBAPI.py (681 of 1228) UNSUPPORTED: lldb-shell :: ScriptInterpreter/Lua/quit.test (682 of 1228) UNSUPPORTED: lldb-api :: tools/lldb-vscode/coreFile/TestVSCode_coreFile.py (683 of 1228) UNSUPPORTED: lldb-api :: benchmarks/stepping/TestSteppingSpeed.py (684 of 1228) PASS: lldb-api :: functionalities/tail_call_frames/thread_step_out_message/TestArtificialFrameStepOutMessage.py (685 of 1228) PASS: lldb-api :: functionalities/breakpoint/address_breakpoints/TestBadAddressBreakpoints.py (686 of 1228) PASS: lldb-api :: functionalities/thread/concurrent_events/TestConcurrentDelaySignalBreak.py (687 of 1228) UNSUPPORTED: lldb-shell :: Register/x86-zmm-read.test (688 of 1228) PASS: lldb-api :: commands/expression/scoped_enums/TestScopedEnumType.py (689 of 1228) PASS: lldb-api :: functionalities/float-display/TestFloatDisplay.py (690 of 1228) PASS: lldb-shell :: ObjectFile/PECOFF/sections-names.yaml (691 of 1228) UNSUPPORTED: lldb-api :: functionalities/thread/thread_specific_break_plus_condition/TestThreadSpecificBpPlusCondition.py (692 of 1228) PASS: lldb-api :: types/TestIntegerType.py (693 of 1228) PASS: lldb-shell :: SymbolFile/Breakpad/line-table-discontinuous-file-ids.test (694 of 1228) PASS: lldb-shell :: Quit/TestQuitExitCode0.test (695 of 1228) PASS: lldb-api :: functionalities/breakpoint/breakpoint_names/TestBreakpointNames.py (696 of 1228) PASS: lldb-shell :: SymbolFile/DWARF/DW_AT_low_pc-addrx.s (697 of 1228) PASS: lldb-shell :: Breakpoint/debug_rnglist_rlestartend.test (698 of 1228) PASS: lldb-api :: lang/c/complex_int/TestComplexInt.py (699 of 1228) UNSUPPORTED: lldb-shell :: SymbolFile/NativePDB/tag-types.cpp (700 of 1228) UNSUPPORTED: lldb-shell :: SymbolFile/NativePDB/stack_unwinding01.cpp (701 of 1228) UNSUPPORTED: lldb-shell :: Reproducer/Functionalities/TestImageList.test (702 of 1228) PASS: lldb-api :: lang/objc/objc-new-syntax/TestObjCNewSyntaxArray.py (703 of 1228) UNSUPPORTED: lldb-api :: functionalities/deleted-executable/TestDeletedExecutable.py (704 of 1228) UNSUPPORTED: lldb-api :: commands/expression/import-std-module/vector-of-vectors/TestVectorOfVectorsFromStdModule.py (705 of 1228) PASS: lldb-api :: functionalities/inferior-assert/TestInferiorAssert.py (706 of 1228) PASS: lldb-api :: lang/cpp/covariant-return-types/TestCovariantReturnTypes.py (707 of 1228) UNSUPPORTED: lldb-api :: tools/lldb-vscode/breakpoint/TestVSCode_setFunctionBreakpoints.py (708 of 1228) PASS: lldb-shell :: Process/UnsupportedLanguage.test (709 of 1228) PASS: lldb-api :: functionalities/gdb_remote_client/TestqOffsets.py (710 of 1228) PASS: lldb-api :: commands/expression/xvalue/TestXValuePrinting.py (711 of 1228) UNSUPPORTED: lldb-shell :: SymbolFile/NativePDB/ast-functions-msvc.cpp (712 of 1228) PASS: lldb-api :: commands/expression/call-function/TestCallStopAndContinue.py (713 of 1228) PASS: lldb-api :: functionalities/pre_run_dylibs/TestPreRunDylibs.py (714 of 1228) UNSUPPORTED: lldb-shell :: Process/Windows/exception_access_violation.cpp (715 of 1228) UNSUPPORTED: lldb-shell :: SymbolFile/NativePDB/ast-types.cpp (716 of 1228) PASS: lldb-api :: commands/settings/TestSettings.py (717 of 1228) PASS: lldb-api :: functionalities/gdb_remote_client/TestJLink6Armv7RegisterDefinition.py (718 of 1228) PASS: lldb-api :: python_api/watchpoint/watchlocation/TestTargetWatchAddress.py (719 of 1228) UNSUPPORTED: lldb-shell :: SymbolFile/PDB/class-layout.test (720 of 1228) PASS: lldb-api :: functionalities/thread/crash_during_step/TestCrashDuringStep.py (721 of 1228) PASS: lldb-api :: lang/objc/objc-dyn-sbtype/TestObjCDynamicSBType.py (722 of 1228) PASS: lldb-shell :: ObjectFile/ELF/base-address.yaml (723 of 1228) PASS: lldb-shell :: SymbolFile/DWARF/limit-debug-info.s (724 of 1228) PASS: lldb-api :: commands/expression/char/TestExprsChar.py (725 of 1228) UNSUPPORTED: lldb-shell :: SymbolFile/PDB/type-quals.test (726 of 1228) UNSUPPORTED: lldb-shell :: Watchpoint/netbsd-nouserdbregs.test (727 of 1228) PASS: lldb-api :: functionalities/tail_call_frames/unambiguous_sequence/TestUnambiguousTailCalls.py (728 of 1228) PASS: lldb-api :: lang/objc/objc-static-method-stripped/TestObjCStaticMethodStripped.py (729 of 1228) PASS: lldb-shell :: Minidump/disassemble-no-module.yaml (730 of 1228) UNSUPPORTED: lldb-shell :: Register/x86-64-read.test (731 of 1228) PASS: lldb-api :: lang/objc/foundation/TestFoundationDisassembly.py (732 of 1228) PASS: lldb-shell :: Breakpoint/implicit_const_form_support.test (733 of 1228) PASS: lldb-api :: commands/expression/persistent_ptr_update/TestPersistentPtrUpdate.py (734 of 1228) PASS: lldb-api :: commands/reproducer/invalid-args/TestInvalidArgsReproducer.py (735 of 1228) PASS: lldb-api :: functionalities/data-formatter/data-formatter-proper-plurals/TestFormattersOneIsSingular.py (736 of 1228) PASS: lldb-api :: functionalities/tail_call_frames/ambiguous_tail_call_seq2/TestAmbiguousTailCallSeq2.py (737 of 1228) PASS: lldb-shell :: Settings/TestSettingsWrite.test (738 of 1228) PASS: lldb-api :: functionalities/data-formatter/data-formatter-stl/libcxx/function/TestLibCxxFunction.py (739 of 1228) XFAIL: lldb-shell :: Register/x86-mm-xmm-read.test (740 of 1228) UNSUPPORTED: lldb-shell :: Reproducer/TestHomeDir.test (741 of 1228) PASS: lldb-api :: lang/objc/objc-static-method/TestObjCStaticMethod.py (742 of 1228) PASS: lldb-api :: lang/c/strings/TestCStrings.py (743 of 1228) UNSUPPORTED: lldb-shell :: SymbolFile/NativePDB/nested-types.cpp (744 of 1228) PASS: lldb-api :: functionalities/thread/concurrent_events/TestConcurrentSignalWatchBreak.py (745 of 1228) PASS: lldb-shell :: ScriptInterpreter/Python/python.test (746 of 1228) PASS: lldb-api :: functionalities/data-formatter/compactvectors/TestCompactVectors.py (747 of 1228) PASS: lldb-api :: commands/expression/completion-in-lambda-and-unnamed-class/TestCompletionInLambdaAndUnnamedClass.py (748 of 1228) PASS: lldb-shell :: BuildScript/script-args.test (749 of 1228) PASS: lldb-api :: lang/cpp/thread_local/TestThreadLocal.py (750 of 1228) PASS: lldb-shell :: ObjectFile/PECOFF/basic-info.yaml (751 of 1228) PASS: lldb-api :: python_api/watchpoint/TestWatchpointIgnoreCount.py (752 of 1228) PASS: lldb-api :: commands/frame/diagnose/dereference-function-return/TestDiagnoseDereferenceFunctionReturn.py (753 of 1228) PASS: lldb-api :: commands/target/stop-hook/delete/TestTargetStopHookDelete.py (754 of 1228) PASS: lldb-api :: commands/frame/diagnose/virtual-method-call/TestDiagnoseDereferenceVirtualMethodCall.py (755 of 1228) PASS: lldb-api :: lang/objc/objc-ivar-protocols/TestIvarProtocols.py (756 of 1228) PASS: lldb-api :: lang/objcxx/cxx-bridged-po/TestObjCXXBridgedPO.py (757 of 1228) UNSUPPORTED: lldb-api :: python_api/file_handle/TestFileHandle.py (758 of 1228) UNSUPPORTED: lldb-shell :: Quit/TestQuitExitCodeHexA.test (759 of 1228) PASS: lldb-shell :: Minidump/breakpad-symbols.test (760 of 1228) UNSUPPORTED: lldb-api :: tools/lldb-server/TestAppleSimulatorOSType.py (761 of 1228) PASS: lldb-shell :: ObjectFile/ELF/PT_LOAD-overlap-PT_INTERP.yaml (762 of 1228) UNSUPPORTED: lldb-shell :: SymbolFile/PDB/udt-layout.test (763 of 1228) PASS: lldb-api :: functionalities/data-formatter/data-formatter-caching/TestDataFormatterCaching.py (764 of 1228) PASS: lldb-api :: lang/cpp/nested-class-other-compilation-unit/TestNestedClassWithParentInAnotherCU.py (765 of 1228) PASS: lldb-api :: functionalities/archives/TestBSDArchives.py (766 of 1228) PASS: lldb-api :: commands/expression/test/TestExprs.py (767 of 1228) UNSUPPORTED: lldb-shell :: ScriptInterpreter/Lua/lua.test (768 of 1228) PASS: lldb-api :: functionalities/breakpoint/consecutive_breakpoints/TestConsecutiveBreakpoints.py (769 of 1228) PASS: lldb-api :: macosx/queues/TestQueues.py (770 of 1228) PASS: lldb-api :: commands/expression/fixits/TestFixIts.py (771 of 1228) PASS: lldb-api :: commands/expression/call-function/TestCallUserDefinedFunction.py (772 of 1228) UNSUPPORTED: lldb-api :: commands/expression/import-std-module/queue/TestQueueFromStdModule.py (773 of 1228) PASS: lldb-api :: types/TestCharTypeExpr.py (774 of 1228) UNSUPPORTED: lldb-api :: macosx/simulator/TestSimulatorPlatform.py (775 of 1228) PASS: lldb-api :: functionalities/signal/handle-abrt/TestHandleAbort.py (776 of 1228) PASS: lldb-api :: tools/lldb-server/commandline/TestStubReverseConnect.py (777 of 1228) PASS: lldb-shell :: ObjectFile/PECOFF/basic-info-arm.yaml (778 of 1228) PASS: lldb-api :: commands/settings/use_source_cache/TestUseSourceCache.py (779 of 1228) PASS: lldb-api :: functionalities/gdb_remote_client/TestProcessConnect.py (780 of 1228) PASS: lldb-api :: lang/cpp/enum_types/TestCPP11EnumTypes.py (781 of 1228) PASS: lldb-api :: functionalities/type_lookup/TestTypeLookup.py (782 of 1228) PASS: lldb-shell :: Commands/command-regex-delete.test (783 of 1228) PASS: lldb-api :: commands/expression/radar_9531204/TestPrintfAfterUp.py (784 of 1228) PASS: lldb-api :: lang/objc/objc-stepping/TestObjCStepping.py (785 of 1228) PASS: lldb-api :: lang/cpp/global_operators/TestCppGlobalOperators.py (786 of 1228) PASS: lldb-api :: lang/c/offsetof/TestOffsetof.py (787 of 1228) PASS: lldb-shell :: ExecControl/StopHook/stop-hook.test (788 of 1228) UNSUPPORTED: lldb-api :: commands/expression/import-std-module/sysroot/TestStdModuleSysroot.py (789 of 1228) PASS: lldb-api :: functionalities/data-formatter/ptr_ref_typedef/TestPtrRef2Typedef.py (790 of 1228) PASS: lldb-api :: lang/cpp/accelerator-table/TestCPPAccelerator.py (791 of 1228) PASS: lldb-shell :: ObjectFile/ELF/avr-basic-info.yaml (792 of 1228) PASS: lldb-api :: python_api/class_members/TestSBTypeClassMembers.py (793 of 1228) PASS: lldb-api :: functionalities/data-formatter/data-formatter-stl/libcxx/multimap/TestDataFormatterLibccMultiMap.py (794 of 1228) PASS: lldb-api :: commands/expression/codegen-crash-typedefdecl-not-in_declcontext/TestCodegenCrashTypedefDeclNotInDeclContext.py (795 of 1228) UNSUPPORTED: lldb-shell :: Reproducer/TestReuseDirectory.test (796 of 1228) PASS: lldb-api :: lang/cpp/virtual-functions/TestCppVirtualFunctions.py (797 of 1228) PASS: lldb-api :: functionalities/breakpoint/breakpoint_ignore_count/TestBreakpointIgnoreCount.py (798 of 1228) PASS: lldb-shell :: SymbolFile/DWARF/DW_OP_piece-struct.s (799 of 1228) UNSUPPORTED: lldb-api :: functionalities/darwin_log/filter/regex/message/TestDarwinLogFilterRegexMessage.py (800 of 1228) PASS: lldb-api :: commands/expression/argument_passing_restrictions/TestArgumentPassingRestrictions.py (801 of 1228) UNSUPPORTED: lldb-api :: functionalities/breakpoint/hardware_breakpoints/write_memory_with_hw_breakpoint/TestWriteMemoryWithHWBreakpoint.py (802 of 1228) PASS: lldb-api :: functionalities/data-formatter/user-format-vs-summary/TestUserFormatVsSummary.py (803 of 1228) PASS: lldb-api :: lang/cpp/signed_types/TestSignedTypes.py (804 of 1228) PASS: lldb-api :: functionalities/breakpoint/breakpoint_command/TestRegexpBreakCommand.py (805 of 1228) UNSUPPORTED: lldb-api :: commands/expression/import-std-module/deque-dbg-info-content/TestDbgInfoContentDequeFromStdModule.py (806 of 1228) PASS: lldb-api :: python_api/signals/TestSignalsAPI.py (807 of 1228) PASS: lldb-api :: functionalities/thread/concurrent_events/TestConcurrentTwoWatchpointThreads.py (808 of 1228) PASS: lldb-api :: functionalities/thread/backtrace_limit/TestBacktraceLimit.py (809 of 1228) PASS: lldb-api :: python_api/name_lookup/TestNameLookup.py (810 of 1228) PASS: lldb-api :: commands/frame/diagnose/array/TestArray.py (811 of 1228) PASS: lldb-api :: functionalities/set-data/TestSetData.py (812 of 1228) PASS: lldb-shell :: SymbolFile/DWARF/DW_TAG_basic_type_DW_ATE_UTF_nonC.ll (813 of 1228) PASS: lldb-api :: commands/watchpoints/watchpoint_commands/condition/TestWatchpointConditionCmd.py (814 of 1228) PASS: lldb-api :: macosx/universal/TestUniversal.py (815 of 1228) PASS: lldb-shell :: ObjectFile/ELF/PT_LOAD-overlap-PT_TLS.yaml (816 of 1228) PASS: lldb-api :: functionalities/memory/find/TestMemoryFind.py (817 of 1228) PASS: lldb-api :: commands/expression/diagnostics/TestExprDiagnostics.py (818 of 1228) PASS: lldb-shell :: SymbolFile/DWARF/apple-index-is-used.cpp (819 of 1228) UNSUPPORTED: lldb-api :: macosx/version_zero/TestGetVersionZeroVersion.py (820 of 1228) PASS: lldb-api :: functionalities/thread/step_until/TestStepUntil.py (821 of 1228) PASS: lldb-api :: functionalities/jitloader_gdb/TestJITLoaderGDB.py (822 of 1228) PASS: lldb-shell :: ObjectFile/ELF/minidebuginfo-corrupt-xz.yaml (823 of 1228) PASS: lldb-api :: lang/cpp/class-template-parameter-pack/TestClassTemplateParameterPack.py (824 of 1228) PASS: lldb-shell :: SymbolFile/DWARF/DW_AT_data_bit_offset-DW_OP_stack_value.s (825 of 1228) PASS: lldb-shell :: Commands/command-disassemble-process.yaml (826 of 1228) PASS: lldb-api :: commands/statistics/basic/TestStats.py (827 of 1228) UNSUPPORTED: lldb-shell :: SymbolFile/NativePDB/function-types-calling-conv.cpp (828 of 1228) PASS: lldb-shell :: SymbolFile/DWARF/find-inline-method.s (829 of 1228) UNSUPPORTED: lldb-api :: commands/expression/import-std-module/shared_ptr-dbg-info-content/TestSharedPtrDbgInfoContentFromStdModule.py (830 of 1228) UNSUPPORTED: lldb-shell :: SymbolFile/PDB/ast-restore.test (831 of 1228) PASS: lldb-shell :: BuildScript/modes.test (832 of 1228) PASS: lldb-api :: lang/c/conflicting-symbol/TestConflictingSymbol.py (833 of 1228) PASS: lldb-api :: functionalities/thread/exit_during_break/TestExitDuringBreak.py (834 of 1228) UNSUPPORTED: lldb-shell :: SymbolFile/PDB/function-level-linking.test (835 of 1228) FAIL: lldb-api :: functionalities/completion/TestCompletion.py (836 of 1228) ******************** TEST 'lldb-api :: functionalities/completion/TestCompletion.py' FAILED ******************** Script: -- /usr/local/Frameworks/Python.framework/Versions/3.7/bin/python3.7 /Users/buildslave/jenkins/workspace/lldb-cmake-reproducers/llvm-project/lldb/test/API/dotest.py -s /Users/buildslave/jenkins/workspace/lldb-cmake-reproducers/lldb-build/lldb-test-traces -S nm -u CXXFLAGS -u CFLAGS --codesign-identity lldb_codesign --server /Users/buildslave/jenkins/workspace/lldb-cmake-reproducers/lldb-build/./bin/debugserver --arch x86_64 --build-dir /Users/buildslave/jenkins/workspace/lldb-cmake-reproducers/lldb-build/lldb-test-build.noindex -s=/Users/buildslave/jenkins/workspace/lldb-cmake-reproducers/test/logs -t --env TERM=vt100 --env LLVM_LIBS_DIR=/Users/buildslave/jenkins/workspace/lldb-cmake-reproducers/lldb-build/./lib --arch x86_64 --build-dir /Users/buildslave/jenkins/workspace/lldb-cmake-reproducers/lldb-build/lldb-test-build.noindex --lldb-module-cache-dir /Users/buildslave/jenkins/workspace/lldb-cmake-reproducers/lldb-build/lldb-test-build.noindex/module-cache-lldb/lldb-api --clang-module-cache-dir /Users/buildslave/jenkins/workspace/lldb-cmake-reproducers/lldb-build/lldb-test-build.noindex/module-cache-clang/lldb-api --executable /Users/buildslave/jenkins/workspace/lldb-cmake-reproducers/lldb-build/./bin/lldb --compiler /Users/buildslave/jenkins/workspace/lldb-cmake-reproducers/lldb-build/./bin/clang --dsymutil /Users/buildslave/jenkins/workspace/lldb-cmake-reproducers/lldb-build/./bin/dsymutil --filecheck /Users/buildslave/jenkins/workspace/lldb-cmake-reproducers/lldb-build/./bin/FileCheck --yaml2obj /Users/buildslave/jenkins/workspace/lldb-cmake-reproducers/lldb-build/./bin/yaml2obj --lldb-libs-dir /Users/buildslave/jenkins/workspace/lldb-cmake-reproducers/lldb-build/./lib --skip-category=lldb-vscode --skip-category=std-module /Users/buildslave/jenkins/workspace/lldb-cmake-reproducers/llvm-project/lldb/test/API/functionalities/completion -p TestCompletion.py --replay-path /Users/buildslave/jenkins/workspace/lldb-cmake-reproducers/lldb-build/lldb-test-build.noindex/reproducers/TestCompletion.py -- Exit Code: -6

Hide Details

Command Output (stdout): -- lldb version 12.0.99 clang revision e30371d99d5157ac9718c803dd1101f9cbb1b224 llvm revision e30371d99d5157ac9718c803dd1101f9cbb1b224

Hide Details

-- Command Output (stderr): -- Reproducer expected signature 463: 'lldb::SBCommandInterpreter SBDebugger::GetCommandInterpreter()' Reproducer actual signature 487: 'uint32_t SBDebugger::GetNumTargets()' LLVM ERROR: Detected reproducer replay divergence. Refusing to continue. Fatal Python error: Aborted

Hide Details

Current thread 0x0000000103d7bdc0 (most recent call first): File "/Users/buildslave/jenkins/workspace/lldb-cmake-reproducers/lldb-build/lib/python3.7/site-packages/lldb/__init__.py", line 4305 in GetNumTargets File "/Users/buildslave/jenkins/workspace/lldb-cmake-reproducers/lldb-build/lib/python3.7/site-packages/lldb/__init__.py", line 143 in lldb_iter File "/Users/buildslave/jenkins/workspace/lldb-cmake-reproducers/llvm-project/lldb/packages/Python/lldbsuite/test/lldbtest.py", line 2074 in tearDown File "/Users/buildslave/jenkins/workspace/lldb-cmake-reproducers/llvm-project/lldb/third_party/Python/module/unittest2/unittest2/case.py", line 386 in run File "/Users/buildslave/jenkins/workspace/lldb-cmake-reproducers/llvm-project/lldb/third_party/Python/module/unittest2/unittest2/case.py", line 458 in __call__ File "/Users/buildslave/jenkins/workspace/lldb-cmake-reproducers/llvm-project/lldb/third_party/Python/module/unittest2/unittest2/suite.py", line 117 in _wrapped_run File "/Users/buildslave/jenkins/workspace/lldb-cmake-reproducers/llvm-project/lldb/third_party/Python/module/unittest2/unittest2/suite.py", line 115 in _wrapped_run File "/Users/buildslave/jenkins/workspace/lldb-cmake-reproducers/llvm-project/lldb/third_party/Python/module/unittest2/unittest2/suite.py", line 85 in run File "/Users/buildslave/jenkins/workspace/lldb-cmake-reproducers/llvm-project/lldb/third_party/Python/module/unittest2/unittest2/suite.py", line 66 in __call__ File "/Users/buildslave/jenkins/workspace/lldb-cmake-reproducers/llvm-project/lldb/third_party/Python/module/unittest2/unittest2/runner.py", line 165 in run File "/Users/buildslave/jenkins/workspace/lldb-cmake-reproducers/llvm-project/lldb/packages/Python/lldbsuite/test/dotest.py", line 1038 in run_suite File "/Users/buildslave/jenkins/workspace/lldb-cmake-reproducers/llvm-project/lldb/test/API/dotest.py", line 7 in <module>

Hide Details

--

Hide Details

******************** PASS: lldb-api :: assert_messages_test/TestAssertMessages.py (837 of 1228) UNSUPPORTED: lldb-api :: commands/expression/expr-in-syscall/TestExpressionInSyscall.py (838 of 1228) PASS: lldb-shell :: SymbolFile/DWARF/dwo-type-in-main-file.s (839 of 1228) PASS: lldb-api :: commands/add-dsym/uuid/TestAddDsymCommand.py (840 of 1228) PASS: lldb-api :: functionalities/data-formatter/synthupdate/TestSyntheticFilterRecompute.py (841 of 1228) PASS: lldb-shell :: ObjectFile/ELF/netbsd-core-amd64.test (842 of 1228) PASS: lldb-shell :: Commands/command-backtrace.test (843 of 1228) PASS: lldb-api :: functionalities/memory/cache/TestMemoryCache.py (844 of 1228) PASS: lldb-api :: lang/objc/ptr_refs/TestPtrRefsObjC.py (845 of 1228) PASS: lldb-shell :: SymbolFile/DWARF/DW_OP_piece-smaller-than-struct.s (846 of 1228) PASS: lldb-api :: functionalities/unwind/zeroth_frame/TestZerothFrame.py (847 of 1228) PASS: lldb-api :: lang/cpp/typeof/TestTypeOfDeclTypeExpr.py (848 of 1228) PASS: lldb-api :: functionalities/data-formatter/data-formatter-stl/libcxx/variant/TestDataFormatterLibcxxVariant.py (849 of 1228) PASS: lldb-api :: lang/objc/objc-baseclass-sbtype/TestObjCBaseClassSBType.py (850 of 1228) PASS: lldb-api :: functionalities/thread/thread_specific_break/TestThreadSpecificBreakpoint.py (851 of 1228) UNSUPPORTED: lldb-api :: tools/lldb-vscode/disconnect/TestVSCode_disconnect.py (852 of 1228) PASS: lldb-shell :: Breakpoint/single-file-split-dwarf.test (853 of 1228) PASS: lldb-api :: python_api/value/TestValueAPI.py (854 of 1228) PASS: lldb-shell :: ObjectFile/ELF/PT_LOAD-overlap.yaml (855 of 1228) PASS: lldb-api :: commands/expression/call-throws/TestCallThatThrows.py (856 of 1228) UNSUPPORTED: lldb-api :: functionalities/tty/TestTerminal.py (857 of 1228) PASS: lldb-api :: macosx/add-dsym/TestAddDsymMidExecutionCommand.py (858 of 1228) PASS: lldb-api :: lang/objc/hidden-ivars/TestHiddenIvars.py (859 of 1228) PASS: lldb-api :: iohandler/completion/TestIOHandlerCompletion.py (860 of 1228) PASS: lldb-api :: python_api/findvalue_duplist/TestSBFrameFindValue.py (861 of 1228) PASS: lldb-api :: python_api/exprpath_synthetic/TestExprPathSynthetic.py (862 of 1228) PASS: lldb-api :: functionalities/thread/concurrent_events/TestConcurrentSignalBreak.py (863 of 1228) PASS: lldb-api :: functionalities/tail_call_frames/disambiguate_tail_call_seq/TestDisambiguateTailCallSeq.py (864 of 1228) PASS: lldb-api :: lang/objc/objc-checker/TestObjCCheckers.py (865 of 1228) PASS: lldb-api :: functionalities/recursion/TestValueObjectRecursion.py (866 of 1228) PASS: lldb-api :: commands/expression/dollar-in-variable/TestDollarInVariable.py (867 of 1228) PASS: lldb-api :: commands/expression/rdar44436068/Test128BitsInteger.py (868 of 1228) PASS: lldb-api :: functionalities/breakpoint/address_breakpoints/TestAddressBreakpoints.py (869 of 1228) PASS: lldb-api :: functionalities/thread/concurrent_events/TestConcurrentTwoWatchpointsOneBreakpoint.py (870 of 1228) PASS: lldb-api :: functionalities/thread/concurrent_events/TestConcurrentSignalNWatchNBreak.py (871 of 1228) PASS: lldb-api :: commands/expression/ir-interpreter/TestIRInterpreter.py (872 of 1228) UNSUPPORTED: lldb-shell :: Reproducer/TestDebugSymbols.test (873 of 1228) PASS: lldb-api :: lang/c/blocks/TestBlocks.py (874 of 1228) PASS: lldb-shell :: SymbolFile/DWARF/find-method-local-struct.cpp (875 of 1228) PASS: lldb-api :: tools/lldb-server/TestGdbRemoteKill.py (876 of 1228) PASS: lldb-api :: commands/frame/select/TestFrameSelect.py (877 of 1228) PASS: lldb-api :: functionalities/data-formatter/data-formatter-stl/libcxx/list/TestDataFormatterLibcxxList.py (878 of 1228) UNSUPPORTED: lldb-shell :: Reproducer/TestSynchronous.test (879 of 1228) PASS: lldb-shell :: Minidump/memory-region-from-module.yaml (880 of 1228) PASS: lldb-api :: commands/target/stop-hooks/TestStopHooks.py (881 of 1228) UNSUPPORTED: lldb-shell :: ObjectFile/ELF/minidebuginfo-set-and-hit-breakpoint.test (882 of 1228) UNSUPPORTED: lldb-api :: functionalities/inferior-changed/TestInferiorChanged.py (883 of 1228) PASS: lldb-api :: functionalities/tsan/cpp_global_location/TestTsanCPPGlobalLocation.py (884 of 1228) PASS: lldb-api :: lang/cpp/class_types/TestClassTypes.py (885 of 1228) PASS: lldb-api :: python_api/sbenvironment/TestSBEnvironment.py (886 of 1228) UNSUPPORTED: lldb-api :: commands/register/register/intel_xtended_registers/mpx_offset_intersection/TestMPXOffsetIntersection.py (887 of 1228) PASS: lldb-api :: commands/process/signal/TestProcessSignal.py (888 of 1228) PASS: lldb-shell :: SymbolFile/Breakpad/unwind-via-stack-win.test (889 of 1228) PASS: lldb-shell :: SymbolFile/DWARF/debug_loc-aslr.s (890 of 1228) UNSUPPORTED: lldb-api :: functionalities/darwin_log/source/info/TestDarwinLogSourceInfo.py (891 of 1228) PASS: lldb-api :: functionalities/data-formatter/data-formatter-stl/libcxx/forward_list/TestDataFormatterLibcxxForwardList.py (892 of 1228) PASS: lldb-api :: commands/command/delete/TestCommandDelete.py (893 of 1228) UNSUPPORTED: lldb-api :: tools/lldb-vscode/completions/TestVSCode_completions.py (894 of 1228) PASS: lldb-shell :: SymbolFile/DWARF/dwp-separate-debug-file.cpp (895 of 1228) PASS: lldb-api :: lang/cpp/wchar_t/TestCxxWCharT.py (896 of 1228) PASS: lldb-api :: functionalities/breakpoint/breakpoint_options/TestBreakpointOptions.py (897 of 1228) PASS: lldb-shell :: SymbolFile/DWARF/find-variable-dwo.cpp (898 of 1228) PASS: lldb-api :: functionalities/plugins/command_plugin/TestPluginCommands.py (899 of 1228) PASS: lldb-api :: lang/objc/real-definition/TestRealDefinition.py (900 of 1228) PASS: lldb-api :: lang/objc/modules-hash-mismatch/TestClangModulesHashMismatch.py (901 of 1228) UNSUPPORTED: lldb-shell :: Reproducer/TestCaptureEnvOverride.test (902 of 1228) PASS: lldb-api :: functionalities/data-formatter/data-formatter-objc/TestDataFormatterObjCKVO.py (903 of 1228) PASS: lldb-api :: functionalities/gdb_remote_client/TestGDBRemoteDiskFileCompletion.py (904 of 1228) PASS: lldb-api :: commands/disassemble/basic/TestDisassembleBreakpoint.py (905 of 1228) PASS: lldb-shell :: Driver/TestSingleQuote.test (906 of 1228) PASS: lldb-shell :: Unwind/thread-step-out-ret-addr-check.test (907 of 1228) UNSUPPORTED: lldb-api :: commands/process/launch/TestProcessLaunch.py (908 of 1228) PASS: lldb-api :: lang/objc/rdar-10967107/TestRdar10967107.py (909 of 1228) UNSUPPORTED: lldb-api :: functionalities/darwin_log/filter/regex/activity-chain/TestDarwinLogFilterRegexActivityChain.py (910 of 1228) PASS: lldb-shell :: SymbolFile/Breakpad/line-table.test (911 of 1228) PASS: lldb-api :: tools/lldb-server/TestGdbRemoteExpeditedRegisters.py (912 of 1228) PASS: lldb-api :: commands/platform/basic/TestPlatformCommand.py (913 of 1228) UNSUPPORTED: lldb-api :: functionalities/thread/create_during_step/TestCreateDuringStep.py (914 of 1228) PASS: lldb-api :: functionalities/thread/concurrent_events/TestConcurrentTwoWatchpointsOneSignal.py (915 of 1228) UNSUPPORTED: lldb-api :: tools/lldb-server/platform-process-connect/TestPlatformProcessConnect.py (916 of 1228) PASS: lldb-api :: functionalities/history/TestHistoryRecall.py (917 of 1228) PASS: lldb-api :: functionalities/breakpoint/inlined_breakpoints/TestInlinedBreakpoints.py (918 of 1228) PASS: lldb-api :: lang/c/complex/TestComplexC99.py (919 of 1228) PASS: lldb-shell :: SymbolFile/DWARF/gnu-style-compression.cpp (920 of 1228) PASS: lldb-api :: lang/cpp/const_this/TestConstThis.py (921 of 1228) UNSUPPORTED: lldb-shell :: ScriptInterpreter/Lua/lua-python.test (922 of 1228) PASS: lldb-api :: commands/disassemble/basic/TestFrameDisassemble.py (923 of 1228) PASS: lldb-shell :: Minidump/Windows/arm-fp-unwind.test (924 of 1228) PASS: lldb-api :: commands/command/script/import/rdar-12586188/TestRdar12586188.py (925 of 1228) PASS: lldb-api :: lang/cpp/namespace/TestNamespaceLookup.py (926 of 1228) PASS: lldb-api :: lang/cpp/namespace/TestNamespace.py (927 of 1228) PASS: lldb-api :: functionalities/data-formatter/data-formatter-python-synth/TestDataFormatterPythonSynth.py (928 of 1228) PASS: lldb-api :: lang/objc/foundation/TestObjCMethodsString.py (929 of 1228) UNSUPPORTED: lldb-shell :: SymbolFile/PDB/variables.test (930 of 1228) UNSUPPORTED: lldb-shell :: Reproducer/TestDriverOptions.test (931 of 1228) PASS: lldb-shell :: SymbolFile/DWARF/dir-separator-windows.s (932 of 1228) UNSUPPORTED: lldb-shell :: Breakpoint/case-insensitive.test (933 of 1228) PASS: lldb-api :: commands/expression/multiline-completion/TestMultilineCompletion.py (934 of 1228) UNSUPPORTED: lldb-shell :: ScriptInterpreter/Lua/independent_state.test (935 of 1228) PASS: lldb-api :: commands/expression/top-level/TestTopLevelExprs.py (936 of 1228) UNSUPPORTED: lldb-api :: macosx/find-dsym/bundle-with-dot-in-filename/TestBundleWithDotInFilename.py (937 of 1228) PASS: lldb-api :: commands/quit/TestQuit.py (938 of 1228) PASS: lldb-shell :: SymbolFile/DWARF/debug_loc_and_loclists.s (939 of 1228) PASS: lldb-shell :: Settings/TestFrameFormatNoColor.test (940 of 1228) PASS: lldb-api :: lang/cpp/gmodules/TestWithModuleDebugging.py (941 of 1228) PASS: lldb-api :: macosx/load-kext/TestLoadKext.py (942 of 1228) UNSUPPORTED: lldb-api :: linux/mix-dwo-and-regular-objects/TestMixedDwarfBinary.py (943 of 1228) UNSUPPORTED: lldb-api :: benchmarks/continue/TestBenchmarkContinue.py (944 of 1228) PASS: lldb-api :: functionalities/data-formatter/language_category_updates/TestDataFormatterLanguageCategoryUpdates.py (945 of 1228) PASS: lldb-api :: lang/cpp/call-function/TestCallCPPFunction.py (946 of 1228) PASS: lldb-api :: commands/gui/viewlarge/TestGuiViewLarge.py (947 of 1228) PASS: lldb-api :: functionalities/data-formatter/cstring-utf8-summary/TestCstringUnicode.py (948 of 1228) PASS: lldb-api :: functionalities/data-formatter/data-formatter-objc/TestDataFormatterObjCNSURL.py (949 of 1228) PASS: lldb-api :: lang/objc/objc-new-syntax/TestObjCNewSyntaxLiteral.py (950 of 1228) UNSUPPORTED: lldb-api :: functionalities/darwin_log/filter/exact_match/message/TestDarwinLogFilterMatchMessage.py (951 of 1228) UNSUPPORTED: lldb-shell :: Reproducer/TestVersionCheck.test (952 of 1228) UNSUPPORTED: lldb-shell :: ScriptInterpreter/Lua/bindings.test (953 of 1228) PASS: lldb-shell :: ObjectFile/ELF/compressed-sections.yaml (954 of 1228) PASS: lldb-api :: arm/emulation/TestEmulations.py (955 of 1228) PASS: lldb-api :: python_api/lldbutil/iter/TestLLDBIterator.py (956 of 1228) PASS: lldb-api :: commands/expression/context-object-objc/TestContextObjectObjc.py (957 of 1228) PASS: lldb-api :: commands/expression/unicode-in-variable/TestUnicodeInVariable.py (958 of 1228) PASS: lldb-api :: commands/watchpoints/watchpoint_commands/command/TestWatchpointCommandLLDB.py (959 of 1228) PASS: lldb-shell :: SymbolFile/DWARF/debug-types-line-tables.s (960 of 1228) PASS: lldb-api :: functionalities/gdb_remote_client/TestRegDefinitionInParts.py (961 of 1228) PASS: lldb-api :: functionalities/ubsan/user-expression/TestUbsanUserExpression.py (962 of 1228) PASS: lldb-api :: commands/version/TestVersion.py (963 of 1228) UNSUPPORTED: lldb-shell :: ExecControl/StopHook/stop-hook-threads.test (964 of 1228) UNSUPPORTED: lldb-api :: functionalities/data-formatter/data-formatter-stl/libstdcpp/tuple/TestDataFormatterStdTuple.py (965 of 1228) UNSUPPORTED: lldb-api :: functionalities/thread/break_after_join/TestBreakAfterJoin.py (966 of 1228) UNSUPPORTED: lldb-api :: functionalities/darwin_log/format/TestDarwinLogMessageFormat.py (967 of 1228) PASS: lldb-api :: functionalities/object-file/TestImageListMultiArchitecture.py (968 of 1228) UNSUPPORTED: lldb-shell :: SymbolFile/NativePDB/bitfields.cpp (969 of 1228) PASS: lldb-api :: lang/cpp/scope/TestCppScope.py (970 of 1228) PASS: lldb-api :: commands/expression/function_template_specialization_temp_args/TestFunctionTemplateSpecializationTempArgs.py (971 of 1228) UNSUPPORTED: lldb-api :: commands/expression/import-std-module/forward_decl_from_module/TestForwardDeclFromStdModule.py (972 of 1228) UNSUPPORTED: lldb-shell :: SymbolFile/NativePDB/s_constant.cpp (973 of 1228) UNSUPPORTED: lldb-api :: linux/thread/create_during_instruction_step/TestCreateDuringInstructionStep.py (974 of 1228) PASS: lldb-shell :: Minidump/Windows/Sigsegv/sigsegv.test (975 of 1228) PASS: lldb-api :: functionalities/dynamic_value_child_count/TestDynamicValueChildCount.py (976 of 1228) PASS: lldb-api :: lang/c/local_types/TestUseClosestType.py (977 of 1228) PASS: lldb-api :: commands/gui/breakpoints/TestGuiBreakpoints.py (978 of 1228) PASS: lldb-api :: lang/objc/objc-struct-argument/TestObjCStructArgument.py (979 of 1228) PASS: lldb-api :: lang/cpp/stl/TestSTL.py (980 of 1228) PASS: lldb-api :: sanity/TestModuleCacheSanity.py (981 of 1228) PASS: lldb-api :: functionalities/tail_call_frames/inlining_and_tail_calls/TestInliningAndTailCalls.py (982 of 1228) UNSUPPORTED: lldb-shell :: Driver/TestFile.test (983 of 1228) PASS: lldb-shell :: ObjectFile/ELF/PT_LOAD.yaml (984 of 1228) PASS: lldb-api :: python_api/frame/inlines/TestInlinedFrame.py (985 of 1228) PASS: lldb-shell :: ObjectFile/Breakpad/discontiguous-sections.test (986 of 1228) PASS: lldb-shell :: Quit/TestQuitExitCodeImplicit0.test (987 of 1228) PASS: lldb-shell :: SymbolFile/Breakpad/stack-cfi-parsing.test (988 of 1228) PASS: lldb-api :: lang/cpp/nsimport/TestCppNsImport.py (989 of 1228) PASS: lldb-api :: functionalities/var_path/TestVarPath.py (990 of 1228) PASS: lldb-api :: sanity/TestSettingSkipping.py (991 of 1228) PASS: lldb-api :: commands/expression/persistent_variables/TestPersistentVariables.py (992 of 1228) PASS: lldb-api :: functionalities/thread/concurrent_events/TestConcurrentTwoBreakpointsOneWatchpoint.py (993 of 1228) PASS: lldb-api :: functionalities/thread/concurrent_events/TestConcurrentWatchpointWithDelayWatchpointThreads.py (994 of 1228) PASS: lldb-shell :: BuildScript/toolchain-clang.test (995 of 1228) PASS: lldb-api :: functionalities/data-formatter/ostypeformatting/TestFormattersOsType.py (996 of 1228) PASS: lldb-api :: python_api/process/TestProcessAPI.py (997 of 1228) UNSUPPORTED: lldb-shell :: SymbolFile/PDB/calling-conventions.test (998 of 1228) PASS: lldb-shell :: Minidump/Windows/broken-unwind.test (999 of 1228) PASS: lldb-api :: commands/expression/radar_9673664/TestExprHelpExamples.py (1000 of 1228) PASS: lldb-api :: lang/cpp/symbols/TestSymbols.py (1001 of 1228) PASS: lldb-api :: functionalities/asan/TestMemoryHistory.py (1002 of 1228) PASS: lldb-api :: lang/c/bitfields/TestBitfields.py (1003 of 1228) PASS: lldb-api :: commands/expression/entry-bp/TestExprEntryBP.py (1004 of 1228) PASS: lldb-api :: tools/lldb-server/TestGdbRemote_qThreadStopInfo.py (1005 of 1228) PASS: lldb-api :: functionalities/gdb_remote_client/TestTargetXMLArch.py (1006 of 1228) PASS: lldb-api :: functionalities/thread/exit_during_step/TestExitDuringStep.py (1007 of 1228) PASS: lldb-api :: python_api/frame/TestFrames.py (1008 of 1228) UNSUPPORTED: lldb-shell :: ScriptInterpreter/Lua/convenience_variables.test (1009 of 1228) PASS: lldb-shell :: Settings/TestStopCommandSourceOnError.test (1010 of 1228) PASS: lldb-api :: functionalities/data-formatter/dump_dynamic/TestDumpDynamic.py (1011 of 1228) UNSUPPORTED: lldb-shell :: Register/arm-gp-read.test (1012 of 1228) PASS: lldb-api :: functionalities/data-formatter/data-formatter-stl/libcxx/list/loop/TestDataFormatterLibcxxListLoop.py (1013 of 1228) PASS: lldb-api :: commands/platform/process/list/TestProcessList.py (1014 of 1228) PASS: lldb-shell :: SymbolFile/dissassemble-entry-point.s (1015 of 1228) PASS: lldb-shell :: SymbolFile/DWARF/DW_AT_const_value-bitfields.s (1016 of 1228) XFAIL: lldb-shell :: SymbolFile/DWARF/find-type-in-function.cpp (1017 of 1228) PASS: lldb-shell :: ObjectFile/ELF/section-overlap.yaml (1018 of 1228) UNSUPPORTED: lldb-api :: commands/watchpoints/variable_out_of_scope/TestWatchedVarHitWhenInScope.py (1019 of 1228) PASS: lldb-shell :: ObjectFile/ELF/section-types.yaml (1020 of 1228) PASS: lldb-api :: commands/process/attach/TestProcessAttach.py (1021 of 1228) PASS: lldb-api :: commands/watchpoints/watchpoint_events/TestWatchpointEvents.py (1022 of 1228) PASS: lldb-api :: commands/command/script_alias/TestCommandScriptAlias.py (1023 of 1228) PASS: lldb-api :: functionalities/tail_call_frames/thread_step_out_or_return/TestSteppingOutWithArtificialFrames.py (1024 of 1228) UNSUPPORTED: lldb-shell :: SymbolFile/NativePDB/function-types-builtins.cpp (1025 of 1228) UNSUPPORTED: lldb-api :: tools/lldb-server/libraries-svr4/TestGdbRemoteLibrariesSvr4Support.py (1026 of 1228) PASS: lldb-shell :: SymbolFile/DWARF/find-basic-namespace.cpp (1027 of 1228) PASS: lldb-api :: lang/objcxx/objcxx-ivar-vector/TestIvarVector.py (1028 of 1228) UNSUPPORTED: lldb-api :: functionalities/darwin_log/filter/exact_match/category/TestDarwinLogFilterMatchCategory.py (1029 of 1228) PASS: lldb-api :: functionalities/backticks/TestBackticksWithoutATarget.py (1030 of 1228) UNSUPPORTED: lldb-api :: arm/breakpoint-it/TestBreakpointIt.py (1031 of 1228) UNSUPPORTED: lldb-shell :: Quit/TestQuitExitCode-30.test (1032 of 1228) PASS: lldb-shell :: SymbolFile/DWARF/anon_class_w_and_wo_export_symbols.ll (1033 of 1228) UNSUPPORTED: lldb-shell :: Register/x86-64-zmm-write.test (1034 of 1228) UNSUPPORTED: lldb-shell :: Register/x86-64-ymm-read.test (1035 of 1228) PASS: lldb-shell :: SymbolFile/DWARF/deterministic-build.cpp (1036 of 1228) PASS: lldb-api :: commands/watchpoints/multiple_threads/TestWatchpointMultipleThreads.py (1037 of 1228) PASS: lldb-shell :: ObjectFile/ELF/netbsd-exec-8.99.30-amd64.yaml (1038 of 1228) PASS: lldb-api :: functionalities/thread/concurrent_events/TestConcurrentCrashWithWatchpointBreakpointSignal.py (1039 of 1228) PASS: lldb-api :: api/command-return-object/TestSBCommandReturnObject.py (1040 of 1228) PASS: lldb-api :: lang/objc/bitfield_ivars/TestBitfieldIvars.py (1041 of 1228) PASS: lldb-api :: macosx/DBGSourcePathRemapping/TestDSYMSourcePathRemapping.py (1042 of 1228) PASS: lldb-shell :: SymbolFile/DWARF/dwp.s (1043 of 1228) PASS: lldb-api :: lang/cpp/multiple-inheritance/TestCppMultipleInheritance.py (1044 of 1228) PASS: lldb-api :: lang/cpp/unique-types/TestUniqueTypes.py (1045 of 1228) PASS: lldb-shell :: ObjectFile/ELF/section-addresses.yaml (1046 of 1228) PASS: lldb-api :: lang/objc/single-entry-dictionary/TestObjCSingleEntryDictionary.py (1047 of 1228) PASS: lldb-api :: commands/process/launch-with-shellexpand/TestLaunchWithShellExpand.py (1048 of 1228) PASS: lldb-shell :: Driver/TestProcessAttach.test (1049 of 1228) PASS: lldb-api :: lang/cpp/alignas_base_class/TestAlignAsBaseClass.py (1050 of 1228) PASS: lldb-api :: functionalities/target_var/TestTargetVar.py (1051 of 1228) PASS: lldb-api :: commands/expression/deleting-implicit-copy-constructor/TestDeletingImplicitCopyConstructor.py (1052 of 1228) PASS: lldb-api :: lang/cpp/subst_template_type_param/TestSubstTemplateTypeParam.py (1053 of 1228) UNSUPPORTED: lldb-api :: functionalities/unwind/ehframe/TestEhFrameUnwind.py (1054 of 1228) PASS: lldb-shell :: ObjectFile/ELF/PT_LOAD-overlap-section.yaml (1055 of 1228) PASS: lldb-api :: lang/objc/objc-ivar-stripped/TestObjCIvarStripped.py (1056 of 1228) UNSUPPORTED: lldb-api :: commands/expression/import-std-module/unique_ptr-dbg-info-content/TestUniquePtrDbgInfoContent.py (1057 of 1228) PASS: lldb-api :: api/multithreaded/TestMultithreaded.py (1058 of 1228) UNSUPPORTED: lldb-api :: lang/objc/rdar-12408181/TestRdar12408181.py (1059 of 1228) UNSUPPORTED: lldb-shell :: SymbolFile/PDB/func-symbols.test (1060 of 1228) UNSUPPORTED: lldb-api :: commands/expression/import-std-module/forward_list/TestForwardListFromStdModule.py (1061 of 1228) PASS: lldb-shell :: ObjectFile/MachO/lc_build_version.yaml (1062 of 1228) PASS: lldb-api :: functionalities/data-formatter/data-formatter-skip-summary/TestDataFormatterSkipSummary.py (1063 of 1228) PASS: lldb-shell :: Commands/CommandScriptImmediateOutput/CommandScriptImmediateOutputFile.test (1064 of 1228) PASS: lldb-api :: lang/objc/objc-foundation-dictionary-empty/TestNSDictionary0.py (1065 of 1228) PASS: lldb-api :: types/TestShortType.py (1066 of 1228) PASS: lldb-api :: lang/cpp/modules-import/TestCXXModulesImport.py (1067 of 1228) UNSUPPORTED: lldb-api :: lang/objc/modules-update/TestClangModulesUpdate.py (1068 of 1228) PASS: lldb-api :: functionalities/load_unload/TestLoadUnload.py (1069 of 1228) PASS: lldb-shell :: ObjectFile/wasm/unified-debug-sections.yaml (1070 of 1228) PASS: lldb-api :: functionalities/non-overlapping-index-variable-i/TestIndexVariable.py (1071 of 1228) PASS: lldb-shell :: Breakpoint/split-dwarf5-debug-stroffsets.test (1072 of 1228) PASS: lldb-api :: lang/objc/modules-inline-functions/TestModulesInlineFunctions.py (1073 of 1228) PASS: lldb-shell :: ObjectFile/ELF/minidebuginfo-find-symbols.yaml (1074 of 1228) UNSUPPORTED: lldb-shell :: Reproducer/TestProcessList.test (1075 of 1228) PASS: lldb-shell :: Minidump/memory-region.yaml (1076 of 1228) UNSUPPORTED: lldb-api :: linux/add-symbols/TestTargetSymbolsAddCommand.py (1077 of 1228) PASS: lldb-api :: functionalities/breakpoint/breakpoint_command/TestBreakpointCommand.py (1078 of 1228) PASS: lldb-api :: functionalities/thread/concurrent_events/TestConcurrentBreakpointsDelayedBreakpointOneWatchpoint.py (1079 of 1228) PASS: lldb-api :: functionalities/gdb_remote_client/TestRecognizeBreakpoint.py (1080 of 1228) PASS: lldb-shell :: Commands/CommandScriptImmediateOutput/CommandScriptImmediateOutputConsole.test (1081 of 1228) PASS: lldb-api :: commands/target/stop-hook/disable/TestTargetStopHookDisable.py (1082 of 1228) PASS: lldb-shell :: SymbolFile/DWARF/debug_rnglists.s (1083 of 1228) PASS: lldb-api :: lang/cpp/namespace_definitions/TestNamespaceDefinitions.py (1084 of 1228) PASS: lldb-api :: tools/lldb-server/TestGdbRemoteThreadsInStopReply.py (1085 of 1228) PASS: lldb-api :: python_api/value/change_values/TestChangeValueAPI.py (1086 of 1228) UNSUPPORTED: lldb-api :: functionalities/darwin_log/filter/exact_match/activity/TestDarwinLogFilterMatchActivity.py (1087 of 1228) UNSUPPORTED: lldb-shell :: SymbolFile/NativePDB/function-types-classes.cpp (1088 of 1228) PASS: lldb-api :: functionalities/breakpoint/cpp_exception/TestCPPExceptionBreakpoint.py (1089 of 1228) PASS: lldb-api :: lang/objc/objc_direct-methods/TestObjCDirectMethods.py (1090 of 1228) UNSUPPORTED: lldb-shell :: Reproducer/TestRelativePath.test (1091 of 1228) PASS: lldb-api :: lang/c/set_values/TestSetValues.py (1092 of 1228) PASS: lldb-api :: functionalities/thread/num_threads/TestNumThreads.py (1093 of 1228) PASS: lldb-shell :: Watchpoint/SetErrorCases.test (1094 of 1228) PASS: lldb-api :: python_api/target/TestTargetAPI.py (1095 of 1228) UNSUPPORTED: lldb-api :: commands/expression/import-std-module/unique_ptr/TestUniquePtrFromStdModule.py (1096 of 1228) PASS: lldb-api :: lang/c/enum_types/TestEnumTypes.py (1097 of 1228) PASS: lldb-api :: commands/expression/test/TestExprs2.py (1098 of 1228) PASS: lldb-api :: functionalities/data-formatter/type_summary_list_script/TestTypeSummaryListScript.py (1099 of 1228) PASS: lldb-api :: lang/cpp/dynamic-value/TestCppValueCast.py (1100 of 1228) UNSUPPORTED: lldb-api :: commands/expression/call-restarts/TestCallThatRestarts.py (1101 of 1228) PASS: lldb-shell :: ObjectFile/ELF/section-permissions.yaml (1102 of 1228) PASS: lldb-api :: python_api/hello_world/TestHelloWorld.py (1103 of 1228) PASS: lldb-api :: commands/watchpoints/watchpoint_on_vectors/TestValueOfVectorVariable.py (1104 of 1228) PASS: lldb-api :: python_api/default-constructor/TestDefaultConstructorForAPIObjects.py (1105 of 1228) PASS: lldb-api :: commands/expression/calculator_mode/TestCalculatorMode.py (1106 of 1228) UNSUPPORTED: lldb-api :: tools/lldb-server/TestGdbRemoteModuleInfo.py (1107 of 1228) PASS: lldb-api :: functionalities/data-formatter/data-formatter-advanced/TestDataFormatterAdv.py (1108 of 1228) PASS: lldb-api :: python_api/sbstructureddata/TestStructuredDataAPI.py (1109 of 1228) UNSUPPORTED: lldb-api :: commands/expression/import-std-module/stack/TestStackFromStdModule.py (1110 of 1228) PASS: lldb-api :: functionalities/thread/concurrent_events/TestConcurrentCrashWithBreak.py (1111 of 1228) PASS: lldb-api :: lang/objc/foundation/TestObjCMethods2.py (1112 of 1228) PASS: lldb-api :: functionalities/thread/concurrent_events/TestConcurrentDelayWatchBreak.py (1113 of 1228) PASS: lldb-api :: lang/objc/objc-ivar-offsets/TestObjCIvarOffsets.py (1114 of 1228) UNSUPPORTED: lldb-api :: functionalities/postmortem/netbsd-core/TestNetBSDCore.py (1115 of 1228) UNSUPPORTED: lldb-api :: commands/expression/unwind_expression/TestUnwindExpression.py (1116 of 1228) UNSUPPORTED: lldb-api :: functionalities/process_save_core/TestProcessSaveCore.py (1117 of 1228) PASS: lldb-api :: lang/c/modules/TestCModules.py (1118 of 1228) PASS: lldb-api :: commands/target/create-no-such-arch/TestNoSuchArch.py (1119 of 1228) UNSUPPORTED: lldb-api :: lang/cpp/static_members/TestCPPStaticMembers.py (1120 of 1228) PASS: lldb-api :: tools/lldb-server/TestGdbRemoteExitCode.py (1121 of 1228) UNSUPPORTED: lldb-api :: functionalities/gdb_remote_client/TestIOSSimulator.py (1122 of 1228) PASS: lldb-api :: functionalities/data-formatter/data-formatter-stl/libcxx/atomic/TestLibCxxAtomic.py (1123 of 1228) PASS: lldb-shell :: SymbolFile/DWARF/find-method.cpp (1124 of 1228) UNSUPPORTED: lldb-api :: python_api/sbdata/TestSBData.py (1125 of 1228) PASS: lldb-api :: linux/builtin_trap/TestBuiltinTrap.py (1126 of 1228) PASS: lldb-api :: commands/target/select/TestTargetSelect.py (1127 of 1228) UNSUPPORTED: lldb-api :: commands/expression/import-std-module/list-dbg-info-content/TestDbgInfoContentListFromStdModule.py (1128 of 1228) UNSUPPORTED: lldb-shell :: SymbolFile/NativePDB/globals-bss.cpp (1129 of 1228) PASS: lldb-shell :: Heap/heap-cstr.test (1130 of 1228) PASS: lldb-api :: commands/frame/diagnose/dereference-this/TestDiagnoseDereferenceThis.py (1131 of 1228) PASS: lldb-api :: lang/cpp/virtual-overload/TestVirtualOverload.py (1132 of 1228) PASS: lldb-shell :: Commands/command-thread-select.test (1133 of 1228) PASS: lldb-api :: functionalities/gdb_remote_client/TestGDBRemoteLoad.py (1134 of 1228) UNSUPPORTED: lldb-api :: tools/lldb-server/signal-filtering/TestGdbRemote_QPassSignals.py (1135 of 1228) UNSUPPORTED: lldb-api :: commands/expression/import-std-module/vector/TestVectorFromStdModule.py (1136 of 1228) PASS: lldb-api :: functionalities/data-formatter/synthcapping/TestSyntheticCapping.py (1137 of 1228) PASS: lldb-api :: functionalities/thread_plan/TestThreadPlanCommands.py (1138 of 1228) UNSUPPORTED: lldb-api :: functionalities/breakpoint/breakpoint_command/TestBreakpointCommandsFromPython.py (1139 of 1228) UNSUPPORTED: lldb-shell :: Reproducer/Functionalities/TestExpressionEvaluation.test (1140 of 1228) UNSUPPORTED: lldb-shell :: Reproducer/TestDiscard.test (1141 of 1228) PASS: lldb-api :: lang/objc/radar-9691614/TestObjCMethodReturningBOOL.py (1142 of 1228) PASS: lldb-api :: commands/target/modules/search-paths/insert/TestTargetModulesSearchpathsInsert.py (1143 of 1228) UNSUPPORTED: lldb-api :: functionalities/data-formatter/data-formatter-stl/libstdcpp/unique_ptr/TestDataFormatterStdUniquePtr.py (1144 of 1228) PASS: lldb-shell :: SymbolFile/DWARF/split-dwarf-inlining.cpp (1145 of 1228) UNSUPPORTED: lldb-api :: tools/intel-features/intel-pt/test/TestIntelPTSimpleBinary.py (1146 of 1228) PASS: lldb-api :: functionalities/gdb_remote_client/TestNestedRegDefinitions.py (1147 of 1228) PASS: lldb-api :: lang/objc/variadic_methods/TestVariadicMethods.py (1148 of 1228) PASS: lldb-api :: lang/cpp/std-function-step-into-callable/TestStdFunctionStepIntoCallable.py (1149 of 1228) PASS: lldb-shell :: SymbolFile/DWARF/debug_ranges_and_rnglists.test (1150 of 1228) PASS: lldb-api :: python_api/value_var_update/TestValueVarUpdate.py (1151 of 1228) PASS: lldb-api :: commands/expression/ignore-artificial-constructors/TestIgnoreArtificialConstructors.py (1152 of 1228) UNSUPPORTED: lldb-shell :: ScriptInterpreter/Python/crashlog.test (1153 of 1228) PASS: lldb-api :: functionalities/thread/concurrent_events/TestConcurrentTwoBreakpointThreads.py (1154 of 1228) PASS: lldb-shell :: Commands/command-target-modules-dump-sections.yaml (1155 of 1228) PASS: lldb-api :: lang/objcxx/class-name-clash/TestNameClash.py (1156 of 1228) PASS: lldb-shell :: SymbolFile/DWARF/parallel-indexing-stress.s (1157 of 1228) PASS: lldb-api :: macosx/lc-note/kern-ver-str/TestKernVerStrLCNOTE.py (1158 of 1228) PASS: lldb-api :: tools/lldb-server/TestGdbRemoteAttach.py (1159 of 1228) PASS: lldb-shell :: Driver/TestUseColor.test (1160 of 1228) PASS: lldb-api :: functionalities/gdb_remote_client/TestGDBRemoteClient.py (1161 of 1228) PASS: lldb-shell :: SymbolFile/DWARF/DW_TAG_variable-invalid_location.s (1162 of 1228) PASS: lldb-api :: functionalities/optimized_code/TestNoASanExceptionAfterEvalOP_piece.py (1163 of 1228) UNSUPPORTED: lldb-shell :: ScriptInterpreter/Lua/io.test (1164 of 1228) UNSUPPORTED: lldb-shell :: Register/x86-gp-write.test (1165 of 1228) UNSUPPORTED: lldb-shell :: Reproducer/TestPythonImport.test (1166 of 1228) PASS: lldb-api :: functionalities/thread/concurrent_events/TestConcurrentBreakpointOneDelayBreakpointThreads.py (1167 of 1228) PASS: lldb-api :: commands/expression/rdar42038760/TestScalarURem.py (1168 of 1228) PASS: lldb-api :: functionalities/thread/concurrent_events/TestConcurrentTwoWatchpointsOneDelayBreakpoint.py (1169 of 1228) PASS: lldb-api :: functionalities/postmortem/elf-core/thread_crash/TestLinuxCoreThreads.py (1170 of 1228) PASS: lldb-api :: functionalities/data-formatter/data-formatter-stl/libcxx/string/TestDataFormatterLibcxxString.py (1171 of 1228) PASS: lldb-api :: lang/cpp/char8_t/TestCxxChar8_t.py (1172 of 1228) PASS: lldb-api :: commands/gui/basicdebug/TestGuiBasicDebug.py (1173 of 1228) PASS: lldb-api :: commands/source/info/TestSourceInfo.py (1174 of 1228) PASS: lldb-shell :: Settings/TestDisassemblyFormat.test (1175 of 1228) UNSUPPORTED: lldb-shell :: Reproducer/TestLuaImport.test (1176 of 1228) UNSUPPORTED: lldb-api :: functionalities/signal/TestSendSignal.py (1177 of 1228) UNSUPPORTED: lldb-api :: python_api/interpreter/TestRunCommandInterpreterAPI.py (1178 of 1228) PASS: lldb-api :: functionalities/thread/jump/TestThreadJump.py (1179 of 1228) UNSUPPORTED: lldb-shell :: Reproducer/TestDSYM.test (1180 of 1228) PASS: lldb-api :: tools/lldb-server/TestGdbRemoteHostInfo.py (1181 of 1228) UNSUPPORTED: lldb-api :: functionalities/signal/handle-segv/TestHandleSegv.py (1182 of 1228) PASS: lldb-api :: commands/expression/multiline-navigation/TestMultilineNavigation.py (1183 of 1228) PASS: lldb-shell :: SymbolFile/DWARF/dir-separator-no-comp-dir.s (1184 of 1228) PASS: lldb-api :: functionalities/thread/concurrent_events/TestConcurrentNWatchNBreak.py (1185 of 1228) PASS: lldb-shell :: ObjectFile/PECOFF/symbol.yaml (1186 of 1228) UNSUPPORTED: lldb-api :: commands/watchpoints/hello_watchlocation/TestWatchLocation.py (1187 of 1228) PASS: lldb-shell :: ObjectFile/wasm/embedded-debug-sections.yaml (1188 of 1228) UNSUPPORTED: lldb-api :: functionalities/darwin_log/filter/exact_match/activity-chain/TestDarwinLogFilterMatchActivityChain.py (1189 of 1228) PASS: lldb-shell :: ObjectFile/Breakpad/sections-trailing-func.test (1190 of 1228) PASS: lldb-api :: commands/expression/two-files/TestObjCTypeQueryFromOtherCompileUnit.py (1191 of 1228) UNSUPPORTED: lldb-api :: lang/objc/objc-dynamic-value/TestObjCDynamicValue.py (1192 of 1228) PASS: lldb-api :: lang/cpp/breakpoint_in_member_func_w_non_primitive_params/TestBreakpointInMemberFuncWNonPrimitiveParams.py (1193 of 1228) PASS: lldb-shell :: ObjectFile/ELF/basic-info.yaml (1194 of 1228) UNSUPPORTED: lldb-api :: tools/lldb-vscode/launch/TestVSCode_launch.py (1195 of 1228) PASS: lldb-shell :: SymbolFile/DWARF/dwarf5-partial-index.cpp (1196 of 1228) UNSUPPORTED: lldb-api :: commands/expression/no-deadlock/TestExprDoesntBlock.py (1197 of 1228) PASS: lldb-api :: python_api/function_symbol/TestDisasmAPI.py (1198 of 1228) PASS: lldb-api :: functionalities/data-formatter/parray/TestPrintArray.py (1199 of 1228) UNSUPPORTED: lldb-shell :: SymbolFile/PDB/function-nested-block.test (1200 of 1228) PASS: lldb-api :: lang/cpp/llvm-style/TestLLVMStyle.py (1201 of 1228) PASS: lldb-api :: functionalities/data-formatter/data-formatter-objc/TestDataFormatterObjCExpr.py (1202 of 1228) PASS: lldb-api :: functionalities/data-formatter/data-formatter-stl/libcxx/tuple/TestDataFormatterLibcxxTuple.py (1203 of 1228) PASS: lldb-api :: commands/expression/options/TestExprOptions.py (1204 of 1228) PASS: lldb-api :: lang/c/unicode/TestUnicodeSymbols.py (1205 of 1228) PASS: lldb-shell :: SymbolFile/DWARF/debug-types-basic.test (1206 of 1228) PASS: lldb-api :: functionalities/data-formatter/type_summary_list_arg/TestTypeSummaryListArg.py (1207 of 1228) PASS: lldb-api :: functionalities/inferior-crashing/TestInferiorCrashing.py (1208 of 1228) UNSUPPORTED: lldb-api :: tools/lldb-vscode/step/TestVSCode_step.py (1209 of 1228) PASS: lldb-api :: macosx/indirect_symbol/TestIndirectSymbols.py (1210 of 1228) PASS: lldb-shell :: ObjectFile/PECOFF/sections.yaml (1211 of 1228) PASS: lldb-api :: lang/cpp/template-function/TestTemplateFunctions.py (1212 of 1228) UNSUPPORTED: lldb-api :: macosx/find-dsym/deep-bundle/TestDeepBundle.py (1213 of 1228) UNSUPPORTED: lldb-api :: lang/c/typedef/Testtypedef.py (1214 of 1228) PASS: lldb-api :: functionalities/data-formatter/data-formatter-cpp/TestDataFormatterCpp.py (1215 of 1228) PASS: lldb-api :: lang/objc/foundation/TestObjCMethodsNSError.py (1216 of 1228) PASS: lldb-api :: lang/cpp/template/TestTemplateArgs.py (1217 of 1228) PASS: lldb-api :: commands/watchpoints/watchpoint_count/TestWatchpointCount.py (1218 of 1228) PASS: lldb-api :: commands/frame/diagnose/dereference-argument/TestDiagnoseDereferenceArgument.py (1219 of 1228) PASS: lldb-api :: functionalities/data-formatter/data-formatter-objc/TestDataFormatterObjCNSContainer.py (1220 of 1228) PASS: lldb-api :: functionalities/gdb_remote_client/TestNoGPacketSupported.py (1221 of 1228) PASS: lldb-shell :: Settings/TestLineMarkerColor.test (1222 of 1228) PASS: lldb-api :: lang/objc/foundation/TestObjCMethodsNSArray.py (1223 of 1228) PASS: lldb-api :: lang/c/register_variables/TestRegisterVariables.py (1224 of 1228) PASS: lldb-api :: source-manager/TestSourceManager.py (1225 of 1228) PASS: lldb-api :: types/TestCharType.py (1226 of 1228) PASS: lldb-api :: lang/objc/objc-new-syntax/TestObjCNewSyntaxDictionary.py (1227 of 1228) PASS: lldb-api :: functionalities/gdb_remote_client/TestWasm.py (1228 of 1228) Slowest Tests: -------------------------------------------------------------------------- 260.19s: lldb-api :: types/TestLongTypesExpr.py 252.50s: lldb-api :: types/TestLongTypes.py 162.70s: lldb-api :: types/TestIntegerTypeExpr.py 144.67s: lldb-api :: lang/cpp/namespace/TestNamespaceLookup.py 130.50s: lldb-api :: types/TestShortTypeExpr.py 130.34s: lldb-api :: types/TestCharTypeExpr.py 126.65s: lldb-api :: types/TestShortType.py 126.40s: lldb-api :: types/TestCharType.py 126.31s: lldb-api :: types/TestIntegerType.py 115.84s: lldb-api :: lang/c/anonymous/TestAnonymous.py 115.57s: lldb-api :: functionalities/inferior-crashing/TestInferiorCrashingStep.py 98.68s: lldb-api :: functionalities/inferior-assert/TestInferiorAssert.py 98.30s: lldb-api :: functionalities/breakpoint/breakpoint_conditions/TestBreakpointConditions.py 96.42s: lldb-api :: lang/objc/foundation/TestObjCMethods.py 91.74s: lldb-api :: lang/objc/hidden-ivars/TestHiddenIvars.py 91.52s: lldb-api :: tools/lldb-server/TestLldbGdbServer.py 90.35s: lldb-api :: functionalities/gdb_remote_client/TestWasm.py 89.58s: lldb-api :: commands/target/basic/TestTargetCommand.py 86.72s: lldb-api :: lang/objc/objc-new-syntax/TestObjCNewSyntaxLiteral.py 83.24s: lldb-api :: lang/objc/exceptions/TestObjCExceptions.py

Hide Details

Tests Times: -------------------------------------------------------------------------- [ Range ] :: [ Percentage ] :: [ Count ] -------------------------------------------------------------------------- [260s,280s) :: [ ] :: [ 2/1228] [240s,260s) :: [ ] :: [ 0/1228] [220s,240s) :: [ ] :: [ 0/1228] [200s,220s) :: [ ] :: [ 0/1228] [180s,200s) :: [ ] :: [ 0/1228] [160s,180s) :: [ ] :: [ 1/1228] [140s,160s) :: [ ] :: [ 3/1228] [120s,140s) :: [ ] :: [ 5/1228] [100s,120s) :: [ ] :: [ 3/1228] [ 80s,100s) :: [ ] :: [ 8/1228] [ 60s, 80s) :: [ ] :: [ 16/1228] [ 40s, 60s) :: [ ] :: [ 26/1228] [ 20s, 40s) :: [***** ] :: [ 167/1228] [ 0s, 20s) :: [******************************** ] :: [ 997/1228] -------------------------------------------------------------------------- ******************** Failed Tests (2): lldb-api :: functionalities/postmortem/minidump-new/TestMiniDumpUUID.py lldb-api :: functionalities/completion/TestCompletion.py

Hide Details

Hide Details

Testing Time: 963.94s Unsupported : 295 Passed : 925 Expectedly Failed: 6 Failed : 2 FAILED: tools/lldb/test/CMakeFiles/check-lldb-reproducers cd /Users/buildslave/jenkins/workspace/lldb-cmake-reproducers/lldb-build/tools/lldb/test && /usr/local/Frameworks/Python.framework/Versions/3.7/bin/python3.7 /Users/buildslave/jenkins/workspace/lldb-cmake-reproducers/lldb-build/./bin/llvm-lit -v --time-tests --shuffle --xunit-xml-output=/Users/buildslave/jenkins/workspace/lldb-cmake-reproducers/test/results.xml -v --param lldb-run-with-repro=replay /Users/buildslave/jenkins/workspace/lldb-cmake-reproducers/lldb-build/tools/lldb/test/API /Users/buildslave/jenkins/workspace/lldb-cmake-reproducers/lldb-build/tools/lldb/test/Shell ninja: build stopped: cannot make progress due to previous errors. Command failed: Command '['/usr/local/bin/ninja', '-k', '0', '-v', 'check-lldb-reproducers']' returned non-zero exit status 1. Command: ['/usr/local/bin/ninja', '-k', '0', '-v', 'check-lldb-reproducers'] [Pipeline] } [Pipeline] // timeout [Pipeline] } [Pipeline] // stage [Pipeline] stage [Pipeline] { (Declarative: Post Actions) [Pipeline] scanForIssues [Clang (LLVM based)] Sleeping for 5 seconds due to JENKINS-32191... [Clang (LLVM based)] Parsing console log (workspace: '/Users/buildslave/jenkins/workspace/lldb-cmake-reproducers') [Clang (LLVM based)] Successfully parsed console log [Clang (LLVM based)] -> found 10 issues (skipped 12 duplicates) [Clang (LLVM based)] Post processing issues on 'green-dragon-23' with source code encoding 'UTF-8' [Clang (LLVM based)] Creating SCM blamer to obtain author and commit information for affected files [Clang (LLVM based)] Creating SCM miner to obtain statistics for affected repository files [Clang (LLVM based)] Resolving file names for all issues in source directory '/Users/buildslave/jenkins/workspace/lldb-cmake-reproducers' [Clang (LLVM based)] -> resolved paths in source directory (7 found, 0 not found) [Clang (LLVM based)] Resolving module names from module definitions (build.xml, pom.xml, or Manifest.mf files) [Clang (LLVM based)] -> resolved module names for 10 issues [Clang (LLVM based)] Resolving package names (or namespaces) by parsing the affected files [Clang (LLVM based)] -> resolved package names of 7 affected files [Clang (LLVM based)] No filter has been set, publishing all 10 issues [Clang (LLVM based)] Creating fingerprints for all affected code blocks to track issues over different builds [Clang (LLVM based)] -> created fingerprints for 10 issues (skipped 0 issues) [Clang (LLVM based)] Copying affected files to Jenkins' build folder '/Users/Shared/Jenkins/Home/jobs/lldb-cmake-reproducers/builds/309/files-with-issues' [Clang (LLVM based)] -> 5 copied, 2 not in workspace, 0 not-found, 0 with I/O error [Pipeline] junit Recording test results [Pipeline] } [Pipeline] // stage [Pipeline] } [Pipeline] // withEnv [Pipeline] } [Pipeline] // node [Pipeline] End of Pipeline ERROR: script returned exit code 1 Finished: FAILURE