FailedConsole Output

Skipping 16,920 KB.. Full Log
efs.py (83 of 1232)
UNSUPPORTED: lldb-api :: functionalities/darwin_log/format/TestDarwinLogMessageFormat.py (84 of 1232)
PASS: lldb-api :: api/log/TestAPILog.py (85 of 1232)
UNSUPPORTED: lldb-shell :: SymbolFile/NativePDB/break-by-line.cpp (86 of 1232)
PASS: lldb-api :: assert_messages_test/TestAssertMessages.py (87 of 1232)
PASS: lldb-api :: functionalities/data-formatter/builtin-formats/TestBuiltinFormats.py (88 of 1232)
PASS: lldb-shell :: SymbolFile/DWARF/DW_TAG_variable-DW_AT_const_value.s (89 of 1232)
UNSUPPORTED: lldb-api :: functionalities/darwin_log/filter/regex/activity-chain/TestDarwinLogFilterRegexActivityChain.py (90 of 1232)
UNSUPPORTED: lldb-shell :: Unwind/eh-frame-small-fde.test (91 of 1232)
PASS: lldb-api :: functionalities/data-formatter/data-formatter-synth/TestDataFormatterSynth.py (92 of 1232)
PASS: lldb-api :: commands/expression/import_base_class_when_class_has_derived_member/TestImportBaseClassWhenClassHasDerivedMember.py (93 of 1232)
UNSUPPORTED: lldb-api :: commands/register/register/intel_xtended_registers/mpx_bound_violation/TestBoundViolation.py (94 of 1232)
PASS: lldb-shell :: ObjectFile/PECOFF/symbol.yaml (95 of 1232)
PASS: lldb-shell :: Breakpoint/debug_rnglist_rlestartend.test (96 of 1232)
UNSUPPORTED: lldb-api :: functionalities/darwin_log/filter/exact_match/activity/TestDarwinLogFilterMatchActivity.py (97 of 1232)
PASS: lldb-api :: functionalities/breakpoint/breakpoint_locations/TestBreakpointLocations.py (98 of 1232)
PASS: lldb-api :: functionalities/tsan/multiple/TestTsanMultiple.py (99 of 1232)
UNSUPPORTED: lldb-shell :: ScriptInterpreter/Python/scripted_breakpoint.test (100 of 1232)
PASS: lldb-api :: functionalities/paths/TestPaths.py (101 of 1232)
PASS: lldb-api :: functionalities/data-formatter/data-formatter-stl/libcxx/variant/TestDataFormatterLibcxxVariant.py (102 of 1232)
PASS: lldb-api :: functionalities/abbreviation/TestAbbreviations.py (103 of 1232)
UNSUPPORTED: lldb-shell :: ScriptInterpreter/Lua/persistent_state.test (104 of 1232)
PASS: lldb-shell :: SymbolFile/DWARF/static_scope.s (105 of 1232)
UNSUPPORTED: lldb-shell :: Reproducer/TestDump.test (106 of 1232)
UNSUPPORTED: lldb-shell :: Quit/TestQuitExitCodeHexA.test (107 of 1232)
PASS: lldb-api :: functionalities/thread/concurrent_events/TestConcurrentDelayedCrashWithBreakpointSignal.py (108 of 1232)
PASS: lldb-api :: types/TestShortType.py (109 of 1232)
UNSUPPORTED: lldb-api :: commands/command/script/TestCommandScript.py (110 of 1232)
PASS: lldb-shell :: Driver/TestNoUseColor.test (111 of 1232)
PASS: lldb-api :: functionalities/plugins/command_plugin/TestPluginCommands.py (112 of 1232)
UNSUPPORTED: lldb-api :: python_api/symbol-context/TestSymbolContext.py (113 of 1232)
PASS: lldb-api :: functionalities/data-formatter/data-formatter-advanced/TestDataFormatterAdv.py (114 of 1232)
UNSUPPORTED: lldb-shell :: ScriptInterpreter/Lua/nested_sessions.test (115 of 1232)
UNSUPPORTED: lldb-api :: macosx/find-dsym/bundle-with-dot-in-filename/TestBundleWithDotInFilename.py (116 of 1232)
UNSUPPORTED: lldb-api :: functionalities/unwind/standard/TestStandardUnwind.py (117 of 1232)
PASS: lldb-api :: lang/cpp/unique-types/TestUniqueTypes.py (118 of 1232)
UNSUPPORTED: lldb-shell :: Reproducer/TestVersionCheck.test (119 of 1232)
PASS: lldb-api :: python_api/class_members/TestSBTypeClassMembers.py (120 of 1232)
PASS: lldb-shell :: SymbolFile/DWARF/DW_TAG_basic_type_DW_ATE_UTF_nonC.ll (121 of 1232)
PASS: lldb-shell :: SymbolFile/DWARF/dwarf5-atomic.s (122 of 1232)
PASS: lldb-shell :: Settings/TestFrameFormatNoColor.test (123 of 1232)
PASS: lldb-api :: functionalities/memory-region/TestMemoryRegion.py (124 of 1232)
PASS: lldb-api :: functionalities/lazy-loading/TestLazyLoading.py (125 of 1232)
UNSUPPORTED: lldb-api :: commands/target/auto-install-main-executable/TestAutoInstallMainExecutable.py (126 of 1232)
UNSUPPORTED: lldb-shell :: SymbolFile/PDB/calling-conventions.test (127 of 1232)
PASS: lldb-shell :: SymbolFile/DWARF/dir-separator-windows.s (128 of 1232)
PASS: lldb-shell :: SymbolFile/DWARF/module-ownership.mm (129 of 1232)
PASS: lldb-api :: functionalities/data-formatter/data-formatter-stl/libcxx/vector/TestDataFormatterLibcxxVector.py (130 of 1232)
UNSUPPORTED: lldb-api :: tools/lldb-server/platform-process-connect/TestPlatformProcessConnect.py (131 of 1232)
PASS: lldb-api :: lang/objc/rdar-11355592/TestRdar11355592.py (132 of 1232)
UNSUPPORTED: lldb-shell :: Reproducer/Functionalities/TestStepping.test (133 of 1232)
PASS: lldb-api :: commands/expression/pr35310/TestExprsBug35310.py (134 of 1232)
PASS: lldb-api :: lang/objc/objc-static-method-stripped/TestObjCStaticMethodStripped.py (135 of 1232)
PASS: lldb-shell :: ScriptInterpreter/None/import_module.test (136 of 1232)
PASS: lldb-shell :: SymbolFile/DWARF/debug_rnglists-dwo.s (137 of 1232)
UNSUPPORTED: lldb-api :: arm/breakpoint-it/TestBreakpointIt.py (138 of 1232)
PASS: lldb-api :: lang/cpp/trivial_abi/TestTrivialABI.py (139 of 1232)
UNSUPPORTED: lldb-shell :: SymbolFile/PDB/class-layout.test (140 of 1232)
UNSUPPORTED: lldb-shell :: BuildScript/toolchain-msvc.test (141 of 1232)
PASS: lldb-api :: functionalities/data-formatter/cstring-utf8-summary/TestCstringUnicode.py (142 of 1232)
PASS: lldb-api :: types/TestDoubleTypesExpr.py (143 of 1232)
PASS: lldb-api :: macosx/save_crashlog/TestSaveCrashlog.py (144 of 1232)
PASS: lldb-api :: functionalities/ubsan/basic/TestUbsanBasic.py (145 of 1232)
PASS: lldb-shell :: SymbolFile/DWARF/clang-ast-from-dwarf-objc-property.m (146 of 1232)
PASS: lldb-api :: commands/target/stop-hook/delete/TestTargetStopHookDelete.py (147 of 1232)
PASS: lldb-shell :: SymbolFile/Breakpad/line-table-missing-file.test (148 of 1232)
PASS: lldb-shell :: SymbolFile/DWARF/find-qualified-variable.cpp (149 of 1232)
PASS: lldb-api :: tools/lldb-server/TestGdbRemoteThreadsInStopReply.py (150 of 1232)
PASS: lldb-shell :: SymbolFile/DWARF/DW_AT_low_pc-addrx.s (151 of 1232)
PASS: lldb-api :: lang/objc/radar-9691614/TestObjCMethodReturningBOOL.py (152 of 1232)
PASS: lldb-api :: functionalities/data-formatter/data-formatter-stl/libcxx/set/TestDataFormatterLibcxxSet.py (153 of 1232)
PASS: lldb-api :: python_api/type/TestTypeList.py (154 of 1232)
UNSUPPORTED: lldb-shell :: ScriptInterpreter/Lua/quit.test (155 of 1232)
UNSUPPORTED: lldb-shell :: SymbolFile/NativePDB/disassembly.cpp (156 of 1232)
UNSUPPORTED: lldb-api :: linux/sepdebugsymlink/TestTargetSymbolsSepDebugSymlink.py (157 of 1232)
PASS: lldb-api :: macosx/lc-note/kern-ver-str/TestKernVerStrLCNOTE.py (158 of 1232)
PASS: lldb-api :: commands/frame/diagnose/complicated-expression/TestComplicatedExpression.py (159 of 1232)
PASS: lldb-api :: functionalities/data-formatter/data-formatter-objc/TestDataFormatterObjCNSError.py (160 of 1232)
PASS: lldb-shell :: Commands/command-regex-delete.test (161 of 1232)
PASS: lldb-api :: functionalities/thread/jump/TestThreadJump.py (162 of 1232)
PASS: lldb-shell :: Expr/TestMultilineExpr.test (163 of 1232)
PASS: lldb-api :: functionalities/value_md5_crash/TestValueMD5Crash.py (164 of 1232)
PASS: lldb-api :: macosx/dyld-trie-symbols/TestDyldTrieSymbols.py (165 of 1232)
PASS: lldb-api :: functionalities/breakpoint/global_constructor/TestBreakpointInGlobalConstructor.py (166 of 1232)
PASS: lldb-api :: functionalities/data-formatter/data-formatter-objc/cmtime/TestDataFormatterCMTime.py (167 of 1232)
PASS: lldb-api :: terminal/TestEditline.py (168 of 1232)
PASS: lldb-api :: python_api/findvalue_duplist/TestSBFrameFindValue.py (169 of 1232)
UNSUPPORTED: lldb-shell :: SymbolFile/PDB/expressions.test (170 of 1232)
UNSUPPORTED: lldb-shell :: Register/x86-64-xmm16-read.test (171 of 1232)
UNSUPPORTED: lldb-api :: functionalities/breakpoint/hardware_breakpoints/hardware_breakpoint_on_multiple_threads/TestHWBreakMultiThread.py (172 of 1232)
PASS: lldb-api :: functionalities/data-formatter/setvaluefromcstring/TestSetValueFromCString.py (173 of 1232)
PASS: lldb-shell :: ObjectFile/ELF/minidebuginfo-corrupt-xz.yaml (174 of 1232)
PASS: lldb-shell :: SymbolFile/Breakpad/unwind-via-stack-cfi.test (175 of 1232)
PASS: lldb-api :: functionalities/inferior-crashing/recursive-inferior/TestRecursiveInferiorStep.py (176 of 1232)
UNSUPPORTED: lldb-shell :: SymbolFile/DWARF/DW_TAG_GNU_call_site-DW_AT_low_pc.s (177 of 1232)
PASS: lldb-api :: lang/objc/ptr_refs/TestPtrRefsObjC.py (178 of 1232)
PASS: lldb-shell :: Minidump/no-process-id.yaml (179 of 1232)
UNSUPPORTED: lldb-api :: functionalities/signal/TestSendSignal.py (180 of 1232)
PASS: lldb-api :: iohandler/unicode/TestUnicode.py (181 of 1232)
PASS: lldb-api :: lang/objc/objc-class-method/TestObjCClassMethod.py (182 of 1232)
PASS: lldb-api :: functionalities/float-display/TestFloatDisplay.py (183 of 1232)
PASS: lldb-api :: lang/c/struct_types/TestStructTypes.py (184 of 1232)
UNSUPPORTED: lldb-api :: commands/expression/import-std-module/unique_ptr/TestUniquePtrFromStdModule.py (185 of 1232)
PASS: lldb-api :: functionalities/tail_call_frames/disambiguate_tail_call_seq/TestDisambiguateTailCallSeq.py (186 of 1232)
PASS: lldb-api :: commands/expression/multiline-completion/TestMultilineCompletion.py (187 of 1232)
PASS: lldb-api :: commands/source/info/TestSourceInfo.py (188 of 1232)
PASS: lldb-api :: functionalities/postmortem/minidump/TestMiniDump.py (189 of 1232)
PASS: lldb-api :: lang/c/const_variables/TestConstVariables.py (190 of 1232)
PASS: lldb-api :: lang/cpp/enum_types/TestCPP11EnumTypes.py (191 of 1232)
PASS: lldb-api :: macosx/indirect_symbol/TestIndirectSymbols.py (192 of 1232)
PASS: lldb-shell :: SymbolFile/DWARF/debug_loc_and_loclists.s (193 of 1232)
PASS: lldb-api :: types/TestShortTypeExpr.py (194 of 1232)
PASS: lldb-api :: commands/expression/persistent_types/TestNestedPersistentTypes.py (195 of 1232)
PASS: lldb-api :: commands/statistics/basic/TestStats.py (196 of 1232)
PASS: lldb-api :: commands/expression/entry-bp/TestExprEntryBP.py (197 of 1232)
PASS: lldb-api :: tools/lldb-server/TestGdbRemote_vCont.py (198 of 1232)
PASS: lldb-api :: functionalities/thread/concurrent_events/TestConcurrentDelayWatchBreak.py (199 of 1232)
PASS: lldb-api :: lang/cpp/const_this/TestConstThis.py (200 of 1232)
PASS: lldb-shell :: SymbolFile/DWARF/split-dwarf-inlining.cpp (201 of 1232)
UNSUPPORTED: lldb-api :: commands/settings/quoting/TestQuoting.py (202 of 1232)
PASS: lldb-api :: commands/gui/viewlarge/TestGuiViewLarge.py (203 of 1232)
PASS: lldb-api :: commands/platform/basic/TestPlatformCommand.py (204 of 1232)
PASS: lldb-api :: functionalities/jitloader_gdb/TestJITLoaderGDB.py (205 of 1232)
UNSUPPORTED: lldb-shell :: SymbolFile/NativePDB/ast-functions.cpp (206 of 1232)
PASS: lldb-api :: commands/expression/argument_passing_restrictions/TestArgumentPassingRestrictions.py (207 of 1232)
PASS: lldb-api :: functionalities/postmortem/elf-core/TestLinuxCore.py (208 of 1232)
PASS: lldb-api :: lang/objc/blocks/TestObjCIvarsInBlocks.py (209 of 1232)
UNSUPPORTED: lldb-api :: lang/cpp/printf/TestPrintf.py (210 of 1232)
PASS: lldb-api :: lang/objc/objc-struct-argument/TestObjCStructArgument.py (211 of 1232)
UNSUPPORTED: lldb-shell :: ObjectFile/ELF/minidebuginfo-set-and-hit-breakpoint.test (212 of 1232)
PASS: lldb-shell :: SymbolFile/Breakpad/unwind-via-stack-win.test (213 of 1232)
UNSUPPORTED: lldb-api :: commands/expression/issue_11588/Test11588.py (214 of 1232)
PASS: lldb-api :: functionalities/thread/num_threads/TestNumThreads.py (215 of 1232)
PASS: lldb-api :: functionalities/thread/concurrent_events/TestConcurrentTwoBreakpointThreads.py (216 of 1232)
UNSUPPORTED: lldb-api :: commands/expression/import-std-module/vector/TestVectorFromStdModule.py (217 of 1232)
UNSUPPORTED: lldb-shell :: Driver/TestRepl.test (218 of 1232)
PASS: lldb-shell :: ObjectFile/ELF/minidebuginfo-find-symbols.yaml (219 of 1232)
PASS: lldb-api :: commands/log/basic/TestLogging.py (220 of 1232)
PASS: lldb-api :: functionalities/gdb_remote_client/TestqOffsets.py (221 of 1232)
PASS: lldb-api :: python_api/sbenvironment/TestSBEnvironment.py (222 of 1232)
UNSUPPORTED: lldb-shell :: SymbolFile/PDB/func-symbols.test (223 of 1232)
PASS: lldb-api :: lang/cpp/offsetof/TestOffsetofCpp.py (224 of 1232)
PASS: lldb-api :: lang/objc/objc-baseclass-sbtype/TestObjCBaseClassSBType.py (225 of 1232)
PASS: lldb-api :: commands/frame/diagnose/local-variable/TestLocalVariable.py (226 of 1232)
UNSUPPORTED: lldb-api :: commands/expression/import-std-module/forward_decl_from_module/TestForwardDeclFromStdModule.py (227 of 1232)
UNSUPPORTED: lldb-shell :: ScriptInterpreter/Lua/convenience_variables.test (228 of 1232)
PASS: lldb-api :: python_api/process/TestProcessAPI.py (229 of 1232)
PASS: lldb-api :: commands/platform/process/list/TestProcessList.py (230 of 1232)
PASS: lldb-api :: lang/objc/foundation/TestObjCMethodsNSArray.py (231 of 1232)
PASS: lldb-api :: commands/watchpoints/watchpoint_commands/condition/TestWatchpointConditionCmd.py (232 of 1232)
PASS: lldb-api :: lang/cpp/stl/TestStdCXXDisassembly.py (233 of 1232)
PASS: lldb-shell :: Commands/command-source.test (234 of 1232)
PASS: lldb-api :: functionalities/thread/concurrent_events/TestConcurrentCrashWithBreak.py (235 of 1232)
PASS: lldb-api :: tools/lldb-server/TestGdbRemoteRegisterState.py (236 of 1232)
PASS: lldb-api :: lang/cpp/char1632_t/TestChar1632T.py (237 of 1232)
PASS: lldb-api :: lang/objc/objc-ivar-offsets/TestObjCIvarOffsets.py (238 of 1232)
PASS: lldb-api :: functionalities/gdb_remote_client/TestProcessConnect.py (239 of 1232)
PASS: lldb-api :: functionalities/breakpoint/cpp/TestCPPBreakpointLocations.py (240 of 1232)
PASS: lldb-api :: functionalities/testid/TestTestId.py (241 of 1232)
PASS: lldb-shell :: SymbolFile/DWARF/dwp.s (242 of 1232)
PASS: lldb-api :: functionalities/postmortem/minidump-new/TestMiniDumpNew.py (243 of 1232)
UNSUPPORTED: lldb-shell :: Reproducer/Functionalities/TestImageList.test (244 of 1232)
PASS: lldb-api :: functionalities/data-formatter/compactvectors/TestCompactVectors.py (245 of 1232)
PASS: lldb-shell :: ObjectFile/PECOFF/dep-modules.yaml (246 of 1232)
PASS: lldb-api :: functionalities/thread/concurrent_events/TestConcurrentTwoWatchpointThreads.py (247 of 1232)
PASS: lldb-api :: python_api/watchpoint/watchlocation/TestTargetWatchAddress.py (248 of 1232)
PASS: lldb-api :: functionalities/load_unload/TestLoadUnload.py (249 of 1232)
UNSUPPORTED: lldb-shell :: Register/x86-64-ymm16-write.test (250 of 1232)
PASS: lldb-api :: lang/cpp/rvalue-references/TestRvalueReferences.py (251 of 1232)
PASS: lldb-shell :: SymbolFile/DWARF/DW_AT_const_value.s (252 of 1232)
UNSUPPORTED: lldb-api :: commands/expression/import-std-module/shared_ptr/TestSharedPtrFromStdModule.py (253 of 1232)
PASS: lldb-api :: commands/watchpoints/multiple_threads/TestWatchpointMultipleThreads.py (254 of 1232)
UNSUPPORTED: lldb-shell :: ScriptInterpreter/Python/crashlog.test (255 of 1232)
XFAIL: lldb-shell :: Register/x86-64-write.test (256 of 1232)
UNSUPPORTED: lldb-api :: tools/lldb-vscode/stackTrace/TestVSCode_stackTrace.py (257 of 1232)
PASS: lldb-api :: functionalities/postmortem/elf-core/thread_crash/TestLinuxCoreThreads.py (258 of 1232)
PASS: lldb-api :: commands/expression/codegen-crash-typedefdecl-not-in_declcontext/TestCodegenCrashTypedefDeclNotInDeclContext.py (259 of 1232)
PASS: lldb-api :: commands/reproducer/invalid-args/TestInvalidArgsReproducer.py (260 of 1232)
PASS: lldb-api :: lang/c/local_types/TestUseClosestType.py (261 of 1232)
PASS: lldb-shell :: SymbolFile/DWARF/DW_AT_loclists_base.s (262 of 1232)
UNSUPPORTED: lldb-api :: lang/objc/modules-update/TestClangModulesUpdate.py (263 of 1232)
PASS: lldb-api :: lang/cpp/dynamic-value/TestCppValueCast.py (264 of 1232)
PASS: lldb-api :: functionalities/data-formatter/data-formatter-globals/TestDataFormatterGlobals.py (265 of 1232)
PASS: lldb-shell :: Breakpoint/case-sensitive.test (266 of 1232)
PASS: lldb-api :: functionalities/breakpoint/breakpoint_command/TestRegexpBreakCommand.py (267 of 1232)
UNSUPPORTED: lldb-api :: functionalities/process_save_core/TestProcessSaveCore.py (268 of 1232)
PASS: lldb-api :: python_api/thread/TestThreadAPI.py (269 of 1232)
PASS: lldb-shell :: Commands/command-target-modules-dump-sections.yaml (270 of 1232)
PASS: lldb-api :: commands/process/launch-with-shellexpand/TestLaunchWithShellExpand.py (271 of 1232)
PASS: lldb-api :: functionalities/data-formatter/data-formatter-objc/nsstring/TestDataFormatterNSString.py (272 of 1232)
PASS: lldb-api :: functionalities/gdb_remote_client/TestNoGPacketSupported.py (273 of 1232)
PASS: lldb-api :: python_api/exprpath_synthetic/TestExprPathSynthetic.py (274 of 1232)
PASS: lldb-shell :: Recognizer/assert.test (275 of 1232)
PASS: lldb-api :: lang/objc/foundation/TestObjCMethodsString.py (276 of 1232)
PASS: lldb-api :: functionalities/data-formatter/data-formatter-stl/libcxx/multiset/TestDataFormatterLibcxxMultiSet.py (277 of 1232)
UNSUPPORTED: lldb-shell :: SymbolFile/NativePDB/function-types-calling-conv.cpp (278 of 1232)
PASS: lldb-api :: lang/mixed/TestMixedLanguages.py (279 of 1232)
UNSUPPORTED: lldb-api :: arm/breakpoint-thumb-codesection/TestBreakpointThumbCodesection.py (280 of 1232)
PASS: lldb-api :: functionalities/breakpoint/debugbreak/TestDebugBreak.py (281 of 1232)
PASS: lldb-api :: lang/objc/ivar-IMP/TestObjCiVarIMP.py (282 of 1232)
PASS: lldb-api :: tools/lldb-server/commandline/TestStubSetSID.py (283 of 1232)
PASS: lldb-api :: python_api/lldbutil/process/TestPrintStackTraces.py (284 of 1232)
PASS: lldb-api :: commands/expression/deleting-implicit-copy-constructor/TestDeletingImplicitCopyConstructor.py (285 of 1232)
PASS: lldb-api :: commands/expression/radar_9531204/TestPrintfAfterUp.py (286 of 1232)
PASS: lldb-api :: functionalities/thread/state_after_expression/TestStateAfterExpression.py (287 of 1232)
PASS: lldb-api :: lang/cpp/virtual-overload/TestVirtualOverload.py (288 of 1232)
PASS: lldb-api :: functionalities/inferior-crashing/recursive-inferior/TestRecursiveInferior.py (289 of 1232)
PASS: lldb-shell :: ObjectFile/ELF/basic-info.yaml (290 of 1232)
PASS: lldb-shell :: Heap/heap-cstr.test (291 of 1232)
PASS: lldb-shell :: ObjectFile/Breakpad/uuid-matching-mac.test (292 of 1232)
PASS: lldb-api :: commands/watchpoints/watchpoint_on_vectors/TestValueOfVectorVariable.py (293 of 1232)
PASS: lldb-shell :: SymbolFile/DWARF/debug_line-tombstone.s (294 of 1232)
PASS: lldb-api :: commands/watchpoints/watchpoint_commands/TestWatchpointCommands.py (295 of 1232)
UNSUPPORTED: lldb-shell :: SymbolFile/NativePDB/globals-fundamental.cpp (296 of 1232)
UNSUPPORTED: lldb-api :: tools/lldb-vscode/breakpoint/TestVSCode_setExceptionBreakpoints.py (297 of 1232)
UNSUPPORTED: lldb-shell :: ScriptInterpreter/Python/sb_address_exception.test (298 of 1232)
PASS: lldb-shell :: Driver/TestSingleQuote.test (299 of 1232)
PASS: lldb-api :: functionalities/gdb_remote_client/TestThreadSelectionBug.py (300 of 1232)
UNSUPPORTED: lldb-api :: tools/lldb-vscode/breakpoint/TestVSCode_setFunctionBreakpoints.py (301 of 1232)
UNSUPPORTED: lldb-shell :: ScriptInterpreter/Lua/bindings.test (302 of 1232)
PASS: lldb-api :: functionalities/unwind/noreturn/TestNoreturnUnwind.py (303 of 1232)
PASS: lldb-api :: functionalities/data-formatter/ostypeformatting/TestFormattersOsType.py (304 of 1232)
PASS: lldb-api :: macosx/thread_suspend/TestInternalThreadSuspension.py (305 of 1232)
UNSUPPORTED: lldb-api :: linux/thread/create_during_instruction_step/TestCreateDuringInstructionStep.py (306 of 1232)
PASS: lldb-shell :: ObjectFile/ELF/PT_LOAD.yaml (307 of 1232)
PASS: lldb-shell :: Commands/command-disassemble.s (308 of 1232)
PASS: lldb-shell :: SymbolFile/DWARF/find-basic-function.cpp (309 of 1232)
PASS: lldb-api :: commands/target/dump-symtab-demangle/TestDumpSymtabDemangle.py (310 of 1232)
UNSUPPORTED: lldb-api :: tools/lldb-server/registers-target-xml-reading/TestGdbRemoteTargetXmlPacket.py (311 of 1232)
UNSUPPORTED: lldb-api :: functionalities/data-formatter/data-formatter-stl/libstdcpp/iterator/TestDataFormatterStdIterator.py (312 of 1232)
PASS: lldb-api :: tools/lldb-server/TestGdbRemoteAttach.py (313 of 1232)
PASS: lldb-api :: commands/target/select/TestTargetSelect.py (314 of 1232)
PASS: lldb-api :: functionalities/data-formatter/data-formatter-skip-summary/TestDataFormatterSkipSummary.py (315 of 1232)
PASS: lldb-api :: commands/expression/context-object/TestContextObject.py (316 of 1232)
PASS: lldb-api :: sanity/TestModuleCacheSanity.py (317 of 1232)
UNSUPPORTED: lldb-shell :: ScriptInterpreter/Lua/command_script_import.test (318 of 1232)
PASS: lldb-api :: lang/objc/exceptions/TestObjCExceptions.py (319 of 1232)
PASS: lldb-api :: functionalities/data-formatter/data-formatter-stl/libcxx/queue/TestDataFormatterLibcxxQueue.py (320 of 1232)
PASS: lldb-api :: python_api/frame/TestFrames.py (321 of 1232)
PASS: lldb-shell :: Settings/TestFrameFormatColor.test (322 of 1232)
UNSUPPORTED: lldb-shell :: SymbolFile/NativePDB/ast-types.cpp (323 of 1232)
PASS: lldb-api :: lang/cpp/dynamic-value/TestDynamicValue.py (324 of 1232)
PASS: lldb-api :: functionalities/set-data/TestSetData.py (325 of 1232)
PASS: lldb-api :: functionalities/thread/concurrent_events/TestConcurrentBreakpointDelayBreakpointOneSignal.py (326 of 1232)
PASS: lldb-api :: python_api/lldbutil/TestSwigVersion.py (327 of 1232)
UNSUPPORTED: lldb-shell :: Register/x86-64-read.test (328 of 1232)
FAIL: lldb-api :: lang/c/vla/TestVLA.py (329 of 1232)
******************** TEST 'lldb-api :: lang/c/vla/TestVLA.py' FAILED ********************
Script:
--
/usr/local/Frameworks/Python.framework/Versions/3.7/bin/python3.7 /Users/buildslave/jenkins/workspace/lldb-cmake-reproducers/llvm-project/lldb/test/API/dotest.py -s /Users/buildslave/jenkins/workspace/lldb-cmake-reproducers/lldb-build/lldb-test-traces -S nm -u CXXFLAGS -u CFLAGS --codesign-identity lldb_codesign --server /Users/buildslave/jenkins/workspace/lldb-cmake-reproducers/lldb-build/./bin/debugserver --arch x86_64 --build-dir /Users/buildslave/jenkins/workspace/lldb-cmake-reproducers/lldb-build/lldb-test-build.noindex -s=/Users/buildslave/jenkins/workspace/lldb-cmake-reproducers/test/logs -t --env TERM=vt100 --env LLVM_LIBS_DIR=/Users/buildslave/jenkins/workspace/lldb-cmake-reproducers/lldb-build/./lib --arch x86_64 --build-dir /Users/buildslave/jenkins/workspace/lldb-cmake-reproducers/lldb-build/lldb-test-build.noindex --lldb-module-cache-dir /Users/buildslave/jenkins/workspace/lldb-cmake-reproducers/lldb-build/lldb-test-build.noindex/module-cache-lldb/lldb-api --clang-module-cache-dir /Users/buildslave/jenkins/workspace/lldb-cmake-reproducers/lldb-build/lldb-test-build.noindex/module-cache-clang/lldb-api --executable /Users/buildslave/jenkins/workspace/lldb-cmake-reproducers/lldb-build/./bin/lldb --compiler /Users/buildslave/jenkins/workspace/lldb-cmake-reproducers/lldb-build/./bin/clang --dsymutil /Users/buildslave/jenkins/workspace/lldb-cmake-reproducers/lldb-build/./bin/dsymutil --filecheck /Users/buildslave/jenkins/workspace/lldb-cmake-reproducers/lldb-build/./bin/FileCheck --yaml2obj /Users/buildslave/jenkins/workspace/lldb-cmake-reproducers/lldb-build/./bin/yaml2obj --lldb-libs-dir /Users/buildslave/jenkins/workspace/lldb-cmake-reproducers/lldb-build/./lib --skip-category=lldb-vscode --skip-category=std-module /Users/buildslave/jenkins/workspace/lldb-cmake-reproducers/llvm-project/lldb/test/API/lang/c/vla -p TestVLA.py --capture-path /Users/buildslave/jenkins/workspace/lldb-cmake-reproducers/lldb-build/lldb-test-build.noindex/reproducers/TestVLA.py
--
Exit Code: 1

Hide Details

Command Output (stdout): -- lldb version 12.0.99 clang revision ed229132f1c4ea2ba0644fc345d8279e47a00565 llvm revision ed229132f1c4ea2ba0644fc345d8279e47a00565 libstdcxx tests will not be run because: Don't know how to build with libstdcxx on macosx Skipping following debug info categories: ['dwo']

Hide Details

-- Command Output (stderr): --

Hide Details

Session logs for test failures/errors/unexpected successes will go into directory '/Users/buildslave/jenkins/workspace/lldb-cmake-reproducers/test/logs' Change dir to: /Users/buildslave/jenkins/workspace/lldb-cmake-reproducers/llvm-project/lldb/test/API/lang/c/vla runCmd: settings clear -all output:

Hide Details

runCmd: settings set symbols.enable-external-lookup false output:

Hide Details

runCmd: settings set target.inherit-tcc true output:

Hide Details

runCmd: settings set target.auto-apply-fixits false output:

Hide Details

runCmd: settings set plugin.process.gdb-remote.packet-timeout 60 output:

Hide Details

runCmd: settings set symbols.clang-modules-cache-path "/Users/buildslave/jenkins/workspace/lldb-cmake-reproducers/lldb-build/lldb-test-build.noindex/module-cache-lldb/lldb-api" output:

Hide Details

runCmd: settings set use-color false output:

Hide Details

runCmd: setting set target.prefer-dynamic-value no-dynamic-values output:

Hide Details

<bound method SBProcess.Kill of <lldb.SBProcess; proxy of <Swig Object of type 'lldb::SBProcess *' at 0x112c8fa20> >>: success

Hide Details

PASS: LLDB (/Users/buildslave/jenkins/workspace/lldb-cmake-reproducers/lldb-build/bin/clang-x86_64) :: test_variable_list_dsym (TestVLA.TestVLA) runCmd: settings clear -all output:

Hide Details

runCmd: settings set symbols.enable-external-lookup false output:

Hide Details

runCmd: settings set target.inherit-tcc true output:

Hide Details

runCmd: settings set target.auto-apply-fixits false output:

Hide Details

runCmd: settings set plugin.process.gdb-remote.packet-timeout 60 output:

Hide Details

runCmd: settings set symbols.clang-modules-cache-path "/Users/buildslave/jenkins/workspace/lldb-cmake-reproducers/lldb-build/lldb-test-build.noindex/module-cache-lldb/lldb-api" output:

Hide Details

runCmd: settings set use-color false output:

Hide Details

runCmd: setting set target.prefer-dynamic-value no-dynamic-values output:

Hide Details

<bound method SBProcess.Kill of <lldb.SBProcess; proxy of <Swig Object of type 'lldb::SBProcess *' at 0x10b174960> >>: success

Hide Details

PASS: LLDB (/Users/buildslave/jenkins/workspace/lldb-cmake-reproducers/lldb-build/bin/clang-x86_64) :: test_variable_list_dwarf (TestVLA.TestVLA) UNSUPPORTED: LLDB (/Users/buildslave/jenkins/workspace/lldb-cmake-reproducers/lldb-build/bin/clang-x86_64) :: test_variable_list_dwo (TestVLA.TestVLA) (test case does not fall in any category of interest for this run) runCmd: settings clear -all output:

Hide Details

runCmd: settings set symbols.enable-external-lookup false output:

Hide Details

runCmd: settings set target.inherit-tcc true output:

Hide Details

runCmd: settings set target.auto-apply-fixits false output:

Hide Details

runCmd: settings set plugin.process.gdb-remote.packet-timeout 60 output:

Hide Details

runCmd: settings set symbols.clang-modules-cache-path "/Users/buildslave/jenkins/workspace/lldb-cmake-reproducers/lldb-build/lldb-test-build.noindex/module-cache-lldb/lldb-api" output:

Hide Details

runCmd: settings set use-color false output:

Hide Details

runCmd: setting set target.prefer-dynamic-value no-dynamic-values output:

Hide Details

<bound method SBProcess.Kill of <lldb.SBProcess; proxy of <Swig Object of type 'lldb::SBProcess *' at 0x1126d99f0> >>: success

Hide Details

PASS: LLDB (/Users/buildslave/jenkins/workspace/lldb-cmake-reproducers/lldb-build/bin/clang-x86_64) :: test_variable_list_gmodules (TestVLA.TestVLA) runCmd: settings clear -all output:

Hide Details

runCmd: settings set symbols.enable-external-lookup false output:

Hide Details

runCmd: settings set target.inherit-tcc true output:

Hide Details

runCmd: settings set target.auto-apply-fixits false output:

Hide Details

runCmd: settings set plugin.process.gdb-remote.packet-timeout 60 output:

Hide Details

runCmd: settings set symbols.clang-modules-cache-path "/Users/buildslave/jenkins/workspace/lldb-cmake-reproducers/lldb-build/lldb-test-build.noindex/module-cache-lldb/lldb-api" output:

Hide Details

runCmd: settings set use-color false output:

Hide Details

runCmd: setting set target.prefer-dynamic-value no-dynamic-values output:

Hide Details

runCmd: fr v vla[0] output: (int) vla[0] = <parent failed to evaluate: variable not available>

Hide Details

Hide Details

Hide Details

Ran command: "fr v vla[0]"

Hide Details

Got output: (int) vla[0] = <parent failed to evaluate: variable not available>

Hide Details

Hide Details

Expecting sub string: "int" (was found) Expecting sub string: "2" (was not found)

Hide Details

FAIL: LLDB (/Users/buildslave/jenkins/workspace/lldb-cmake-reproducers/lldb-build/bin/clang-x86_64) :: test_vla_dsym (TestVLA.TestVLA) <bound method SBProcess.Kill of <lldb.SBProcess; proxy of <Swig Object of type 'lldb::SBProcess *' at 0x10b174450> >>: success

Hide Details

runCmd: settings clear -all output:

Hide Details

runCmd: settings set symbols.enable-external-lookup false output:

Hide Details

runCmd: settings set target.inherit-tcc true output:

Hide Details

runCmd: settings set target.auto-apply-fixits false output:

Hide Details

runCmd: settings set plugin.process.gdb-remote.packet-timeout 60 output:

Hide Details

runCmd: settings set symbols.clang-modules-cache-path "/Users/buildslave/jenkins/workspace/lldb-cmake-reproducers/lldb-build/lldb-test-build.noindex/module-cache-lldb/lldb-api" output:

Hide Details

runCmd: settings set use-color false output:

Hide Details

runCmd: setting set target.prefer-dynamic-value no-dynamic-values output:

Hide Details

runCmd: fr v vla[0] output: (int) vla[0] = <parent failed to evaluate: variable not available>

Hide Details

Hide Details

Hide Details

Ran command: "fr v vla[0]"

Hide Details

Got output: (int) vla[0] = <parent failed to evaluate: variable not available>

Hide Details

Hide Details

Expecting sub string: "int" (was found) Expecting sub string: "2" (was not found)

Hide Details

FAIL: LLDB (/Users/buildslave/jenkins/workspace/lldb-cmake-reproducers/lldb-build/bin/clang-x86_64) :: test_vla_dwarf (TestVLA.TestVLA) <bound method SBProcess.Kill of <lldb.SBProcess; proxy of <Swig Object of type 'lldb::SBProcess *' at 0x1126d99f0> >>: success

Hide Details

UNSUPPORTED: LLDB (/Users/buildslave/jenkins/workspace/lldb-cmake-reproducers/lldb-build/bin/clang-x86_64) :: test_vla_dwo (TestVLA.TestVLA) (test case does not fall in any category of interest for this run) runCmd: settings clear -all output:

Hide Details

runCmd: settings set symbols.enable-external-lookup false output:

Hide Details

runCmd: settings set target.inherit-tcc true output:

Hide Details

runCmd: settings set target.auto-apply-fixits false output:

Hide Details

runCmd: settings set plugin.process.gdb-remote.packet-timeout 60 output:

Hide Details

runCmd: settings set symbols.clang-modules-cache-path "/Users/buildslave/jenkins/workspace/lldb-cmake-reproducers/lldb-build/lldb-test-build.noindex/module-cache-lldb/lldb-api" output:

Hide Details

runCmd: settings set use-color false output:

Hide Details

runCmd: setting set target.prefer-dynamic-value no-dynamic-values output:

Hide Details

runCmd: fr v vla[0] output: (int) vla[0] = <parent failed to evaluate: variable not available>

Hide Details

Hide Details

Hide Details

Ran command: "fr v vla[0]"

Hide Details

Got output: (int) vla[0] = <parent failed to evaluate: variable not available>

Hide Details

Hide Details

Expecting sub string: "int" (was found) Expecting sub string: "2" (was not found)

Hide Details

FAIL: LLDB (/Users/buildslave/jenkins/workspace/lldb-cmake-reproducers/lldb-build/bin/clang-x86_64) :: test_vla_gmodules (TestVLA.TestVLA) <bound method SBProcess.Kill of <lldb.SBProcess; proxy of <Swig Object of type 'lldb::SBProcess *' at 0x10b174960> >>: success

Hide Details

Restore dir to: /Users/buildslave/jenkins/workspace/lldb-cmake-reproducers/lldb-build/tools/lldb/test ====================================================================== FAIL: test_vla_dsym (TestVLA.TestVLA) ---------------------------------------------------------------------- Traceback (most recent call last): File "/Users/buildslave/jenkins/workspace/lldb-cmake-reproducers/llvm-project/lldb/packages/Python/lldbsuite/test/lldbtest.py", line 1823, in test_method return attrvalue(self) File "/Users/buildslave/jenkins/workspace/lldb-cmake-reproducers/llvm-project/lldb/packages/Python/lldbsuite/test/decorators.py", line 134, in wrapper return func(*args, **kwargs) File "/Users/buildslave/jenkins/workspace/lldb-cmake-reproducers/llvm-project/lldb/test/API/lang/c/vla/TestVLA.py", line 42, in test_vla test(2, ["int []", "[0] = 2, [1] = 1"]) File "/Users/buildslave/jenkins/workspace/lldb-cmake-reproducers/llvm-project/lldb/test/API/lang/c/vla/TestVLA.py", line 37, in test self.expect("fr v vla[%d]"%i, substrs=["int", "%d"%(a-i)]) File "/Users/buildslave/jenkins/workspace/lldb-cmake-reproducers/llvm-project/lldb/packages/Python/lldbsuite/test/lldbtest.py", line 2526, in expect self.fail(log_msg) AssertionError: Ran command: "fr v vla[0]"

Hide Details

Got output: (int) vla[0] = <parent failed to evaluate: variable not available>

Hide Details

Hide Details

Expecting sub string: "int" (was found) Expecting sub string: "2" (was not found) Config=x86_64-/Users/buildslave/jenkins/workspace/lldb-cmake-reproducers/lldb-build/bin/clang ====================================================================== FAIL: test_vla_dwarf (TestVLA.TestVLA) ---------------------------------------------------------------------- Traceback (most recent call last): File "/Users/buildslave/jenkins/workspace/lldb-cmake-reproducers/llvm-project/lldb/packages/Python/lldbsuite/test/lldbtest.py", line 1823, in test_method return attrvalue(self) File "/Users/buildslave/jenkins/workspace/lldb-cmake-reproducers/llvm-project/lldb/packages/Python/lldbsuite/test/decorators.py", line 134, in wrapper return func(*args, **kwargs) File "/Users/buildslave/jenkins/workspace/lldb-cmake-reproducers/llvm-project/lldb/test/API/lang/c/vla/TestVLA.py", line 42, in test_vla test(2, ["int []", "[0] = 2, [1] = 1"]) File "/Users/buildslave/jenkins/workspace/lldb-cmake-reproducers/llvm-project/lldb/test/API/lang/c/vla/TestVLA.py", line 37, in test self.expect("fr v vla[%d]"%i, substrs=["int", "%d"%(a-i)]) File "/Users/buildslave/jenkins/workspace/lldb-cmake-reproducers/llvm-project/lldb/packages/Python/lldbsuite/test/lldbtest.py", line 2526, in expect self.fail(log_msg) AssertionError: Ran command: "fr v vla[0]"

Hide Details

Got output: (int) vla[0] = <parent failed to evaluate: variable not available>

Hide Details

Hide Details

Expecting sub string: "int" (was found) Expecting sub string: "2" (was not found) Config=x86_64-/Users/buildslave/jenkins/workspace/lldb-cmake-reproducers/lldb-build/bin/clang ====================================================================== FAIL: test_vla_gmodules (TestVLA.TestVLA) ---------------------------------------------------------------------- Traceback (most recent call last): File "/Users/buildslave/jenkins/workspace/lldb-cmake-reproducers/llvm-project/lldb/packages/Python/lldbsuite/test/lldbtest.py", line 1823, in test_method return attrvalue(self) File "/Users/buildslave/jenkins/workspace/lldb-cmake-reproducers/llvm-project/lldb/packages/Python/lldbsuite/test/decorators.py", line 134, in wrapper return func(*args, **kwargs) File "/Users/buildslave/jenkins/workspace/lldb-cmake-reproducers/llvm-project/lldb/test/API/lang/c/vla/TestVLA.py", line 42, in test_vla test(2, ["int []", "[0] = 2, [1] = 1"]) File "/Users/buildslave/jenkins/workspace/lldb-cmake-reproducers/llvm-project/lldb/test/API/lang/c/vla/TestVLA.py", line 37, in test self.expect("fr v vla[%d]"%i, substrs=["int", "%d"%(a-i)]) File "/Users/buildslave/jenkins/workspace/lldb-cmake-reproducers/llvm-project/lldb/packages/Python/lldbsuite/test/lldbtest.py", line 2526, in expect self.fail(log_msg) AssertionError: Ran command: "fr v vla[0]"

Hide Details

Got output: (int) vla[0] = <parent failed to evaluate: variable not available>

Hide Details

Hide Details

Expecting sub string: "int" (was found) Expecting sub string: "2" (was not found) Config=x86_64-/Users/buildslave/jenkins/workspace/lldb-cmake-reproducers/lldb-build/bin/clang ---------------------------------------------------------------------- Ran 8 tests in 4.984s

Hide Details

RESULT: FAILED (3 passes, 3 failures, 0 errors, 2 skipped, 0 expected failures, 0 unexpected successes)

Hide Details

--

Hide Details

******************** PASS: lldb-shell :: SymbolFile/Breakpad/symtab.test (330 of 1232) PASS: lldb-api :: python_api/watchpoint/watchlocation/TestSetWatchlocation.py (331 of 1232) PASS: lldb-shell :: BuildScript/toolchain-clang.test (332 of 1232) UNSUPPORTED: lldb-api :: python_api/file_handle/TestFileHandle.py (333 of 1232) PASS: lldb-api :: functionalities/dynamic_value_child_count/TestDynamicValueChildCount.py (334 of 1232) PASS: lldb-shell :: SymbolFile/DWARF/debug_aranges-empty-section.s (335 of 1232) PASS: lldb-shell :: ObjectFile/MachO/lc_version_min.yaml (336 of 1232) UNSUPPORTED: lldb-api :: tools/intel-features/intel-pt/test/TestIntelPTSimpleBinary.py (337 of 1232) PASS: lldb-api :: commands/expression/dollar-in-variable/TestDollarInVariable.py (338 of 1232) PASS: lldb-api :: python_api/sbstructureddata/TestStructuredDataAPI.py (339 of 1232) PASS: lldb-api :: commands/breakpoint/command/list/TestBreakpointCommandList.py (340 of 1232) UNSUPPORTED: lldb-shell :: Reproducer/TestWorkingDir.test (341 of 1232) PASS: lldb-api :: functionalities/data-formatter/data-formatter-stl/libcxx/forward_list/TestDataFormatterLibcxxForwardList.py (342 of 1232) PASS: lldb-api :: python_api/lldbutil/frame/TestFrameUtils.py (343 of 1232) PASS: lldb-api :: python_api/function_symbol/TestSymbolAPI.py (344 of 1232) PASS: lldb-api :: lang/cpp/chained-calls/TestCppChainedCalls.py (345 of 1232) PASS: lldb-api :: functionalities/tail_call_frames/inlining_and_tail_calls/TestInliningAndTailCalls.py (346 of 1232) PASS: lldb-shell :: ObjectFile/wasm/unified-debug-sections.yaml (347 of 1232) PASS: lldb-api :: lang/objc/objc-checker/TestObjCCheckers.py (348 of 1232) PASS: lldb-shell :: Minidump/dump-all.test (349 of 1232) XFAIL: lldb-shell :: Unwind/prefer-debug-over-eh-frame.test (350 of 1232) UNSUPPORTED: lldb-api :: benchmarks/stepping/TestSteppingSpeed.py (351 of 1232) PASS: lldb-api :: commands/expression/diagnostics/TestExprDiagnostics.py (352 of 1232) PASS: lldb-api :: python_api/section/TestSectionAPI.py (353 of 1232) UNSUPPORTED: lldb-shell :: SymbolFile/NativePDB/function-types-builtins.cpp (354 of 1232) PASS: lldb-api :: lang/c/complex_int/TestComplexInt.py (355 of 1232) PASS: lldb-api :: lang/cpp/gmodules/TestWithModuleDebugging.py (356 of 1232) PASS: lldb-api :: functionalities/thread/concurrent_events/TestConcurrentSignalWatch.py (357 of 1232) PASS: lldb-api :: functionalities/breakpoint/cpp_exception/TestCPPExceptionBreakpoint.py (358 of 1232) PASS: lldb-api :: functionalities/thread/concurrent_events/TestConcurrentSignalDelayBreak.py (359 of 1232) PASS: lldb-shell :: Commands/command-regex-unalias.test (360 of 1232) PASS: lldb-api :: functionalities/backticks/TestBackticksWithoutATarget.py (361 of 1232) PASS: lldb-api :: functionalities/data-formatter/data-formatter-script/TestDataFormatterScript.py (362 of 1232) PASS: lldb-api :: lang/cpp/class-template-parameter-pack/TestClassTemplateParameterPack.py (363 of 1232) PASS: lldb-api :: lang/cpp/global_variables/TestCPPGlobalVariables.py (364 of 1232) PASS: lldb-api :: driver/batch_mode/TestBatchMode.py (365 of 1232) PASS: lldb-api :: commands/help/TestHelp.py (366 of 1232) PASS: lldb-shell :: ObjectFile/PECOFF/uuid.yaml (367 of 1232) PASS: lldb-shell :: Breakpoint/dummy-target.test (368 of 1232) PASS: lldb-api :: lang/objc/modules-compile-error/TestModulesCompileError.py (369 of 1232) UNSUPPORTED: lldb-api :: functionalities/gdb_remote_client/TestWriteMemory.py (370 of 1232) PASS: lldb-api :: python_api/watchpoint/TestWatchpointIter.py (371 of 1232) PASS: lldb-api :: lang/cpp/this/TestCPPThis.py (372 of 1232) PASS: lldb-shell :: ObjectFile/ELF/gnu-debuglink.yaml (373 of 1232) PASS: lldb-api :: functionalities/type_completion/TestTypeCompletion.py (374 of 1232) PASS: lldb-api :: functionalities/thread/concurrent_events/TestConcurrentManyWatchpoints.py (375 of 1232) PASS: lldb-shell :: Quit/TestQuitExitCodeNonInt.test (376 of 1232) PASS: lldb-api :: functionalities/type_lookup/TestTypeLookup.py (377 of 1232) PASS: lldb-api :: functionalities/data-formatter/pyobjsynthprovider/TestPyObjSynthProvider.py (378 of 1232) PASS: lldb-shell :: SymbolFile/Breakpad/line-table-edgecases.test (379 of 1232) PASS: lldb-shell :: SymbolFile/DWARF/debug_loclists-dwo.s (380 of 1232) PASS: lldb-api :: lang/objc/modules-non-objc-target/TestObjCModulesNonObjCTarget.py (381 of 1232) PASS: lldb-api :: lang/objc/modules-auto-import/TestModulesAutoImport.py (382 of 1232) PASS: lldb-api :: commands/command/script_alias/TestCommandScriptAlias.py (383 of 1232) UNSUPPORTED: lldb-shell :: Reproducer/Functionalities/TestDataFormatter.test (384 of 1232) PASS: lldb-api :: commands/add-dsym/uuid/TestAddDsymCommand.py (385 of 1232) PASS: lldb-api :: functionalities/inferior-crashing/TestInferiorCrashingStep.py (386 of 1232) PASS: lldb-shell :: Minidump/Windows/find-module.test (387 of 1232) PASS: lldb-api :: lang/objc/modules-cache/TestClangModulesCache.py (388 of 1232) UNSUPPORTED: lldb-shell :: BuildScript/toolchain-clang-cl.test (389 of 1232) PASS: lldb-api :: python_api/lldbutil/iter/TestLLDBIterator.py (390 of 1232) PASS: lldb-shell :: ObjectFile/wasm/basic.yaml (391 of 1232) UNSUPPORTED: lldb-shell :: SymbolFile/NativePDB/bitfields.cpp (392 of 1232) UNSUPPORTED: lldb-shell :: Reproducer/TestDiscard.test (393 of 1232) PASS: lldb-shell :: Driver/TestConvenienceVariables.test (394 of 1232) PASS: lldb-shell :: ObjectFile/ELF/netbsd-core-amd64.test (395 of 1232) PASS: lldb-api :: tools/lldb-server/TestGdbRemoteKill.py (396 of 1232) UNSUPPORTED: lldb-api :: commands/expression/no-deadlock/TestExprDoesntBlock.py (397 of 1232) PASS: lldb-shell :: Quit/TestQuitExitCodeImplicit0.test (398 of 1232) UNSUPPORTED: lldb-api :: linux/mix-dwo-and-regular-objects/TestMixedDwarfBinary.py (399 of 1232) PASS: lldb-api :: macosx/duplicate-archive-members/TestDuplicateMembers.py (400 of 1232) PASS: lldb-api :: commands/frame/language/TestGuessLanguage.py (401 of 1232) UNSUPPORTED: lldb-api :: functionalities/darwin_log/filter/regex/message/TestDarwinLogFilterRegexMessage.py (402 of 1232) PASS: lldb-api :: functionalities/data-formatter/data-formatter-stl/libcxx/map/TestDataFormatterLibccMap.py (403 of 1232) UNSUPPORTED: lldb-api :: macosx/function-starts/TestFunctionStarts.py (404 of 1232) UNSUPPORTED: lldb-api :: tools/lldb-vscode/module/TestVSCode_module.py (405 of 1232) PASS: lldb-api :: functionalities/thread/concurrent_events/TestConcurrentTwoWatchpointsOneDelayBreakpoint.py (406 of 1232) PASS: lldb-api :: functionalities/data-formatter/data-formatter-stl/libcxx/string/TestDataFormatterLibcxxString.py (407 of 1232) PASS: lldb-api :: lang/objc/modules-app-update/TestClangModulesAppUpdate.py (408 of 1232) UNSUPPORTED: lldb-api :: python_api/disassemble-raw-data/TestDisassembleRawData.py (409 of 1232) PASS: lldb-api :: commands/gui/invalid-args/TestInvalidArgsGui.py (410 of 1232) UNSUPPORTED: lldb-api :: commands/expression/completion-crash-invalid-iterator/TestInvalidIteratorCompletionCrash.py (411 of 1232) PASS: lldb-api :: functionalities/tsan/thread_numbers/TestTsanThreadNumbers.py (412 of 1232) UNSUPPORTED: lldb-api :: tools/lldb-vscode/breakpoint-events/TestVSCode_breakpointEvents.py (413 of 1232) PASS: lldb-api :: commands/disassemble/basic/TestFrameDisassemble.py (414 of 1232) UNSUPPORTED: lldb-shell :: SymbolFile/DWARF/debug_loc.s (415 of 1232) PASS: lldb-api :: functionalities/tsan/thread_leak/TestTsanThreadLeak.py (416 of 1232) PASS: lldb-api :: commands/target/modules/search-paths/insert/TestTargetModulesSearchpathsInsert.py (417 of 1232) PASS: lldb-api :: functionalities/data-formatter/parray/TestPrintArray.py (418 of 1232) UNSUPPORTED: lldb-shell :: Reproducer/TestCaptureEnvOverride.test (419 of 1232) PASS: lldb-api :: python_api/value/TestValueAPI.py (420 of 1232) PASS: lldb-api :: lang/cpp/type_lookup/TestCppTypeLookup.py (421 of 1232) PASS: lldb-api :: lang/objc/variadic_methods/TestVariadicMethods.py (422 of 1232) PASS: lldb-api :: functionalities/data-formatter/data-formatter-stl/libcxx/unique_ptr/TestDataFormatterLibcxxUniquePtr.py (423 of 1232) PASS: lldb-api :: functionalities/multiword-commands/TestMultiWordCommands.py (424 of 1232) UNSUPPORTED: lldb-api :: commands/expression/import-std-module/weak_ptr/TestWeakPtrFromStdModule.py (425 of 1232) PASS: lldb-api :: commands/command/source/TestCommandSource.py (426 of 1232) PASS: lldb-shell :: SymbolFile/Breakpad/symtab-macho.test (427 of 1232) PASS: lldb-api :: functionalities/pre_run_dylibs/TestPreRunDylibs.py (428 of 1232) PASS: lldb-api :: lang/objc/conflicting-definition/TestConflictingDefinition.py (429 of 1232) PASS: lldb-api :: lang/cpp/bitfields/TestCppBitfields.py (430 of 1232) UNSUPPORTED: lldb-api :: tools/lldb-vscode/breakpoint/TestVSCode_setBreakpoints.py (431 of 1232) UNSUPPORTED: lldb-api :: lang/cpp/static_members/TestCPPStaticMembers.py (432 of 1232) PASS: lldb-shell :: ObjectFile/PECOFF/invalid-export-table.yaml (433 of 1232) PASS: lldb-api :: functionalities/data-formatter/data-formatter-stl/libcxx/multimap/TestDataFormatterLibccMultiMap.py (434 of 1232) UNSUPPORTED: lldb-api :: commands/expression/import-std-module/conflicts/TestStdModuleWithConflicts.py (435 of 1232) UNSUPPORTED: lldb-api :: functionalities/darwin_log/source/info/TestDarwinLogSourceInfo.py (436 of 1232) PASS: lldb-api :: commands/frame/diagnose/dereference-argument/TestDiagnoseDereferenceArgument.py (437 of 1232) PASS: lldb-api :: tools/lldb-server/inferior-crash/TestGdbRemoteAbort.py (438 of 1232) PASS: lldb-api :: functionalities/gdb_remote_client/TestWasm.py (439 of 1232) UNSUPPORTED: lldb-shell :: SymbolFile/NativePDB/locate-pdb.cpp (440 of 1232) PASS: lldb-api :: lang/cpp/signed_types/TestSignedTypes.py (441 of 1232) PASS: lldb-api :: functionalities/data-formatter/data-formatter-objc/TestDataFormatterObjCNSDate.py (442 of 1232) UNSUPPORTED: lldb-api :: functionalities/data-formatter/data-formatter-stl/libstdcpp/map/TestDataFormatterStdMap.py (443 of 1232) PASS: lldb-api :: commands/expression/function_template_specialization_temp_args/TestFunctionTemplateSpecializationTempArgs.py (444 of 1232) PASS: lldb-api :: functionalities/var_path/TestVarPath.py (445 of 1232) PASS: lldb-api :: functionalities/gdb_remote_client/TestPlatformClient.py (446 of 1232) UNSUPPORTED: lldb-api :: android/platform/TestDefaultCacheLineSize.py (447 of 1232) PASS: lldb-shell :: SymbolFile/DWARF/DW_AT_location-DW_AT_const_value.s (448 of 1232) PASS: lldb-api :: tools/lldb-server/inferior-crash/TestGdbRemoteSegFault.py (449 of 1232) UNSUPPORTED: lldb-shell :: Reproducer/TestMultipleTargets.test (450 of 1232) PASS: lldb-api :: lang/cpp/global_operators/TestCppGlobalOperators.py (451 of 1232) PASS: lldb-api :: functionalities/thread/concurrent_events/TestConcurrentCrashWithWatchpoint.py (452 of 1232) PASS: lldb-api :: python_api/breakpoint/TestBreakpointAPI.py (453 of 1232) UNSUPPORTED: lldb-shell :: Reproducer/TestFileRepro.test (454 of 1232) PASS: lldb-api :: commands/expression/vector_of_enums/TestVectorOfEnums.py (455 of 1232) PASS: lldb-api :: tools/lldb-server/TestGdbRemoteProcessInfo.py (456 of 1232) PASS: lldb-shell :: ObjectFile/Breakpad/sections.test (457 of 1232) PASS: lldb-api :: functionalities/thread/concurrent_events/TestConcurrentWatchBreak.py (458 of 1232) PASS: lldb-shell :: ObjectFile/ELF/PT_TLS-overlap-PT_LOAD.yaml (459 of 1232) PASS: lldb-api :: functionalities/tsan/basic/TestTsanBasic.py (460 of 1232) UNSUPPORTED: lldb-api :: python_api/disassemble-raw-data/TestDisassemble_VST1_64.py (461 of 1232) PASS: lldb-api :: commands/platform/file/close/TestPlatformFileClose.py (462 of 1232) PASS: lldb-shell :: SymbolFile/DWARF/split-dwarf-multiple-cu.ll (463 of 1232) UNSUPPORTED: lldb-api :: commands/expression/import-std-module/queue/TestQueueFromStdModule.py (464 of 1232) PASS: lldb-api :: functionalities/stats_api/TestStatisticsAPI.py (465 of 1232) UNSUPPORTED: lldb-api :: tools/lldb-vscode/launch/TestVSCode_launch.py (466 of 1232) UNSUPPORTED: lldb-api :: functionalities/load_using_paths/TestLoadUsingPaths.py (467 of 1232) PASS: lldb-api :: functionalities/breakpoint/serialize/TestBreakpointSerialization.py (468 of 1232) UNSUPPORTED: lldb-shell :: Register/x86-64-gp-write.test (469 of 1232) PASS: lldb-api :: lang/c/function_types/TestFunctionTypes.py (470 of 1232) UNSUPPORTED: lldb-api :: lang/objc/foundation/TestRuntimeTypes.py (471 of 1232) PASS: lldb-shell :: ObjectFile/ELF/PT_LOAD-overlap-section.yaml (472 of 1232) XFAIL: lldb-shell :: Register/x86-mm-xmm-write.test (473 of 1232) PASS: lldb-api :: macosx/nslog/TestDarwinNSLogOutput.py (474 of 1232) PASS: lldb-shell :: SymbolFile/DWARF/debug_line-relative_path.s (475 of 1232) PASS: lldb-api :: functionalities/breakpoint/source_regexp/TestSourceRegexBreakpoints.py (476 of 1232) PASS: lldb-api :: types/TestCharTypeExpr.py (477 of 1232) PASS: lldb-api :: functionalities/target-new-solib-notifications/TestModuleLoadedNotifys.py (478 of 1232) PASS: lldb-api :: functionalities/thread/exit_during_break/TestExitDuringBreak.py (479 of 1232) PASS: lldb-api :: commands/register/register/register_command/TestRegisters.py (480 of 1232) PASS: lldb-api :: commands/log/invalid-args/TestInvalidArgsLog.py (481 of 1232) PASS: lldb-shell :: SymbolFile/DWARF/debug_ranges-missing-section.s (482 of 1232) UNSUPPORTED: lldb-shell :: ScriptInterpreter/Lua/lua.test (483 of 1232) UNSUPPORTED: lldb-api :: linux/add-symbols/TestTargetSymbolsAddCommand.py (484 of 1232) UNSUPPORTED: lldb-shell :: SymbolFile/PDB/enums-layout.test (485 of 1232) UNSUPPORTED: lldb-shell :: Reproducer/TestGDBRemoteRepro.test (486 of 1232) PASS: lldb-api :: source-manager/TestSourceManager.py (487 of 1232) PASS: lldb-api :: macosx/safe-to-func-call/TestSafeFuncCalls.py (488 of 1232) PASS: lldb-api :: functionalities/data-formatter/frameformat_smallstruct/TestFrameFormatSmallStruct.py (489 of 1232) PASS: lldb-shell :: SymbolFile/DWARF/DW_AT_declaration-with-children.s (490 of 1232) PASS: lldb-shell :: SymbolFile/DWARF/find-inline-method.s (491 of 1232) PASS: lldb-api :: tools/lldb-server/register-reading/TestGdbRemoteGPacket.py (492 of 1232) PASS: lldb-api :: commands/expression/po_verbosity/TestPoVerbosity.py (493 of 1232) PASS: lldb-api :: functionalities/breakpoint/scripted_bkpt/TestScriptedResolver.py (494 of 1232) PASS: lldb-api :: lang/objc/foundation/TestConstStrings.py (495 of 1232) PASS: lldb-api :: api/multithreaded/TestMultithreaded.py (496 of 1232) PASS: lldb-api :: commands/expression/options/TestExprOptions.py (497 of 1232) PASS: lldb-shell :: SymbolFile/DWARF/debug-types-address-ranges.s (498 of 1232) UNSUPPORTED: lldb-shell :: Reproducer/TestCrash.test (499 of 1232) UNSUPPORTED: lldb-api :: commands/expression/import-std-module/deque-dbg-info-content/TestDbgInfoContentDequeFromStdModule.py (500 of 1232) UNSUPPORTED: lldb-api :: commands/expression/unwind_expression/TestUnwindExpression.py (501 of 1232) PASS: lldb-api :: functionalities/thread/concurrent_events/TestConcurrentTwoWatchpointsOneSignal.py (502 of 1232) PASS: lldb-api :: commands/expression/context-object-objc/TestContextObjectObjc.py (503 of 1232) PASS: lldb-api :: python_api/hello_world/TestHelloWorld.py (504 of 1232) PASS: lldb-api :: macosx/load-kext/TestLoadKext.py (505 of 1232) PASS: lldb-api :: functionalities/data-formatter/data-formatter-caching/TestDataFormatterCaching.py (506 of 1232) PASS: lldb-shell :: ObjectFile/MachO/lc_build_version.yaml (507 of 1232) UNSUPPORTED: lldb-shell :: Reproducer/TestSynchronous.test (508 of 1232) PASS: lldb-api :: lang/cpp/typeof/TestTypeOfDeclTypeExpr.py (509 of 1232) UNSUPPORTED: lldb-shell :: SymbolFile/NativePDB/s_constant.cpp (510 of 1232) UNSUPPORTED: lldb-api :: tools/lldb-server/thread-name/TestGdbRemoteThreadName.py (511 of 1232) PASS: lldb-api :: functionalities/target_var/TestTargetVar.py (512 of 1232) PASS: lldb-api :: lang/objc/hidden-ivars/TestHiddenIvars.py (513 of 1232) UNSUPPORTED: lldb-api :: functionalities/darwin_log/filter/exact_match/message/TestDarwinLogFilterMatchMessage.py (514 of 1232) PASS: lldb-api :: functionalities/thread/concurrent_events/TestConcurrentSignalBreak.py (515 of 1232) PASS: lldb-shell :: SymbolFile/DWARF/dir-separator-no-comp-dir-relative-name.s (516 of 1232) PASS: lldb-shell :: SymbolFile/Breakpad/stack-cfi-parsing.test (517 of 1232) PASS: lldb-api :: functionalities/breakpoint/inlined_breakpoints/TestInlinedBreakpoints.py (518 of 1232) PASS: lldb-shell :: SymbolFile/Breakpad/line-table-mixed-path-styles.test (519 of 1232) PASS: lldb-api :: lang/cpp/wchar_t/TestCxxWCharT.py (520 of 1232) PASS: lldb-api :: commands/expression/top-level/TestTopLevelExprs.py (521 of 1232) UNSUPPORTED: lldb-api :: commands/expression/import-std-module/basic/TestImportStdModule.py (522 of 1232) PASS: lldb-shell :: ScriptInterpreter/Python/eof.test (523 of 1232) UNSUPPORTED: lldb-api :: functionalities/step_scripted/TestStepScripted.py (524 of 1232) PASS: lldb-shell :: ObjectFile/PECOFF/sections-names.yaml (525 of 1232) UNSUPPORTED: lldb-api :: commands/expression/import-std-module/list-dbg-info-content/TestDbgInfoContentListFromStdModule.py (526 of 1232) PASS: lldb-shell :: ObjectFile/ELF/many-sections.s (527 of 1232) PASS: lldb-api :: lang/cpp/exceptions/TestCPPExceptionBreakpoints.py (528 of 1232) PASS: lldb-shell :: SymbolFile/DWARF/dir-separator-no-comp-dir.s (529 of 1232) PASS: lldb-api :: functionalities/data-formatter/data-formatter-objc/TestDataFormatterObjNSException.py (530 of 1232) UNSUPPORTED: lldb-api :: commands/process/launch/TestProcessLaunch.py (531 of 1232) XFAIL: lldb-shell :: Register/x86-64-ymm-write.test (532 of 1232) PASS: lldb-shell :: SymbolFile/DWARF/apple-index-is-used.cpp (533 of 1232) UNSUPPORTED: lldb-api :: functionalities/darwin_log/filter/regex/category/TestDarwinLogFilterRegexCategory.py (534 of 1232) PASS: lldb-api :: iohandler/resize/TestIOHandlerResize.py (535 of 1232) PASS: lldb-api :: terminal/TestSTTYBeforeAndAfter.py (536 of 1232) UNSUPPORTED: lldb-api :: functionalities/process_group/TestChangeProcessGroup.py (537 of 1232) PASS: lldb-api :: lang/objcxx/class-name-clash/TestNameClash.py (538 of 1232) PASS: lldb-api :: commands/watchpoints/watchpoint_disable/TestWatchpointDisable.py (539 of 1232) PASS: lldb-shell :: ObjectFile/PECOFF/section-types.yaml (540 of 1232) PASS: lldb-shell :: SymbolFile/DWARF/compilercontext.ll (541 of 1232) PASS: lldb-api :: commands/watchpoints/watchpoint_commands/command/TestWatchpointCommandPython.py (542 of 1232) PASS: lldb-api :: lang/objcxx/cxx-bridged-po/TestObjCXXBridgedPO.py (543 of 1232) PASS: lldb-api :: functionalities/breakpoint/breakpoint_ignore_count/TestBreakpointIgnoreCount.py (544 of 1232) PASS: lldb-shell :: ScriptInterpreter/Python/python.test (545 of 1232) PASS: lldb-api :: lang/cpp/breakpoint_in_member_func_w_non_primitive_params/TestBreakpointInMemberFuncWNonPrimitiveParams.py (546 of 1232) PASS: lldb-shell :: SymbolFile/DWARF/dwo-type-in-main-file.s (547 of 1232) PASS: lldb-shell :: SymbolFile/DWARF/DW_AT_data_bit_offset-DW_OP_stack_value.s (548 of 1232) PASS: lldb-api :: functionalities/breakpoint/move_nearest/TestMoveNearest.py (549 of 1232) PASS: lldb-api :: functionalities/data-formatter/boolreference/TestFormattersBoolRefPtr.py (550 of 1232) PASS: lldb-shell :: BuildScript/script-args.test (551 of 1232) PASS: lldb-api :: tools/lldb-server/TestGdbRemoteSingleStep.py (552 of 1232) PASS: lldb-api :: api/check_public_api_headers/TestPublicAPIHeaders.py (553 of 1232) PASS: lldb-api :: python_api/value/empty_class/TestValueAPIEmptyClass.py (554 of 1232) PASS: lldb-shell :: Process/UnsupportedLanguage.test (555 of 1232) PASS: lldb-api :: commands/watchpoints/watchpoint_count/TestWatchpointCount.py (556 of 1232) PASS: lldb-shell :: ObjectFile/PECOFF/basic-info.yaml (557 of 1232) PASS: lldb-api :: commands/command/script/import/TestImport.py (558 of 1232) PASS: lldb-api :: commands/target/create-deps/TestTargetCreateDeps.py (559 of 1232) UNSUPPORTED: lldb-shell :: Register/x86-64-ymm-read.test (560 of 1232) PASS: lldb-api :: python_api/objc_type/TestObjCType.py (561 of 1232) PASS: lldb-api :: lang/objc/objc-runtime-ivars/TestRuntimeIvars.py (562 of 1232) PASS: lldb-api :: functionalities/breakpoint/objc/TestObjCBreakpoints.py (563 of 1232) PASS: lldb-api :: functionalities/breakpoint/breakpoint_names/TestBreakpointNames.py (564 of 1232) UNSUPPORTED: lldb-shell :: SymbolFile/PDB/pointers.test (565 of 1232) UNSUPPORTED: lldb-api :: functionalities/breakpoint/breakpoint_in_delayslot/TestAvoidBreakpointInDelaySlot.py (566 of 1232) UNSUPPORTED: lldb-shell :: SymbolFile/NativePDB/global-classes.cpp (567 of 1232) PASS: lldb-api :: linux/builtin_trap/TestBuiltinTrap.py (568 of 1232) PASS: lldb-api :: tools/lldb-server/TestGdbRemote_qThreadStopInfo.py (569 of 1232) PASS: lldb-api :: functionalities/archives/TestBSDArchives.py (570 of 1232) UNSUPPORTED: lldb-shell :: SymbolFile/NativePDB/nested-types.cpp (571 of 1232) PASS: lldb-api :: api/listeners/TestListener.py (572 of 1232) PASS: lldb-api :: functionalities/data-formatter/vector-types/TestVectorTypesFormatting.py (573 of 1232) PASS: lldb-shell :: Unwind/trap_frame_sym_ctx.test (574 of 1232) PASS: lldb-api :: python_api/name_lookup/TestNameLookup.py (575 of 1232) PASS: lldb-api :: lang/cpp/this_class_type_mixing/TestThisClassTypeMixing.py (576 of 1232) PASS: lldb-shell :: Settings/TestDisassemblyFormat.test (577 of 1232) PASS: lldb-api :: functionalities/data-formatter/data-formatter-objc/TestDataFormatterObjCCF.py (578 of 1232) PASS: lldb-api :: commands/expression/ir-interpreter-phi-nodes/TestIRInterpreterPHINodes.py (579 of 1232) PASS: lldb-api :: commands/expression/completion-crash-incomplete-record/TestCompletionCrashIncompleteRecord.py (580 of 1232) PASS: lldb-api :: commands/expression/call-throws/TestCallThatThrows.py (581 of 1232) PASS: lldb-api :: macosx/add-dsym/TestAddDsymMidExecutionCommand.py (582 of 1232) PASS: lldb-api :: commands/expression/call-function/TestCallStdStringFunction.py (583 of 1232) PASS: lldb-api :: lang/cpp/overloaded-functions/TestOverloadedFunctions.py (584 of 1232) PASS: lldb-api :: functionalities/data-formatter/hexcaps/TestDataFormatterHexCaps.py (585 of 1232) UNSUPPORTED: lldb-shell :: Register/x86-gp-write.test (586 of 1232) UNSUPPORTED: lldb-shell :: SymbolFile/PDB/function-nested-block.test (587 of 1232) PASS: lldb-api :: python_api/formatters/TestFormattersSBAPI.py (588 of 1232) UNSUPPORTED: lldb-api :: functionalities/postmortem/netbsd-core/TestNetBSDCore.py (589 of 1232) PASS: lldb-api :: python_api/lldbutil/iter/TestRegistersIterator.py (590 of 1232) PASS: lldb-shell :: Settings/TestDisableColor.test (591 of 1232) PASS: lldb-api :: functionalities/data-formatter/data-formatter-stl/libcxx/function/TestLibCxxFunction.py (592 of 1232) PASS: lldb-api :: functionalities/breakpoint/breakpoint_conditions/TestBreakpointConditions.py (593 of 1232) PASS: lldb-api :: lang/cpp/unicode-literals/TestUnicodeLiterals.py (594 of 1232) PASS: lldb-api :: commands/expression/call-function/TestCallBuiltinFunction.py (595 of 1232) UNSUPPORTED: lldb-api :: functionalities/unwind/ehframe/TestEhFrameUnwind.py (596 of 1232) PASS: lldb-api :: functionalities/postmortem/elf-core/gcore/TestGCore.py (597 of 1232) PASS: lldb-api :: types/TestCharType.py (598 of 1232) PASS: lldb-api :: functionalities/data-formatter/data-formatter-stl/libcxx/tuple/TestDataFormatterLibcxxTuple.py (599 of 1232) PASS: lldb-api :: lang/cpp/template/TestTemplateArgs.py (600 of 1232) PASS: lldb-api :: lang/c/array_types/TestArrayTypes.py (601 of 1232) UNSUPPORTED: lldb-api :: functionalities/darwin_log/filter/regex/activity/TestDarwinLogFilterRegexActivity.py (602 of 1232) PASS: lldb-api :: lang/objc/objc-static-method/TestObjCStaticMethod.py (603 of 1232) PASS: lldb-api :: commands/frame/diagnose/bad-reference/TestBadReference.py (604 of 1232) PASS: lldb-api :: functionalities/data-formatter/type_summary_list_arg/TestTypeSummaryListArg.py (605 of 1232) PASS: lldb-api :: commands/expression/radar_9673664/TestExprHelpExamples.py (606 of 1232) PASS: lldb-api :: commands/frame/diagnose/inheritance/TestDiagnoseInheritance.py (607 of 1232) UNSUPPORTED: lldb-api :: functionalities/data-formatter/data-formatter-stl/libstdcpp/list/TestDataFormatterStdList.py (608 of 1232) PASS: lldb-shell :: Expr/TestIRMemoryMap.test (609 of 1232) UNSUPPORTED: lldb-api :: commands/register/register/aarch64_sve_registers/rw_access_static_config/TestSVERegisters.py (610 of 1232) PASS: lldb-api :: functionalities/data-formatter/data-formatter-stl/libcxx/unordered/TestDataFormatterUnordered.py (611 of 1232) UNSUPPORTED: lldb-shell :: SymbolFile/NativePDB/source-list.cpp (612 of 1232) PASS: lldb-shell :: ObjectFile/PECOFF/export-dllfunc.yaml (613 of 1232) PASS: lldb-api :: functionalities/breakpoint/hardware_breakpoints/require_hw_breakpoints/TestRequireHWBreakpoints.py (614 of 1232) PASS: lldb-api :: commands/apropos/basic/TestApropos.py (615 of 1232) PASS: lldb-api :: functionalities/breakpoint/comp_dir_symlink/TestCompDirSymLink.py (616 of 1232) PASS: lldb-api :: functionalities/thread/concurrent_events/TestConcurrentDelaySignalWatch.py (617 of 1232) PASS: lldb-api :: lang/cpp/lambdas/TestLambdas.py (618 of 1232) UNSUPPORTED: lldb-api :: functionalities/breakpoint/breakpoint_command/TestBreakpointCommandsFromPython.py (619 of 1232) UNSUPPORTED: lldb-api :: macosx/find-dsym/deep-bundle/TestDeepBundle.py (620 of 1232) PASS: lldb-api :: functionalities/plugins/python_os_plugin/TestPythonOSPlugin.py (621 of 1232) PASS: lldb-api :: functionalities/data-formatter/language_category_updates/TestDataFormatterLanguageCategoryUpdates.py (622 of 1232) PASS: lldb-shell :: Settings/TestEchoCommands.test (623 of 1232) PASS: lldb-shell :: Process/Optimization.test (624 of 1232) PASS: lldb-api :: functionalities/thread/concurrent_events/TestConcurrentManyBreakpoints.py (625 of 1232) UNSUPPORTED: lldb-shell :: SymbolFile/PDB/variables.test (626 of 1232) UNSUPPORTED: lldb-api :: functionalities/darwin_log/filter/exact_match/activity-chain/TestDarwinLogFilterMatchActivityChain.py (627 of 1232) PASS: lldb-api :: functionalities/object-file/TestImageListMultiArchitecture.py (628 of 1232) PASS: lldb-api :: tools/lldb-server/TestGdbRemoteExitCode.py (629 of 1232) PASS: lldb-api :: commands/expression/namespace_local_var_same_name_obj_c/TestNamespaceLocalVarSameNameObjC.py (630 of 1232) PASS: lldb-api :: lang/cpp/breakpoint-commands/TestCPPBreakpointCommands.py (631 of 1232) PASS: lldb-api :: lang/cpp/frame-var-anon-unions/TestFrameVariableAnonymousUnions.py (632 of 1232) PASS: lldb-api :: functionalities/exec/TestExec.py (633 of 1232) PASS: lldb-api :: python_api/sbplatform/TestSBPlatform.py (634 of 1232) UNSUPPORTED: lldb-api :: functionalities/data-formatter/data-formatter-stl/libstdcpp/tuple/TestDataFormatterStdTuple.py (635 of 1232) UNSUPPORTED: lldb-api :: commands/expression/import-std-module/vector-bool/TestVectorBoolFromStdModule.py (636 of 1232) UNSUPPORTED: lldb-api :: python_api/process/read-mem-cstring/TestReadMemCString.py (637 of 1232) PASS: lldb-api :: types/TestFloatTypes.py (638 of 1232) PASS: lldb-api :: lang/cpp/dynamic-value-same-basename/TestDynamicValueSameBase.py (639 of 1232) PASS: lldb-api :: functionalities/breakpoint/consecutive_breakpoints/TestConsecutiveBreakpoints.py (640 of 1232) UNSUPPORTED: lldb-shell :: SymbolFile/DWARF/split-dwarf-expression-eval-bug.cpp (641 of 1232) UNSUPPORTED: lldb-api :: commands/expression/import-std-module/sysroot/TestStdModuleSysroot.py (642 of 1232) UNSUPPORTED: lldb-api :: commands/expression/import-std-module/no-std-module/TestMissingStdModule.py (643 of 1232) UNSUPPORTED: lldb-api :: macosx/macCatalyst/TestMacCatalyst.py (644 of 1232) PASS: lldb-api :: functionalities/data-formatter/data-formatter-proper-plurals/TestFormattersOneIsSingular.py (645 of 1232) PASS: lldb-api :: functionalities/tail_call_frames/disambiguate_call_site/TestDisambiguateCallSite.py (646 of 1232) UNSUPPORTED: lldb-shell :: Reproducer/TestDebugSymbols.test (647 of 1232) PASS: lldb-api :: commands/command/nested_alias/TestNestedAlias.py (648 of 1232) UNSUPPORTED: lldb-api :: tools/lldb-server/TestGdbRemoteModuleInfo.py (649 of 1232) UNSUPPORTED: lldb-shell :: ScriptInterpreter/Lua/breakpoint_callback.test (650 of 1232) PASS: lldb-api :: commands/expression/anonymous-struct/TestCallUserAnonTypedef.py (651 of 1232) PASS: lldb-api :: lang/cpp/template-specialization-type/TestTemplateSpecializationType.py (652 of 1232) PASS: lldb-api :: lang/cpp/alignas_base_class/TestAlignAsBaseClass.py (653 of 1232) UNSUPPORTED: lldb-api :: tools/lldb-vscode/runInTerminal/TestVSCode_runInTerminal.py (654 of 1232) PASS: lldb-shell :: Breakpoint/single-file-split-dwarf.test (655 of 1232) PASS: lldb-api :: commands/expression/cast_int_to_anonymous_enum/TestCastIntToAnonymousEnum.py (656 of 1232) PASS: lldb-shell :: VSCode/TestOptions.test (657 of 1232) PASS: lldb-api :: python_api/signals/TestSignalsAPI.py (658 of 1232) UNSUPPORTED: lldb-shell :: Reproducer/TestVerify.test (659 of 1232) PASS: lldb-api :: functionalities/history/TestHistoryRecall.py (660 of 1232) PASS: lldb-api :: lang/cpp/scope/TestCppScope.py (661 of 1232) UNSUPPORTED: lldb-api :: tools/lldb-vscode/coreFile/TestVSCode_coreFile.py (662 of 1232) PASS: lldb-api :: python_api/debugger/TestDebuggerAPI.py (663 of 1232) PASS: lldb-api :: commands/watchpoints/watchpoint_size/TestWatchpointSizes.py (664 of 1232) UNSUPPORTED: lldb-shell :: SymbolFile/target-symbols-add-unwind.test (665 of 1232) PASS: lldb-shell :: Minidump/Windows/broken-unwind.test (666 of 1232) UNSUPPORTED: lldb-api :: commands/trace/TestTraceLoad.py (667 of 1232) PASS: lldb-api :: functionalities/data-formatter/data-formatter-stl/libcxx/initializerlist/TestInitializerList.py (668 of 1232) PASS: lldb-api :: commands/expression/char/TestExprsChar.py (669 of 1232) UNSUPPORTED: lldb-api :: python_api/process/io/TestProcessIO.py (670 of 1232) PASS: lldb-shell :: SymbolFile/DWARF/anon_class_w_and_wo_export_symbols.ll (671 of 1232) PASS: lldb-api :: functionalities/tail_call_frames/ambiguous_tail_call_seq1/TestAmbiguousTailCallSeq1.py (672 of 1232) PASS: lldb-api :: lang/cpp/bool/TestCPPBool.py (673 of 1232) PASS: lldb-shell :: Breakpoint/debug_rnglist_offset_pair.test (674 of 1232) PASS: lldb-api :: lang/objc/modules-inline-functions/TestModulesInlineFunctions.py (675 of 1232) PASS: lldb-api :: functionalities/breakpoint/step_over_breakpoint/TestStepOverBreakpoint.py (676 of 1232) PASS: lldb-shell :: SymbolFile/DWARF/debug-types-missing-signature.test (677 of 1232) PASS: lldb-api :: python_api/default-constructor/TestDefaultConstructorForAPIObjects.py (678 of 1232) PASS: lldb-shell :: SymbolFile/DWARF/dwarf5-partial-index.cpp (679 of 1232) PASS: lldb-shell :: Breakpoint/debug_rnglistx_rlex.test (680 of 1232) PASS: lldb-api :: functionalities/thread/concurrent_events/TestConcurrentBreakpointOneDelayBreakpointThreads.py (681 of 1232) PASS: lldb-api :: functionalities/data-formatter/data-formatter-stl/libcxx/list/loop/TestDataFormatterLibcxxListLoop.py (682 of 1232) PASS: lldb-shell :: SymbolFile/DWARF/gnu-style-compression.cpp (683 of 1232) UNSUPPORTED: lldb-api :: lang/c/typedef/Testtypedef.py (684 of 1232) PASS: lldb-api :: lang/cpp/accelerator-table/TestCPPAccelerator.py (685 of 1232) UNSUPPORTED: lldb-api :: functionalities/thread/concurrent_events/TestConcurrentManySignals.py (686 of 1232) PASS: lldb-api :: functionalities/data-formatter/data-formatter-python-synth/TestDataFormatterPythonSynth.py (687 of 1232) PASS: lldb-shell :: Host/TestCustomShell.test (688 of 1232) UNSUPPORTED: lldb-shell :: SymbolFile/NativePDB/tag-types.cpp (689 of 1232) PASS: lldb-api :: lang/cpp/std-function-step-into-callable/TestStdFunctionStepIntoCallable.py (690 of 1232) PASS: lldb-api :: commands/expression/inline-namespace/TestInlineNamespace.py (691 of 1232) PASS: lldb-api :: functionalities/thread/concurrent_events/TestConcurrentTwoBreakpointsOneDelaySignal.py (692 of 1232) PASS: lldb-shell :: Commands/command-breakpoint-col.test (693 of 1232) PASS: lldb-shell :: SymbolFile/DWARF/find-variable-file.cpp (694 of 1232) PASS: lldb-api :: functionalities/thread/concurrent_events/TestConcurrentCrashWithWatchpointBreakpointSignal.py (695 of 1232) PASS: lldb-api :: commands/frame/var/TestFrameVar.py (696 of 1232) PASS: lldb-api :: functionalities/data-formatter/data-formatter-stl/libcxx/list/TestDataFormatterLibcxxList.py (697 of 1232) UNSUPPORTED: lldb-api :: lang/cpp/function-template-parameter-pack/TestFunctionTemplateParameterPack.py (698 of 1232) PASS: lldb-shell :: Settings/TestSettingsWrite.test (699 of 1232) PASS: lldb-api :: python_api/watchpoint/TestSetWatchpoint.py (700 of 1232) PASS: lldb-api :: functionalities/signal/handle-abrt/TestHandleAbort.py (701 of 1232) UNSUPPORTED: lldb-shell :: Quit/TestQuitExitCode30.test (702 of 1232) PASS: lldb-shell :: SymbolFile/DWARF/debug-types-basic.test (703 of 1232) PASS: lldb-api :: lang/objc/bitfield_ivars/TestBitfieldIvars.py (704 of 1232) UNSUPPORTED: lldb-api :: tools/lldb-server/signal-filtering/TestGdbRemote_QPassSignals.py (705 of 1232) PASS: lldb-shell :: SymbolFile/DWARF/debug_loc-aslr.s (706 of 1232) UNSUPPORTED: lldb-shell :: Watchpoint/netbsd-nouserdbregs.test (707 of 1232) PASS: lldb-api :: lang/cpp/limit-debug-info/TestWithLimitDebugInfo.py (708 of 1232) PASS: lldb-api :: lang/c/offsetof/TestOffsetof.py (709 of 1232) PASS: lldb-api :: lang/cpp/diamond/TestDiamond.py (710 of 1232) PASS: lldb-shell :: Minidump/memory-region.yaml (711 of 1232) PASS: lldb-api :: lang/objc/objc-ivar-stripped/TestObjCIvarStripped.py (712 of 1232) PASS: lldb-api :: functionalities/data-formatter/data-formatter-synthtype/TestDataFormatterSynthType.py (713 of 1232) UNSUPPORTED: lldb-shell :: Reproducer/Functionalities/TestExpressionEvaluation.test (714 of 1232) PASS: lldb-api :: lang/cpp/char8_t/TestCxxChar8_t.py (715 of 1232) PASS: lldb-api :: commands/disassemble/basic/TestDisassembleBreakpoint.py (716 of 1232) PASS: lldb-api :: lang/objc/objc_direct-methods/TestObjCDirectMethods.py (717 of 1232) UNSUPPORTED: lldb-api :: commands/process/attach/attach_denied/TestAttachDenied.py (718 of 1232) UNSUPPORTED: lldb-api :: tools/lldb-server/TestGdbRemoteAuxvSupport.py (719 of 1232) PASS: lldb-api :: python_api/function_symbol/TestDisasmAPI.py (720 of 1232) UNSUPPORTED: lldb-api :: benchmarks/libcxxlist/TestBenchmarkLibcxxList.py (721 of 1232) PASS: lldb-shell :: ExecControl/StopHook/stop-hook.test (722 of 1232) PASS: lldb-api :: commands/expression/invalid-args/TestInvalidArgsExpression.py (723 of 1232) PASS: lldb-api :: commands/frame/diagnose/array/TestArray.py (724 of 1232) UNSUPPORTED: lldb-shell :: SymbolFile/NativePDB/globals-bss.cpp (725 of 1232) UNSUPPORTED: lldb-api :: commands/expression/import-std-module/vector-of-vectors/TestVectorOfVectorsFromStdModule.py (726 of 1232) PASS: lldb-api :: commands/frame/diagnose/virtual-method-call/TestDiagnoseDereferenceVirtualMethodCall.py (727 of 1232) XFAIL: lldb-shell :: Register/x86-mm-xmm-read.test (728 of 1232) PASS: lldb-api :: functionalities/gdb_remote_client/TestNoWatchpointSupportInfo.py (729 of 1232) PASS: lldb-api :: commands/watchpoints/watchpoint_commands/command/TestWatchpointCommandLLDB.py (730 of 1232) PASS: lldb-api :: functionalities/abbreviation/TestCommonShortSpellings.py (731 of 1232) UNSUPPORTED: lldb-shell :: Driver/LocalLLDBInit.test (732 of 1232) UNSUPPORTED: lldb-shell :: ScriptInterpreter/Lua/watchpoint_callback.test (733 of 1232) PASS: lldb-api :: functionalities/thread/concurrent_events/TestConcurrentNWatchNBreak.py (734 of 1232) PASS: lldb-api :: lang/objc/foundation/TestObjCMethods2.py (735 of 1232) PASS: lldb-api :: functionalities/gdb_remote_client/TestQemuAArch64TargetXml.py (736 of 1232) PASS: lldb-api :: lang/objc/objc-ivar-protocols/TestIvarProtocols.py (737 of 1232) UNSUPPORTED: lldb-shell :: Driver/TestFile.test (738 of 1232) PASS: lldb-shell :: Driver/TestProcessAttach.test (739 of 1232) PASS: lldb-shell :: SymbolFile/DWARF/deterministic-build.cpp (740 of 1232) PASS: lldb-api :: lang/cpp/operator-overload/TestOperatorOverload.py (741 of 1232) PASS: lldb-api :: functionalities/data-formatter/data-formatter-objc/TestDataFormatterObjCNSURL.py (742 of 1232) PASS: lldb-api :: lang/cpp/inlines/TestInlines.py (743 of 1232) UNSUPPORTED: lldb-api :: functionalities/thread/create_during_step/TestCreateDuringStep.py (744 of 1232) UNSUPPORTED: lldb-shell :: Reproducer/TestDriverOptions.test (745 of 1232) PASS: lldb-shell :: Breakpoint/ppc64-localentry.test (746 of 1232) PASS: lldb-api :: functionalities/tail_call_frames/thread_step_out_message/TestArtificialFrameStepOutMessage.py (747 of 1232) PASS: lldb-api :: functionalities/inline-stepping/TestInlineStepping.py (748 of 1232) PASS: lldb-api :: lang/cpp/class_types/TestClassTypes.py (749 of 1232) PASS: lldb-api :: functionalities/tail_call_frames/disambiguate_paths_to_common_sink/TestDisambiguatePathsToCommonSink.py (750 of 1232) PASS: lldb-api :: commands/expression/rdar44436068/Test128BitsInteger.py (751 of 1232) PASS: lldb-api :: commands/expression/ignore-artificial-constructors/TestIgnoreArtificialConstructors.py (752 of 1232) PASS: lldb-shell :: SymbolFile/DWARF/find-function-regex.cpp (753 of 1232) PASS: lldb-api :: lang/cpp/modules-import/TestCXXModulesImport.py (754 of 1232) PASS: lldb-api :: lang/cpp/extern_c/TestExternCSymbols.py (755 of 1232) PASS: lldb-api :: functionalities/thread/ignore_suspended/TestIgnoreSuspendedThread.py (756 of 1232) UNSUPPORTED: lldb-shell :: SymbolFile/PDB/udt-layout.test (757 of 1232) PASS: lldb-shell :: ObjectFile/MachO/subsections.yaml (758 of 1232) PASS: lldb-api :: functionalities/data-formatter/data-formatter-stl/libcxx/bitset/TestDataFormatterLibcxxBitset.py (759 of 1232) PASS: lldb-api :: functionalities/data-formatter/data-formatter-objc/TestDataFormatterObjCPlain.py (760 of 1232) PASS: lldb-api :: functionalities/gdb_remote_client/TestRecognizeBreakpoint.py (761 of 1232) PASS: lldb-shell :: BuildScript/modes.test (762 of 1232) PASS: lldb-api :: macosx/DBGSourcePathRemapping/TestDSYMSourcePathRemapping.py (763 of 1232) PASS: lldb-api :: functionalities/postmortem/wow64_minidump/TestWow64MiniDump.py (764 of 1232) UNSUPPORTED: lldb-api :: tools/lldb-server/TestAppleSimulatorOSType.py (765 of 1232) PASS: lldb-shell :: SymbolFile/DWARF/dwarf5_locations.s (766 of 1232) UNSUPPORTED: lldb-api :: iohandler/resize/TestIOHandlerResizeNoEditline.py (767 of 1232) PASS: lldb-api :: functionalities/plugins/python_os_plugin/stepping_plugin_threads/TestOSPluginStepping.py (768 of 1232) PASS: lldb-shell :: ObjectFile/ELF/base-address.yaml (769 of 1232) PASS: lldb-api :: functionalities/thread/thread_specific_break/TestThreadSpecificBreakpoint.py (770 of 1232) UNSUPPORTED: lldb-shell :: Register/x86-64-zmm-read.test (771 of 1232) UNSUPPORTED: lldb-shell :: Reproducer/TestReuseDirectory.test (772 of 1232) PASS: lldb-shell :: SymbolFile/DWARF/DW_OP_piece-struct.s (773 of 1232) PASS: lldb-api :: lang/objc/objc-foundation-dictionary-empty/TestNSDictionary0.py (774 of 1232) PASS: lldb-shell :: Quit/TestQuitExitCode0.test (775 of 1232) PASS: lldb-api :: functionalities/data-formatter/data-formatter-objc/TestDataFormatterObjCNSContainer.py (776 of 1232) PASS: lldb-api :: lang/cpp/stl/TestSTL.py (777 of 1232) UNSUPPORTED: lldb-shell :: ScriptInterpreter/Lua/lua-python.test (778 of 1232) UNSUPPORTED: lldb-api :: functionalities/inferior-changed/TestInferiorChanged.py (779 of 1232) PASS: lldb-api :: functionalities/breakpoint/breakpoint_by_line_and_column/TestBreakpointByLineAndColumn.py (780 of 1232) UNSUPPORTED: lldb-api :: commands/watchpoints/hello_watchlocation/TestWatchLocation.py (781 of 1232) UNSUPPORTED: lldb-api :: functionalities/thread/state/TestThreadStates.py (782 of 1232) PASS: lldb-api :: functionalities/thread/step_until/TestStepUntil.py (783 of 1232) PASS: lldb-api :: lang/cpp/unsigned_types/TestUnsignedTypes.py (784 of 1232) PASS: lldb-api :: lang/objc/modules-hash-mismatch/TestClangModulesHashMismatch.py (785 of 1232) PASS: lldb-api :: commands/command/invalid-args/TestInvalidArgsCommand.py (786 of 1232) PASS: lldb-api :: api/multiple-debuggers/TestMultipleDebuggers.py (787 of 1232) PASS: lldb-api :: functionalities/thread/concurrent_events/TestConcurrentTwoBreakpointsOneWatchpoint.py (788 of 1232) PASS: lldb-api :: functionalities/data-formatter/data-formatter-stl/libcxx/iterator/TestDataFormatterLibccIterator.py (789 of 1232) UNSUPPORTED: lldb-shell :: Quit/TestQuitExitCode-30.test (790 of 1232) PASS: lldb-api :: python_api/symbol-context/two-files/TestSymbolContextTwoFiles.py (791 of 1232) PASS: lldb-api :: commands/watchpoints/step_over_watchpoint/TestStepOverWatchpoint.py (792 of 1232) PASS: lldb-api :: lang/c/enum_types/TestEnumTypes.py (793 of 1232) UNSUPPORTED: lldb-shell :: SymbolFile/NativePDB/break-by-function.cpp (794 of 1232) PASS: lldb-shell :: SymbolFile/DWARF/dir-separator-posix.s (795 of 1232) PASS: lldb-api :: functionalities/thread/create_after_attach/TestCreateAfterAttach.py (796 of 1232) PASS: lldb-api :: functionalities/thread/crash_during_step/TestCrashDuringStep.py (797 of 1232) UNSUPPORTED: lldb-api :: functionalities/deleted-executable/TestDeletedExecutable.py (798 of 1232) PASS: lldb-api :: types/TestRecursiveTypes.py (799 of 1232) PASS: lldb-shell :: ObjectFile/PECOFF/sections.yaml (800 of 1232) PASS: lldb-shell :: SymbolFile/DWARF/childless-compile-unit.s (801 of 1232) PASS: lldb-api :: functionalities/breakpoint/breakpoint_options/TestBreakpointOptions.py (802 of 1232) PASS: lldb-api :: functionalities/data-formatter/typedef_array/TestTypedefArray.py (803 of 1232) PASS: lldb-api :: macosx/order/TestOrderFile.py (804 of 1232) PASS: lldb-api :: functionalities/data-formatter/summary-string-onfail/Test-rdar-9974002.py (805 of 1232) UNSUPPORTED: lldb-api :: functionalities/tty/TestTerminal.py (806 of 1232) UNSUPPORTED: lldb-shell :: SymbolFile/PDB/variables-locations.test (807 of 1232) PASS: lldb-shell :: SymbolFile/DWARF/parallel-indexing-stress.s (808 of 1232) PASS: lldb-api :: sample_test/TestSampleInlineTest.py (809 of 1232) PASS: lldb-api :: functionalities/gdb_remote_client/TestStopPCs.py (810 of 1232) PASS: lldb-api :: api/multiple-targets/TestMultipleTargets.py (811 of 1232) UNSUPPORTED: lldb-api :: functionalities/thread/multi_break/TestMultipleBreakpoints.py (812 of 1232) PASS: lldb-api :: commands/expression/import_builtin_fileid/TestImportBuiltinFileID.py (813 of 1232) UNSUPPORTED: lldb-api :: commands/process/attach-resume/TestAttachResume.py (814 of 1232) UNSUPPORTED: lldb-api :: commands/register/register/intel_xtended_registers/mpx_offset_intersection/TestMPXOffsetIntersection.py (815 of 1232) PASS: lldb-shell :: Driver/TestCommands.test (816 of 1232) PASS: lldb-api :: lang/objc/foundation/TestObjectDescriptionAPI.py (817 of 1232) PASS: lldb-shell :: SymbolFile/DWARF/dwp-separate-debug-file.cpp (818 of 1232) UNSUPPORTED: lldb-api :: functionalities/darwin_log/filter/regex/subsystem/TestDarwinLogFilterRegexSubsystem.py (819 of 1232) PASS: lldb-api :: commands/watchpoints/hello_watchpoint/TestMyFirstWatchpoint.py (820 of 1232) PASS: lldb-api :: functionalities/thread/concurrent_events/TestConcurrentTwoBreakpointsOneSignal.py (821 of 1232) PASS: lldb-api :: functionalities/unwind/zeroth_frame/TestZerothFrame.py (822 of 1232) UNSUPPORTED: lldb-api :: tools/lldb-server/libraries-svr4/TestGdbRemoteLibrariesSvr4Support.py (823 of 1232) PASS: lldb-api :: functionalities/thread/concurrent_events/TestConcurrentSignalDelayWatch.py (824 of 1232) PASS: lldb-api :: lang/cpp/subst_template_type_param/TestSubstTemplateTypeParam.py (825 of 1232) PASS: lldb-api :: functionalities/thread/backtrace_limit/TestBacktraceLimit.py (826 of 1232) UNSUPPORTED: lldb-shell :: SymbolFile/PDB/function-level-linking.test (827 of 1232) PASS: lldb-api :: commands/expression/dont_allow_jit/TestAllowJIT.py (828 of 1232) PASS: lldb-shell :: SymbolFile/symbol-binding.test (829 of 1232) UNSUPPORTED: lldb-api :: commands/expression/import-std-module/forward_list-dbg-info-content/TestDbgInfoContentForwardListFromStdModule.py (830 of 1232) PASS: lldb-api :: lang/cpp/class_types/TestClassTypesDisassembly.py (831 of 1232) PASS: lldb-api :: lang/objc/rdar-10967107/TestRdar10967107.py (832 of 1232) PASS: lldb-api :: functionalities/memory/cache/TestMemoryCache.py (833 of 1232) PASS: lldb-api :: lang/c/forward/TestForwardDeclaration.py (834 of 1232) PASS: lldb-api :: commands/expression/test/TestExprs2.py (835 of 1232) PASS: lldb-shell :: SymbolFile/DWARF/dwarf5-index-is-used.cpp (836 of 1232) PASS: lldb-api :: functionalities/dlopen_other_executable/TestDlopenOtherExecutable.py (837 of 1232) PASS: lldb-api :: commands/target/stop-hook/disable/TestTargetStopHookDisable.py (838 of 1232) UNSUPPORTED: lldb-shell :: Unwind/unwind-plan-dwarf-dump.test (839 of 1232) UNSUPPORTED: lldb-api :: commands/watchpoints/multi_watchpoint_slots/TestWatchpointMultipleSlots.py (840 of 1232) PASS: lldb-api :: functionalities/thread/thread_exit/TestThreadExit.py (841 of 1232) PASS: lldb-api :: commands/expression/namespace_local_var_same_name_cpp_and_c/TestNamespaceLocalVarSameNameCppAndC.py (842 of 1232) UNSUPPORTED: lldb-shell :: SymbolFile/NativePDB/local-variables.cpp (843 of 1232) PASS: lldb-api :: functionalities/breakpoint/auto_continue/TestBreakpointAutoContinue.py (844 of 1232) PASS: lldb-api :: lang/cpp/covariant-return-types/TestCovariantReturnTypes.py (845 of 1232) PASS: lldb-api :: functionalities/thread/concurrent_events/TestConcurrentTwoWatchpointsOneBreakpoint.py (846 of 1232) UNSUPPORTED: lldb-api :: functionalities/longjmp/TestLongjmp.py (847 of 1232) PASS: lldb-api :: functionalities/tail_call_frames/thread_step_out_or_return/TestSteppingOutWithArtificialFrames.py (848 of 1232) PASS: lldb-api :: lang/objc/foundation/TestSymbolTable.py (849 of 1232) PASS: lldb-api :: python_api/value/linked_list/TestValueAPILinkedList.py (850 of 1232) UNSUPPORTED: lldb-shell :: SymbolFile/NativePDB/function-types-classes.cpp (851 of 1232) PASS: lldb-api :: functionalities/non-overlapping-index-variable-i/TestIndexVariable.py (852 of 1232) UNSUPPORTED: lldb-shell :: ScriptInterpreter/Lua/io.test (853 of 1232) UNSUPPORTED: lldb-api :: benchmarks/libcxxmap/TestBenchmarkLibcxxMap.py (854 of 1232) PASS: lldb-api :: functionalities/show_location/TestShowLocationDwarf5.py (855 of 1232) PASS: lldb-api :: functionalities/thread/concurrent_events/TestConcurrentSignalNWatchNBreak.py (856 of 1232) PASS: lldb-api :: functionalities/gdb_remote_client/TestJLink6Armv7RegisterDefinition.py (857 of 1232) PASS: lldb-api :: python_api/sblaunchinfo/TestSBLaunchInfo.py (858 of 1232) PASS: lldb-api :: functionalities/tsan/global_location/TestTsanGlobalLocation.py (859 of 1232) PASS: lldb-api :: functionalities/thread/concurrent_events/TestConcurrentWatchBreakDelay.py (860 of 1232) PASS: lldb-shell :: Minidump/fb-dump.test (861 of 1232) PASS: lldb-api :: functionalities/multidebugger_commands/TestMultipleDebuggersCommands.py (862 of 1232) PASS: lldb-api :: lang/objc/objc-struct-return/TestObjCStructReturn.py (863 of 1232) PASS: lldb-api :: sanity/TestSettingSkipping.py (864 of 1232) UNSUPPORTED: lldb-shell :: Driver/TestHelp.test (865 of 1232) PASS: lldb-shell :: SymbolFile/DWARF/find-method.cpp (866 of 1232) UNSUPPORTED: lldb-api :: commands/expression/import-std-module/deque-basic/TestDequeFromStdModule.py (867 of 1232) PASS: lldb-shell :: ObjectFile/MachO/symtab.yaml (868 of 1232) PASS: lldb-api :: functionalities/data-formatter/data-formatter-objc/nsindexpath/TestDataFormatterNSIndexPath.py (869 of 1232) PASS: lldb-api :: functionalities/process_crash_info/TestProcessCrashInfo.py (870 of 1232) UNSUPPORTED: lldb-api :: commands/expression/macros/TestMacros.py (871 of 1232) PASS: lldb-shell :: SymbolFile/DWARF/debug-types-dwo-cross-reference.cpp (872 of 1232) PASS: lldb-shell :: SymbolFile/DWARF/win-i386-line-table.s (873 of 1232) PASS: lldb-api :: lang/c/tls_globals/TestTlsGlobals.py (874 of 1232) PASS: lldb-shell :: ObjectFile/PECOFF/disassemble-thumb.yaml (875 of 1232) PASS: lldb-api :: functionalities/thread/step_out/TestThreadStepOut.py (876 of 1232) PASS: lldb-api :: lang/objc/objc-optimized/TestObjcOptimized.py (877 of 1232) PASS: lldb-api :: functionalities/data-formatter/dump_dynamic/TestDumpDynamic.py (878 of 1232) PASS: lldb-api :: functionalities/memory/find/TestMemoryFind.py (879 of 1232) PASS: lldb-api :: iohandler/autosuggestion/TestAutosuggestion.py (880 of 1232) UNSUPPORTED: lldb-api :: macosx/simulator/TestSimulatorPlatform.py (881 of 1232) PASS: lldb-api :: functionalities/tail_call_frames/unambiguous_sequence/TestUnambiguousTailCalls.py (882 of 1232) UNSUPPORTED: lldb-shell :: SymbolFile/NativePDB/ast-methods.cpp (883 of 1232) PASS: lldb-api :: functionalities/data-formatter/data-formatter-stl/libcxx/atomic/TestLibCxxAtomic.py (884 of 1232) PASS: lldb-shell :: Breakpoint/debug_addrx.test (885 of 1232) PASS: lldb-api :: functionalities/breakpoint/breakpoint_command/TestBreakpointCommand.py (886 of 1232) PASS: lldb-shell :: Minidump/breakpad-symbols.test (887 of 1232) PASS: lldb-api :: functionalities/memory/read/TestMemoryRead.py (888 of 1232) UNSUPPORTED: lldb-shell :: Breakpoint/case-insensitive.test (889 of 1232) PASS: lldb-shell :: Commands/command-disassemble-process.yaml (890 of 1232) PASS: lldb-api :: commands/command/script/import/rdar-12586188/TestRdar12586188.py (891 of 1232) PASS: lldb-api :: lang/cpp/nsimport/TestCppNsImport.py (892 of 1232) PASS: lldb-api :: commands/breakpoint/set/func-regex/TestBreakpointRegexError.py (893 of 1232) PASS: lldb-api :: functionalities/gdb_remote_client/TestTargetXMLArch.py (894 of 1232) PASS: lldb-api :: commands/target/stop-hook/enable/TestTargetStopHookEnable.py (895 of 1232) PASS: lldb-shell :: Unwind/eh-frame-dwarf-unwind.test (896 of 1232) UNSUPPORTED: lldb-api :: tools/lldb-vscode/completions/TestVSCode_completions.py (897 of 1232) UNSUPPORTED: lldb-shell :: Register/x86-64-ymm16-read.test (898 of 1232) UNSUPPORTED: lldb-shell :: ExecControl/StopHook/stop-hook-threads.test (899 of 1232) PASS: lldb-shell :: ObjectFile/Breakpad/breakpad-identification.test (900 of 1232) PASS: lldb-shell :: Unwind/thread-step-out-ret-addr-check.test (901 of 1232) PASS: lldb-api :: python_api/frame/get-variables/TestGetVariables.py (902 of 1232) PASS: lldb-api :: functionalities/breakpoint/breakpoint_language/TestBreakpointLanguage.py (903 of 1232) PASS: lldb-api :: functionalities/pointer_num_children/TestPointerNumChildren.py (904 of 1232) PASS: lldb-api :: python_api/get-value-32bit-int/TestGetValue32BitInt.py (905 of 1232) PASS: lldb-api :: lang/cpp/function-qualifiers/TestCppFunctionQualifiers.py (906 of 1232) UNSUPPORTED: lldb-api :: tools/lldb-vscode/attach/TestVSCode_attach.py (907 of 1232) PASS: lldb-api :: functionalities/breakpoint/address_breakpoints/TestBadAddressBreakpoints.py (908 of 1232) PASS: lldb-api :: lang/cpp/namespace/TestNamespace.py (909 of 1232) PASS: lldb-shell :: SymbolFile/DWARF/debug_rnglists.s (910 of 1232) PASS: lldb-api :: commands/expression/rdar42038760/TestScalarURem.py (911 of 1232) PASS: lldb-api :: functionalities/breakpoint/address_breakpoints/TestAddressBreakpoints.py (912 of 1232) PASS: lldb-api :: lang/cpp/auto/TestCPPAuto.py (913 of 1232) PASS: lldb-shell :: Settings/TestSettingsSet.test (914 of 1232) PASS: lldb-shell :: SymbolFile/Breakpad/line-table.test (915 of 1232) PASS: lldb-api :: commands/watchpoints/multiple_hits/TestMultipleHits.py (916 of 1232) PASS: lldb-api :: lang/objcxx/hide-runtime-values/TestObjCXXHideRuntimeValues.py (917 of 1232) UNSUPPORTED: lldb-shell :: SymbolFile/PDB/ast-restore.test (918 of 1232) PASS: lldb-api :: functionalities/data-formatter/data-formatter-smart-array/TestDataFormatterSmartArray.py (919 of 1232) PASS: lldb-api :: functionalities/data-formatter/data-formatter-cpp/TestDataFormatterCpp.py (920 of 1232) UNSUPPORTED: lldb-api :: tools/lldb-vscode/variables/TestVSCode_variables.py (921 of 1232) PASS: lldb-shell :: ObjectFile/PECOFF/basic-info-arm.yaml (922 of 1232) PASS: lldb-api :: functionalities/data-formatter/refpointer-recursion/TestDataFormatterRefPtrRecursion.py (923 of 1232) PASS: lldb-api :: lang/cpp/call-function/TestCallCPPFunction.py (924 of 1232) PASS: lldb-api :: commands/expression/calculator_mode/TestCalculatorMode.py (925 of 1232) PASS: lldb-shell :: ObjectFile/ELF/section-permissions.yaml (926 of 1232) PASS: lldb-api :: commands/expression/call-function/TestCallUserDefinedFunction.py (927 of 1232) UNSUPPORTED: lldb-api :: functionalities/reproducers/attach/TestReproducerAttach.py (928 of 1232) PASS: lldb-shell :: SymbolFile/DWARF/find-method-local-struct.cpp (929 of 1232) UNSUPPORTED: lldb-shell :: Register/x86-64-xmm16-write.test (930 of 1232) PASS: lldb-api :: tools/lldb-server/TestLldbGdbServer.py (931 of 1232) PASS: lldb-api :: functionalities/postmortem/mach-core/TestMachCore.py (932 of 1232) PASS: lldb-api :: functionalities/conditional_break/TestConditionalBreak.py (933 of 1232) PASS: lldb-api :: lang/objc/real-definition/TestRealDefinition.py (934 of 1232) PASS: lldb-shell :: SymbolFile/DWARF/dwp-debug-types.s (935 of 1232) PASS: lldb-shell :: Settings/TestStopCommandSourceOnError.test (936 of 1232) PASS: lldb-api :: lang/objc/self/TestObjCSelf.py (937 of 1232) PASS: lldb-api :: types/TestDoubleTypes.py (938 of 1232) PASS: lldb-api :: lang/cpp/llvm-style/TestLLVMStyle.py (939 of 1232) PASS: lldb-shell :: ObjectFile/ELF/PT_LOAD-overlap.yaml (940 of 1232) PASS: lldb-api :: commands/expression/persistent_types/TestPersistentTypes.py (941 of 1232) PASS: lldb-api :: lang/c/bitfields/TestBitfields.py (942 of 1232) PASS: lldb-api :: functionalities/breakpoint/dummy_target_breakpoints/TestBreakpointsWithNoTargets.py (943 of 1232) PASS: lldb-api :: functionalities/data-formatter/array_typedef/TestArrayTypedef.py (944 of 1232) PASS: lldb-shell :: Minidump/disassemble-no-module.yaml (945 of 1232) PASS: lldb-api :: commands/quit/TestQuit.py (946 of 1232) PASS: lldb-shell :: SymbolFile/DWARF/debug_ranges.s (947 of 1232) UNSUPPORTED: lldb-api :: tools/lldb-vscode/disconnect/TestVSCode_disconnect.py (948 of 1232) PASS: lldb-api :: commands/watchpoints/watchpoint_set_command/TestWatchLocationWithWatchSet.py (949 of 1232) UNSUPPORTED: lldb-shell :: SymbolFile/NativePDB/typedefs.cpp (950 of 1232) PASS: lldb-api :: functionalities/data-formatter/data-formatter-synthval/TestDataFormatterSynthVal.py (951 of 1232) UNSUPPORTED: lldb-shell :: SymbolFile/NativePDB/ast-functions-msvc.cpp (952 of 1232) UNSUPPORTED: lldb-api :: functionalities/breakpoint/hardware_breakpoints/write_memory_with_hw_breakpoint/TestWriteMemoryWithHWBreakpoint.py (953 of 1232) PASS: lldb-api :: functionalities/data-formatter/nsarraysynth/TestNSArraySynthetic.py (954 of 1232) PASS: lldb-api :: lang/c/modules/TestCModules.py (955 of 1232) UNSUPPORTED: lldb-api :: tools/lldb-vscode/step/TestVSCode_step.py (956 of 1232) PASS: lldb-api :: lang/c/step-target/TestStepTarget.py (957 of 1232) UNSUPPORTED: lldb-api :: lang/objc/rdar-12408181/TestRdar12408181.py (958 of 1232) PASS: lldb-api :: commands/version/TestVersion.py (959 of 1232) PASS: lldb-api :: functionalities/data-formatter/data-formatter-named-summaries/TestDataFormatterNamedSummaries.py (960 of 1232) UNSUPPORTED: lldb-shell :: SymbolFile/PDB/typedefs.test (961 of 1232) PASS: lldb-api :: functionalities/gdb_remote_client/TestGDBRemoteDiskFileCompletion.py (962 of 1232) PASS: lldb-api :: lang/c/global_variables/TestGlobalVariables.py (963 of 1232) PASS: lldb-api :: types/TestIntegerType.py (964 of 1232) PASS: lldb-shell :: Quit/TestQuitExitCodeTooManyArgs.test (965 of 1232) PASS: lldb-api :: lang/c/find_struct_type/TestFindStructTypes.py (966 of 1232) UNSUPPORTED: lldb-api :: functionalities/data-formatter/data-formatter-stl/libstdcpp/unique_ptr/TestDataFormatterStdUniquePtr.py (967 of 1232) PASS: lldb-api :: functionalities/data-formatter/nssetsynth/TestNSSetSynthetic.py (968 of 1232) UNSUPPORTED: lldb-shell :: Register/x86-zmm-write.test (969 of 1232) PASS: lldb-api :: tools/lldb-server/commandline/TestStubReverseConnect.py (970 of 1232) PASS: lldb-api :: commands/expression/xvalue/TestXValuePrinting.py (971 of 1232) PASS: lldb-api :: commands/expression/test/TestExprs.py (972 of 1232) FAIL: lldb-api :: commands/gui/basicdebug/TestGuiBasicDebug.py (973 of 1232) ******************** TEST 'lldb-api :: commands/gui/basicdebug/TestGuiBasicDebug.py' FAILED ******************** Script: -- /usr/local/Frameworks/Python.framework/Versions/3.7/bin/python3.7 /Users/buildslave/jenkins/workspace/lldb-cmake-reproducers/llvm-project/lldb/test/API/dotest.py -s /Users/buildslave/jenkins/workspace/lldb-cmake-reproducers/lldb-build/lldb-test-traces -S nm -u CXXFLAGS -u CFLAGS --codesign-identity lldb_codesign --server /Users/buildslave/jenkins/workspace/lldb-cmake-reproducers/lldb-build/./bin/debugserver --arch x86_64 --build-dir /Users/buildslave/jenkins/workspace/lldb-cmake-reproducers/lldb-build/lldb-test-build.noindex -s=/Users/buildslave/jenkins/workspace/lldb-cmake-reproducers/test/logs -t --env TERM=vt100 --env LLVM_LIBS_DIR=/Users/buildslave/jenkins/workspace/lldb-cmake-reproducers/lldb-build/./lib --arch x86_64 --build-dir /Users/buildslave/jenkins/workspace/lldb-cmake-reproducers/lldb-build/lldb-test-build.noindex --lldb-module-cache-dir /Users/buildslave/jenkins/workspace/lldb-cmake-reproducers/lldb-build/lldb-test-build.noindex/module-cache-lldb/lldb-api --clang-module-cache-dir /Users/buildslave/jenkins/workspace/lldb-cmake-reproducers/lldb-build/lldb-test-build.noindex/module-cache-clang/lldb-api --executable /Users/buildslave/jenkins/workspace/lldb-cmake-reproducers/lldb-build/./bin/lldb --compiler /Users/buildslave/jenkins/workspace/lldb-cmake-reproducers/lldb-build/./bin/clang --dsymutil /Users/buildslave/jenkins/workspace/lldb-cmake-reproducers/lldb-build/./bin/dsymutil --filecheck /Users/buildslave/jenkins/workspace/lldb-cmake-reproducers/lldb-build/./bin/FileCheck --yaml2obj /Users/buildslave/jenkins/workspace/lldb-cmake-reproducers/lldb-build/./bin/yaml2obj --lldb-libs-dir /Users/buildslave/jenkins/workspace/lldb-cmake-reproducers/lldb-build/./lib --skip-category=lldb-vscode --skip-category=std-module /Users/buildslave/jenkins/workspace/lldb-cmake-reproducers/llvm-project/lldb/test/API/commands/gui/basicdebug -p TestGuiBasicDebug.py --capture-path /Users/buildslave/jenkins/workspace/lldb-cmake-reproducers/lldb-build/lldb-test-build.noindex/reproducers/TestGuiBasicDebug.py -- Exit Code: 1

Hide Details

Command Output (stdout): -- lldb version 12.0.99 clang revision ed229132f1c4ea2ba0644fc345d8279e47a00565 llvm revision ed229132f1c4ea2ba0644fc345d8279e47a00565 (lldb) settings clear -all (lldb) settings set symbols.enable-external-lookup false (lldb) settings set target.inherit-tcc true (lldb) settings set target.auto-apply-fixits false (lldb) settings set plugin.process.gdb-remote.packet-timeout 60 (lldb) settings set symbols.clang-modules-cache-path "/Users/buildslave/jenkins/workspace/lldb-cmake-reproducers/lldb-build/lldb-test-build.noindex/module-cache-lldb/lldb-api" (lldb) settings set use-color false (lldb) setting set target.prefer-dynamic-value no-dynamic-values (lldb) target create "/Users/buildslave/jenkins/workspace/lldb-cmake-reproducers/lldb-build/lldb-test-build.noindex/commands/gui/basicdebug/TestGuiBasicDebug.test_gui/a.out" Current executable set to '/Users/buildslave/jenkins/workspace/lldb-cmake-reproducers/lldb-build/lldb-test-build.noindex/commands/gui/basicdebug/TestGuiBasicDebug.test_gui/a.out' (x86_64). (lldb) br set -f main.c -p "// Break here" br set -f main.c -p "// Break here" Breakpoint 1: where = a.out`main + 22 at main.c:4:3, address = 0x0000000100000f86 (lldb) run run Process 91788 launched: '/Users/buildslave/jenkins/workspace/lldb-cmake-reproducers/lldb-build/lldb-test-build.noindex/commands/gui/basicdebug/TestGuiBasicDebug.test_gui/a.out' (x86_64) Process 91788 stopped * thread #1, queue = 'com.apple.main-thread', stop reason = breakpoint 1.1 frame #0: 0x0000000100000f86 a.out`main(argc=1, argv=0x00007ffeefbff870) at main.c:4:3 1 extern int func(); 2 3 int main(int argc, char **argv) { -> 4 func(); // Break here ^ 5 func(); // Second 6 return 0; 7 } (lldb) gui sgui (B)0[?7h[?1h=| LLDB (F1) | Target (F2) | Process (F3) | Thread (F4) | View (F5) | Help (F6) | lqq<Sources>qqqqqqqqqqqqqqqqqqqqqqqqqqqqqqqqqqqqqqqqqqqqqqqqqqqqqqqqqqqqqqqqqqqqqqqqqqqqqqqqqqqqqqqqqqqqqqqqqqqqqqqqqqqqqqqqqqqqqqqqqqqqqqqqqqqqqqqqqqqqqqqqqqqqqqqqqqqqqqqqqqqqqqqqqqqqqqqqqqqqqqqqqqqqqqqqqqqqqqqqqqqqqqqqqqqqqqqqqqqqqqqqqqqqqqqqqqqqqqqqqqqqqqqqqqqqqqqqqqqqqqqqqqqqqqqqqqqqqqqqqqqqqqqqqqqqqqqqqqqqqqqqqqqqqqqqqqqqqqqqqqqqqqqqqqqqqqqqqqqqqqqqqqqqqqqqqqqqqqqqqqqqqqqqqqqqqqqqqqqqqqqqqqqklqq<Threads>qqqqqqqqqqqqqqqqqqqqqqqqqqqqqqqqqqqqqqqqqqqqqqqqqqqqqqqqqqqqqqqqqqqqqqqqqqqqqqqqqqqqqqqkx a.out`main xx `qprocess 91788xx 1 x extern int func();xxxx 2 xxxxx 3 x int main(int argc, char **argv) {xxxx 4 x` func(); // Break here <<< Thread 1: breakpoint 1.1xxxx 5 x func(); // Secondxxxx 6 x return 0;xxxx 7 x }xxxx 8 xxxxxxxxxxxxxxxxxxxxxxxxxxxxxxxxxxxxxxxxxxxxxxxxxxxxxxxxxxxxxxxxxxxxxxxxxxxxxxxxxxxxxxxxxxxxxxxxxxxxxxxxxxxxxxxxxxxxxxxxxxxxxlqq<Help>qqqqqqqqqqqqqqqqqqqqqqqqqqqqqqqqqqqqqqqqqqqqqqqqqqqqqqqqqqqqqqqqqqqqqqqqqqqqqqqkxxxxx Welcome to the LLDB curses GUI.xxxxxxxxxxxx Press the TAB key to change the selected view.xxxxxx Each view has its own keyboard shortcuts, press 'h' to open a dialog to display them. xxxxxxxxxxxx Common key bindings for all views:xxxxxxxxxxxxtab - Select next viewxxxxxx back-tab key - Select previous viewxxxxxxh - Show help dialog with view specific key bindingsxxxxxx, - Page upxxxxxx. - Page downxxxxxxup - Select previousxxxxxxdown - Select nextxxxxxxleft - Unexpand or select parentxxxxxxright - Expandxxxxxx page-up - Page upxxxxxx page-down - Page downxxxxxmqqqqqqqqqqqqqqqqqqqqqqqqqqqqqqqqqqqqqqqqqqqqqqqqqqqqqqqqqqqqqq[Press any key to exit]qqjxxxxxxxxxxxxxxxxxxxxxxxxxxxxxxxmqqqqqqqqqqqqqqqqqqqqqqqqqqqqqqqqqqqqqqqqqqqqqqqqqqqqqqqqqqqqqqqqqqqqqqqqqqqqqqqqqqqqqqqqqqqqqqqqqqqqqqqqqqqqqqqqqqqqqqqqqqqqqqqqqqqqqqqqqqqqqqqqqqqqqqqqqqqqqqqqqqqqqqqqqqqqqqqqqqqqqqqqqqqqqqqqqqqqqqqqqqqqqqqqqqqqqqqqqqqqqqqqqqqqqqqqqqqqqqqqqqqqqqqqqqqqqqqqqqqqqqqqqqqqqqqqqqqqqqqqqqqqqqqqqqqqqqqqqqqqqqqqqqqqqqqqqqqqqqqqqqqqqqqqqqqqqqqqqqqqqqqqqqqqqqqqqqqqqqqqqqqqqqqqqqqqqqqqqqqqqqqqqqqqqqqqqqqqqqjxxlqq<Variables>qqqqqqqqqqqqqqqqqqqqqqqqqqqqqqqqqqqqqqqqqqqqqqqqqqqqqqqqqqqqqqqqqqqqqqqqqqqqqqqqqqqqqqqqqqqqqqqqqqqqqqqqqqqqqqqqqqqqqqqqqqqqqqqqqqqqqqqqqqqqqqqqqqqqqqqqqqqqqqqqqqqqqqqqqqqqqqqqqqqqqqqqqqqqqqqqqqqqqqqqqqqqqqqqqqqqqqqqqqqqqqqqqqqqqqqqqqqqqqqqqqqqqqqqqqqqqqqqqqqqqqqqqqqqqqqqqqqqqqqqqqqqqqqqqqqqqqqqqqqqqqqqqqqqqqqqqqqqqqqqqqqqqqqqqqqqqqqqqqqqqqqqqqqqqqqqqqqqqqqqqqqqqqqqqqqqqqqqqqqqqqqqqkxxx (int) argc = 1xxxx `q(char **) argv = 0x00007ffeefbff870xxxxxxxxxxxxxxxxxxxxxxxxxxxxxxxxxxxxxxxxxxxxxxxxxxxxxxxxxxxxxxxxxxxxxxxxxxxxxxxxxxxxxxxxxxxxxxxxxxxxxxxxxxxmqqqqqqqqqqqqqqqqqqqqqqqqqqqqqqqqqqqqqqqqqqqqqqqqqqqqqqqqqqqqqqqqqqqqqqqqqqqqqqqqqqqqqqqqqqqqqqqqqqqqqqqqqqqqqqqqqqqqqqqqqqqqqqqqqqqqqqqqqqqqqqqqqqqqqqqqqqqqqqqqqqqqqqqqqqqqqqqqqqqqqqqqqqqqqqqqqqqqqqqqqqqqqqqqqqqqqqqqqqqqqqqqqqqqqqqqqqqqqqqqqqqqqqqqqqqqqqqqqqqqqqqqqqqqqqqqqqqqqqqqqqqqqqqqqqqqqqqqqqqqqqqqqqqqqqqqqqqqqqqqqqqqqqqqqqqqqqqqqqqqqqqqqqqqqqqqqqqqqqqqqqqqqqqqqqqqqqqqqqqqqqqqqqqqqqqqqqqqqqjmqqqqqqqqqqqqqqqqqqqqqqqqqqqqqqqqqqqqqqqqqqqqqqqqqqqqqqqqqqqqqqqqqqqqqqqqqqqqqqqqqqqqqqqqqqqqqqqqqqjProcess: 91788 stopped Thread: 0x23e8b3 Frame: 0 PC = 0x0000000100000f86 lqq<Sources>qqqqqqqqqqqqqqqqqqqqqqqqqqqqqqqqqqqqqqqqqqqqqqqqqqqqqqqqqqqqqqqqqqqqqqqqqqqqqqqqqqqqqqqqqqqqqqqqqqqqqqqqqqqqqqqqqqqqqqqqqqqqqqqqqqqqqqqqqqqqqqqqqqqqqqqqqqqqqqqqqqqqqqqqqqqqqqqqqqqqqqqqqqqqqqqqqqqqqqqqqqqqqqqqqqqqqqqqqqqqqqqqqqqqqqqqqqqqqqqqqqqqqqqqqqqqqqqqqqqqqqqqqqqqqqqqqqqqqqqqqqqqqqqqqqqqqqqqqqqqqqqqqqqqqqqqqqqqqqqqqqqqqqqqqqqqqqqqqqqqqqqqqqqqqqqqqqqqqqqqqqqqqqqqqqqqqqqqqqqqqqqqqqqk xx xx xx xx xx xx xx xx xx xx xx xx xx xx xx xx xx xx xx xx xx xx xx xx xx xx xx xx xx xx xx xx xx xx xx xx xx xx xx x x x  x x  x x  x x x x  x x  x x  x x   x x  x x   x x   x x   x x   x x   x x   x x   x x  x x  x x x xx xx xx xx xx xx xx mqqqqqqqqqqqqqqqqqqqqqqqqqqqqqqqqqqqqqqqqqqqqqqqqqqqqqqqqqqqqqqqqqqqqqqqqqqqqqqqqqqqqqqqqqqqqqqqqqqqqqqqqqqqqqqqqqqqqqqqqqqqqqqqqqqqqqqqqqqqqqqqqqqqqqqqqqqqqqqqqqqqqqqqqqqqqqqqqqqqqqqqqqqqqqqqqqqqqqqqqqqqqqqqqqqqqqqqqqqqqqqqqqqqqqqqqqqqqqqqqqqqqqqqqqqqqqqqqqqqqqqqqqqqqqqqqqqqqqqqqqqqqqqqqqqqqqqqqqqqqqqqqqqqqqqqqqqqqqqqqqqqqqqqqqqqqqqqqqqqqqqqqqqqqqqqqqqqqqqqqqqqqqqqqqqqqqqqqqqqqqqqqqqqqqqqqqqqqqqj runningfunc int func() { ` return 1; // In function <<< Thread 1: step in }  4 x       stoppedThread: 0x23e8b3 Frame: 0 PC = 0x0000000100000fa4umain extern int func();  int main(int argc, char **argv) {  4 x` func(); // Break here 5 x func(); // Second 6 x return 0; 7 x } 8 x(int) argc = 1 `q(char **) argv = 0x00007ffeefbff87018ddfunc int func() { ` return 1; // In function <<< Thread 1: step in }  4 x       0a4f runningmain extern int func();  int main(int argc, char **argv) {  4 x func(); // Break here 5 x` func(); // Second <<< Thread 1: step out 6 x return 0; 7 x } 8 x(int) argc = 1 `q(char **) argv = 0x00007ffeefbff870stoppedThread: 0x23e8b3 Frame: 0 PC = 0x0000000100000f8dsettings set interpreter.prompt-on-quit false quit  running

Hide Details

Hide Details

extern int func();

Hide Details

Hide Details

Hide Details

 func(); // Secondfunc int func() { ` return 1; // In function <<< Thread 1: step in }  4 x       stoppedThread: 0x23e8b3 Frame: 0 PC = 0x0000000100000fa4

Hide Details

Hide Details

Hide Details

 2  running  exited with status = 0libstdcxx tests will not be run because: Don't know how to build with libstdcxx on macosx Skipping following debug info categories: ['dwo']

Hide Details

-- Command Output (stderr): --

Hide Details

Session logs for test failures/errors/unexpected successes will go into directory '/Users/buildslave/jenkins/workspace/lldb-cmake-reproducers/test/logs' Change dir to: /Users/buildslave/jenkins/workspace/lldb-cmake-reproducers/llvm-project/lldb/test/API/commands/gui/basicdebug runCmd: settings clear -all output:

Hide Details

runCmd: settings set symbols.enable-external-lookup false output:

Hide Details

runCmd: settings set target.inherit-tcc true output:

Hide Details

runCmd: settings set target.auto-apply-fixits false output:

Hide Details

runCmd: settings set plugin.process.gdb-remote.packet-timeout 60 output:

Hide Details

runCmd: settings set symbols.clang-modules-cache-path "/Users/buildslave/jenkins/workspace/lldb-cmake-reproducers/lldb-build/lldb-test-build.noindex/module-cache-lldb/lldb-api" output:

Hide Details

runCmd: settings set use-color false output:

Hide Details

runCmd: setting set target.prefer-dynamic-value no-dynamic-values output:

Hide Details

FAIL: LLDB (/Users/buildslave/jenkins/workspace/lldb-cmake-reproducers/lldb-build/bin/clang-x86_64) :: test_gui (TestGuiBasicDebug.TestGuiBasicDebugCommandTest) tearing down the child process....

Hide Details

Restore dir to: /Users/buildslave/jenkins/workspace/lldb-cmake-reproducers/lldb-build/tools/lldb/test ====================================================================== ERROR: test_gui (TestGuiBasicDebug.TestGuiBasicDebugCommandTest) ---------------------------------------------------------------------- Traceback (most recent call last): File "/Users/buildslave/jenkins/workspace/lldb-cmake-reproducers/llvm-project/lldb/third_party/Python/module/pexpect-4.6/pexpect/expect.py", line 111, in expect_loop incoming = spawn.read_nonblocking(spawn.maxread, timeout) File "/Users/buildslave/jenkins/workspace/lldb-cmake-reproducers/llvm-project/lldb/third_party/Python/module/pexpect-4.6/pexpect/pty_spawn.py", line 482, in read_nonblocking raise TIMEOUT('Timeout exceeded.') pexpect.exceptions.TIMEOUT: Timeout exceeded.

Hide Details

During handling of the above exception, another exception occurred:

Hide Details

Traceback (most recent call last): File "/Users/buildslave/jenkins/workspace/lldb-cmake-reproducers/llvm-project/lldb/packages/Python/lldbsuite/test/decorators.py", line 134, in wrapper return func(*args, **kwargs) File "/Users/buildslave/jenkins/workspace/lldb-cmake-reproducers/llvm-project/lldb/packages/Python/lldbsuite/test/decorators.py", line 104, in wrapper func(*args, **kwargs) File "/Users/buildslave/jenkins/workspace/lldb-cmake-reproducers/llvm-project/lldb/test/API/commands/gui/basicdebug/TestGuiBasicDebug.py", line 40, in test_gui self.child.expect("func\(\); // Break here[^\r\n]+<<< Thread 1: step out") File "/Users/buildslave/jenkins/workspace/lldb-cmake-reproducers/llvm-project/lldb/third_party/Python/module/pexpect-4.6/pexpect/spawnbase.py", line 341, in expect timeout, searchwindowsize, async_) File "/Users/buildslave/jenkins/workspace/lldb-cmake-reproducers/llvm-project/lldb/third_party/Python/module/pexpect-4.6/pexpect/spawnbase.py", line 369, in expect_list return exp.expect_loop(timeout) File "/Users/buildslave/jenkins/workspace/lldb-cmake-reproducers/llvm-project/lldb/third_party/Python/module/pexpect-4.6/pexpect/expect.py", line 119, in expect_loop return self.timeout(e) File "/Users/buildslave/jenkins/workspace/lldb-cmake-reproducers/llvm-project/lldb/third_party/Python/module/pexpect-4.6/pexpect/expect.py", line 82, in timeout raise TIMEOUT(msg) pexpect.exceptions.TIMEOUT: Timeout exceeded. <pexpect.pty_spawn.spawn object at 0x113918390> command: /Users/buildslave/jenkins/workspace/lldb-cmake-reproducers/lldb-build/bin/lldb args: ['/Users/buildslave/jenkins/workspace/lldb-cmake-reproducers/lldb-build/bin/lldb', '--no-lldbinit', '--no-use-colors', '-O', 'settings clear -all', '-O', 'settings set symbols.enable-external-lookup false', '-O', 'settings set target.inherit-tcc true', '-O', 'settings set target.auto-apply-fixits false', '-O', 'settings set plugin.process.gdb-remote.packet-timeout 60', '-O', 'settings set symbols.clang-modules-cache-path "/Users/buildslave/jenkins/workspace/lldb-cmake-reproducers/lldb-build/lldb-test-build.noindex/module-cache-lldb/lldb-api"', '-O', 'settings set use-color false', '-O', 'setting set target.prefer-dynamic-value no-dynamic-values', '--file', '/Users/buildslave/jenkins/workspace/lldb-cmake-reproducers/lldb-build/lldb-test-build.noindex/commands/gui/basicdebug/TestGuiBasicDebug.test_gui/a.out'] buffer (last 100 chars): b'07ffeefbff870\x1b[100;19Hstopped\x1b[100;41HThread: 0x23e8b3 Frame: 0 PC = 0x0000000100000f8d\x1b[m\x0f\x1b[H' before (last 100 chars): b'07ffeefbff870\x1b[100;19Hstopped\x1b[100;41HThread: 0x23e8b3 Frame: 0 PC = 0x0000000100000f8d\x1b[m\x0f\x1b[H' after: <class 'pexpect.exceptions.TIMEOUT'> match: None match_index: None exitstatus: None flag_eof: False pid: 91529 child_fd: 7 closed: False timeout: 30 delimiter: <class 'pexpect.exceptions.EOF'> logfile: <_io.BufferedWriter name='<stdout>'> logfile_read: None logfile_send: None maxread: 2000 ignorecase: False searchwindowsize: None delaybeforesend: 0.05 delayafterclose: 0.1 delayafterterminate: 0.1 searcher: searcher_re: 0: re.compile(b'func\\(\\); // Break here[^\r\n]+<<< Thread 1: step out') Config=x86_64-/Users/buildslave/jenkins/workspace/lldb-cmake-reproducers/lldb-build/bin/clang ---------------------------------------------------------------------- Ran 1 test in 61.966s

Hide Details

RESULT: FAILED (0 passes, 0 failures, 1 errors, 0 skipped, 0 expected failures, 0 unexpected successes)

Hide Details

--

Hide Details

******************** UNSUPPORTED: lldb-api :: macosx/version_zero/TestGetVersionZeroVersion.py (974 of 1232) PASS: lldb-api :: functionalities/tail_call_frames/ambiguous_tail_call_seq2/TestAmbiguousTailCallSeq2.py (975 of 1232) PASS: lldb-api :: functionalities/fat_archives/TestFatArchives.py (976 of 1232) PASS: lldb-api :: commands/expression/static-initializers/TestStaticInitializers.py (977 of 1232) PASS: lldb-api :: commands/expression/weak_symbols/TestWeakSymbols.py (978 of 1232) PASS: lldb-api :: functionalities/data-formatter/var-in-aggregate-misuse/TestVarInAggregateMisuse.py (979 of 1232) UNSUPPORTED: lldb-api :: functionalities/thread/thread_specific_break_plus_condition/TestThreadSpecificBpPlusCondition.py (980 of 1232) UNSUPPORTED: lldb-shell :: ObjectFile/ELF/minidebuginfo-no-lzma.yaml (981 of 1232) PASS: lldb-api :: types/TestFloatTypesExpr.py (982 of 1232) PASS: lldb-api :: functionalities/data-formatter/data-formatter-objc/TestDataFormatterObjCKVO.py (983 of 1232) UNSUPPORTED: lldb-shell :: Register/x86-ymm-write.test (984 of 1232) UNSUPPORTED: lldb-api :: benchmarks/turnaround/TestCompileRunToBreakpointTurnaround.py (985 of 1232) PASS: lldb-api :: commands/expression/call-function/TestCallStopAndContinue.py (986 of 1232) PASS: lldb-shell :: ObjectFile/ELF/section-overlap.yaml (987 of 1232) UNSUPPORTED: lldb-shell :: Driver/TestCore.test (988 of 1232) UNSUPPORTED: lldb-shell :: Reproducer/TestHomeDir.test (989 of 1232) PASS: lldb-shell :: Commands/command-backtrace.test (990 of 1232) PASS: lldb-api :: commands/expression/ir-interpreter/TestIRInterpreter.py (991 of 1232) UNSUPPORTED: lldb-api :: commands/expression/import-std-module/pair/TestPairFromStdModule.py (992 of 1232) PASS: lldb-api :: functionalities/tail_call_frames/cross_object/TestCrossObjectTailCalls.py (993 of 1232) PASS: lldb-api :: lang/objc/objc-new-syntax/TestObjCNewSyntaxDictionary.py (994 of 1232) PASS: lldb-api :: lang/c/unions/TestUnionMembers.py (995 of 1232) PASS: lldb-shell :: SymbolFile/Breakpad/stack-cfi-arm.yaml (996 of 1232) PASS: lldb-api :: lang/c/unicode/TestUnicodeSymbols.py (997 of 1232) PASS: lldb-api :: commands/expression/formatters/TestFormatters.py (998 of 1232) PASS: lldb-shell :: SymbolFile/Breakpad/unwind-via-stack-win-no-memory-info.yaml (999 of 1232) UNSUPPORTED: lldb-api :: commands/trace/TestTraceSchema.py (1000 of 1232) UNSUPPORTED: lldb-shell :: Driver/TestPositionalArgs.test (1001 of 1232) UNSUPPORTED: lldb-api :: tools/lldb-server/TestGdbRemote_vContThreads.py (1002 of 1232) UNSUPPORTED: lldb-api :: functionalities/data-formatter/data-formatter-stl/libstdcpp/vbool/TestDataFormatterStdVBool.py (1003 of 1232) PASS: lldb-api :: commands/frame/select/TestFrameSelect.py (1004 of 1232) UNSUPPORTED: lldb-shell :: SymbolFile/DWARF/debug-types-expressions.test (1005 of 1232) PASS: lldb-api :: functionalities/recursion/TestValueObjectRecursion.py (1006 of 1232) PASS: lldb-shell :: ObjectFile/ELF/build-id-case.yaml (1007 of 1232) UNSUPPORTED: lldb-api :: functionalities/breakpoint/breakpoint_set_restart/TestBreakpointSetRestart.py (1008 of 1232) PASS: lldb-api :: lang/objc/direct-dispatch-step/TestObjCDirectDispatchStepping.py (1009 of 1232) PASS: lldb-api :: lang/c/anonymous/TestAnonymous.py (1010 of 1232) PASS: lldb-api :: functionalities/data-formatter/data-formatter-objc/TestDataFormatterObjCExpr.py (1011 of 1232) UNSUPPORTED: lldb-api :: python_api/event/TestEvents.py (1012 of 1232) PASS: lldb-shell :: Breakpoint/implicit_const_form_support.test (1013 of 1232) PASS: lldb-api :: functionalities/data-formatter/format-propagation/TestFormatPropagation.py (1014 of 1232) UNSUPPORTED: lldb-api :: benchmarks/expression/TestExpressionCmd.py (1015 of 1232) PASS: lldb-api :: lang/c/set_values/TestSetValues.py (1016 of 1232) PASS: lldb-api :: lang/objc/objc-new-syntax/TestObjCNewSyntaxLiteral.py (1017 of 1232) PASS: lldb-shell :: ObjectFile/ELF/section-addresses.yaml (1018 of 1232) PASS: lldb-api :: functionalities/limit-debug-info/TestLimitDebugInfo.py (1019 of 1232) PASS: lldb-shell :: SymbolFile/DWARF/debug_ranges_and_rnglists.test (1020 of 1232) UNSUPPORTED: lldb-api :: functionalities/thread/exit_during_expression/TestExitDuringExpression.py (1021 of 1232) PASS: lldb-api :: functionalities/gdb_remote_client/TestGDBRemoteClient.py (1022 of 1232) UNSUPPORTED: lldb-shell :: Register/aarch64-gp-read.test (1023 of 1232) PASS: lldb-api :: lang/c/blocks/TestBlocks.py (1024 of 1232) PASS: lldb-api :: lang/objc/single-entry-dictionary/TestObjCSingleEntryDictionary.py (1025 of 1232) PASS: lldb-api :: functionalities/signal/raise/TestRaise.py (1026 of 1232) PASS: lldb-api :: lang/cpp/multiple-inheritance/TestCppMultipleInheritance.py (1027 of 1232) PASS: lldb-api :: lang/objc/objc-property/TestObjCProperty.py (1028 of 1232) PASS: lldb-api :: lang/c/inlines/TestRedefinitionsInInlines.py (1029 of 1232) PASS: lldb-api :: commands/expression/persist_objc_pointeetype/TestPersistObjCPointeeType.py (1030 of 1232) UNSUPPORTED: lldb-api :: lang/objc/objc-dynamic-value/TestObjCDynamicValue.py (1031 of 1232) UNSUPPORTED: lldb-shell :: Driver/TestError.test (1032 of 1232) PASS: lldb-shell :: SymbolFile/DWARF/find-basic-variable.cpp (1033 of 1232) PASS: lldb-shell :: ScriptInterpreter/None/none.test (1034 of 1232) PASS: lldb-api :: lang/cpp/namespace_definitions/TestNamespaceDefinitions.py (1035 of 1232) UNSUPPORTED: lldb-api :: functionalities/darwin_log/filter/exact_match/subsystem/TestDarwinLogFilterMatchSubsystem.py (1036 of 1232) UNSUPPORTED: lldb-api :: commands/expression/import-std-module/shared_ptr-dbg-info-content/TestSharedPtrDbgInfoContentFromStdModule.py (1037 of 1232) UNSUPPORTED: lldb-shell :: Process/Windows/exception_access_violation.cpp (1038 of 1232) PASS: lldb-shell :: Watchpoint/SetErrorCases.test (1039 of 1232) PASS: lldb-shell :: SymbolFile/DWARF/DW_AT_const_value-bitfields.s (1040 of 1232) PASS: lldb-api :: lang/cpp/namespace_conflicts/TestNamespaceConflicts.py (1041 of 1232) PASS: lldb-api :: python_api/sbvalue_const_addrof/TestSBValueConstAddrOf.py (1042 of 1232) PASS: lldb-api :: commands/thread/select/TestThreadSelect.py (1043 of 1232) PASS: lldb-shell :: SymbolFile/DWARF/DW_TAG_variable-invalid_location.s (1044 of 1232) PASS: lldb-api :: commands/expression/persistent_variables/TestPersistentVariables.py (1045 of 1232) PASS: lldb-shell :: SymbolFile/Breakpad/line-table-discontinuous-file-ids.test (1046 of 1232) PASS: lldb-shell :: SymbolFile/DWARF/debug-line-basic.s (1047 of 1232) PASS: lldb-api :: commands/process/attach/TestProcessAttach.py (1048 of 1232) PASS: lldb-api :: lang/c/stepping/TestThreadStepping.py (1049 of 1232) UNSUPPORTED: lldb-shell :: SymbolFile/NativePDB/stack_unwinding01.cpp (1050 of 1232) PASS: lldb-api :: commands/expression/result_numbering/TestResultNumbering.py (1051 of 1232) PASS: lldb-api :: python_api/value/change_values/TestChangeValueAPI.py (1052 of 1232) PASS: lldb-api :: functionalities/postmortem/minidump-new/TestMiniDumpUUID.py (1053 of 1232) PASS: lldb-api :: types/TestLongTypes.py (1054 of 1232) PASS: lldb-api :: lang/objc/forward-decl/TestForwardDecl.py (1055 of 1232) PASS: lldb-shell :: SymbolFile/DWARF/clang-ast-from-dwarf-unamed-and-anon-structs.cpp (1056 of 1232) PASS: lldb-shell :: ObjectFile/ELF/netbsd-exec-8.99.30-amd64.yaml (1057 of 1232) PASS: lldb-api :: functionalities/completion/TestCompletion.py (1058 of 1232) PASS: lldb-shell :: Commands/CommandScriptImmediateOutput/CommandScriptImmediateOutputFile.test (1059 of 1232) PASS: lldb-api :: commands/platform/file/read/TestPlatformFileRead.py (1060 of 1232) PASS: lldb-shell :: SymbolFile/DWARF/find-basic-type.cpp (1061 of 1232) PASS: lldb-api :: functionalities/ubsan/user-expression/TestUbsanUserExpression.py (1062 of 1232) UNSUPPORTED: lldb-api :: commands/expression/call-restarts/TestCallThatRestarts.py (1063 of 1232) PASS: lldb-api :: functionalities/gdb_remote_client/TestNestedRegDefinitions.py (1064 of 1232) PASS: lldb-api :: functionalities/data-formatter/stringprinter/TestStringPrinter.py (1065 of 1232) PASS: lldb-api :: commands/target/stop-hooks/TestStopHooks.py (1066 of 1232) UNSUPPORTED: lldb-api :: benchmarks/startup/TestStartupDelays.py (1067 of 1232) PASS: lldb-api :: functionalities/asan/TestMemoryHistory.py (1068 of 1232) PASS: lldb-api :: functionalities/gdb_remote_client/TestGDBRemoteLoad.py (1069 of 1232) PASS: lldb-shell :: ObjectFile/ELF/avr-basic-info.yaml (1070 of 1232) UNSUPPORTED: lldb-api :: benchmarks/frame_variable/TestFrameVariableResponse.py (1071 of 1232) PASS: lldb-shell :: Quit/TestQuitExitCodeHex0.test (1072 of 1232) PASS: lldb-api :: functionalities/thread/concurrent_events/TestConcurrentCrashWithSignal.py (1073 of 1232) PASS: lldb-shell :: SymbolFile/DWARF/inline-function-address.ll (1074 of 1232) PASS: lldb-api :: commands/gui/basic/TestGuiBasic.py (1075 of 1232) PASS: lldb-api :: functionalities/data-formatter/type_summary_list_script/TestTypeSummaryListScript.py (1076 of 1232) PASS: lldb-api :: lang/cpp/gmodules-templates/TestGModules.py (1077 of 1232) PASS: lldb-shell :: Driver/TestTarget.test (1078 of 1232) PASS: lldb-shell :: ObjectFile/PECOFF/basic-info-arm64.yaml (1079 of 1232) PASS: lldb-api :: sample_test/TestSampleTest.py (1080 of 1232) UNSUPPORTED: lldb-api :: commands/expression/import-std-module/vector-dbg-info-content/TestDbgInfoContentVectorFromStdModule.py (1081 of 1232) UNSUPPORTED: lldb-api :: commands/session/save/TestSessionSave.py (1082 of 1232) UNSUPPORTED: lldb-shell :: SymbolFile/PDB/type-quals.test (1083 of 1232) UNSUPPORTED: lldb-shell :: Reproducer/TestPythonImport.test (1084 of 1232) UNSUPPORTED: lldb-shell :: Expr/TestIRMemoryMapWindows.test (1085 of 1232) UNSUPPORTED: lldb-shell :: Register/arm-fp-read.test (1086 of 1232) PASS: lldb-shell :: Minidump/memory-region-from-module.yaml (1087 of 1232) PASS: lldb-shell :: ObjectFile/ELF/PT_LOAD-overlap-PT_TLS.yaml (1088 of 1232) PASS: lldb-shell :: Settings/TestLineMarkerColor.test (1089 of 1232) PASS: lldb-shell :: SymbolFile/DWARF/limit-debug-info.s (1090 of 1232) PASS: lldb-api :: functionalities/data-formatter/data-formatter-enum-format/TestDataFormatterEnumFormat.py (1091 of 1232) PASS: lldb-api :: commands/platform/basic/TestPlatformPython.py (1092 of 1232) PASS: lldb-shell :: Commands/CommandScriptImmediateOutput/CommandScriptImmediateOutputConsole.test (1093 of 1232) PASS: lldb-api :: python_api/interpreter/TestCommandInterpreterAPI.py (1094 of 1232) UNSUPPORTED: lldb-shell :: Register/aarch64-fp-read.test (1095 of 1232) PASS: lldb-api :: functionalities/tsan/cpp_global_location/TestTsanCPPGlobalLocation.py (1096 of 1232) XFAIL: lldb-shell :: SymbolFile/DWARF/find-type-in-function.cpp (1097 of 1232) PASS: lldb-shell :: Breakpoint/split-dwarf5-debug-stroffsets.test (1098 of 1232) PASS: lldb-api :: lang/objc/foundation/TestObjCMethodsNSError.py (1099 of 1232) PASS: lldb-shell :: ObjectFile/MachO/lc_build_version_notools.yaml (1100 of 1232) PASS: lldb-api :: lang/objc/foundation/TestFoundationDisassembly.py (1101 of 1232) PASS: lldb-api :: lang/c/conflicting-symbol/TestConflictingSymbol.py (1102 of 1232) PASS: lldb-api :: functionalities/data-formatter/data-formatter-objc/TestDataFormatterObjCNSBundle.py (1103 of 1232) UNSUPPORTED: lldb-api :: commands/expression/import-std-module/unique_ptr-dbg-info-content/TestUniquePtrDbgInfoContent.py (1104 of 1232) UNSUPPORTED: lldb-shell :: Reproducer/TestLuaImport.test (1105 of 1232) PASS: lldb-api :: types/TestLongTypesExpr.py (1106 of 1232) PASS: lldb-api :: functionalities/data-formatter/data-formatter-stl/libcxx/optional/TestDataFormatterLibcxxOptional.py (1107 of 1232) PASS: lldb-shell :: SymbolFile/DWARF/inline-function-address-shared.test (1108 of 1232) PASS: lldb-api :: commands/expression/regression-access-function-template-in-record/TestRegressionAccessFunctionTemplateInRecord.py (1109 of 1232) PASS: lldb-api :: arm/emulation/TestEmulations.py (1110 of 1232) PASS: lldb-shell :: SymbolFile/DWARF/find-variable-dwo.cpp (1111 of 1232) PASS: lldb-api :: functionalities/wrong_commands/TestWrongCommands.py (1112 of 1232) PASS: lldb-api :: lang/objc/objc-stepping/TestObjCStepping.py (1113 of 1232) PASS: lldb-api :: commands/watchpoints/watchpoint_events/TestWatchpointEvents.py (1114 of 1232) PASS: lldb-api :: lang/c/shared_lib_stripped_symbols/TestSharedLibStrippedSymbols.py (1115 of 1232) PASS: lldb-api :: lang/c/local_variables/TestLocalVariables.py (1116 of 1232) PASS: lldb-api :: lang/cpp/virtual-functions/TestCppVirtualFunctions.py (1117 of 1232) PASS: lldb-api :: functionalities/asan/TestReportData.py (1118 of 1232) PASS: lldb-api :: lang/cpp/template-function/TestTemplateFunctions.py (1119 of 1232) UNSUPPORTED: lldb-api :: functionalities/darwin_log/filter/exact_match/category/TestDarwinLogFilterMatchCategory.py (1120 of 1232) PASS: lldb-api :: functionalities/thread_plan/TestThreadPlanCommands.py (1121 of 1232) PASS: lldb-api :: commands/expression/two-files/TestObjCTypeQueryFromOtherCompileUnit.py (1122 of 1232) PASS: lldb-api :: tools/lldb-server/TestGdbRemoteHostInfo.py (1123 of 1232) PASS: lldb-api :: functionalities/data-formatter/data-formatter-ptr-to-array/TestPtrToArrayFormatting.py (1124 of 1232) PASS: lldb-api :: python_api/watchpoint/condition/TestWatchpointConditionAPI.py (1125 of 1232) PASS: lldb-shell :: ObjectFile/ELF/short-build-id.yaml (1126 of 1232) PASS: lldb-api :: functionalities/thread/concurrent_events/TestConcurrentWatchpointWithDelayWatchpointThreads.py (1127 of 1232) UNSUPPORTED: lldb-shell :: SymbolFile/PDB/vbases.test (1128 of 1232) PASS: lldb-api :: functionalities/data-formatter/synthcapping/TestSyntheticCapping.py (1129 of 1232) PASS: lldb-api :: functionalities/breakpoint/breakpoint_hit_count/TestBreakpointHitCount.py (1130 of 1232) PASS: lldb-api :: functionalities/breakpoint/breakpoint_by_file_colon_line/TestBreakpointByFileColonLine.py (1131 of 1232) PASS: lldb-shell :: ObjectFile/ELF/section-types.yaml (1132 of 1232) PASS: lldb-api :: python_api/watchpoint/TestWatchpointIgnoreCount.py (1133 of 1232) PASS: lldb-shell :: SymbolFile/DWARF/debug-names-compressed.cpp (1134 of 1232) PASS: lldb-api :: functionalities/source-map/TestTargetSourceMap.py (1135 of 1232) PASS: lldb-shell :: ObjectFile/wasm/embedded-debug-sections.yaml (1136 of 1232) UNSUPPORTED: lldb-api :: commands/expression/import-std-module/empty-module/TestEmptyStdModule.py (1137 of 1232) PASS: lldb-api :: commands/expression/save_jit_objects/TestSaveJITObjects.py (1138 of 1232) PASS: lldb-api :: commands/target/create-no-such-arch/TestNoSuchArch.py (1139 of 1232) UNSUPPORTED: lldb-shell :: Register/x86-gp-read.test (1140 of 1232) UNSUPPORTED: lldb-api :: functionalities/gdb_remote_client/TestIOSSimulator.py (1141 of 1232) PASS: lldb-api :: python_api/frame/inlines/TestInlinedFrame.py (1142 of 1232) UNSUPPORTED: lldb-shell :: Register/x86-ymm-read.test (1143 of 1232) PASS: lldb-api :: tools/lldb-server/TestGdbRemoteExpeditedRegisters.py (1144 of 1232) PASS: lldb-api :: functionalities/unwind/noreturn/module-end/TestNoReturnModuleEnd.py (1145 of 1232) PASS: lldb-shell :: ObjectFile/ELF/aarch64-relocations.yaml (1146 of 1232) PASS: lldb-shell :: Minidump/Windows/Sigsegv/sigsegv.test (1147 of 1232) PASS: lldb-shell :: Process/TestAbortExitCode.test (1148 of 1232) PASS: lldb-api :: functionalities/rerun/TestRerun.py (1149 of 1232) PASS: lldb-api :: python_api/value_var_update/TestValueVarUpdate.py (1150 of 1232) UNSUPPORTED: lldb-api :: functionalities/data-formatter/data-formatter-stl/libstdcpp/vector/TestDataFormatterStdVector.py (1151 of 1232) PASS: lldb-api :: python_api/sbtype_typeclass/TestSBTypeTypeClass.py (1152 of 1232) PASS: lldb-api :: lang/objc/foundation/TestObjCMethods.py (1153 of 1232) PASS: lldb-api :: commands/frame/diagnose/dereference-function-return/TestDiagnoseDereferenceFunctionReturn.py (1154 of 1232) PASS: lldb-shell :: ObjectFile/wasm/stripped-debug-sections.yaml (1155 of 1232) PASS: lldb-shell :: Commands/command-thread-select.test (1156 of 1232) PASS: lldb-api :: functionalities/optimized_code/TestNoASanExceptionAfterEvalOP_piece.py (1157 of 1232) PASS: lldb-api :: lang/c/step_over_no_deadlock/TestStepOverDoesntBlock.py (1158 of 1232) PASS: lldb-shell :: ObjectFile/ELF/PT_LOAD-empty.yaml (1159 of 1232) PASS: lldb-api :: functionalities/avoids-fd-leak/TestFdLeak.py (1160 of 1232) PASS: lldb-api :: commands/frame/var-scope/TestFrameVariableScope.py (1161 of 1232) PASS: lldb-shell :: BuildScript/compiler-full-path.test (1162 of 1232) PASS: lldb-api :: functionalities/gdb_remote_client/TestRegDefinitionInParts.py (1163 of 1232) UNSUPPORTED: lldb-shell :: Process/TestEnvironment.test (1164 of 1232) PASS: lldb-api :: functionalities/data-formatter/data-formatter-objc/TestDataFormatterObjCNSData.py (1165 of 1232) PASS: lldb-api :: functionalities/thread/concurrent_events/TestConcurrentManyCrash.py (1166 of 1232) PASS: lldb-api :: lang/objc/objc-super/TestObjCSuper.py (1167 of 1232) UNSUPPORTED: lldb-api :: functionalities/darwin_log/basic/TestDarwinLogBasic.py (1168 of 1232) UNSUPPORTED: lldb-shell :: Reproducer/TestProcessList.test (1169 of 1232) PASS: lldb-api :: commands/session/history/TestSessionHistory.py (1170 of 1232) PASS: lldb-api :: functionalities/gdb_remote_client/TestArmRegisterDefinition.py (1171 of 1232) PASS: lldb-api :: lang/cpp/typedef/TestCppTypedef.py (1172 of 1232) PASS: lldb-api :: functionalities/thread/concurrent_events/TestConcurrentDelaySignalBreak.py (1173 of 1232) UNSUPPORTED: lldb-shell :: Reproducer/Modules/TestModuleCXX.test (1174 of 1232) PASS: lldb-api :: functionalities/data-formatter/data-formatter-categories/TestDataFormatterCategories.py (1175 of 1232) UNSUPPORTED: lldb-api :: macosx/thread-names/TestInterruptThreadNames.py (1176 of 1232) PASS: lldb-api :: lang/objc/modules-incomplete/TestIncompleteModules.py (1177 of 1232) PASS: lldb-api :: lang/cpp/nested-class-other-compilation-unit/TestNestedClassWithParentInAnotherCU.py (1178 of 1232) PASS: lldb-api :: functionalities/thread/concurrent_events/TestConcurrentWatchpointDelayWatchpointOneBreakpoint.py (1179 of 1232) PASS: lldb-api :: functionalities/thread/concurrent_events/TestConcurrentSignalWatchBreak.py (1180 of 1232) UNSUPPORTED: lldb-shell :: Reproducer/TestDSYM.test (1181 of 1232) PASS: lldb-api :: python_api/target/TestTargetAPI.py (1182 of 1232) PASS: lldb-api :: lang/objc/objc-dyn-sbtype/TestObjCDynamicSBType.py (1183 of 1232) UNSUPPORTED: lldb-api :: functionalities/gdb_remote_client/TestRestartBug.py (1184 of 1232) PASS: lldb-api :: lang/c/stepping/TestStepAndBreakpoints.py (1185 of 1232) UNSUPPORTED: lldb-api :: tools/lldb-vscode/console/TestVSCode_console.py (1186 of 1232) PASS: lldb-api :: lang/cpp/constructors/TestCppConstructors.py (1187 of 1232) PASS: lldb-api :: functionalities/data-formatter/data-formatter-disabling/TestDataFormatterDisabling.py (1188 of 1232) PASS: lldb-shell :: SymbolFile/DWARF/DW_OP_piece-smaller-than-struct.s (1189 of 1232) PASS: lldb-api :: commands/apropos/with-process/TestAproposWithProcess.py (1190 of 1232) PASS: lldb-api :: lang/objcxx/objcxx-ivar-vector/TestIvarVector.py (1191 of 1232) PASS: lldb-api :: lang/c/complex/TestComplexC99.py (1192 of 1232) UNSUPPORTED: lldb-api :: commands/watchpoints/variable_out_of_scope/TestWatchedVarHitWhenInScope.py (1193 of 1232) UNSUPPORTED: lldb-api :: python_api/interpreter/TestRunCommandInterpreterAPI.py (1194 of 1232) PASS: lldb-shell :: ObjectFile/Breakpad/discontiguous-sections.test (1195 of 1232) UNSUPPORTED: lldb-shell :: Register/arm-gp-read.test (1196 of 1232) UNSUPPORTED: lldb-shell :: Unwind/eh-frame-augment-noop.test (1197 of 1232) PASS: lldb-api :: lang/cpp/incomplete-types/TestCppIncompleteTypes.py (1198 of 1232) PASS: lldb-api :: functionalities/inferior-assert/TestInferiorAssert.py (1199 of 1232) UNSUPPORTED: lldb-api :: commands/register/register/intel_xtended_registers/TestMPXRegisters.py (1200 of 1232) PASS: lldb-shell :: ObjectFile/ELF/duplicate-section.yaml (1201 of 1232) PASS: lldb-api :: lang/objc/global_ptrs/TestGlobalObjects.py (1202 of 1232) PASS: lldb-api :: macosx/queues/TestQueues.py (1203 of 1232) PASS: lldb-shell :: SymbolFile/DWARF/dwarf5-debug_line.s (1204 of 1232) PASS: lldb-shell :: Breakpoint/split-dwarf-5-addrbase.test (1205 of 1232) PASS: lldb-api :: functionalities/thread/exit_during_step/TestExitDuringStep.py (1206 of 1232) PASS: lldb-api :: macosx/universal/TestUniversal.py (1207 of 1232) PASS: lldb-api :: lang/objc/objc++/TestObjCXX.py (1208 of 1232) PASS: lldb-api :: types/TestIntegerTypeExpr.py (1209 of 1232) PASS: lldb-shell :: SymbolFile/DWARF/debug-types-line-tables.s (1210 of 1232) PASS: lldb-api :: functionalities/dead-strip/TestDeadStrip.py (1211 of 1232) PASS: lldb-api :: functionalities/data-formatter/poarray/TestPrintObjectArray.py (1212 of 1232) PASS: lldb-api :: lang/cpp/symbols/TestSymbols.py (1213 of 1232) UNSUPPORTED: lldb-api :: benchmarks/expression/TestRepeatedExprs.py (1214 of 1232) PASS: lldb-api :: commands/expression/persistent_ptr_update/TestPersistentPtrUpdate.py (1215 of 1232) UNSUPPORTED: lldb-api :: functionalities/data-formatter/data-formatter-stl/libstdcpp/smart_ptr/TestDataFormatterStdSmartPtr.py (1216 of 1232) UNSUPPORTED: lldb-api :: functionalities/data-formatter/data-formatter-stl/libstdcpp/string/TestDataFormatterStdString.py (1217 of 1232) PASS: lldb-shell :: Minidump/Windows/arm-fp-unwind.test (1218 of 1232) PASS: lldb-api :: functionalities/thread/concurrent_events/TestConcurrentDelayedCrashWithBreakpointWatchpoint.py (1219 of 1232) PASS: lldb-api :: functionalities/inferior-crashing/TestInferiorCrashing.py (1220 of 1232) PASS: lldb-api :: functionalities/data-formatter/nsdictionarysynth/TestNSDictionarySynthetic.py (1221 of 1232) PASS: lldb-api :: commands/expression/completion/TestExprCompletion.py (1222 of 1232) PASS: lldb-api :: lang/cpp/function_refs/TestFunctionRefs.py (1223 of 1232) PASS: lldb-api :: lang/cpp/operators/TestCppOperators.py (1224 of 1232) PASS: lldb-api :: commands/expression/fixits/TestFixIts.py (1225 of 1232) PASS: lldb-api :: commands/expression/class_template_specialization_empty_pack/TestClassTemplateSpecializationParametersHandling.py (1226 of 1232) PASS: lldb-shell :: SymbolFile/Breakpad/unwind-via-raSearch.test (1227 of 1232) PASS: lldb-api :: lang/objc/objc-new-syntax/TestObjCNewSyntaxArray.py (1228 of 1232) PASS: lldb-api :: functionalities/return-value/TestReturnValue.py (1229 of 1232) PASS: lldb-api :: lang/objc/orderedset/TestOrderedSet.py (1230 of 1232) PASS: lldb-api :: functionalities/thread/backtrace_all/TestBacktraceAll.py (1231 of 1232) PASS: lldb-api :: lang/cpp/namespace/TestNamespaceLookup.py (1232 of 1232) Slowest Tests: -------------------------------------------------------------------------- 116.98s: lldb-api :: tools/lldb-server/TestLldbGdbServer.py 79.27s: lldb-api :: lang/objc/foundation/TestFoundationDisassembly.py 68.47s: lldb-api :: lang/objc/foundation/TestObjCMethods.py 62.69s: lldb-api :: lang/objc/exceptions/TestObjCExceptions.py 62.53s: lldb-api :: commands/gui/basicdebug/TestGuiBasicDebug.py 61.78s: lldb-api :: api/multithreaded/TestMultithreaded.py 52.85s: lldb-api :: types/TestLongTypesExpr.py 51.25s: lldb-api :: lang/objc/hidden-ivars/TestHiddenIvars.py 49.05s: lldb-api :: lang/objc/objc-new-syntax/TestObjCNewSyntaxLiteral.py 48.21s: lldb-api :: functionalities/completion/TestCompletion.py 44.81s: lldb-api :: lang/cpp/namespace/TestNamespaceLookup.py 42.18s: lldb-api :: lang/objc/real-definition/TestRealDefinition.py 38.11s: lldb-api :: lang/objc/objc-new-syntax/TestObjCNewSyntaxArray.py 38.10s: lldb-api :: lang/objc/foundation/TestObjCMethodsNSError.py 37.89s: lldb-api :: lang/objc/foundation/TestObjCMethodsString.py 37.20s: lldb-api :: lang/objc/objc-new-syntax/TestObjCNewSyntaxDictionary.py 36.23s: lldb-api :: types/TestLongTypes.py 33.34s: lldb-api :: types/TestIntegerTypeExpr.py 33.06s: lldb-api :: tools/lldb-server/TestGdbRemoteThreadsInStopReply.py 29.42s: lldb-api :: commands/target/basic/TestTargetCommand.py

Hide Details

Tests Times: -------------------------------------------------------------------------- [ Range ] :: [ Percentage ] :: [ Count ] -------------------------------------------------------------------------- [110s,120s) :: [ ] :: [ 1/1232] [100s,110s) :: [ ] :: [ 0/1232] [ 90s,100s) :: [ ] :: [ 0/1232] [ 80s, 90s) :: [ ] :: [ 1/1232] [ 70s, 80s) :: [ ] :: [ 1/1232] [ 60s, 70s) :: [ ] :: [ 3/1232] [ 50s, 60s) :: [ ] :: [ 3/1232] [ 40s, 50s) :: [ ] :: [ 3/1232] [ 30s, 40s) :: [ ] :: [ 8/1232] [ 20s, 30s) :: [ ] :: [ 22/1232] [ 10s, 20s) :: [**** ] :: [ 136/1232] [ 0s, 10s) :: [********************************** ] :: [1054/1232] -------------------------------------------------------------------------- ******************** Failed Tests (2): lldb-api :: lang/c/vla/TestVLA.py lldb-api :: commands/gui/basicdebug/TestGuiBasicDebug.py

Hide Details

Hide Details

Testing Time: 376.38s Unsupported : 297 Passed : 927 Expectedly Failed: 6 Failed : 2 FAILED: tools/lldb/test/CMakeFiles/check-lldb-reproducers-capture cd /Users/buildslave/jenkins/workspace/lldb-cmake-reproducers/lldb-build/tools/lldb/test && /usr/local/Frameworks/Python.framework/Versions/3.7/bin/python3.7 /Users/buildslave/jenkins/workspace/lldb-cmake-reproducers/lldb-build/./bin/llvm-lit -v --time-tests --shuffle --xunit-xml-output=/Users/buildslave/jenkins/workspace/lldb-cmake-reproducers/test/results.xml -v --param lldb-run-with-repro=capture /Users/buildslave/jenkins/workspace/lldb-cmake-reproducers/lldb-build/tools/lldb/test/API /Users/buildslave/jenkins/workspace/lldb-cmake-reproducers/lldb-build/tools/lldb/test/Shell ninja: build stopped: cannot make progress due to previous errors. Command failed: Command '['/usr/local/bin/ninja', '-k', '0', '-v', 'check-lldb-reproducers']' returned non-zero exit status 1. Command: ['/usr/local/bin/ninja', '-k', '0', '-v', 'check-lldb-reproducers'] [Pipeline] } [Pipeline] // timeout [Pipeline] } [Pipeline] // stage [Pipeline] stage [Pipeline] { (Declarative: Post Actions) [Pipeline] scanForIssues [Clang (LLVM based)] Sleeping for 5 seconds due to JENKINS-32191... [Clang (LLVM based)] Parsing console log (workspace: '/Users/buildslave/jenkins/workspace/lldb-cmake-reproducers') [Clang (LLVM based)] Successfully parsed console log [Clang (LLVM based)] -> found 8 issues (skipped 10 duplicates) [Clang (LLVM based)] Post processing issues on 'green-dragon-23' with source code encoding 'UTF-8' [Clang (LLVM based)] Creating SCM blamer to obtain author and commit information for affected files [Clang (LLVM based)] Creating SCM miner to obtain statistics for affected repository files [Clang (LLVM based)] Resolving file names for all issues in source directory '/Users/buildslave/jenkins/workspace/lldb-cmake-reproducers' [Clang (LLVM based)] -> resolved paths in source directory (6 found, 0 not found) [Clang (LLVM based)] Resolving module names from module definitions (build.xml, pom.xml, or Manifest.mf files) [Clang (LLVM based)] -> resolved module names for 8 issues [Clang (LLVM based)] Resolving package names (or namespaces) by parsing the affected files [Clang (LLVM based)] -> resolved package names of 6 affected files [Clang (LLVM based)] No filter has been set, publishing all 8 issues [Clang (LLVM based)] Creating fingerprints for all affected code blocks to track issues over different builds [Clang (LLVM based)] -> created fingerprints for 8 issues (skipped 0 issues) [Clang (LLVM based)] Copying affected files to Jenkins' build folder '/Users/Shared/Jenkins/Home/jobs/lldb-cmake-reproducers/builds/324/files-with-issues' [Clang (LLVM based)] -> 4 copied, 2 not in workspace, 0 not-found, 0 with I/O error [Pipeline] junit Recording test results [Pipeline] } [Pipeline] // stage [Pipeline] } [Pipeline] // withEnv [Pipeline] } [Pipeline] // node [Pipeline] End of Pipeline ERROR: script returned exit code 1 Finished: FAILURE