FailedConsole Output

Skipping 16,000 KB.. Full Log
apple.main-thread', stop reason = breakpoint 1.1

Hide Details

Hide Details

Ran command: "thread list"

Hide Details

Got output: Process 96353 stopped * thread #1: tid = 0x48177c, 0x0000000100001b54 a.out`A::B::test_lookup_at_nested_ns_scope_after_using() at ns2.cpp:36:74, queue = 'com.apple.main-thread', stop reason = breakpoint 1.1

Hide Details

Expecting sub string: "stopped" (was found) Expecting sub string: "stop reason = breakpoint" (was found)

Hide Details

runCmd: expr -- func() output: (int) $0 = 4

Hide Details

Hide Details

Ran command: "expr -- func()"

Hide Details

Got output: (int) $0 = 4

Hide Details

Expecting start string: "(int) $0 = 3" (was not found)

Hide Details

XFAIL: LLDB (/Users/buildslave/jenkins/workspace/lldb-cmake-reproducers/lldb-build/bin/clang-x86_64) :: test_scope_after_using_declaration_lookup_with_run_command_dwarf (TestNamespaceLookup.NamespaceLookupTestCase) <bound method SBProcess.Kill of <lldb.SBProcess; proxy of <Swig Object of type 'lldb::SBProcess *' at 0x1016371e0> >>: success

Hide Details

UNSUPPORTED: LLDB (/Users/buildslave/jenkins/workspace/lldb-cmake-reproducers/lldb-build/bin/clang-x86_64) :: test_scope_after_using_declaration_lookup_with_run_command_dwo (TestNamespaceLookup.NamespaceLookupTestCase) (test case does not fall in any category of interest for this run) runCmd: settings clear -all output:

Hide Details

runCmd: settings set symbols.enable-external-lookup false output:

Hide Details

runCmd: settings set target.inherit-tcc true output:

Hide Details

runCmd: settings set target.auto-apply-fixits false output:

Hide Details

runCmd: settings set plugin.process.gdb-remote.packet-timeout 60 output:

Hide Details

runCmd: settings set symbols.clang-modules-cache-path "/Users/buildslave/jenkins/workspace/lldb-cmake-reproducers/lldb-build/lldb-test-build.noindex/module-cache-lldb/lldb-api" output:

Hide Details

runCmd: settings set use-color false output:

Hide Details

runCmd: setting set target.prefer-dynamic-value no-dynamic-values output:

Hide Details

XFAIL: LLDB (/Users/buildslave/jenkins/workspace/lldb-cmake-reproducers/lldb-build/bin/clang-x86_64) :: test_scope_after_using_declaration_lookup_with_run_command_gmodules (TestNamespaceLookup.NamespaceLookupTestCase) runCmd: settings clear -all output:

Hide Details

runCmd: settings set symbols.enable-external-lookup false output:

Hide Details

runCmd: settings set target.inherit-tcc true output:

Hide Details

runCmd: settings set target.auto-apply-fixits false output:

Hide Details

runCmd: settings set plugin.process.gdb-remote.packet-timeout 60 output:

Hide Details

runCmd: settings set symbols.clang-modules-cache-path "/Users/buildslave/jenkins/workspace/lldb-cmake-reproducers/lldb-build/lldb-test-build.noindex/module-cache-lldb/lldb-api" output:

Hide Details

runCmd: settings set use-color false output:

Hide Details

runCmd: setting set target.prefer-dynamic-value no-dynamic-values output:

Hide Details

runCmd: file /Users/buildslave/jenkins/workspace/lldb-cmake-reproducers/lldb-build/lldb-test-build.noindex/lang/cpp/namespace/TestNamespaceLookup.test_scope_after_using_directive_lookup_with_run_command_dsym/a.out output: Current executable set to '/Users/buildslave/jenkins/workspace/lldb-cmake-reproducers/lldb-build/lldb-test-build.noindex/lang/cpp/namespace/TestNamespaceLookup.test_scope_after_using_directive_lookup_with_run_command_dsym/a.out' (x86_64).

Hide Details

Hide Details

runCmd: breakpoint set -f "ns3.cpp" -l 13 output: Breakpoint 1: where = a.out`test_lookup_after_using_directive() + 8 at ns3.cpp:15:56, address = 0x0000000100001c88

Hide Details

Hide Details

Expecting pattern: ^Breakpoint (?P<bpno>[0-9]+): (?P<num_locations>[0-9]+) locations\.$ Not matched

Hide Details

Expecting pattern: ^Breakpoint (?P<bpno>[0-9]+): (?P<num_locations>no) locations \(pending\)\. Not matched

Hide Details

Expecting pattern: ^Breakpoint (?P<bpno>[0-9]+): where = (?P<module>.*)`(?P<symbol>[+\-]{0,1}[^+]+)( \+ (?P<offset>[0-9]+)){0,1}( \[inlined\] (?P<inline_symbol>.*)){0,1} at (?P<file>[^:]+):(?P<line_no>[0-9]+)(?P<column>(:[0-9]+)?), address = (?P<address>0x[0-9a-fA-F]+)$ Matched

Hide Details

runCmd: run output: Process 23890 stopped * thread #1, queue = 'com.apple.main-thread', stop reason = breakpoint 1.1 frame #0: 0x0000000100001c88 a.out`test_lookup_after_using_directive() at ns3.cpp:15:56 12 { 13 // BP_after_using_directive 14 //printf("func() = %d\n", func()); // eval func(), exp: error, ambiguous -> 15 std::printf("after using directive: func2() = %d\n", func2()); // eval func2(), exp: 3 ^ 16 std::printf("after using directive: ::func() = %d\n", ::func()); // eval ::func(), exp: 1 17 std::printf("after using directive: B::func() = %d\n", B::func()); // eval B::func(), exp: 4 18 }

Hide Details

Process 23890 launched: '/Users/buildslave/jenkins/workspace/lldb-cmake-reproducers/lldb-build/lldb-test-build.noindex/lang/cpp/namespace/TestNamespaceLookup.test_scope_after_using_directive_lookup_with_run_command_dsym/a.out' (x86_64)

Hide Details

Hide Details

runCmd: thread list output: Process 23890 stopped * thread #1: tid = 0x493827, 0x0000000100001c88 a.out`test_lookup_after_using_directive() at ns3.cpp:15:56, queue = 'com.apple.main-thread', stop reason = breakpoint 1.1

Hide Details

Hide Details

Ran command: "thread list"

Hide Details

Got output: Process 23890 stopped * thread #1: tid = 0x493827, 0x0000000100001c88 a.out`test_lookup_after_using_directive() at ns3.cpp:15:56, queue = 'com.apple.main-thread', stop reason = breakpoint 1.1

Hide Details

Expecting sub string: "stopped" (was found) Expecting sub string: "stop reason = breakpoint" (was found)

Hide Details

runCmd: expr -- func2() output: (int) $0 = 3

Hide Details

Hide Details

Ran command: "expr -- func2()"

Hide Details

Got output: (int) $0 = 3

Hide Details

Expecting start string: "(int) $0 = 3" (was found)

Hide Details

<bound method SBProcess.Kill of <lldb.SBProcess; proxy of <Swig Object of type 'lldb::SBProcess *' at 0x101637600> >>: success

Hide Details

PASS: LLDB (/Users/buildslave/jenkins/workspace/lldb-cmake-reproducers/lldb-build/bin/clang-x86_64) :: test_scope_after_using_directive_lookup_with_run_command_dsym (TestNamespaceLookup.NamespaceLookupTestCase) runCmd: settings clear -all output:

Hide Details

runCmd: settings set symbols.enable-external-lookup false output:

Hide Details

runCmd: settings set target.inherit-tcc true output:

Hide Details

runCmd: settings set target.auto-apply-fixits false output:

Hide Details

runCmd: settings set plugin.process.gdb-remote.packet-timeout 60 output:

Hide Details

runCmd: settings set symbols.clang-modules-cache-path "/Users/buildslave/jenkins/workspace/lldb-cmake-reproducers/lldb-build/lldb-test-build.noindex/module-cache-lldb/lldb-api" output:

Hide Details

runCmd: settings set use-color false output:

Hide Details

runCmd: setting set target.prefer-dynamic-value no-dynamic-values output:

Hide Details

runCmd: file /Users/buildslave/jenkins/workspace/lldb-cmake-reproducers/lldb-build/lldb-test-build.noindex/lang/cpp/namespace/TestNamespaceLookup.test_scope_after_using_directive_lookup_with_run_command_dwarf/a.out output: Current executable set to '/Users/buildslave/jenkins/workspace/lldb-cmake-reproducers/lldb-build/lldb-test-build.noindex/lang/cpp/namespace/TestNamespaceLookup.test_scope_after_using_directive_lookup_with_run_command_dwarf/a.out' (x86_64).

Hide Details

Hide Details

runCmd: breakpoint set -f "ns3.cpp" -l 13 output: Breakpoint 1: where = a.out`test_lookup_after_using_directive() + 8 at ns3.cpp:15:56, address = 0x0000000100001c88

Hide Details

Hide Details

Expecting pattern: ^Breakpoint (?P<bpno>[0-9]+): (?P<num_locations>[0-9]+) locations\.$ Not matched

Hide Details

Expecting pattern: ^Breakpoint (?P<bpno>[0-9]+): (?P<num_locations>no) locations \(pending\)\. Not matched

Hide Details

Expecting pattern: ^Breakpoint (?P<bpno>[0-9]+): where = (?P<module>.*)`(?P<symbol>[+\-]{0,1}[^+]+)( \+ (?P<offset>[0-9]+)){0,1}( \[inlined\] (?P<inline_symbol>.*)){0,1} at (?P<file>[^:]+):(?P<line_no>[0-9]+)(?P<column>(:[0-9]+)?), address = (?P<address>0x[0-9a-fA-F]+)$ Matched

Hide Details

runCmd: run output: Process 24474 stopped * thread #1, queue = 'com.apple.main-thread', stop reason = breakpoint 1.1 frame #0: 0x0000000100001c88 a.out`test_lookup_after_using_directive() at ns3.cpp:15:56 12 { 13 // BP_after_using_directive 14 //printf("func() = %d\n", func()); // eval func(), exp: error, ambiguous -> 15 std::printf("after using directive: func2() = %d\n", func2()); // eval func2(), exp: 3 ^ 16 std::printf("after using directive: ::func() = %d\n", ::func()); // eval ::func(), exp: 1 17 std::printf("after using directive: B::func() = %d\n", B::func()); // eval B::func(), exp: 4 18 }

Hide Details

Process 24474 launched: '/Users/buildslave/jenkins/workspace/lldb-cmake-reproducers/lldb-build/lldb-test-build.noindex/lang/cpp/namespace/TestNamespaceLookup.test_scope_after_using_directive_lookup_with_run_command_dwarf/a.out' (x86_64)

Hide Details

Hide Details

runCmd: thread list output: Process 24474 stopped * thread #1: tid = 0x493db9, 0x0000000100001c88 a.out`test_lookup_after_using_directive() at ns3.cpp:15:56, queue = 'com.apple.main-thread', stop reason = breakpoint 1.1

Hide Details

Hide Details

Ran command: "thread list"

Hide Details

Got output: Process 24474 stopped * thread #1: tid = 0x493db9, 0x0000000100001c88 a.out`test_lookup_after_using_directive() at ns3.cpp:15:56, queue = 'com.apple.main-thread', stop reason = breakpoint 1.1

Hide Details

Expecting sub string: "stopped" (was found) Expecting sub string: "stop reason = breakpoint" (was found)

Hide Details

runCmd: expr -- func2() output: (int) $0 = 3

Hide Details

Hide Details

Ran command: "expr -- func2()"

Hide Details

Got output: (int) $0 = 3

Hide Details

Expecting start string: "(int) $0 = 3" (was found)

Hide Details

<bound method SBProcess.Kill of <lldb.SBProcess; proxy of <Swig Object of type 'lldb::SBProcess *' at 0x1014bcea0> >>: success

Hide Details

PASS: LLDB (/Users/buildslave/jenkins/workspace/lldb-cmake-reproducers/lldb-build/bin/clang-x86_64) :: test_scope_after_using_directive_lookup_with_run_command_dwarf (TestNamespaceLookup.NamespaceLookupTestCase) UNSUPPORTED: LLDB (/Users/buildslave/jenkins/workspace/lldb-cmake-reproducers/lldb-build/bin/clang-x86_64) :: test_scope_after_using_directive_lookup_with_run_command_dwo (TestNamespaceLookup.NamespaceLookupTestCase) (test case does not fall in any category of interest for this run) runCmd: settings clear -all output:

Hide Details

runCmd: settings set symbols.enable-external-lookup false output:

Hide Details

runCmd: settings set target.inherit-tcc true output:

Hide Details

runCmd: settings set target.auto-apply-fixits false output:

Hide Details

runCmd: settings set plugin.process.gdb-remote.packet-timeout 60 output:

Hide Details

runCmd: settings set symbols.clang-modules-cache-path "/Users/buildslave/jenkins/workspace/lldb-cmake-reproducers/lldb-build/lldb-test-build.noindex/module-cache-lldb/lldb-api" output:

Hide Details

runCmd: settings set use-color false output:

Hide Details

runCmd: setting set target.prefer-dynamic-value no-dynamic-values output:

Hide Details

FAIL: LLDB (/Users/buildslave/jenkins/workspace/lldb-cmake-reproducers/lldb-build/bin/clang-x86_64) :: test_scope_after_using_directive_lookup_with_run_command_gmodules (TestNamespaceLookup.NamespaceLookupTestCase) runCmd: settings clear -all output:

Hide Details

runCmd: settings set symbols.enable-external-lookup false output:

Hide Details

runCmd: settings set target.inherit-tcc true output:

Hide Details

runCmd: settings set target.auto-apply-fixits false output:

Hide Details

runCmd: settings set plugin.process.gdb-remote.packet-timeout 60 output:

Hide Details

runCmd: settings set symbols.clang-modules-cache-path "/Users/buildslave/jenkins/workspace/lldb-cmake-reproducers/lldb-build/lldb-test-build.noindex/module-cache-lldb/lldb-api" output:

Hide Details

runCmd: settings set use-color false output:

Hide Details

runCmd: setting set target.prefer-dynamic-value no-dynamic-values output:

Hide Details

runCmd: file /Users/buildslave/jenkins/workspace/lldb-cmake-reproducers/lldb-build/lldb-test-build.noindex/lang/cpp/namespace/TestNamespaceLookup.test_scope_ambiguity_after_using_lookup_with_run_command_dsym/a.out output: Current executable set to '/Users/buildslave/jenkins/workspace/lldb-cmake-reproducers/lldb-build/lldb-test-build.noindex/lang/cpp/namespace/TestNamespaceLookup.test_scope_ambiguity_after_using_lookup_with_run_command_dsym/a.out' (x86_64).

Hide Details

Hide Details

runCmd: breakpoint set -f "ns3.cpp" -l 13 output: Breakpoint 1: where = a.out`test_lookup_after_using_directive() + 8 at ns3.cpp:15:56, address = 0x0000000100001c88

Hide Details

Hide Details

Expecting pattern: ^Breakpoint (?P<bpno>[0-9]+): (?P<num_locations>[0-9]+) locations\.$ Not matched

Hide Details

Expecting pattern: ^Breakpoint (?P<bpno>[0-9]+): (?P<num_locations>no) locations \(pending\)\. Not matched

Hide Details

Expecting pattern: ^Breakpoint (?P<bpno>[0-9]+): where = (?P<module>.*)`(?P<symbol>[+\-]{0,1}[^+]+)( \+ (?P<offset>[0-9]+)){0,1}( \[inlined\] (?P<inline_symbol>.*)){0,1} at (?P<file>[^:]+):(?P<line_no>[0-9]+)(?P<column>(:[0-9]+)?), address = (?P<address>0x[0-9a-fA-F]+)$ Matched

Hide Details

runCmd: run output: Process 48413 stopped * thread #1, queue = 'com.apple.main-thread', stop reason = breakpoint 1.1 frame #0: 0x0000000100001c88 a.out`test_lookup_after_using_directive() at ns3.cpp:15:56 12 { 13 // BP_after_using_directive 14 //printf("func() = %d\n", func()); // eval func(), exp: error, ambiguous -> 15 std::printf("after using directive: func2() = %d\n", func2()); // eval func2(), exp: 3 ^ 16 std::printf("after using directive: ::func() = %d\n", ::func()); // eval ::func(), exp: 1 17 std::printf("after using directive: B::func() = %d\n", B::func()); // eval B::func(), exp: 4 18 }

Hide Details

Process 48413 launched: '/Users/buildslave/jenkins/workspace/lldb-cmake-reproducers/lldb-build/lldb-test-build.noindex/lang/cpp/namespace/TestNamespaceLookup.test_scope_ambiguity_after_using_lookup_with_run_command_dsym/a.out' (x86_64)

Hide Details

Hide Details

runCmd: thread list output: Process 48413 stopped * thread #1: tid = 0x4a2f03, 0x0000000100001c88 a.out`test_lookup_after_using_directive() at ns3.cpp:15:56, queue = 'com.apple.main-thread', stop reason = breakpoint 1.1

Hide Details

Hide Details

Ran command: "thread list"

Hide Details

Got output: Process 48413 stopped * thread #1: tid = 0x4a2f03, 0x0000000100001c88 a.out`test_lookup_after_using_directive() at ns3.cpp:15:56, queue = 'com.apple.main-thread', stop reason = breakpoint 1.1

Hide Details

Expecting sub string: "stopped" (was found) Expecting sub string: "stop reason = breakpoint" (was found)

Hide Details

runCmd: expr -- func() output: (int) $0 = 1

Hide Details

Hide Details

Ran command: "expr -- func()"

Hide Details

Got output: (int) $0 = 1

Hide Details

Expecting start string: "error" (was not found)

Hide Details

XFAIL: LLDB (/Users/buildslave/jenkins/workspace/lldb-cmake-reproducers/lldb-build/bin/clang-x86_64) :: test_scope_ambiguity_after_using_lookup_with_run_command_dsym (TestNamespaceLookup.NamespaceLookupTestCase) <bound method SBProcess.Kill of <lldb.SBProcess; proxy of <Swig Object of type 'lldb::SBProcess *' at 0x101bdcd80> >>: success

Hide Details

runCmd: settings clear -all output:

Hide Details

runCmd: settings set symbols.enable-external-lookup false output:

Hide Details

runCmd: settings set target.inherit-tcc true output:

Hide Details

runCmd: settings set target.auto-apply-fixits false output:

Hide Details

runCmd: settings set plugin.process.gdb-remote.packet-timeout 60 output:

Hide Details

runCmd: settings set symbols.clang-modules-cache-path "/Users/buildslave/jenkins/workspace/lldb-cmake-reproducers/lldb-build/lldb-test-build.noindex/module-cache-lldb/lldb-api" output:

Hide Details

runCmd: settings set use-color false output:

Hide Details

runCmd: setting set target.prefer-dynamic-value no-dynamic-values output:

Hide Details

runCmd: file /Users/buildslave/jenkins/workspace/lldb-cmake-reproducers/lldb-build/lldb-test-build.noindex/lang/cpp/namespace/TestNamespaceLookup.test_scope_ambiguity_after_using_lookup_with_run_command_dwarf/a.out output: Current executable set to '/Users/buildslave/jenkins/workspace/lldb-cmake-reproducers/lldb-build/lldb-test-build.noindex/lang/cpp/namespace/TestNamespaceLookup.test_scope_ambiguity_after_using_lookup_with_run_command_dwarf/a.out' (x86_64).

Hide Details

Hide Details

runCmd: breakpoint set -f "ns3.cpp" -l 13 output: Breakpoint 1: where = a.out`test_lookup_after_using_directive() + 8 at ns3.cpp:15:56, address = 0x0000000100001c88

Hide Details

Hide Details

Expecting pattern: ^Breakpoint (?P<bpno>[0-9]+): (?P<num_locations>[0-9]+) locations\.$ Not matched

Hide Details

Expecting pattern: ^Breakpoint (?P<bpno>[0-9]+): (?P<num_locations>no) locations \(pending\)\. Not matched

Hide Details

Expecting pattern: ^Breakpoint (?P<bpno>[0-9]+): where = (?P<module>.*)`(?P<symbol>[+\-]{0,1}[^+]+)( \+ (?P<offset>[0-9]+)){0,1}( \[inlined\] (?P<inline_symbol>.*)){0,1} at (?P<file>[^:]+):(?P<line_no>[0-9]+)(?P<column>(:[0-9]+)?), address = (?P<address>0x[0-9a-fA-F]+)$ Matched

Hide Details

runCmd: run output: Process 48806 stopped * thread #1, queue = 'com.apple.main-thread', stop reason = breakpoint 1.1 frame #0: 0x0000000100001c88 a.out`test_lookup_after_using_directive() at ns3.cpp:15:56 12 { 13 // BP_after_using_directive 14 //printf("func() = %d\n", func()); // eval func(), exp: error, ambiguous -> 15 std::printf("after using directive: func2() = %d\n", func2()); // eval func2(), exp: 3 ^ 16 std::printf("after using directive: ::func() = %d\n", ::func()); // eval ::func(), exp: 1 17 std::printf("after using directive: B::func() = %d\n", B::func()); // eval B::func(), exp: 4 18 }

Hide Details

Process 48806 launched: '/Users/buildslave/jenkins/workspace/lldb-cmake-reproducers/lldb-build/lldb-test-build.noindex/lang/cpp/namespace/TestNamespaceLookup.test_scope_ambiguity_after_using_lookup_with_run_command_dwarf/a.out' (x86_64)

Hide Details

Hide Details

runCmd: thread list output: Process 48806 stopped * thread #1: tid = 0x4a31ec, 0x0000000100001c88 a.out`test_lookup_after_using_directive() at ns3.cpp:15:56, queue = 'com.apple.main-thread', stop reason = breakpoint 1.1

Hide Details

Hide Details

Ran command: "thread list"

Hide Details

Got output: Process 48806 stopped * thread #1: tid = 0x4a31ec, 0x0000000100001c88 a.out`test_lookup_after_using_directive() at ns3.cpp:15:56, queue = 'com.apple.main-thread', stop reason = breakpoint 1.1

Hide Details

Expecting sub string: "stopped" (was found) Expecting sub string: "stop reason = breakpoint" (was found)

Hide Details

runCmd: expr -- func() output: (int) $0 = 1

Hide Details

Hide Details

Ran command: "expr -- func()"

Hide Details

Got output: (int) $0 = 1

Hide Details

Expecting start string: "error" (was not found)

Hide Details

XFAIL: LLDB (/Users/buildslave/jenkins/workspace/lldb-cmake-reproducers/lldb-build/bin/clang-x86_64) :: test_scope_ambiguity_after_using_lookup_with_run_command_dwarf (TestNamespaceLookup.NamespaceLookupTestCase) <bound method SBProcess.Kill of <lldb.SBProcess; proxy of <Swig Object of type 'lldb::SBProcess *' at 0x1014bc960> >>: success

Hide Details

UNSUPPORTED: LLDB (/Users/buildslave/jenkins/workspace/lldb-cmake-reproducers/lldb-build/bin/clang-x86_64) :: test_scope_ambiguity_after_using_lookup_with_run_command_dwo (TestNamespaceLookup.NamespaceLookupTestCase) (test case does not fall in any category of interest for this run) runCmd: settings clear -all output:

Hide Details

runCmd: settings set symbols.enable-external-lookup false output:

Hide Details

runCmd: settings set target.inherit-tcc true output:

Hide Details

runCmd: settings set target.auto-apply-fixits false output:

Hide Details

runCmd: settings set plugin.process.gdb-remote.packet-timeout 60 output:

Hide Details

runCmd: settings set symbols.clang-modules-cache-path "/Users/buildslave/jenkins/workspace/lldb-cmake-reproducers/lldb-build/lldb-test-build.noindex/module-cache-lldb/lldb-api" output:

Hide Details

runCmd: settings set use-color false output:

Hide Details

runCmd: setting set target.prefer-dynamic-value no-dynamic-values output:

Hide Details

XFAIL: LLDB (/Users/buildslave/jenkins/workspace/lldb-cmake-reproducers/lldb-build/bin/clang-x86_64) :: test_scope_ambiguity_after_using_lookup_with_run_command_gmodules (TestNamespaceLookup.NamespaceLookupTestCase) runCmd: settings clear -all output:

Hide Details

runCmd: settings set symbols.enable-external-lookup false output:

Hide Details

runCmd: settings set target.inherit-tcc true output:

Hide Details

runCmd: settings set target.auto-apply-fixits false output:

Hide Details

runCmd: settings set plugin.process.gdb-remote.packet-timeout 60 output:

Hide Details

runCmd: settings set symbols.clang-modules-cache-path "/Users/buildslave/jenkins/workspace/lldb-cmake-reproducers/lldb-build/lldb-test-build.noindex/module-cache-lldb/lldb-api" output:

Hide Details

runCmd: settings set use-color false output:

Hide Details

runCmd: setting set target.prefer-dynamic-value no-dynamic-values output:

Hide Details

runCmd: file /Users/buildslave/jenkins/workspace/lldb-cmake-reproducers/lldb-build/lldb-test-build.noindex/lang/cpp/namespace/TestNamespaceLookup.test_scope_lookup_before_using_with_run_command_dsym/a.out output: Current executable set to '/Users/buildslave/jenkins/workspace/lldb-cmake-reproducers/lldb-build/lldb-test-build.noindex/lang/cpp/namespace/TestNamespaceLookup.test_scope_lookup_before_using_with_run_command_dsym/a.out' (x86_64).

Hide Details

Hide Details

runCmd: breakpoint set -f "ns3.cpp" -l 7 output: Breakpoint 1: where = a.out`test_lookup_before_using_directive() + 4 at ns3.cpp:8:56, address = 0x0000000100001c64

Hide Details

Hide Details

Expecting pattern: ^Breakpoint (?P<bpno>[0-9]+): (?P<num_locations>[0-9]+) locations\.$ Not matched

Hide Details

Expecting pattern: ^Breakpoint (?P<bpno>[0-9]+): (?P<num_locations>no) locations \(pending\)\. Not matched

Hide Details

Expecting pattern: ^Breakpoint (?P<bpno>[0-9]+): where = (?P<module>.*)`(?P<symbol>[+\-]{0,1}[^+]+)( \+ (?P<offset>[0-9]+)){0,1}( \[inlined\] (?P<inline_symbol>.*)){0,1} at (?P<file>[^:]+):(?P<line_no>[0-9]+)(?P<column>(:[0-9]+)?), address = (?P<address>0x[0-9a-fA-F]+)$ Matched

Hide Details

runCmd: run output: Process 62404 stopped * thread #1, queue = 'com.apple.main-thread', stop reason = breakpoint 1.1 frame #0: 0x0000000100001c64 a.out`test_lookup_before_using_directive() at ns3.cpp:8:56 5 void test_lookup_before_using_directive() 6 { 7 // BP_before_using_directive -> 8 std::printf("before using directive: func() = %d\n", func()); // eval func(), exp: 1 ^ 9 } 10 using namespace A; 11 void test_lookup_after_using_directive()

Hide Details

Process 62404 launched: '/Users/buildslave/jenkins/workspace/lldb-cmake-reproducers/lldb-build/lldb-test-build.noindex/lang/cpp/namespace/TestNamespaceLookup.test_scope_lookup_before_using_with_run_command_dsym/a.out' (x86_64)

Hide Details

Hide Details

runCmd: thread list output: Process 62404 stopped * thread #1: tid = 0x4aa98e, 0x0000000100001c64 a.out`test_lookup_before_using_directive() at ns3.cpp:8:56, queue = 'com.apple.main-thread', stop reason = breakpoint 1.1

Hide Details

Hide Details

Ran command: "thread list"

Hide Details

Got output: Process 62404 stopped * thread #1: tid = 0x4aa98e, 0x0000000100001c64 a.out`test_lookup_before_using_directive() at ns3.cpp:8:56, queue = 'com.apple.main-thread', stop reason = breakpoint 1.1

Hide Details

Expecting sub string: "stopped" (was found) Expecting sub string: "stop reason = breakpoint" (was found)

Hide Details

runCmd: expr -- func() output: (int) $0 = 1

Hide Details

Hide Details

Ran command: "expr -- func()"

Hide Details

Got output: (int) $0 = 1

Hide Details

Expecting start string: "(int) $0 = 1" (was found)

Hide Details

<bound method SBProcess.Kill of <lldb.SBProcess; proxy of <Swig Object of type 'lldb::SBProcess *' at 0x1014bcea0> >>: success

Hide Details

PASS: LLDB (/Users/buildslave/jenkins/workspace/lldb-cmake-reproducers/lldb-build/bin/clang-x86_64) :: test_scope_lookup_before_using_with_run_command_dsym (TestNamespaceLookup.NamespaceLookupTestCase) runCmd: settings clear -all output:

Hide Details

runCmd: settings set symbols.enable-external-lookup false output:

Hide Details

runCmd: settings set target.inherit-tcc true output:

Hide Details

runCmd: settings set target.auto-apply-fixits false output:

Hide Details

runCmd: settings set plugin.process.gdb-remote.packet-timeout 60 output:

Hide Details

runCmd: settings set symbols.clang-modules-cache-path "/Users/buildslave/jenkins/workspace/lldb-cmake-reproducers/lldb-build/lldb-test-build.noindex/module-cache-lldb/lldb-api" output:

Hide Details

runCmd: settings set use-color false output:

Hide Details

runCmd: setting set target.prefer-dynamic-value no-dynamic-values output:

Hide Details

runCmd: file /Users/buildslave/jenkins/workspace/lldb-cmake-reproducers/lldb-build/lldb-test-build.noindex/lang/cpp/namespace/TestNamespaceLookup.test_scope_lookup_before_using_with_run_command_dwarf/a.out output: Current executable set to '/Users/buildslave/jenkins/workspace/lldb-cmake-reproducers/lldb-build/lldb-test-build.noindex/lang/cpp/namespace/TestNamespaceLookup.test_scope_lookup_before_using_with_run_command_dwarf/a.out' (x86_64).

Hide Details

Hide Details

runCmd: breakpoint set -f "ns3.cpp" -l 7 output: Breakpoint 1: where = a.out`test_lookup_before_using_directive() + 4 at ns3.cpp:8:56, address = 0x0000000100001c64

Hide Details

Hide Details

Expecting pattern: ^Breakpoint (?P<bpno>[0-9]+): (?P<num_locations>[0-9]+) locations\.$ Not matched

Hide Details

Expecting pattern: ^Breakpoint (?P<bpno>[0-9]+): (?P<num_locations>no) locations \(pending\)\. Not matched

Hide Details

Expecting pattern: ^Breakpoint (?P<bpno>[0-9]+): where = (?P<module>.*)`(?P<symbol>[+\-]{0,1}[^+]+)( \+ (?P<offset>[0-9]+)){0,1}( \[inlined\] (?P<inline_symbol>.*)){0,1} at (?P<file>[^:]+):(?P<line_no>[0-9]+)(?P<column>(:[0-9]+)?), address = (?P<address>0x[0-9a-fA-F]+)$ Matched

Hide Details

runCmd: run output: Process 62515 stopped * thread #1, queue = 'com.apple.main-thread', stop reason = breakpoint 1.1 frame #0: 0x0000000100001c64 a.out`test_lookup_before_using_directive() at ns3.cpp:8:56 5 void test_lookup_before_using_directive() 6 { 7 // BP_before_using_directive -> 8 std::printf("before using directive: func() = %d\n", func()); // eval func(), exp: 1 ^ 9 } 10 using namespace A; 11 void test_lookup_after_using_directive()

Hide Details

Process 62515 launched: '/Users/buildslave/jenkins/workspace/lldb-cmake-reproducers/lldb-build/lldb-test-build.noindex/lang/cpp/namespace/TestNamespaceLookup.test_scope_lookup_before_using_with_run_command_dwarf/a.out' (x86_64)

Hide Details

Hide Details

runCmd: thread list output: Process 62515 stopped * thread #1: tid = 0x4aaa7c, 0x0000000100001c64 a.out`test_lookup_before_using_directive() at ns3.cpp:8:56, queue = 'com.apple.main-thread', stop reason = breakpoint 1.1

Hide Details

Hide Details

Ran command: "thread list"

Hide Details

Got output: Process 62515 stopped * thread #1: tid = 0x4aaa7c, 0x0000000100001c64 a.out`test_lookup_before_using_directive() at ns3.cpp:8:56, queue = 'com.apple.main-thread', stop reason = breakpoint 1.1

Hide Details

Expecting sub string: "stopped" (was found) Expecting sub string: "stop reason = breakpoint" (was found)

Hide Details

runCmd: expr -- func() output: (int) $0 = 1

Hide Details

Hide Details

Ran command: "expr -- func()"

Hide Details

Got output: (int) $0 = 1

Hide Details

Expecting start string: "(int) $0 = 1" (was found)

Hide Details

<bound method SBProcess.Kill of <lldb.SBProcess; proxy of <Swig Object of type 'lldb::SBProcess *' at 0x1014bc930> >>: success

Hide Details

PASS: LLDB (/Users/buildslave/jenkins/workspace/lldb-cmake-reproducers/lldb-build/bin/clang-x86_64) :: test_scope_lookup_before_using_with_run_command_dwarf (TestNamespaceLookup.NamespaceLookupTestCase) UNSUPPORTED: LLDB (/Users/buildslave/jenkins/workspace/lldb-cmake-reproducers/lldb-build/bin/clang-x86_64) :: test_scope_lookup_before_using_with_run_command_dwo (TestNamespaceLookup.NamespaceLookupTestCase) (test case does not fall in any category of interest for this run) runCmd: settings clear -all output:

Hide Details

runCmd: settings set symbols.enable-external-lookup false output:

Hide Details

runCmd: settings set target.inherit-tcc true output:

Hide Details

runCmd: settings set target.auto-apply-fixits false output:

Hide Details

runCmd: settings set plugin.process.gdb-remote.packet-timeout 60 output:

Hide Details

runCmd: settings set symbols.clang-modules-cache-path "/Users/buildslave/jenkins/workspace/lldb-cmake-reproducers/lldb-build/lldb-test-build.noindex/module-cache-lldb/lldb-api" output:

Hide Details

runCmd: settings set use-color false output:

Hide Details

runCmd: setting set target.prefer-dynamic-value no-dynamic-values output:

Hide Details

FAIL: LLDB (/Users/buildslave/jenkins/workspace/lldb-cmake-reproducers/lldb-build/bin/clang-x86_64) :: test_scope_lookup_before_using_with_run_command_gmodules (TestNamespaceLookup.NamespaceLookupTestCase) runCmd: settings clear -all output:

Hide Details

runCmd: settings set symbols.enable-external-lookup false output:

Hide Details

runCmd: settings set target.inherit-tcc true output:

Hide Details

runCmd: settings set target.auto-apply-fixits false output:

Hide Details

runCmd: settings set plugin.process.gdb-remote.packet-timeout 60 output:

Hide Details

runCmd: settings set symbols.clang-modules-cache-path "/Users/buildslave/jenkins/workspace/lldb-cmake-reproducers/lldb-build/lldb-test-build.noindex/module-cache-lldb/lldb-api" output:

Hide Details

runCmd: settings set use-color false output:

Hide Details

runCmd: setting set target.prefer-dynamic-value no-dynamic-values output:

Hide Details

runCmd: file /Users/buildslave/jenkins/workspace/lldb-cmake-reproducers/lldb-build/lldb-test-build.noindex/lang/cpp/namespace/TestNamespaceLookup.test_scope_lookup_shadowed_by_using_with_run_command_dsym/a.out output: Current executable set to '/Users/buildslave/jenkins/workspace/lldb-cmake-reproducers/lldb-build/lldb-test-build.noindex/lang/cpp/namespace/TestNamespaceLookup.test_scope_lookup_shadowed_by_using_with_run_command_dsym/a.out' (x86_64).

Hide Details

Hide Details

runCmd: breakpoint set -f "ns2.cpp" -l 23 output: Breakpoint 1: where = a.out`A::B::test_lookup_at_nested_ns_scope() + 4 at ns2.cpp:24:62, address = 0x0000000100001b34

Hide Details

Hide Details

Expecting pattern: ^Breakpoint (?P<bpno>[0-9]+): (?P<num_locations>[0-9]+) locations\.$ Not matched

Hide Details

Expecting pattern: ^Breakpoint (?P<bpno>[0-9]+): (?P<num_locations>no) locations \(pending\)\. Not matched

Hide Details

Expecting pattern: ^Breakpoint (?P<bpno>[0-9]+): where = (?P<module>.*)`(?P<symbol>[+\-]{0,1}[^+]+)( \+ (?P<offset>[0-9]+)){0,1}( \[inlined\] (?P<inline_symbol>.*)){0,1} at (?P<file>[^:]+):(?P<line_no>[0-9]+)(?P<column>(:[0-9]+)?), address = (?P<address>0x[0-9a-fA-F]+)$ Matched

Hide Details

runCmd: run output: Process 62972 stopped * thread #1, queue = 'com.apple.main-thread', stop reason = breakpoint 1.1 frame #0: 0x0000000100001b34 a.out`A::B::test_lookup_at_nested_ns_scope() at ns2.cpp:24:62 21 void test_lookup_at_nested_ns_scope() 22 { 23 // BP_nested_ns_scope -> 24 std::printf("at nested ns scope: func() = %d\n", func()); // eval func(), exp: 4 ^ 25 26 //printf("func(10) = %d\n", func(10)); // eval func(10), exp: 13 27 // NOTE: Under the rules of C++, this test would normally get an error

Hide Details

Process 62972 launched: '/Users/buildslave/jenkins/workspace/lldb-cmake-reproducers/lldb-build/lldb-test-build.noindex/lang/cpp/namespace/TestNamespaceLookup.test_scope_lookup_shadowed_by_using_with_run_command_dsym/a.out' (x86_64)

Hide Details

Hide Details

runCmd: thread list output: Process 62972 stopped * thread #1: tid = 0x4aae5d, 0x0000000100001b34 a.out`A::B::test_lookup_at_nested_ns_scope() at ns2.cpp:24:62, queue = 'com.apple.main-thread', stop reason = breakpoint 1.1

Hide Details

Hide Details

Ran command: "thread list"

Hide Details

Got output: Process 62972 stopped * thread #1: tid = 0x4aae5d, 0x0000000100001b34 a.out`A::B::test_lookup_at_nested_ns_scope() at ns2.cpp:24:62, queue = 'com.apple.main-thread', stop reason = breakpoint 1.1

Hide Details

Expecting sub string: "stopped" (was found) Expecting sub string: "stop reason = breakpoint" (was found)

Hide Details

runCmd: expr -- func(10) output: (int) $0 = 13

Hide Details

Hide Details

Ran command: "expr -- func(10)"

Hide Details

Got output: (int) $0 = 13

Hide Details

Expecting start string: "(int) $0 = 13" (was found)

Hide Details

<bound method SBProcess.Kill of <lldb.SBProcess; proxy of <Swig Object of type 'lldb::SBProcess *' at 0x101611f90> >>: success

Hide Details

PASS: LLDB (/Users/buildslave/jenkins/workspace/lldb-cmake-reproducers/lldb-build/bin/clang-x86_64) :: test_scope_lookup_shadowed_by_using_with_run_command_dsym (TestNamespaceLookup.NamespaceLookupTestCase) runCmd: settings clear -all output:

Hide Details

runCmd: settings set symbols.enable-external-lookup false output:

Hide Details

runCmd: settings set target.inherit-tcc true output:

Hide Details

runCmd: settings set target.auto-apply-fixits false output:

Hide Details

runCmd: settings set plugin.process.gdb-remote.packet-timeout 60 output:

Hide Details

runCmd: settings set symbols.clang-modules-cache-path "/Users/buildslave/jenkins/workspace/lldb-cmake-reproducers/lldb-build/lldb-test-build.noindex/module-cache-lldb/lldb-api" output:

Hide Details

runCmd: settings set use-color false output:

Hide Details

runCmd: setting set target.prefer-dynamic-value no-dynamic-values output:

Hide Details

runCmd: file /Users/buildslave/jenkins/workspace/lldb-cmake-reproducers/lldb-build/lldb-test-build.noindex/lang/cpp/namespace/TestNamespaceLookup.test_scope_lookup_shadowed_by_using_with_run_command_dwarf/a.out output: Current executable set to '/Users/buildslave/jenkins/workspace/lldb-cmake-reproducers/lldb-build/lldb-test-build.noindex/lang/cpp/namespace/TestNamespaceLookup.test_scope_lookup_shadowed_by_using_with_run_command_dwarf/a.out' (x86_64).

Hide Details

Hide Details

runCmd: breakpoint set -f "ns2.cpp" -l 23 output: Breakpoint 1: where = a.out`A::B::test_lookup_at_nested_ns_scope() + 4 at ns2.cpp:24:62, address = 0x0000000100001b34

Hide Details

Hide Details

Expecting pattern: ^Breakpoint (?P<bpno>[0-9]+): (?P<num_locations>[0-9]+) locations\.$ Not matched

Hide Details

Expecting pattern: ^Breakpoint (?P<bpno>[0-9]+): (?P<num_locations>no) locations \(pending\)\. Not matched

Hide Details

Expecting pattern: ^Breakpoint (?P<bpno>[0-9]+): where = (?P<module>.*)`(?P<symbol>[+\-]{0,1}[^+]+)( \+ (?P<offset>[0-9]+)){0,1}( \[inlined\] (?P<inline_symbol>.*)){0,1} at (?P<file>[^:]+):(?P<line_no>[0-9]+)(?P<column>(:[0-9]+)?), address = (?P<address>0x[0-9a-fA-F]+)$ Matched

Hide Details

runCmd: run output: Process 63031 stopped * thread #1, queue = 'com.apple.main-thread', stop reason = breakpoint 1.1 frame #0: 0x0000000100001b34 a.out`A::B::test_lookup_at_nested_ns_scope() at ns2.cpp:24:62 21 void test_lookup_at_nested_ns_scope() 22 { 23 // BP_nested_ns_scope -> 24 std::printf("at nested ns scope: func() = %d\n", func()); // eval func(), exp: 4 ^ 25 26 //printf("func(10) = %d\n", func(10)); // eval func(10), exp: 13 27 // NOTE: Under the rules of C++, this test would normally get an error

Hide Details

Process 63031 launched: '/Users/buildslave/jenkins/workspace/lldb-cmake-reproducers/lldb-build/lldb-test-build.noindex/lang/cpp/namespace/TestNamespaceLookup.test_scope_lookup_shadowed_by_using_with_run_command_dwarf/a.out' (x86_64)

Hide Details

Hide Details

runCmd: thread list output: Process 63031 stopped * thread #1: tid = 0x4aaf05, 0x0000000100001b34 a.out`A::B::test_lookup_at_nested_ns_scope() at ns2.cpp:24:62, queue = 'com.apple.main-thread', stop reason = breakpoint 1.1

Hide Details

Hide Details

Ran command: "thread list"

Hide Details

Got output: Process 63031 stopped * thread #1: tid = 0x4aaf05, 0x0000000100001b34 a.out`A::B::test_lookup_at_nested_ns_scope() at ns2.cpp:24:62, queue = 'com.apple.main-thread', stop reason = breakpoint 1.1

Hide Details

Expecting sub string: "stopped" (was found) Expecting sub string: "stop reason = breakpoint" (was found)

Hide Details

runCmd: expr -- func(10) output: (int) $0 = 13

Hide Details

Hide Details

Ran command: "expr -- func(10)"

Hide Details

Got output: (int) $0 = 13

Hide Details

Expecting start string: "(int) $0 = 13" (was found)

Hide Details

<bound method SBProcess.Kill of <lldb.SBProcess; proxy of <Swig Object of type 'lldb::SBProcess *' at 0x1014bcea0> >>: success

Hide Details

PASS: LLDB (/Users/buildslave/jenkins/workspace/lldb-cmake-reproducers/lldb-build/bin/clang-x86_64) :: test_scope_lookup_shadowed_by_using_with_run_command_dwarf (TestNamespaceLookup.NamespaceLookupTestCase) UNSUPPORTED: LLDB (/Users/buildslave/jenkins/workspace/lldb-cmake-reproducers/lldb-build/bin/clang-x86_64) :: test_scope_lookup_shadowed_by_using_with_run_command_dwo (TestNamespaceLookup.NamespaceLookupTestCase) (test case does not fall in any category of interest for this run) runCmd: settings clear -all output:

Hide Details

runCmd: settings set symbols.enable-external-lookup false output:

Hide Details

runCmd: settings set target.inherit-tcc true output:

Hide Details

runCmd: settings set target.auto-apply-fixits false output:

Hide Details

runCmd: settings set plugin.process.gdb-remote.packet-timeout 60 output:

Hide Details

runCmd: settings set symbols.clang-modules-cache-path "/Users/buildslave/jenkins/workspace/lldb-cmake-reproducers/lldb-build/lldb-test-build.noindex/module-cache-lldb/lldb-api" output:

Hide Details

runCmd: settings set use-color false output:

Hide Details

runCmd: setting set target.prefer-dynamic-value no-dynamic-values output:

Hide Details

FAIL: LLDB (/Users/buildslave/jenkins/workspace/lldb-cmake-reproducers/lldb-build/bin/clang-x86_64) :: test_scope_lookup_shadowed_by_using_with_run_command_gmodules (TestNamespaceLookup.NamespaceLookupTestCase) runCmd: settings clear -all output:

Hide Details

runCmd: settings set symbols.enable-external-lookup false output:

Hide Details

runCmd: settings set target.inherit-tcc true output:

Hide Details

runCmd: settings set target.auto-apply-fixits false output:

Hide Details

runCmd: settings set plugin.process.gdb-remote.packet-timeout 60 output:

Hide Details

runCmd: settings set symbols.clang-modules-cache-path "/Users/buildslave/jenkins/workspace/lldb-cmake-reproducers/lldb-build/lldb-test-build.noindex/module-cache-lldb/lldb-api" output:

Hide Details

runCmd: settings set use-color false output:

Hide Details

runCmd: setting set target.prefer-dynamic-value no-dynamic-values output:

Hide Details

runCmd: file /Users/buildslave/jenkins/workspace/lldb-cmake-reproducers/lldb-build/lldb-test-build.noindex/lang/cpp/namespace/TestNamespaceLookup.test_scope_lookup_with_run_command_dsym/a.out output: Current executable set to '/Users/buildslave/jenkins/workspace/lldb-cmake-reproducers/lldb-build/lldb-test-build.noindex/lang/cpp/namespace/TestNamespaceLookup.test_scope_lookup_with_run_command_dsym/a.out' (x86_64).

Hide Details

Hide Details

runCmd: breakpoint set -f "ns.cpp" -l 20 output: Breakpoint 1: where = a.out`test_lookup_at_global_scope() + 8 at ns.cpp:21:48, address = 0x0000000100001a58

Hide Details

Hide Details

Expecting pattern: ^Breakpoint (?P<bpno>[0-9]+): (?P<num_locations>[0-9]+) locations\.$ Not matched

Hide Details

Expecting pattern: ^Breakpoint (?P<bpno>[0-9]+): (?P<num_locations>no) locations \(pending\)\. Not matched

Hide Details

Expecting pattern: ^Breakpoint (?P<bpno>[0-9]+): where = (?P<module>.*)`(?P<symbol>[+\-]{0,1}[^+]+)( \+ (?P<offset>[0-9]+)){0,1}( \[inlined\] (?P<inline_symbol>.*)){0,1} at (?P<file>[^:]+):(?P<line_no>[0-9]+)(?P<column>(:[0-9]+)?), address = (?P<address>0x[0-9a-fA-F]+)$ Matched

Hide Details

runCmd: breakpoint set -f "ns2.cpp" -l 52 output: Breakpoint 2: where = a.out`A::test_lookup_at_ns_scope() + 8 at ns2.cpp:53:52, address = 0x0000000100001c08

Hide Details

Hide Details

Expecting pattern: ^Breakpoint (?P<bpno>[0-9]+): (?P<num_locations>[0-9]+) locations\.$ Not matched

Hide Details

Expecting pattern: ^Breakpoint (?P<bpno>[0-9]+): (?P<num_locations>no) locations \(pending\)\. Not matched

Hide Details

Expecting pattern: ^Breakpoint (?P<bpno>[0-9]+): where = (?P<module>.*)`(?P<symbol>[+\-]{0,1}[^+]+)( \+ (?P<offset>[0-9]+)){0,1}( \[inlined\] (?P<inline_symbol>.*)){0,1} at (?P<file>[^:]+):(?P<line_no>[0-9]+)(?P<column>(:[0-9]+)?), address = (?P<address>0x[0-9a-fA-F]+)$ Matched

Hide Details

runCmd: breakpoint set -f "ns2.cpp" -l 23 output: Breakpoint 3: where = a.out`A::B::test_lookup_at_nested_ns_scope() + 4 at ns2.cpp:24:62, address = 0x0000000100001b34

Hide Details

Hide Details

Expecting pattern: ^Breakpoint (?P<bpno>[0-9]+): (?P<num_locations>[0-9]+) locations\.$ Not matched

Hide Details

Expecting pattern: ^Breakpoint (?P<bpno>[0-9]+): (?P<num_locations>no) locations \(pending\)\. Not matched

Hide Details

Expecting pattern: ^Breakpoint (?P<bpno>[0-9]+): where = (?P<module>.*)`(?P<symbol>[+\-]{0,1}[^+]+)( \+ (?P<offset>[0-9]+)){0,1}( \[inlined\] (?P<inline_symbol>.*)){0,1} at (?P<file>[^:]+):(?P<line_no>[0-9]+)(?P<column>(:[0-9]+)?), address = (?P<address>0x[0-9a-fA-F]+)$ Matched

Hide Details

runCmd: breakpoint set -f "ns2.cpp" -l 34 output: Breakpoint 4: where = a.out`A::B::test_lookup_at_nested_ns_scope_after_using() + 4 at ns2.cpp:36:74, address = 0x0000000100001b54

Hide Details

Hide Details

Expecting pattern: ^Breakpoint (?P<bpno>[0-9]+): (?P<num_locations>[0-9]+) locations\.$ Not matched

Hide Details

Expecting pattern: ^Breakpoint (?P<bpno>[0-9]+): (?P<num_locations>no) locations \(pending\)\. Not matched

Hide Details

Expecting pattern: ^Breakpoint (?P<bpno>[0-9]+): where = (?P<module>.*)`(?P<symbol>[+\-]{0,1}[^+]+)( \+ (?P<offset>[0-9]+)){0,1}( \[inlined\] (?P<inline_symbol>.*)){0,1} at (?P<file>[^:]+):(?P<line_no>[0-9]+)(?P<column>(:[0-9]+)?), address = (?P<address>0x[0-9a-fA-F]+)$ Matched

Hide Details

runCmd: breakpoint set -f "ns3.cpp" -l 7 output: Breakpoint 5: where = a.out`test_lookup_before_using_directive() + 4 at ns3.cpp:8:56, address = 0x0000000100001c64

Hide Details

Hide Details

Expecting pattern: ^Breakpoint (?P<bpno>[0-9]+): (?P<num_locations>[0-9]+) locations\.$ Not matched

Hide Details

Expecting pattern: ^Breakpoint (?P<bpno>[0-9]+): (?P<num_locations>no) locations \(pending\)\. Not matched

Hide Details

Expecting pattern: ^Breakpoint (?P<bpno>[0-9]+): where = (?P<module>.*)`(?P<symbol>[+\-]{0,1}[^+]+)( \+ (?P<offset>[0-9]+)){0,1}( \[inlined\] (?P<inline_symbol>.*)){0,1} at (?P<file>[^:]+):(?P<line_no>[0-9]+)(?P<column>(:[0-9]+)?), address = (?P<address>0x[0-9a-fA-F]+)$ Matched

Hide Details

runCmd: breakpoint set -f "ns3.cpp" -l 13 output: Breakpoint 6: where = a.out`test_lookup_after_using_directive() + 8 at ns3.cpp:15:56, address = 0x0000000100001c88

Hide Details

Hide Details

Expecting pattern: ^Breakpoint (?P<bpno>[0-9]+): (?P<num_locations>[0-9]+) locations\.$ Not matched

Hide Details

Expecting pattern: ^Breakpoint (?P<bpno>[0-9]+): (?P<num_locations>no) locations \(pending\)\. Not matched

Hide Details

Expecting pattern: ^Breakpoint (?P<bpno>[0-9]+): where = (?P<module>.*)`(?P<symbol>[+\-]{0,1}[^+]+)( \+ (?P<offset>[0-9]+)){0,1}( \[inlined\] (?P<inline_symbol>.*)){0,1} at (?P<file>[^:]+):(?P<line_no>[0-9]+)(?P<column>(:[0-9]+)?), address = (?P<address>0x[0-9a-fA-F]+)$ Matched

Hide Details

runCmd: run output: Process 63135 stopped * thread #1, queue = 'com.apple.main-thread', stop reason = breakpoint 1.1 frame #0: 0x0000000100001a58 a.out`test_lookup_at_global_scope() at ns.cpp:21:48 18 void test_lookup_at_global_scope() 19 { 20 // BP_global_scope -> 21 std::printf("at global scope: foo() = %d\n", foo()); // eval foo(), exp: 42 ^ 22 std::printf("at global scope: func() = %d\n", func()); // eval func(), exp: 1 23 }

Hide Details

Process 63135 launched: '/Users/buildslave/jenkins/workspace/lldb-cmake-reproducers/lldb-build/lldb-test-build.noindex/lang/cpp/namespace/TestNamespaceLookup.test_scope_lookup_with_run_command_dsym/a.out' (x86_64)

Hide Details

Hide Details

runCmd: thread list output: Process 63135 stopped * thread #1: tid = 0x4ab011, 0x0000000100001a58 a.out`test_lookup_at_global_scope() at ns.cpp:21:48, queue = 'com.apple.main-thread', stop reason = breakpoint 1.1

Hide Details

Hide Details

Ran command: "thread list"

Hide Details

Got output: Process 63135 stopped * thread #1: tid = 0x4ab011, 0x0000000100001a58 a.out`test_lookup_at_global_scope() at ns.cpp:21:48, queue = 'com.apple.main-thread', stop reason = breakpoint 1.1

Hide Details

Expecting sub string: "stopped" (was found) Expecting sub string: "stop reason = breakpoint" (was found)

Hide Details

runCmd: expr -- func() output: (int) $0 = 1

Hide Details

Hide Details

Ran command: "expr -- func()"

Hide Details

Got output: (int) $0 = 1

Hide Details

Expecting start string: "(int) $0 = 1" (was found)

Hide Details

runCmd: expr -- A::B::func() output: (int) $1 = 4

Hide Details

Hide Details

Ran command: "expr -- A::B::func()"

Hide Details

Got output: (int) $1 = 4

Hide Details

Expecting start string: "(int) $1 = 4" (was found)

Hide Details

runCmd: expr -- func(10) output: (int) $2 = 11

Hide Details

Hide Details

Ran command: "expr -- func(10)"

Hide Details

Got output: (int) $2 = 11

Hide Details

Expecting start string: "(int) $2 = 11" (was found)

Hide Details

runCmd: expr -- ::func() output: (int) $3 = 1

Hide Details

Hide Details

Ran command: "expr -- ::func()"

Hide Details

Got output: (int) $3 = 1

Hide Details

Expecting start string: "(int) $3 = 1" (was found)

Hide Details

runCmd: expr -- A::foo() output: (int) $4 = 42

Hide Details

Hide Details

Ran command: "expr -- A::foo()"

Hide Details

Got output: (int) $4 = 42

Hide Details

Expecting start string: "(int) $4 = 42" (was found)

Hide Details

runCmd: continue output: Process 63135 resuming Process 63135 stopped * thread #1, queue = 'com.apple.main-thread', stop reason = breakpoint 2.1 frame #0: 0x0000000100001c08 a.out`A::test_lookup_at_ns_scope() at ns2.cpp:53:52 50 void A::test_lookup_at_ns_scope() 51 { 52 // BP_ns_scope -> 53 std::printf("at nested ns scope: func() = %d\n", func()); // eval func(), exp: 3 ^ 54 std::printf("at nested ns scope: func(10) = %d\n", func(10)); // eval func(10), exp: 13 55 std::printf("at nested ns scope: foo() = %d\n", foo()); // eval foo(), exp: 42 56 }

Hide Details

Hide Details

Hide Details

runCmd: thread list output: Process 63135 stopped * thread #1: tid = 0x4ab011, 0x0000000100001c08 a.out`A::test_lookup_at_ns_scope() at ns2.cpp:53:52, queue = 'com.apple.main-thread', stop reason = breakpoint 2.1

Hide Details

Hide Details

Ran command: "thread list"

Hide Details

Got output: Process 63135 stopped * thread #1: tid = 0x4ab011, 0x0000000100001c08 a.out`A::test_lookup_at_ns_scope() at ns2.cpp:53:52, queue = 'com.apple.main-thread', stop reason = breakpoint 2.1

Hide Details

Expecting sub string: "stopped" (was found) Expecting sub string: "stop reason = breakpoint" (was found)

Hide Details

runCmd: expr -- func(10) output: (int) $5 = 13

Hide Details

Hide Details

Ran command: "expr -- func(10)"

Hide Details

Got output: (int) $5 = 13

Hide Details

Expecting start string: "(int) $5 = 13" (was found)

Hide Details

runCmd: expr -- B::func() output: (int) $6 = 4

Hide Details

Hide Details

Ran command: "expr -- B::func()"

Hide Details

Got output: (int) $6 = 4

Hide Details

Expecting start string: "(int) $6 = 4" (was found)

Hide Details

runCmd: expr -- func() output: (int) $7 = 3

Hide Details

Hide Details

Ran command: "expr -- func()"

Hide Details

Got output: (int) $7 = 3

Hide Details

Expecting start string: "(int) $7 = 3" (was found)

Hide Details

runCmd: continue output: Process 63135 resuming Process 63135 stopped * thread #1, queue = 'com.apple.main-thread', stop reason = breakpoint 3.1 frame #0: 0x0000000100001b34 a.out`A::B::test_lookup_at_nested_ns_scope() at ns2.cpp:24:62 21 void test_lookup_at_nested_ns_scope() 22 { 23 // BP_nested_ns_scope -> 24 std::printf("at nested ns scope: func() = %d\n", func()); // eval func(), exp: 4 ^ 25 26 //printf("func(10) = %d\n", func(10)); // eval func(10), exp: 13 27 // NOTE: Under the rules of C++, this test would normally get an error

Hide Details

Hide Details

Hide Details

runCmd: thread list output: Process 63135 stopped * thread #1: tid = 0x4ab011, 0x0000000100001b34 a.out`A::B::test_lookup_at_nested_ns_scope() at ns2.cpp:24:62, queue = 'com.apple.main-thread', stop reason = breakpoint 3.1

Hide Details

Hide Details

Ran command: "thread list"

Hide Details

Got output: Process 63135 stopped * thread #1: tid = 0x4ab011, 0x0000000100001b34 a.out`A::B::test_lookup_at_nested_ns_scope() at ns2.cpp:24:62, queue = 'com.apple.main-thread', stop reason = breakpoint 3.1

Hide Details

Expecting sub string: "stopped" (was found) Expecting sub string: "stop reason = breakpoint" (was found)

Hide Details

runCmd: expr -- func() output: (int) $8 = 4

Hide Details

Hide Details

Ran command: "expr -- func()"

Hide Details

Got output: (int) $8 = 4

Hide Details

Expecting start string: "(int) $8 = 4" (was found)

Hide Details

runCmd: expr -- A::func() output: (int) $9 = 3

Hide Details

Hide Details

Ran command: "expr -- A::func()"

Hide Details

Got output: (int) $9 = 3

Hide Details

Expecting start string: "(int) $9 = 3" (was found)

Hide Details

runCmd: expr -- func(10) output: (int) $10 = 13

Hide Details

Hide Details

Ran command: "expr -- func(10)"

Hide Details

Got output: (int) $10 = 13

Hide Details

Expecting start string: "(int) $10 = 13" (was found)

Hide Details

runCmd: continue output: Process 63135 resuming Process 63135 stopped * thread #1, queue = 'com.apple.main-thread', stop reason = breakpoint 4.1 frame #0: 0x0000000100001b54 a.out`A::B::test_lookup_at_nested_ns_scope_after_using() at ns2.cpp:36:74 33 { 34 // BP_nested_ns_scope_after_using 35 using A::func; -> 36 std::printf("at nested ns scope after using: func() = %d\n", func()); // eval func(), exp: 3 ^ 37 } 38 } 39 }

Hide Details

Hide Details

Hide Details

runCmd: thread list output: Process 63135 stopped * thread #1: tid = 0x4ab011, 0x0000000100001b54 a.out`A::B::test_lookup_at_nested_ns_scope_after_using() at ns2.cpp:36:74, queue = 'com.apple.main-thread', stop reason = breakpoint 4.1

Hide Details

Hide Details

Ran command: "thread list"

Hide Details

Got output: Process 63135 stopped * thread #1: tid = 0x4ab011, 0x0000000100001b54 a.out`A::B::test_lookup_at_nested_ns_scope_after_using() at ns2.cpp:36:74, queue = 'com.apple.main-thread', stop reason = breakpoint 4.1

Hide Details

Expecting sub string: "stopped" (was found) Expecting sub string: "stop reason = breakpoint" (was found)

Hide Details

runCmd: expr -- A::func(10) output: (int) $11 = 13

Hide Details

Hide Details

Ran command: "expr -- A::func(10)"

Hide Details

Got output: (int) $11 = 13

Hide Details

Expecting start string: "(int) $11 = 13" (was found)

Hide Details

runCmd: continue output: Process 63135 resuming Process 63135 stopped * thread #1, queue = 'com.apple.main-thread', stop reason = breakpoint 5.1 frame #0: 0x0000000100001c64 a.out`test_lookup_before_using_directive() at ns3.cpp:8:56 5 void test_lookup_before_using_directive() 6 { 7 // BP_before_using_directive -> 8 std::printf("before using directive: func() = %d\n", func()); // eval func(), exp: 1 ^ 9 } 10 using namespace A; 11 void test_lookup_after_using_directive()

Hide Details

Hide Details

Hide Details

runCmd: thread list output: Process 63135 stopped * thread #1: tid = 0x4ab011, 0x0000000100001c64 a.out`test_lookup_before_using_directive() at ns3.cpp:8:56, queue = 'com.apple.main-thread', stop reason = breakpoint 5.1

Hide Details

Hide Details

Ran command: "thread list"

Hide Details

Got output: Process 63135 stopped * thread #1: tid = 0x4ab011, 0x0000000100001c64 a.out`test_lookup_before_using_directive() at ns3.cpp:8:56, queue = 'com.apple.main-thread', stop reason = breakpoint 5.1

Hide Details

Expecting sub string: "stopped" (was found) Expecting sub string: "stop reason = breakpoint" (was found)

Hide Details

runCmd: expr -- ::func() output: (int) $12 = 1

Hide Details

Hide Details

Ran command: "expr -- ::func()"

Hide Details

Got output: (int) $12 = 1

Hide Details

Expecting start string: "(int) $12 = 1" (was found)

Hide Details

runCmd: expr -- B::func() output: (int) $13 = 4

Hide Details

Hide Details

Ran command: "expr -- B::func()"

Hide Details

Got output: (int) $13 = 4

Hide Details

Expecting start string: "(int) $13 = 4" (was found)

Hide Details

runCmd: continue output: Process 63135 resuming Process 63135 stopped * thread #1, queue = 'com.apple.main-thread', stop reason = breakpoint 6.1 frame #0: 0x0000000100001c88 a.out`test_lookup_after_using_directive() at ns3.cpp:15:56 12 { 13 // BP_after_using_directive 14 //printf("func() = %d\n", func()); // eval func(), exp: error, ambiguous -> 15 std::printf("after using directive: func2() = %d\n", func2()); // eval func2(), exp: 3 ^ 16 std::printf("after using directive: ::func() = %d\n", ::func()); // eval ::func(), exp: 1 17 std::printf("after using directive: B::func() = %d\n", B::func()); // eval B::func(), exp: 4 18 }

Hide Details

Hide Details

Hide Details

runCmd: thread list output: Process 63135 stopped * thread #1: tid = 0x4ab011, 0x0000000100001c88 a.out`test_lookup_after_using_directive() at ns3.cpp:15:56, queue = 'com.apple.main-thread', stop reason = breakpoint 6.1

Hide Details

Hide Details

Ran command: "thread list"

Hide Details

Got output: Process 63135 stopped * thread #1: tid = 0x4ab011, 0x0000000100001c88 a.out`test_lookup_after_using_directive() at ns3.cpp:15:56, queue = 'com.apple.main-thread', stop reason = breakpoint 6.1

Hide Details

Expecting sub string: "stopped" (was found) Expecting sub string: "stop reason = breakpoint" (was found)

Hide Details

runCmd: expr -- ::func() output: (int) $14 = 1

Hide Details

Hide Details

Ran command: "expr -- ::func()"

Hide Details

Got output: (int) $14 = 1

Hide Details

Expecting start string: "(int) $14 = 1" (was found)

Hide Details

runCmd: expr -- B::func() output: (int) $15 = 4

Hide Details

Hide Details

Ran command: "expr -- B::func()"

Hide Details

Got output: (int) $15 = 4

Hide Details

Expecting start string: "(int) $15 = 4" (was found)

Hide Details

<bound method SBProcess.Kill of <lldb.SBProcess; proxy of <Swig Object of type 'lldb::SBProcess *' at 0x1014bcea0> >>: success

Hide Details

PASS: LLDB (/Users/buildslave/jenkins/workspace/lldb-cmake-reproducers/lldb-build/bin/clang-x86_64) :: test_scope_lookup_with_run_command_dsym (TestNamespaceLookup.NamespaceLookupTestCase) runCmd: settings clear -all output:

Hide Details

runCmd: settings set symbols.enable-external-lookup false output:

Hide Details

runCmd: settings set target.inherit-tcc true output:

Hide Details

runCmd: settings set target.auto-apply-fixits false output:

Hide Details

runCmd: settings set plugin.process.gdb-remote.packet-timeout 60 output:

Hide Details

runCmd: settings set symbols.clang-modules-cache-path "/Users/buildslave/jenkins/workspace/lldb-cmake-reproducers/lldb-build/lldb-test-build.noindex/module-cache-lldb/lldb-api" output:

Hide Details

runCmd: settings set use-color false output:

Hide Details

runCmd: setting set target.prefer-dynamic-value no-dynamic-values output:

Hide Details

runCmd: file /Users/buildslave/jenkins/workspace/lldb-cmake-reproducers/lldb-build/lldb-test-build.noindex/lang/cpp/namespace/TestNamespaceLookup.test_scope_lookup_with_run_command_dwarf/a.out output: Current executable set to '/Users/buildslave/jenkins/workspace/lldb-cmake-reproducers/lldb-build/lldb-test-build.noindex/lang/cpp/namespace/TestNamespaceLookup.test_scope_lookup_with_run_command_dwarf/a.out' (x86_64).

Hide Details

Hide Details

runCmd: breakpoint set -f "ns.cpp" -l 20 output: Breakpoint 1: where = a.out`test_lookup_at_global_scope() + 8 at ns.cpp:21:48, address = 0x0000000100001a58

Hide Details

Hide Details

Expecting pattern: ^Breakpoint (?P<bpno>[0-9]+): (?P<num_locations>[0-9]+) locations\.$ Not matched

Hide Details

Expecting pattern: ^Breakpoint (?P<bpno>[0-9]+): (?P<num_locations>no) locations \(pending\)\. Not matched

Hide Details

Expecting pattern: ^Breakpoint (?P<bpno>[0-9]+): where = (?P<module>.*)`(?P<symbol>[+\-]{0,1}[^+]+)( \+ (?P<offset>[0-9]+)){0,1}( \[inlined\] (?P<inline_symbol>.*)){0,1} at (?P<file>[^:]+):(?P<line_no>[0-9]+)(?P<column>(:[0-9]+)?), address = (?P<address>0x[0-9a-fA-F]+)$ Matched

Hide Details

runCmd: breakpoint set -f "ns2.cpp" -l 52 output: Breakpoint 2: where = a.out`A::test_lookup_at_ns_scope() + 8 at ns2.cpp:53:52, address = 0x0000000100001c08

Hide Details

Hide Details

Expecting pattern: ^Breakpoint (?P<bpno>[0-9]+): (?P<num_locations>[0-9]+) locations\.$ Not matched

Hide Details

Expecting pattern: ^Breakpoint (?P<bpno>[0-9]+): (?P<num_locations>no) locations \(pending\)\. Not matched

Hide Details

Expecting pattern: ^Breakpoint (?P<bpno>[0-9]+): where = (?P<module>.*)`(?P<symbol>[+\-]{0,1}[^+]+)( \+ (?P<offset>[0-9]+)){0,1}( \[inlined\] (?P<inline_symbol>.*)){0,1} at (?P<file>[^:]+):(?P<line_no>[0-9]+)(?P<column>(:[0-9]+)?), address = (?P<address>0x[0-9a-fA-F]+)$ Matched

Hide Details

runCmd: breakpoint set -f "ns2.cpp" -l 23 output: Breakpoint 3: where = a.out`A::B::test_lookup_at_nested_ns_scope() + 4 at ns2.cpp:24:62, address = 0x0000000100001b34

Hide Details

Hide Details

Expecting pattern: ^Breakpoint (?P<bpno>[0-9]+): (?P<num_locations>[0-9]+) locations\.$ Not matched

Hide Details

Expecting pattern: ^Breakpoint (?P<bpno>[0-9]+): (?P<num_locations>no) locations \(pending\)\. Not matched

Hide Details

Expecting pattern: ^Breakpoint (?P<bpno>[0-9]+): where = (?P<module>.*)`(?P<symbol>[+\-]{0,1}[^+]+)( \+ (?P<offset>[0-9]+)){0,1}( \[inlined\] (?P<inline_symbol>.*)){0,1} at (?P<file>[^:]+):(?P<line_no>[0-9]+)(?P<column>(:[0-9]+)?), address = (?P<address>0x[0-9a-fA-F]+)$ Matched

Hide Details

runCmd: breakpoint set -f "ns2.cpp" -l 34 output: Breakpoint 4: where = a.out`A::B::test_lookup_at_nested_ns_scope_after_using() + 4 at ns2.cpp:36:74, address = 0x0000000100001b54

Hide Details

Hide Details

Expecting pattern: ^Breakpoint (?P<bpno>[0-9]+): (?P<num_locations>[0-9]+) locations\.$ Not matched

Hide Details

Expecting pattern: ^Breakpoint (?P<bpno>[0-9]+): (?P<num_locations>no) locations \(pending\)\. Not matched

Hide Details

Expecting pattern: ^Breakpoint (?P<bpno>[0-9]+): where = (?P<module>.*)`(?P<symbol>[+\-]{0,1}[^+]+)( \+ (?P<offset>[0-9]+)){0,1}( \[inlined\] (?P<inline_symbol>.*)){0,1} at (?P<file>[^:]+):(?P<line_no>[0-9]+)(?P<column>(:[0-9]+)?), address = (?P<address>0x[0-9a-fA-F]+)$ Matched

Hide Details

runCmd: breakpoint set -f "ns3.cpp" -l 7 output: Breakpoint 5: where = a.out`test_lookup_before_using_directive() + 4 at ns3.cpp:8:56, address = 0x0000000100001c64

Hide Details

Hide Details

Expecting pattern: ^Breakpoint (?P<bpno>[0-9]+): (?P<num_locations>[0-9]+) locations\.$ Not matched

Hide Details

Expecting pattern: ^Breakpoint (?P<bpno>[0-9]+): (?P<num_locations>no) locations \(pending\)\. Not matched

Hide Details

Expecting pattern: ^Breakpoint (?P<bpno>[0-9]+): where = (?P<module>.*)`(?P<symbol>[+\-]{0,1}[^+]+)( \+ (?P<offset>[0-9]+)){0,1}( \[inlined\] (?P<inline_symbol>.*)){0,1} at (?P<file>[^:]+):(?P<line_no>[0-9]+)(?P<column>(:[0-9]+)?), address = (?P<address>0x[0-9a-fA-F]+)$ Matched

Hide Details

runCmd: breakpoint set -f "ns3.cpp" -l 13 output: Breakpoint 6: where = a.out`test_lookup_after_using_directive() + 8 at ns3.cpp:15:56, address = 0x0000000100001c88

Hide Details

Hide Details

Expecting pattern: ^Breakpoint (?P<bpno>[0-9]+): (?P<num_locations>[0-9]+) locations\.$ Not matched

Hide Details

Expecting pattern: ^Breakpoint (?P<bpno>[0-9]+): (?P<num_locations>no) locations \(pending\)\. Not matched

Hide Details

Expecting pattern: ^Breakpoint (?P<bpno>[0-9]+): where = (?P<module>.*)`(?P<symbol>[+\-]{0,1}[^+]+)( \+ (?P<offset>[0-9]+)){0,1}( \[inlined\] (?P<inline_symbol>.*)){0,1} at (?P<file>[^:]+):(?P<line_no>[0-9]+)(?P<column>(:[0-9]+)?), address = (?P<address>0x[0-9a-fA-F]+)$ Matched

Hide Details

runCmd: run output: Process 63196 stopped * thread #1, queue = 'com.apple.main-thread', stop reason = breakpoint 1.1 frame #0: 0x0000000100001a58 a.out`test_lookup_at_global_scope() at ns.cpp:21:48 18 void test_lookup_at_global_scope() 19 { 20 // BP_global_scope -> 21 std::printf("at global scope: foo() = %d\n", foo()); // eval foo(), exp: 42 ^ 22 std::printf("at global scope: func() = %d\n", func()); // eval func(), exp: 1 23 }

Hide Details

Process 63196 launched: '/Users/buildslave/jenkins/workspace/lldb-cmake-reproducers/lldb-build/lldb-test-build.noindex/lang/cpp/namespace/TestNamespaceLookup.test_scope_lookup_with_run_command_dwarf/a.out' (x86_64)

Hide Details

Hide Details

runCmd: thread list output: Process 63196 stopped * thread #1: tid = 0x4ab0cf, 0x0000000100001a58 a.out`test_lookup_at_global_scope() at ns.cpp:21:48, queue = 'com.apple.main-thread', stop reason = breakpoint 1.1

Hide Details

Hide Details

Ran command: "thread list"

Hide Details

Got output: Process 63196 stopped * thread #1: tid = 0x4ab0cf, 0x0000000100001a58 a.out`test_lookup_at_global_scope() at ns.cpp:21:48, queue = 'com.apple.main-thread', stop reason = breakpoint 1.1

Hide Details

Expecting sub string: "stopped" (was found) Expecting sub string: "stop reason = breakpoint" (was found)

Hide Details

runCmd: expr -- func() output: (int) $0 = 1

Hide Details

Hide Details

Ran command: "expr -- func()"

Hide Details

Got output: (int) $0 = 1

Hide Details

Expecting start string: "(int) $0 = 1" (was found)

Hide Details

runCmd: expr -- A::B::func() output: (int) $1 = 4

Hide Details

Hide Details

Ran command: "expr -- A::B::func()"

Hide Details

Got output: (int) $1 = 4

Hide Details

Expecting start string: "(int) $1 = 4" (was found)

Hide Details

runCmd: expr -- func(10) output: (int) $2 = 11

Hide Details

Hide Details

Ran command: "expr -- func(10)"

Hide Details

Got output: (int) $2 = 11

Hide Details

Expecting start string: "(int) $2 = 11" (was found)

Hide Details

runCmd: expr -- ::func() output: (int) $3 = 1

Hide Details

Hide Details

Ran command: "expr -- ::func()"

Hide Details

Got output: (int) $3 = 1

Hide Details

Expecting start string: "(int) $3 = 1" (was found)

Hide Details

runCmd: expr -- A::foo() output: (int) $4 = 42

Hide Details

Hide Details

Ran command: "expr -- A::foo()"

Hide Details

Got output: (int) $4 = 42

Hide Details

Expecting start string: "(int) $4 = 42" (was found)

Hide Details

runCmd: continue output: Process 63196 resuming Process 63196 stopped * thread #1, queue = 'com.apple.main-thread', stop reason = breakpoint 2.1 frame #0: 0x0000000100001c08 a.out`A::test_lookup_at_ns_scope() at ns2.cpp:53:52 50 void A::test_lookup_at_ns_scope() 51 { 52 // BP_ns_scope -> 53 std::printf("at nested ns scope: func() = %d\n", func()); // eval func(), exp: 3 ^ 54 std::printf("at nested ns scope: func(10) = %d\n", func(10)); // eval func(10), exp: 13 55 std::printf("at nested ns scope: foo() = %d\n", foo()); // eval foo(), exp: 42 56 }

Hide Details

Hide Details

Hide Details

runCmd: thread list output: Process 63196 stopped * thread #1: tid = 0x4ab0cf, 0x0000000100001c08 a.out`A::test_lookup_at_ns_scope() at ns2.cpp:53:52, queue = 'com.apple.main-thread', stop reason = breakpoint 2.1

Hide Details

Hide Details

Ran command: "thread list"

Hide Details

Got output: Process 63196 stopped * thread #1: tid = 0x4ab0cf, 0x0000000100001c08 a.out`A::test_lookup_at_ns_scope() at ns2.cpp:53:52, queue = 'com.apple.main-thread', stop reason = breakpoint 2.1

Hide Details

Expecting sub string: "stopped" (was found) Expecting sub string: "stop reason = breakpoint" (was found)

Hide Details

runCmd: expr -- func(10) output: (int) $5 = 13

Hide Details

Hide Details

Ran command: "expr -- func(10)"

Hide Details

Got output: (int) $5 = 13

Hide Details

Expecting start string: "(int) $5 = 13" (was found)

Hide Details

runCmd: expr -- B::func() output: (int) $6 = 4

Hide Details

Hide Details

Ran command: "expr -- B::func()"

Hide Details

Got output: (int) $6 = 4

Hide Details

Expecting start string: "(int) $6 = 4" (was found)

Hide Details

runCmd: expr -- func() output: (int) $7 = 3

Hide Details

Hide Details

Ran command: "expr -- func()"

Hide Details

Got output: (int) $7 = 3

Hide Details

Expecting start string: "(int) $7 = 3" (was found)

Hide Details

runCmd: continue output: Process 63196 resuming Process 63196 stopped * thread #1, queue = 'com.apple.main-thread', stop reason = breakpoint 3.1 frame #0: 0x0000000100001b34 a.out`A::B::test_lookup_at_nested_ns_scope() at ns2.cpp:24:62 21 void test_lookup_at_nested_ns_scope() 22 { 23 // BP_nested_ns_scope -> 24 std::printf("at nested ns scope: func() = %d\n", func()); // eval func(), exp: 4 ^ 25 26 //printf("func(10) = %d\n", func(10)); // eval func(10), exp: 13 27 // NOTE: Under the rules of C++, this test would normally get an error

Hide Details

Hide Details

Hide Details

runCmd: thread list output: Process 63196 stopped * thread #1: tid = 0x4ab0cf, 0x0000000100001b34 a.out`A::B::test_lookup_at_nested_ns_scope() at ns2.cpp:24:62, queue = 'com.apple.main-thread', stop reason = breakpoint 3.1

Hide Details

Hide Details

Ran command: "thread list"

Hide Details

Got output: Process 63196 stopped * thread #1: tid = 0x4ab0cf, 0x0000000100001b34 a.out`A::B::test_lookup_at_nested_ns_scope() at ns2.cpp:24:62, queue = 'com.apple.main-thread', stop reason = breakpoint 3.1

Hide Details

Expecting sub string: "stopped" (was found) Expecting sub string: "stop reason = breakpoint" (was found)

Hide Details

runCmd: expr -- func() output: (int) $8 = 4

Hide Details

Hide Details

Ran command: "expr -- func()"

Hide Details

Got output: (int) $8 = 4

Hide Details

Expecting start string: "(int) $8 = 4" (was found)

Hide Details

runCmd: expr -- A::func() output: (int) $9 = 3

Hide Details

Hide Details

Ran command: "expr -- A::func()"

Hide Details

Got output: (int) $9 = 3

Hide Details

Expecting start string: "(int) $9 = 3" (was found)

Hide Details

runCmd: expr -- func(10) output: (int) $10 = 13

Hide Details

Hide Details

Ran command: "expr -- func(10)"

Hide Details

Got output: (int) $10 = 13

Hide Details

Expecting start string: "(int) $10 = 13" (was found)

Hide Details

runCmd: continue output: Process 63196 resuming Process 63196 stopped * thread #1, queue = 'com.apple.main-thread', stop reason = breakpoint 4.1 frame #0: 0x0000000100001b54 a.out`A::B::test_lookup_at_nested_ns_scope_after_using() at ns2.cpp:36:74 33 { 34 // BP_nested_ns_scope_after_using 35 using A::func; -> 36 std::printf("at nested ns scope after using: func() = %d\n", func()); // eval func(), exp: 3 ^ 37 } 38 } 39 }

Hide Details

Hide Details

Hide Details

runCmd: thread list output: Process 63196 stopped * thread #1: tid = 0x4ab0cf, 0x0000000100001b54 a.out`A::B::test_lookup_at_nested_ns_scope_after_using() at ns2.cpp:36:74, queue = 'com.apple.main-thread', stop reason = breakpoint 4.1

Hide Details

Hide Details

Ran command: "thread list"

Hide Details

Got output: Process 63196 stopped * thread #1: tid = 0x4ab0cf, 0x0000000100001b54 a.out`A::B::test_lookup_at_nested_ns_scope_after_using() at ns2.cpp:36:74, queue = 'com.apple.main-thread', stop reason = breakpoint 4.1

Hide Details

Expecting sub string: "stopped" (was found) Expecting sub string: "stop reason = breakpoint" (was found)

Hide Details

runCmd: expr -- A::func(10) output: (int) $11 = 13

Hide Details

Hide Details

Ran command: "expr -- A::func(10)"

Hide Details

Got output: (int) $11 = 13

Hide Details

Expecting start string: "(int) $11 = 13" (was found)

Hide Details

runCmd: continue output: Process 63196 resuming Process 63196 stopped * thread #1, queue = 'com.apple.main-thread', stop reason = breakpoint 5.1 frame #0: 0x0000000100001c64 a.out`test_lookup_before_using_directive() at ns3.cpp:8:56 5 void test_lookup_before_using_directive() 6 { 7 // BP_before_using_directive -> 8 std::printf("before using directive: func() = %d\n", func()); // eval func(), exp: 1 ^ 9 } 10 using namespace A; 11 void test_lookup_after_using_directive()

Hide Details

Hide Details

Hide Details

runCmd: thread list output: Process 63196 stopped * thread #1: tid = 0x4ab0cf, 0x0000000100001c64 a.out`test_lookup_before_using_directive() at ns3.cpp:8:56, queue = 'com.apple.main-thread', stop reason = breakpoint 5.1

Hide Details

Hide Details

Ran command: "thread list"

Hide Details

Got output: Process 63196 stopped * thread #1: tid = 0x4ab0cf, 0x0000000100001c64 a.out`test_lookup_before_using_directive() at ns3.cpp:8:56, queue = 'com.apple.main-thread', stop reason = breakpoint 5.1

Hide Details

Expecting sub string: "stopped" (was found) Expecting sub string: "stop reason = breakpoint" (was found)

Hide Details

runCmd: expr -- ::func() output: (int) $12 = 1

Hide Details

Hide Details

Ran command: "expr -- ::func()"

Hide Details

Got output: (int) $12 = 1

Hide Details

Expecting start string: "(int) $12 = 1" (was found)

Hide Details

runCmd: expr -- B::func() output: (int) $13 = 4

Hide Details

Hide Details

Ran command: "expr -- B::func()"

Hide Details

Got output: (int) $13 = 4

Hide Details

Expecting start string: "(int) $13 = 4" (was found)

Hide Details

runCmd: continue output: Process 63196 resuming Process 63196 stopped * thread #1, queue = 'com.apple.main-thread', stop reason = breakpoint 6.1 frame #0: 0x0000000100001c88 a.out`test_lookup_after_using_directive() at ns3.cpp:15:56 12 { 13 // BP_after_using_directive 14 //printf("func() = %d\n", func()); // eval func(), exp: error, ambiguous -> 15 std::printf("after using directive: func2() = %d\n", func2()); // eval func2(), exp: 3 ^ 16 std::printf("after using directive: ::func() = %d\n", ::func()); // eval ::func(), exp: 1 17 std::printf("after using directive: B::func() = %d\n", B::func()); // eval B::func(), exp: 4 18 }

Hide Details

Hide Details

Hide Details

runCmd: thread list output: Process 63196 stopped * thread #1: tid = 0x4ab0cf, 0x0000000100001c88 a.out`test_lookup_after_using_directive() at ns3.cpp:15:56, queue = 'com.apple.main-thread', stop reason = breakpoint 6.1

Hide Details

Hide Details

Ran command: "thread list"

Hide Details

Got output: Process 63196 stopped * thread #1: tid = 0x4ab0cf, 0x0000000100001c88 a.out`test_lookup_after_using_directive() at ns3.cpp:15:56, queue = 'com.apple.main-thread', stop reason = breakpoint 6.1

Hide Details

Expecting sub string: "stopped" (was found) Expecting sub string: "stop reason = breakpoint" (was found)

Hide Details

runCmd: expr -- ::func() output: (int) $14 = 1

Hide Details

Hide Details

Ran command: "expr -- ::func()"

Hide Details

Got output: (int) $14 = 1

Hide Details

Expecting start string: "(int) $14 = 1" (was found)

Hide Details

runCmd: expr -- B::func() output: (int) $15 = 4

Hide Details

Hide Details

Ran command: "expr -- B::func()"

Hide Details

Got output: (int) $15 = 4

Hide Details

Expecting start string: "(int) $15 = 4" (was found)

Hide Details

<bound method SBProcess.Kill of <lldb.SBProcess; proxy of <Swig Object of type 'lldb::SBProcess *' at 0x101bdcd80> >>: success

Hide Details

PASS: LLDB (/Users/buildslave/jenkins/workspace/lldb-cmake-reproducers/lldb-build/bin/clang-x86_64) :: test_scope_lookup_with_run_command_dwarf (TestNamespaceLookup.NamespaceLookupTestCase) UNSUPPORTED: LLDB (/Users/buildslave/jenkins/workspace/lldb-cmake-reproducers/lldb-build/bin/clang-x86_64) :: test_scope_lookup_with_run_command_dwo (TestNamespaceLookup.NamespaceLookupTestCase) (test case does not fall in any category of interest for this run) runCmd: settings clear -all output:

Hide Details

runCmd: settings set symbols.enable-external-lookup false output:

Hide Details

runCmd: settings set target.inherit-tcc true output:

Hide Details

runCmd: settings set target.auto-apply-fixits false output:

Hide Details

runCmd: settings set plugin.process.gdb-remote.packet-timeout 60 output:

Hide Details

runCmd: settings set symbols.clang-modules-cache-path "/Users/buildslave/jenkins/workspace/lldb-cmake-reproducers/lldb-build/lldb-test-build.noindex/module-cache-lldb/lldb-api" output:

Hide Details

runCmd: settings set use-color false output:

Hide Details

runCmd: setting set target.prefer-dynamic-value no-dynamic-values output:

Hide Details

FAIL: LLDB (/Users/buildslave/jenkins/workspace/lldb-cmake-reproducers/lldb-build/bin/clang-x86_64) :: test_scope_lookup_with_run_command_gmodules (TestNamespaceLookup.NamespaceLookupTestCase) Restore dir to: /Users/buildslave/jenkins/workspace/lldb-cmake-reproducers/lldb-build/tools/lldb/test ====================================================================== ERROR: test_scope_after_using_directive_lookup_with_run_command_gmodules (TestNamespaceLookup.NamespaceLookupTestCase) Test scope lookup after using directive in lldb. ---------------------------------------------------------------------- Error when building test subject.

Hide Details

Build Command: make VPATH=/Users/buildslave/jenkins/workspace/lldb-cmake-reproducers/llvm-project/lldb/test/API/lang/cpp/namespace -C /Users/buildslave/jenkins/workspace/lldb-cmake-reproducers/lldb-build/lldb-test-build.noindex/lang/cpp/namespace/TestNamespaceLookup.test_scope_after_using_directive_lookup_with_run_command_gmodules -I /Users/buildslave/jenkins/workspace/lldb-cmake-reproducers/llvm-project/lldb/test/API/lang/cpp/namespace -I /Users/buildslave/jenkins/workspace/lldb-cmake-reproducers/llvm-project/lldb/packages/Python/lldbsuite/test/make -f /Users/buildslave/jenkins/workspace/lldb-cmake-reproducers/llvm-project/lldb/test/API/lang/cpp/namespace/Makefile MAKE_DSYM=NO MAKE_GMODULES=YES ARCH=x86_64 CC="/Users/buildslave/jenkins/workspace/lldb-cmake-reproducers/lldb-build/bin/clang" DSYMUTIL="/Users/buildslave/jenkins/workspace/lldb-cmake-reproducers/lldb-build/./bin/dsymutil" CLANG_MODULE_CACHE_DIR=/Users/buildslave/jenkins/workspace/lldb-cmake-reproducers/lldb-build/lldb-test-build.noindex/module-cache-clang/lldb-api

Hide Details

Build Command Output: While building module 'std' imported from /Users/buildslave/jenkins/workspace/lldb-cmake-reproducers/llvm-project/lldb/test/API/lang/cpp/namespace/ns.h:1: In file included from <module-includes>:31: In file included from /Users/buildslave/jenkins/workspace/lldb-cmake-reproducers/lldb-build/bin/../include/c++/v1/complex.h:28: In file included from /Users/buildslave/jenkins/workspace/lldb-cmake-reproducers/lldb-build/bin/../include/c++/v1/ccomplex:20: In file included from /Users/buildslave/jenkins/workspace/lldb-cmake-reproducers/lldb-build/bin/../include/c++/v1/complex:247: In file included from /Users/buildslave/jenkins/workspace/lldb-cmake-reproducers/lldb-build/bin/../include/c++/v1/sstream:173: /Users/buildslave/jenkins/workspace/lldb-cmake-reproducers/lldb-build/bin/../include/c++/v1/ostream:1038:45: error: no template named 'enable_if_t'; did you mean 'enable_if'? template <class _Stream, class _Tp, class = enable_if_t< ^ /Users/buildslave/jenkins/workspace/lldb-cmake-reproducers/lldb-build/bin/../include/c++/v1/type_traits:538:63: note: 'enable_if' declared here template <bool, class _Tp = void> struct _LIBCPP_TEMPLATE_VIS enable_if {}; ^ While building module 'std' imported from /Users/buildslave/jenkins/workspace/lldb-cmake-reproducers/llvm-project/lldb/test/API/lang/cpp/namespace/ns.h:1: In file included from <module-includes>:31: In file included from /Users/buildslave/jenkins/workspace/lldb-cmake-reproducers/lldb-build/bin/../include/c++/v1/complex.h:28: In file included from /Users/buildslave/jenkins/workspace/lldb-cmake-reproducers/lldb-build/bin/../include/c++/v1/ccomplex:20: In file included from /Users/buildslave/jenkins/workspace/lldb-cmake-reproducers/lldb-build/bin/../include/c++/v1/complex:247: In file included from /Users/buildslave/jenkins/workspace/lldb-cmake-reproducers/lldb-build/bin/../include/c++/v1/sstream:174: /Users/buildslave/jenkins/workspace/lldb-cmake-reproducers/lldb-build/bin/../include/c++/v1/istream:1389:45: error: no template named 'enable_if_t'; did you mean 'enable_if'? template <class _Stream, class _Tp, class = enable_if_t< ^ /Users/buildslave/jenkins/workspace/lldb-cmake-reproducers/lldb-build/bin/../include/c++/v1/type_traits:538:63: note: 'enable_if' declared here template <bool, class _Tp = void> struct _LIBCPP_TEMPLATE_VIS enable_if {}; ^ In file included from /Users/buildslave/jenkins/workspace/lldb-cmake-reproducers/llvm-project/lldb/test/API/lang/cpp/namespace/ns3.cpp:1: /Users/buildslave/jenkins/workspace/lldb-cmake-reproducers/llvm-project/lldb/test/API/lang/cpp/namespace/ns.h:1:10: fatal error: could not build module 'std' #include <cstdio> ~~~~~~~~^ 3 errors generated. While building module 'std' imported from /Users/buildslave/jenkins/workspace/lldb-cmake-reproducers/llvm-project/lldb/test/API/lang/cpp/namespace/ns.h:1: In file included from <module-includes>:31: In file included from /Users/buildslave/jenkins/workspace/lldb-cmake-reproducers/lldb-build/bin/../include/c++/v1/complex.h:28: In file included from /Users/buildslave/jenkins/workspace/lldb-cmake-reproducers/lldb-build/bin/../include/c++/v1/ccomplex:20: In file included from /Users/buildslave/jenkins/workspace/lldb-cmake-reproducers/lldb-build/bin/../include/c++/v1/complex:247: In file included from /Users/buildslave/jenkins/workspace/lldb-cmake-reproducers/lldb-build/bin/../include/c++/v1/sstream:173: /Users/buildslave/jenkins/workspace/lldb-cmake-reproducers/lldb-build/bin/../include/c++/v1/ostream:1038:45: error: no template named 'enable_if_t'; did you mean 'enable_if'? template <class _Stream, class _Tp, class = enable_if_t< ^ /Users/buildslave/jenkins/workspace/lldb-cmake-reproducers/lldb-build/bin/../include/c++/v1/type_traits:538:63: note: 'enable_if' declared here template <bool, class _Tp = void> struct _LIBCPP_TEMPLATE_VIS enable_if {}; ^ While building module 'std' imported from /Users/buildslave/jenkins/workspace/lldb-cmake-reproducers/llvm-project/lldb/test/API/lang/cpp/namespace/ns.h:1: In file included from <module-includes>:31: In file included from /Users/buildslave/jenkins/workspace/lldb-cmake-reproducers/lldb-build/bin/../include/c++/v1/complex.h:28: In file included from /Users/buildslave/jenkins/workspace/lldb-cmake-reproducers/lldb-build/bin/../include/c++/v1/ccomplex:20: In file included from /Users/buildslave/jenkins/workspace/lldb-cmake-reproducers/lldb-build/bin/../include/c++/v1/complex:247: In file included from /Users/buildslave/jenkins/workspace/lldb-cmake-reproducers/lldb-build/bin/../include/c++/v1/sstream:174: /Users/buildslave/jenkins/workspace/lldb-cmake-reproducers/lldb-build/bin/../include/c++/v1/istream:1389:45: error: no template named 'enable_if_t'; did you mean 'enable_if'? template <class _Stream, class _Tp, class = enable_if_t< ^ /Users/buildslave/jenkins/workspace/lldb-cmake-reproducers/lldb-build/bin/../include/c++/v1/type_traits:538:63: note: 'enable_if' declared here template <bool, class _Tp = void> struct _LIBCPP_TEMPLATE_VIS enable_if {}; ^ In file included from /Users/buildslave/jenkins/workspace/lldb-cmake-reproducers/llvm-project/lldb/test/API/lang/cpp/namespace/ns2.cpp:1: /Users/buildslave/jenkins/workspace/lldb-cmake-reproducers/llvm-project/lldb/test/API/lang/cpp/namespace/ns.h:1:10: fatal error: could not build module 'std' #include <cstdio> ~~~~~~~~^ 3 errors generated. While building module 'std' imported from /Users/buildslave/jenkins/workspace/lldb-cmake-reproducers/llvm-project/lldb/test/API/lang/cpp/namespace/ns.h:1: In file included from <module-includes>:31: In file included from /Users/buildslave/jenkins/workspace/lldb-cmake-reproducers/lldb-build/bin/../include/c++/v1/complex.h:28: In file included from /Users/buildslave/jenkins/workspace/lldb-cmake-reproducers/lldb-build/bin/../include/c++/v1/ccomplex:20: In file included from /Users/buildslave/jenkins/workspace/lldb-cmake-reproducers/lldb-build/bin/../include/c++/v1/complex:247: In file included from /Users/buildslave/jenkins/workspace/lldb-cmake-reproducers/lldb-build/bin/../include/c++/v1/sstream:173: /Users/buildslave/jenkins/workspace/lldb-cmake-reproducers/lldb-build/bin/../include/c++/v1/ostream:1038:45: error: no template named 'enable_if_t'; did you mean 'enable_if'? template <class _Stream, class _Tp, class = enable_if_t< ^ /Users/buildslave/jenkins/workspace/lldb-cmake-reproducers/lldb-build/bin/../include/c++/v1/type_traits:538:63: note: 'enable_if' declared here template <bool, class _Tp = void> struct _LIBCPP_TEMPLATE_VIS enable_if {}; ^ While building module 'std' imported from /Users/buildslave/jenkins/workspace/lldb-cmake-reproducers/llvm-project/lldb/test/API/lang/cpp/namespace/ns.h:1: In file included from <module-includes>:31: In file included from /Users/buildslave/jenkins/workspace/lldb-cmake-reproducers/lldb-build/bin/../include/c++/v1/complex.h:28: In file included from /Users/buildslave/jenkins/workspace/lldb-cmake-reproducers/lldb-build/bin/../include/c++/v1/ccomplex:20: In file included from /Users/buildslave/jenkins/workspace/lldb-cmake-reproducers/lldb-build/bin/../include/c++/v1/complex:247: In file included from /Users/buildslave/jenkins/workspace/lldb-cmake-reproducers/lldb-build/bin/../include/c++/v1/sstream:174: /Users/buildslave/jenkins/workspace/lldb-cmake-reproducers/lldb-build/bin/../include/c++/v1/istream:1389:45: error: no template named 'enable_if_t'; did you mean 'enable_if'? template <class _Stream, class _Tp, class = enable_if_t< ^ /Users/buildslave/jenkins/workspace/lldb-cmake-reproducers/lldb-build/bin/../include/c++/v1/type_traits:538:63: note: 'enable_if' declared here template <bool, class _Tp = void> struct _LIBCPP_TEMPLATE_VIS enable_if {}; ^ In file included from /Users/buildslave/jenkins/workspace/lldb-cmake-reproducers/llvm-project/lldb/test/API/lang/cpp/namespace/ns.cpp:1: /Users/buildslave/jenkins/workspace/lldb-cmake-reproducers/llvm-project/lldb/test/API/lang/cpp/namespace/ns.h:1:10: fatal error: could not build module 'std' #include <cstdio> ~~~~~~~~^ 3 errors generated. While building module 'std' imported from /Users/buildslave/jenkins/workspace/lldb-cmake-reproducers/llvm-project/lldb/test/API/lang/cpp/namespace/main.cpp:1: In file included from <module-includes>:31: In file included from /Users/buildslave/jenkins/workspace/lldb-cmake-reproducers/lldb-build/bin/../include/c++/v1/complex.h:28: In file included from /Users/buildslave/jenkins/workspace/lldb-cmake-reproducers/lldb-build/bin/../include/c++/v1/ccomplex:20: In file included from /Users/buildslave/jenkins/workspace/lldb-cmake-reproducers/lldb-build/bin/../include/c++/v1/complex:247: In file included from /Users/buildslave/jenkins/workspace/lldb-cmake-reproducers/lldb-build/bin/../include/c++/v1/sstream:173: /Users/buildslave/jenkins/workspace/lldb-cmake-reproducers/lldb-build/bin/../include/c++/v1/ostream:1038:45: error: no template named 'enable_if_t'; did you mean 'enable_if'? template <class _Stream, class _Tp, class = enable_if_t< ^ /Users/buildslave/jenkins/workspace/lldb-cmake-reproducers/lldb-build/bin/../include/c++/v1/type_traits:538:63: note: 'enable_if' declared here template <bool, class _Tp = void> struct _LIBCPP_TEMPLATE_VIS enable_if {}; ^ While building module 'std' imported from /Users/buildslave/jenkins/workspace/lldb-cmake-reproducers/llvm-project/lldb/test/API/lang/cpp/namespace/main.cpp:1: In file included from <module-includes>:31: In file included from /Users/buildslave/jenkins/workspace/lldb-cmake-reproducers/lldb-build/bin/../include/c++/v1/complex.h:28: In file included from /Users/buildslave/jenkins/workspace/lldb-cmake-reproducers/lldb-build/bin/../include/c++/v1/ccomplex:20: In file included from /Users/buildslave/jenkins/workspace/lldb-cmake-reproducers/lldb-build/bin/../include/c++/v1/complex:247: In file included from /Users/buildslave/jenkins/workspace/lldb-cmake-reproducers/lldb-build/bin/../include/c++/v1/sstream:174: /Users/buildslave/jenkins/workspace/lldb-cmake-reproducers/lldb-build/bin/../include/c++/v1/istream:1389:45: error: no template named 'enable_if_t'; did you mean 'enable_if'? template <class _Stream, class _Tp, class = enable_if_t< ^ /Users/buildslave/jenkins/workspace/lldb-cmake-reproducers/lldb-build/bin/../include/c++/v1/type_traits:538:63: note: 'enable_if' declared here template <bool, class _Tp = void> struct _LIBCPP_TEMPLATE_VIS enable_if {}; ^ /Users/buildslave/jenkins/workspace/lldb-cmake-reproducers/llvm-project/lldb/test/API/lang/cpp/namespace/main.cpp:1:10: fatal error: could not build module 'std' #include <cstdarg> ~~~~~~~~^ 3 errors generated. /Users/buildslave/jenkins/workspace/lldb-cmake-reproducers/lldb-build/bin/clang -fmodules -gmodules -fmodules-cache-path=/Users/buildslave/jenkins/workspace/lldb-cmake-reproducers/lldb-build/lldb-test-build.noindex/module-cache-clang/lldb-api -gmodules -fcxx-modules -std=c++11 -g -O0 -fno-builtin -isysroot "/Applications/Xcode.app/Contents/Developer/Platforms/MacOSX.platform/Developer/SDKs/MacOSX10.15.sdk" -arch x86_64 -I/Users/buildslave/jenkins/workspace/lldb-cmake-reproducers/llvm-project/lldb/packages/Python/lldbsuite/test/make/../../../../../include -I/Users/buildslave/jenkins/workspace/lldb-cmake-reproducers/llvm-project/lldb/test/API/lang/cpp/namespace -I/Users/buildslave/jenkins/workspace/lldb-cmake-reproducers/llvm-project/lldb/packages/Python/lldbsuite/test/make -include /Users/buildslave/jenkins/workspace/lldb-cmake-reproducers/llvm-project/lldb/packages/Python/lldbsuite/test/make/test_common.h -fno-limit-debug-info -fmodules -gmodules -fmodules-cache-path=/Users/buildslave/jenkins/workspace/lldb-cmake-reproducers/lldb-build/lldb-test-build.noindex/module-cache-clang/lldb-api -gmodules -fcxx-modules --driver-mode=g++ -c -o main.o /Users/buildslave/jenkins/workspace/lldb-cmake-reproducers/llvm-project/lldb/test/API/lang/cpp/namespace/main.cpp While building module 'std' imported from /Users/buildslave/jenkins/workspace/lldb-cmake-reproducers/llvm-project/lldb/test/API/lang/cpp/namespace/main.cpp:1: In file included from <module-includes>:31: In file included from /Users/buildslave/jenkins/workspace/lldb-cmake-reproducers/lldb-build/bin/../include/c++/v1/complex.h:28: In file included from /Users/buildslave/jenkins/workspace/lldb-cmake-reproducers/lldb-build/bin/../include/c++/v1/ccomplex:20: In file included from /Users/buildslave/jenkins/workspace/lldb-cmake-reproducers/lldb-build/bin/../include/c++/v1/complex:247: In file included from /Users/buildslave/jenkins/workspace/lldb-cmake-reproducers/lldb-build/bin/../include/c++/v1/sstream:173: /Users/buildslave/jenkins/workspace/lldb-cmake-reproducers/lldb-build/bin/../include/c++/v1/ostream:1038:45: error: no template named 'enable_if_t'; did you mean 'enable_if'? template <class _Stream, class _Tp, class = enable_if_t< ^ /Users/buildslave/jenkins/workspace/lldb-cmake-reproducers/lldb-build/bin/../include/c++/v1/type_traits:538:63: note: 'enable_if' declared here template <bool, class _Tp = void> struct _LIBCPP_TEMPLATE_VIS enable_if {}; ^ While building module 'std' imported from /Users/buildslave/jenkins/workspace/lldb-cmake-reproducers/llvm-project/lldb/test/API/lang/cpp/namespace/main.cpp:1: In file included from <module-includes>:31: In file included from /Users/buildslave/jenkins/workspace/lldb-cmake-reproducers/lldb-build/bin/../include/c++/v1/complex.h:28: In file included from /Users/buildslave/jenkins/workspace/lldb-cmake-reproducers/lldb-build/bin/../include/c++/v1/ccomplex:20: In file included from /Users/buildslave/jenkins/workspace/lldb-cmake-reproducers/lldb-build/bin/../include/c++/v1/complex:247: In file included from /Users/buildslave/jenkins/workspace/lldb-cmake-reproducers/lldb-build/bin/../include/c++/v1/sstream:174: /Users/buildslave/jenkins/workspace/lldb-cmake-reproducers/lldb-build/bin/../include/c++/v1/istream:1389:45: error: no template named 'enable_if_t'; did you mean 'enable_if'? template <class _Stream, class _Tp, class = enable_if_t< ^ /Users/buildslave/jenkins/workspace/lldb-cmake-reproducers/lldb-build/bin/../include/c++/v1/type_traits:538:63: note: 'enable_if' declared here template <bool, class _Tp = void> struct _LIBCPP_TEMPLATE_VIS enable_if {}; ^ /Users/buildslave/jenkins/workspace/lldb-cmake-reproducers/llvm-project/lldb/test/API/lang/cpp/namespace/main.cpp:1:10: fatal error: could not build module 'std' #include <cstdarg> ~~~~~~~~^ 3 errors generated. make: *** [main.o] Error 1

Hide Details

Test Directory: /Users/buildslave/jenkins/workspace/lldb-cmake-reproducers/llvm-project/lldb/test/API/lang/cpp/namespace ====================================================================== ERROR: test_scope_lookup_before_using_with_run_command_gmodules (TestNamespaceLookup.NamespaceLookupTestCase) Test scope lookup before using in lldb. ---------------------------------------------------------------------- Error when building test subject.

Hide Details

Build Command: make VPATH=/Users/buildslave/jenkins/workspace/lldb-cmake-reproducers/llvm-project/lldb/test/API/lang/cpp/namespace -C /Users/buildslave/jenkins/workspace/lldb-cmake-reproducers/lldb-build/lldb-test-build.noindex/lang/cpp/namespace/TestNamespaceLookup.test_scope_lookup_before_using_with_run_command_gmodules -I /Users/buildslave/jenkins/workspace/lldb-cmake-reproducers/llvm-project/lldb/test/API/lang/cpp/namespace -I /Users/buildslave/jenkins/workspace/lldb-cmake-reproducers/llvm-project/lldb/packages/Python/lldbsuite/test/make -f /Users/buildslave/jenkins/workspace/lldb-cmake-reproducers/llvm-project/lldb/test/API/lang/cpp/namespace/Makefile MAKE_DSYM=NO MAKE_GMODULES=YES ARCH=x86_64 CC="/Users/buildslave/jenkins/workspace/lldb-cmake-reproducers/lldb-build/bin/clang" DSYMUTIL="/Users/buildslave/jenkins/workspace/lldb-cmake-reproducers/lldb-build/./bin/dsymutil" CLANG_MODULE_CACHE_DIR=/Users/buildslave/jenkins/workspace/lldb-cmake-reproducers/lldb-build/lldb-test-build.noindex/module-cache-clang/lldb-api

Hide Details

Build Command Output: While building module 'std' imported from /Users/buildslave/jenkins/workspace/lldb-cmake-reproducers/llvm-project/lldb/test/API/lang/cpp/namespace/ns.h:1: In file included from <module-includes>:31: In file included from /Users/buildslave/jenkins/workspace/lldb-cmake-reproducers/lldb-build/bin/../include/c++/v1/complex.h:28: In file included from /Users/buildslave/jenkins/workspace/lldb-cmake-reproducers/lldb-build/bin/../include/c++/v1/ccomplex:20: In file included from /Users/buildslave/jenkins/workspace/lldb-cmake-reproducers/lldb-build/bin/../include/c++/v1/complex:247: In file included from /Users/buildslave/jenkins/workspace/lldb-cmake-reproducers/lldb-build/bin/../include/c++/v1/sstream:173: /Users/buildslave/jenkins/workspace/lldb-cmake-reproducers/lldb-build/bin/../include/c++/v1/ostream:1038:45: error: no template named 'enable_if_t'; did you mean 'enable_if'? template <class _Stream, class _Tp, class = enable_if_t< ^ /Users/buildslave/jenkins/workspace/lldb-cmake-reproducers/lldb-build/bin/../include/c++/v1/type_traits:538:63: note: 'enable_if' declared here template <bool, class _Tp = void> struct _LIBCPP_TEMPLATE_VIS enable_if {}; ^ While building module 'std' imported from /Users/buildslave/jenkins/workspace/lldb-cmake-reproducers/llvm-project/lldb/test/API/lang/cpp/namespace/ns.h:1: In file included from <module-includes>:31: In file included from /Users/buildslave/jenkins/workspace/lldb-cmake-reproducers/lldb-build/bin/../include/c++/v1/complex.h:28: In file included from /Users/buildslave/jenkins/workspace/lldb-cmake-reproducers/lldb-build/bin/../include/c++/v1/ccomplex:20: In file included from /Users/buildslave/jenkins/workspace/lldb-cmake-reproducers/lldb-build/bin/../include/c++/v1/complex:247: In file included from /Users/buildslave/jenkins/workspace/lldb-cmake-reproducers/lldb-build/bin/../include/c++/v1/sstream:174: /Users/buildslave/jenkins/workspace/lldb-cmake-reproducers/lldb-build/bin/../include/c++/v1/istream:1389:45: error: no template named 'enable_if_t'; did you mean 'enable_if'? template <class _Stream, class _Tp, class = enable_if_t< ^ /Users/buildslave/jenkins/workspace/lldb-cmake-reproducers/lldb-build/bin/../include/c++/v1/type_traits:538:63: note: 'enable_if' declared here template <bool, class _Tp = void> struct _LIBCPP_TEMPLATE_VIS enable_if {}; ^ In file included from /Users/buildslave/jenkins/workspace/lldb-cmake-reproducers/llvm-project/lldb/test/API/lang/cpp/namespace/ns3.cpp:1: /Users/buildslave/jenkins/workspace/lldb-cmake-reproducers/llvm-project/lldb/test/API/lang/cpp/namespace/ns.h:1:10: fatal error: could not build module 'std' #include <cstdio> ~~~~~~~~^ 3 errors generated. While building module 'std' imported from /Users/buildslave/jenkins/workspace/lldb-cmake-reproducers/llvm-project/lldb/test/API/lang/cpp/namespace/ns.h:1: In file included from <module-includes>:31: In file included from /Users/buildslave/jenkins/workspace/lldb-cmake-reproducers/lldb-build/bin/../include/c++/v1/complex.h:28: In file included from /Users/buildslave/jenkins/workspace/lldb-cmake-reproducers/lldb-build/bin/../include/c++/v1/ccomplex:20: In file included from /Users/buildslave/jenkins/workspace/lldb-cmake-reproducers/lldb-build/bin/../include/c++/v1/complex:247: In file included from /Users/buildslave/jenkins/workspace/lldb-cmake-reproducers/lldb-build/bin/../include/c++/v1/sstream:173: /Users/buildslave/jenkins/workspace/lldb-cmake-reproducers/lldb-build/bin/../include/c++/v1/ostream:1038:45: error: no template named 'enable_if_t'; did you mean 'enable_if'? template <class _Stream, class _Tp, class = enable_if_t< ^ /Users/buildslave/jenkins/workspace/lldb-cmake-reproducers/lldb-build/bin/../include/c++/v1/type_traits:538:63: note: 'enable_if' declared here template <bool, class _Tp = void> struct _LIBCPP_TEMPLATE_VIS enable_if {}; ^ While building module 'std' imported from /Users/buildslave/jenkins/workspace/lldb-cmake-reproducers/llvm-project/lldb/test/API/lang/cpp/namespace/ns.h:1: In file included from <module-includes>:31: In file included from /Users/buildslave/jenkins/workspace/lldb-cmake-reproducers/lldb-build/bin/../include/c++/v1/complex.h:28: In file included from /Users/buildslave/jenkins/workspace/lldb-cmake-reproducers/lldb-build/bin/../include/c++/v1/ccomplex:20: In file included from /Users/buildslave/jenkins/workspace/lldb-cmake-reproducers/lldb-build/bin/../include/c++/v1/complex:247: In file included from /Users/buildslave/jenkins/workspace/lldb-cmake-reproducers/lldb-build/bin/../include/c++/v1/sstream:174: /Users/buildslave/jenkins/workspace/lldb-cmake-reproducers/lldb-build/bin/../include/c++/v1/istream:1389:45: error: no template named 'enable_if_t'; did you mean 'enable_if'? template <class _Stream, class _Tp, class = enable_if_t< ^ /Users/buildslave/jenkins/workspace/lldb-cmake-reproducers/lldb-build/bin/../include/c++/v1/type_traits:538:63: note: 'enable_if' declared here template <bool, class _Tp = void> struct _LIBCPP_TEMPLATE_VIS enable_if {}; ^ In file included from /Users/buildslave/jenkins/workspace/lldb-cmake-reproducers/llvm-project/lldb/test/API/lang/cpp/namespace/ns2.cpp:1: /Users/buildslave/jenkins/workspace/lldb-cmake-reproducers/llvm-project/lldb/test/API/lang/cpp/namespace/ns.h:1:10: fatal error: could not build module 'std' #include <cstdio> ~~~~~~~~^ 3 errors generated. While building module 'std' imported from /Users/buildslave/jenkins/workspace/lldb-cmake-reproducers/llvm-project/lldb/test/API/lang/cpp/namespace/ns.h:1: In file included from <module-includes>:31: In file included from /Users/buildslave/jenkins/workspace/lldb-cmake-reproducers/lldb-build/bin/../include/c++/v1/complex.h:28: In file included from /Users/buildslave/jenkins/workspace/lldb-cmake-reproducers/lldb-build/bin/../include/c++/v1/ccomplex:20: In file included from /Users/buildslave/jenkins/workspace/lldb-cmake-reproducers/lldb-build/bin/../include/c++/v1/complex:247: In file included from /Users/buildslave/jenkins/workspace/lldb-cmake-reproducers/lldb-build/bin/../include/c++/v1/sstream:173: /Users/buildslave/jenkins/workspace/lldb-cmake-reproducers/lldb-build/bin/../include/c++/v1/ostream:1038:45: error: no template named 'enable_if_t'; did you mean 'enable_if'? template <class _Stream, class _Tp, class = enable_if_t< ^ /Users/buildslave/jenkins/workspace/lldb-cmake-reproducers/lldb-build/bin/../include/c++/v1/type_traits:538:63: note: 'enable_if' declared here template <bool, class _Tp = void> struct _LIBCPP_TEMPLATE_VIS enable_if {}; ^ While building module 'std' imported from /Users/buildslave/jenkins/workspace/lldb-cmake-reproducers/llvm-project/lldb/test/API/lang/cpp/namespace/ns.h:1: In file included from <module-includes>:31: In file included from /Users/buildslave/jenkins/workspace/lldb-cmake-reproducers/lldb-build/bin/../include/c++/v1/complex.h:28: In file included from /Users/buildslave/jenkins/workspace/lldb-cmake-reproducers/lldb-build/bin/../include/c++/v1/ccomplex:20: In file included from /Users/buildslave/jenkins/workspace/lldb-cmake-reproducers/lldb-build/bin/../include/c++/v1/complex:247: In file included from /Users/buildslave/jenkins/workspace/lldb-cmake-reproducers/lldb-build/bin/../include/c++/v1/sstream:174: /Users/buildslave/jenkins/workspace/lldb-cmake-reproducers/lldb-build/bin/../include/c++/v1/istream:1389:45: error: no template named 'enable_if_t'; did you mean 'enable_if'? template <class _Stream, class _Tp, class = enable_if_t< ^ /Users/buildslave/jenkins/workspace/lldb-cmake-reproducers/lldb-build/bin/../include/c++/v1/type_traits:538:63: note: 'enable_if' declared here template <bool, class _Tp = void> struct _LIBCPP_TEMPLATE_VIS enable_if {}; ^ In file included from /Users/buildslave/jenkins/workspace/lldb-cmake-reproducers/llvm-project/lldb/test/API/lang/cpp/namespace/ns.cpp:1: /Users/buildslave/jenkins/workspace/lldb-cmake-reproducers/llvm-project/lldb/test/API/lang/cpp/namespace/ns.h:1:10: fatal error: could not build module 'std' #include <cstdio> ~~~~~~~~^ 3 errors generated. While building module 'std' imported from /Users/buildslave/jenkins/workspace/lldb-cmake-reproducers/llvm-project/lldb/test/API/lang/cpp/namespace/main.cpp:1: In file included from <module-includes>:31: In file included from /Users/buildslave/jenkins/workspace/lldb-cmake-reproducers/lldb-build/bin/../include/c++/v1/complex.h:28: In file included from /Users/buildslave/jenkins/workspace/lldb-cmake-reproducers/lldb-build/bin/../include/c++/v1/ccomplex:20: In file included from /Users/buildslave/jenkins/workspace/lldb-cmake-reproducers/lldb-build/bin/../include/c++/v1/complex:247: In file included from /Users/buildslave/jenkins/workspace/lldb-cmake-reproducers/lldb-build/bin/../include/c++/v1/sstream:173: /Users/buildslave/jenkins/workspace/lldb-cmake-reproducers/lldb-build/bin/../include/c++/v1/ostream:1038:45: error: no template named 'enable_if_t'; did you mean 'enable_if'? template <class _Stream, class _Tp, class = enable_if_t< ^ /Users/buildslave/jenkins/workspace/lldb-cmake-reproducers/lldb-build/bin/../include/c++/v1/type_traits:538:63: note: 'enable_if' declared here template <bool, class _Tp = void> struct _LIBCPP_TEMPLATE_VIS enable_if {}; ^ While building module 'std' imported from /Users/buildslave/jenkins/workspace/lldb-cmake-reproducers/llvm-project/lldb/test/API/lang/cpp/namespace/main.cpp:1: In file included from <module-includes>:31: In file included from /Users/buildslave/jenkins/workspace/lldb-cmake-reproducers/lldb-build/bin/../include/c++/v1/complex.h:28: In file included from /Users/buildslave/jenkins/workspace/lldb-cmake-reproducers/lldb-build/bin/../include/c++/v1/ccomplex:20: In file included from /Users/buildslave/jenkins/workspace/lldb-cmake-reproducers/lldb-build/bin/../include/c++/v1/complex:247: In file included from /Users/buildslave/jenkins/workspace/lldb-cmake-reproducers/lldb-build/bin/../include/c++/v1/sstream:174: /Users/buildslave/jenkins/workspace/lldb-cmake-reproducers/lldb-build/bin/../include/c++/v1/istream:1389:45: error: no template named 'enable_if_t'; did you mean 'enable_if'? template <class _Stream, class _Tp, class = enable_if_t< ^ /Users/buildslave/jenkins/workspace/lldb-cmake-reproducers/lldb-build/bin/../include/c++/v1/type_traits:538:63: note: 'enable_if' declared here template <bool, class _Tp = void> struct _LIBCPP_TEMPLATE_VIS enable_if {}; ^ /Users/buildslave/jenkins/workspace/lldb-cmake-reproducers/llvm-project/lldb/test/API/lang/cpp/namespace/main.cpp:1:10: fatal error: could not build module 'std' #include <cstdarg> ~~~~~~~~^ 3 errors generated. /Users/buildslave/jenkins/workspace/lldb-cmake-reproducers/lldb-build/bin/clang -fmodules -gmodules -fmodules-cache-path=/Users/buildslave/jenkins/workspace/lldb-cmake-reproducers/lldb-build/lldb-test-build.noindex/module-cache-clang/lldb-api -gmodules -fcxx-modules -std=c++11 -g -O0 -fno-builtin -isysroot "/Applications/Xcode.app/Contents/Developer/Platforms/MacOSX.platform/Developer/SDKs/MacOSX10.15.sdk" -arch x86_64 -I/Users/buildslave/jenkins/workspace/lldb-cmake-reproducers/llvm-project/lldb/packages/Python/lldbsuite/test/make/../../../../../include -I/Users/buildslave/jenkins/workspace/lldb-cmake-reproducers/llvm-project/lldb/test/API/lang/cpp/namespace -I/Users/buildslave/jenkins/workspace/lldb-cmake-reproducers/llvm-project/lldb/packages/Python/lldbsuite/test/make -include /Users/buildslave/jenkins/workspace/lldb-cmake-reproducers/llvm-project/lldb/packages/Python/lldbsuite/test/make/test_common.h -fno-limit-debug-info -fmodules -gmodules -fmodules-cache-path=/Users/buildslave/jenkins/workspace/lldb-cmake-reproducers/lldb-build/lldb-test-build.noindex/module-cache-clang/lldb-api -gmodules -fcxx-modules --driver-mode=g++ -c -o main.o /Users/buildslave/jenkins/workspace/lldb-cmake-reproducers/llvm-project/lldb/test/API/lang/cpp/namespace/main.cpp While building module 'std' imported from /Users/buildslave/jenkins/workspace/lldb-cmake-reproducers/llvm-project/lldb/test/API/lang/cpp/namespace/main.cpp:1: In file included from <module-includes>:31: In file included from /Users/buildslave/jenkins/workspace/lldb-cmake-reproducers/lldb-build/bin/../include/c++/v1/complex.h:28: In file included from /Users/buildslave/jenkins/workspace/lldb-cmake-reproducers/lldb-build/bin/../include/c++/v1/ccomplex:20: In file included from /Users/buildslave/jenkins/workspace/lldb-cmake-reproducers/lldb-build/bin/../include/c++/v1/complex:247: In file included from /Users/buildslave/jenkins/workspace/lldb-cmake-reproducers/lldb-build/bin/../include/c++/v1/sstream:173: /Users/buildslave/jenkins/workspace/lldb-cmake-reproducers/lldb-build/bin/../include/c++/v1/ostream:1038:45: error: no template named 'enable_if_t'; did you mean 'enable_if'? template <class _Stream, class _Tp, class = enable_if_t< ^ /Users/buildslave/jenkins/workspace/lldb-cmake-reproducers/lldb-build/bin/../include/c++/v1/type_traits:538:63: note: 'enable_if' declared here template <bool, class _Tp = void> struct _LIBCPP_TEMPLATE_VIS enable_if {}; ^ While building module 'std' imported from /Users/buildslave/jenkins/workspace/lldb-cmake-reproducers/llvm-project/lldb/test/API/lang/cpp/namespace/main.cpp:1: In file included from <module-includes>:31: In file included from /Users/buildslave/jenkins/workspace/lldb-cmake-reproducers/lldb-build/bin/../include/c++/v1/complex.h:28: In file included from /Users/buildslave/jenkins/workspace/lldb-cmake-reproducers/lldb-build/bin/../include/c++/v1/ccomplex:20: In file included from /Users/buildslave/jenkins/workspace/lldb-cmake-reproducers/lldb-build/bin/../include/c++/v1/complex:247: In file included from /Users/buildslave/jenkins/workspace/lldb-cmake-reproducers/lldb-build/bin/../include/c++/v1/sstream:174: /Users/buildslave/jenkins/workspace/lldb-cmake-reproducers/lldb-build/bin/../include/c++/v1/istream:1389:45: error: no template named 'enable_if_t'; did you mean 'enable_if'? template <class _Stream, class _Tp, class = enable_if_t< ^ /Users/buildslave/jenkins/workspace/lldb-cmake-reproducers/lldb-build/bin/../include/c++/v1/type_traits:538:63: note: 'enable_if' declared here template <bool, class _Tp = void> struct _LIBCPP_TEMPLATE_VIS enable_if {}; ^ /Users/buildslave/jenkins/workspace/lldb-cmake-reproducers/llvm-project/lldb/test/API/lang/cpp/namespace/main.cpp:1:10: fatal error: could not build module 'std' #include <cstdarg> ~~~~~~~~^ 3 errors generated. make: *** [main.o] Error 1

Hide Details

Test Directory: /Users/buildslave/jenkins/workspace/lldb-cmake-reproducers/llvm-project/lldb/test/API/lang/cpp/namespace ====================================================================== ERROR: test_scope_lookup_shadowed_by_using_with_run_command_gmodules (TestNamespaceLookup.NamespaceLookupTestCase) Test scope lookup shadowed by using in lldb. ---------------------------------------------------------------------- Error when building test subject.

Hide Details

Build Command: make VPATH=/Users/buildslave/jenkins/workspace/lldb-cmake-reproducers/llvm-project/lldb/test/API/lang/cpp/namespace -C /Users/buildslave/jenkins/workspace/lldb-cmake-reproducers/lldb-build/lldb-test-build.noindex/lang/cpp/namespace/TestNamespaceLookup.test_scope_lookup_shadowed_by_using_with_run_command_gmodules -I /Users/buildslave/jenkins/workspace/lldb-cmake-reproducers/llvm-project/lldb/test/API/lang/cpp/namespace -I /Users/buildslave/jenkins/workspace/lldb-cmake-reproducers/llvm-project/lldb/packages/Python/lldbsuite/test/make -f /Users/buildslave/jenkins/workspace/lldb-cmake-reproducers/llvm-project/lldb/test/API/lang/cpp/namespace/Makefile MAKE_DSYM=NO MAKE_GMODULES=YES ARCH=x86_64 CC="/Users/buildslave/jenkins/workspace/lldb-cmake-reproducers/lldb-build/bin/clang" DSYMUTIL="/Users/buildslave/jenkins/workspace/lldb-cmake-reproducers/lldb-build/./bin/dsymutil" CLANG_MODULE_CACHE_DIR=/Users/buildslave/jenkins/workspace/lldb-cmake-reproducers/lldb-build/lldb-test-build.noindex/module-cache-clang/lldb-api

Hide Details

Build Command Output: While building module 'std' imported from /Users/buildslave/jenkins/workspace/lldb-cmake-reproducers/llvm-project/lldb/test/API/lang/cpp/namespace/ns.h:1: In file included from <module-includes>:31: In file included from /Users/buildslave/jenkins/workspace/lldb-cmake-reproducers/lldb-build/bin/../include/c++/v1/complex.h:28: In file included from /Users/buildslave/jenkins/workspace/lldb-cmake-reproducers/lldb-build/bin/../include/c++/v1/ccomplex:20: In file included from /Users/buildslave/jenkins/workspace/lldb-cmake-reproducers/lldb-build/bin/../include/c++/v1/complex:247: In file included from /Users/buildslave/jenkins/workspace/lldb-cmake-reproducers/lldb-build/bin/../include/c++/v1/sstream:173: /Users/buildslave/jenkins/workspace/lldb-cmake-reproducers/lldb-build/bin/../include/c++/v1/ostream:1038:45: error: no template named 'enable_if_t'; did you mean 'enable_if'? template <class _Stream, class _Tp, class = enable_if_t< ^ /Users/buildslave/jenkins/workspace/lldb-cmake-reproducers/lldb-build/bin/../include/c++/v1/type_traits:538:63: note: 'enable_if' declared here template <bool, class _Tp = void> struct _LIBCPP_TEMPLATE_VIS enable_if {}; ^ While building module 'std' imported from /Users/buildslave/jenkins/workspace/lldb-cmake-reproducers/llvm-project/lldb/test/API/lang/cpp/namespace/ns.h:1: In file included from <module-includes>:31: In file included from /Users/buildslave/jenkins/workspace/lldb-cmake-reproducers/lldb-build/bin/../include/c++/v1/complex.h:28: In file included from /Users/buildslave/jenkins/workspace/lldb-cmake-reproducers/lldb-build/bin/../include/c++/v1/ccomplex:20: In file included from /Users/buildslave/jenkins/workspace/lldb-cmake-reproducers/lldb-build/bin/../include/c++/v1/complex:247: In file included from /Users/buildslave/jenkins/workspace/lldb-cmake-reproducers/lldb-build/bin/../include/c++/v1/sstream:174: /Users/buildslave/jenkins/workspace/lldb-cmake-reproducers/lldb-build/bin/../include/c++/v1/istream:1389:45: error: no template named 'enable_if_t'; did you mean 'enable_if'? template <class _Stream, class _Tp, class = enable_if_t< ^ /Users/buildslave/jenkins/workspace/lldb-cmake-reproducers/lldb-build/bin/../include/c++/v1/type_traits:538:63: note: 'enable_if' declared here template <bool, class _Tp = void> struct _LIBCPP_TEMPLATE_VIS enable_if {}; ^ In file included from /Users/buildslave/jenkins/workspace/lldb-cmake-reproducers/llvm-project/lldb/test/API/lang/cpp/namespace/ns3.cpp:1: /Users/buildslave/jenkins/workspace/lldb-cmake-reproducers/llvm-project/lldb/test/API/lang/cpp/namespace/ns.h:1:10: fatal error: could not build module 'std' #include <cstdio> ~~~~~~~~^ 3 errors generated. While building module 'std' imported from /Users/buildslave/jenkins/workspace/lldb-cmake-reproducers/llvm-project/lldb/test/API/lang/cpp/namespace/ns.h:1: In file included from <module-includes>:31: In file included from /Users/buildslave/jenkins/workspace/lldb-cmake-reproducers/lldb-build/bin/../include/c++/v1/complex.h:28: In file included from /Users/buildslave/jenkins/workspace/lldb-cmake-reproducers/lldb-build/bin/../include/c++/v1/ccomplex:20: In file included from /Users/buildslave/jenkins/workspace/lldb-cmake-reproducers/lldb-build/bin/../include/c++/v1/complex:247: In file included from /Users/buildslave/jenkins/workspace/lldb-cmake-reproducers/lldb-build/bin/../include/c++/v1/sstream:173: /Users/buildslave/jenkins/workspace/lldb-cmake-reproducers/lldb-build/bin/../include/c++/v1/ostream:1038:45: error: no template named 'enable_if_t'; did you mean 'enable_if'? template <class _Stream, class _Tp, class = enable_if_t< ^ /Users/buildslave/jenkins/workspace/lldb-cmake-reproducers/lldb-build/bin/../include/c++/v1/type_traits:538:63: note: 'enable_if' declared here template <bool, class _Tp = void> struct _LIBCPP_TEMPLATE_VIS enable_if {}; ^ While building module 'std' imported from /Users/buildslave/jenkins/workspace/lldb-cmake-reproducers/llvm-project/lldb/test/API/lang/cpp/namespace/ns.h:1: In file included from <module-includes>:31: In file included from /Users/buildslave/jenkins/workspace/lldb-cmake-reproducers/lldb-build/bin/../include/c++/v1/complex.h:28: In file included from /Users/buildslave/jenkins/workspace/lldb-cmake-reproducers/lldb-build/bin/../include/c++/v1/ccomplex:20: In file included from /Users/buildslave/jenkins/workspace/lldb-cmake-reproducers/lldb-build/bin/../include/c++/v1/complex:247: In file included from /Users/buildslave/jenkins/workspace/lldb-cmake-reproducers/lldb-build/bin/../include/c++/v1/sstream:174: /Users/buildslave/jenkins/workspace/lldb-cmake-reproducers/lldb-build/bin/../include/c++/v1/istream:1389:45: error: no template named 'enable_if_t'; did you mean 'enable_if'? template <class _Stream, class _Tp, class = enable_if_t< ^ /Users/buildslave/jenkins/workspace/lldb-cmake-reproducers/lldb-build/bin/../include/c++/v1/type_traits:538:63: note: 'enable_if' declared here template <bool, class _Tp = void> struct _LIBCPP_TEMPLATE_VIS enable_if {}; ^ In file included from /Users/buildslave/jenkins/workspace/lldb-cmake-reproducers/llvm-project/lldb/test/API/lang/cpp/namespace/ns2.cpp:1: /Users/buildslave/jenkins/workspace/lldb-cmake-reproducers/llvm-project/lldb/test/API/lang/cpp/namespace/ns.h:1:10: fatal error: could not build module 'std' #include <cstdio> ~~~~~~~~^ 3 errors generated. While building module 'std' imported from /Users/buildslave/jenkins/workspace/lldb-cmake-reproducers/llvm-project/lldb/test/API/lang/cpp/namespace/ns.h:1: In file included from <module-includes>:31: In file included from /Users/buildslave/jenkins/workspace/lldb-cmake-reproducers/lldb-build/bin/../include/c++/v1/complex.h:28: In file included from /Users/buildslave/jenkins/workspace/lldb-cmake-reproducers/lldb-build/bin/../include/c++/v1/ccomplex:20: In file included from /Users/buildslave/jenkins/workspace/lldb-cmake-reproducers/lldb-build/bin/../include/c++/v1/complex:247: In file included from /Users/buildslave/jenkins/workspace/lldb-cmake-reproducers/lldb-build/bin/../include/c++/v1/sstream:173: /Users/buildslave/jenkins/workspace/lldb-cmake-reproducers/lldb-build/bin/../include/c++/v1/ostream:1038:45: error: no template named 'enable_if_t'; did you mean 'enable_if'? template <class _Stream, class _Tp, class = enable_if_t< ^ /Users/buildslave/jenkins/workspace/lldb-cmake-reproducers/lldb-build/bin/../include/c++/v1/type_traits:538:63: note: 'enable_if' declared here template <bool, class _Tp = void> struct _LIBCPP_TEMPLATE_VIS enable_if {}; ^ While building module 'std' imported from /Users/buildslave/jenkins/workspace/lldb-cmake-reproducers/llvm-project/lldb/test/API/lang/cpp/namespace/ns.h:1: In file included from <module-includes>:31: In file included from /Users/buildslave/jenkins/workspace/lldb-cmake-reproducers/lldb-build/bin/../include/c++/v1/complex.h:28: In file included from /Users/buildslave/jenkins/workspace/lldb-cmake-reproducers/lldb-build/bin/../include/c++/v1/ccomplex:20: In file included from /Users/buildslave/jenkins/workspace/lldb-cmake-reproducers/lldb-build/bin/../include/c++/v1/complex:247: In file included from /Users/buildslave/jenkins/workspace/lldb-cmake-reproducers/lldb-build/bin/../include/c++/v1/sstream:174: /Users/buildslave/jenkins/workspace/lldb-cmake-reproducers/lldb-build/bin/../include/c++/v1/istream:1389:45: error: no template named 'enable_if_t'; did you mean 'enable_if'? template <class _Stream, class _Tp, class = enable_if_t< ^ /Users/buildslave/jenkins/workspace/lldb-cmake-reproducers/lldb-build/bin/../include/c++/v1/type_traits:538:63: note: 'enable_if' declared here template <bool, class _Tp = void> struct _LIBCPP_TEMPLATE_VIS enable_if {}; ^ In file included from /Users/buildslave/jenkins/workspace/lldb-cmake-reproducers/llvm-project/lldb/test/API/lang/cpp/namespace/ns.cpp:1: /Users/buildslave/jenkins/workspace/lldb-cmake-reproducers/llvm-project/lldb/test/API/lang/cpp/namespace/ns.h:1:10: fatal error: could not build module 'std' #include <cstdio> ~~~~~~~~^ 3 errors generated. While building module 'std' imported from /Users/buildslave/jenkins/workspace/lldb-cmake-reproducers/llvm-project/lldb/test/API/lang/cpp/namespace/main.cpp:1: In file included from <module-includes>:31: In file included from /Users/buildslave/jenkins/workspace/lldb-cmake-reproducers/lldb-build/bin/../include/c++/v1/complex.h:28: In file included from /Users/buildslave/jenkins/workspace/lldb-cmake-reproducers/lldb-build/bin/../include/c++/v1/ccomplex:20: In file included from /Users/buildslave/jenkins/workspace/lldb-cmake-reproducers/lldb-build/bin/../include/c++/v1/complex:247: In file included from /Users/buildslave/jenkins/workspace/lldb-cmake-reproducers/lldb-build/bin/../include/c++/v1/sstream:173: /Users/buildslave/jenkins/workspace/lldb-cmake-reproducers/lldb-build/bin/../include/c++/v1/ostream:1038:45: error: no template named 'enable_if_t'; did you mean 'enable_if'? template <class _Stream, class _Tp, class = enable_if_t< ^ /Users/buildslave/jenkins/workspace/lldb-cmake-reproducers/lldb-build/bin/../include/c++/v1/type_traits:538:63: note: 'enable_if' declared here template <bool, class _Tp = void> struct _LIBCPP_TEMPLATE_VIS enable_if {}; ^ While building module 'std' imported from /Users/buildslave/jenkins/workspace/lldb-cmake-reproducers/llvm-project/lldb/test/API/lang/cpp/namespace/main.cpp:1: In file included from <module-includes>:31: In file included from /Users/buildslave/jenkins/workspace/lldb-cmake-reproducers/lldb-build/bin/../include/c++/v1/complex.h:28: In file included from /Users/buildslave/jenkins/workspace/lldb-cmake-reproducers/lldb-build/bin/../include/c++/v1/ccomplex:20: In file included from /Users/buildslave/jenkins/workspace/lldb-cmake-reproducers/lldb-build/bin/../include/c++/v1/complex:247: In file included from /Users/buildslave/jenkins/workspace/lldb-cmake-reproducers/lldb-build/bin/../include/c++/v1/sstream:174: /Users/buildslave/jenkins/workspace/lldb-cmake-reproducers/lldb-build/bin/../include/c++/v1/istream:1389:45: error: no template named 'enable_if_t'; did you mean 'enable_if'? template <class _Stream, class _Tp, class = enable_if_t< ^ /Users/buildslave/jenkins/workspace/lldb-cmake-reproducers/lldb-build/bin/../include/c++/v1/type_traits:538:63: note: 'enable_if' declared here template <bool, class _Tp = void> struct _LIBCPP_TEMPLATE_VIS enable_if {}; ^ /Users/buildslave/jenkins/workspace/lldb-cmake-reproducers/llvm-project/lldb/test/API/lang/cpp/namespace/main.cpp:1:10: fatal error: could not build module 'std' #include <cstdarg> ~~~~~~~~^ 3 errors generated. /Users/buildslave/jenkins/workspace/lldb-cmake-reproducers/lldb-build/bin/clang -fmodules -gmodules -fmodules-cache-path=/Users/buildslave/jenkins/workspace/lldb-cmake-reproducers/lldb-build/lldb-test-build.noindex/module-cache-clang/lldb-api -gmodules -fcxx-modules -std=c++11 -g -O0 -fno-builtin -isysroot "/Applications/Xcode.app/Contents/Developer/Platforms/MacOSX.platform/Developer/SDKs/MacOSX10.15.sdk" -arch x86_64 -I/Users/buildslave/jenkins/workspace/lldb-cmake-reproducers/llvm-project/lldb/packages/Python/lldbsuite/test/make/../../../../../include -I/Users/buildslave/jenkins/workspace/lldb-cmake-reproducers/llvm-project/lldb/test/API/lang/cpp/namespace -I/Users/buildslave/jenkins/workspace/lldb-cmake-reproducers/llvm-project/lldb/packages/Python/lldbsuite/test/make -include /Users/buildslave/jenkins/workspace/lldb-cmake-reproducers/llvm-project/lldb/packages/Python/lldbsuite/test/make/test_common.h -fno-limit-debug-info -fmodules -gmodules -fmodules-cache-path=/Users/buildslave/jenkins/workspace/lldb-cmake-reproducers/lldb-build/lldb-test-build.noindex/module-cache-clang/lldb-api -gmodules -fcxx-modules --driver-mode=g++ -c -o main.o /Users/buildslave/jenkins/workspace/lldb-cmake-reproducers/llvm-project/lldb/test/API/lang/cpp/namespace/main.cpp While building module 'std' imported from /Users/buildslave/jenkins/workspace/lldb-cmake-reproducers/llvm-project/lldb/test/API/lang/cpp/namespace/main.cpp:1: In file included from <module-includes>:31: In file included from /Users/buildslave/jenkins/workspace/lldb-cmake-reproducers/lldb-build/bin/../include/c++/v1/complex.h:28: In file included from /Users/buildslave/jenkins/workspace/lldb-cmake-reproducers/lldb-build/bin/../include/c++/v1/ccomplex:20: In file included from /Users/buildslave/jenkins/workspace/lldb-cmake-reproducers/lldb-build/bin/../include/c++/v1/complex:247: In file included from /Users/buildslave/jenkins/workspace/lldb-cmake-reproducers/lldb-build/bin/../include/c++/v1/sstream:173: /Users/buildslave/jenkins/workspace/lldb-cmake-reproducers/lldb-build/bin/../include/c++/v1/ostream:1038:45: error: no template named 'enable_if_t'; did you mean 'enable_if'? template <class _Stream, class _Tp, class = enable_if_t< ^ /Users/buildslave/jenkins/workspace/lldb-cmake-reproducers/lldb-build/bin/../include/c++/v1/type_traits:538:63: note: 'enable_if' declared here template <bool, class _Tp = void> struct _LIBCPP_TEMPLATE_VIS enable_if {}; ^ While building module 'std' imported from /Users/buildslave/jenkins/workspace/lldb-cmake-reproducers/llvm-project/lldb/test/API/lang/cpp/namespace/main.cpp:1: In file included from <module-includes>:31: In file included from /Users/buildslave/jenkins/workspace/lldb-cmake-reproducers/lldb-build/bin/../include/c++/v1/complex.h:28: In file included from /Users/buildslave/jenkins/workspace/lldb-cmake-reproducers/lldb-build/bin/../include/c++/v1/ccomplex:20: In file included from /Users/buildslave/jenkins/workspace/lldb-cmake-reproducers/lldb-build/bin/../include/c++/v1/complex:247: In file included from /Users/buildslave/jenkins/workspace/lldb-cmake-reproducers/lldb-build/bin/../include/c++/v1/sstream:174: /Users/buildslave/jenkins/workspace/lldb-cmake-reproducers/lldb-build/bin/../include/c++/v1/istream:1389:45: error: no template named 'enable_if_t'; did you mean 'enable_if'? template <class _Stream, class _Tp, class = enable_if_t< ^ /Users/buildslave/jenkins/workspace/lldb-cmake-reproducers/lldb-build/bin/../include/c++/v1/type_traits:538:63: note: 'enable_if' declared here template <bool, class _Tp = void> struct _LIBCPP_TEMPLATE_VIS enable_if {}; ^ /Users/buildslave/jenkins/workspace/lldb-cmake-reproducers/llvm-project/lldb/test/API/lang/cpp/namespace/main.cpp:1:10: fatal error: could not build module 'std' #include <cstdarg> ~~~~~~~~^ 3 errors generated. make: *** [main.o] Error 1

Hide Details

Test Directory: /Users/buildslave/jenkins/workspace/lldb-cmake-reproducers/llvm-project/lldb/test/API/lang/cpp/namespace ====================================================================== ERROR: test_scope_lookup_with_run_command_gmodules (TestNamespaceLookup.NamespaceLookupTestCase) Test scope lookup of functions in lldb. ---------------------------------------------------------------------- Error when building test subject.

Hide Details

Build Command: make VPATH=/Users/buildslave/jenkins/workspace/lldb-cmake-reproducers/llvm-project/lldb/test/API/lang/cpp/namespace -C /Users/buildslave/jenkins/workspace/lldb-cmake-reproducers/lldb-build/lldb-test-build.noindex/lang/cpp/namespace/TestNamespaceLookup.test_scope_lookup_with_run_command_gmodules -I /Users/buildslave/jenkins/workspace/lldb-cmake-reproducers/llvm-project/lldb/test/API/lang/cpp/namespace -I /Users/buildslave/jenkins/workspace/lldb-cmake-reproducers/llvm-project/lldb/packages/Python/lldbsuite/test/make -f /Users/buildslave/jenkins/workspace/lldb-cmake-reproducers/llvm-project/lldb/test/API/lang/cpp/namespace/Makefile MAKE_DSYM=NO MAKE_GMODULES=YES ARCH=x86_64 CC="/Users/buildslave/jenkins/workspace/lldb-cmake-reproducers/lldb-build/bin/clang" DSYMUTIL="/Users/buildslave/jenkins/workspace/lldb-cmake-reproducers/lldb-build/./bin/dsymutil" CLANG_MODULE_CACHE_DIR=/Users/buildslave/jenkins/workspace/lldb-cmake-reproducers/lldb-build/lldb-test-build.noindex/module-cache-clang/lldb-api

Hide Details

Build Command Output: While building module 'std' imported from /Users/buildslave/jenkins/workspace/lldb-cmake-reproducers/llvm-project/lldb/test/API/lang/cpp/namespace/ns.h:1: In file included from <module-includes>:31: In file included from /Users/buildslave/jenkins/workspace/lldb-cmake-reproducers/lldb-build/bin/../include/c++/v1/complex.h:28: In file included from /Users/buildslave/jenkins/workspace/lldb-cmake-reproducers/lldb-build/bin/../include/c++/v1/ccomplex:20: In file included from /Users/buildslave/jenkins/workspace/lldb-cmake-reproducers/lldb-build/bin/../include/c++/v1/complex:247: In file included from /Users/buildslave/jenkins/workspace/lldb-cmake-reproducers/lldb-build/bin/../include/c++/v1/sstream:173: /Users/buildslave/jenkins/workspace/lldb-cmake-reproducers/lldb-build/bin/../include/c++/v1/ostream:1038:45: error: no template named 'enable_if_t'; did you mean 'enable_if'? template <class _Stream, class _Tp, class = enable_if_t< ^ /Users/buildslave/jenkins/workspace/lldb-cmake-reproducers/lldb-build/bin/../include/c++/v1/type_traits:538:63: note: 'enable_if' declared here template <bool, class _Tp = void> struct _LIBCPP_TEMPLATE_VIS enable_if {}; ^ While building module 'std' imported from /Users/buildslave/jenkins/workspace/lldb-cmake-reproducers/llvm-project/lldb/test/API/lang/cpp/namespace/ns.h:1: In file included from <module-includes>:31: In file included from /Users/buildslave/jenkins/workspace/lldb-cmake-reproducers/lldb-build/bin/../include/c++/v1/complex.h:28: In file included from /Users/buildslave/jenkins/workspace/lldb-cmake-reproducers/lldb-build/bin/../include/c++/v1/ccomplex:20: In file included from /Users/buildslave/jenkins/workspace/lldb-cmake-reproducers/lldb-build/bin/../include/c++/v1/complex:247: In file included from /Users/buildslave/jenkins/workspace/lldb-cmake-reproducers/lldb-build/bin/../include/c++/v1/sstream:174: /Users/buildslave/jenkins/workspace/lldb-cmake-reproducers/lldb-build/bin/../include/c++/v1/istream:1389:45: error: no template named 'enable_if_t'; did you mean 'enable_if'? template <class _Stream, class _Tp, class = enable_if_t< ^ /Users/buildslave/jenkins/workspace/lldb-cmake-reproducers/lldb-build/bin/../include/c++/v1/type_traits:538:63: note: 'enable_if' declared here template <bool, class _Tp = void> struct _LIBCPP_TEMPLATE_VIS enable_if {}; ^ In file included from /Users/buildslave/jenkins/workspace/lldb-cmake-reproducers/llvm-project/lldb/test/API/lang/cpp/namespace/ns3.cpp:1: /Users/buildslave/jenkins/workspace/lldb-cmake-reproducers/llvm-project/lldb/test/API/lang/cpp/namespace/ns.h:1:10: fatal error: could not build module 'std' #include <cstdio> ~~~~~~~~^ 3 errors generated. While building module 'std' imported from /Users/buildslave/jenkins/workspace/lldb-cmake-reproducers/llvm-project/lldb/test/API/lang/cpp/namespace/ns.h:1: In file included from <module-includes>:31: In file included from /Users/buildslave/jenkins/workspace/lldb-cmake-reproducers/lldb-build/bin/../include/c++/v1/complex.h:28: In file included from /Users/buildslave/jenkins/workspace/lldb-cmake-reproducers/lldb-build/bin/../include/c++/v1/ccomplex:20: In file included from /Users/buildslave/jenkins/workspace/lldb-cmake-reproducers/lldb-build/bin/../include/c++/v1/complex:247: In file included from /Users/buildslave/jenkins/workspace/lldb-cmake-reproducers/lldb-build/bin/../include/c++/v1/sstream:173: /Users/buildslave/jenkins/workspace/lldb-cmake-reproducers/lldb-build/bin/../include/c++/v1/ostream:1038:45: error: no template named 'enable_if_t'; did you mean 'enable_if'? template <class _Stream, class _Tp, class = enable_if_t< ^ /Users/buildslave/jenkins/workspace/lldb-cmake-reproducers/lldb-build/bin/../include/c++/v1/type_traits:538:63: note: 'enable_if' declared here template <bool, class _Tp = void> struct _LIBCPP_TEMPLATE_VIS enable_if {}; ^ While building module 'std' imported from /Users/buildslave/jenkins/workspace/lldb-cmake-reproducers/llvm-project/lldb/test/API/lang/cpp/namespace/ns.h:1: In file included from <module-includes>:31: In file included from /Users/buildslave/jenkins/workspace/lldb-cmake-reproducers/lldb-build/bin/../include/c++/v1/complex.h:28: In file included from /Users/buildslave/jenkins/workspace/lldb-cmake-reproducers/lldb-build/bin/../include/c++/v1/ccomplex:20: In file included from /Users/buildslave/jenkins/workspace/lldb-cmake-reproducers/lldb-build/bin/../include/c++/v1/complex:247: In file included from /Users/buildslave/jenkins/workspace/lldb-cmake-reproducers/lldb-build/bin/../include/c++/v1/sstream:174: /Users/buildslave/jenkins/workspace/lldb-cmake-reproducers/lldb-build/bin/../include/c++/v1/istream:1389:45: error: no template named 'enable_if_t'; did you mean 'enable_if'? template <class _Stream, class _Tp, class = enable_if_t< ^ /Users/buildslave/jenkins/workspace/lldb-cmake-reproducers/lldb-build/bin/../include/c++/v1/type_traits:538:63: note: 'enable_if' declared here template <bool, class _Tp = void> struct _LIBCPP_TEMPLATE_VIS enable_if {}; ^ In file included from /Users/buildslave/jenkins/workspace/lldb-cmake-reproducers/llvm-project/lldb/test/API/lang/cpp/namespace/ns2.cpp:1: /Users/buildslave/jenkins/workspace/lldb-cmake-reproducers/llvm-project/lldb/test/API/lang/cpp/namespace/ns.h:1:10: fatal error: could not build module 'std' #include <cstdio> ~~~~~~~~^ 3 errors generated. While building module 'std' imported from /Users/buildslave/jenkins/workspace/lldb-cmake-reproducers/llvm-project/lldb/test/API/lang/cpp/namespace/ns.h:1: In file included from <module-includes>:31: In file included from /Users/buildslave/jenkins/workspace/lldb-cmake-reproducers/lldb-build/bin/../include/c++/v1/complex.h:28: In file included from /Users/buildslave/jenkins/workspace/lldb-cmake-reproducers/lldb-build/bin/../include/c++/v1/ccomplex:20: In file included from /Users/buildslave/jenkins/workspace/lldb-cmake-reproducers/lldb-build/bin/../include/c++/v1/complex:247: In file included from /Users/buildslave/jenkins/workspace/lldb-cmake-reproducers/lldb-build/bin/../include/c++/v1/sstream:173: /Users/buildslave/jenkins/workspace/lldb-cmake-reproducers/lldb-build/bin/../include/c++/v1/ostream:1038:45: error: no template named 'enable_if_t'; did you mean 'enable_if'? template <class _Stream, class _Tp, class = enable_if_t< ^ /Users/buildslave/jenkins/workspace/lldb-cmake-reproducers/lldb-build/bin/../include/c++/v1/type_traits:538:63: note: 'enable_if' declared here template <bool, class _Tp = void> struct _LIBCPP_TEMPLATE_VIS enable_if {}; ^ While building module 'std' imported from /Users/buildslave/jenkins/workspace/lldb-cmake-reproducers/llvm-project/lldb/test/API/lang/cpp/namespace/ns.h:1: In file included from <module-includes>:31: In file included from /Users/buildslave/jenkins/workspace/lldb-cmake-reproducers/lldb-build/bin/../include/c++/v1/complex.h:28: In file included from /Users/buildslave/jenkins/workspace/lldb-cmake-reproducers/lldb-build/bin/../include/c++/v1/ccomplex:20: In file included from /Users/buildslave/jenkins/workspace/lldb-cmake-reproducers/lldb-build/bin/../include/c++/v1/complex:247: In file included from /Users/buildslave/jenkins/workspace/lldb-cmake-reproducers/lldb-build/bin/../include/c++/v1/sstream:174: /Users/buildslave/jenkins/workspace/lldb-cmake-reproducers/lldb-build/bin/../include/c++/v1/istream:1389:45: error: no template named 'enable_if_t'; did you mean 'enable_if'? template <class _Stream, class _Tp, class = enable_if_t< ^ /Users/buildslave/jenkins/workspace/lldb-cmake-reproducers/lldb-build/bin/../include/c++/v1/type_traits:538:63: note: 'enable_if' declared here template <bool, class _Tp = void> struct _LIBCPP_TEMPLATE_VIS enable_if {}; ^ In file included from /Users/buildslave/jenkins/workspace/lldb-cmake-reproducers/llvm-project/lldb/test/API/lang/cpp/namespace/ns.cpp:1: /Users/buildslave/jenkins/workspace/lldb-cmake-reproducers/llvm-project/lldb/test/API/lang/cpp/namespace/ns.h:1:10: fatal error: could not build module 'std' #include <cstdio> ~~~~~~~~^ 3 errors generated. While building module 'std' imported from /Users/buildslave/jenkins/workspace/lldb-cmake-reproducers/llvm-project/lldb/test/API/lang/cpp/namespace/main.cpp:1: In file included from <module-includes>:31: In file included from /Users/buildslave/jenkins/workspace/lldb-cmake-reproducers/lldb-build/bin/../include/c++/v1/complex.h:28: In file included from /Users/buildslave/jenkins/workspace/lldb-cmake-reproducers/lldb-build/bin/../include/c++/v1/ccomplex:20: In file included from /Users/buildslave/jenkins/workspace/lldb-cmake-reproducers/lldb-build/bin/../include/c++/v1/complex:247: In file included from /Users/buildslave/jenkins/workspace/lldb-cmake-reproducers/lldb-build/bin/../include/c++/v1/sstream:173: /Users/buildslave/jenkins/workspace/lldb-cmake-reproducers/lldb-build/bin/../include/c++/v1/ostream:1038:45: error: no template named 'enable_if_t'; did you mean 'enable_if'? template <class _Stream, class _Tp, class = enable_if_t< ^ /Users/buildslave/jenkins/workspace/lldb-cmake-reproducers/lldb-build/bin/../include/c++/v1/type_traits:538:63: note: 'enable_if' declared here template <bool, class _Tp = void> struct _LIBCPP_TEMPLATE_VIS enable_if {}; ^ While building module 'std' imported from /Users/buildslave/jenkins/workspace/lldb-cmake-reproducers/llvm-project/lldb/test/API/lang/cpp/namespace/main.cpp:1: In file included from <module-includes>:31: In file included from /Users/buildslave/jenkins/workspace/lldb-cmake-reproducers/lldb-build/bin/../include/c++/v1/complex.h:28: In file included from /Users/buildslave/jenkins/workspace/lldb-cmake-reproducers/lldb-build/bin/../include/c++/v1/ccomplex:20: In file included from /Users/buildslave/jenkins/workspace/lldb-cmake-reproducers/lldb-build/bin/../include/c++/v1/complex:247: In file included from /Users/buildslave/jenkins/workspace/lldb-cmake-reproducers/lldb-build/bin/../include/c++/v1/sstream:174: /Users/buildslave/jenkins/workspace/lldb-cmake-reproducers/lldb-build/bin/../include/c++/v1/istream:1389:45: error: no template named 'enable_if_t'; did you mean 'enable_if'? template <class _Stream, class _Tp, class = enable_if_t< ^ /Users/buildslave/jenkins/workspace/lldb-cmake-reproducers/lldb-build/bin/../include/c++/v1/type_traits:538:63: note: 'enable_if' declared here template <bool, class _Tp = void> struct _LIBCPP_TEMPLATE_VIS enable_if {}; ^ /Users/buildslave/jenkins/workspace/lldb-cmake-reproducers/llvm-project/lldb/test/API/lang/cpp/namespace/main.cpp:1:10: fatal error: could not build module 'std' #include <cstdarg> ~~~~~~~~^ 3 errors generated. /Users/buildslave/jenkins/workspace/lldb-cmake-reproducers/lldb-build/bin/clang -fmodules -gmodules -fmodules-cache-path=/Users/buildslave/jenkins/workspace/lldb-cmake-reproducers/lldb-build/lldb-test-build.noindex/module-cache-clang/lldb-api -gmodules -fcxx-modules -std=c++11 -g -O0 -fno-builtin -isysroot "/Applications/Xcode.app/Contents/Developer/Platforms/MacOSX.platform/Developer/SDKs/MacOSX10.15.sdk" -arch x86_64 -I/Users/buildslave/jenkins/workspace/lldb-cmake-reproducers/llvm-project/lldb/packages/Python/lldbsuite/test/make/../../../../../include -I/Users/buildslave/jenkins/workspace/lldb-cmake-reproducers/llvm-project/lldb/test/API/lang/cpp/namespace -I/Users/buildslave/jenkins/workspace/lldb-cmake-reproducers/llvm-project/lldb/packages/Python/lldbsuite/test/make -include /Users/buildslave/jenkins/workspace/lldb-cmake-reproducers/llvm-project/lldb/packages/Python/lldbsuite/test/make/test_common.h -fno-limit-debug-info -fmodules -gmodules -fmodules-cache-path=/Users/buildslave/jenkins/workspace/lldb-cmake-reproducers/lldb-build/lldb-test-build.noindex/module-cache-clang/lldb-api -gmodules -fcxx-modules --driver-mode=g++ -c -o main.o /Users/buildslave/jenkins/workspace/lldb-cmake-reproducers/llvm-project/lldb/test/API/lang/cpp/namespace/main.cpp While building module 'std' imported from /Users/buildslave/jenkins/workspace/lldb-cmake-reproducers/llvm-project/lldb/test/API/lang/cpp/namespace/main.cpp:1: In file included from <module-includes>:31: In file included from /Users/buildslave/jenkins/workspace/lldb-cmake-reproducers/lldb-build/bin/../include/c++/v1/complex.h:28: In file included from /Users/buildslave/jenkins/workspace/lldb-cmake-reproducers/lldb-build/bin/../include/c++/v1/ccomplex:20: In file included from /Users/buildslave/jenkins/workspace/lldb-cmake-reproducers/lldb-build/bin/../include/c++/v1/complex:247: In file included from /Users/buildslave/jenkins/workspace/lldb-cmake-reproducers/lldb-build/bin/../include/c++/v1/sstream:173: /Users/buildslave/jenkins/workspace/lldb-cmake-reproducers/lldb-build/bin/../include/c++/v1/ostream:1038:45: error: no template named 'enable_if_t'; did you mean 'enable_if'? template <class _Stream, class _Tp, class = enable_if_t< ^ /Users/buildslave/jenkins/workspace/lldb-cmake-reproducers/lldb-build/bin/../include/c++/v1/type_traits:538:63: note: 'enable_if' declared here template <bool, class _Tp = void> struct _LIBCPP_TEMPLATE_VIS enable_if {}; ^ While building module 'std' imported from /Users/buildslave/jenkins/workspace/lldb-cmake-reproducers/llvm-project/lldb/test/API/lang/cpp/namespace/main.cpp:1: In file included from <module-includes>:31: In file included from /Users/buildslave/jenkins/workspace/lldb-cmake-reproducers/lldb-build/bin/../include/c++/v1/complex.h:28: In file included from /Users/buildslave/jenkins/workspace/lldb-cmake-reproducers/lldb-build/bin/../include/c++/v1/ccomplex:20: In file included from /Users/buildslave/jenkins/workspace/lldb-cmake-reproducers/lldb-build/bin/../include/c++/v1/complex:247: In file included from /Users/buildslave/jenkins/workspace/lldb-cmake-reproducers/lldb-build/bin/../include/c++/v1/sstream:174: /Users/buildslave/jenkins/workspace/lldb-cmake-reproducers/lldb-build/bin/../include/c++/v1/istream:1389:45: error: no template named 'enable_if_t'; did you mean 'enable_if'? template <class _Stream, class _Tp, class = enable_if_t< ^ /Users/buildslave/jenkins/workspace/lldb-cmake-reproducers/lldb-build/bin/../include/c++/v1/type_traits:538:63: note: 'enable_if' declared here template <bool, class _Tp = void> struct _LIBCPP_TEMPLATE_VIS enable_if {}; ^ /Users/buildslave/jenkins/workspace/lldb-cmake-reproducers/llvm-project/lldb/test/API/lang/cpp/namespace/main.cpp:1:10: fatal error: could not build module 'std' #include <cstdarg> ~~~~~~~~^ 3 errors generated. make: *** [main.o] Error 1

Hide Details

Test Directory: /Users/buildslave/jenkins/workspace/lldb-cmake-reproducers/llvm-project/lldb/test/API/lang/cpp/namespace ---------------------------------------------------------------------- Ran 32 tests in 507.767s

Hide Details

RESULT: FAILED (8 passes, 0 failures, 4 errors, 8 skipped, 12 expected failures, 0 unexpected successes)

Hide Details

--

Hide Details

******************** Slowest Tests: -------------------------------------------------------------------------- 508.24s: lldb-api :: lang/cpp/namespace/TestNamespaceLookup.py 245.91s: lldb-api :: types/TestIntegerTypeExpr.py 241.89s: lldb-api :: types/TestLongTypes.py 232.43s: lldb-api :: lang/cpp/namespace/TestNamespace.py 208.46s: lldb-api :: types/TestIntegerType.py 207.04s: lldb-api :: functionalities/thread/step_out/TestThreadStepOut.py 206.61s: lldb-api :: types/TestLongTypesExpr.py 185.85s: lldb-api :: functionalities/thread/break_after_join/TestBreakAfterJoin.py 157.08s: lldb-api :: types/TestShortType.py 130.50s: lldb-api :: functionalities/data-formatter/data-formatter-smart-array/TestDataFormatterSmartArray.py 129.96s: lldb-api :: functionalities/thread/create_during_step/TestCreateDuringStep.py 121.07s: lldb-api :: lang/cpp/class_types/TestClassTypes.py 119.68s: lldb-api :: lang/cpp/global_operators/TestCppGlobalOperators.py 116.50s: lldb-api :: lang/cpp/template/TestTemplateArgs.py 114.59s: lldb-api :: functionalities/thread/exit_during_step/TestExitDuringStep.py 112.51s: lldb-api :: functionalities/data-formatter/data-formatter-stl/libcxx/initializerlist/TestInitializerList.py 112.03s: lldb-api :: commands/expression/formatters/TestFormatters.py 109.04s: lldb-api :: types/TestShortTypeExpr.py 94.08s: lldb-api :: functionalities/type_completion/TestTypeCompletion.py 93.56s: lldb-api :: types/TestCharTypeExpr.py

Hide Details

Tests Times: -------------------------------------------------------------------------- [ Range ] :: [ Percentage ] :: [ Count ] -------------------------------------------------------------------------- [500s,550s) :: [ ] :: [ 1/1233] [450s,500s) :: [ ] :: [ 0/1233] [400s,450s) :: [ ] :: [ 0/1233] [350s,400s) :: [ ] :: [ 0/1233] [300s,350s) :: [ ] :: [ 0/1233] [250s,300s) :: [ ] :: [ 3/1233] [200s,250s) :: [ ] :: [ 4/1233] [150s,200s) :: [ ] :: [ 1/1233] [100s,150s) :: [ ] :: [ 12/1233] [ 50s,100s) :: [ ] :: [ 20/1233] [ 0s, 50s) :: [************************************** ] :: [1192/1233] -------------------------------------------------------------------------- ******************** Failed Tests (107): lldb-api :: python_api/watchpoint/watchlocation/TestSetWatchlocation.py lldb-api :: lang/cpp/extern_c/TestExternCSymbols.py lldb-api :: types/TestCharTypeExpr.py lldb-api :: tools/lldb-server/inferior-crash/TestGdbRemoteAbort.py lldb-api :: lang/cpp/operators/TestCppOperators.py lldb-api :: python_api/watchpoint/watchlocation/TestTargetWatchAddress.py lldb-api :: commands/frame/diagnose/inheritance/TestDiagnoseInheritance.py lldb-api :: functionalities/data-formatter/data-formatter-stl/libcxx/string/TestDataFormatterLibcxxString.py lldb-api :: lang/objcxx/hide-runtime-values/TestObjCXXHideRuntimeValues.py lldb-api :: functionalities/data-formatter/data-formatter-script/TestDataFormatterScript.py lldb-api :: lang/objcxx/class-name-clash/TestNameClash.py lldb-api :: functionalities/data-formatter/data-formatter-stl/libcxx/multiset/TestDataFormatterLibcxxMultiSet.py lldb-api :: types/TestLongTypes.py lldb-api :: types/TestFloatTypesExpr.py lldb-api :: functionalities/breakpoint/hardware_breakpoints/hardware_breakpoint_on_multiple_threads/TestHWBreakMultiThread.py lldb-api :: functionalities/data-formatter/data-formatter-disabling/TestDataFormatterDisabling.py lldb-api :: lang/cpp/exceptions/TestCPPExceptionBreakpoints.py lldb-api :: functionalities/data-formatter/data-formatter-stl/libcxx/tuple/TestDataFormatterLibcxxTuple.py lldb-api :: lang/cpp/class_types/TestClassTypes.py lldb-api :: functionalities/data-formatter/data-formatter-stl/libcxx/function/TestLibCxxFunction.py lldb-api :: tools/lldb-server/inferior-crash/TestGdbRemoteSegFault.py lldb-api :: functionalities/breakpoint/cpp/TestCPPBreakpointLocations.py lldb-api :: functionalities/data-formatter/data-formatter-stl/libcxx/iterator/TestDataFormatterLibccIterator.py lldb-api :: functionalities/data-formatter/data-formatter-skip-summary/TestDataFormatterSkipSummary.py lldb-api :: python_api/exprpath_synthetic/TestExprPathSynthetic.py lldb-api :: commands/expression/call-function/TestCallStopAndContinue.py lldb-api :: lang/cpp/breakpoint_in_member_func_w_non_primitive_params/TestBreakpointInMemberFuncWNonPrimitiveParams.py lldb-api :: functionalities/thread/exit_during_step/TestExitDuringStep.py lldb-api :: lang/cpp/global_operators/TestCppGlobalOperators.py lldb-api :: functionalities/thread/backtrace_all/TestBacktraceAll.py lldb-api :: functionalities/data-formatter/parray/TestPrintArray.py lldb-api :: lang/cpp/dynamic-value/TestDynamicValue.py lldb-api :: functionalities/data-formatter/poarray/TestPrintObjectArray.py lldb-api :: functionalities/data-formatter/data-formatter-stl/libcxx/vector/TestDataFormatterLibcxxVector.py lldb-api :: lang/cpp/namespace/TestNamespaceLookup.py lldb-api :: functionalities/data-formatter/stringprinter/TestStringPrinter.py lldb-api :: commands/settings/TestSettings.py lldb-api :: types/TestIntegerType.py lldb-api :: commands/expression/formatters/TestFormatters.py lldb-api :: functionalities/type_lookup/TestTypeLookup.py lldb-api :: python_api/process/TestProcessAPI.py lldb-api :: types/TestDoubleTypes.py lldb-api :: lang/cpp/wchar_t/TestCxxWCharT.py lldb-api :: functionalities/data-formatter/data-formatter-synth/TestDataFormatterSynth.py lldb-api :: functionalities/breakpoint/inlined_breakpoints/TestInlinedBreakpoints.py lldb-api :: types/TestShortType.py lldb-api :: types/TestDoubleTypesExpr.py lldb-api :: functionalities/data-formatter/data-formatter-smart-array/TestDataFormatterSmartArray.py lldb-api :: api/multithreaded/TestMultithreaded.py lldb-api :: lang/cpp/template/TestTemplateArgs.py lldb-api :: functionalities/data-formatter/data-formatter-stl/libcxx/atomic/TestLibCxxAtomic.py lldb-api :: functionalities/inline-stepping/TestInlineStepping.py lldb-api :: functionalities/memory/read/TestMemoryRead.py lldb-api :: functionalities/data-formatter/data-formatter-stl/libcxx/map/TestDataFormatterLibccMap.py lldb-api :: functionalities/memory/find/TestMemoryFind.py lldb-api :: lang/cpp/bitfields/TestCppBitfields.py lldb-api :: functionalities/data-formatter/data-formatter-stl/libcxx/set/TestDataFormatterLibcxxSet.py lldb-api :: python_api/sbvalue_const_addrof/TestSBValueConstAddrOf.py lldb-api :: functionalities/thread/step_out/TestThreadStepOut.py lldb-api :: commands/log/basic/TestLogging.py lldb-api :: lang/objc/objc++/TestObjCXX.py lldb-api :: lang/objc/exceptions/TestObjCExceptions.py lldb-api :: lang/cpp/unique-types/TestUniqueTypes.py lldb-api :: lang/cpp/class_types/TestClassTypesDisassembly.py lldb-api :: functionalities/data-formatter/data-formatter-stl/libcxx/bitset/TestDataFormatterLibcxxBitset.py lldb-api :: functionalities/thread/exit_during_break/TestExitDuringBreak.py lldb-api :: commands/expression/namespace_local_var_same_name_obj_c/TestNamespaceLocalVarSameNameObjC.py lldb-api :: functionalities/breakpoint/breakpoint_ids/TestBreakpointIDs.py lldb-api :: functionalities/type_completion/TestTypeCompletion.py lldb-api :: functionalities/memory-region/TestMemoryRegion.py lldb-api :: types/TestIntegerTypeExpr.py lldb-api :: commands/expression/vector_of_enums/TestVectorOfEnums.py lldb-api :: lang/cpp/stl/TestSTL.py lldb-api :: functionalities/data-formatter/data-formatter-advanced/TestDataFormatterAdv.py lldb-api :: functionalities/dynamic_value_child_count/TestDynamicValueChildCount.py lldb-api :: functionalities/data-formatter/data-formatter-stl/libcxx/unordered/TestDataFormatterUnordered.py lldb-api :: python_api/lldbutil/iter/TestLLDBIterator.py lldb-api :: types/TestLongTypesExpr.py lldb-api :: functionalities/data-formatter/data-formatter-stl/libcxx/initializerlist/TestInitializerList.py lldb-api :: lang/cpp/namespace/TestNamespace.py lldb-api :: functionalities/data-formatter/data-formatter-named-summaries/TestDataFormatterNamedSummaries.py lldb-api :: commands/expression/call-function/TestCallUserDefinedFunction.py lldb-api :: types/TestFloatTypes.py lldb-api :: lang/cpp/stl/TestStdCXXDisassembly.py lldb-api :: lang/objcxx/objcxx-ivar-vector/TestIvarVector.py lldb-api :: functionalities/data-formatter/ostypeformatting/TestFormattersOsType.py lldb-api :: commands/expression/call-function/TestCallStdStringFunction.py lldb-api :: python_api/class_members/TestSBTypeClassMembers.py lldb-api :: functionalities/breakpoint/cpp_exception/TestCPPExceptionBreakpoint.py lldb-api :: types/TestShortTypeExpr.py lldb-api :: commands/expression/static-initializers/TestStaticInitializers.py lldb-api :: functionalities/thread/create_after_attach/TestCreateAfterAttach.py lldb-api :: lang/c/step_over_no_deadlock/TestStepOverDoesntBlock.py lldb-api :: lang/cpp/char1632_t/TestChar1632T.py lldb-api :: python_api/lldbutil/iter/TestRegistersIterator.py lldb-api :: functionalities/data-formatter/compactvectors/TestCompactVectors.py lldb-api :: functionalities/data-formatter/data-formatter-stl/libcxx/forward_list/TestDataFormatterLibcxxForwardList.py lldb-api :: functionalities/data-formatter/boolreference/TestFormattersBoolRefPtr.py lldb-api :: functionalities/thread/state_after_expression/TestStateAfterExpression.py lldb-api :: functionalities/data-formatter/data-formatter-categories/TestDataFormatterCategories.py lldb-api :: functionalities/data-formatter/data-formatter-stl/libcxx/multimap/TestDataFormatterLibccMultiMap.py lldb-api :: lang/objcxx/cxx-bridged-po/TestObjCXXBridgedPO.py lldb-api :: functionalities/thread/thread_exit/TestThreadExit.py lldb-api :: functionalities/data-formatter/data-formatter-stl/libcxx/vbool/TestDataFormatterLibcxxVBool.py lldb-api :: functionalities/completion/TestCompletion.py lldb-api :: types/TestCharType.py lldb-api :: functionalities/data-formatter/data-formatter-stl/libcxx/queue/TestDataFormatterLibcxxQueue.py

Hide Details

Hide Details

Testing Time: 649.22s Unsupported : 297 Passed : 823 Expectedly Failed: 6 Failed : 107 FAILED: tools/lldb/test/CMakeFiles/check-lldb-reproducers-capture cd /Users/buildslave/jenkins/workspace/lldb-cmake-reproducers/lldb-build/tools/lldb/test && /usr/local/Frameworks/Python.framework/Versions/3.7/bin/python3.7 /Users/buildslave/jenkins/workspace/lldb-cmake-reproducers/lldb-build/./bin/llvm-lit -v --time-tests --shuffle --xunit-xml-output=/Users/buildslave/jenkins/workspace/lldb-cmake-reproducers/test/results.xml -v --param lldb-run-with-repro=capture /Users/buildslave/jenkins/workspace/lldb-cmake-reproducers/lldb-build/tools/lldb/test/API /Users/buildslave/jenkins/workspace/lldb-cmake-reproducers/lldb-build/tools/lldb/test/Shell ninja: build stopped: cannot make progress due to previous errors. Command failed: Command '['/usr/local/bin/ninja', '-k', '0', '-v', 'check-lldb-reproducers']' returned non-zero exit status 1. Command: ['/usr/local/bin/ninja', '-k', '0', '-v', 'check-lldb-reproducers'] [Pipeline] } [Pipeline] // timeout [Pipeline] } [Pipeline] // stage [Pipeline] stage [Pipeline] { (Declarative: Post Actions) [Pipeline] scanForIssues [Clang (LLVM based)] Sleeping for 5 seconds due to JENKINS-32191... [Clang (LLVM based)] Parsing console log (workspace: '/Users/buildslave/jenkins/workspace/lldb-cmake-reproducers') [Clang (LLVM based)] Successfully parsed console log [Clang (LLVM based)] -> found 97 issues (skipped 1662 duplicates) [Clang (LLVM based)] Post processing issues on 'green-dragon-23' with source code encoding 'UTF-8' [Clang (LLVM based)] Creating SCM blamer to obtain author and commit information for affected files [Clang (LLVM based)] Creating SCM miner to obtain statistics for affected repository files [Clang (LLVM based)] Resolving file names for all issues in source directory '/Users/buildslave/jenkins/workspace/lldb-cmake-reproducers' [Clang (LLVM based)] -> resolved paths in source directory (94 found, 0 not found) [Clang (LLVM based)] Resolving module names from module definitions (build.xml, pom.xml, or Manifest.mf files) [Clang (LLVM based)] -> resolved module names for 97 issues [Clang (LLVM based)] Resolving package names (or namespaces) by parsing the affected files [Clang (LLVM based)] -> resolved package names of 94 affected files [Clang (LLVM based)] No filter has been set, publishing all 97 issues [Clang (LLVM based)] Creating fingerprints for all affected code blocks to track issues over different builds [Clang (LLVM based)] -> created fingerprints for 97 issues (skipped 0 issues) [Clang (LLVM based)] Copying affected files to Jenkins' build folder '/Users/Shared/Jenkins/Home/jobs/lldb-cmake-reproducers/builds/326/files-with-issues' [Clang (LLVM based)] -> 73 copied, 22 not in workspace, 0 not-found, 0 with I/O error [Pipeline] junit Recording test results [Pipeline] } [Pipeline] // stage [Pipeline] } [Pipeline] // withEnv [Pipeline] } [Pipeline] // node [Pipeline] End of Pipeline ERROR: script returned exit code 1 Finished: FAILURE