Regression

lldb-api.tools/lldb-server.TestLldbGdbServer.py (from lldb-api)

Failing for the past 1 build (Since Failed#585 )
Took 2 min 20 sec.

Stacktrace

Script:
--
/usr/local/Frameworks/Python.framework/Versions/3.7/bin/python3.7 /Users/buildslave/jenkins/workspace/lldb-cmake-reproducers/llvm-project/lldb/test/API/dotest.py -S nm -u CXXFLAGS -u CFLAGS --codesign-identity lldb_codesign --arch x86_64 --build-dir /Users/buildslave/jenkins/workspace/lldb-cmake-reproducers/lldb-build/lldb-test-build.noindex -s=/Users/buildslave/jenkins/workspace/lldb-cmake-reproducers/test/logs -t --env TERM=vt100 --env LLVM_LIBS_DIR=/Users/buildslave/jenkins/workspace/lldb-cmake-reproducers/lldb-build/./lib --arch x86_64 --build-dir /Users/buildslave/jenkins/workspace/lldb-cmake-reproducers/lldb-build/lldb-test-build.noindex -s /Users/buildslave/jenkins/workspace/lldb-cmake-reproducers/lldb-build/lldb-test-traces --lldb-module-cache-dir /Users/buildslave/jenkins/workspace/lldb-cmake-reproducers/lldb-build/lldb-test-build.noindex/module-cache-lldb/lldb-api --clang-module-cache-dir /Users/buildslave/jenkins/workspace/lldb-cmake-reproducers/lldb-build/lldb-test-build.noindex/module-cache-clang/lldb-api --executable /Users/buildslave/jenkins/workspace/lldb-cmake-reproducers/lldb-build/./bin/lldb --compiler /Users/buildslave/jenkins/workspace/lldb-cmake-reproducers/lldb-build/./bin/clang --dsymutil /Users/buildslave/jenkins/workspace/lldb-cmake-reproducers/lldb-build/./bin/dsymutil --filecheck /Users/buildslave/jenkins/workspace/lldb-cmake-reproducers/lldb-build/./bin/FileCheck --yaml2obj /Users/buildslave/jenkins/workspace/lldb-cmake-reproducers/lldb-build/./bin/yaml2obj --server /Users/buildslave/jenkins/workspace/lldb-cmake-reproducers/lldb-build/./bin/debugserver --lldb-libs-dir /Users/buildslave/jenkins/workspace/lldb-cmake-reproducers/lldb-build/./lib --skip-category=lldb-vscode --skip-category=std-module /Users/buildslave/jenkins/workspace/lldb-cmake-reproducers/llvm-project/lldb/test/API/tools/lldb-server -p TestLldbGdbServer.py --capture-path /Users/buildslave/jenkins/workspace/lldb-cmake-reproducers/lldb-build/lldb-test-build.noindex/reproducers/TestLldbGdbServer.py
--
Exit Code: 1

Command Output (stdout):
--
lldb version 12.0.99 (http://labmaster3.local/git/llvm-project.git revision 37340798ccb00b9c3a53e8a5f1b6430e85870338)
  clang revision 37340798ccb00b9c3a53e8a5f1b6430e85870338
  llvm revision 37340798ccb00b9c3a53e8a5f1b6430e85870338
libstdcxx tests will not be run because: Don't know how to build with libstdcxx on macosx
Skipping following debug info categories: ['dwo']
warning: packet queue entries still exist:
'$T1ethread:1ff27c;00:0400000000000000;01:0000000000000000;02:c848dfe9fe7f0000;03:0100000000000000;04:0309000000000000;05:0000000000000000;06:0049dfe9fe7f0000;07:c848dfe9fe7f0000;08:0a00000000000000;09:0000000000000000;0a:0100000000000000;0b:4602000000000000;0c:0000000000000000;0d:0000000000000000;0e:1849dfe9fe7f0000;0f:1849dfe9fe7f0000;10:56f71869ff7f0000;11:4702000000000000;12:0700000000000000;13:0000000000000000;14:0000000000000000;metype:5;mecount:2;medata:10003;medata:1e;memory:0x7ffee9df4900=3049dfe9fe7f0000dae63566ff7f0000;memory:0x7ffee9df4930=8049dfe9fe7f0000decfe00501000000;#00'


from here:

--
Command Output (stderr):
--

Session logs for test failures/errors/unexpected successes will go into directory '/Users/buildslave/jenkins/workspace/lldb-cmake-reproducers/lldb-build/lldb-test-traces'
Change dir to: /Users/buildslave/jenkins/workspace/lldb-cmake-reproducers/llvm-project/lldb/test/API/tools/lldb-server
runCmd: settings clear -all
output: 

runCmd: settings set symbols.enable-external-lookup false
output: 

runCmd: settings set target.inherit-tcc true
output: 

runCmd: settings set target.auto-apply-fixits false
output: 

runCmd: settings set plugin.process.gdb-remote.packet-timeout 60
output: 

runCmd: settings set symbols.clang-modules-cache-path "/Users/buildslave/jenkins/workspace/lldb-cmake-reproducers/lldb-build/lldb-test-build.noindex/module-cache-lldb/lldb-api"
output: 

runCmd: settings set use-color false
output: 

runCmd: setting set target.prefer-dynamic-value no-dynamic-values
output: 

2020-12-01 11:53:41,039 WARNING  timeout waiting for stub output (accumulated output:)
XFAIL: LLDB (/Users/buildslave/jenkins/workspace/lldb-cmake-reproducers/lldb-build/bin/clang-x86_64) :: test_Hc_then_Csignal_signals_correct_thread_launch_debugserver (TestLldbGdbServer.LldbGdbServerTestCase)
  File "/Users/buildslave/jenkins/workspace/lldb-cmake-reproducers/llvm-project/lldb/test/API/dotest.py", line 7, in <module>
    lldbsuite.test.run_suite()
  File "/Users/buildslave/jenkins/workspace/lldb-cmake-reproducers/llvm-project/lldb/packages/Python/lldbsuite/test/dotest.py", line 1017, in run_suite
    configuration.suite)
  File "/Users/buildslave/jenkins/workspace/lldb-cmake-reproducers/llvm-project/lldb/third_party/Python/module/unittest2/unittest2/runner.py", line 165, in run
    test(result)
  File "/Users/buildslave/jenkins/workspace/lldb-cmake-reproducers/llvm-project/lldb/third_party/Python/module/unittest2/unittest2/suite.py", line 66, in __call__
    return self.run(*args, **kwds)
  File "/Users/buildslave/jenkins/workspace/lldb-cmake-reproducers/llvm-project/lldb/third_party/Python/module/unittest2/unittest2/suite.py", line 85, in run
    self._wrapped_run(result)
  File "/Users/buildslave/jenkins/workspace/lldb-cmake-reproducers/llvm-project/lldb/third_party/Python/module/unittest2/unittest2/suite.py", line 115, in _wrapped_run
    test._wrapped_run(result, debug)
  File "/Users/buildslave/jenkins/workspace/lldb-cmake-reproducers/llvm-project/lldb/third_party/Python/module/unittest2/unittest2/suite.py", line 117, in _wrapped_run
    test(result)
  File "/Users/buildslave/jenkins/workspace/lldb-cmake-reproducers/llvm-project/lldb/third_party/Python/module/unittest2/unittest2/case.py", line 458, in __call__
    return self.run(*args, **kwds)
  File "/Users/buildslave/jenkins/workspace/lldb-cmake-reproducers/llvm-project/lldb/third_party/Python/module/unittest2/unittest2/case.py", line 386, in run
    self.tearDown()
  File "/Users/buildslave/jenkins/workspace/lldb-cmake-reproducers/llvm-project/lldb/packages/Python/lldbsuite/test/tools/lldb-server/gdbremote_testcase.py", line 121, in tearDown
    self._pump_queues.verify_queues_empty()
  File "/Users/buildslave/jenkins/workspace/lldb-cmake-reproducers/llvm-project/lldb/packages/Python/lldbsuite/test/tools/lldb-server/socket_packet_pump.py", line 57, in verify_queues_empty
    traceback.print_stack()
runCmd: settings clear -all
output: 

runCmd: settings set symbols.enable-external-lookup false
output: 

runCmd: settings set target.inherit-tcc true
output: 

runCmd: settings set target.auto-apply-fixits false
output: 

runCmd: settings set plugin.process.gdb-remote.packet-timeout 60
output: 

runCmd: settings set symbols.clang-modules-cache-path "/Users/buildslave/jenkins/workspace/lldb-cmake-reproducers/lldb-build/lldb-test-build.noindex/module-cache-lldb/lldb-api"
output: 

runCmd: settings set use-color false
output: 

runCmd: setting set target.prefer-dynamic-value no-dynamic-values
output: 

UNSUPPORTED: LLDB (/Users/buildslave/jenkins/workspace/lldb-cmake-reproducers/lldb-build/bin/clang-x86_64) :: test_Hc_then_Csignal_signals_correct_thread_launch_llgs (TestLldbGdbServer.LldbGdbServerTestCase) (llgs tests) 
runCmd: settings clear -all
output: 

runCmd: settings set symbols.enable-external-lookup false
output: 

runCmd: settings set target.inherit-tcc true
output: 

runCmd: settings set target.auto-apply-fixits false
output: 

runCmd: settings set plugin.process.gdb-remote.packet-timeout 60
output: 

runCmd: settings set symbols.clang-modules-cache-path "/Users/buildslave/jenkins/workspace/lldb-cmake-reproducers/lldb-build/lldb-test-build.noindex/module-cache-lldb/lldb-api"
output: 

runCmd: settings set use-color false
output: 

runCmd: setting set target.prefer-dynamic-value no-dynamic-values
output: 

PASS: LLDB (/Users/buildslave/jenkins/workspace/lldb-cmake-reproducers/lldb-build/bin/clang-x86_64) :: test_Hg_switches_to_3_threads_attach_debugserver (TestLldbGdbServer.LldbGdbServerTestCase)
runCmd: settings clear -all
output: 

runCmd: settings set symbols.enable-external-lookup false
output: 

runCmd: settings set target.inherit-tcc true
output: 

runCmd: settings set target.auto-apply-fixits false
output: 

runCmd: settings set plugin.process.gdb-remote.packet-timeout 60
output: 

runCmd: settings set symbols.clang-modules-cache-path "/Users/buildslave/jenkins/workspace/lldb-cmake-reproducers/lldb-build/lldb-test-build.noindex/module-cache-lldb/lldb-api"
output: 

runCmd: settings set use-color false
output: 

runCmd: setting set target.prefer-dynamic-value no-dynamic-values
output: 

UNSUPPORTED: LLDB (/Users/buildslave/jenkins/workspace/lldb-cmake-reproducers/lldb-build/bin/clang-x86_64) :: test_Hg_switches_to_3_threads_attach_llgs (TestLldbGdbServer.LldbGdbServerTestCase) (llgs tests) 
runCmd: settings clear -all
output: 

runCmd: settings set symbols.enable-external-lookup false
output: 

runCmd: settings set target.inherit-tcc true
output: 

runCmd: settings set target.auto-apply-fixits false
output: 

runCmd: settings set plugin.process.gdb-remote.packet-timeout 60
output: 

runCmd: settings set symbols.clang-modules-cache-path "/Users/buildslave/jenkins/workspace/lldb-cmake-reproducers/lldb-build/lldb-test-build.noindex/module-cache-lldb/lldb-api"
output: 

runCmd: settings set use-color false
output: 

runCmd: setting set target.prefer-dynamic-value no-dynamic-values
output: 

FAIL: LLDB (/Users/buildslave/jenkins/workspace/lldb-cmake-reproducers/lldb-build/bin/clang-x86_64) :: test_Hg_switches_to_3_threads_launch_debugserver (TestLldbGdbServer.LldbGdbServerTestCase)
runCmd: settings clear -all
output: 

runCmd: settings set symbols.enable-external-lookup false
output: 

runCmd: settings set target.inherit-tcc true
output: 

runCmd: settings set target.auto-apply-fixits false
output: 

runCmd: settings set plugin.process.gdb-remote.packet-timeout 60
output: 

runCmd: settings set symbols.clang-modules-cache-path "/Users/buildslave/jenkins/workspace/lldb-cmake-reproducers/lldb-build/lldb-test-build.noindex/module-cache-lldb/lldb-api"
output: 

runCmd: settings set use-color false
output: 

runCmd: setting set target.prefer-dynamic-value no-dynamic-values
output: 

UNSUPPORTED: LLDB (/Users/buildslave/jenkins/workspace/lldb-cmake-reproducers/lldb-build/bin/clang-x86_64) :: test_Hg_switches_to_3_threads_launch_llgs (TestLldbGdbServer.LldbGdbServerTestCase) (llgs tests) 
runCmd: settings clear -all
output: 

runCmd: settings set symbols.enable-external-lookup false
output: 

runCmd: settings set target.inherit-tcc true
output: 

runCmd: settings set target.auto-apply-fixits false
output: 

runCmd: settings set plugin.process.gdb-remote.packet-timeout 60
output: 

runCmd: settings set symbols.clang-modules-cache-path "/Users/buildslave/jenkins/workspace/lldb-cmake-reproducers/lldb-build/lldb-test-build.noindex/module-cache-lldb/lldb-api"
output: 

runCmd: settings set use-color false
output: 

runCmd: setting set target.prefer-dynamic-value no-dynamic-values
output: 

PASS: LLDB (/Users/buildslave/jenkins/workspace/lldb-cmake-reproducers/lldb-build/bin/clang-x86_64) :: test_P_and_p_thread_suffix_work_debugserver (TestLldbGdbServer.LldbGdbServerTestCase)
runCmd: settings clear -all
output: 

runCmd: settings set symbols.enable-external-lookup false
output: 

runCmd: settings set target.inherit-tcc true
output: 

runCmd: settings set target.auto-apply-fixits false
output: 

runCmd: settings set plugin.process.gdb-remote.packet-timeout 60
output: 

runCmd: settings set symbols.clang-modules-cache-path "/Users/buildslave/jenkins/workspace/lldb-cmake-reproducers/lldb-build/lldb-test-build.noindex/module-cache-lldb/lldb-api"
output: 

runCmd: settings set use-color false
output: 

runCmd: setting set target.prefer-dynamic-value no-dynamic-values
output: 

UNSUPPORTED: LLDB (/Users/buildslave/jenkins/workspace/lldb-cmake-reproducers/lldb-build/bin/clang-x86_64) :: test_P_and_p_thread_suffix_work_llgs (TestLldbGdbServer.LldbGdbServerTestCase) (llgs tests) 
runCmd: settings clear -all
output: 

runCmd: settings set symbols.enable-external-lookup false
output: 

runCmd: settings set target.inherit-tcc true
output: 

runCmd: settings set target.auto-apply-fixits false
output: 

runCmd: settings set plugin.process.gdb-remote.packet-timeout 60
output: 

runCmd: settings set symbols.clang-modules-cache-path "/Users/buildslave/jenkins/workspace/lldb-cmake-reproducers/lldb-build/lldb-test-build.noindex/module-cache-lldb/lldb-api"
output: 

runCmd: settings set use-color false
output: 

runCmd: setting set target.prefer-dynamic-value no-dynamic-values
output: 

successful writes: 7, failed writes: 11

PASS: LLDB (/Users/buildslave/jenkins/workspace/lldb-cmake-reproducers/lldb-build/bin/clang-x86_64) :: test_P_writes_all_gpr_registers_debugserver (TestLldbGdbServer.LldbGdbServerTestCase)
runCmd: settings clear -all
output: 

runCmd: settings set symbols.enable-external-lookup false
output: 

runCmd: settings set target.inherit-tcc true
output: 

runCmd: settings set target.auto-apply-fixits false
output: 

runCmd: settings set plugin.process.gdb-remote.packet-timeout 60
output: 

runCmd: settings set symbols.clang-modules-cache-path "/Users/buildslave/jenkins/workspace/lldb-cmake-reproducers/lldb-build/lldb-test-build.noindex/module-cache-lldb/lldb-api"
output: 

runCmd: settings set use-color false
output: 

runCmd: setting set target.prefer-dynamic-value no-dynamic-values
output: 

UNSUPPORTED: LLDB (/Users/buildslave/jenkins/workspace/lldb-cmake-reproducers/lldb-build/bin/clang-x86_64) :: test_P_writes_all_gpr_registers_llgs (TestLldbGdbServer.LldbGdbServerTestCase) (llgs tests) 
runCmd: settings clear -all
output: 

runCmd: settings set symbols.enable-external-lookup false
output: 

runCmd: settings set target.inherit-tcc true
output: 

runCmd: settings set target.auto-apply-fixits false
output: 

runCmd: settings set plugin.process.gdb-remote.packet-timeout 60
output: 

runCmd: settings set symbols.clang-modules-cache-path "/Users/buildslave/jenkins/workspace/lldb-cmake-reproducers/lldb-build/lldb-test-build.noindex/module-cache-lldb/lldb-api"
output: 

runCmd: settings set use-color false
output: 

runCmd: setting set target.prefer-dynamic-value no-dynamic-values
output: 

PASS: LLDB (/Users/buildslave/jenkins/workspace/lldb-cmake-reproducers/lldb-build/bin/clang-x86_64) :: test_attach_commandline_continue_app_exits_debugserver (TestLldbGdbServer.LldbGdbServerTestCase)
runCmd: settings clear -all
output: 

runCmd: settings set symbols.enable-external-lookup false
output: 

runCmd: settings set target.inherit-tcc true
output: 

runCmd: settings set target.auto-apply-fixits false
output: 

runCmd: settings set plugin.process.gdb-remote.packet-timeout 60
output: 

runCmd: settings set symbols.clang-modules-cache-path "/Users/buildslave/jenkins/workspace/lldb-cmake-reproducers/lldb-build/lldb-test-build.noindex/module-cache-lldb/lldb-api"
output: 

runCmd: settings set use-color false
output: 

runCmd: setting set target.prefer-dynamic-value no-dynamic-values
output: 

UNSUPPORTED: LLDB (/Users/buildslave/jenkins/workspace/lldb-cmake-reproducers/lldb-build/bin/clang-x86_64) :: test_attach_commandline_continue_app_exits_llgs (TestLldbGdbServer.LldbGdbServerTestCase) (llgs tests) 
runCmd: settings clear -all
output: 

runCmd: settings set symbols.enable-external-lookup false
output: 

runCmd: settings set target.inherit-tcc true
output: 

runCmd: settings set target.auto-apply-fixits false
output: 

runCmd: settings set plugin.process.gdb-remote.packet-timeout 60
output: 

runCmd: settings set symbols.clang-modules-cache-path "/Users/buildslave/jenkins/workspace/lldb-cmake-reproducers/lldb-build/lldb-test-build.noindex/module-cache-lldb/lldb-api"
output: 

runCmd: settings set use-color false
output: 

runCmd: setting set target.prefer-dynamic-value no-dynamic-values
output: 

PASS: LLDB (/Users/buildslave/jenkins/workspace/lldb-cmake-reproducers/lldb-build/bin/clang-x86_64) :: test_c_packet_works_debugserver (TestLldbGdbServer.LldbGdbServerTestCase)
runCmd: settings clear -all
output: 

runCmd: settings set symbols.enable-external-lookup false
output: 

runCmd: settings set target.inherit-tcc true
output: 

runCmd: settings set target.auto-apply-fixits false
output: 

runCmd: settings set plugin.process.gdb-remote.packet-timeout 60
output: 

runCmd: settings set symbols.clang-modules-cache-path "/Users/buildslave/jenkins/workspace/lldb-cmake-reproducers/lldb-build/lldb-test-build.noindex/module-cache-lldb/lldb-api"
output: 

runCmd: settings set use-color false
output: 

runCmd: setting set target.prefer-dynamic-value no-dynamic-values
output: 

UNSUPPORTED: LLDB (/Users/buildslave/jenkins/workspace/lldb-cmake-reproducers/lldb-build/bin/clang-x86_64) :: test_c_packet_works_llgs (TestLldbGdbServer.LldbGdbServerTestCase) (llgs tests) 
runCmd: settings clear -all
output: 

runCmd: settings set symbols.enable-external-lookup false
output: 

runCmd: settings set target.inherit-tcc true
output: 

runCmd: settings set target.auto-apply-fixits false
output: 

runCmd: settings set plugin.process.gdb-remote.packet-timeout 60
output: 

runCmd: settings set symbols.clang-modules-cache-path "/Users/buildslave/jenkins/workspace/lldb-cmake-reproducers/lldb-build/lldb-test-build.noindex/module-cache-lldb/lldb-api"
output: 

runCmd: settings set use-color false
output: 

runCmd: setting set target.prefer-dynamic-value no-dynamic-values
output: 

PASS: LLDB (/Users/buildslave/jenkins/workspace/lldb-cmake-reproducers/lldb-build/bin/clang-x86_64) :: test_exe_starts_debugserver (TestLldbGdbServer.LldbGdbServerTestCase)
runCmd: settings clear -all
output: 

runCmd: settings set symbols.enable-external-lookup false
output: 

runCmd: settings set target.inherit-tcc true
output: 

runCmd: settings set target.auto-apply-fixits false
output: 

runCmd: settings set plugin.process.gdb-remote.packet-timeout 60
output: 

runCmd: settings set symbols.clang-modules-cache-path "/Users/buildslave/jenkins/workspace/lldb-cmake-reproducers/lldb-build/lldb-test-build.noindex/module-cache-lldb/lldb-api"
output: 

runCmd: settings set use-color false
output: 

runCmd: setting set target.prefer-dynamic-value no-dynamic-values
output: 

UNSUPPORTED: LLDB (/Users/buildslave/jenkins/workspace/lldb-cmake-reproducers/lldb-build/bin/clang-x86_64) :: test_exe_starts_llgs (TestLldbGdbServer.LldbGdbServerTestCase) (llgs tests) 
runCmd: settings clear -all
output: 

runCmd: settings set symbols.enable-external-lookup false
output: 

runCmd: settings set target.inherit-tcc true
output: 

runCmd: settings set target.auto-apply-fixits false
output: 

runCmd: settings set plugin.process.gdb-remote.packet-timeout 60
output: 

runCmd: settings set symbols.clang-modules-cache-path "/Users/buildslave/jenkins/workspace/lldb-cmake-reproducers/lldb-build/lldb-test-build.noindex/module-cache-lldb/lldb-api"
output: 

runCmd: settings set use-color false
output: 

runCmd: setting set target.prefer-dynamic-value no-dynamic-values
output: 

PASS: LLDB (/Users/buildslave/jenkins/workspace/lldb-cmake-reproducers/lldb-build/bin/clang-x86_64) :: test_first_launch_stop_reply_thread_matches_first_qC_debugserver (TestLldbGdbServer.LldbGdbServerTestCase)
runCmd: settings clear -all
output: 

runCmd: settings set symbols.enable-external-lookup false
output: 

runCmd: settings set target.inherit-tcc true
output: 

runCmd: settings set target.auto-apply-fixits false
output: 

runCmd: settings set plugin.process.gdb-remote.packet-timeout 60
output: 

runCmd: settings set symbols.clang-modules-cache-path "/Users/buildslave/jenkins/workspace/lldb-cmake-reproducers/lldb-build/lldb-test-build.noindex/module-cache-lldb/lldb-api"
output: 

runCmd: settings set use-color false
output: 

runCmd: setting set target.prefer-dynamic-value no-dynamic-values
output: 

UNSUPPORTED: LLDB (/Users/buildslave/jenkins/workspace/lldb-cmake-reproducers/lldb-build/bin/clang-x86_64) :: test_first_launch_stop_reply_thread_matches_first_qC_llgs (TestLldbGdbServer.LldbGdbServerTestCase) (llgs tests) 
UNSUPPORTED: LLDB (/Users/buildslave/jenkins/workspace/lldb-cmake-reproducers/lldb-build/bin/clang-x86_64) :: test_hardware_breakpoint_set_and_remove_work_debugserver (TestLldbGdbServer.LldbGdbServerTestCase) (requires one of linux) 
UNSUPPORTED: LLDB (/Users/buildslave/jenkins/workspace/lldb-cmake-reproducers/lldb-build/bin/clang-x86_64) :: test_hardware_breakpoint_set_and_remove_work_llgs (TestLldbGdbServer.LldbGdbServerTestCase) (requires one of linux) 
runCmd: settings clear -all
output: 

runCmd: settings set symbols.enable-external-lookup false
output: 

runCmd: settings set target.inherit-tcc true
output: 

runCmd: settings set target.auto-apply-fixits false
output: 

runCmd: settings set plugin.process.gdb-remote.packet-timeout 60
output: 

runCmd: settings set symbols.clang-modules-cache-path "/Users/buildslave/jenkins/workspace/lldb-cmake-reproducers/lldb-build/lldb-test-build.noindex/module-cache-lldb/lldb-api"
output: 

runCmd: settings set use-color false
output: 

runCmd: setting set target.prefer-dynamic-value no-dynamic-values
output: 

PASS: LLDB (/Users/buildslave/jenkins/workspace/lldb-cmake-reproducers/lldb-build/bin/clang-x86_64) :: test_inferior_print_exit_debugserver (TestLldbGdbServer.LldbGdbServerTestCase)
runCmd: settings clear -all
output: 

runCmd: settings set symbols.enable-external-lookup false
output: 

runCmd: settings set target.inherit-tcc true
output: 

runCmd: settings set target.auto-apply-fixits false
output: 

runCmd: settings set plugin.process.gdb-remote.packet-timeout 60
output: 

runCmd: settings set symbols.clang-modules-cache-path "/Users/buildslave/jenkins/workspace/lldb-cmake-reproducers/lldb-build/lldb-test-build.noindex/module-cache-lldb/lldb-api"
output: 

runCmd: settings set use-color false
output: 

runCmd: setting set target.prefer-dynamic-value no-dynamic-values
output: 

UNSUPPORTED: LLDB (/Users/buildslave/jenkins/workspace/lldb-cmake-reproducers/lldb-build/bin/clang-x86_64) :: test_inferior_print_exit_llgs (TestLldbGdbServer.LldbGdbServerTestCase) (llgs tests) 
runCmd: settings clear -all
output: 

runCmd: settings set symbols.enable-external-lookup false
output: 

runCmd: settings set target.inherit-tcc true
output: 

runCmd: settings set target.auto-apply-fixits false
output: 

runCmd: settings set plugin.process.gdb-remote.packet-timeout 60
output: 

runCmd: settings set symbols.clang-modules-cache-path "/Users/buildslave/jenkins/workspace/lldb-cmake-reproducers/lldb-build/lldb-test-build.noindex/module-cache-lldb/lldb-api"
output: 

runCmd: settings set use-color false
output: 

runCmd: setting set target.prefer-dynamic-value no-dynamic-values
output: 

PASS: LLDB (/Users/buildslave/jenkins/workspace/lldb-cmake-reproducers/lldb-build/bin/clang-x86_64) :: test_list_threads_in_stop_reply_supported_debugserver (TestLldbGdbServer.LldbGdbServerTestCase)
runCmd: settings clear -all
output: 

runCmd: settings set symbols.enable-external-lookup false
output: 

runCmd: settings set target.inherit-tcc true
output: 

runCmd: settings set target.auto-apply-fixits false
output: 

runCmd: settings set plugin.process.gdb-remote.packet-timeout 60
output: 

runCmd: settings set symbols.clang-modules-cache-path "/Users/buildslave/jenkins/workspace/lldb-cmake-reproducers/lldb-build/lldb-test-build.noindex/module-cache-lldb/lldb-api"
output: 

runCmd: settings set use-color false
output: 

runCmd: setting set target.prefer-dynamic-value no-dynamic-values
output: 

UNSUPPORTED: LLDB (/Users/buildslave/jenkins/workspace/lldb-cmake-reproducers/lldb-build/bin/clang-x86_64) :: test_list_threads_in_stop_reply_supported_llgs (TestLldbGdbServer.LldbGdbServerTestCase) (llgs tests) 
runCmd: settings clear -all
output: 

runCmd: settings set symbols.enable-external-lookup false
output: 

runCmd: settings set target.inherit-tcc true
output: 

runCmd: settings set target.auto-apply-fixits false
output: 

runCmd: settings set plugin.process.gdb-remote.packet-timeout 60
output: 

runCmd: settings set symbols.clang-modules-cache-path "/Users/buildslave/jenkins/workspace/lldb-cmake-reproducers/lldb-build/lldb-test-build.noindex/module-cache-lldb/lldb-api"
output: 

runCmd: settings set use-color false
output: 

runCmd: setting set target.prefer-dynamic-value no-dynamic-values
output: 

PASS: LLDB (/Users/buildslave/jenkins/workspace/lldb-cmake-reproducers/lldb-build/bin/clang-x86_64) :: test_m_packet_reads_memory_debugserver (TestLldbGdbServer.LldbGdbServerTestCase)
runCmd: settings clear -all
output: 

runCmd: settings set symbols.enable-external-lookup false
output: 

runCmd: settings set target.inherit-tcc true
output: 

runCmd: settings set target.auto-apply-fixits false
output: 

runCmd: settings set plugin.process.gdb-remote.packet-timeout 60
output: 

runCmd: settings set symbols.clang-modules-cache-path "/Users/buildslave/jenkins/workspace/lldb-cmake-reproducers/lldb-build/lldb-test-build.noindex/module-cache-lldb/lldb-api"
output: 

runCmd: settings set use-color false
output: 

runCmd: setting set target.prefer-dynamic-value no-dynamic-values
output: 

UNSUPPORTED: LLDB (/Users/buildslave/jenkins/workspace/lldb-cmake-reproducers/lldb-build/bin/clang-x86_64) :: test_m_packet_reads_memory_llgs (TestLldbGdbServer.LldbGdbServerTestCase) (llgs tests) 
runCmd: settings clear -all
output: 

runCmd: settings set symbols.enable-external-lookup false
output: 

runCmd: settings set target.inherit-tcc true
output: 

runCmd: settings set target.auto-apply-fixits false
output: 

runCmd: settings set plugin.process.gdb-remote.packet-timeout 60
output: 

runCmd: settings set symbols.clang-modules-cache-path "/Users/buildslave/jenkins/workspace/lldb-cmake-reproducers/lldb-build/lldb-test-build.noindex/module-cache-lldb/lldb-api"
output: 

runCmd: settings set use-color false
output: 

runCmd: setting set target.prefer-dynamic-value no-dynamic-values
output: 

PASS: LLDB (/Users/buildslave/jenkins/workspace/lldb-cmake-reproducers/lldb-build/bin/clang-x86_64) :: test_p_returns_correct_data_size_for_each_qRegisterInfo_attach_debugserver (TestLldbGdbServer.LldbGdbServerTestCase)
runCmd: settings clear -all
output: 

runCmd: settings set symbols.enable-external-lookup false
output: 

runCmd: settings set target.inherit-tcc true
output: 

runCmd: settings set target.auto-apply-fixits false
output: 

runCmd: settings set plugin.process.gdb-remote.packet-timeout 60
output: 

runCmd: settings set symbols.clang-modules-cache-path "/Users/buildslave/jenkins/workspace/lldb-cmake-reproducers/lldb-build/lldb-test-build.noindex/module-cache-lldb/lldb-api"
output: 

runCmd: settings set use-color false
output: 

runCmd: setting set target.prefer-dynamic-value no-dynamic-values
output: 

UNSUPPORTED: LLDB (/Users/buildslave/jenkins/workspace/lldb-cmake-reproducers/lldb-build/bin/clang-x86_64) :: test_p_returns_correct_data_size_for_each_qRegisterInfo_attach_llgs (TestLldbGdbServer.LldbGdbServerTestCase) (llgs tests) 
runCmd: settings clear -all
output: 

runCmd: settings set symbols.enable-external-lookup false
output: 

runCmd: settings set target.inherit-tcc true
output: 

runCmd: settings set target.auto-apply-fixits false
output: 

runCmd: settings set plugin.process.gdb-remote.packet-timeout 60
output: 

runCmd: settings set symbols.clang-modules-cache-path "/Users/buildslave/jenkins/workspace/lldb-cmake-reproducers/lldb-build/lldb-test-build.noindex/module-cache-lldb/lldb-api"
output: 

runCmd: settings set use-color false
output: 

runCmd: setting set target.prefer-dynamic-value no-dynamic-values
output: 

PASS: LLDB (/Users/buildslave/jenkins/workspace/lldb-cmake-reproducers/lldb-build/bin/clang-x86_64) :: test_p_returns_correct_data_size_for_each_qRegisterInfo_launch_debugserver (TestLldbGdbServer.LldbGdbServerTestCase)
runCmd: settings clear -all
output: 

runCmd: settings set symbols.enable-external-lookup false
output: 

runCmd: settings set target.inherit-tcc true
output: 

runCmd: settings set target.auto-apply-fixits false
output: 

runCmd: settings set plugin.process.gdb-remote.packet-timeout 60
output: 

runCmd: settings set symbols.clang-modules-cache-path "/Users/buildslave/jenkins/workspace/lldb-cmake-reproducers/lldb-build/lldb-test-build.noindex/module-cache-lldb/lldb-api"
output: 

runCmd: settings set use-color false
output: 

runCmd: setting set target.prefer-dynamic-value no-dynamic-values
output: 

UNSUPPORTED: LLDB (/Users/buildslave/jenkins/workspace/lldb-cmake-reproducers/lldb-build/bin/clang-x86_64) :: test_p_returns_correct_data_size_for_each_qRegisterInfo_launch_llgs (TestLldbGdbServer.LldbGdbServerTestCase) (llgs tests) 
runCmd: settings clear -all
output: 

runCmd: settings set symbols.enable-external-lookup false
output: 

runCmd: settings set target.inherit-tcc true
output: 

runCmd: settings set target.auto-apply-fixits false
output: 

runCmd: settings set plugin.process.gdb-remote.packet-timeout 60
output: 

runCmd: settings set symbols.clang-modules-cache-path "/Users/buildslave/jenkins/workspace/lldb-cmake-reproducers/lldb-build/lldb-test-build.noindex/module-cache-lldb/lldb-api"
output: 

runCmd: settings set use-color false
output: 

runCmd: setting set target.prefer-dynamic-value no-dynamic-values
output: 

PASS: LLDB (/Users/buildslave/jenkins/workspace/lldb-cmake-reproducers/lldb-build/bin/clang-x86_64) :: test_qMemoryRegionInfo_is_supported_debugserver (TestLldbGdbServer.LldbGdbServerTestCase)
runCmd: settings clear -all
output: 

runCmd: settings set symbols.enable-external-lookup false
output: 

runCmd: settings set target.inherit-tcc true
output: 

runCmd: settings set target.auto-apply-fixits false
output: 

runCmd: settings set plugin.process.gdb-remote.packet-timeout 60
output: 

runCmd: settings set symbols.clang-modules-cache-path "/Users/buildslave/jenkins/workspace/lldb-cmake-reproducers/lldb-build/lldb-test-build.noindex/module-cache-lldb/lldb-api"
output: 

runCmd: settings set use-color false
output: 

runCmd: setting set target.prefer-dynamic-value no-dynamic-values
output: 

UNSUPPORTED: LLDB (/Users/buildslave/jenkins/workspace/lldb-cmake-reproducers/lldb-build/bin/clang-x86_64) :: test_qMemoryRegionInfo_is_supported_llgs (TestLldbGdbServer.LldbGdbServerTestCase) (llgs tests) 
runCmd: settings clear -all
output: 

runCmd: settings set symbols.enable-external-lookup false
output: 

runCmd: settings set target.inherit-tcc true
output: 

runCmd: settings set target.auto-apply-fixits false
output: 

runCmd: settings set plugin.process.gdb-remote.packet-timeout 60
output: 

runCmd: settings set symbols.clang-modules-cache-path "/Users/buildslave/jenkins/workspace/lldb-cmake-reproducers/lldb-build/lldb-test-build.noindex/module-cache-lldb/lldb-api"
output: 

runCmd: settings set use-color false
output: 

runCmd: setting set target.prefer-dynamic-value no-dynamic-values
output: 

PASS: LLDB (/Users/buildslave/jenkins/workspace/lldb-cmake-reproducers/lldb-build/bin/clang-x86_64) :: test_qMemoryRegionInfo_reports_code_address_as_executable_debugserver (TestLldbGdbServer.LldbGdbServerTestCase)
runCmd: settings clear -all
output: 

runCmd: settings set symbols.enable-external-lookup false
output: 

runCmd: settings set target.inherit-tcc true
output: 

runCmd: settings set target.auto-apply-fixits false
output: 

runCmd: settings set plugin.process.gdb-remote.packet-timeout 60
output: 

runCmd: settings set symbols.clang-modules-cache-path "/Users/buildslave/jenkins/workspace/lldb-cmake-reproducers/lldb-build/lldb-test-build.noindex/module-cache-lldb/lldb-api"
output: 

runCmd: settings set use-color false
output: 

runCmd: setting set target.prefer-dynamic-value no-dynamic-values
output: 

UNSUPPORTED: LLDB (/Users/buildslave/jenkins/workspace/lldb-cmake-reproducers/lldb-build/bin/clang-x86_64) :: test_qMemoryRegionInfo_reports_code_address_as_executable_llgs (TestLldbGdbServer.LldbGdbServerTestCase) (llgs tests) 
runCmd: settings clear -all
output: 

runCmd: settings set symbols.enable-external-lookup false
output: 

runCmd: settings set target.inherit-tcc true
output: 

runCmd: settings set target.auto-apply-fixits false
output: 

runCmd: settings set plugin.process.gdb-remote.packet-timeout 60
output: 

runCmd: settings set symbols.clang-modules-cache-path "/Users/buildslave/jenkins/workspace/lldb-cmake-reproducers/lldb-build/lldb-test-build.noindex/module-cache-lldb/lldb-api"
output: 

runCmd: settings set use-color false
output: 

runCmd: setting set target.prefer-dynamic-value no-dynamic-values
output: 

PASS: LLDB (/Users/buildslave/jenkins/workspace/lldb-cmake-reproducers/lldb-build/bin/clang-x86_64) :: test_qMemoryRegionInfo_reports_heap_address_as_readable_writeable_debugserver (TestLldbGdbServer.LldbGdbServerTestCase)
runCmd: settings clear -all
output: 

runCmd: settings set symbols.enable-external-lookup false
output: 

runCmd: settings set target.inherit-tcc true
output: 

runCmd: settings set target.auto-apply-fixits false
output: 

runCmd: settings set plugin.process.gdb-remote.packet-timeout 60
output: 

runCmd: settings set symbols.clang-modules-cache-path "/Users/buildslave/jenkins/workspace/lldb-cmake-reproducers/lldb-build/lldb-test-build.noindex/module-cache-lldb/lldb-api"
output: 

runCmd: settings set use-color false
output: 

runCmd: setting set target.prefer-dynamic-value no-dynamic-values
output: 

UNSUPPORTED: LLDB (/Users/buildslave/jenkins/workspace/lldb-cmake-reproducers/lldb-build/bin/clang-x86_64) :: test_qMemoryRegionInfo_reports_heap_address_as_readable_writeable_llgs (TestLldbGdbServer.LldbGdbServerTestCase) (llgs tests) 
runCmd: settings clear -all
output: 

runCmd: settings set symbols.enable-external-lookup false
output: 

runCmd: settings set target.inherit-tcc true
output: 

runCmd: settings set target.auto-apply-fixits false
output: 

runCmd: settings set plugin.process.gdb-remote.packet-timeout 60
output: 

runCmd: settings set symbols.clang-modules-cache-path "/Users/buildslave/jenkins/workspace/lldb-cmake-reproducers/lldb-build/lldb-test-build.noindex/module-cache-lldb/lldb-api"
output: 

runCmd: settings set use-color false
output: 

runCmd: setting set target.prefer-dynamic-value no-dynamic-values
output: 

PASS: LLDB (/Users/buildslave/jenkins/workspace/lldb-cmake-reproducers/lldb-build/bin/clang-x86_64) :: test_qMemoryRegionInfo_reports_stack_address_as_readable_writeable_debugserver (TestLldbGdbServer.LldbGdbServerTestCase)
runCmd: settings clear -all
output: 

runCmd: settings set symbols.enable-external-lookup false
output: 

runCmd: settings set target.inherit-tcc true
output: 

runCmd: settings set target.auto-apply-fixits false
output: 

runCmd: settings set plugin.process.gdb-remote.packet-timeout 60
output: 

runCmd: settings set symbols.clang-modules-cache-path "/Users/buildslave/jenkins/workspace/lldb-cmake-reproducers/lldb-build/lldb-test-build.noindex/module-cache-lldb/lldb-api"
output: 

runCmd: settings set use-color false
output: 

runCmd: setting set target.prefer-dynamic-value no-dynamic-values
output: 

UNSUPPORTED: LLDB (/Users/buildslave/jenkins/workspace/lldb-cmake-reproducers/lldb-build/bin/clang-x86_64) :: test_qMemoryRegionInfo_reports_stack_address_as_readable_writeable_llgs (TestLldbGdbServer.LldbGdbServerTestCase) (llgs tests) 
runCmd: settings clear -all
output: 

runCmd: settings set symbols.enable-external-lookup false
output: 

runCmd: settings set target.inherit-tcc true
output: 

runCmd: settings set target.auto-apply-fixits false
output: 

runCmd: settings set plugin.process.gdb-remote.packet-timeout 60
output: 

runCmd: settings set symbols.clang-modules-cache-path "/Users/buildslave/jenkins/workspace/lldb-cmake-reproducers/lldb-build/lldb-test-build.noindex/module-cache-lldb/lldb-api"
output: 

runCmd: settings set use-color false
output: 

runCmd: setting set target.prefer-dynamic-value no-dynamic-values
output: 

PASS: LLDB (/Users/buildslave/jenkins/workspace/lldb-cmake-reproducers/lldb-build/bin/clang-x86_64) :: test_qRegisterInfo_contains_at_least_one_register_set_debugserver (TestLldbGdbServer.LldbGdbServerTestCase)
runCmd: settings clear -all
output: 

runCmd: settings set symbols.enable-external-lookup false
output: 

runCmd: settings set target.inherit-tcc true
output: 

runCmd: settings set target.auto-apply-fixits false
output: 

runCmd: settings set plugin.process.gdb-remote.packet-timeout 60
output: 

runCmd: settings set symbols.clang-modules-cache-path "/Users/buildslave/jenkins/workspace/lldb-cmake-reproducers/lldb-build/lldb-test-build.noindex/module-cache-lldb/lldb-api"
output: 

runCmd: settings set use-color false
output: 

runCmd: setting set target.prefer-dynamic-value no-dynamic-values
output: 

UNSUPPORTED: LLDB (/Users/buildslave/jenkins/workspace/lldb-cmake-reproducers/lldb-build/bin/clang-x86_64) :: test_qRegisterInfo_contains_at_least_one_register_set_llgs (TestLldbGdbServer.LldbGdbServerTestCase) (llgs tests) 
runCmd: settings clear -all
output: 

runCmd: settings set symbols.enable-external-lookup false
output: 

runCmd: settings set target.inherit-tcc true
output: 

runCmd: settings set target.auto-apply-fixits false
output: 

runCmd: settings set plugin.process.gdb-remote.packet-timeout 60
output: 

runCmd: settings set symbols.clang-modules-cache-path "/Users/buildslave/jenkins/workspace/lldb-cmake-reproducers/lldb-build/lldb-test-build.noindex/module-cache-lldb/lldb-api"
output: 

runCmd: settings set use-color false
output: 

runCmd: setting set target.prefer-dynamic-value no-dynamic-values
output: 

UNSUPPORTED: LLDB (/Users/buildslave/jenkins/workspace/lldb-cmake-reproducers/lldb-build/bin/clang-x86_64) :: test_qRegisterInfo_contains_avx_registers_llgs (TestLldbGdbServer.LldbGdbServerTestCase) (llgs tests) 
runCmd: settings clear -all
output: 

runCmd: settings set symbols.enable-external-lookup false
output: 

runCmd: settings set target.inherit-tcc true
output: 

runCmd: settings set target.auto-apply-fixits false
output: 

runCmd: settings set plugin.process.gdb-remote.packet-timeout 60
output: 

runCmd: settings set symbols.clang-modules-cache-path "/Users/buildslave/jenkins/workspace/lldb-cmake-reproducers/lldb-build/lldb-test-build.noindex/module-cache-lldb/lldb-api"
output: 

runCmd: settings set use-color false
output: 

runCmd: setting set target.prefer-dynamic-value no-dynamic-values
output: 

PASS: LLDB (/Users/buildslave/jenkins/workspace/lldb-cmake-reproducers/lldb-build/bin/clang-x86_64) :: test_qRegisterInfo_contains_required_generics_debugserver (TestLldbGdbServer.LldbGdbServerTestCase)
runCmd: settings clear -all
output: 

runCmd: settings set symbols.enable-external-lookup false
output: 

runCmd: settings set target.inherit-tcc true
output: 

runCmd: settings set target.auto-apply-fixits false
output: 

runCmd: settings set plugin.process.gdb-remote.packet-timeout 60
output: 

runCmd: settings set symbols.clang-modules-cache-path "/Users/buildslave/jenkins/workspace/lldb-cmake-reproducers/lldb-build/lldb-test-build.noindex/module-cache-lldb/lldb-api"
output: 

runCmd: settings set use-color false
output: 

runCmd: setting set target.prefer-dynamic-value no-dynamic-values
output: 

UNSUPPORTED: LLDB (/Users/buildslave/jenkins/workspace/lldb-cmake-reproducers/lldb-build/bin/clang-x86_64) :: test_qRegisterInfo_contains_required_generics_llgs (TestLldbGdbServer.LldbGdbServerTestCase) (llgs tests) 
runCmd: settings clear -all
output: 

runCmd: settings set symbols.enable-external-lookup false
output: 

runCmd: settings set target.inherit-tcc true
output: 

runCmd: settings set target.auto-apply-fixits false
output: 

runCmd: settings set plugin.process.gdb-remote.packet-timeout 60
output: 

runCmd: settings set symbols.clang-modules-cache-path "/Users/buildslave/jenkins/workspace/lldb-cmake-reproducers/lldb-build/lldb-test-build.noindex/module-cache-lldb/lldb-api"
output: 

runCmd: settings set use-color false
output: 

runCmd: setting set target.prefer-dynamic-value no-dynamic-values
output: 

PASS: LLDB (/Users/buildslave/jenkins/workspace/lldb-cmake-reproducers/lldb-build/bin/clang-x86_64) :: test_qRegisterInfo_returns_all_valid_results_debugserver (TestLldbGdbServer.LldbGdbServerTestCase)
runCmd: settings clear -all
output: 

runCmd: settings set symbols.enable-external-lookup false
output: 

runCmd: settings set target.inherit-tcc true
output: 

runCmd: settings set target.auto-apply-fixits false
output: 

runCmd: settings set plugin.process.gdb-remote.packet-timeout 60
output: 

runCmd: settings set symbols.clang-modules-cache-path "/Users/buildslave/jenkins/workspace/lldb-cmake-reproducers/lldb-build/lldb-test-build.noindex/module-cache-lldb/lldb-api"
output: 

runCmd: settings set use-color false
output: 

runCmd: setting set target.prefer-dynamic-value no-dynamic-values
output: 

UNSUPPORTED: LLDB (/Users/buildslave/jenkins/workspace/lldb-cmake-reproducers/lldb-build/bin/clang-x86_64) :: test_qRegisterInfo_returns_all_valid_results_llgs (TestLldbGdbServer.LldbGdbServerTestCase) (llgs tests) 
runCmd: settings clear -all
output: 

runCmd: settings set symbols.enable-external-lookup false
output: 

runCmd: settings set target.inherit-tcc true
output: 

runCmd: settings set target.auto-apply-fixits false
output: 

runCmd: settings set plugin.process.gdb-remote.packet-timeout 60
output: 

runCmd: settings set symbols.clang-modules-cache-path "/Users/buildslave/jenkins/workspace/lldb-cmake-reproducers/lldb-build/lldb-test-build.noindex/module-cache-lldb/lldb-api"
output: 

runCmd: settings set use-color false
output: 

runCmd: setting set target.prefer-dynamic-value no-dynamic-values
output: 

PASS: LLDB (/Users/buildslave/jenkins/workspace/lldb-cmake-reproducers/lldb-build/bin/clang-x86_64) :: test_qRegisterInfo_returns_one_valid_result_debugserver (TestLldbGdbServer.LldbGdbServerTestCase)
runCmd: settings clear -all
output: 

runCmd: settings set symbols.enable-external-lookup false
output: 

runCmd: settings set target.inherit-tcc true
output: 

runCmd: settings set target.auto-apply-fixits false
output: 

runCmd: settings set plugin.process.gdb-remote.packet-timeout 60
output: 

runCmd: settings set symbols.clang-modules-cache-path "/Users/buildslave/jenkins/workspace/lldb-cmake-reproducers/lldb-build/lldb-test-build.noindex/module-cache-lldb/lldb-api"
output: 

runCmd: settings set use-color false
output: 

runCmd: setting set target.prefer-dynamic-value no-dynamic-values
output: 

UNSUPPORTED: LLDB (/Users/buildslave/jenkins/workspace/lldb-cmake-reproducers/lldb-build/bin/clang-x86_64) :: test_qRegisterInfo_returns_one_valid_result_llgs (TestLldbGdbServer.LldbGdbServerTestCase) (llgs tests) 
runCmd: settings clear -all
output: 

runCmd: settings set symbols.enable-external-lookup false
output: 

runCmd: settings set target.inherit-tcc true
output: 

runCmd: settings set target.auto-apply-fixits false
output: 

runCmd: settings set plugin.process.gdb-remote.packet-timeout 60
output: 

runCmd: settings set symbols.clang-modules-cache-path "/Users/buildslave/jenkins/workspace/lldb-cmake-reproducers/lldb-build/lldb-test-build.noindex/module-cache-lldb/lldb-api"
output: 

runCmd: settings set use-color false
output: 

runCmd: setting set target.prefer-dynamic-value no-dynamic-values
output: 

PASS: LLDB (/Users/buildslave/jenkins/workspace/lldb-cmake-reproducers/lldb-build/bin/clang-x86_64) :: test_qSupported_returns_known_stub_features_debugserver (TestLldbGdbServer.LldbGdbServerTestCase)
runCmd: settings clear -all
output: 

runCmd: settings set symbols.enable-external-lookup false
output: 

runCmd: settings set target.inherit-tcc true
output: 

runCmd: settings set target.auto-apply-fixits false
output: 

runCmd: settings set plugin.process.gdb-remote.packet-timeout 60
output: 

runCmd: settings set symbols.clang-modules-cache-path "/Users/buildslave/jenkins/workspace/lldb-cmake-reproducers/lldb-build/lldb-test-build.noindex/module-cache-lldb/lldb-api"
output: 

runCmd: settings set use-color false
output: 

runCmd: setting set target.prefer-dynamic-value no-dynamic-values
output: 

UNSUPPORTED: LLDB (/Users/buildslave/jenkins/workspace/lldb-cmake-reproducers/lldb-build/bin/clang-x86_64) :: test_qSupported_returns_known_stub_features_llgs (TestLldbGdbServer.LldbGdbServerTestCase) (llgs tests) 
runCmd: settings clear -all
output: 

runCmd: settings set symbols.enable-external-lookup false
output: 

runCmd: settings set target.inherit-tcc true
output: 

runCmd: settings set target.auto-apply-fixits false
output: 

runCmd: settings set plugin.process.gdb-remote.packet-timeout 60
output: 

runCmd: settings set symbols.clang-modules-cache-path "/Users/buildslave/jenkins/workspace/lldb-cmake-reproducers/lldb-build/lldb-test-build.noindex/module-cache-lldb/lldb-api"
output: 

runCmd: settings set use-color false
output: 

runCmd: setting set target.prefer-dynamic-value no-dynamic-values
output: 

PASS: LLDB (/Users/buildslave/jenkins/workspace/lldb-cmake-reproducers/lldb-build/bin/clang-x86_64) :: test_qThreadInfo_contains_thread_attach_debugserver (TestLldbGdbServer.LldbGdbServerTestCase)
runCmd: settings clear -all
output: 

runCmd: settings set symbols.enable-external-lookup false
output: 

runCmd: settings set target.inherit-tcc true
output: 

runCmd: settings set target.auto-apply-fixits false
output: 

runCmd: settings set plugin.process.gdb-remote.packet-timeout 60
output: 

runCmd: settings set symbols.clang-modules-cache-path "/Users/buildslave/jenkins/workspace/lldb-cmake-reproducers/lldb-build/lldb-test-build.noindex/module-cache-lldb/lldb-api"
output: 

runCmd: settings set use-color false
output: 

runCmd: setting set target.prefer-dynamic-value no-dynamic-values
output: 

UNSUPPORTED: LLDB (/Users/buildslave/jenkins/workspace/lldb-cmake-reproducers/lldb-build/bin/clang-x86_64) :: test_qThreadInfo_contains_thread_attach_llgs (TestLldbGdbServer.LldbGdbServerTestCase) (llgs tests) 
runCmd: settings clear -all
output: 

runCmd: settings set symbols.enable-external-lookup false
output: 

runCmd: settings set target.inherit-tcc true
output: 

runCmd: settings set target.auto-apply-fixits false
output: 

runCmd: settings set plugin.process.gdb-remote.packet-timeout 60
output: 

runCmd: settings set symbols.clang-modules-cache-path "/Users/buildslave/jenkins/workspace/lldb-cmake-reproducers/lldb-build/lldb-test-build.noindex/module-cache-lldb/lldb-api"
output: 

runCmd: settings set use-color false
output: 

runCmd: setting set target.prefer-dynamic-value no-dynamic-values
output: 

PASS: LLDB (/Users/buildslave/jenkins/workspace/lldb-cmake-reproducers/lldb-build/bin/clang-x86_64) :: test_qThreadInfo_contains_thread_launch_debugserver (TestLldbGdbServer.LldbGdbServerTestCase)
runCmd: settings clear -all
output: 

runCmd: settings set symbols.enable-external-lookup false
output: 

runCmd: settings set target.inherit-tcc true
output: 

runCmd: settings set target.auto-apply-fixits false
output: 

runCmd: settings set plugin.process.gdb-remote.packet-timeout 60
output: 

runCmd: settings set symbols.clang-modules-cache-path "/Users/buildslave/jenkins/workspace/lldb-cmake-reproducers/lldb-build/lldb-test-build.noindex/module-cache-lldb/lldb-api"
output: 

runCmd: settings set use-color false
output: 

runCmd: setting set target.prefer-dynamic-value no-dynamic-values
output: 

UNSUPPORTED: LLDB (/Users/buildslave/jenkins/workspace/lldb-cmake-reproducers/lldb-build/bin/clang-x86_64) :: test_qThreadInfo_contains_thread_launch_llgs (TestLldbGdbServer.LldbGdbServerTestCase) (llgs tests) 
runCmd: settings clear -all
output: 

runCmd: settings set symbols.enable-external-lookup false
output: 

runCmd: settings set target.inherit-tcc true
output: 

runCmd: settings set target.auto-apply-fixits false
output: 

runCmd: settings set plugin.process.gdb-remote.packet-timeout 60
output: 

runCmd: settings set symbols.clang-modules-cache-path "/Users/buildslave/jenkins/workspace/lldb-cmake-reproducers/lldb-build/lldb-test-build.noindex/module-cache-lldb/lldb-api"
output: 

runCmd: settings set use-color false
output: 

runCmd: setting set target.prefer-dynamic-value no-dynamic-values
output: 

PASS: LLDB (/Users/buildslave/jenkins/workspace/lldb-cmake-reproducers/lldb-build/bin/clang-x86_64) :: test_qThreadInfo_matches_qC_attach_debugserver (TestLldbGdbServer.LldbGdbServerTestCase)
runCmd: settings clear -all
output: 

runCmd: settings set symbols.enable-external-lookup false
output: 

runCmd: settings set target.inherit-tcc true
output: 

runCmd: settings set target.auto-apply-fixits false
output: 

runCmd: settings set plugin.process.gdb-remote.packet-timeout 60
output: 

runCmd: settings set symbols.clang-modules-cache-path "/Users/buildslave/jenkins/workspace/lldb-cmake-reproducers/lldb-build/lldb-test-build.noindex/module-cache-lldb/lldb-api"
output: 

runCmd: settings set use-color false
output: 

runCmd: setting set target.prefer-dynamic-value no-dynamic-values
output: 

UNSUPPORTED: LLDB (/Users/buildslave/jenkins/workspace/lldb-cmake-reproducers/lldb-build/bin/clang-x86_64) :: test_qThreadInfo_matches_qC_attach_llgs (TestLldbGdbServer.LldbGdbServerTestCase) (llgs tests) 
runCmd: settings clear -all
output: 

runCmd: settings set symbols.enable-external-lookup false
output: 

runCmd: settings set target.inherit-tcc true
output: 

runCmd: settings set target.auto-apply-fixits false
output: 

runCmd: settings set plugin.process.gdb-remote.packet-timeout 60
output: 

runCmd: settings set symbols.clang-modules-cache-path "/Users/buildslave/jenkins/workspace/lldb-cmake-reproducers/lldb-build/lldb-test-build.noindex/module-cache-lldb/lldb-api"
output: 

runCmd: settings set use-color false
output: 

runCmd: setting set target.prefer-dynamic-value no-dynamic-values
output: 

PASS: LLDB (/Users/buildslave/jenkins/workspace/lldb-cmake-reproducers/lldb-build/bin/clang-x86_64) :: test_qThreadInfo_matches_qC_launch_debugserver (TestLldbGdbServer.LldbGdbServerTestCase)
runCmd: settings clear -all
output: 

runCmd: settings set symbols.enable-external-lookup false
output: 

runCmd: settings set target.inherit-tcc true
output: 

runCmd: settings set target.auto-apply-fixits false
output: 

runCmd: settings set plugin.process.gdb-remote.packet-timeout 60
output: 

runCmd: settings set symbols.clang-modules-cache-path "/Users/buildslave/jenkins/workspace/lldb-cmake-reproducers/lldb-build/lldb-test-build.noindex/module-cache-lldb/lldb-api"
output: 

runCmd: settings set use-color false
output: 

runCmd: setting set target.prefer-dynamic-value no-dynamic-values
output: 

UNSUPPORTED: LLDB (/Users/buildslave/jenkins/workspace/lldb-cmake-reproducers/lldb-build/bin/clang-x86_64) :: test_qThreadInfo_matches_qC_launch_llgs (TestLldbGdbServer.LldbGdbServerTestCase) (llgs tests) 
runCmd: settings clear -all
output: 

runCmd: settings set symbols.enable-external-lookup false
output: 

runCmd: settings set target.inherit-tcc true
output: 

runCmd: settings set target.auto-apply-fixits false
output: 

runCmd: settings set plugin.process.gdb-remote.packet-timeout 60
output: 

runCmd: settings set symbols.clang-modules-cache-path "/Users/buildslave/jenkins/workspace/lldb-cmake-reproducers/lldb-build/lldb-test-build.noindex/module-cache-lldb/lldb-api"
output: 

runCmd: settings set use-color false
output: 

runCmd: setting set target.prefer-dynamic-value no-dynamic-values
output: 

PASS: LLDB (/Users/buildslave/jenkins/workspace/lldb-cmake-reproducers/lldb-build/bin/clang-x86_64) :: test_software_breakpoint_set_and_remove_work_debugserver (TestLldbGdbServer.LldbGdbServerTestCase)
runCmd: settings clear -all
output: 

runCmd: settings set symbols.enable-external-lookup false
output: 

runCmd: settings set target.inherit-tcc true
output: 

runCmd: settings set target.auto-apply-fixits false
output: 

runCmd: settings set plugin.process.gdb-remote.packet-timeout 60
output: 

runCmd: settings set symbols.clang-modules-cache-path "/Users/buildslave/jenkins/workspace/lldb-cmake-reproducers/lldb-build/lldb-test-build.noindex/module-cache-lldb/lldb-api"
output: 

runCmd: settings set use-color false
output: 

runCmd: setting set target.prefer-dynamic-value no-dynamic-values
output: 

UNSUPPORTED: LLDB (/Users/buildslave/jenkins/workspace/lldb-cmake-reproducers/lldb-build/bin/clang-x86_64) :: test_software_breakpoint_set_and_remove_work_llgs (TestLldbGdbServer.LldbGdbServerTestCase) (llgs tests) 
runCmd: settings clear -all
output: 

runCmd: settings set symbols.enable-external-lookup false
output: 

runCmd: settings set target.inherit-tcc true
output: 

runCmd: settings set target.auto-apply-fixits false
output: 

runCmd: settings set plugin.process.gdb-remote.packet-timeout 60
output: 

runCmd: settings set symbols.clang-modules-cache-path "/Users/buildslave/jenkins/workspace/lldb-cmake-reproducers/lldb-build/lldb-test-build.noindex/module-cache-lldb/lldb-api"
output: 

runCmd: settings set use-color false
output: 

runCmd: setting set target.prefer-dynamic-value no-dynamic-values
output: 

PASS: LLDB (/Users/buildslave/jenkins/workspace/lldb-cmake-reproducers/lldb-build/bin/clang-x86_64) :: test_start_no_ack_mode_debugserver (TestLldbGdbServer.LldbGdbServerTestCase)
runCmd: settings clear -all
output: 

runCmd: settings set symbols.enable-external-lookup false
output: 

runCmd: settings set target.inherit-tcc true
output: 

runCmd: settings set target.auto-apply-fixits false
output: 

runCmd: settings set plugin.process.gdb-remote.packet-timeout 60
output: 

runCmd: settings set symbols.clang-modules-cache-path "/Users/buildslave/jenkins/workspace/lldb-cmake-reproducers/lldb-build/lldb-test-build.noindex/module-cache-lldb/lldb-api"
output: 

runCmd: settings set use-color false
output: 

runCmd: setting set target.prefer-dynamic-value no-dynamic-values
output: 

UNSUPPORTED: LLDB (/Users/buildslave/jenkins/workspace/lldb-cmake-reproducers/lldb-build/bin/clang-x86_64) :: test_start_no_ack_mode_llgs (TestLldbGdbServer.LldbGdbServerTestCase) (llgs tests) 
runCmd: settings clear -all
output: 

runCmd: settings set symbols.enable-external-lookup false
output: 

runCmd: settings set target.inherit-tcc true
output: 

runCmd: settings set target.auto-apply-fixits false
output: 

runCmd: settings set plugin.process.gdb-remote.packet-timeout 60
output: 

runCmd: settings set symbols.clang-modules-cache-path "/Users/buildslave/jenkins/workspace/lldb-cmake-reproducers/lldb-build/lldb-test-build.noindex/module-cache-lldb/lldb-api"
output: 

runCmd: settings set use-color false
output: 

runCmd: setting set target.prefer-dynamic-value no-dynamic-values
output: 

PASS: LLDB (/Users/buildslave/jenkins/workspace/lldb-cmake-reproducers/lldb-build/bin/clang-x86_64) :: test_thread_suffix_supported_debugserver (TestLldbGdbServer.LldbGdbServerTestCase)
runCmd: settings clear -all
output: 

runCmd: settings set symbols.enable-external-lookup false
output: 

runCmd: settings set target.inherit-tcc true
output: 

runCmd: settings set target.auto-apply-fixits false
output: 

runCmd: settings set plugin.process.gdb-remote.packet-timeout 60
output: 

runCmd: settings set symbols.clang-modules-cache-path "/Users/buildslave/jenkins/workspace/lldb-cmake-reproducers/lldb-build/lldb-test-build.noindex/module-cache-lldb/lldb-api"
output: 

runCmd: settings set use-color false
output: 

runCmd: setting set target.prefer-dynamic-value no-dynamic-values
output: 

UNSUPPORTED: LLDB (/Users/buildslave/jenkins/workspace/lldb-cmake-reproducers/lldb-build/bin/clang-x86_64) :: test_thread_suffix_supported_llgs (TestLldbGdbServer.LldbGdbServerTestCase) (llgs tests) 
runCmd: settings clear -all
output: 

runCmd: settings set symbols.enable-external-lookup false
output: 

runCmd: settings set target.inherit-tcc true
output: 

runCmd: settings set target.auto-apply-fixits false
output: 

runCmd: settings set plugin.process.gdb-remote.packet-timeout 60
output: 

runCmd: settings set symbols.clang-modules-cache-path "/Users/buildslave/jenkins/workspace/lldb-cmake-reproducers/lldb-build/lldb-test-build.noindex/module-cache-lldb/lldb-api"
output: 

runCmd: settings set use-color false
output: 

runCmd: setting set target.prefer-dynamic-value no-dynamic-values
output: 

PASS: LLDB (/Users/buildslave/jenkins/workspace/lldb-cmake-reproducers/lldb-build/bin/clang-x86_64) :: test_written_M_content_reads_back_correctly_debugserver (TestLldbGdbServer.LldbGdbServerTestCase)
runCmd: settings clear -all
output: 

runCmd: settings set symbols.enable-external-lookup false
output: 

runCmd: settings set target.inherit-tcc true
output: 

runCmd: settings set target.auto-apply-fixits false
output: 

runCmd: settings set plugin.process.gdb-remote.packet-timeout 60
output: 

runCmd: settings set symbols.clang-modules-cache-path "/Users/buildslave/jenkins/workspace/lldb-cmake-reproducers/lldb-build/lldb-test-build.noindex/module-cache-lldb/lldb-api"
output: 

runCmd: settings set use-color false
output: 

runCmd: setting set target.prefer-dynamic-value no-dynamic-values
output: 

UNSUPPORTED: LLDB (/Users/buildslave/jenkins/workspace/lldb-cmake-reproducers/lldb-build/bin/clang-x86_64) :: test_written_M_content_reads_back_correctly_llgs (TestLldbGdbServer.LldbGdbServerTestCase) (llgs tests) 
Restore dir to: /Users/buildslave/jenkins/workspace/lldb-cmake-reproducers/lldb-build/tools/lldb/test
======================================================================
ERROR: test_Hg_switches_to_3_threads_launch_debugserver (TestLldbGdbServer.LldbGdbServerTestCase)
----------------------------------------------------------------------
Traceback (most recent call last):
  File "/Users/buildslave/jenkins/workspace/lldb-cmake-reproducers/llvm-project/lldb/packages/Python/lldbsuite/test/decorators.py", line 136, in wrapper
    return func(*args, **kwargs)
  File "/Users/buildslave/jenkins/workspace/lldb-cmake-reproducers/llvm-project/lldb/test/API/tools/lldb-server/TestLldbGdbServer.py", line 675, in test_Hg_switches_to_3_threads_launch_debugserver
    self.Hg_switches_to_3_threads()
  File "/Users/buildslave/jenkins/workspace/lldb-cmake-reproducers/llvm-project/lldb/test/API/tools/lldb-server/TestLldbGdbServer.py", line 648, in Hg_switches_to_3_threads
    threads = self.wait_for_thread_count(3)
  File "/Users/buildslave/jenkins/workspace/lldb-cmake-reproducers/llvm-project/lldb/packages/Python/lldbsuite/test/tools/lldb-server/gdbremote_testcase.py", line 806, in wait_for_thread_count
    self.DEFAULT_TIMEOUT, thread_count, actual_thread_count))
Exception: timed out after 10 seconds while waiting for theads: waiting for at least 3 threads, found 1
Config=x86_64-/Users/buildslave/jenkins/workspace/lldb-cmake-reproducers/lldb-build/bin/clang
----------------------------------------------------------------------
Ran 65 tests in 140.056s

RESULT: FAILED (29 passes, 0 failures, 1 errors, 34 skipped, 1 expected failures, 0 unexpected successes)

--