FailedConsole Output

Skipping 8,045 KB.. Full Log
(698 of 2121)
PASS: lldb-unit :: Utility/./UtilityTests/ConstStringTest.CompareStringRef (699 of 2121)
PASS: lldb-shell :: SymbolFile/DWARF/debug-types-basic.test (700 of 2121)
PASS: lldb-shell :: ObjectFile/PECOFF/basic-info-arm64.yaml (701 of 2121)
PASS: lldb-unit :: Utility/./UtilityTests/ArgsTest.TestSingleArg (702 of 2121)
PASS: lldb-api :: functionalities/testid/TestTestId.py (703 of 2121)
PASS: lldb-api :: api/command-return-object/TestSBCommandReturnObject.py (704 of 2121)
PASS: lldb-unit :: Utility/./UtilityTests/ReproducerTest.SetCapture (705 of 2121)
PASS: lldb-unit :: Utility/./UtilityTests/RangeDataVector.CustomSort (706 of 2121)
PASS: lldb-api :: functionalities/breakpoint/global_constructor/TestBreakpointInGlobalConstructor.py (707 of 2121)
PASS: lldb-shell :: ObjectFile/ELF/PT_LOAD-overlap-PT_TLS.yaml (708 of 2121)
PASS: lldb-unit :: UnwindAssembly/x86/./UnwindAssemblyx86Tests/Testx86AssemblyInspectionEngine.TestPushR14 (709 of 2121)
PASS: lldb-unit :: ScriptInterpreter/Python/./ScriptInterpreterPythonTests/PythonDataObjectsTest.TestExtractingUInt64ThroughStructuredData (710 of 2121)
PASS: lldb-shell :: SymbolFile/DWARF/DW_AT_declaration-with-children.s (711 of 2121)
PASS: lldb-api :: functionalities/data-formatter/data-formatter-objc/TestDataFormatterObjCPlain.py (712 of 2121)
PASS: lldb-api :: functionalities/data-formatter/data-formatter-stl/libcxx/set/TestDataFormatterLibcxxSet.py (713 of 2121)
PASS: lldb-shell :: Reproducer/TestRelativePath.test (714 of 2121)
PASS: lldb-api :: lang/cpp/virtual-functions/TestCppVirtualFunctions.py (715 of 2121)
PASS: lldb-api :: tools/lldb-vscode/stackTrace/TestVSCode_stackTrace.py (716 of 2121)
PASS: lldb-api :: lang/objc/objc-struct-return/TestObjCStructReturn.py (717 of 2121)
PASS: lldb-unit :: UnwindAssembly/ARM64/./Arm64InstEmulationTests/TestArm64InstEmulation.TestRegisterDoubleSpills (718 of 2121)
PASS: lldb-unit :: Process/minidump/./LLDBMinidumpTests/MinidumpParserTest.GetMemoryRegionInfoFromMemory64List (719 of 2121)
PASS: lldb-unit :: Core/./LLDBCoreTests/RichManglingContextTest.FromCxxMethodName (720 of 2121)
PASS: lldb-api :: lang/cpp/operators/TestCppOperators.py (721 of 2121)
PASS: lldb-unit :: Utility/./UtilityTests/OptionsWithRawTest.WhitespaceInput (722 of 2121)
PASS: lldb-unit :: SymbolFile/DWARF/./SymbolFileDWARFTests/SymbolFileDWARFTests.TestAbbrevOrder1Start1 (723 of 2121)
PASS: lldb-unit :: Utility/./UtilityTests/StreamTest.PutULEB128 (724 of 2121)
PASS: lldb-api :: functionalities/data-formatter/data-formatter-objc/TestDataFormatterObjCNSContainer.py (725 of 2121)
PASS: lldb-shell :: ScriptInterpreter/Python/eof.test (726 of 2121)
PASS: lldb-unit :: debugserver/./debugserverTests/JSON.Parse (727 of 2121)
PASS: lldb-unit :: Signals/./SignalsTests/UnixSignalsTest.VersionChange (728 of 2121)
PASS: lldb-unit :: Utility/./UtilityTests/BinaryStreamTest.PutSLEB128FiveBytes (729 of 2121)
PASS: lldb-api :: commands/target/stop-hooks/TestStopHooks.py (730 of 2121)
PASS: lldb-shell :: ObjectFile/ELF/section-addresses.yaml (731 of 2121)
PASS: lldb-unit :: Utility/./UtilityTests/StringExtractorTest.DecodeHexU8_InvalidHex (732 of 2121)
PASS: lldb-unit :: Process/minidump/./LLDBMinidumpTests/MinidumpParserTest.GetLinuxProcStatus_no_stream (733 of 2121)
PASS: lldb-unit :: Signals/./SignalsTests/UnixSignalsTest.GetFilteredSignals (734 of 2121)
PASS: lldb-api :: python_api/frame/TestFrames.py (735 of 2121)
UNSUPPORTED: lldb-api :: functionalities/process_save_core/TestProcessSaveCore.py (736 of 2121)
PASS: lldb-unit :: Utility/./UtilityTests/StringExtractorTest.DecodeHexU8_InvalidHex2 (737 of 2121)
PASS: lldb-api :: lang/cpp/lambdas/TestLambdas.py (738 of 2121)
PASS: lldb-api :: functionalities/data-formatter/data-formatter-stl/libstdcpp/unique_ptr/invalid/TestDataFormatterInvalidStdUniquePtr.py (739 of 2121)
PASS: lldb-shell :: ObjectFile/PECOFF/uuid.yaml (740 of 2121)
PASS: lldb-unit :: Utility/./UtilityTests/StringListTest.SplitIntoLines (741 of 2121)
PASS: lldb-unit :: Utility/./UtilityTests/SerializationRountripTest.SerializeDeserializeCStringArrayNullptr (742 of 2121)
PASS: lldb-unit :: debugserver/./debugserverTests/RNBSocket.LoopBackListenIPv6 (743 of 2121)
PASS: lldb-unit :: UnwindAssembly/ARM64/./Arm64InstEmulationTests/TestArm64InstEmulation.TestRegisterSavedTwice (744 of 2121)
PASS: lldb-api :: functionalities/tail_call_frames/ambiguous_tail_call_seq1/TestAmbiguousTailCallSeq1.py (745 of 2121)
PASS: lldb-api :: commands/expression/rdar42038760/TestScalarURem.py (746 of 2121)
PASS: lldb-api :: commands/target/stop-hook/delete/TestTargetStopHookDelete.py (747 of 2121)
PASS: lldb-api :: functionalities/conditional_break/TestConditionalBreak.py (748 of 2121)
PASS: lldb-api :: commands/expression/xvalue/TestXValuePrinting.py (749 of 2121)
PASS: lldb-api :: functionalities/memory/cache/TestMemoryCache.py (750 of 2121)
PASS: lldb-unit :: Platform/Android/./AdbClientTests/AdbClientTest.CreateByDeviceId_ByEnvVar (751 of 2121)
PASS: lldb-api :: functionalities/gdb_remote_client/TestGDBRemoteLoad.py (752 of 2121)
PASS: lldb-unit :: Utility/./UtilityTests/StreamTest.PutBytesAsRawHex8ToMixedEndian (753 of 2121)
PASS: lldb-api :: commands/expression/import_base_class_when_class_has_derived_member/TestImportBaseClassWhenClassHasDerivedMember.py (754 of 2121)
UNSUPPORTED: lldb-api :: macosx/macCatalystAppMacOSFramework/TestMacCatalystAppWithMacOSFramework.py (755 of 2121)
PASS: lldb-api :: python_api/lldbutil/frame/TestFrameUtils.py (756 of 2121)
UNSUPPORTED: lldb-api :: functionalities/data-formatter/data-formatter-stl/libstdcpp/list/TestDataFormatterStdList.py (757 of 2121)
PASS: lldb-api :: commands/breakpoint/command/list/TestBreakpointCommandList.py (758 of 2121)
UNSUPPORTED: lldb-shell :: SymbolFile/DWARF/debug-types-expressions.test (759 of 2121)
PASS: lldb-unit :: Process/minidump/./LLDBMinidumpTests/MinidumpParserTest.GetThreadContext_x86_32 (760 of 2121)
PASS: lldb-unit :: SymbolFile/NativePDB/./SymbolFileNativePDBTests/PDBFPOProgramToDWARFExpressionTests.InvalidAssignmentMultiple (761 of 2121)
PASS: lldb-api :: tools/lldb-server/TestGdbRemoteKill.py (762 of 2121)
PASS: lldb-unit :: Utility/./UtilityTests/StringListTest.DefaultConstructor (763 of 2121)
PASS: lldb-shell :: ObjectFile/ELF/minidebuginfo-find-symbols.yaml (764 of 2121)
PASS: lldb-api :: lang/c/shared_lib/TestSharedLib.py (765 of 2121)
PASS: lldb-api :: lang/objc/objc-ivar-stripped/TestObjCIvarStripped.py (766 of 2121)
PASS: lldb-unit :: Utility/./UtilityTests/StatusTest.Formatv (767 of 2121)
PASS: lldb-shell :: SymbolFile/NativePDB/ast-types.cpp (768 of 2121)
PASS: lldb-unit :: Expression/./ExpressionTests/CppModuleConfigurationTest.MissingLibCpp (769 of 2121)
PASS: lldb-unit :: Process/minidump/./LLDBMinidumpTests/MinidumpParserTest.GetMemoryRegionInfoLinuxMaps (770 of 2121)
PASS: lldb-shell :: SymbolFile/DWARF/dir-separator-windows.s (771 of 2121)
PASS: lldb-api :: commands/expression/timeout/TestCallWithTimeout.py (772 of 2121)
PASS: lldb-shell :: Minidump/fb-dump.test (773 of 2121)
PASS: lldb-api :: commands/expression/context-object/TestContextObject.py (774 of 2121)
PASS: lldb-unit :: Utility/./UtilityTests/BinaryStreamTest.PutSLEB128One (775 of 2121)
PASS: lldb-shell :: Minidump/disassemble-no-module.yaml (776 of 2121)
PASS: lldb-unit :: DataFormatter/./LLDBFormatterTests/StringPrinterTests.SwiftUTF8 (777 of 2121)
PASS: lldb-unit :: Utility/./UtilityTests/TildeExpressionResolver.ResolveFullPath (778 of 2121)
PASS: lldb-shell :: SymbolFile/NativePDB/nested-types.cpp (779 of 2121)
PASS: lldb-unit :: Utility/./UtilityTests/AnsiTerminal.Incomplete (780 of 2121)
UNSUPPORTED: lldb-api :: linux/sepdebugsymlink/TestTargetSymbolsSepDebugSymlink.py (781 of 2121)
PASS: lldb-api :: tools/lldb-server/inferior-crash/TestGdbRemoteSegFault.py (782 of 2121)
PASS: lldb-api :: macosx/find-dsym/bundle-with-dot-in-filename/TestBundleWithDotInFilename.py (783 of 2121)
PASS: lldb-api :: commands/register/register/register_command/TestRegisters.py (784 of 2121)
PASS: lldb-unit :: Utility/./UtilityTests/BinaryStreamTest.PutSLEB128MaxValue (785 of 2121)
PASS: lldb-unit :: Language/Highlighting/./HighlighterTests/HighlighterTest.HighlighterSelectionType (786 of 2121)
PASS: lldb-shell :: SymbolFile/Breakpad/symtab.test (787 of 2121)
PASS: lldb-api :: functionalities/postmortem/elf-core/thread_crash/TestLinuxCoreThreads.py (788 of 2121)
PASS: lldb-unit :: Thread/./ThreadTests/ThreadTest.GetPrivateStopInfo (789 of 2121)
PASS: lldb-shell :: Breakpoint/split-dwarf5-debug-stroffsets.test (790 of 2121)
PASS: lldb-api :: lang/objc/objc-ivar-offsets/TestObjCIvarOffsets.py (791 of 2121)
PASS: lldb-api :: functionalities/postmortem/minidump-new/TestMiniDumpUUID.py (792 of 2121)
PASS: lldb-api :: commands/target/stop-hook/enable/TestTargetStopHookEnable.py (793 of 2121)
PASS: lldb-api :: lang/c/local_types/TestUseClosestType.py (794 of 2121)
PASS: lldb-shell :: Settings/TestDisassemblyFormat.test (795 of 2121)
PASS: lldb-unit :: Symbol/./SymbolTests/TestTypeSystemClang.TestGetTypeClassNested (796 of 2121)
PASS: lldb-api :: commands/expression/persistent_types/TestPersistentTypes.py (797 of 2121)
PASS: lldb-unit :: Utility/./UtilityTests/DataExtractorTest.GetCStrAtNullOffset (798 of 2121)
PASS: lldb-api :: python_api/interpreter/TestRunCommandInterpreterAPI.py (799 of 2121)
PASS: lldb-api :: functionalities/breakpoint/address_breakpoints/TestAddressBreakpoints.py (800 of 2121)
PASS: lldb-api :: python_api/watchpoint/condition/TestWatchpointConditionAPI.py (801 of 2121)
PASS: lldb-api :: python_api/watchpoint/watchlocation/TestSetWatchlocation.py (802 of 2121)
PASS: lldb-unit :: Utility/./UtilityTests/UriParserTest.BracketedHostname (803 of 2121)
PASS: lldb-unit :: Utility/./UtilityTests/ArgsTest.TestUnknownEscape (804 of 2121)
UNSUPPORTED: lldb-shell :: SymbolFile/PDB/class-layout.test (805 of 2121)
PASS: lldb-api :: functionalities/pre_run_dylibs/TestPreRunDylibs.py (806 of 2121)
PASS: lldb-shell :: SymbolFile/NativePDB/tag-types.cpp (807 of 2121)
UNSUPPORTED: lldb-api :: functionalities/thread/state/TestThreadStates.py (808 of 2121)
PASS: lldb-api :: functionalities/dlopen_other_executable/TestDlopenOtherExecutable.py (809 of 2121)
PASS: lldb-api :: commands/add-dsym/uuid/TestAddDsymCommand.py (810 of 2121)
PASS: lldb-unit :: Host/./HostTests/ProcessLaunchInfoTest.Constructor (811 of 2121)
PASS: lldb-unit :: Language/Highlighting/./HighlighterTests/HighlighterTest.ClangTrailingBackslashWithWhitespace (812 of 2121)
PASS: lldb-unit :: Expression/./ExpressionTests/DWARFExpression.DW_OP_pick (813 of 2121)
PASS: lldb-unit :: Process/./ProcessEventDataTests/ProcessEventDataTest.ShouldStop (814 of 2121)
PASS: lldb-api :: functionalities/float-display/TestFloatDisplay.py (815 of 2121)
PASS: lldb-shell :: Process/TestEnvironment.test (816 of 2121)
PASS: lldb-unit :: Expression/./ExpressionTests/CppModuleConfigurationTest.LibCppV2 (817 of 2121)
PASS: lldb-unit :: Process/minidump/./LLDBMinidumpTests/MinidumpParserTest.FindMemoryRange (818 of 2121)
PASS: lldb-unit :: Utility/./UtilityTests/BinaryStreamTest.PutULEB128SevenBytes (819 of 2121)
PASS: lldb-api :: types/TestShortTypeExpr.py (820 of 2121)
PASS: lldb-unit :: UnwindAssembly/x86/./UnwindAssemblyx86Tests/Testx86AssemblyInspectionEngine.TestPushExtended (821 of 2121)
UNSUPPORTED: lldb-shell :: SymbolFile/PDB/type-quals.test (822 of 2121)
PASS: lldb-api :: functionalities/data-formatter/format-propagation/TestFormatPropagation.py (823 of 2121)
PASS: lldb-api :: commands/expression/multiline-navigation/TestMultilineNavigation.py (824 of 2121)
PASS: lldb-unit :: Language/Highlighting/./HighlighterTests/HighlighterTest.ClangCursorPosAfterOtherToken (825 of 2121)
PASS: lldb-api :: lang/objc/print-obj/TestPrintObj.py (826 of 2121)
PASS: lldb-unit :: Utility/./UtilityTests/RangeDataVector.FindEntryIndexesThatContain (827 of 2121)
PASS: lldb-unit :: Utility/./UtilityTests/BinaryStreamTest.PutSLEB128Zero (828 of 2121)
PASS: lldb-unit :: Process/minidump/./LLDBMinidumpTests/MinidumpParserTest.MinidumpModuleOrder (829 of 2121)
PASS: lldb-unit :: ObjectFile/ELF/./ObjectFileELFTests/ObjectFileELFTest.GetSymtab_NoSymEntryPointArmAddressClass (830 of 2121)
PASS: lldb-unit :: Interpreter/./InterpreterTests/CompletionTest.DirCompletionAbsolute (831 of 2121)
PASS: lldb-unit :: Utility/./UtilityTests/RangeTest.SetRangeBase (832 of 2121)
PASS: lldb-api :: functionalities/data-formatter/data-formatter-named-summaries/TestDataFormatterNamedSummaries.py (833 of 2121)
PASS: lldb-api :: functionalities/thread/concurrent_events/TestConcurrentSignalDelayWatch.py (834 of 2121)
PASS: lldb-api :: tools/lldb-server/TestAppleSimulatorOSType.py (835 of 2121)
PASS: lldb-api :: python_api/name_lookup/TestNameLookup.py (836 of 2121)
PASS: lldb-api :: functionalities/data-formatter/data-formatter-synthval/TestDataFormatterSynthVal.py (837 of 2121)
PASS: lldb-api :: terminal/TestEditline.py (838 of 2121)
XFAIL: lldb-shell :: SymbolFile/DWARF/find-type-in-function.cpp (839 of 2121)
PASS: lldb-unit :: Process/gdb-remote/./ProcessGdbRemoteTests/GDBRemoteCommunicationClientTest.WriteRegister (840 of 2121)
PASS: lldb-api :: tools/lldb-server/TestGdbRemoteAttach.py (841 of 2121)
PASS: lldb-shell :: Reproducer/TestVersionCheck.test (842 of 2121)
UNSUPPORTED: lldb-shell :: ScriptInterpreter/Lua/nested_sessions.test (843 of 2121)
PASS: lldb-shell :: Watchpoint/SetErrorCases.test (844 of 2121)
UNSUPPORTED: lldb-api :: functionalities/darwin_log/source/info/TestDarwinLogSourceInfo.py (845 of 2121)
PASS: lldb-api :: functionalities/postmortem/wow64_minidump/TestWow64MiniDump.py (846 of 2121)
PASS: lldb-api :: functionalities/tsan/multiple/TestTsanMultiple.py (847 of 2121)
PASS: lldb-shell :: SymbolFile/DWARF/static_scope.s (848 of 2121)
PASS: lldb-api :: commands/expression/entry-bp/TestExprEntryBP.py (849 of 2121)
PASS: lldb-api :: functionalities/data-formatter/user-format-vs-summary/TestUserFormatVsSummary.py (850 of 2121)
PASS: lldb-unit :: Utility/./UtilityTests/StringListTest.LongestCommonPrefixSingleElement (851 of 2121)
PASS: lldb-unit :: Utility/./UtilityTests/VMRange.Reset (852 of 2121)
PASS: lldb-unit :: Utility/./UtilityTests/ProcessInstanceInfo.DumpTable_invalidUID (853 of 2121)
PASS: lldb-shell :: Expr/TestIRMemoryMap.test (854 of 2121)
PASS: lldb-unit :: Process/minidump/./LLDBMinidumpTests/MinidumpParserTest.GetArchitecture (855 of 2121)
UNSUPPORTED: lldb-shell :: ScriptInterpreter/Lua/quit.test (856 of 2121)
PASS: lldb-unit :: Utility/./UtilityTests/ScalarTest.GetBytes (857 of 2121)
PASS: lldb-unit :: Utility/./UtilityTests/RecordReplayTest.InstrumentedBarPtr (858 of 2121)
PASS: lldb-unit :: DataFormatter/./LLDBFormatterTests/TypeMatcherTests.GetMatchStringRegex (859 of 2121)
PASS: lldb-api :: commands/disassemble/basic/TestFrameDisassemble.py (860 of 2121)
UNSUPPORTED: lldb-shell :: Register/x86-gp-read.test (861 of 2121)
PASS: lldb-unit :: Process/gdb-remote/./ProcessGdbRemoteTests/GDBRemoteCommunicationClientTest.SendGetMetaDataPacket (862 of 2121)
PASS: lldb-api :: commands/expression/ignore-artificial-constructors/TestIgnoreArtificialConstructors.py (863 of 2121)
PASS: lldb-api :: lang/c/stepping/TestThreadStepping.py (864 of 2121)
PASS: lldb-unit :: Utility/./UtilityTests/StringListTest.SetSize (865 of 2121)
PASS: lldb-unit :: Core/./LLDBCoreTests/RichManglingContextTest.Basic (866 of 2121)
PASS: lldb-api :: lang/objc/foundation/TestObjCMethods.py (867 of 2121)
PASS: lldb-unit :: Utility/./UtilityTests/DataExtractorTest.GetCStrUnterminated (868 of 2121)
PASS: lldb-api :: lang/objc/objc-baseclass-sbtype/TestObjCBaseClassSBType.py (869 of 2121)
PASS: lldb-unit :: Utility/./UtilityTests/RegisterValueTest.GetSet8 (870 of 2121)
PASS: lldb-api :: lang/cpp/covariant-return-types/TestCovariantReturnTypes.py (871 of 2121)
PASS: lldb-api :: lang/objc/foundation/TestObjCMethods2.py (872 of 2121)
PASS: lldb-unit :: Editline/./EditlineTests/EditlineTestFixture.EditlineReceivesMultiLineText (873 of 2121)
UNSUPPORTED: lldb-shell :: ScriptInterpreter/Lua/convenience_variables.test (874 of 2121)
PASS: lldb-shell :: Quit/TestQuitExitCodeNonInt.test (875 of 2121)
PASS: lldb-api :: tools/lldb-server/TestGdbRemote_qThreadStopInfo.py (876 of 2121)
PASS: lldb-unit :: Utility/./UtilityTests/ScalarTest.GetValue (877 of 2121)
UNSUPPORTED: lldb-api :: functionalities/darwin_log/source/debug/TestDarwinLogSourceDebug.py (878 of 2121)
UNSUPPORTED: lldb-shell :: SymbolFile/NativePDB/typedefs.cpp (879 of 2121)
PASS: lldb-api :: functionalities/wrong_commands/TestWrongCommands.py (880 of 2121)
PASS: lldb-api :: lang/objc/foundation/TestObjCMethodsNSArray.py (881 of 2121)
PASS: lldb-api :: lang/c/struct_types/TestStructTypes.py (882 of 2121)
PASS: lldb-unit :: Utility/./UtilityTests/ArgsTest.DoubleQuotedItem (883 of 2121)
PASS: lldb-unit :: Utility/./UtilityTests/StreamTest.PutBytesAsRawHex8ToLittleEndian (884 of 2121)
PASS: lldb-unit :: Symbol/./SymbolTests/TestClangASTImporter.CanImportInvalidType (885 of 2121)
PASS: lldb-unit :: Expression/./ExpressionTests/CppModuleConfigurationTest.Linux (886 of 2121)
PASS: lldb-unit :: Utility/./UtilityTests/ConstStringTest.YAML (887 of 2121)
PASS: lldb-api :: lang/objc/foundation/TestFoundationDisassembly.py (888 of 2121)
PASS: lldb-unit :: ScriptInterpreter/Python/./ScriptInterpreterPythonTests/PythonDataObjectsTest.TestPythonTupleInitializerList (889 of 2121)
PASS: lldb-unit :: Utility/./UtilityTests/TimerTest.CategoryTimesStats (890 of 2121)
PASS: lldb-api :: functionalities/exec/TestExec.py (891 of 2121)
PASS: lldb-unit :: Utility/./UtilityTests/NameMatchesTest.EndsWith (892 of 2121)
PASS: lldb-unit :: Utility/./UtilityTests/EnvironmentTest.EnvpConversion (893 of 2121)
PASS: lldb-api :: commands/platform/process/list/TestProcessList.py (894 of 2121)
PASS: lldb-api :: tools/lldb-vscode/console/TestVSCode_console.py (895 of 2121)
PASS: lldb-api :: commands/expression/import-std-module/forward_list/TestForwardListFromStdModule.py (896 of 2121)
PASS: lldb-shell :: ObjectFile/Breakpad/uuid-matching-mac.test (897 of 2121)
PASS: lldb-api :: functionalities/data-formatter/data-formatter-objc/TestDataFormatterObjCNSURL.py (898 of 2121)
PASS: lldb-shell :: Breakpoint/debug_rnglist_basic.test (899 of 2121)
UNSUPPORTED: lldb-shell :: Register/arm-gp-read.test (900 of 2121)
PASS: lldb-api :: functionalities/data-formatter/varscript_formatting/TestDataFormatterVarScriptFormatting.py (901 of 2121)
PASS: lldb-unit :: Utility/./UtilityTests/FileSpecTest.AppendPathComponent (902 of 2121)
PASS: lldb-unit :: Utility/./UtilityTests/ListenerTest.GetEventImmediate (903 of 2121)
PASS: lldb-shell :: SymbolFile/DWARF/dir-separator-no-comp-dir-relative-name.s (904 of 2121)
PASS: lldb-api :: commands/expression/import-std-module/queue/TestQueueFromStdModule.py (905 of 2121)
PASS: lldb-shell :: Driver/TestPositionalArgs.test (906 of 2121)
PASS: lldb-unit :: Utility/./UtilityTests/OptionsWithRawTest.MultiWordSuffix (907 of 2121)
PASS: lldb-api :: lang/objc/objc-dyn-sbtype/TestObjCDynamicSBType.py (908 of 2121)
UNSUPPORTED: lldb-api :: benchmarks/libcxxlist/TestBenchmarkLibcxxList.py (909 of 2121)
PASS: lldb-unit :: tools/lldb-server/tests/./LLDBServerTests/StandardStartupTest.TestStopReplyContainsThreadPcs (910 of 2121)
PASS: lldb-shell :: SymbolFile/DWARF/DW_TAG_basic_type_DW_ATE_UTF_nonC.ll (911 of 2121)
PASS: lldb-unit :: Expression/./ExpressionTests/DiagnosticManagerTest.PutStringSeverities (912 of 2121)
PASS: lldb-api :: commands/log/invalid-args/TestInvalidArgsLog.py (913 of 2121)
PASS: lldb-unit :: Utility/./UtilityTests/BinaryStreamTest.PutULEB128FiveBytes (914 of 2121)
PASS: lldb-shell :: Reproducer/TestFileRepro.test (915 of 2121)
PASS: lldb-unit :: ScriptInterpreter/Python/./ScriptInterpreterPythonTests/PythonDataObjectsTest.TestPythonByteArray (916 of 2121)
PASS: lldb-unit :: Interpreter/./InterpreterTests/OptionArgParserTest.toScriptLanguage (917 of 2121)
PASS: lldb-unit :: Utility/./UtilityTests/StreamTest.PutCharNull (918 of 2121)
PASS: lldb-unit :: Host/./HostTests/FileSystemTest.GetPermissions (919 of 2121)
PASS: lldb-api :: python_api/function_symbol/TestSymbolAPI.py (920 of 2121)
UNSUPPORTED: lldb-api :: tools/lldb-server/platform-process-connect/TestPlatformProcessConnect.py (921 of 2121)
PASS: lldb-shell :: ObjectFile/ELF/PT_LOAD-empty.yaml (922 of 2121)
PASS: lldb-unit :: SymbolFile/NativePDB/./SymbolFileNativePDBTests/PDBFPOProgramToDWARFExpressionTests.InvalidOpUnary (923 of 2121)
PASS: lldb-unit :: Utility/./UtilityTests/OptionsWithRawTest.QuotedSuffix (924 of 2121)
PASS: lldb-unit :: Utility/./UtilityTests/AnsiTerminal.WhiteSpace (925 of 2121)
PASS: lldb-unit :: Utility/./UtilityTests/DataExtractorTest.GetBitfield (926 of 2121)
PASS: lldb-unit :: Utility/./UtilityTests/PassiveReplayTest.InstrumentedFooInvalid (927 of 2121)
PASS: lldb-unit :: Utility/./UtilityTests/ScalarTest.Scalar_512 (928 of 2121)
PASS: lldb-api :: lang/objc/objc-static-method-stripped/TestObjCStaticMethodStripped.py (929 of 2121)
PASS: lldb-shell :: ObjectFile/ELF/PT_TLS-overlap-PT_LOAD.yaml (930 of 2121)
PASS: lldb-unit :: Utility/./UtilityTests/RangeDataVector.FindEntryIndexesThatContain_Overlap (931 of 2121)
PASS: lldb-api :: functionalities/data-formatter/nsarraysynth/TestNSArraySynthetic.py (932 of 2121)
PASS: lldb-unit :: Target/./TargetTests/PathMappingListTest.AbsoluteTests (933 of 2121)
PASS: lldb-unit :: Utility/./UtilityTests/BinaryStreamTest.PutSLEB128SixBytes (934 of 2121)
PASS: lldb-api :: functionalities/gdb_remote_client/TestProcessConnect.py (935 of 2121)
PASS: lldb-unit :: Utility/./UtilityTests/StatusTest.ErrorConstructor (936 of 2121)
PASS: lldb-api :: commands/expression/save_jit_objects/TestSaveJITObjects.py (937 of 2121)
PASS: lldb-api :: functionalities/plugins/python_os_plugin/TestPythonOSPlugin.py (938 of 2121)
PASS: lldb-unit :: Language/Highlighting/./HighlighterTests/HighlighterTest.ClangUnterminatedString (939 of 2121)
PASS: lldb-unit :: Utility/./UtilityTests/CompletionRequest.TestCompletionOwnership (940 of 2121)
PASS: lldb-shell :: Heap/heap-cstr.test (941 of 2121)
PASS: lldb-unit :: Process/gdb-remote/./ProcessGdbRemoteTests/GDBRemoteClientBaseTest.SendContinueAndInterrupt2PacketBug (942 of 2121)
PASS: lldb-shell :: SymbolFile/DWARF/debug_loc.s (943 of 2121)
PASS: lldb-api :: lang/cpp/namespace_conflicts/TestNamespaceConflicts.py (944 of 2121)
PASS: lldb-api :: lang/cpp/class_static/TestStaticVariables.py (945 of 2121)
PASS: lldb-api :: functionalities/avoids-fd-leak/TestFdLeak.py (946 of 2121)
PASS: lldb-unit :: Utility/./UtilityTests/ScalarTest.Division (947 of 2121)
PASS: lldb-unit :: Utility/./UtilityTests/StringLexerTest.NextIfList (948 of 2121)
PASS: lldb-unit :: Breakpoint/./LLDBBreakpointTests/BreakpointIDTest.StringIsBreakpointName (949 of 2121)
PASS: lldb-unit :: Editline/./EditlineTests/EditlineTestFixture.EditlineReceivesSingleLineText (950 of 2121)
PASS: lldb-api :: lang/cpp/unsigned_types/TestUnsignedTypes.py (951 of 2121)
PASS: lldb-api :: lang/cpp/incomplete-types/TestCppIncompleteTypes.py (952 of 2121)
UNSUPPORTED: lldb-api :: functionalities/thread/thread_specific_break_plus_condition/TestThreadSpecificBpPlusCondition.py (953 of 2121)
PASS: lldb-shell :: SymbolFile/DWARF/dwarf5-debug_line.s (954 of 2121)
PASS: lldb-shell :: Reproducer/TestDiscard.test (955 of 2121)
PASS: lldb-api :: functionalities/breakpoint/cpp/TestCPPBreakpointLocations.py (956 of 2121)
PASS: lldb-unit :: Utility/./UtilityTests/ArgsTest.ReplaceArgumentAtIndexOutOfRange (957 of 2121)
PASS: lldb-unit :: Utility/./UtilityTests/LogTest.LLDB_LOG_nullptr (958 of 2121)
PASS: lldb-unit :: Utility/./UtilityTests/FileSpecTest.EqualDotsPosixRoot (959 of 2121)
PASS: lldb-api :: lang/objc/foundation/TestObjCMethodsNSError.py (960 of 2121)
PASS: lldb-api :: lang/cpp/bitfields/TestCppBitfields.py (961 of 2121)
PASS: lldb-unit :: Utility/./UtilityTests/BroadcasterTest.EventTypeHasListeners (962 of 2121)
PASS: lldb-shell :: ObjectFile/MachO/lc_build_version.yaml (963 of 2121)
PASS: lldb-unit :: Utility/./UtilityTests/StringExtractorTest.GetHexBytes_OddPair (964 of 2121)
PASS: lldb-unit :: Utility/./UtilityTests/DataExtractorTest.GetMaxU64_unchecked (965 of 2121)
PASS: lldb-api :: commands/expression/call-function/TestCallBuiltinFunction.py (966 of 2121)
UNSUPPORTED: lldb-api :: android/platform/TestDefaultCacheLineSize.py (967 of 2121)
PASS: lldb-unit :: DataFormatter/./LLDBFormatterTests/StringPrinterTests.CxxUTF8 (968 of 2121)
PASS: lldb-unit :: Utility/./UtilityTests/DataExtractorTest.GetFloat (969 of 2121)
PASS: lldb-unit :: Expression/./ExpressionTests/DiagnosticManagerTest.GetStringMultipleDiags (970 of 2121)
PASS: lldb-shell :: Settings/TestSettingsSet.test (971 of 2121)
PASS: lldb-api :: python_api/lldbutil/TestSwigVersion.py (972 of 2121)
PASS: lldb-api :: commands/watchpoints/watchpoint_events/TestWatchpointEvents.py (973 of 2121)
PASS: lldb-unit :: Expression/./ExpressionTests/ClangExpressionDeclMapTest.TestPersistentDeclLookup (974 of 2121)
UNSUPPORTED: lldb-shell :: SymbolFile/PDB/pointers.test (975 of 2121)
PASS: lldb-unit :: Utility/./UtilityTests/StringListTest.CopyList (976 of 2121)
PASS: lldb-unit :: Interpreter/./InterpreterTests/OptionValueFileColonLine.setFromString (977 of 2121)
XFAIL: lldb-shell :: Register/x86-64-ymm-write.test (978 of 2121)
PASS: lldb-unit :: Utility/./UtilityTests/StringExtractorTest.GetHexBytesAvail_OddPair (979 of 2121)
PASS: lldb-unit :: Platform/./LLDBPlatformTests/PlatformAppleSimulatorTest.TestHostPlatformToSim (980 of 2121)
PASS: lldb-shell :: SymbolFile/Breakpad/unwind-via-stack-win-no-memory-info.yaml (981 of 2121)
PASS: lldb-unit :: Utility/./UtilityTests/VMRange.IsValid (982 of 2121)
PASS: lldb-unit :: Symbol/./SymbolTests/TestTypeSystemClang.TestFunctionTemplateInRecordConstruction (983 of 2121)
PASS: lldb-unit :: Utility/./UtilityTests/StringExtractorTest.GetHexBytesAvail (984 of 2121)
PASS: lldb-unit :: Utility/./UtilityTests/ArchSpecTest.MergeFromMachOUnknown (985 of 2121)
PASS: lldb-unit :: Utility/./UtilityTests/PassiveReplayTest.InstrumentedBarPtr (986 of 2121)
PASS: lldb-unit :: Host/./HostTests/HostInfoTest.GetXcodeSDK (987 of 2121)
PASS: lldb-shell :: Driver/TestConvenienceVariables.test (988 of 2121)
PASS: lldb-api :: functionalities/tsan/cpp_global_location/TestTsanCPPGlobalLocation.py (989 of 2121)
PASS: lldb-api :: commands/target/basic/TestTargetCommand.py (990 of 2121)
PASS: lldb-unit :: Utility/./UtilityTests/Flags.AnyClear (991 of 2121)
PASS: lldb-api :: api/listeners/TestListener.py (992 of 2121)
PASS: lldb-unit :: Platform/Android/./AdbClientTests/AdbClientTest.CreateByDeviceId (993 of 2121)
PASS: lldb-unit :: Utility/./UtilityTests/DataExtractorTest.GetCStrEmpty (994 of 2121)
PASS: lldb-unit :: Utility/./UtilityTests/LogTest.Register (995 of 2121)
PASS: lldb-unit :: Utility/./UtilityTests/StreamTest.PutStringAsRawHex8 (996 of 2121)
PASS: lldb-api :: functionalities/postmortem/netbsd-core/TestNetBSDCore.py (997 of 2121)
PASS: lldb-unit :: Symbol/./SymbolTests/PostfixExpression.ToDWARF (998 of 2121)
PASS: lldb-api :: functionalities/breakpoint/scripted_bkpt/TestScriptedResolver.py (999 of 2121)
PASS: lldb-unit :: Utility/./UtilityTests/OptionsWithRawTest.EmptyInput (1000 of 2121)
PASS: lldb-unit :: Utility/./UtilityTests/ProcessInfoTest.Constructor (1001 of 2121)
PASS: lldb-unit :: Symbol/./SymbolTests/LineEntryTest.GetSameLineContiguousAddressRangeOneInline (1002 of 2121)
UNSUPPORTED: lldb-api :: lang/c/typedef/Testtypedef.py (1003 of 2121)
PASS: lldb-shell :: ObjectFile/ELF/compressed-sections.yaml (1004 of 2121)
PASS: lldb-api :: functionalities/breakpoint/serialize/TestBreakpointSerialization.py (1005 of 2121)
PASS: lldb-unit :: Utility/./UtilityTests/UriParserTest.SchemeHostSeparator4 (1006 of 2121)
PASS: lldb-api :: functionalities/breakpoint/consecutive_breakpoints/TestConsecutiveBreakpoints.py (1007 of 2121)
PASS: lldb-unit :: Utility/./UtilityTests/GeneratorTest.GetOrCreate (1008 of 2121)
PASS: lldb-unit :: Utility/./UtilityTests/RangeTest.ContainsAddr (1009 of 2121)
PASS: lldb-api :: functionalities/breakpoint/source_regexp/TestSourceRegexBreakpoints.py (1010 of 2121)
PASS: lldb-unit :: Utility/./UtilityTests/StringExtractorTest.GetNameColonValueNoSemicolon (1011 of 2121)
PASS: lldb-api :: functionalities/data-formatter/vector-types/TestVectorTypesFormatting.py (1012 of 2121)
PASS: lldb-api :: functionalities/breakpoint/step_over_breakpoint/TestStepOverBreakpoint.py (1013 of 2121)
PASS: lldb-shell :: SymbolFile/DWARF/clang-ast-from-dwarf-objc-property.m (1014 of 2121)
PASS: lldb-unit :: Utility/./UtilityTests/VMRange.Comparison (1015 of 2121)
PASS: lldb-unit :: ScriptInterpreter/Python/./ScriptInterpreterPythonTests/PythonDataObjectsTest.TestPythonDictionaryToStructuredDictionary (1016 of 2121)
PASS: lldb-unit :: Utility/./UtilityTests/ProcessInstanceInfo.DumpTable (1017 of 2121)
PASS: lldb-unit :: Expression/./ExpressionTests/CppModuleConfigurationTest.LinuxLocalLibCpp (1018 of 2121)
UNSUPPORTED: lldb-api :: functionalities/darwin_log/filter/exact_match/category/TestDarwinLogFilterMatchCategory.py (1019 of 2121)
PASS: lldb-unit :: Utility/./UtilityTests/AnsiTerminal.Twice (1020 of 2121)
PASS: lldb-unit :: Language/CPlusPlus/./LanguageCPlusPlusTests/CPlusPlusLanguage.MethodNameParsing (1021 of 2121)
PASS: lldb-unit :: Utility/./UtilityTests/BinaryStreamTest.PutULEB128TwoBytes (1022 of 2121)
PASS: lldb-api :: python_api/disassemble-raw-data/TestDisassemble_VST1_64.py (1023 of 2121)
PASS: lldb-api :: functionalities/data-formatter/hexcaps/TestDataFormatterHexCaps.py (1024 of 2121)
PASS: lldb-unit :: UnwindAssembly/x86/./UnwindAssemblyx86Tests/Testx86AssemblyInspectionEngine.TestLEAVE (1025 of 2121)
PASS: lldb-api :: functionalities/deleted-executable/TestDeletedExecutable.py (1026 of 2121)
PASS: lldb-unit :: Utility/./UtilityTests/VMRange.ContainsAddr (1027 of 2121)
PASS: lldb-unit :: Symbol/./SymbolTests/TestTypeSystemClang.TestGetEnumIntegerTypeBasicTypes (1028 of 2121)
PASS: lldb-api :: functionalities/thread/concurrent_events/TestConcurrentTwoWatchpointsOneDelayBreakpoint.py (1029 of 2121)
PASS: lldb-api :: functionalities/data-formatter/frameformat_smallstruct/TestFrameFormatSmallStruct.py (1030 of 2121)
PASS: lldb-api :: functionalities/thread/backtrace_limit/TestBacktraceLimit.py (1031 of 2121)
PASS: lldb-api :: commands/settings/use_source_cache/TestUseSourceCache.py (1032 of 2121)
PASS: lldb-unit :: UnwindAssembly/ARM64/./Arm64InstEmulationTests/TestArm64InstEmulation.TestSimpleDarwinFunction (1033 of 2121)
PASS: lldb-api :: functionalities/thread/concurrent_events/TestConcurrentTwoBreakpointsOneSignal.py (1034 of 2121)
PASS: lldb-api :: commands/command/script/import/TestImport.py (1035 of 2121)
UNSUPPORTED: lldb-api :: lang/cpp/printf/TestPrintf.py (1036 of 2121)
PASS: lldb-unit :: Utility/./UtilityTests/AnsiTerminal.KnownPrefix (1037 of 2121)
PASS: lldb-unit :: UnwindAssembly/ARM64/./Arm64InstEmulationTests/TestArm64InstEmulation.TestFramelessThreeEpilogueFunction (1038 of 2121)
PASS: lldb-api :: commands/target/select/TestTargetSelect.py (1039 of 2121)
PASS: lldb-api :: python_api/disassemble-raw-data/TestDisassembleRawData.py (1040 of 2121)
PASS: lldb-shell :: ObjectFile/PECOFF/disassemble-thumb.yaml (1041 of 2121)
PASS: lldb-unit :: Utility/./UtilityTests/ListenerTest.GetEventWait (1042 of 2121)
PASS: lldb-unit :: Core/./LLDBCoreTests/MangledTest.NameIndexes_FindFunctionSymbols (1043 of 2121)
PASS: lldb-unit :: Utility/./UtilityTests/StringExtractorTest.GetHexU8_Underflow2 (1044 of 2121)
PASS: lldb-api :: functionalities/completion/TestCompletion.py (1045 of 2121)
PASS: lldb-api :: functionalities/breakpoint/auto_continue/TestBreakpointAutoContinue.py (1046 of 2121)
PASS: lldb-api :: commands/expression/call-throws/TestCallThatThrows.py (1047 of 2121)
UNSUPPORTED: lldb-shell :: SymbolFile/PDB/function-level-linking.test (1048 of 2121)
PASS: lldb-api :: functionalities/data-formatter/type_summary_list_arg/TestTypeSummaryListArg.py (1049 of 2121)
PASS: lldb-shell :: ScriptInterpreter/Python/scripted_breakpoint.test (1050 of 2121)
PASS: lldb-api :: commands/frame/diagnose/dereference-function-return/TestDiagnoseDereferenceFunctionReturn.py (1051 of 2121)
PASS: lldb-api :: types/TestDoubleTypes.py (1052 of 2121)
PASS: lldb-shell :: SymbolFile/DWARF/debug-types-address-ranges.s (1053 of 2121)
PASS: lldb-api :: functionalities/gdb_remote_client/TestWriteMemory.py (1054 of 2121)
PASS: lldb-api :: commands/expression/import-std-module/basic/TestImportStdModule.py (1055 of 2121)
PASS: lldb-api :: functionalities/thread/concurrent_events/TestConcurrentManyCrash.py (1056 of 2121)
PASS: lldb-api :: types/TestIntegerType.py (1057 of 2121)
PASS: lldb-unit :: tools/lldb-server/tests/./LLDBServerTests/TestBase.DebugserverEnv (1058 of 2121)
PASS: lldb-api :: functionalities/thread/concurrent_events/TestConcurrentDelayWatchBreak.py (1059 of 2121)
PASS: lldb-unit :: Process/gdb-remote/./ProcessGdbRemoteTests/GDBRemoteCommunicationServerTest.SendErrorResponse_StringError (1060 of 2121)
PASS: lldb-shell :: ScriptInterpreter/Python/crashlog.test (1061 of 2121)
PASS: lldb-unit :: Utility/./UtilityTests/StreamTest.PutRawBytesToMixedEndian (1062 of 2121)
PASS: lldb-unit :: Utility/./UtilityTests/StatusTest.ErrorCodeConstructor (1063 of 2121)
PASS: lldb-api :: commands/gui/basicdebug/TestGuiBasicDebug.py (1064 of 2121)
PASS: lldb-unit :: ScriptInterpreter/Python/./ScriptInterpreterPythonTests/PythonDataObjectsTest.TestPythonFile (1065 of 2121)
UNSUPPORTED: lldb-api :: functionalities/darwin_log/filter/exact_match/message/TestDarwinLogFilterMatchMessage.py (1066 of 2121)
PASS: lldb-api :: lang/cpp/this_class_type_mixing/TestThisClassTypeMixing.py (1067 of 2121)
PASS: lldb-shell :: Recognizer/assert.test (1068 of 2121)
PASS: lldb-unit :: Utility/./UtilityTests/StreamTest.PutHex16ByteOrderBig (1069 of 2121)
PASS: lldb-api :: api/multithreaded/TestMultithreaded.py (1070 of 2121)
PASS: lldb-unit :: Utility/./UtilityTests/SerializationRountripTest.SerializeDeserializeCStringArrayNullptrElem (1071 of 2121)
PASS: lldb-unit :: UnwindAssembly/PPC64/./PPC64InstEmulationTests/TestPPC64InstEmulation.TestMediumFunction (1072 of 2121)
UNSUPPORTED: lldb-shell :: Register/x86-64-xmm16-read.test (1073 of 2121)
PASS: lldb-api :: lang/cpp/breakpoint-commands/TestCPPBreakpointCommands.py (1074 of 2121)
UNSUPPORTED: lldb-api :: benchmarks/frame_variable/TestFrameVariableResponse.py (1075 of 2121)
PASS: lldb-unit :: Process/minidump/./LLDBMinidumpTests/MinidumpParserTest.GetPidWow64 (1076 of 2121)
PASS: lldb-shell :: SymbolFile/DWARF/DW_AT_loclists_base.s (1077 of 2121)
PASS: lldb-unit :: Process/./ProcessEventDataTests/ProcessEventDataTest.DoOnRemoval (1078 of 2121)
PASS: lldb-unit :: Language/Highlighting/./HighlighterTests/HighlighterTest.ClangEmptyInput (1079 of 2121)
PASS: lldb-unit :: Utility/./UtilityTests/ArgsTest.Yaml (1080 of 2121)
PASS: lldb-shell :: ObjectFile/ELF/PT_LOAD-overlap.yaml (1081 of 2121)
PASS: lldb-unit :: SymbolFile/NativePDB/./SymbolFileNativePDBTests/PDBFPOProgramToDWARFExpressionTests.UnsupportedRASearch (1082 of 2121)
PASS: lldb-api :: commands/expression/no-deadlock/TestExprDoesntBlock.py (1083 of 2121)
PASS: lldb-unit :: Utility/./UtilityTests/ArgsTest.ReplaceArgumentAtIndexLonger (1084 of 2121)
PASS: lldb-unit :: Process/minidump/./LLDBMinidumpTests/MinidumpParserTest.GetMiscInfo_no_stream (1085 of 2121)
PASS: lldb-unit :: Utility/./UtilityTests/SharedCluster.ClusterManager (1086 of 2121)
PASS: lldb-api :: functionalities/thread/thread_exit/TestThreadExit.py (1087 of 2121)
PASS: lldb-shell :: Minidump/dump-all.test (1088 of 2121)
PASS: lldb-unit :: Utility/./UtilityTests/PassiveReplayTest.InstrumentedBarRef (1089 of 2121)
UNSUPPORTED: lldb-shell :: Register/x86-ymm-read.test (1090 of 2121)
PASS: lldb-unit :: Utility/./UtilityTests/RangeTest.ContainsAddrInvalid (1091 of 2121)
PASS: lldb-api :: commands/expression/persist_objc_pointeetype/TestPersistObjCPointeeType.py (1092 of 2121)
PASS: lldb-unit :: Host/./HostTests/Host.WaitStatusFormat (1093 of 2121)
PASS: lldb-unit :: Symbol/./SymbolTests/TestTypeSystemClang.TestGetTypeClassDeclType (1094 of 2121)
PASS: lldb-unit :: Utility/./UtilityTests/DataExtractorTest.GetMaxS64 (1095 of 2121)
PASS: lldb-unit :: Utility/./UtilityTests/StringExtractorTest.GetHexBytesAvail_Underflow (1096 of 2121)
PASS: lldb-unit :: ObjectFile/Breakpad/./ObjectFileBreakpadTests/FuncRecord.parse (1097 of 2121)
PASS: lldb-api :: functionalities/tsan/basic/TestTsanBasic.py (1098 of 2121)
PASS: lldb-unit :: Host/./HostTests/ConnectionFileDescriptorTest.TCPGetURIv6 (1099 of 2121)
PASS: lldb-api :: functionalities/postmortem/elf-core/TestLinuxCore.py (1100 of 2121)
PASS: lldb-unit :: Utility/./UtilityTests/UriParserTest.MinimalPort (1101 of 2121)
PASS: lldb-unit :: Host/./HostTests/HostInfoTest.GetHostname (1102 of 2121)
PASS: lldb-shell :: Driver/TestCommands.test (1103 of 2121)
PASS: lldb-api :: commands/expression/expr-in-syscall/TestExpressionInSyscall.py (1104 of 2121)
PASS: lldb-shell :: SymbolFile/NativePDB/function-types-classes.cpp (1105 of 2121)
PASS: lldb-unit :: Utility/./UtilityTests/RangeTest.LessThanInvalid (1106 of 2121)
PASS: lldb-api :: functionalities/thread/concurrent_events/TestConcurrentWatchpointDelayWatchpointOneBreakpoint.py (1107 of 2121)
UNSUPPORTED: lldb-shell :: Register/x86-64-ymm16-read.test (1108 of 2121)
UNSUPPORTED: lldb-shell :: Reproducer/TestLuaImport.test (1109 of 2121)
PASS: lldb-unit :: DataFormatter/./LLDBFormatterTests/FormatManagerTests.CompatibleLangs (1110 of 2121)
PASS: lldb-unit :: Utility/./UtilityTests/StringExtractorTest.GetHexU8_Exact (1111 of 2121)
PASS: lldb-unit :: ScriptInterpreter/Python/./ScriptInterpreterPythonTests/PythonDataObjectsTest.TestPythonListValueEquality (1112 of 2121)
PASS: lldb-api :: functionalities/breakpoint/comp_dir_symlink/TestCompDirSymLink.py (1113 of 2121)
PASS: lldb-api :: commands/expression/rdar44436068/Test128BitsInteger.py (1114 of 2121)
PASS: lldb-api :: lang/cpp/global_variables/TestCPPGlobalVariables.py (1115 of 2121)
PASS: lldb-unit :: Utility/./UtilityTests/StringExtractorTest.GetHexU8_InvalidHex (1116 of 2121)
PASS: lldb-unit :: Utility/./UtilityTests/DataExtractorTest.PeekData (1117 of 2121)
PASS: lldb-unit :: Utility/./UtilityTests/IndexToObjectTest.ObjectForIndex (1118 of 2121)
UNSUPPORTED: lldb-api :: linux/thread/create_during_instruction_step/TestCreateDuringInstructionStep.py (1119 of 2121)
PASS: lldb-api :: python_api/target/TestTargetAPI.py (1120 of 2121)
PASS: lldb-api :: functionalities/memory-region/TestMemoryRegion.py (1121 of 2121)
PASS: lldb-api :: lang/cpp/template/TestTemplateArgs.py (1122 of 2121)
PASS: lldb-api :: lang/objc/modules/TestObjCModules.py (1123 of 2121)
PASS: lldb-api :: macosx/add-dsym/TestAddDsymMidExecutionCommand.py (1124 of 2121)
PASS: lldb-unit :: Utility/./UtilityTests/RangeTest.Copy (1125 of 2121)
PASS: lldb-unit :: Utility/./UtilityTests/StringListTest.JoinNonSpace (1126 of 2121)
PASS: lldb-unit :: UnwindAssembly/x86/./UnwindAssemblyx86Tests/Testx86AssemblyInspectionEngine.TestCALLNextInsn (1127 of 2121)
PASS: lldb-api :: functionalities/thread/step_out/TestThreadStepOut.py (1128 of 2121)
PASS: lldb-api :: functionalities/tail_call_frames/thread_step_out_or_return/TestSteppingOutWithArtificialFrames.py (1129 of 2121)
PASS: lldb-unit :: Target/./TargetTests/ModuleCacheTest.GetAndPutStrangeHostname (1130 of 2121)
PASS: lldb-unit :: Utility/./UtilityTests/ArgsTest.TestSingleArgWithQuotedSpace (1131 of 2121)
PASS: lldb-api :: commands/expression/cast_int_to_anonymous_enum/TestCastIntToAnonymousEnum.py (1132 of 2121)
PASS: lldb-api :: lang/objc/global_ptrs/TestGlobalObjects.py (1133 of 2121)
PASS: lldb-shell :: SymbolFile/DWARF/dwarf5-partial-index.cpp (1134 of 2121)
PASS: lldb-api :: commands/expression/options/TestExprOptions.py (1135 of 2121)
PASS: lldb-api :: functionalities/recursion/TestValueObjectRecursion.py (1136 of 2121)
PASS: lldb-api :: commands/expression/call-function/TestCallStopAndContinue.py (1137 of 2121)
PASS: lldb-api :: lang/cpp/offsetof/TestOffsetofCpp.py (1138 of 2121)
PASS: lldb-api :: lang/objc/single-entry-dictionary/TestObjCSingleEntryDictionary.py (1139 of 2121)
PASS: lldb-unit :: ScriptInterpreter/Python/./ScriptInterpreterPythonTests/PythonDataObjectsTest.TestPythonDictionaryValueEquality (1140 of 2121)
PASS: lldb-api :: lang/c/offsetof/TestOffsetof.py (1141 of 2121)
PASS: lldb-unit :: Utility/./UtilityTests/StreamTeeTest.AppendStream (1142 of 2121)
PASS: lldb-api :: commands/expression/call-function/TestCallUserDefinedFunction.py (1143 of 2121)
PASS: lldb-unit :: Host/./HostTests/FileSystemTest.EnumerateDirectory (1144 of 2121)
PASS: lldb-unit :: SymbolFile/NativePDB/./SymbolFileNativePDBTests/PDBFPOProgramToDWARFExpressionTests.UnresolvedRegisterReference (1145 of 2121)
PASS: lldb-api :: lang/objc/modules-non-objc-target/TestObjCModulesNonObjCTarget.py (1146 of 2121)
PASS: lldb-api :: functionalities/thread/concurrent_events/TestConcurrentBreakpointOneDelayBreakpointThreads.py (1147 of 2121)
PASS: lldb-unit :: Symbol/./SymbolTests/TestTypeSystemClang.TestGetEnumIntegerTypeUnexpectedType (1148 of 2121)
PASS: lldb-api :: commands/frame/diagnose/inheritance/TestDiagnoseInheritance.py (1149 of 2121)
PASS: lldb-unit :: ObjectFile/PECOFF/./ObjectFilePECOFFTests/PECallFrameInfoTest.Frame_reg_eh (1150 of 2121)
PASS: lldb-api :: lang/cpp/member-and-local-vars-with-same-name/TestMembersAndLocalsWithSameName.py (1151 of 2121)
PASS: lldb-api :: tools/lldb-vscode/module/TestVSCode_module.py (1152 of 2121)
PASS: lldb-unit :: Utility/./UtilityTests/FileSpecTest.IsRelative (1153 of 2121)
UNSUPPORTED: lldb-shell :: ExecControl/StopHook/stop-hook-threads.test (1154 of 2121)
PASS: lldb-unit :: Utility/./UtilityTests/DataExtractorTest.UncommonAddressSize (1155 of 2121)
PASS: lldb-unit :: Language/Highlighting/./HighlighterTests/HighlighterTest.ClangCursorOutOfBounds (1156 of 2121)
PASS: lldb-unit :: Expression/./ExpressionTests/DWARFExpression.DW_OP_unknown (1157 of 2121)
PASS: lldb-unit :: Symbol/./SymbolTests/LineEntryTest.GetSameLineContiguousAddressRangeNestedInline (1158 of 2121)
PASS: lldb-api :: python_api/value/change_values/TestChangeValueAPI.py (1159 of 2121)
PASS: lldb-api :: functionalities/data-formatter/data-formatter-stl/libcxx/function/TestLibCxxFunction.py (1160 of 2121)
PASS: lldb-unit :: ObjectFile/ELF/./ObjectFileELFTests/ObjectFileELFTest.SectionsResolveConsistently (1161 of 2121)
PASS: lldb-api :: api/multiple-targets/TestMultipleTargets.py (1162 of 2121)
PASS: lldb-api :: functionalities/gdb_remote_client/TestqOffsets.py (1163 of 2121)
PASS: lldb-api :: functionalities/thread/concurrent_events/TestConcurrentSignalBreak.py (1164 of 2121)
PASS: lldb-api :: types/TestLongTypes.py (1165 of 2121)
PASS: lldb-unit :: Utility/./UtilityTests/UriParserTest.SchemeHostSeparator3 (1166 of 2121)
PASS: lldb-shell :: ObjectFile/ELF/avr-basic-info.yaml (1167 of 2121)
PASS: lldb-unit :: Utility/./UtilityTests/StreamTeeTest.SetStreamAtIndexOverwrite (1168 of 2121)
PASS: lldb-unit :: Utility/./UtilityTests/RangeTest.ContainsEndInclusive (1169 of 2121)
PASS: lldb-api :: functionalities/data-formatter/data-formatter-objc/TestDataFormatterObjCNSData.py (1170 of 2121)
PASS: lldb-api :: commands/expression/issue_11588/Test11588.py (1171 of 2121)
UNSUPPORTED: lldb-api :: functionalities/darwin_log/filter/regex/message/TestDarwinLogFilterRegexMessage.py (1172 of 2121)
PASS: lldb-shell :: SymbolFile/DWARF/dir-separator-posix.s (1173 of 2121)
PASS: lldb-unit :: Utility/./UtilityTests/StringListTest.InsertStringAtIndexOutOfBounds (1174 of 2121)
UNSUPPORTED: lldb-api :: commands/target/auto-install-main-executable/TestAutoInstallMainExecutable.py (1175 of 2121)
PASS: lldb-api :: lang/cpp/trivial_abi/TestTrivialABI.py (1176 of 2121)
PASS: lldb-api :: lang/cpp/class-template-parameter-pack/TestClassTemplateParameterPack.py (1177 of 2121)
PASS: lldb-api :: functionalities/data-formatter/data-formatter-stl/libcxx/map/TestDataFormatterLibccMap.py (1178 of 2121)
PASS: lldb-shell :: Settings/TestEchoCommands.test (1179 of 2121)
PASS: lldb-unit :: Target/./TargetTests/ModuleCacheTest.GetAndPut (1180 of 2121)
PASS: lldb-unit :: Utility/./UtilityTests/CompletionRequest.FakeLastArg (1181 of 2121)
PASS: lldb-unit :: Utility/./UtilityTests/BinaryStreamTest.PutULEB128EightBytes (1182 of 2121)
PASS: lldb-unit :: SymbolFile/NativePDB/./SymbolFileNativePDBTests/PDBFPOProgramToDWARFExpressionTests.UnresolvedCyclicRegisterAssignmentReference (1183 of 2121)
PASS: lldb-unit :: UnwindAssembly/x86/./UnwindAssemblyx86Tests/Testx86AssemblyInspectionEngine.TestPopESI (1184 of 2121)
PASS: lldb-shell :: SymbolFile/DWARF/debug-types-signature-loop.s (1185 of 2121)
PASS: lldb-unit :: Disassembler/./DisassemblerTests/TestArm64Disassembly.TestArmv81Instruction (1186 of 2121)
PASS: lldb-api :: functionalities/thread_plan/TestThreadPlanCommands.py (1187 of 2121)
PASS: lldb-unit :: Utility/./UtilityTests/StreamTeeTest.Flush (1188 of 2121)
PASS: lldb-api :: lang/cpp/bool/TestCPPBool.py (1189 of 2121)
PASS: lldb-unit :: Process/gdb-remote/./ProcessGdbRemoteTests/GDBRemoteCommunicationClientTest.SendGetDataPacket (1190 of 2121)
PASS: lldb-api :: functionalities/process_crash_info/TestProcessCrashInfo.py (1191 of 2121)
PASS: lldb-unit :: Host/./HostTests/Host.GetEnvironment (1192 of 2121)
PASS: lldb-shell :: ObjectFile/ELF/basic-info.yaml (1193 of 2121)
PASS: lldb-unit :: ScriptInterpreter/Python/./ScriptInterpreterPythonTests/PythonDataObjectsTest.TestTypeNameResolutionNoDot (1194 of 2121)
PASS: lldb-unit :: Process/gdb-remote/./ProcessGdbRemoteTests/GDBRemoteClientBaseTest.InterruptNoResponse (1195 of 2121)
PASS: lldb-unit :: Utility/./UtilityTests/GeneratorTest.YamlMultiProvider (1196 of 2121)
PASS: lldb-unit :: Utility/./UtilityTests/OptionsWithRawTest.EmptySuffix (1197 of 2121)
PASS: lldb-unit :: Process/minidump/./LLDBMinidumpTests/MinidumpParserTest.FindMemoryRangeWithFullMemoryMinidump (1198 of 2121)
PASS: lldb-api :: lang/objc/foundation/TestObjectDescriptionAPI.py (1199 of 2121)
PASS: lldb-unit :: Language/Highlighting/./HighlighterTests/HighlighterTest.ClangPreserveNewLine (1200 of 2121)
PASS: lldb-unit :: Utility/./UtilityTests/StreamTest.AddressPrefix (1201 of 2121)
PASS: lldb-unit :: ScriptInterpreter/Python/./ScriptInterpreterPythonTests/PythonDataObjectsTest.TestPythonListToStructuredList (1202 of 2121)
UNSUPPORTED: lldb-api :: tools/lldb-vscode/completions/TestVSCode_completions.py (1203 of 2121)
PASS: lldb-unit :: Utility/./UtilityTests/OptionsWithRawTest.EmptySuffixSingleWhitespace (1204 of 2121)
PASS: lldb-api :: python_api/value/TestValueAPI.py (1205 of 2121)
PASS: lldb-api :: functionalities/data-formatter/array_typedef/TestArrayTypedef.py (1206 of 2121)
PASS: lldb-api :: commands/frame/diagnose/dereference-this/TestDiagnoseDereferenceThis.py (1207 of 2121)
PASS: lldb-unit :: Utility/./UtilityTests/StringExtractorTest.DecodeHexU8_Extra (1208 of 2121)
PASS: lldb-api :: tools/lldb-server/TestGdbRemoteProcessInfo.py (1209 of 2121)
PASS: lldb-api :: functionalities/data-formatter/data-formatter-stl/libcxx/string/TestDataFormatterLibcxxString.py (1210 of 2121)
PASS: lldb-unit :: Utility/./UtilityTests/BinaryStreamTest.PutULEB128Zero (1211 of 2121)
PASS: lldb-shell :: ObjectFile/ELF/many-sections.s (1212 of 2121)
PASS: lldb-unit :: Utility/./UtilityTests/OptionsWithRawTest.LeadingSpaceArgs (1213 of 2121)
PASS: lldb-unit :: Utility/./UtilityTests/AnsiTerminal.Basic (1214 of 2121)
PASS: lldb-unit :: Utility/./UtilityTests/SerializationRountripTest.SerializeDeserializeCStringArray (1215 of 2121)
PASS: lldb-unit :: UnwindAssembly/x86/./UnwindAssemblyx86Tests/Testx86AssemblyInspectionEngine.TestStackRealignMSVC_i386 (1216 of 2121)
PASS: lldb-api :: functionalities/fat_archives/TestFatArchives.py (1217 of 2121)
PASS: lldb-unit :: UnwindAssembly/x86/./UnwindAssemblyx86Tests/Testx86AssemblyInspectionEngine.Test32BitOnlyInstruction (1218 of 2121)
PASS: lldb-api :: macosx/order/TestOrderFile.py (1219 of 2121)
PASS: lldb-shell :: SymbolFile/DWARF/DW_TAG_variable-invalid_location.s (1220 of 2121)
PASS: lldb-api :: python_api/file_handle/TestFileHandle.py (1221 of 2121)
PASS: lldb-unit :: Utility/./UtilityTests/DataExtractorTest.GetCStr (1222 of 2121)
PASS: lldb-api :: lang/c/const_variables/TestConstVariables.py (1223 of 2121)
PASS: lldb-api :: commands/process/signal/TestProcessSignal.py (1224 of 2121)
PASS: lldb-api :: commands/expression/import-std-module/list-dbg-info-content/TestDbgInfoContentListFromStdModule.py (1225 of 2121)
PASS: lldb-api :: functionalities/postmortem/minidump-new/TestMiniDumpNew.py (1226 of 2121)
PASS: lldb-api :: python_api/hello_world/TestHelloWorld.py (1227 of 2121)
PASS: lldb-unit :: UnwindAssembly/x86/./UnwindAssemblyx86Tests/Testx86AssemblyInspectionEngine.TestDisassemblyJunkBytes (1228 of 2121)
PASS: lldb-shell :: Reproducer/Modules/TestModuleCXX.test (1229 of 2121)
PASS: lldb-shell :: Minidump/Windows/arm-fp-unwind.test (1230 of 2121)
PASS: lldb-shell :: Reproducer/TestGDBRemoteRepro.test (1231 of 2121)
UNSUPPORTED: lldb-shell :: BuildScript/toolchain-clang-cl.test (1232 of 2121)
PASS: lldb-unit :: ScriptInterpreter/Python/./ScriptInterpreterPythonTests/PythonDataObjectsTest.TestPythonStringToStr (1233 of 2121)
PASS: lldb-unit :: Language/Highlighting/./HighlighterTests/HighlighterTest.FallbackHighlighter (1234 of 2121)
PASS: lldb-shell :: SymbolFile/Breakpad/line-table-missing-file.test (1235 of 2121)
PASS: lldb-api :: tools/lldb-vscode/breakpoint-events/TestVSCode_breakpointEvents.py (1236 of 2121)
PASS: lldb-unit :: Utility/./UtilityTests/UUIDTest.StringConverion (1237 of 2121)
PASS: lldb-shell :: ObjectFile/Breakpad/sections.test (1238 of 2121)
PASS: lldb-api :: functionalities/plugins/command_plugin/TestPluginCommands.py (1239 of 2121)
PASS: lldb-shell :: SymbolFile/DWARF/find-variable-file.cpp (1240 of 2121)
PASS: lldb-api :: lang/cpp/limit-debug-info/TestWithLimitDebugInfo.py (1241 of 2121)
PASS: lldb-unit :: Utility/./UtilityTests/ArgsTest.AppendArguments (1242 of 2121)
PASS: lldb-shell :: SymbolFile/DWARF/debug-types-dwarf5.s (1243 of 2121)
PASS: lldb-unit :: Utility/./UtilityTests/CompletionRequest.TryCompleteCurrentArgMode (1244 of 2121)
PASS: lldb-api :: lang/cpp/auto/TestCPPAuto.py (1245 of 2121)
PASS: lldb-api :: lang/objc/modules-cache/TestClangModulesCache.py (1246 of 2121)
PASS: lldb-unit :: Language/Highlighting/./HighlighterTests/HighlighterTest.DefaultHighlighterWithCursor (1247 of 2121)
PASS: lldb-unit :: Utility/./UtilityTests/LogChannelEnabledTest.log_options (1248 of 2121)
PASS: lldb-shell :: ObjectFile/PECOFF/invalid-export-table.yaml (1249 of 2121)
UNSUPPORTED: lldb-api :: lang/objc/rdar-12408181/TestRdar12408181.py (1250 of 2121)
PASS: lldb-api :: arm/emulation/TestEmulations.py (1251 of 2121)
UNSUPPORTED: lldb-shell :: ScriptInterpreter/Lua/persistent_state.test (1252 of 2121)
PASS: lldb-unit :: Process/minidump/./LLDBMinidumpTests/MinidumpParserTest.MinidumpDuplicateModuleMinAddress (1253 of 2121)
PASS: lldb-api :: commands/expression/import-std-module/vector-of-vectors/TestVectorOfVectorsFromStdModule.py (1254 of 2121)
PASS: lldb-unit :: Utility/./UtilityTests/StringExtractorTest.InitMisc (1255 of 2121)
PASS: lldb-api :: lang/cpp/enum_types/TestCPP11EnumTypes.py (1256 of 2121)
PASS: lldb-shell :: Register/x86-64-read.test (1257 of 2121)
PASS: lldb-unit :: Utility/./UtilityTests/BinaryStreamTest.PutULEB128One (1258 of 2121)
PASS: lldb-api :: functionalities/tail_call_frames/inlining_and_tail_calls/TestInliningAndTailCalls.py (1259 of 2121)
PASS: lldb-unit :: ObjectFile/ELF/./ObjectFileELFTests/ObjectFileELFTest.GetModuleSpecifications_EarlySectionHeaders (1260 of 2121)
UNSUPPORTED: lldb-api :: functionalities/tty/TestTerminal.py (1261 of 2121)
UNSUPPORTED: lldb-api :: tools/lldb-server/thread-name/TestGdbRemoteThreadName.py (1262 of 2121)
PASS: lldb-shell :: Driver/TestCore.test (1263 of 2121)
PASS: lldb-api :: commands/expression/radar_9531204/TestPrintfAfterUp.py (1264 of 2121)
PASS: lldb-unit :: Utility/./UtilityTests/SerializationRountripTest.SerializeDeserializePodPointers (1265 of 2121)
PASS: lldb-api :: lang/cpp/rvalue-references/TestRvalueReferences.py (1266 of 2121)
PASS: lldb-unit :: ObjectFile/PECOFF/./ObjectFilePECOFFTests/PECallFrameInfoTest.Basic_eh (1267 of 2121)
PASS: lldb-unit :: Platform/./LLDBPlatformTests/PlatformAppleSimulatorTest.TestSimHasSimEnvionament (1268 of 2121)
PASS: lldb-unit :: UnwindAssembly/x86/./UnwindAssemblyx86Tests/Testx86AssemblyInspectionEngine.TestReturnDetect (1269 of 2121)
PASS: lldb-unit :: Utility/./UtilityTests/StringExtractorTest.GetNameColonValueContainsColon (1270 of 2121)
PASS: lldb-api :: commands/expression/import-std-module/vector/TestVectorFromStdModule.py (1271 of 2121)
PASS: lldb-unit :: ScriptInterpreter/Python/./ScriptInterpreterPythonTests/PythonDataObjectsTest.TestPythonBoolean (1272 of 2121)
PASS: lldb-api :: functionalities/data-formatter/data-formatter-synthtype/TestDataFormatterSynthType.py (1273 of 2121)
PASS: lldb-api :: functionalities/breakpoint/breakpoint_set_restart/TestBreakpointSetRestart.py (1274 of 2121)
PASS: lldb-unit :: Utility/./UtilityTests/AnsiTerminal.Unknown (1275 of 2121)
PASS: lldb-unit :: Utility/./UtilityTests/UserIDResolver.GetGroupName (1276 of 2121)
PASS: lldb-api :: commands/expression/invalid-args/TestInvalidArgsExpression.py (1277 of 2121)
PASS: lldb-shell :: ObjectFile/PECOFF/sections-names.yaml (1278 of 2121)
XFAIL: lldb-shell :: Unwind/prefer-debug-over-eh-frame.test (1279 of 2121)
PASS: lldb-unit :: Expression/./ExpressionTests/CppModuleConfigurationTest.UnknownLibCppFile (1280 of 2121)
PASS: lldb-unit :: Process/minidump/./LLDBMinidumpTests/MinidumpParserTest.GetLinuxProcStatus (1281 of 2121)
PASS: lldb-shell :: SymbolFile/DWARF/find-basic-function.cpp (1282 of 2121)
PASS: lldb-unit :: Process/gdb-remote/./ProcessGdbRemoteTests/GDBRemoteCommunicationClientTest.TestPacketSpeedJSON (1283 of 2121)
PASS: lldb-api :: functionalities/non-overlapping-index-variable-i/TestIndexVariable.py (1284 of 2121)
PASS: lldb-unit :: Utility/./UtilityTests/ScalarTest.SetValueFromData (1285 of 2121)
PASS: lldb-api :: python_api/get-value-32bit-int/TestGetValue32BitInt.py (1286 of 2121)
PASS: lldb-unit :: Utility/./UtilityTests/UriParserTest.SchemeHostSeparator (1287 of 2121)
PASS: lldb-unit :: Utility/./UtilityTests/TimeoutTest.Format (1288 of 2121)
PASS: lldb-unit :: Symbol/./SymbolTests/TestClangASTImporter.CompleteFwdDeclWithOtherOrigin (1289 of 2121)
PASS: lldb-unit :: Expression/./ExpressionTests/DiagnosticManagerTest.PutString (1290 of 2121)
UNSUPPORTED: lldb-api :: functionalities/data-formatter/data-formatter-stl/libstdcpp/smart_ptr/TestDataFormatterStdSmartPtr.py (1291 of 2121)
PASS: lldb-api :: lang/cpp/namespace_definitions/TestNamespaceDefinitions.py (1292 of 2121)
PASS: lldb-api :: lang/cpp/const_this/TestConstThis.py (1293 of 2121)
PASS: lldb-shell :: Commands/command-disassemble-process.yaml (1294 of 2121)
PASS: lldb-unit :: Utility/./UtilityTests/ArgsTest.TestSingleQuotedArgWithSpace (1295 of 2121)
PASS: lldb-unit :: Host/./HostTests/NativeProcessProtocolTest.ReadCStringFromMemory_CrossPageBoundary (1296 of 2121)
PASS: lldb-shell :: SymbolFile/DWARF/find-qualified-variable.cpp (1297 of 2121)
PASS: lldb-api :: python_api/watchpoint/TestWatchpointIgnoreCount.py (1298 of 2121)
PASS: lldb-unit :: ScriptInterpreter/Python/./ScriptInterpreterPythonTests/PythonDataObjectsTest.TestOwnedReferences (1299 of 2121)
PASS: lldb-unit :: Utility/./UtilityTests/StatusTest.ErrorConversion (1300 of 2121)
UNSUPPORTED: lldb-api :: commands/register/register/intel_xtended_registers/TestMPXRegisters.py (1301 of 2121)
PASS: lldb-unit :: DataFormatter/./LLDBFormatterTests/TypeMatcherTests.RegexMatchPart (1302 of 2121)
PASS: lldb-unit :: Utility/./UtilityTests/StringLexerTest.AdvanceIf (1303 of 2121)
PASS: lldb-api :: lang/objc/direct-dispatch-step/TestObjCDirectDispatchStepping.py (1304 of 2121)
PASS: lldb-api :: python_api/sbvalue_const_addrof/TestSBValueConstAddrOf.py (1305 of 2121)
PASS: lldb-api :: lang/c/complex_int/TestComplexInt.py (1306 of 2121)
PASS: lldb-unit :: SymbolFile/DWARF/./SymbolFileDWARFTests/SymbolFileDWARFTests.TestAbbrevNullAttrValidForm (1307 of 2121)
PASS: lldb-unit :: Utility/./UtilityTests/Flags.AllSet (1308 of 2121)
PASS: lldb-api :: sample_test/TestSampleInlineTest.py (1309 of 2121)
PASS: lldb-api :: commands/process/launch-with-shellexpand/TestLaunchWithShellExpand.py (1310 of 2121)
UNSUPPORTED: lldb-shell :: Unwind/unwind-plan-dwarf-dump.test (1311 of 2121)
PASS: lldb-api :: commands/expression/import-std-module/no-std-module/TestMissingStdModule.py (1312 of 2121)
PASS: lldb-unit :: Utility/./UtilityTests/StringListTest.LongestCommonPrefixNoPrefix (1313 of 2121)
PASS: lldb-api :: lang/cpp/operator-overload/TestOperatorOverload.py (1314 of 2121)
PASS: lldb-api :: functionalities/data-formatter/dump_dynamic/TestDumpDynamic.py (1315 of 2121)
PASS: lldb-unit :: Target/./TargetTests/ExecutionContextTest.GetByteOrder (1316 of 2121)
PASS: lldb-shell :: Minidump/no-process-id.yaml (1317 of 2121)
UNSUPPORTED: lldb-api :: functionalities/darwin_log/filter/exact_match/activity/TestDarwinLogFilterMatchActivity.py (1318 of 2121)
PASS: lldb-shell :: SymbolFile/DWARF/parallel-indexing-stress.s (1319 of 2121)
UNSUPPORTED: lldb-api :: api/multiple-debuggers/TestMultipleDebuggers.py (1320 of 2121)
PASS: lldb-api :: tools/lldb-vscode/breakpoint/TestVSCode_setExceptionBreakpoints.py (1321 of 2121)
PASS: lldb-api :: lang/cpp/char1632_t/TestChar1632T.py (1322 of 2121)
PASS: lldb-api :: types/TestRecursiveTypes.py (1323 of 2121)
PASS: lldb-unit :: ScriptInterpreter/Python/./ScriptInterpreterPythonTests/PythonDataObjectsTest.TestGlobalNameResolutionWithDot (1324 of 2121)
PASS: lldb-api :: functionalities/data-formatter/data-formatter-globals/TestDataFormatterGlobals.py (1325 of 2121)
PASS: lldb-api :: functionalities/tail_call_frames/disambiguate_paths_to_common_sink/TestDisambiguatePathsToCommonSink.py (1326 of 2121)
PASS: lldb-api :: lang/cpp/dynamic-value/TestCppValueCast.py (1327 of 2121)
PASS: lldb-api :: functionalities/mtc/simple/TestMTCSimple.py (1328 of 2121)
PASS: lldb-unit :: Process/gdb-remote/./ProcessGdbRemoteTests/GDBRemoteCommunicationClientTest.SendSignalsToIgnore (1329 of 2121)
UNSUPPORTED: lldb-shell :: ScriptInterpreter/Lua/breakpoint_callback.test (1330 of 2121)
PASS: lldb-unit :: Utility/./UtilityTests/BinaryStreamTest.PutSLEB128ThreeBytes (1331 of 2121)
PASS: lldb-api :: lang/objc/objc-checker/TestObjCCheckers.py (1332 of 2121)
PASS: lldb-api :: functionalities/tsan/thread_leak/TestTsanThreadLeak.py (1333 of 2121)
PASS: lldb-api :: functionalities/breakpoint/breakpoint_by_file_colon_line/TestBreakpointByFileColonLine.py (1334 of 2121)
PASS: lldb-shell :: Quit/TestQuitExitCode30.test (1335 of 2121)
PASS: lldb-api :: functionalities/data-formatter/boolreference/TestFormattersBoolRefPtr.py (1336 of 2121)
PASS: lldb-unit :: Utility/./UtilityTests/StreamTest.ShiftOperatorStrings (1337 of 2121)
PASS: lldb-unit :: Utility/./UtilityTests/SerializationRountripTest.SerializeDeserializePodReferences (1338 of 2121)
PASS: lldb-shell :: ObjectFile/PECOFF/export-dllfunc.yaml (1339 of 2121)
PASS: lldb-api :: commands/expression/diagnostics/TestExprDiagnostics.py (1340 of 2121)
PASS: lldb-shell :: BuildScript/compiler-full-path.test (1341 of 2121)
PASS: lldb-unit :: Host/./HostTests/SocketTest.TCPListen0GetPort (1342 of 2121)
PASS: lldb-api :: functionalities/thread/crash_during_step/TestCrashDuringStep.py (1343 of 2121)
PASS: lldb-unit :: UnwindAssembly/x86/./UnwindAssemblyx86Tests/Testx86AssemblyInspectionEngine.TestMovRSPtoRBP (1344 of 2121)
PASS: lldb-shell :: SymbolFile/DWARF/gnu-style-compression.cpp (1345 of 2121)
PASS: lldb-unit :: Utility/./UtilityTests/TimeoutTest.Construction (1346 of 2121)
PASS: lldb-unit :: Utility/./UtilityTests/FileSpecTest.FormatFileSpec (1347 of 2121)
PASS: lldb-unit :: Utility/./UtilityTests/StreamTest.PutNHex8 (1348 of 2121)
PASS: lldb-unit :: Utility/./UtilityTests/StringLexerTest.NextIf (1349 of 2121)
PASS: lldb-shell :: SymbolFile/NativePDB/break-by-function.cpp (1350 of 2121)
PASS: lldb-unit :: Utility/./UtilityTests/ArchSpecTest.Compatibility (1351 of 2121)
PASS: lldb-api :: commands/expression/import-std-module/vector-dbg-info-content/TestDbgInfoContentVectorFromStdModule.py (1352 of 2121)
PASS: lldb-api :: commands/frame/diagnose/local-variable/TestLocalVariable.py (1353 of 2121)
PASS: lldb-unit :: SymbolFile/DWARF/./SymbolFileDWARFTests/SymbolFileDWARFTests.TestAbbrevValidAttrNullForm (1354 of 2121)
PASS: lldb-unit :: Utility/./UtilityTests/TimerTest.CategoryTimes (1355 of 2121)
PASS: lldb-unit :: Process/minidump/./LLDBMinidumpTests/MinidumpParserTest.InvalidMinidump (1356 of 2121)
PASS: lldb-shell :: Breakpoint/implicit_const_form_support.test (1357 of 2121)
PASS: lldb-unit :: UnwindAssembly/x86/./UnwindAssemblyx86Tests/Testx86AssemblyInspectionEngine.TestPushRBP (1358 of 2121)
PASS: lldb-shell :: Breakpoint/ppc64-localentry.test (1359 of 2121)
PASS: lldb-api :: tools/lldb-server/TestGdbRemoteExitCode.py (1360 of 2121)
PASS: lldb-shell :: ObjectFile/ELF/base-address.yaml (1361 of 2121)
UNSUPPORTED: lldb-shell :: SymbolFile/PDB/ast-restore.test (1362 of 2121)
PASS: lldb-api :: tools/lldb-server/TestGdbRemoteRegisterState.py (1363 of 2121)
PASS: lldb-unit :: Process/gdb-remote/./ProcessGdbRemoteTests/GDBRemoteCommunicationClientTest.WriteRegisterNoSuffix (1364 of 2121)
PASS: lldb-api :: lang/objc/real-definition/TestRealDefinition.py (1365 of 2121)
PASS: lldb-unit :: Host/./HostTests/MainLoopTest.DetectsEOF (1366 of 2121)
PASS: lldb-api :: commands/apropos/with-process/TestAproposWithProcess.py (1367 of 2121)
PASS: lldb-unit :: SymbolFile/NativePDB/./SymbolFileNativePDBTests/PDBFPOProgramToDWARFExpressionTests.MissingTargetRegister (1368 of 2121)
PASS: lldb-unit :: Process/gdb-remote/./ProcessGdbRemoteTests/GDBRemoteClientBaseTest.SendContinueAndInterrupt (1369 of 2121)
PASS: lldb-api :: lang/objc/modules-compile-error/TestModulesCompileError.py (1370 of 2121)
PASS: lldb-api :: lang/cpp/typedef/TestCppTypedef.py (1371 of 2121)
PASS: lldb-shell :: Minidump/Windows/broken-unwind.test (1372 of 2121)
PASS: lldb-api :: commands/watchpoints/watchpoint_commands/command/TestWatchpointCommandPython.py (1373 of 2121)
PASS: lldb-api :: functionalities/thread/concurrent_events/TestConcurrentTwoWatchpointsOneSignal.py (1374 of 2121)
PASS: lldb-unit :: Utility/./UtilityTests/RegularExpression.Match (1375 of 2121)
PASS: lldb-api :: functionalities/data-formatter/data-formatter-caching/TestDataFormatterCaching.py (1376 of 2121)
PASS: lldb-api :: lang/cpp/thread_local/TestThreadLocal.py (1377 of 2121)
PASS: lldb-unit :: Utility/./UtilityTests/Flags.IsClear (1378 of 2121)
PASS: lldb-unit :: Utility/./UtilityTests/XcodeSDKTest.FindXcodeContentsDirectoryInPath (1379 of 2121)
PASS: lldb-api :: lang/cpp/symbols/TestSymbols.py (1380 of 2121)
PASS: lldb-api :: types/TestFloatTypesExpr.py (1381 of 2121)
PASS: lldb-api :: functionalities/plugins/python_os_plugin/stepping_plugin_threads/TestOSPluginStepping.py (1382 of 2121)
PASS: lldb-api :: commands/expression/import-std-module/vector-bool/TestVectorBoolFromStdModule.py (1383 of 2121)
PASS: lldb-api :: functionalities/thread/exit_during_expression/TestExitDuringExpression.py (1384 of 2121)
PASS: lldb-unit :: Utility/./UtilityTests/RecordReplayTest.InstrumentedBar (1385 of 2121)
PASS: lldb-api :: commands/expression/function_template_specialization_temp_args/TestFunctionTemplateSpecializationTempArgs.py (1386 of 2121)
PASS: lldb-shell :: SymbolFile/DWARF/clang-ast-from-dwarf-unamed-and-anon-structs.cpp (1387 of 2121)
PASS: lldb-unit :: Host/./HostTests/MainLoopTest.TerminatesImmediately (1388 of 2121)
PASS: lldb-shell :: SymbolFile/DWARF/dwp.s (1389 of 2121)
PASS: lldb-unit :: Utility/./UtilityTests/StreamTest.Indent (1390 of 2121)
PASS: lldb-unit :: Utility/./UtilityTests/StringListTest.GetMaxStringLengthMixed (1391 of 2121)
PASS: lldb-api :: commands/target/dump-symtab-demangle/TestDumpSymtabDemangle.py (1392 of 2121)
UNSUPPORTED: lldb-shell :: SymbolFile/NativePDB/stack_unwinding01.cpp (1393 of 2121)
PASS: lldb-api :: functionalities/data-formatter/data-formatter-synth/TestDataFormatterSynth.py (1394 of 2121)
PASS: lldb-unit :: Language/CPlusPlus/./LanguageCPlusPlusTests/CPlusPlusLanguage.FindAlternateFunctionManglings (1395 of 2121)
PASS: lldb-api :: functionalities/thread/concurrent_events/TestConcurrentDelaySignalWatch.py (1396 of 2121)
PASS: lldb-unit :: Expression/./ExpressionTests/CppModuleConfigurationTest.AmbiguousCLib (1397 of 2121)
PASS: lldb-unit :: UnwindAssembly/PPC64/./PPC64InstEmulationTests/TestPPC64InstEmulation.TestSimpleFunction (1398 of 2121)
PASS: lldb-shell :: Settings/TestSettingsWrite.test (1399 of 2121)
PASS: lldb-unit :: Expression/./ExpressionTests/CppModuleConfigurationTest.IgnoreLibStdCpp (1400 of 2121)
PASS: lldb-unit :: Utility/./UtilityTests/RecordReplayTest.InstrumentedFoo (1401 of 2121)
PASS: lldb-api :: functionalities/memory/find/TestMemoryFind.py (1402 of 2121)
PASS: lldb-unit :: Process/gdb-remote/./ProcessGdbRemoteTests/GDBRemoteClientBaseTest.SendContinueAndAsyncPacket (1403 of 2121)
PASS: lldb-api :: functionalities/gdb_remote_client/TestNoGPacketSupported.py (1404 of 2121)
PASS: lldb-api :: source-manager/TestSourceManager.py (1405 of 2121)
PASS: lldb-unit :: ScriptInterpreter/Python/./ScriptInterpreterPythonTests/PythonDataObjectsTest.TestBorrowedReferences (1406 of 2121)
PASS: lldb-api :: functionalities/breakpoint/breakpoint_conditions/TestBreakpointConditions.py (1407 of 2121)
PASS: lldb-unit :: Host/./HostTests/FileSystemTest.Exists (1408 of 2121)
PASS: lldb-unit :: Symbol/./SymbolTests/DWARFCallFrameInfoTest.Basic_dwarf4 (1409 of 2121)
PASS: lldb-api :: functionalities/breakpoint/inlined_breakpoints/TestInlinedBreakpoints.py (1410 of 2121)
UNSUPPORTED: lldb-shell :: Register/x86-gp-write.test (1411 of 2121)
PASS: lldb-unit :: Utility/./UtilityTests/LogChannelEnabledTest.LogVerboseThread (1412 of 2121)
PASS: lldb-unit :: Utility/./UtilityTests/StringExtractorTest.GetHexBytes_Partial (1413 of 2121)
PASS: lldb-unit :: Utility/./UtilityTests/StreamTest.AddressNoSuffix (1414 of 2121)
PASS: lldb-unit :: Utility/./UtilityTests/StringExtractorTest.GetHexBytesAvail_FullString (1415 of 2121)
PASS: lldb-unit :: Host/./HostTests/FileSystemTest.FileAndDirectoryComponents (1416 of 2121)
PASS: lldb-shell :: SymbolFile/Breakpad/symtab-macho.test (1417 of 2121)
PASS: lldb-unit :: Language/CPlusPlus/./LanguageCPlusPlusTests/CPlusPlusLanguage.CPlusPlusNameParser (1418 of 2121)
PASS: lldb-unit :: UnwindAssembly/x86/./UnwindAssemblyx86Tests/Testx86AssemblyInspectionEngine.Test64bitFramelessSmallStackFrame (1419 of 2121)
PASS: lldb-shell :: Minidump/Windows/find-module.test (1420 of 2121)
PASS: lldb-shell :: Reproducer/TestSynchronous.test (1421 of 2121)
PASS: lldb-api :: lang/objc/objc++/TestObjCXX.py (1422 of 2121)
PASS: lldb-api :: functionalities/limit-debug-info/TestLimitDebugInfo.py (1423 of 2121)
PASS: lldb-api :: lang/objcxx/class-name-clash/TestNameClash.py (1424 of 2121)
PASS: lldb-shell :: SymbolFile/DWARF/inline-function-address-shared.test (1425 of 2121)
PASS: lldb-unit :: SymbolFile/DWARF/./SymbolFileDWARFTests/SymbolFileDWARFTests.ParseArangesNonzeroSegmentSize (1426 of 2121)
PASS: lldb-shell :: SymbolFile/DWARF/split-dwarf-inlining.cpp (1427 of 2121)
PASS: lldb-shell :: Register/x86-64-ymm-read.test (1428 of 2121)
PASS: lldb-api :: iohandler/unicode/TestUnicode.py (1429 of 2121)
UNSUPPORTED: lldb-api :: commands/expression/macros/TestMacros.py (1430 of 2121)
PASS: lldb-unit :: Utility/./UtilityTests/ArchSpecTest.TripleComponentsWereSpecified (1431 of 2121)
PASS: lldb-api :: functionalities/thread/concurrent_events/TestConcurrentCrashWithBreak.py (1432 of 2121)
PASS: lldb-unit :: Utility/./UtilityTests/StringExtractorTest.GetHexBytes (1433 of 2121)
PASS: lldb-api :: functionalities/thread/concurrent_events/TestConcurrentTwoWatchpointThreads.py (1434 of 2121)
PASS: lldb-unit :: Utility/./UtilityTests/GeneratorTest.Get (1435 of 2121)
PASS: lldb-unit :: Utility/./UtilityTests/StructuredDataTest.ParseJSONFromFile (1436 of 2121)
PASS: lldb-shell :: Driver/TestUseColor.test (1437 of 2121)
PASS: lldb-api :: python_api/sblaunchinfo/TestSBLaunchInfo.py (1438 of 2121)
PASS: lldb-shell :: ObjectFile/ELF/aarch64-relocations.yaml (1439 of 2121)
PASS: lldb-api :: lang/objc/forward-decl/TestForwardDecl.py (1440 of 2121)
PASS: lldb-unit :: UnwindAssembly/x86/./UnwindAssemblyx86Tests/Testx86AssemblyInspectionEngine.TestPushRBPWithREX (1441 of 2121)
PASS: lldb-unit :: Process/gdb-remote/./ProcessGdbRemoteTests/GDBRemoteCommunicationClientTest.SendStopTracePacket (1442 of 2121)
UNSUPPORTED: lldb-shell :: Register/aarch64-gp-read.test (1443 of 2121)
PASS: lldb-unit :: Symbol/./SymbolTests/LineEntryTest.GetSameLineContiguousAddressRangeNoInlines (1444 of 2121)
PASS: lldb-unit :: UnwindAssembly/ARM64/./Arm64InstEmulationTests/TestArm64InstEmulation.TestMediumDarwinFunction (1445 of 2121)
PASS: lldb-shell :: ObjectFile/MachO/symtab.yaml (1446 of 2121)
PASS: lldb-unit :: Language/Highlighting/./HighlighterTests/HighlighterTest.ClangCommas (1447 of 2121)
PASS: lldb-unit :: Utility/./UtilityTests/UriParserTest.BracketedHostnameWithColon (1448 of 2121)
PASS: lldb-unit :: ObjectFile/Breakpad/./ObjectFileBreakpadTests/FileRecord.parse (1449 of 2121)
PASS: lldb-api :: commands/expression/completion/TestExprCompletion.py (1450 of 2121)
PASS: lldb-shell :: SymbolFile/DWARF/dwarf5-index-is-used.cpp (1451 of 2121)
PASS: lldb-unit :: Symbol/./SymbolTests/TestClangASTImporter.RecordLayout (1452 of 2121)
PASS: lldb-unit :: Process/minidump/./LLDBMinidumpTests/MinidumpParserTest.GetArchitectureWindows (1453 of 2121)
PASS: lldb-api :: functionalities/thread/jump/TestThreadJump.py (1454 of 2121)
PASS: lldb-unit :: Symbol/./SymbolTests/TestTypeSystemClang.TestIsClangType (1455 of 2121)
PASS: lldb-api :: sample_test/TestSampleTest.py (1456 of 2121)
PASS: lldb-shell :: Commands/CommandScriptImmediateOutput/CommandScriptImmediateOutputFile.test (1457 of 2121)
PASS: lldb-api :: lang/cpp/char8_t/TestCxxChar8_t.py (1458 of 2121)
PASS: lldb-api :: python_api/value_var_update/TestValueVarUpdate.py (1459 of 2121)
PASS: lldb-unit :: Utility/./UtilityTests/Predicate.WaitForValueEqualTo (1460 of 2121)
PASS: lldb-unit :: UnwindAssembly/x86/./UnwindAssemblyx86Tests/Testx86AssemblyInspectionEngine.TestPopRBP (1461 of 2121)
PASS: lldb-unit :: ScriptInterpreter/Python/./ScriptInterpreterPythonTests/PythonDataObjectsTest.TestInstanceNameResolutionNoDot (1462 of 2121)
PASS: lldb-api :: lang/cpp/this/TestCPPThis.py (1463 of 2121)
PASS: lldb-unit :: Expression/./ExpressionTests/DWARFExpression.DW_OP_stack_value (1464 of 2121)
PASS: lldb-unit :: Utility/./UtilityTests/StreamTeeTest.Constructor2Streams (1465 of 2121)
PASS: lldb-api :: lang/objc/radar-9691614/TestObjCMethodReturningBOOL.py (1466 of 2121)
UNSUPPORTED: lldb-api :: commands/watchpoints/multi_watchpoint_slots/TestWatchpointMultipleSlots.py (1467 of 2121)
PASS: lldb-unit :: Core/./LLDBCoreTests/CommunicationTest.SynchronizeWhileClosing (1468 of 2121)
PASS: lldb-api :: functionalities/tsan/global_location/TestTsanGlobalLocation.py (1469 of 2121)
PASS: lldb-api :: lang/cpp/class_types/TestClassTypes.py (1470 of 2121)
PASS: lldb-unit :: Process/gdb-remote/./ProcessGdbRemoteTests/GDBRemoteClientBaseTest.SendContinueAndWait (1471 of 2121)
UNSUPPORTED: lldb-api :: commands/watchpoints/hello_watchlocation/TestWatchLocation.py (1472 of 2121)
PASS: lldb-api :: commands/expression/fixits/TestFixIts.py (1473 of 2121)
PASS: lldb-shell :: SymbolFile/DWARF/find-function-regex.cpp (1474 of 2121)
PASS: lldb-api :: commands/command/script_alias/TestCommandScriptAlias.py (1475 of 2121)
PASS: lldb-api :: functionalities/thread/concurrent_events/TestConcurrentWatchBreak.py (1476 of 2121)
PASS: lldb-unit :: UnwindAssembly/x86/./UnwindAssemblyx86Tests/Testx86AssemblyInspectionEngine.TestSimplex86_64Augmented (1477 of 2121)
PASS: lldb-api :: functionalities/postmortem/mach-core/TestMachCore.py (1478 of 2121)
PASS: lldb-unit :: Utility/./UtilityTests/RangeTest.ContainsRangeStartingFromZero (1479 of 2121)
PASS: lldb-api :: commands/target/create-deps/TestTargetCreateDeps.py (1480 of 2121)
PASS: lldb-api :: functionalities/breakpoint/breakpoint_ignore_count/TestBreakpointIgnoreCount.py (1481 of 2121)
PASS: lldb-unit :: Utility/./UtilityTests/StringListTest.ShiftStdString (1482 of 2121)
PASS: lldb-unit :: Core/./LLDBCoreTests/ModuleSpecTest.TestELFFile (1483 of 2121)
UNSUPPORTED: lldb-api :: tools/lldb-server/signal-filtering/TestGdbRemote_QPassSignals.py (1484 of 2121)
PASS: lldb-api :: commands/expression/two-files/TestObjCTypeQueryFromOtherCompileUnit.py (1485 of 2121)
UNSUPPORTED: lldb-api :: functionalities/darwin_log/filter/regex/activity/TestDarwinLogFilterRegexActivity.py (1486 of 2121)
PASS: lldb-unit :: Utility/./UtilityTests/ProcessInstanceInfo.Dump (1487 of 2121)
PASS: lldb-api :: functionalities/object-file/TestImageListMultiArchitecture.py (1488 of 2121)
PASS: lldb-api :: python_api/frame/inlines/TestInlinedFrame.py (1489 of 2121)
PASS: lldb-shell :: ObjectFile/MachO/lc_build_version_notools.yaml (1490 of 2121)
PASS: lldb-unit :: Language/Highlighting/./HighlighterTests/HighlighterTest.Keywords (1491 of 2121)
PASS: lldb-api :: functionalities/data-formatter/poarray/TestPrintObjectArray.py (1492 of 2121)
PASS: lldb-api :: functionalities/data-formatter/parray/TestPrintArray.py (1493 of 2121)
PASS: lldb-unit :: Process/minidump/./LLDBMinidumpTests/MinidumpParserTest.GetMemoryRegionInfoFromMemoryList (1494 of 2121)
PASS: lldb-unit :: Symbol/./SymbolTests/SymbolsTest.TerminateLocateExecutableSymbolFileForUnknownExecutableAndUnknownSymbolFile (1495 of 2121)
PASS: lldb-api :: lang/c/bitfields/TestBitfields.py (1496 of 2121)
PASS: lldb-api :: lang/cpp/modules-import/TestCXXModulesImport.py (1497 of 2121)
PASS: lldb-api :: lang/cpp/std-function-step-into-callable/TestStdFunctionStepIntoCallable.py (1498 of 2121)
PASS: lldb-api :: lang/objc/modules-update/TestClangModulesUpdate.py (1499 of 2121)
PASS: lldb-api :: lang/cpp/extern_c/TestExternCSymbols.py (1500 of 2121)
PASS: lldb-api :: functionalities/target_var/TestTargetVar.py (1501 of 2121)
PASS: lldb-shell :: SymbolFile/Breakpad/unwind-via-stack-cfi.test (1502 of 2121)
PASS: lldb-shell :: ObjectFile/PECOFF/section-types.yaml (1503 of 2121)
PASS: lldb-unit :: Utility/./UtilityTests/ArgsTest.TestTrailingBackslash (1504 of 2121)
PASS: lldb-unit :: ScriptInterpreter/Python/./ScriptInterpreterPythonTests/PythonDataObjectsTest.TestPythonListManipulation (1505 of 2121)
PASS: lldb-api :: lang/objc/modules-incomplete/TestIncompleteModules.py (1506 of 2121)
PASS: lldb-unit :: SymbolFile/NativePDB/./SymbolFileNativePDBTests/PDBFPOProgramToDWARFExpressionTests.UnknownOp (1507 of 2121)
PASS: lldb-api :: functionalities/tail_call_frames/disambiguate_tail_call_seq/TestDisambiguateTailCallSeq.py (1508 of 2121)
PASS: lldb-api :: commands/disassemble/basic/TestDisassembleBreakpoint.py (1509 of 2121)
PASS: lldb-api :: macosx/indirect_symbol/TestIndirectSymbols.py (1510 of 2121)
PASS: lldb-api :: functionalities/gdb_remote_client/TestPlatformClient.py (1511 of 2121)
PASS: lldb-unit :: Process/minidump/./LLDBMinidumpTests/MinidumpParserTest.GetMemory (1512 of 2121)
PASS: lldb-unit :: Utility/./UtilityTests/SubsystemRAIITest.SubsystemWithErrorSuccess (1513 of 2121)
PASS: lldb-unit :: Utility/./UtilityTests/XcodeSDKTest.GetCanonicalNameAndConstruct (1514 of 2121)
PASS: lldb-api :: functionalities/return-value/TestReturnValue.py (1515 of 2121)
PASS: lldb-api :: lang/cpp/static_methods/TestCPPStaticMethods.py (1516 of 2121)
PASS: lldb-shell :: Driver/LocalLLDBInit.test (1517 of 2121)
PASS: lldb-shell :: SymbolFile/DWARF/debug_rnglists-dwo.s (1518 of 2121)
PASS: lldb-api :: lang/objc/objc_direct-methods/TestObjCDirectMethods.py (1519 of 2121)
PASS: lldb-shell :: SymbolFile/DWARF/DW_TAG_variable-DW_AT_const_value.s (1520 of 2121)
PASS: lldb-api :: functionalities/data-formatter/data-formatter-stl/libcxx/bitset/TestDataFormatterLibcxxBitset.py (1521 of 2121)
PASS: lldb-api :: lang/objc/objc-struct-argument/TestObjCStructArgument.py (1522 of 2121)
PASS: lldb-api :: functionalities/thread/concurrent_events/TestConcurrentSignalDelayBreak.py (1523 of 2121)
PASS: lldb-unit :: Symbol/./SymbolTests/DWARFCallFrameInfoTest.Basic_eh (1524 of 2121)
PASS: lldb-api :: lang/cpp/accelerator-table/TestCPPAccelerator.py (1525 of 2121)
PASS: lldb-api :: lang/c/register_variables/TestRegisterVariables.py (1526 of 2121)
UNSUPPORTED: lldb-api :: benchmarks/startup/TestStartupDelays.py (1527 of 2121)
PASS: lldb-shell :: Quit/TestQuitExitCodeHexA.test (1528 of 2121)
PASS: lldb-shell :: SymbolFile/DWARF/find-variable-dwo.cpp (1529 of 2121)
PASS: lldb-unit :: Utility/./UtilityTests/FileSpecTest.RemoveLastPathComponent (1530 of 2121)
PASS: lldb-unit :: Utility/./UtilityTests/ScalarTest.RightShiftOperator (1531 of 2121)
PASS: lldb-shell :: SymbolFile/DWARF/debug-types-dwo-cross-reference.cpp (1532 of 2121)
PASS: lldb-api :: functionalities/source-map/TestTargetSourceMap.py (1533 of 2121)
PASS: lldb-unit :: Utility/./UtilityTests/RangeTest.LessThan (1534 of 2121)
PASS: lldb-shell :: SymbolFile/DWARF/dwp-debug-types.s (1535 of 2121)
PASS: lldb-api :: macosx/save_crashlog/TestSaveCrashlog.py (1536 of 2121)
PASS: lldb-api :: functionalities/data-formatter/data-formatter-advanced/TestDataFormatterAdv.py (1537 of 2121)
PASS: lldb-api :: functionalities/ubsan/basic/TestUbsanBasic.py (1538 of 2121)
PASS: lldb-api :: commands/expression/weak_symbols/TestWeakSymbols.py (1539 of 2121)
PASS: lldb-unit :: Expression/./ExpressionTests/DiagnosticManagerTest.GetStringBasic (1540 of 2121)
PASS: lldb-unit :: Process/gdb-remote/./ProcessGdbRemoteTests/GDBRemoteCommunicationServerTest.SendErrorResponse_UnimplementedError (1541 of 2121)
PASS: lldb-shell :: Settings/TestDisableColor.test (1542 of 2121)
PASS: lldb-unit :: Utility/./UtilityTests/StringListTest.GetMaxStringLengthEmpty (1543 of 2121)
PASS: lldb-shell :: SymbolFile/DWARF/dwp-separate-debug-file.cpp (1544 of 2121)
UNSUPPORTED: lldb-shell :: ScriptInterpreter/Lua/bindings.test (1545 of 2121)
PASS: lldb-unit :: Host/./HostTests/NativeProcessProtocolTest.ReadCStringFromMemory_MaxSize (1546 of 2121)
PASS: lldb-unit :: Symbol/./SymbolTests/TestTypeSystemClang.AddMethodToObjCObjectType (1547 of 2121)
PASS: lldb-api :: macosx/find-app-in-bundle/TestFindAppInBundle.py (1548 of 2121)
PASS: lldb-unit :: DataFormatter/./LLDBFormatterTests/StringPrinterTests.CxxASCII (1549 of 2121)
PASS: lldb-api :: functionalities/data-formatter/data-formatter-objc/TestDataFormatterObjCExpr.py (1550 of 2121)
PASS: lldb-api :: commands/expression/namespace_local_var_same_name_cpp_and_c/TestNamespaceLocalVarSameNameCppAndC.py (1551 of 2121)
PASS: lldb-shell :: SymbolFile/DWARF/debug_line-tombstone.s (1552 of 2121)
PASS: lldb-unit :: Utility/./UtilityTests/StringListTest.AppendStringCString (1553 of 2121)
PASS: lldb-api :: functionalities/data-formatter/typedef_array/TestTypedefArray.py (1554 of 2121)
PASS: lldb-unit :: Expression/./ExpressionTests/CppModuleConfigurationTest.Sysroot (1555 of 2121)
PASS: lldb-api :: lang/objc/objc-optimized/TestObjcOptimized.py (1556 of 2121)
UNSUPPORTED: lldb-shell :: Register/x86-64-zmm-read.test (1557 of 2121)
PASS: lldb-unit :: Utility/./UtilityTests/ArgsTest.ReplaceArgumentAtIndexFarOutOfRange (1558 of 2121)
PASS: lldb-unit :: Utility/./UtilityTests/ArgsTest.ReplaceArgumentAtIndexShort (1559 of 2121)
PASS: lldb-unit :: Expression/./ExpressionTests/DiagnosticManagerTest.AppendMessageNoDiag (1560 of 2121)
PASS: lldb-api :: tools/lldb-server/TestGdbRemoteExpeditedRegisters.py (1561 of 2121)
PASS: lldb-api :: python_api/section/TestSectionAPI.py (1562 of 2121)
PASS: lldb-unit :: Utility/./UtilityTests/StreamTest.AddressRangeInvalidRange (1563 of 2121)
PASS: lldb-api :: lang/cpp/stl/TestSTL.py (1564 of 2121)
PASS: lldb-unit :: Utility/./UtilityTests/BinaryStreamTest.PutSLEB128TwoBytes (1565 of 2121)
PASS: lldb-unit :: Utility/./UtilityTests/GeneratorTest.Create (1566 of 2121)
PASS: lldb-shell :: SymbolFile/DWARF/debug_loc_and_loclists.s (1567 of 2121)
PASS: lldb-api :: python_api/sbdata/TestSBData.py (1568 of 2121)
PASS: lldb-api :: macosx/thread_suspend/TestInternalThreadSuspension.py (1569 of 2121)
PASS: lldb-api :: lang/c/tls_globals/TestTlsGlobals.py (1570 of 2121)
UNSUPPORTED: lldb-shell :: SymbolFile/PDB/variables-locations.test (1571 of 2121)
PASS: lldb-unit :: debugserver/./debugserverTests/RNBSocket.LoopBackConnectIPv4 (1572 of 2121)
PASS: lldb-unit :: UnwindAssembly/x86/./UnwindAssemblyx86Tests/Testx86AssemblyInspectionEngine.TestDisassemblyMidFunctionEpilogues (1573 of 2121)
PASS: lldb-api :: commands/command/script/import/rdar-12586188/TestRdar12586188.py (1574 of 2121)
PASS: lldb-unit :: Symbol/./SymbolTests/PostfixExpression.ParseFPOProgram (1575 of 2121)
PASS: lldb-api :: commands/expression/import-std-module/shared_ptr-dbg-info-content/TestSharedPtrDbgInfoContentFromStdModule.py (1576 of 2121)
PASS: lldb-api :: functionalities/thread/concurrent_events/TestConcurrentWatchpointWithDelayWatchpointThreads.py (1577 of 2121)
PASS: lldb-unit :: Utility/./UtilityTests/StringListTest.AppendListCStringArrayEmpty (1578 of 2121)
PASS: lldb-api :: functionalities/signal/handle-abrt/TestHandleAbort.py (1579 of 2121)
PASS: lldb-unit :: Utility/./UtilityTests/StringExtractorTest.GetHexU8_Extra (1580 of 2121)
PASS: lldb-unit :: Utility/./UtilityTests/CompletionRequest.DuplicateFilteringWithComments (1581 of 2121)
PASS: lldb-unit :: Utility/./UtilityTests/FileSpecTest.GetPath (1582 of 2121)
PASS: lldb-api :: python_api/default-constructor/TestDefaultConstructorForAPIObjects.py (1583 of 2121)
PASS: lldb-unit :: Expression/./ExpressionTests/DiagnosticManagerTest.FixedExpression (1584 of 2121)
PASS: lldb-api :: tools/lldb-server/register-reading/TestGdbRemoteGPacket.py (1585 of 2121)
PASS: lldb-api :: functionalities/data-formatter/data-formatter-stl/libcxx/atomic/TestLibCxxAtomic.py (1586 of 2121)
PASS: lldb-unit :: Expression/./ExpressionTests/ClangHostTest.ComputeClangResourceDirectory (1587 of 2121)
PASS: lldb-api :: lang/objcxx/hide-runtime-values/TestObjCXXHideRuntimeValues.py (1588 of 2121)
PASS: lldb-api :: commands/expression/scoped_enums/TestScopedEnumType.py (1589 of 2121)
PASS: lldb-unit :: SymbolFile/NativePDB/./SymbolFileNativePDBTests/PDBFPOProgramToDWARFExpressionTests.UnresolvedDependentCyclicRegisterAssignmentReference (1590 of 2121)
PASS: lldb-unit :: ObjectFile/Breakpad/./ObjectFileBreakpadTests/StackWinRecord.parse (1591 of 2121)
PASS: lldb-shell :: Reproducer/TestReuseDirectory.test (1592 of 2121)
PASS: lldb-unit :: Symbol/./SymbolTests/TestTypeSystemClang.TestDisplayNameEmpty (1593 of 2121)
PASS: lldb-unit :: Utility/./UtilityTests/ProcessInstanceInfo.Yaml (1594 of 2121)
PASS: lldb-unit :: Target/./TargetTests/ModuleCacheTest.GetAndPutUuidExists (1595 of 2121)
PASS: lldb-shell :: BuildScript/script-args.test (1596 of 2121)
PASS: lldb-shell :: Breakpoint/single-file-split-dwarf.test (1597 of 2121)
PASS: lldb-api :: commands/expression/completion-in-lambda-and-unnamed-class/TestCompletionInLambdaAndUnnamedClass.py (1598 of 2121)
PASS: lldb-api :: lang/cpp/template-function/TestTemplateFunctions.py (1599 of 2121)
PASS: lldb-api :: commands/frame/select/TestFrameSelect.py (1600 of 2121)
PASS: lldb-unit :: Utility/./UtilityTests/UriParserTest.BracketedHostnameWithPortIPv4 (1601 of 2121)
PASS: lldb-unit :: UnwindAssembly/x86/./UnwindAssemblyx86Tests/Testx86AssemblyInspectionEngine.TestSpillRegToStackViaMOVi386 (1602 of 2121)
PASS: lldb-api :: lang/cpp/subst_template_type_param/TestSubstTemplateTypeParam.py (1603 of 2121)
PASS: lldb-unit :: Process/minidump/./LLDBMinidumpTests/MinidumpParserTest.GetThreadContext_x86_32_wow64 (1604 of 2121)
PASS: lldb-unit :: UnwindAssembly/x86/./UnwindAssemblyx86Tests/Testx86AssemblyInspectionEngine.TestPopR12 (1605 of 2121)
PASS: lldb-api :: tools/lldb-server/inferior-crash/TestGdbRemoteAbort.py (1606 of 2121)
PASS: lldb-api :: functionalities/breakpoint/breakpoint_command/TestBreakpointCommandsFromPython.py (1607 of 2121)
PASS: lldb-unit :: ScriptInterpreter/Python/./ScriptInterpreterPythonTests/PythonDataObjectsTest.TestPythonCallableCheck (1608 of 2121)
UNSUPPORTED: lldb-shell :: ScriptInterpreter/Lua/io.test (1609 of 2121)
PASS: lldb-unit :: Utility/./UtilityTests/StringListTest.JoinMultiCharSeparator (1610 of 2121)
PASS: lldb-unit :: SymbolFile/DWARF/./SymbolFileDWARFTests/XcodeSDKModuleTests.TestModuleGetXcodeSDK (1611 of 2121)
PASS: lldb-unit :: Target/./TargetTests/ExecutionContextTest.GetByteOrderProcess (1612 of 2121)
PASS: lldb-unit :: UnwindAssembly/x86/./UnwindAssemblyx86Tests/Testx86AssemblyInspectionEngine.TestPushEAX (1613 of 2121)
PASS: lldb-unit :: Utility/./UtilityTests/ScalarTest.APIntConstructor (1614 of 2121)
PASS: lldb-api :: commands/frame/diagnose/bad-reference/TestBadReference.py (1615 of 2121)
PASS: lldb-unit :: Utility/./UtilityTests/StringExtractorTest.GetU32BigEndian (1616 of 2121)
PASS: lldb-api :: macosx/dyld-trie-symbols/TestDyldTrieSymbols.py (1617 of 2121)
PASS: lldb-shell :: Commands/command-script-import.test (1618 of 2121)
PASS: lldb-unit :: ScriptInterpreter/Python/./ScriptInterpreterPythonTests/PythonDataObjectsTest.TestScript (1619 of 2121)
PASS: lldb-unit :: ScriptInterpreter/Python/./ScriptInterpreterPythonTests/PythonDataObjectsTest.TestPythonIntegerToStructuredInteger (1620 of 2121)
PASS: lldb-unit :: Utility/./UtilityTests/StreamTeeTest.Assignment (1621 of 2121)
UNSUPPORTED: lldb-api :: lang/cpp/static_members/TestCPPStaticMembers.py (1622 of 2121)
PASS: lldb-api :: functionalities/breakpoint/debugbreak/TestDebugBreak.py (1623 of 2121)
PASS: lldb-api :: types/TestCharTypeExpr.py (1624 of 2121)
PASS: lldb-unit :: UnwindAssembly/x86/./UnwindAssemblyx86Tests/Testx86AssemblyInspectionEngine.TestSimple32bitFrameFunction (1625 of 2121)
PASS: lldb-unit :: Symbol/./SymbolTests/TestClangASTImporter.ImportInvalidType (1626 of 2121)
PASS: lldb-unit :: ScriptInterpreter/Python/./ScriptInterpreterPythonTests/PythonDataObjectsTest.TestPythonTupleToStructuredList (1627 of 2121)
PASS: lldb-unit :: Utility/./UtilityTests/NameMatchesTest.Equals (1628 of 2121)
PASS: lldb-shell :: ObjectFile/ELF/build-id-case.yaml (1629 of 2121)
PASS: lldb-api :: macosx/queues/TestQueues.py (1630 of 2121)
PASS: lldb-unit :: SymbolFile/NativePDB/./SymbolFileNativePDBTests/PDBFPOProgramToDWARFExpressionTests.InvalidAssignmentSingle (1631 of 2121)
PASS: lldb-shell :: Breakpoint/debug_rnglist_rlestartend.test (1632 of 2121)
PASS: lldb-unit :: Process/gdb-remote/./ProcessGdbRemoteTests/GDBRemoteCommunicationClientTest.ReadRegister (1633 of 2121)
PASS: lldb-api :: functionalities/gdb_remote_client/TestJLink6Armv7RegisterDefinition.py (1634 of 2121)
PASS: lldb-unit :: Language/Highlighting/./HighlighterTests/HighlighterTest.ClangOperators (1635 of 2121)
PASS: lldb-api :: lang/objc/foundation/TestConstStrings.py (1636 of 2121)
PASS: lldb-api :: functionalities/tail_call_frames/unambiguous_sequence/TestUnambiguousTailCalls.py (1637 of 2121)
PASS: lldb-unit :: Utility/./UtilityTests/EnvironmentTest.EnvpConstruction (1638 of 2121)
PASS: lldb-unit :: Platform/./LLDBPlatformTests/PlatformDarwinTest.FindComponentInPath (1639 of 2121)
UNSUPPORTED: lldb-api :: functionalities/thread/create_during_step/TestCreateDuringStep.py (1640 of 2121)
PASS: lldb-api :: lang/objc/rdar-10967107/TestRdar10967107.py (1641 of 2121)
PASS: lldb-unit :: Utility/./UtilityTests/RangeTest.ContainsRange (1642 of 2121)
UNSUPPORTED: lldb-shell :: Expr/TestIRMemoryMapWindows.test (1643 of 2121)
PASS: lldb-unit :: Utility/./UtilityTests/Flags.AnySet (1644 of 2121)
PASS: lldb-api :: lang/c/vla/TestVLA.py (1645 of 2121)
PASS: lldb-api :: lang/c/function_types/TestFunctionTypes.py (1646 of 2121)
PASS: lldb-api :: commands/expression/import_builtin_fileid/TestImportBuiltinFileID.py (1647 of 2121)
PASS: lldb-unit :: UnwindAssembly/x86/./UnwindAssemblyx86Tests/Testx86AssemblyInspectionEngine.TestPushR15 (1648 of 2121)
PASS: lldb-api :: functionalities/data-formatter/data-formatter-objc/TestDataFormatterObjNSException.py (1649 of 2121)
PASS: lldb-api :: commands/process/attach/attach_denied/TestAttachDenied.py (1650 of 2121)
PASS: lldb-unit :: Utility/./UtilityTests/RecordReplayTest.InstrumentedBarRef (1651 of 2121)
PASS: lldb-unit :: Expression/./ExpressionTests/DiagnosticManagerTest.GetStringMultiline (1652 of 2121)
UNSUPPORTED: lldb-api :: functionalities/breakpoint/hardware_breakpoints/write_memory_with_hw_breakpoint/TestWriteMemoryWithHWBreakpoint.py (1653 of 2121)
PASS: lldb-unit :: Expression/./ExpressionTests/CppModuleConfigurationTest.Xcode (1654 of 2121)
PASS: lldb-unit :: Utility/./UtilityTests/UriParserTest.BracketedHostnamePort (1655 of 2121)
PASS: lldb-api :: lang/objc/objc-property/TestObjCProperty.py (1656 of 2121)
PASS: lldb-unit :: ScriptInterpreter/Python/./ScriptInterpreterPythonTests/PythonDataObjectsTest.TestPythonStringToStructuredString (1657 of 2121)
UNSUPPORTED: lldb-shell :: SymbolFile/PDB/udt-layout.test (1658 of 2121)
PASS: lldb-unit :: UnwindAssembly/x86/./UnwindAssemblyx86Tests/Testx86AssemblyInspectionEngine.TestPushESI (1659 of 2121)
PASS: lldb-api :: sanity/TestModuleCacheSanity.py (1660 of 2121)
PASS: lldb-shell :: Settings/TestModuleCacheSanity.test (1661 of 2121)
PASS: lldb-api :: commands/expression/dont_allow_jit/TestAllowJIT.py (1662 of 2121)
PASS: lldb-unit :: Utility/./UtilityTests/FileSpecTest.CopyByAppendingPathComponent (1663 of 2121)
PASS: lldb-unit :: Utility/./UtilityTests/SerializationRountripTest.SerializeDeserializeCStringNull (1664 of 2121)
PASS: lldb-shell :: SymbolFile/DWARF/childless-compile-unit.s (1665 of 2121)
PASS: lldb-unit :: Core/./LLDBCoreTests/UniqueCStringMap.NoDefaultConstructor (1666 of 2121)
PASS: lldb-api :: functionalities/pointer_num_children/TestPointerNumChildren.py (1667 of 2121)
PASS: lldb-shell :: Commands/command-regex-delete.test (1668 of 2121)
PASS: lldb-api :: functionalities/data-formatter/data-formatter-proper-plurals/TestFormattersOneIsSingular.py (1669 of 2121)
PASS: lldb-api :: commands/expression/unicode-in-variable/TestUnicodeInVariable.py (1670 of 2121)
PASS: lldb-unit :: Utility/./UtilityTests/Flags.Clear (1671 of 2121)
PASS: lldb-shell :: ScriptInterpreter/Python/sb_address_exception.test (1672 of 2121)
PASS: lldb-unit :: Utility/./UtilityTests/LogTest.Unregister (1673 of 2121)
UNSUPPORTED: lldb-api :: lang/cpp/function-template-parameter-pack/TestFunctionTemplateParameterPack.py (1674 of 2121)
PASS: lldb-unit :: Process/gdb-remote/./ProcessGdbRemoteTests/GDBRemoteCommunicationClientTest.GetMemoryRegionInfoInvalidResponse (1675 of 2121)
PASS: lldb-api :: macosx/macCatalyst/TestMacCatalyst.py (1676 of 2121)
PASS: lldb-api :: commands/watchpoints/multiple_threads/TestWatchpointMultipleThreads.py (1677 of 2121)
PASS: lldb-unit :: Utility/./UtilityTests/DataExtractorTest.GetDoubleUnaligned (1678 of 2121)
PASS: lldb-unit :: Process/gdb-remote/./ProcessGdbRemoteTests/GDBRemoteClientBaseTest.SendContinueAndAsyncSignal (1679 of 2121)
PASS: lldb-api :: lang/cpp/wchar_t/TestCxxWCharT.py (1680 of 2121)
PASS: lldb-api :: commands/quit/TestQuit.py (1681 of 2121)
PASS: lldb-unit :: Utility/./UtilityTests/Flags.GetBitSize (1682 of 2121)
PASS: lldb-unit :: Language/CLanguages/./LanguageCLanguagesTests/CLanguages.LookupCLanguagesByLanguageType (1683 of 2121)
PASS: lldb-api :: commands/watchpoints/watchpoint_commands/condition/TestWatchpointConditionCmd.py (1684 of 2121)
PASS: lldb-unit :: Interpreter/./InterpreterTests/CompletionTest.FileCompletionAbsolute (1685 of 2121)
PASS: lldb-unit :: Utility/./UtilityTests/DataExtractorTest.GetFloatUnaligned (1686 of 2121)
PASS: lldb-unit :: Host/./HostTests/SocketTest.UDPGetConnectURI (1687 of 2121)
PASS: lldb-unit :: Utility/./UtilityTests/FileSpecTest.EqualDotsPosix (1688 of 2121)
PASS: lldb-unit :: Host/./HostTests/NativeProcessProtocolTest.SetBreakpointFailWrite (1689 of 2121)
PASS: lldb-api :: commands/expression/static-initializers/TestStaticInitializers.py (1690 of 2121)
PASS: lldb-unit :: Utility/./UtilityTests/OptionsWithRawTest.SingleWhitespaceInput (1691 of 2121)
PASS: lldb-unit :: Utility/./UtilityTests/UUIDTest.RelationalOperators (1692 of 2121)
PASS: lldb-unit :: Language/Highlighting/./HighlighterTests/HighlighterTest.ClangCursorPos (1693 of 2121)
PASS: lldb-unit :: Utility/./UtilityTests/StreamTest.PutCString (1694 of 2121)
PASS: lldb-api :: lang/c/local_variables/TestLocalVariables.py (1695 of 2121)
PASS: lldb-unit :: Utility/./UtilityTests/StringListTest.InsertStringAtIndexEnd (1696 of 2121)
PASS: lldb-unit :: Utility/./UtilityTests/RangeTest.NotEqualInvalid (1697 of 2121)
PASS: lldb-unit :: Utility/./UtilityTests/StreamTest.SetIndentLevel (1698 of 2121)
PASS: lldb-unit :: Utility/./UtilityTests/BinaryStreamTest.PutULEB128NineBytes (1699 of 2121)
PASS: lldb-unit :: Utility/./UtilityTests/EventTest.DumpEventDataBytes (1700 of 2121)
PASS: lldb-api :: functionalities/signal/TestSendSignal.py (1701 of 2121)
PASS: lldb-api :: lang/cpp/typeof/TestTypeOfDeclTypeExpr.py (1702 of 2121)
PASS: lldb-api :: lang/cpp/dynamic-value-same-basename/TestDynamicValueSameBase.py (1703 of 2121)
PASS: lldb-api :: functionalities/unwind/sigtramp/TestSigtrampUnwind.py (1704 of 2121)
PASS: lldb-shell :: ObjectFile/ELF/PT_LOAD-overlap-section.yaml (1705 of 2121)
PASS: lldb-unit :: Utility/./UtilityTests/StreamTeeTest.SetStreamAtIndexOutOfBounds (1706 of 2121)
PASS: lldb-unit :: UnwindAssembly/x86/./UnwindAssemblyx86Tests/Testx86AssemblyInspectionEngine.TestPopRBPWithREX (1707 of 2121)
PASS: lldb-api :: functionalities/data-formatter/var-in-aggregate-misuse/TestVarInAggregateMisuse.py (1708 of 2121)
PASS: lldb-unit :: Utility/./UtilityTests/XcodeSDKTest.SDKSupportsSwift (1709 of 2121)
UNSUPPORTED: lldb-api :: functionalities/darwin_log/format/TestDarwinLogMessageFormat.py (1710 of 2121)
PASS: lldb-shell :: Reproducer/TestProcessList.test (1711 of 2121)
PASS: lldb-api :: lang/cpp/diamond/TestDiamond.py (1712 of 2121)
PASS: lldb-api :: lang/objc/self/TestObjCSelf.py (1713 of 2121)
PASS: lldb-api :: functionalities/tail_call_frames/disambiguate_call_site/TestDisambiguateCallSite.py (1714 of 2121)
PASS: lldb-unit :: Utility/./UtilityTests/StringListTest.JoinThree (1715 of 2121)
PASS: lldb-shell :: SymbolFile/DWARF/debug_line-relative_path.s (1716 of 2121)
PASS: lldb-unit :: Utility/./UtilityTests/RangeTest.DoesAdjoinOrIntersect (1717 of 2121)
PASS: lldb-api :: functionalities/data-formatter/builtin-formats/TestBuiltinFormats.py (1718 of 2121)
PASS: lldb-unit :: Symbol/./SymbolTests/TestTypeSystemClang.TestGetBasicTypeFromEnum (1719 of 2121)
PASS: lldb-shell :: ObjectFile/ELF/short-build-id.yaml (1720 of 2121)
PASS: lldb-unit :: ObjectFile/Breakpad/./ObjectFileBreakpadTests/InfoRecord.parse (1721 of 2121)
PASS: lldb-unit :: Utility/./UtilityTests/UriParserTest.BadPort2 (1722 of 2121)
PASS: lldb-unit :: Utility/./UtilityTests/LogChannelTest.Disable (1723 of 2121)
PASS: lldb-api :: functionalities/tail_call_frames/cross_dso/TestCrossDSOTailCalls.py (1724 of 2121)
PASS: lldb-shell :: Commands/command-backtrace.test (1725 of 2121)
PASS: lldb-unit :: Host/./HostTests/NativeProcessProtocolTest.SetBreakpointFailVerify (1726 of 2121)
PASS: lldb-unit :: Target/./TargetTests/MCBasedABI.MapRegisterName (1727 of 2121)
PASS: lldb-api :: lang/cpp/signed_types/TestSignedTypes.py (1728 of 2121)
PASS: lldb-unit :: Utility/./UtilityTests/ArgsTest.BareSingleQuote (1729 of 2121)
PASS: lldb-unit :: Utility/./UtilityTests/StreamTest.PutHex32ByteOrderBig (1730 of 2121)
PASS: lldb-unit :: UnwindAssembly/x86/./UnwindAssemblyx86Tests/Testx86AssemblyInspectionEngine.TestPopR13 (1731 of 2121)
PASS: lldb-api :: functionalities/data-formatter/nsdictionarysynth/TestNSDictionarySynthetic.py (1732 of 2121)
PASS: lldb-shell :: SymbolFile/DWARF/debug-types-missing-signature.test (1733 of 2121)
PASS: lldb-api :: macosx/thread-names/TestInterruptThreadNames.py (1734 of 2121)
PASS: lldb-api :: functionalities/value_md5_crash/TestValueMD5Crash.py (1735 of 2121)
PASS: lldb-unit :: Language/Highlighting/./HighlighterTests/HighlighterTest.ClangIdentifiers (1736 of 2121)
PASS: lldb-unit :: Expression/./ExpressionTests/DWARFExpression.DW_OP_piece (1737 of 2121)
PASS: lldb-api :: functionalities/thread/concurrent_events/TestConcurrentBreakpointDelayBreakpointOneSignal.py (1738 of 2121)
PASS: lldb-unit :: Symbol/./SymbolTests/TestTypeSystemClang.TestGetTypeClassTypeOf (1739 of 2121)
PASS: lldb-unit :: Utility/./UtilityTests/StringListTest.InsertStringAtIndexStart (1740 of 2121)
PASS: lldb-api :: lang/cpp/stl/TestStdCXXDisassembly.py (1741 of 2121)
PASS: lldb-api :: lang/objc/objc-new-syntax/TestObjCNewSyntaxLiteral.py (1742 of 2121)
PASS: lldb-api :: commands/expression/context-object-objc/TestContextObjectObjc.py (1743 of 2121)
PASS: lldb-api :: functionalities/data-formatter/data-formatter-stl/libcxx/initializerlist/TestInitializerList.py (1744 of 2121)
PASS: lldb-unit :: Utility/./UtilityTests/FileSpecTest.OperatorBool (1745 of 2121)
PASS: lldb-unit :: Symbol/./SymbolTests/TestTypeSystemClang.TestGetEnumIntegerTypeInvalid (1746 of 2121)
PASS: lldb-shell :: Commands/CommandScriptImmediateOutput/CommandScriptImmediateOutputConsole.test (1747 of 2121)
PASS: lldb-api :: tools/lldb-vscode/breakpoint/TestVSCode_setFunctionBreakpoints.py (1748 of 2121)
PASS: lldb-unit :: Utility/./UtilityTests/RangeTest.Union (1749 of 2121)
PASS: lldb-shell :: ObjectFile/ELF/minidebuginfo-corrupt-xz.yaml (1750 of 2121)
PASS: lldb-unit :: Utility/./UtilityTests/ArchSpecTest.YAML (1751 of 2121)
PASS: lldb-unit :: Utility/./UtilityTests/BinaryStreamTest.PutULEB128MaxValue (1752 of 2121)
PASS: lldb-unit :: UnwindAssembly/x86/./UnwindAssemblyx86Tests/Testx86AssemblyInspectionEngine.TestPopR15 (1753 of 2121)
PASS: lldb-api :: lang/c/complex/TestComplexC99.py (1754 of 2121)
PASS: lldb-api :: functionalities/inline-stepping/TestInlineStepping.py (1755 of 2121)
PASS: lldb-api :: macosx/safe-to-func-call/TestSafeFuncCalls.py (1756 of 2121)
PASS: lldb-api :: commands/expression/test/TestExprs.py (1757 of 2121)
PASS: lldb-api :: functionalities/thread/concurrent_events/TestConcurrentCrashWithSignal.py (1758 of 2121)
PASS: lldb-unit :: Process/minidump/./LLDBMinidumpTests/RegisterContextMinidump.ConvertMinidumpContext_x86_64 (1759 of 2121)
PASS: lldb-unit :: Utility/./UtilityTests/VMRange.SetEndAddress (1760 of 2121)
PASS: lldb-api :: functionalities/dynamic_value_child_count/TestDynamicValueChildCount.py (1761 of 2121)
PASS: lldb-api :: commands/expression/import-std-module/sysroot/TestStdModuleSysroot.py (1762 of 2121)
PASS: lldb-api :: commands/platform/file/close/TestPlatformFileClose.py (1763 of 2121)
UNSUPPORTED: lldb-api :: linux/mix-dwo-and-regular-objects/TestMixedDwarfBinary.py (1764 of 2121)
PASS: lldb-unit :: Symbol/./SymbolTests/TestClangASTImporter.MetadataPropagation (1765 of 2121)
PASS: lldb-unit :: Utility/./UtilityTests/ReproducerTest.SetReplay (1766 of 2121)
PASS: lldb-api :: functionalities/thread/concurrent_events/TestConcurrentTwoBreakpointsOneDelaySignal.py (1767 of 2121)
PASS: lldb-api :: functionalities/data-formatter/data-formatter-stl/libcxx/vector/TestDataFormatterLibcxxVector.py (1768 of 2121)
PASS: lldb-unit :: Utility/./UtilityTests/StreamTeeTest.DefaultConstructor (1769 of 2121)
PASS: lldb-api :: macosx/universal/TestUniversal.py (1770 of 2121)
PASS: lldb-api :: commands/session/history/TestSessionHistory.py (1771 of 2121)
PASS: lldb-unit :: Process/minidump/./LLDBMinidumpTests/MinidumpParserTest.GetPid (1772 of 2121)
PASS: lldb-api :: commands/expression/persistent_ptr_update/TestPersistentPtrUpdate.py (1773 of 2121)
PASS: lldb-unit :: Utility/./UtilityTests/UriParserTest.Empty (1774 of 2121)
XFAIL: lldb-shell :: Register/x86-mm-xmm-write.test (1775 of 2121)
PASS: lldb-api :: commands/expression/multiline-completion/TestMultilineCompletion.py (1776 of 2121)
PASS: lldb-unit :: Utility/./UtilityTests/ScalarTest.LongLongAssigmentOperator (1777 of 2121)
PASS: lldb-unit :: Expression/./ExpressionTests/DiagnosticManagerTest.GetStringNoDiags (1778 of 2121)
PASS: lldb-unit :: SymbolFile/DWARF/./SymbolFileDWARFTests/SymbolFileDWARFTests.TestAbilitiesForDWARF (1779 of 2121)
PASS: lldb-api :: tools/lldb-server/TestGdbRemoteHostInfo.py (1780 of 2121)
PASS: lldb-api :: lang/cpp/frame-var-anon-unions/TestFrameVariableAnonymousUnions.py (1781 of 2121)
PASS: lldb-api :: commands/expression/codegen-crash-typedefdecl-not-in_declcontext/TestCodegenCrashTypedefDeclNotInDeclContext.py (1782 of 2121)
PASS: lldb-unit :: Target/./TargetTests/PathMappingListTest.RemapRoot (1783 of 2121)
UNSUPPORTED: lldb-api :: functionalities/darwin_log/filter/exact_match/activity-chain/TestDarwinLogFilterMatchActivityChain.py (1784 of 2121)
PASS: lldb-unit :: Utility/./UtilityTests/ScalarTest.ComparisonFloat (1785 of 2121)
PASS: lldb-unit :: Process/gdb-remote/./ProcessGdbRemoteTests/GDBRemoteCommunicationClientTest.GetMemoryRegionInfo (1786 of 2121)
PASS: lldb-api :: functionalities/data-formatter/pyobjsynthprovider/TestPyObjSynthProvider.py (1787 of 2121)
PASS: lldb-api :: lang/objc/objc-runtime-ivars/TestRuntimeIvars.py (1788 of 2121)
PASS: lldb-unit :: Host/./HostTests/FileSystemTest.MakeAbsolute (1789 of 2121)
UNSUPPORTED: lldb-shell :: SymbolFile/PDB/function-nested-block.test (1790 of 2121)
PASS: lldb-api :: lang/objc/bitfield_ivars/TestBitfieldIvars.py (1791 of 2121)
UNSUPPORTED: lldb-api :: commands/register/register/intel_xtended_registers/mpx_offset_intersection/TestMPXOffsetIntersection.py (1792 of 2121)
PASS: lldb-api :: functionalities/data-formatter/cstring-utf8-summary/TestCstringUnicode.py (1793 of 2121)
PASS: lldb-unit :: Host/./HostTests/SocketAddressTest.GetAddressInfo (1794 of 2121)
PASS: lldb-unit :: Utility/./UtilityTests/StringListTest.SplitIntoLinesEmpty (1795 of 2121)
PASS: lldb-api :: lang/c/anonymous/TestAnonymous.py (1796 of 2121)
PASS: lldb-shell :: ObjectFile/PECOFF/basic-info.yaml (1797 of 2121)
PASS: lldb-api :: python_api/lldbutil/iter/TestLLDBIterator.py (1798 of 2121)
PASS: lldb-unit :: Utility/./UtilityTests/StreamTest.AddressRangeSize (1799 of 2121)
PASS: lldb-api :: functionalities/show_location/TestShowLocationDwarf5.py (1800 of 2121)
PASS: lldb-shell :: Reproducer/Functionalities/TestDataFormatter.test (1801 of 2121)
PASS: lldb-api :: functionalities/thread/thread_specific_break/TestThreadSpecificBreakpoint.py (1802 of 2121)
PASS: lldb-unit :: Utility/./UtilityTests/FileSpecTest.Match (1803 of 2121)
PASS: lldb-shell :: SymbolFile/Breakpad/line-table-discontinuous-file-ids.test (1804 of 2121)
PASS: lldb-unit :: Utility/./UtilityTests/UUIDTest.SetFromStringRef (1805 of 2121)
PASS: lldb-api :: lang/objc/blocks/TestObjCIvarsInBlocks.py (1806 of 2121)
PASS: lldb-unit :: UnwindAssembly/x86/./UnwindAssemblyx86Tests/Testx86AssemblyInspectionEngine.TestPopEBP (1807 of 2121)
UNSUPPORTED: lldb-api :: functionalities/unwind/standard/TestStandardUnwind.py (1808 of 2121)
PASS: lldb-unit :: Utility/./UtilityTests/RangeTest.ClearWithStarAddress (1809 of 2121)
PASS: lldb-unit :: Utility/./UtilityTests/StreamTest.AddressSize (1810 of 2121)
PASS: lldb-unit :: debugserver/./debugserverTests/RNBSocket.AnyListen (1811 of 2121)
PASS: lldb-unit :: Symbol/./SymbolTests/TestTypeSystemClang.TestBuiltinTypeForEncodingAndBitSize (1812 of 2121)
PASS: lldb-api :: commands/command/nested_alias/TestNestedAlias.py (1813 of 2121)
PASS: lldb-api :: commands/expression/import-std-module/conflicts/TestStdModuleWithConflicts.py (1814 of 2121)
PASS: lldb-api :: functionalities/data-formatter/data-formatter-stl/libcxx/list/TestDataFormatterLibcxxList.py (1815 of 2121)
PASS: lldb-unit :: Utility/./UtilityTests/RecordReplayTest.InstrumentedFooSameThis (1816 of 2121)
PASS: lldb-api :: functionalities/data-formatter/data-formatter-objc/TestDataFormatterObjCKVO.py (1817 of 2121)
PASS: lldb-unit :: Language/Highlighting/./HighlighterTests/HighlighterTest.ClangCursorPosInOtherToken (1818 of 2121)
UNSUPPORTED: lldb-api :: arm/breakpoint-thumb-codesection/TestBreakpointThumbCodesection.py (1819 of 2121)
PASS: lldb-unit :: Utility/./UtilityTests/UserIDResolver.GetUserName (1820 of 2121)
PASS: lldb-unit :: Utility/./UtilityTests/UriParserTest.Minimal (1821 of 2121)
PASS: lldb-unit :: Utility/./UtilityTests/NameMatchesTest.StartsWith (1822 of 2121)
PASS: lldb-api :: commands/expression/regression-access-function-template-in-record/TestRegressionAccessFunctionTemplateInRecord.py (1823 of 2121)
PASS: lldb-shell :: Register/x86-64-gp-read.test (1824 of 2121)
PASS: lldb-shell :: ObjectFile/ELF/section-permissions.yaml (1825 of 2121)
PASS: lldb-unit :: Utility/./UtilityTests/ConstStringTest.UpdateMangledCounterpart (1826 of 2121)
PASS: lldb-api :: commands/expression/import-std-module/list/TestListFromStdModule.py (1827 of 2121)
PASS: lldb-api :: functionalities/data-formatter/data-formatter-smart-array/TestDataFormatterSmartArray.py (1828 of 2121)
PASS: lldb-unit :: Core/./LLDBCoreTests/RichManglingContextTest.IPDRealloc (1829 of 2121)
PASS: lldb-api :: commands/frame/language/TestGuessLanguage.py (1830 of 2121)
PASS: lldb-api :: functionalities/abbreviation/TestCommonShortSpellings.py (1831 of 2121)
PASS: lldb-unit :: Target/./TargetTests/PathMappingListTest.RelativeTests (1832 of 2121)
PASS: lldb-api :: commands/expression/ir-interpreter-phi-nodes/TestIRInterpreterPHINodes.py (1833 of 2121)
PASS: lldb-api :: lang/cpp/alignas_base_class/TestAlignAsBaseClass.py (1834 of 2121)
PASS: lldb-unit :: Target/./TargetTests/MemoryRegionInfoTest.Formatv (1835 of 2121)
PASS: lldb-api :: commands/watchpoints/watchpoint_count/TestWatchpointCount.py (1836 of 2121)
PASS: lldb-api :: python_api/process/TestProcessAPI.py (1837 of 2121)
PASS: lldb-unit :: Utility/./UtilityTests/CompletionRequest.Constructor (1838 of 2121)
PASS: lldb-api :: commands/expression/import-std-module/deque-dbg-info-content/TestDbgInfoContentDequeFromStdModule.py (1839 of 2121)
PASS: lldb-shell :: SymbolFile/DWARF/debug_ranges-missing-section.s (1840 of 2121)
PASS: lldb-shell :: Breakpoint/dummy-target.test (1841 of 2121)
UNSUPPORTED: lldb-shell :: SymbolFile/PDB/variables.test (1842 of 2121)
PASS: lldb-unit :: Host/./HostTests/NativeProcessProtocolTest.SetBreakpointFailRead (1843 of 2121)
PASS: lldb-shell :: SymbolFile/NativePDB/ast-methods.cpp (1844 of 2121)
PASS: lldb-unit :: Language/Highlighting/./HighlighterTests/HighlighterTest.DefaultHighlighterWithCursorOutOfBounds (1845 of 2121)
PASS: lldb-unit :: Host/./HostTests/FileActionTest.Open (1846 of 2121)
PASS: lldb-shell :: SymbolFile/DWARF/win-i386-line-table.s (1847 of 2121)
PASS: lldb-api :: functionalities/data-formatter/data-formatter-stl/libcxx/queue/TestDataFormatterLibcxxQueue.py (1848 of 2121)
PASS: lldb-unit :: Utility/./UtilityTests/SerializationRountripTest.SerializeDeserializeObjectReference (1849 of 2121)
PASS: lldb-unit :: Utility/./UtilityTests/BinaryStreamTest.PutULEB128ThreeBytes (1850 of 2121)
PASS: lldb-unit :: UnwindAssembly/x86/./UnwindAssemblyx86Tests/Testx86AssemblyInspectionEngine.TestSubRSP (1851 of 2121)
PASS: lldb-unit :: UnwindAssembly/x86/./UnwindAssemblyx86Tests/Testx86AssemblyInspectionEngine.TestAddESP (1852 of 2121)
PASS: lldb-api :: functionalities/rerun/TestRerun.py (1853 of 2121)
PASS: lldb-api :: commands/expression/completion-crash-incomplete-record/TestCompletionCrashIncompleteRecord.py (1854 of 2121)
UNSUPPORTED: lldb-shell :: SymbolFile/NativePDB/local-variables.cpp (1855 of 2121)
PASS: lldb-shell :: Reproducer/TestCrash.test (1856 of 2121)
PASS: lldb-api :: lang/cpp/class_types/TestClassTypesDisassembly.py (1857 of 2121)
PASS: lldb-api :: functionalities/data-formatter/synthcapping/TestSyntheticCapping.py (1858 of 2121)
PASS: lldb-api :: functionalities/data-formatter/language_category_updates/TestDataFormatterLanguageCategoryUpdates.py (1859 of 2121)
PASS: lldb-unit :: DataFormatter/./LLDBFormatterTests/TypeMatcherTests.ExactName (1860 of 2121)
PASS: lldb-unit :: Host/./HostTests/SocketTest.DomainListenConnectAccept (1861 of 2121)
PASS: lldb-unit :: UnwindAssembly/x86/./UnwindAssemblyx86Tests/Testx86AssemblyInspectionEngine.TestPushEBX (1862 of 2121)
PASS: lldb-unit :: Utility/./UtilityTests/FileSpecTest.PrependPathComponent (1863 of 2121)
PASS: lldb-unit :: Utility/./UtilityTests/StreamTest.PutRawBytesToLittleEndian (1864 of 2121)
PASS: lldb-unit :: UnwindAssembly/x86/./UnwindAssemblyx86Tests/Testx86AssemblyInspectionEngine.TestPushEBP (1865 of 2121)
PASS: lldb-unit :: Utility/./UtilityTests/ScalarTest.TruncOrExtendTo (1866 of 2121)
PASS: lldb-unit :: Utility/./UtilityTests/TimerTest.CategoryTimesNested (1867 of 2121)
PASS: lldb-unit :: Process/gdb-remote/./ProcessGdbRemoteTests/GDBRemoteCommunicationClientTest.GetQOffsets (1868 of 2121)
PASS: lldb-shell :: SymbolFile/DWARF/find-basic-variable.cpp (1869 of 2121)
PASS: lldb-api :: functionalities/data-formatter/data-formatter-script/TestDataFormatterScript.py (1870 of 2121)
PASS: lldb-api :: macosx/profile_vrs_detach/TestDetachVrsProfile.py (1871 of 2121)
PASS: lldb-unit :: Utility/./UtilityTests/StringExtractorTest.GetHexU8_Exact_NoEof (1872 of 2121)
PASS: lldb-shell :: ObjectFile/ELF/PT_LOAD-overlap-PT_INTERP.yaml (1873 of 2121)
PASS: lldb-api :: lang/cpp/exceptions/TestCPPExceptionBreakpoints.py (1874 of 2121)
UNSUPPORTED: lldb-shell :: ScriptInterpreter/Lua/lua.test (1875 of 2121)
PASS: lldb-shell :: Minidump/breakpad-symbols.test (1876 of 2121)
PASS: lldb-shell :: Reproducer/Functionalities/TestImageList.test (1877 of 2121)
PASS: lldb-api :: commands/expression/po_verbosity/TestPoVerbosity.py (1878 of 2121)
PASS: lldb-shell :: Commands/command-regex-unalias.test (1879 of 2121)
PASS: lldb-shell :: SymbolFile/DWARF/debug_loc-aslr.s (1880 of 2121)
PASS: lldb-api :: functionalities/data-formatter/nssetsynth/TestNSSetSynthetic.py (1881 of 2121)
PASS: lldb-api :: functionalities/data-formatter/data-formatter-objc/TestDataFormatterObjCCF.py (1882 of 2121)
PASS: lldb-unit :: Utility/./UtilityTests/DataExtractorTest.GetDouble (1883 of 2121)
PASS: lldb-api :: functionalities/data-formatter/data-formatter-stl/libcxx/iterator/TestDataFormatterLibccIterator.py (1884 of 2121)
PASS: lldb-unit :: Utility/./UtilityTests/StringExtractorTest.GetHexU8_Extra_NoEof (1885 of 2121)
PASS: lldb-api :: functionalities/thread/concurrent_events/TestConcurrentCrashWithWatchpoint.py (1886 of 2121)
PASS: lldb-unit :: tools/lldb-server/tests/./LLDBServerTests/TestBase.LaunchModePreservesEnvironment (1887 of 2121)
PASS: lldb-unit :: Language/Highlighting/./HighlighterTests/HighlighterTest.ClangComments (1888 of 2121)
PASS: lldb-api :: functionalities/data-formatter/data-formatter-stl/libcxx/multimap/TestDataFormatterLibccMultiMap.py (1889 of 2121)
PASS: lldb-unit :: Utility/./UtilityTests/XcodeSDKTest.ParseTest (1890 of 2121)
PASS: lldb-unit :: Utility/./UtilityTests/StringExtractorTest.GetHexU8_Underflow_NoEof (1891 of 2121)
PASS: lldb-unit :: Utility/./UtilityTests/StreamTest.PutHex64ByteOrderLittle (1892 of 2121)
PASS: lldb-api :: lang/cpp/inlines/TestInlines.py (1893 of 2121)
UNSUPPORTED: lldb-api :: lang/objc/objc-dynamic-value/TestObjCDynamicValue.py (1894 of 2121)
PASS: lldb-unit :: UnwindAssembly/x86/./UnwindAssemblyx86Tests/Testx86AssemblyInspectionEngine.Test32bitFramelessSmallStackFrame (1895 of 2121)
PASS: lldb-unit :: Utility/./UtilityTests/StreamTest.ShiftOperatorChars (1896 of 2121)
PASS: lldb-unit :: Target/./TargetTests/RemoteAwarePlatformTest.TestResolveExecutabelOnClientByPlatform (1897 of 2121)
UNSUPPORTED: lldb-api :: commands/expression/call-restarts/TestCallThatRestarts.py (1898 of 2121)
PASS: lldb-api :: functionalities/unwind/zeroth_frame/TestZerothFrame.py (1899 of 2121)
UNSUPPORTED: lldb-api :: functionalities/breakpoint/hardware_breakpoints/hardware_breakpoint_on_multiple_threads/TestHWBreakMultiThread.py (1900 of 2121)
PASS: lldb-api :: python_api/watchpoint/TestSetWatchpoint.py (1901 of 2121)
PASS: lldb-shell :: Driver/TestFile.test (1902 of 2121)
PASS: lldb-unit :: Process/gdb-remote/./ProcessGdbRemoteTests/GDBRemoteClientBaseTest.SendPacketAndReceiveResponseWithOutputSupport (1903 of 2121)
UNSUPPORTED: lldb-api :: linux/add-symbols/TestTargetSymbolsAddCommand.py (1904 of 2121)
PASS: lldb-unit :: Utility/./UtilityTests/SerializationRountripTest.SerializeDeserializeCString (1905 of 2121)
PASS: lldb-unit :: Utility/./UtilityTests/UriParserTest.BracketedHostnameWithPortIPv6 (1906 of 2121)
PASS: lldb-unit :: Utility/./UtilityTests/UriParserTest.MinimalPortPath (1907 of 2121)
PASS: lldb-unit :: Utility/./UtilityTests/StringExtractorTest.DecodeHexU8_Exact (1908 of 2121)
PASS: lldb-unit :: ScriptInterpreter/Python/./ScriptInterpreterPythonTests/PythonDataObjectsTest.TestExceptions (1909 of 2121)
PASS: lldb-unit :: UnwindAssembly/x86/./UnwindAssemblyx86Tests/Testx86AssemblyInspectionEngine.TestSimple64bitFrameFunction (1910 of 2121)
PASS: lldb-unit :: Utility/./UtilityTests/StringListTest.JoinEmpty (1911 of 2121)
PASS: lldb-api :: terminal/TestSTTYBeforeAndAfter.py (1912 of 2121)
PASS: lldb-unit :: Utility/./UtilityTests/FileSpecTest.Equal (1913 of 2121)
PASS: lldb-unit :: Utility/./UtilityTests/StringListTest.ForRangeEmpty (1914 of 2121)
PASS: lldb-unit :: Utility/./UtilityTests/ArgsTest.GetArgumentArrayRef (1915 of 2121)
PASS: lldb-unit :: Utility/./UtilityTests/DeserializerTest.HasData (1916 of 2121)
UNSUPPORTED: lldb-shell :: SymbolFile/PDB/vbases.test (1917 of 2121)
UNSUPPORTED: lldb-shell :: SymbolFile/DWARF/DW_TAG_GNU_call_site-DW_AT_low_pc.s (1918 of 2121)
PASS: lldb-api :: commands/gui/basic/TestGuiBasic.py (1919 of 2121)
PASS: lldb-unit :: UnwindAssembly/x86/./UnwindAssemblyx86Tests/Testx86AssemblyInspectionEngine.Test32bitFramelessBigStackFrame (1920 of 2121)
PASS: lldb-unit :: Utility/./UtilityTests/StringListTest.AppendList (1921 of 2121)
PASS: lldb-unit :: Utility/./UtilityTests/StringListTest.ForRange (1922 of 2121)
PASS: lldb-unit :: Process/gdb-remote/./ProcessGdbRemoteTests/GDBRemoteCommunicationServerTest.SendErrorResponse_Status (1923 of 2121)
UNSUPPORTED: lldb-shell :: Unwind/eh-frame-small-fde.test (1924 of 2121)
PASS: lldb-api :: lang/cpp/nsimport/TestCppNsImport.py (1925 of 2121)
PASS: lldb-unit :: Language/Highlighting/./HighlighterTests/HighlighterTest.ClangTrailingBackslashBeforeNewline (1926 of 2121)
PASS: lldb-shell :: SymbolFile/Breakpad/line-table-mixed-path-styles.test (1927 of 2121)
PASS: lldb-api :: functionalities/gdb_remote_client/TestRestartBug.py (1928 of 2121)
PASS: lldb-api :: lang/objc/objc-ivar-protocols/TestIvarProtocols.py (1929 of 2121)
TIMEOUT: lldb-api :: macosx/simulator/TestSimulatorPlatform.py (1930 of 2121)
******************** TEST 'lldb-api :: macosx/simulator/TestSimulatorPlatform.py' FAILED ********************
Script:
--
/usr/local/Frameworks/Python.framework/Versions/3.7/bin/python3.7 /Users/buildslave/jenkins/workspace/lldb-cmake/llvm-project/lldb/test/API/dotest.py --arch x86_64 -s /Users/buildslave/jenkins/workspace/lldb-cmake/lldb-build/lldb-test-traces -S nm -u CXXFLAGS -u CFLAGS --codesign-identity - --server /Users/buildslave/jenkins/workspace/lldb-cmake/lldb-build/./bin/debugserver --arch x86_64 --build-dir /Users/buildslave/jenkins/workspace/lldb-cmake/lldb-build/lldb-test-build.noindex -s=/Users/buildslave/jenkins/workspace/lldb-cmake/test/logs -t --env TERM=vt100 --env LLVM_LIBS_DIR=/Users/buildslave/jenkins/workspace/lldb-cmake/lldb-build/./lib --build-dir /Users/buildslave/jenkins/workspace/lldb-cmake/lldb-build/lldb-test-build.noindex --lldb-module-cache-dir /Users/buildslave/jenkins/workspace/lldb-cmake/lldb-build/lldb-test-build.noindex/module-cache-lldb/lldb-api --clang-module-cache-dir /Users/buildslave/jenkins/workspace/lldb-cmake/lldb-build/lldb-test-build.noindex/module-cache-clang/lldb-api --executable /Users/buildslave/jenkins/workspace/lldb-cmake/lldb-build/./bin/lldb --compiler /Users/buildslave/jenkins/workspace/lldb-cmake/lldb-build/./bin/clang --dsymutil /Users/buildslave/jenkins/workspace/lldb-cmake/lldb-build/./bin/dsymutil --filecheck /Users/buildslave/jenkins/workspace/lldb-cmake/lldb-build/./bin/FileCheck --yaml2obj /Users/buildslave/jenkins/workspace/lldb-cmake/lldb-build/./bin/yaml2obj --lldb-libs-dir /Users/buildslave/jenkins/workspace/lldb-cmake/lldb-build/./lib /Users/buildslave/jenkins/workspace/lldb-cmake/llvm-project/lldb/test/API/macosx/simulator -p TestSimulatorPlatform.py
--
Exit Code: -9
Timeout: Reached timeout of 600 seconds

Hide Details

Command Output (stdout): -- lldb version 12.0.99 clang revision 31e5f7120bdd2f76337686d9d169b1c00e6ee69c llvm revision 31e5f7120bdd2f76337686d9d169b1c00e6ee69c

Hide Details

-- Command Output (stderr): --

Hide Details

Session logs for test failures/errors/unexpected successes will go into directory '/Users/buildslave/jenkins/workspace/lldb-cmake/test/logs' Change dir to: /Users/buildslave/jenkins/workspace/lldb-cmake/llvm-project/lldb/test/API/macosx/simulator runCmd: settings clear -all output:

Hide Details

runCmd: settings set symbols.enable-external-lookup false output:

Hide Details

runCmd: settings set target.inherit-tcc true output:

Hide Details

runCmd: settings set target.auto-apply-fixits false output:

Hide Details

runCmd: settings set plugin.process.gdb-remote.packet-timeout 60 output:

Hide Details

runCmd: settings set symbols.clang-modules-cache-path "/Users/buildslave/jenkins/workspace/lldb-cmake/lldb-build/lldb-test-build.noindex/module-cache-lldb/lldb-api" output:

Hide Details

runCmd: settings set use-color false output:

Hide Details

runCmd: setting set target.prefer-dynamic-value no-dynamic-values output:

Hide Details

runCmd: log enable gdb-remote packets -f /Users/buildslave/jenkins/workspace/lldb-cmake/lldb-build/lldb-test-build.noindex/macosx/simulator/TestSimulatorPlatform.test_ios/packets.log output:

Hide Details

runCmd: image list -b -t output: [ 0] a.out x86_64-apple-ios13.5.0-simulator [ 1] dyld x86_64-apple-macosx10.15.0 [ 2] dyld_sim x86_64-apple-ios13.5.0-simulator [ 3] libc++.1.dylib x86_64-apple-ios13.5.0-simulator [ 4] libSystem.B.dylib x86_64-apple-ios13.5.0-simulator [ 5] libc++abi.dylib x86_64-apple-ios13.5.0-simulator [ 6] libcache.dylib x86_64-apple-ios13.5.0-simulator [ 7] libcommonCrypto.dylib x86_64-apple-ios13.5.0-simulator [ 8] libcompiler_rt.dylib x86_64-apple-ios13.5.0-simulator [ 9] libcopyfile.dylib x86_64-apple-ios13.5.0-simulator [ 10] libcorecrypto.dylib x86_64-apple-ios13.5.0-simulator [ 11] libdispatch.dylib x86_64-apple-ios13.5.0-simulator [ 12] libdyld.dylib x86_64-apple-ios13.5.0-simulator [ 13] liblaunch.dylib x86_64-apple-ios13.5.0-simulator [ 14] libmacho.dylib x86_64-apple-ios13.5.0-simulator [ 15] libremovefile.dylib x86_64-apple-ios13.5.0-simulator [ 16] libsystem_asl.dylib x86_64-apple-ios13.5.0-simulator [ 17] libsystem_blocks.dylib x86_64-apple-ios13.5.0-simulator [ 18] libsystem_c.dylib x86_64-apple-ios13.5.0-simulator [ 19] libsystem_configuration.dylib x86_64-apple-ios13.5.0-simulator [ 20] libsystem_containermanager.dylib x86_64-apple-ios13.5.0-simulator [ 21] libsystem_coreservices.dylib x86_64-apple-ios13.5.0-simulator [ 22] libsystem_darwin.dylib x86_64-apple-ios13.5.0-simulator [ 23] libsystem_dnssd.dylib x86_64-apple-ios13.5.0-simulator [ 24] libsystem_featureflags.dylib x86_64-apple-ios13.5.0-simulator [ 25] libsystem_info.dylib x86_64-apple-ios13.5.0-simulator [ 26] libsystem_m.dylib x86_64-apple-ios13.5.0-simulator [ 27] libsystem_malloc.dylib x86_64-apple-ios13.5.0-simulator [ 28] libsystem_notify.dylib x86_64-apple-ios13.5.0-simulator [ 29] libsystem_sandbox.dylib x86_64-apple-ios13.5.0-simulator [ 30] libsystem_sim_kernel.dylib x86_64-apple-ios13.5.0-simulator [ 31] libsystem_sim_platform.dylib x86_64-apple-ios13.5.0-simulator [ 32] libsystem_sim_pthread.dylib x86_64-apple-ios13.5.0-simulator [ 33] libsystem_trace.dylib x86_64-apple-ios13.5.0-simulator [ 34] libunwind.dylib x86_64-apple-ios13.5.0-simulator [ 35] libxpc.dylib x86_64-apple-ios13.5.0-simulator [ 36] libsystem_sim_pthread_host.dylib x86_64-apple-ios13.5.0-simulator [ 37] libsystem_sim_platform_host.dylib x86_64-apple-ios13.5.0-simulator [ 38] libsystem_sim_kernel_host.dylib x86_64-apple-ios13.5.0-simulator [ 39] libsystem_kernel.dylib x86_64-apple-macosx10.15.0-simulator(0x00007fff51b5a000) [ 40] libobjc.A.dylib x86_64-apple-ios13.5.0-simulator [ 41] libsystem_platform.dylib x86_64-apple-macosx10.15.0-simulator(0x00007fff51bfd000) [ 42] libsystem_pthread.dylib x86_64-apple-macosx10.15.0-simulator(0x00007fff51c06000)

Hide Details

Hide Details

Expecting pattern: a\.out x86_64-apple-ios.*-simulator Matched

Hide Details

<bound method SBProcess.Kill of <lldb.SBProcess; proxy of <Swig Object of type 'lldb::SBProcess *' at 0x10ef38960> >>: success

Hide Details

PASS: LLDB (/Users/buildslave/jenkins/workspace/lldb-cmake/lldb-build/bin/clang-x86_64) :: test_ios (TestSimulatorPlatform.TestSimulatorPlatformLaunching) runCmd: settings clear -all output:

Hide Details

runCmd: settings set symbols.enable-external-lookup false output:

Hide Details

runCmd: settings set target.inherit-tcc true output:

Hide Details

runCmd: settings set target.auto-apply-fixits false output:

Hide Details

runCmd: settings set plugin.process.gdb-remote.packet-timeout 60 output:

Hide Details

runCmd: settings set symbols.clang-modules-cache-path "/Users/buildslave/jenkins/workspace/lldb-cmake/lldb-build/lldb-test-build.noindex/module-cache-lldb/lldb-api" output:

Hide Details

runCmd: settings set use-color false output:

Hide Details

runCmd: setting set target.prefer-dynamic-value no-dynamic-values output:

Hide Details

UNSUPPORTED: LLDB (/Users/buildslave/jenkins/workspace/lldb-cmake/lldb-build/bin/clang-x86_64) :: test_ios_backdeploy_apple_silicon (TestSimulatorPlatform.TestSimulatorPlatformLaunching) (skipping due to the following parameter(s): architecture) runCmd: settings clear -all output:

Hide Details

runCmd: settings set symbols.enable-external-lookup false output:

Hide Details

runCmd: settings set target.inherit-tcc true output:

Hide Details

runCmd: settings set target.auto-apply-fixits false output:

Hide Details

runCmd: settings set plugin.process.gdb-remote.packet-timeout 60 output:

Hide Details

runCmd: settings set symbols.clang-modules-cache-path "/Users/buildslave/jenkins/workspace/lldb-cmake/lldb-build/lldb-test-build.noindex/module-cache-lldb/lldb-api" output:

Hide Details

runCmd: settings set use-color false output:

Hide Details

runCmd: setting set target.prefer-dynamic-value no-dynamic-values output:

Hide Details

runCmd: log enable gdb-remote packets -f /Users/buildslave/jenkins/workspace/lldb-cmake/lldb-build/lldb-test-build.noindex/macosx/simulator/TestSimulatorPlatform.test_ios_backdeploy_x86/packets.log output:

Hide Details

runCmd: image list -b -t output: [ 0] a.out x86_64-apple-ios13.0.0-simulator [ 1] dyld x86_64-apple-macosx10.15.0 [ 2] dyld_sim x86_64-apple-ios13.5.0-simulator [ 3] libc++.1.dylib x86_64-apple-ios13.5.0-simulator [ 4] libSystem.B.dylib x86_64-apple-ios13.5.0-simulator [ 5] libc++abi.dylib x86_64-apple-ios13.5.0-simulator [ 6] libcache.dylib x86_64-apple-ios13.5.0-simulator [ 7] libcommonCrypto.dylib x86_64-apple-ios13.5.0-simulator [ 8] libcompiler_rt.dylib x86_64-apple-ios13.5.0-simulator [ 9] libcopyfile.dylib x86_64-apple-ios13.5.0-simulator [ 10] libcorecrypto.dylib x86_64-apple-ios13.5.0-simulator [ 11] libdispatch.dylib x86_64-apple-ios13.5.0-simulator [ 12] libdyld.dylib x86_64-apple-ios13.5.0-simulator [ 13] liblaunch.dylib x86_64-apple-ios13.5.0-simulator [ 14] libmacho.dylib x86_64-apple-ios13.5.0-simulator [ 15] libremovefile.dylib x86_64-apple-ios13.5.0-simulator [ 16] libsystem_asl.dylib x86_64-apple-ios13.5.0-simulator [ 17] libsystem_blocks.dylib x86_64-apple-ios13.5.0-simulator [ 18] libsystem_c.dylib x86_64-apple-ios13.5.0-simulator [ 19] libsystem_configuration.dylib x86_64-apple-ios13.5.0-simulator [ 20] libsystem_containermanager.dylib x86_64-apple-ios13.5.0-simulator [ 21] libsystem_coreservices.dylib x86_64-apple-ios13.5.0-simulator [ 22] libsystem_darwin.dylib x86_64-apple-ios13.5.0-simulator [ 23] libsystem_dnssd.dylib x86_64-apple-ios13.5.0-simulator [ 24] libsystem_featureflags.dylib x86_64-apple-ios13.5.0-simulator [ 25] libsystem_info.dylib x86_64-apple-ios13.5.0-simulator [ 26] libsystem_m.dylib x86_64-apple-ios13.5.0-simulator [ 27] libsystem_malloc.dylib x86_64-apple-ios13.5.0-simulator [ 28] libsystem_notify.dylib x86_64-apple-ios13.5.0-simulator [ 29] libsystem_sandbox.dylib x86_64-apple-ios13.5.0-simulator [ 30] libsystem_sim_kernel.dylib x86_64-apple-ios13.5.0-simulator [ 31] libsystem_sim_platform.dylib x86_64-apple-ios13.5.0-simulator [ 32] libsystem_sim_pthread.dylib x86_64-apple-ios13.5.0-simulator [ 33] libsystem_trace.dylib x86_64-apple-ios13.5.0-simulator [ 34] libunwind.dylib x86_64-apple-ios13.5.0-simulator [ 35] libxpc.dylib x86_64-apple-ios13.5.0-simulator [ 36] libsystem_sim_pthread_host.dylib x86_64-apple-ios13.5.0-simulator [ 37] libsystem_sim_platform_host.dylib x86_64-apple-ios13.5.0-simulator [ 38] libsystem_sim_kernel_host.dylib x86_64-apple-ios13.5.0-simulator [ 39] libsystem_kernel.dylib x86_64-apple-macosx10.15.0-simulator(0x00007fff51b5a000) [ 40] libobjc.A.dylib x86_64-apple-ios13.5.0-simulator [ 41] libsystem_platform.dylib x86_64-apple-macosx10.15.0-simulator(0x00007fff51bfd000) [ 42] libsystem_pthread.dylib x86_64-apple-macosx10.15.0-simulator(0x00007fff51c06000)

Hide Details

Hide Details

--

Hide Details

******************** UNSUPPORTED: lldb-api :: functionalities/darwin_log/filter/regex/category/TestDarwinLogFilterRegexCategory.py (1931 of 2121) PASS: lldb-unit :: Utility/./UtilityTests/ArgsTest.TestQuotedTrailingBackslash (1932 of 2121) PASS: lldb-unit :: Core/./LLDBCoreTests/SourceFileCache.FindSourceFileNotFound (1933 of 2121) PASS: lldb-api :: tools/lldb-vscode/step/TestVSCode_step.py (1934 of 2121) PASS: lldb-api :: functionalities/optimized_code/TestNoASanExceptionAfterEvalOP_piece.py (1935 of 2121) PASS: lldb-shell :: Driver/TestSingleQuote.test (1936 of 2121) PASS: lldb-api :: lang/objc/ptr_refs/TestPtrRefsObjC.py (1937 of 2121) PASS: lldb-unit :: Utility/./UtilityTests/RangeDataVector.FindEntryThatContains_Overlap (1938 of 2121) PASS: lldb-shell :: Unwind/thread-step-out-ret-addr-check.test (1939 of 2121) PASS: lldb-api :: linux/builtin_trap/TestBuiltinTrap.py (1940 of 2121) PASS: lldb-shell :: SymbolFile/NativePDB/ast-functions.cpp (1941 of 2121) PASS: lldb-unit :: Expression/./ExpressionTests/DiagnosticManagerTest.HasFixits (1942 of 2121) PASS: lldb-shell :: Breakpoint/debug_addrx.test (1943 of 2121) PASS: lldb-api :: commands/expression/unwind_expression/TestUnwindExpression.py (1944 of 2121) UNSUPPORTED: lldb-shell :: Breakpoint/case-insensitive.test (1945 of 2121) PASS: lldb-unit :: Utility/./UtilityTests/DataExtractorTest.GetMaxU64 (1946 of 2121) PASS: lldb-api :: commands/statistics/basic/TestStats.py (1947 of 2121) PASS: lldb-unit :: Utility/./UtilityTests/LogChannelTest.EnableOptions (1948 of 2121) PASS: lldb-unit :: Utility/./UtilityTests/OptionsWithRawTest.WhitespaceSuffix (1949 of 2121) PASS: lldb-shell :: SymbolFile/NativePDB/bitfields.cpp (1950 of 2121) PASS: lldb-unit :: Utility/./UtilityTests/StringListTest.Join (1951 of 2121) PASS: lldb-api :: functionalities/data-formatter/synthupdate/TestSyntheticFilterRecompute.py (1952 of 2121) PASS: lldb-api :: commands/expression/import-std-module/unique_ptr-dbg-info-content/TestUniquePtrDbgInfoContent.py (1953 of 2121) UNSUPPORTED: lldb-shell :: SymbolFile/PDB/calling-conventions.test (1954 of 2121) PASS: lldb-shell :: Commands/command-source.test (1955 of 2121) PASS: lldb-api :: lang/cpp/dynamic-value/TestDynamicValue.py (1956 of 2121) PASS: lldb-unit :: Utility/./UtilityTests/Flags.Reset (1957 of 2121) PASS: lldb-api :: lang/objc/objc-new-syntax/TestObjCNewSyntaxDictionary.py (1958 of 2121) PASS: lldb-api :: commands/expression/import-std-module/deque-basic/TestDequeFromStdModule.py (1959 of 2121) PASS: lldb-unit :: ObjectFile/Breakpad/./ObjectFileBreakpadTests/ModuleRecord.parse (1960 of 2121) PASS: lldb-api :: lang/cpp/breakpoint_in_member_func_w_non_primitive_params/TestBreakpointInMemberFuncWNonPrimitiveParams.py (1961 of 2121) PASS: lldb-api :: lang/c/strings/TestCStrings.py (1962 of 2121) PASS: lldb-api :: lang/cpp/unicode-literals/TestUnicodeLiterals.py (1963 of 2121) PASS: lldb-unit :: Process/gdb-remote/./ProcessGdbRemoteTests/GDBRemoteCommunicationServerTest.SendErrorResponse_ErrorList (1964 of 2121) PASS: lldb-unit :: Symbol/./SymbolTests/TestTypeSystemClang.TestGetBasicTypeFromName (1965 of 2121) PASS: lldb-api :: lang/c/global_variables/TestGlobalVariables.py (1966 of 2121) PASS: lldb-api :: lang/objc/objc-builtin-types/TestObjCBuiltinTypes.py (1967 of 2121) PASS: lldb-unit :: API/./APITests/SBCommandInterpreterTest.SingleWordCommand (1968 of 2121) PASS: lldb-api :: commands/watchpoints/watchpoint_disable/TestWatchpointDisable.py (1969 of 2121) PASS: lldb-api :: functionalities/data-formatter/data-formatter-disabling/TestDataFormatterDisabling.py (1970 of 2121) UNSUPPORTED: lldb-shell :: ScriptInterpreter/Lua/command_script_import.test (1971 of 2121) PASS: lldb-unit :: Expression/./ExpressionTests/DiagnosticManagerTest.PutStringMultiple (1972 of 2121) PASS: lldb-api :: functionalities/data-formatter/data-formatter-stl/libcxx/variant/TestDataFormatterLibcxxVariant.py (1973 of 2121) PASS: lldb-api :: commands/expression/import-std-module/shared_ptr/TestSharedPtrFromStdModule.py (1974 of 2121) PASS: lldb-unit :: UnwindAssembly/x86/./UnwindAssemblyx86Tests/Testx86AssemblyInspectionEngine.Test64bitFramelessBigStackFrame (1975 of 2121) PASS: lldb-api :: python_api/sbvalue_persist/TestSBValuePersist.py (1976 of 2121) UNSUPPORTED: lldb-api :: tools/lldb-server/TestGdbRemote_vContThreads.py (1977 of 2121) PASS: lldb-api :: commands/expression/import-std-module/unique_ptr/TestUniquePtrFromStdModule.py (1978 of 2121) PASS: lldb-unit :: Expression/./ExpressionTests/DWARFExpression.DW_OP_convert (1979 of 2121) PASS: lldb-api :: functionalities/thread/create_after_attach/TestCreateAfterAttach.py (1980 of 2121) PASS: lldb-unit :: Symbol/./SymbolTests/TestTypeSystemClang.TestGetTypeClassTypeOfExpr (1981 of 2121) UNSUPPORTED: lldb-api :: functionalities/data-formatter/data-formatter-stl/libstdcpp/unique_ptr/TestDataFormatterStdUniquePtr.py (1982 of 2121) PASS: lldb-api :: functionalities/data-formatter/data-formatter-stl/libcxx/tuple/TestDataFormatterLibcxxTuple.py (1983 of 2121) PASS: lldb-unit :: SymbolFile/NativePDB/./SymbolFileNativePDBTests/PDBFPOProgramToDWARFExpressionTests.InvalidOpBinary (1984 of 2121) PASS: lldb-api :: functionalities/target-new-solib-notifications/TestModuleLoadedNotifys.py (1985 of 2121) PASS: lldb-shell :: Expr/TestMultilineExpr.test (1986 of 2121) PASS: lldb-unit :: UnwindAssembly/x86/./UnwindAssemblyx86Tests/Testx86AssemblyInspectionEngine.TestStackRealign32BitDisp_x86_64 (1987 of 2121) PASS: lldb-api :: commands/expression/calculator_mode/TestCalculatorMode.py (1988 of 2121) PASS: lldb-api :: functionalities/data-formatter/compactvectors/TestCompactVectors.py (1989 of 2121) PASS: lldb-unit :: Core/./LLDBCoreTests/ModuleSpecTest.TestCOFFFile (1990 of 2121) PASS: lldb-unit :: Utility/./UtilityTests/RegularExpression.Empty (1991 of 2121) PASS: lldb-shell :: SymbolFile/DWARF/find-inline-method.s (1992 of 2121) PASS: lldb-unit :: Utility/./UtilityTests/StringExtractorTest.InitEmpty (1993 of 2121) PASS: lldb-api :: lang/objc/ivar-IMP/TestObjCiVarIMP.py (1994 of 2121) PASS: lldb-api :: commands/watchpoints/watchpoint_set_command/TestWatchLocationWithWatchSet.py (1995 of 2121) PASS: lldb-unit :: Symbol/./SymbolTests/TestClangASTImporter.MetadataPropagationIndirectImport (1996 of 2121) PASS: lldb-api :: lang/cpp/scope/TestCppScope.py (1997 of 2121) PASS: lldb-api :: commands/expression/pr35310/TestExprsBug35310.py (1998 of 2121) PASS: lldb-api :: functionalities/data-formatter/data-formatter-objc/TestDataFormatterObjCNSError.py (1999 of 2121) PASS: lldb-unit :: Process/minidump/./LLDBMinidumpTests/MinidumpParserTest.GetMemoryRegionInfo (2000 of 2121) PASS: lldb-api :: tools/lldb-server/commandline/TestStubReverseConnect.py (2001 of 2121) PASS: lldb-api :: commands/expression/import-std-module/weak_ptr-dbg-info-content/TestDbgInfoContentWeakPtrFromStdModule.py (2002 of 2121) PASS: lldb-unit :: Utility/./UtilityTests/RegularExpression.Valid (2003 of 2121) PASS: lldb-api :: functionalities/breakpoint/address_breakpoints/TestBadAddressBreakpoints.py (2004 of 2121) PASS: lldb-unit :: ScriptInterpreter/Python/./ScriptInterpreterPythonTests/PythonDataObjectsTest.TestResetting (2005 of 2121) PASS: lldb-unit :: Utility/./UtilityTests/LogChannelTest.Enable (2006 of 2121) PASS: lldb-api :: functionalities/breakpoint/breakpoint_hit_count/TestBreakpointHitCount.py (2007 of 2121) PASS: lldb-api :: functionalities/gdb_remote_client/TestRegDefinitionInParts.py (2008 of 2121) PASS: lldb-unit :: Utility/./UtilityTests/StringExtractorTest.GetHexBytes_FullString (2009 of 2121) PASS: lldb-unit :: ScriptInterpreter/Python/./ScriptInterpreterPythonTests/PythonDataObjectsTest.TestRun (2010 of 2121) PASS: lldb-shell :: SymbolFile/DWARF/debug_aranges-empty-section.s (2011 of 2121) PASS: lldb-shell :: SymbolFile/NativePDB/global-classes.cpp (2012 of 2121) UNSUPPORTED: lldb-api :: tools/lldb-vscode/disconnect/TestVSCode_disconnect.py (2013 of 2121) PASS: lldb-unit :: ScriptInterpreter/Python/./ScriptInterpreterPythonTests/PythonDataObjectsTest.TestPythonInteger (2014 of 2121) PASS: lldb-api :: lang/objc/foundation/TestObjCMethodsString.py (2015 of 2121) PASS: lldb-api :: commands/expression/radar_9673664/TestExprHelpExamples.py (2016 of 2121) UNSUPPORTED: lldb-api :: functionalities/darwin_log/filter/regex/activity-chain/TestDarwinLogFilterRegexActivityChain.py (2017 of 2121) PASS: lldb-api :: functionalities/thread/concurrent_events/TestConcurrentWatchBreakDelay.py (2018 of 2121) PASS: lldb-unit :: Utility/./UtilityTests/DataExtractorTest.GetSLEB128_bit63 (2019 of 2121) PASS: lldb-unit :: Symbol/./SymbolTests/TestTypeSystemClang.TemplateArguments (2020 of 2121) UNSUPPORTED: lldb-shell :: ScriptInterpreter/Lua/independent_state.test (2021 of 2121) PASS: lldb-api :: functionalities/thread/backtrace_all/TestBacktraceAll.py (2022 of 2121) PASS: lldb-unit :: Utility/./UtilityTests/FileSpecTest.FileAndDirectoryComponents (2023 of 2121) PASS: lldb-api :: lang/c/set_values/TestSetValues.py (2024 of 2121) PASS: lldb-unit :: ObjectFile/ELF/./ObjectFileELFTests/ObjectFileELFTest.GetSymtab_NoSymEntryPointArmThumbAddressClass (2025 of 2121) PASS: lldb-unit :: Utility/./UtilityTests/BinaryStreamTest.PutULEB128OneByte (2026 of 2121) PASS: lldb-shell :: SymbolFile/DWARF/dwarf5-atomic.s (2027 of 2121) PASS: lldb-api :: functionalities/data-formatter/data-formatter-stl/libcxx/forward_list/TestDataFormatterLibcxxForwardList.py (2028 of 2121) PASS: lldb-api :: lang/cpp/template-specialization-type/TestTemplateSpecializationType.py (2029 of 2121) PASS: lldb-api :: api/check_public_api_headers/TestPublicAPIHeaders.py (2030 of 2121) PASS: lldb-shell :: SymbolFile/NativePDB/disassembly.cpp (2031 of 2121) PASS: lldb-unit :: Interpreter/./InterpreterTests/OptionArgParserTest.toChar (2032 of 2121) PASS: lldb-unit :: Symbol/./SymbolTests/PostfixExpression.ParseOneExpression (2033 of 2121) PASS: lldb-api :: commands/breakpoint/set/func-regex/TestBreakpointRegexError.py (2034 of 2121) PASS: lldb-api :: python_api/function_symbol/TestDisasmAPI.py (2035 of 2121) PASS: lldb-shell :: SymbolFile/Breakpad/line-table.test (2036 of 2121) PASS: lldb-api :: functionalities/breakpoint/breakpoint_options/TestBreakpointOptions.py (2037 of 2121) PASS: lldb-unit :: Utility/./UtilityTests/RangeDataVector.FindEntryThatContains (2038 of 2121) PASS: lldb-unit :: Utility/./UtilityTests/Flags.Test (2039 of 2121) PASS: lldb-shell :: Settings/TestFrameFormatMangling.test (2040 of 2121) PASS: lldb-unit :: Utility/./UtilityTests/ProcessInstanceInfoList.Yaml (2041 of 2121) PASS: lldb-unit :: UnwindAssembly/x86/./UnwindAssemblyx86Tests/Testx86AssemblyInspectionEngine.TestPushEDX (2042 of 2121) PASS: lldb-api :: commands/expression/top-level/TestTopLevelExprs.py (2043 of 2121) PASS: lldb-api :: commands/command/delete/TestCommandDelete.py (2044 of 2121) PASS: lldb-shell :: Settings/TestFrameFormatNoColor.test (2045 of 2121) PASS: lldb-api :: commands/expression/class_template_specialization_empty_pack/TestClassTemplateSpecializationParametersHandling.py (2046 of 2121) PASS: lldb-api :: iohandler/resize/TestIOHandlerResize.py (2047 of 2121) PASS: lldb-api :: functionalities/data-formatter/data-formatter-ptr-to-array/TestPtrToArrayFormatting.py (2048 of 2121) PASS: lldb-api :: commands/process/attach/TestProcessAttach.py (2049 of 2121) PASS: lldb-api :: functionalities/unwind/noreturn/TestNoreturnUnwind.py (2050 of 2121) PASS: lldb-unit :: Utility/./UtilityTests/RangeTest.NotEqual (2051 of 2121) PASS: lldb-unit :: Utility/./UtilityTests/VMRange.Ordering (2052 of 2121) PASS: lldb-unit :: Utility/./UtilityTests/OptionsWithRawTest.ArgsButNoLeadingDash (2053 of 2121) UNSUPPORTED: lldb-api :: functionalities/longjmp/TestLongjmp.py (2054 of 2121) PASS: lldb-unit :: Utility/./UtilityTests/RangeTest.DefaultConstructor (2055 of 2121) PASS: lldb-unit :: Utility/./UtilityTests/LogChannelEnabledTest.LogThread (2056 of 2121) PASS: lldb-unit :: ScriptInterpreter/Python/./ScriptInterpreterPythonTests/PythonDataObjectsTest.TestPythonTupleValues (2057 of 2121) PASS: lldb-shell :: SymbolFile/NativePDB/function-types-calling-conv.cpp (2058 of 2121) PASS: lldb-unit :: Utility/./UtilityTests/BinaryStreamTest.PutSLEB128NineBytes (2059 of 2121) PASS: lldb-api :: functionalities/gdb_remote_client/TestRecognizeBreakpoint.py (2060 of 2121) PASS: lldb-unit :: Utility/./UtilityTests/UUIDTest.Validity (2061 of 2121) PASS: lldb-api :: commands/expression/deleting-implicit-copy-constructor/TestDeletingImplicitCopyConstructor.py (2062 of 2121) PASS: lldb-api :: python_api/thread/TestThreadAPI.py (2063 of 2121) PASS: lldb-shell :: SymbolFile/Breakpad/stack-cfi-arm.yaml (2064 of 2121) PASS: lldb-shell :: SymbolFile/DWARF/dir-separator-no-comp-dir.s (2065 of 2121) PASS: lldb-unit :: Utility/./UtilityTests/ScalarTest.Promotion (2066 of 2121) PASS: lldb-shell :: BuildScript/modes.test (2067 of 2121) PASS: lldb-unit :: Utility/./UtilityTests/BinaryStreamTest.PutULEB128FourBytes (2068 of 2121) PASS: lldb-unit :: Utility/./UtilityTests/DataExtractorTest.GetCStrAtEnd (2069 of 2121) PASS: lldb-unit :: Utility/./UtilityTests/StringExtractorTest.GetHexU8_Underflow2_NoEof (2070 of 2121) PASS: lldb-api :: lang/cpp/function-qualifiers/TestCppFunctionQualifiers.py (2071 of 2121) PASS: lldb-api :: functionalities/breakpoint/breakpoint_command/TestBreakpointCommand.py (2072 of 2121) PASS: lldb-api :: functionalities/breakpoint/breakpoint_ids/TestBreakpointIDs.py (2073 of 2121) PASS: lldb-unit :: Utility/./UtilityTests/StringListTest.ShiftMove (2074 of 2121) PASS: lldb-unit :: UnwindAssembly/x86/./UnwindAssemblyx86Tests/Testx86AssemblyInspectionEngine.Testi386IgnoredRegisters (2075 of 2121) PASS: lldb-unit :: SymbolFile/NativePDB/./SymbolFileNativePDBTests/PDBFPOProgramToDWARFExpressionTests.MultipleDependentAssignments (2076 of 2121) PASS: lldb-shell :: Driver/TestHelp.test (2077 of 2121) PASS: lldb-shell :: SymbolFile/NativePDB/s_constant.cpp (2078 of 2121) PASS: lldb-unit :: ScriptInterpreter/Python/./ScriptInterpreterPythonTests/PythonDataObjectsTest.TestModuleNameResolutionNoDot (2079 of 2121) UNSUPPORTED: lldb-shell :: Process/Windows/exception_access_violation.cpp (2080 of 2121) PASS: lldb-api :: functionalities/asan/TestReportData.py (2081 of 2121) PASS: lldb-unit :: Utility/./UtilityTests/StringListTest.InsertStringAtIndexMove (2082 of 2121) PASS: lldb-unit :: Process/gdb-remote/./ProcessGdbRemoteTests/GDBRemoteCommunicationClientTest.GetModulesInfo_UUID20 (2083 of 2121) PASS: lldb-unit :: Utility/./UtilityTests/StringListTest.LongestCommonPrefixDuplicateElement (2084 of 2121) PASS: lldb-shell :: Reproducer/TestDSYM.test (2085 of 2121) UNSUPPORTED: lldb-shell :: BuildScript/toolchain-msvc.test (2086 of 2121) PASS: lldb-unit :: Utility/./UtilityTests/UriParserTest.BadPort (2087 of 2121) PASS: lldb-unit :: Language/Highlighting/./HighlighterTests/HighlighterTest.HighlighterSelectionPath (2088 of 2121) PASS: lldb-unit :: ScriptInterpreter/Python/./ScriptInterpreterPythonTests/PythonDataObjectsTest.TestDictionaryResolutionWithDot (2089 of 2121) PASS: lldb-api :: functionalities/data-formatter/summary-string-onfail/Test-rdar-9974002.py (2090 of 2121) UNSUPPORTED: lldb-api :: tools/lldb-server/libraries-svr4/TestGdbRemoteLibrariesSvr4Support.py (2091 of 2121) PASS: lldb-unit :: Utility/./UtilityTests/RegularExpression.CopyAssignment (2092 of 2121) PASS: lldb-api :: api/log/TestAPILog.py (2093 of 2121) UNSUPPORTED: lldb-shell :: Watchpoint/netbsd-nouserdbregs.test (2094 of 2121) PASS: lldb-unit :: Core/./LLDBCoreTests/ModuleSpecTest.InvalidInMemoryBuffer (2095 of 2121) UNSUPPORTED: lldb-api :: functionalities/breakpoint/breakpoint_in_delayslot/TestAvoidBreakpointInDelaySlot.py (2096 of 2121) PASS: lldb-api :: functionalities/data-formatter/data-formatter-stl/libcxx/vbool/TestDataFormatterLibcxxVBool.py (2097 of 2121) PASS: lldb-unit :: SymbolFile/NativePDB/./SymbolFileNativePDBTests/PDBFPOProgramToDWARFExpressionTests.SingleAssignmentRegisterRef (2098 of 2121) PASS: lldb-unit :: Utility/./UtilityTests/VMRange.CollectionContains (2099 of 2121) PASS: lldb-api :: functionalities/thread/concurrent_events/TestConcurrentNWatchNBreak.py (2100 of 2121) PASS: lldb-api :: functionalities/reproducers/attach/TestReproducerAttach.py (2101 of 2121) PASS: lldb-api :: python_api/class_members/TestSBTypeClassMembers.py (2102 of 2121) PASS: lldb-unit :: Utility/./UtilityTests/CompletionRequest.TryCompleteCurrentArgGood (2103 of 2121) PASS: lldb-api :: lang/cpp/function_refs/TestFunctionRefs.py (2104 of 2121) PASS: lldb-shell :: SymbolFile/NativePDB/globals-bss.cpp (2105 of 2121) PASS: lldb-unit :: Host/./HostTests/NativeProcessProtocolTest.SetBreakpoint (2106 of 2121) PASS: lldb-api :: functionalities/breakpoint/breakpoint_callback_command_source/TestBreakpointCallbackCommandSource.py (2107 of 2121) PASS: lldb-api :: functionalities/dead-strip/TestDeadStrip.py (2108 of 2121) PASS: lldb-shell :: SymbolFile/NativePDB/locate-pdb.cpp (2109 of 2121) PASS: lldb-shell :: SymbolFile/DWARF/apple-index-is-used.cpp (2110 of 2121) PASS: lldb-unit :: Core/./LLDBCoreTests/RichManglingContextTest.SwitchProvider (2111 of 2121) PASS: lldb-api :: lang/objcxx/cxx-bridged-po/TestObjCXXBridgedPO.py (2112 of 2121) PASS: lldb-api :: functionalities/load_using_paths/TestLoadUsingPaths.py (2113 of 2121) PASS: lldb-unit :: Utility/./UtilityTests/RangeTest.DoesIntersect (2114 of 2121) PASS: lldb-api :: functionalities/paths/TestPaths.py (2115 of 2121) UNSUPPORTED: lldb-api :: functionalities/data-formatter/data-formatter-stl/libstdcpp/string/TestDataFormatterStdString.py (2116 of 2121) PASS: lldb-unit :: Expression/./ExpressionTests/DiagnosticManagerTest.AppendMessageAttachToLastDiag (2117 of 2121) PASS: lldb-shell :: Commands/command-disassemble.s (2118 of 2121) PASS: lldb-api :: functionalities/step_scripted/TestStepScripted.py (2119 of 2121) PASS: lldb-api :: functionalities/inferior-crashing/TestInferiorCrashingStep.py (2120 of 2121) PASS: lldb-api :: lang/objc/objc-new-syntax/TestObjCNewSyntaxArray.py (2121 of 2121) Slowest Tests: -------------------------------------------------------------------------- 601.16s: lldb-api :: macosx/simulator/TestSimulatorPlatform.py 192.05s: lldb-api :: lang/objc/objc-ivar-protocols/TestIvarProtocols.py 170.64s: lldb-api :: lang/objc/objc-new-syntax/TestObjCNewSyntaxDictionary.py 128.24s: lldb-api :: functionalities/gdb_remote_client/TestRestartBug.py 121.20s: lldb-api :: functionalities/rerun/TestRerun.py 107.25s: lldb-api :: lang/cpp/class_types/TestClassTypesDisassembly.py 96.93s: lldb-api :: tools/lldb-server/TestLldbGdbServer.py 91.74s: lldb-api :: commands/expression/completion-crash-incomplete-record/TestCompletionCrashIncompleteRecord.py 71.76s: lldb-api :: commands/expression/po_verbosity/TestPoVerbosity.py 59.75s: lldb-api :: lang/objc/hidden-ivars/TestHiddenIvars.py 59.32s: lldb-api :: functionalities/data-formatter/data-formatter-stl/libcxx/queue/TestDataFormatterLibcxxQueue.py 58.45s: lldb-api :: lang/cpp/enum_types/TestCPP11EnumTypes.py 52.28s: lldb-api :: lang/objc/exceptions/TestObjCExceptions.py 49.66s: lldb-api :: lang/objc/ptr_refs/TestPtrRefsObjC.py 49.14s: lldb-api :: functionalities/breakpoint/hardware_breakpoints/hardware_breakpoint_on_multiple_threads/TestHWBreakMultiThread.py 48.91s: lldb-shell :: SymbolFile/DWARF/win-i386-line-table.s 48.27s: lldb-shell :: SymbolFile/NativePDB/ast-methods.cpp 48.10s: lldb-api :: functionalities/data-formatter/data-formatter-objc/TestDataFormatterObjCCF.py 47.69s: lldb-api :: api/multithreaded/TestMultithreaded.py 47.25s: lldb-api :: lang/objc/foundation/TestFoundationDisassembly.py

Hide Details

Tests Times: -------------------------------------------------------------------------- [ Range ] :: [ Percentage ] :: [ Count ] -------------------------------------------------------------------------- [600s,650s) :: [ ] :: [ 1/2121] [550s,600s) :: [ ] :: [ 0/2121] [500s,550s) :: [ ] :: [ 0/2121] [450s,500s) :: [ ] :: [ 0/2121] [400s,450s) :: [ ] :: [ 0/2121] [350s,400s) :: [ ] :: [ 0/2121] [300s,350s) :: [ ] :: [ 0/2121] [250s,300s) :: [ ] :: [ 0/2121] [200s,250s) :: [ ] :: [ 1/2121] [150s,200s) :: [ ] :: [ 1/2121] [100s,150s) :: [ ] :: [ 4/2121] [ 50s,100s) :: [ ] :: [ 14/2121] [ 0s, 50s) :: [*************************************** ] :: [2100/2121] -------------------------------------------------------------------------- ******************** Timed Out Tests (1): lldb-api :: macosx/simulator/TestSimulatorPlatform.py

Hide Details

Hide Details

Testing Time: 1970.90s Unsupported : 150 Passed : 1964 Expectedly Failed: 6 Timed Out : 1 FAILED: tools/lldb/test/CMakeFiles/check-lldb-lit cd /Users/buildslave/jenkins/workspace/lldb-cmake/lldb-build/tools/lldb/test && /usr/local/Frameworks/Python.framework/Versions/3.7/bin/python3.7 /Users/buildslave/jenkins/workspace/lldb-cmake/lldb-build/./bin/llvm-lit -v --time-tests --shuffle --xunit-xml-output=/Users/buildslave/jenkins/workspace/lldb-cmake/test/results.xml -v -j 4 /Users/buildslave/jenkins/workspace/lldb-cmake/lldb-build/tools/lldb/test ninja: build stopped: subcommand failed. Command failed: Command '['/usr/bin/env', 'TERM=vt100', '/usr/local/bin/ninja', '-v', 'check-lldb']' returned non-zero exit status 1 Command: ['/usr/bin/env', 'TERM=vt100', '/usr/local/bin/ninja', '-v', 'check-lldb'] [Pipeline] } [Pipeline] // timeout [Pipeline] } [Pipeline] // stage [Pipeline] stage [Pipeline] { (Declarative: Post Actions) [Pipeline] scanForIssues [Clang (LLVM based)] Sleeping for 5 seconds due to JENKINS-32191... [Clang (LLVM based)] Parsing console log (workspace: '/Users/buildslave/jenkins/workspace/lldb-cmake') [Clang (LLVM based)] Successfully parsed console log [Clang (LLVM based)] -> found 12 issues (skipped 48 duplicates) [Clang (LLVM based)] Post processing issues on 'green-dragon-10' with source code encoding 'UTF-8' [Clang (LLVM based)] Creating SCM blamer to obtain author and commit information for affected files [Clang (LLVM based)] Creating SCM miner to obtain statistics for affected repository files [Clang (LLVM based)] Resolving file names for all issues in source directory '/Users/buildslave/jenkins/workspace/lldb-cmake' [Clang (LLVM based)] -> resolved paths in source directory (7 found, 0 not found) [Clang (LLVM based)] Resolving module names from module definitions (build.xml, pom.xml, or Manifest.mf files) [Clang (LLVM based)] -> resolved module names for 12 issues [Clang (LLVM based)] Resolving package names (or namespaces) by parsing the affected files [Clang (LLVM based)] -> resolved package names of 7 affected files [Clang (LLVM based)] No filter has been set, publishing all 12 issues [Clang (LLVM based)] Creating fingerprints for all affected code blocks to track issues over different builds [Clang (LLVM based)] -> created fingerprints for 12 issues (skipped 0 issues) [Clang (LLVM based)] Copying affected files to Jenkins' build folder '/Users/Shared/Jenkins/Home/jobs/lldb-cmake/builds/23332/files-with-issues' [Clang (LLVM based)] -> 5 copied, 2 not in workspace, 0 not-found, 0 with I/O error [Pipeline] junit Recording test results [Pipeline] } [Pipeline] // stage [Pipeline] } [Pipeline] // withEnv [Pipeline] } [Pipeline] // node [Pipeline] End of Pipeline ERROR: script returned exit code 1 Finished: FAILURE