FailedConsole Output

Skipping 9,556 KB.. Full Log
es/thread/create_during_step/TestCreateDuringStep.py (691 of 2121)
PASS: lldb-unit :: debugserver/./debugserverTests/RNBSocket.LoopBackConnectIPv6 (692 of 2121)
PASS: lldb-shell :: ObjectFile/ELF/many-sections.s (693 of 2121)
PASS: lldb-unit :: Utility/./UtilityTests/StringExtractorTest.GetHexU8_Underflow2 (694 of 2121)
PASS: lldb-api :: macosx/load-kext/TestLoadKext.py (695 of 2121)
PASS: lldb-api :: commands/frame/var-scope/TestFrameVariableScope.py (696 of 2121)
PASS: lldb-unit :: Utility/./UtilityTests/ArgsTest.TestInsertArg (697 of 2121)
PASS: lldb-api :: lang/objc/foundation/TestObjCMethods.py (698 of 2121)
PASS: lldb-api :: commands/source/info/TestSourceInfo.py (699 of 2121)
PASS: lldb-unit :: Utility/./UtilityTests/OptionsWithRawTest.SingleWhitespaceInput (700 of 2121)
PASS: lldb-unit :: Utility/./UtilityTests/ScalarTest.SetValueFromCString (701 of 2121)
PASS: lldb-unit :: Utility/./UtilityTests/RegularExpression.Empty (702 of 2121)
PASS: lldb-shell :: Reproducer/TestWorkingDir.test (703 of 2121)
UNSUPPORTED: lldb-shell :: SymbolFile/PDB/typedefs.test (704 of 2121)
PASS: lldb-unit :: SymbolFile/DWARF/./SymbolFileDWARFTests/SymbolFileDWARFTests.ParseArangesNonzeroSegmentSize (705 of 2121)
PASS: lldb-api :: functionalities/thread/crash_during_step/TestCrashDuringStep.py (706 of 2121)
PASS: lldb-unit :: UnwindAssembly/ARM64/./Arm64InstEmulationTests/TestArm64InstEmulation.TestRegisterDoubleSpills (707 of 2121)
UNSUPPORTED: lldb-api :: functionalities/signal/handle-segv/TestHandleSegv.py (708 of 2121)
PASS: lldb-unit :: SymbolFile/DWARF/./SymbolFileDWARFTests/SymbolFileDWARFTests.TestAbbrevNullAttrValidForm (709 of 2121)
PASS: lldb-api :: macosx/find-app-in-bundle/TestFindAppInBundle.py (710 of 2121)
PASS: lldb-unit :: Utility/./UtilityTests/ListenerTest.GetEventWait (711 of 2121)
PASS: lldb-api :: tools/lldb-server/TestLldbGdbServer.py (712 of 2121)
PASS: lldb-api :: commands/expression/ir-interpreter/TestIRInterpreter.py (713 of 2121)
PASS: lldb-api :: lang/objc/objc-stepping/TestObjCStepping.py (714 of 2121)
PASS: lldb-api :: functionalities/breakpoint/breakpoint_set_restart/TestBreakpointSetRestart.py (715 of 2121)
PASS: lldb-api :: commands/target/stop-hook/enable/TestTargetStopHookEnable.py (716 of 2121)
PASS: lldb-unit :: Utility/./UtilityTests/Flags.AnyClear (717 of 2121)
PASS: lldb-unit :: Utility/./UtilityTests/StringListTest.LongestCommonPrefixEmpty (718 of 2121)
PASS: lldb-shell :: SymbolFile/DWARF/dwarf5_locations.s (719 of 2121)
PASS: lldb-shell :: SymbolFile/DWARF/DW_OP_piece-smaller-than-struct.s (720 of 2121)
PASS: lldb-api :: tools/lldb-server/TestGdbRemoteAttach.py (721 of 2121)
PASS: lldb-shell :: SymbolFile/DWARF/debug_line-relative_path.s (722 of 2121)
PASS: lldb-api :: commands/expression/radar_9673664/TestExprHelpExamples.py (723 of 2121)
PASS: lldb-unit :: Utility/./UtilityTests/StreamTeeTest.GetStreamAtIndexOutOfBounds (724 of 2121)
PASS: lldb-api :: lang/objc/modules-inline-functions/TestModulesInlineFunctions.py (725 of 2121)
PASS: lldb-shell :: SymbolFile/DWARF/debug_ranges-missing-section.s (726 of 2121)
PASS: lldb-api :: python_api/findvalue_duplist/TestSBFrameFindValue.py (727 of 2121)
PASS: lldb-api :: functionalities/inferior-assert/TestInferiorAssert.py (728 of 2121)
PASS: lldb-api :: functionalities/thread/concurrent_events/TestConcurrentBreakpointOneDelayBreakpointThreads.py (729 of 2121)
PASS: lldb-shell :: Reproducer/TestDump.test (730 of 2121)
PASS: lldb-unit :: Process/minidump/./LLDBMinidumpTests/MinidumpParserTest.GetMiscInfo_no_stream (731 of 2121)
PASS: lldb-shell :: ObjectFile/ELF/gnu-debuglink.yaml (732 of 2121)
PASS: lldb-unit :: Utility/./UtilityTests/StreamTest.AddressRange (733 of 2121)
UNSUPPORTED: lldb-shell :: Register/x86-64-xmm16-read.test (734 of 2121)
PASS: lldb-unit :: Utility/./UtilityTests/BinaryStreamTest.PutULEB128SixBytes (735 of 2121)
PASS: lldb-api :: lang/objc/variadic_methods/TestVariadicMethods.py (736 of 2121)
PASS: lldb-api :: functionalities/thread/concurrent_events/TestConcurrentCrashWithBreak.py (737 of 2121)
PASS: lldb-shell :: SymbolFile/DWARF/debug_loclists-dwo.s (738 of 2121)
PASS: lldb-api :: functionalities/gdb_remote_client/TestNoWatchpointSupportInfo.py (739 of 2121)
PASS: lldb-unit :: Process/gdb-remote/./ProcessGdbRemoteTests/GDBRemoteClientBaseTest.SendContinueDelegateStructuredDataReceipt (740 of 2121)
PASS: lldb-api :: python_api/section/TestSectionAPI.py (741 of 2121)
PASS: lldb-unit :: Host/./HostTests/FileSystemTest.FileAndDirectoryComponents (742 of 2121)
UNSUPPORTED: lldb-shell :: ScriptInterpreter/Lua/lua.test (743 of 2121)
PASS: lldb-unit :: Utility/./UtilityTests/StreamTeeTest.CopyConstructor (744 of 2121)
PASS: lldb-unit :: Utility/./UtilityTests/TimerTest.CategoryTimesNested (745 of 2121)
PASS: lldb-unit :: Utility/./UtilityTests/RangeTest.NotEqual (746 of 2121)
PASS: lldb-unit :: Process/gdb-remote/./ProcessGdbRemoteTests/GDBRemoteClientBaseTest.SendContinueAndWait (747 of 2121)
PASS: lldb-unit :: Utility/./UtilityTests/StringExtractorTest.InitMisc (748 of 2121)
PASS: lldb-unit :: Utility/./UtilityTests/StringLexerTest.PutBack (749 of 2121)
PASS: lldb-shell :: SymbolFile/DWARF/find-qualified-variable.cpp (750 of 2121)
UNSUPPORTED: lldb-api :: functionalities/breakpoint/hardware_breakpoints/hardware_breakpoint_on_multiple_threads/TestHWBreakMultiThread.py (751 of 2121)
PASS: lldb-unit :: Utility/./UtilityTests/SerializationRountripTest.SerializeDeserializePod (752 of 2121)
PASS: lldb-unit :: Host/./HostTests/NativeProcessProtocolTest.ReadCStringFromMemory_CrossPageBoundary (753 of 2121)
PASS: lldb-unit :: Utility/./UtilityTests/CompletionRequest.TryCompleteCurrentArgGood (754 of 2121)
PASS: lldb-unit :: Utility/./UtilityTests/UriParserTest.SchemeHostSeparator4 (755 of 2121)
PASS: lldb-unit :: Language/Highlighting/./HighlighterTests/HighlighterTest.ClangStringLiterals (756 of 2121)
PASS: lldb-unit :: Utility/./UtilityTests/XcodeSDKTest.SDKSupportsModules (757 of 2121)
PASS: lldb-api :: commands/expression/multiline-navigation/TestMultilineNavigation.py (758 of 2121)
PASS: lldb-shell :: SymbolFile/Breakpad/line-table.test (759 of 2121)
PASS: lldb-unit :: Utility/./UtilityTests/StringLexerTest.Next (760 of 2121)
UNSUPPORTED: lldb-api :: functionalities/tty/TestTerminal.py (761 of 2121)
PASS: lldb-unit :: Utility/./UtilityTests/ProcessInstanceInfoList.Yaml (762 of 2121)
PASS: lldb-shell :: Commands/command-breakpoint-col.test (763 of 2121)
PASS: lldb-shell :: Driver/TestCommands.test (764 of 2121)
PASS: lldb-api :: commands/frame/diagnose/dereference-function-return/TestDiagnoseDereferenceFunctionReturn.py (765 of 2121)
PASS: lldb-unit :: Host/./HostTests/HostInfoTest.GetAugmentedArchSpec (766 of 2121)
PASS: lldb-unit :: ScriptInterpreter/Python/./ScriptInterpreterPythonTests/PythonDataObjectsTest.TestPythonCallableCheck (767 of 2121)
PASS: lldb-unit :: Utility/./UtilityTests/StreamTest.PutHex16ByteOrderBig (768 of 2121)
PASS: lldb-api :: python_api/class_members/TestSBTypeClassMembers.py (769 of 2121)
PASS: lldb-api :: functionalities/tail_call_frames/cross_object/TestCrossObjectTailCalls.py (770 of 2121)
PASS: lldb-shell :: Settings/TestDisableColor.test (771 of 2121)
PASS: lldb-unit :: Utility/./UtilityTests/CompletionRequest.TryCompleteCurrentArgMode (772 of 2121)
PASS: lldb-unit :: Interpreter/./InterpreterTests/OptionArgParserTest.toChar (773 of 2121)
PASS: lldb-api :: python_api/sbdata/TestSBData.py (774 of 2121)
PASS: lldb-api :: tools/lldb-vscode/console/TestVSCode_console.py (775 of 2121)
PASS: lldb-shell :: SymbolFile/NativePDB/source-list.cpp (776 of 2121)
PASS: lldb-api :: commands/target/create-no-such-arch/TestNoSuchArch.py (777 of 2121)
PASS: lldb-shell :: ObjectFile/wasm/embedded-debug-sections.yaml (778 of 2121)
PASS: lldb-api :: functionalities/breakpoint/breakpoint_locations/TestBreakpointLocations.py (779 of 2121)
UNSUPPORTED: lldb-api :: commands/register/register/intel_xtended_registers/TestMPXRegisters.py (780 of 2121)
PASS: lldb-api :: functionalities/thread/concurrent_events/TestConcurrentWatchBreak.py (781 of 2121)
PASS: lldb-unit :: Language/Highlighting/./HighlighterTests/HighlighterTest.Keywords (782 of 2121)
PASS: lldb-api :: lang/c/find_struct_type/TestFindStructTypes.py (783 of 2121)
PASS: lldb-api :: commands/command/script/TestCommandScript.py (784 of 2121)
PASS: lldb-unit :: Symbol/./SymbolTests/TestClangASTImporter.DeportDeclTagDecl (785 of 2121)
PASS: lldb-unit :: UnwindAssembly/x86/./UnwindAssemblyx86Tests/Testx86AssemblyInspectionEngine.TestPopR15 (786 of 2121)
PASS: lldb-unit :: UnwindAssembly/x86/./UnwindAssemblyx86Tests/Testx86AssemblyInspectionEngine.TestSimple32bitFrameFunction (787 of 2121)
PASS: lldb-api :: lang/objc/objc-ivar-protocols/TestIvarProtocols.py (788 of 2121)
PASS: lldb-api :: functionalities/data-formatter/data-formatter-stl/libcxx/string/TestDataFormatterLibcxxString.py (789 of 2121)
UNSUPPORTED: lldb-shell :: ScriptInterpreter/Lua/breakpoint_callback.test (790 of 2121)
PASS: lldb-shell :: Reproducer/TestRelativePath.test (791 of 2121)
UNSUPPORTED: lldb-api :: functionalities/unwind/standard/TestStandardUnwind.py (792 of 2121)
PASS: lldb-api :: lang/c/modules/TestCModules.py (793 of 2121)
PASS: lldb-unit :: Signals/./SignalsTests/UnixSignalsTest.GetFilteredSignals (794 of 2121)
PASS: lldb-shell :: Breakpoint/debug_rnglist_rlestartend.test (795 of 2121)
PASS: lldb-unit :: Utility/./UtilityTests/StreamTest.Indent (796 of 2121)
PASS: lldb-shell :: ObjectFile/Breakpad/breakpad-identification.test (797 of 2121)
PASS: lldb-api :: functionalities/signal/handle-abrt/TestHandleAbort.py (798 of 2121)
PASS: lldb-shell :: ObjectFile/PECOFF/dep-modules.yaml (799 of 2121)
PASS: lldb-unit :: Utility/./UtilityTests/StringExtractorTest.GetNameColonValueContainsColon (800 of 2121)
PASS: lldb-api :: functionalities/show_location/TestShowLocationDwarf5.py (801 of 2121)
PASS: lldb-unit :: Utility/./UtilityTests/UriParserTest.BracketedHostname (802 of 2121)
PASS: lldb-unit :: Utility/./UtilityTests/ArchSpecTest.MergeFrom (803 of 2121)
PASS: lldb-api :: functionalities/postmortem/minidump/TestMiniDump.py (804 of 2121)
PASS: lldb-unit :: Utility/./UtilityTests/EnvironmentTest.EnvpConversion (805 of 2121)
PASS: lldb-unit :: DataFormatter/./LLDBFormatterTests/TypeMatcherTests.CreatedBySameMatchStringExactNamePrefixes (806 of 2121)
PASS: lldb-api :: lang/objc/foundation/TestObjCMethodsString.py (807 of 2121)
PASS: lldb-api :: python_api/disassemble-raw-data/TestDisassemble_VST1_64.py (808 of 2121)
PASS: lldb-shell :: SymbolFile/DWARF/debug-types-dwo-cross-reference.cpp (809 of 2121)
PASS: lldb-api :: lang/cpp/subst_template_type_param/TestSubstTemplateTypeParam.py (810 of 2121)
PASS: lldb-unit :: Utility/./UtilityTests/ProcessInstanceInfoMatch.Name (811 of 2121)
PASS: lldb-shell :: Breakpoint/dummy-target.test (812 of 2121)
PASS: lldb-unit :: Utility/./UtilityTests/BinaryStreamTest.PutSLEB128FourBytes (813 of 2121)
PASS: lldb-unit :: Utility/./UtilityTests/StreamTeeTest.Flush (814 of 2121)
PASS: lldb-shell :: Reproducer/TestDriverOptions.test (815 of 2121)
PASS: lldb-unit :: Utility/./UtilityTests/LogChannelTest.List (816 of 2121)
PASS: lldb-unit :: Language/Highlighting/./HighlighterTests/HighlighterTest.ClangPPDirectives (817 of 2121)
PASS: lldb-api :: functionalities/tsan/cpp_global_location/TestTsanCPPGlobalLocation.py (818 of 2121)
UNSUPPORTED: lldb-shell :: Register/x86-64-ymm16-write.test (819 of 2121)
UNSUPPORTED: lldb-api :: functionalities/data-formatter/data-formatter-stl/libstdcpp/unique_ptr/TestDataFormatterStdUniquePtr.py (820 of 2121)
PASS: lldb-api :: functionalities/thread/concurrent_events/TestConcurrentSignalDelayBreak.py (821 of 2121)
PASS: lldb-unit :: UnwindAssembly/x86/./UnwindAssemblyx86Tests/Testx86AssemblyInspectionEngine.TestPushEAX (822 of 2121)
PASS: lldb-api :: functionalities/load_unload/TestLoadUnload.py (823 of 2121)
PASS: lldb-unit :: UnwindAssembly/x86/./UnwindAssemblyx86Tests/Testx86AssemblyInspectionEngine.TestPushR15 (824 of 2121)
PASS: lldb-api :: functionalities/inferior-crashing/TestInferiorCrashingStep.py (825 of 2121)
PASS: lldb-unit :: Utility/./UtilityTests/RecordReplayTest.InstrumentedFooSameThis (826 of 2121)
PASS: lldb-unit :: Utility/./UtilityTests/StreamTeeTest.Assignment (827 of 2121)
UNSUPPORTED: lldb-shell :: ObjectFile/ELF/minidebuginfo-no-lzma.yaml (828 of 2121)
UNSUPPORTED: lldb-shell :: Unwind/eh-frame-augment-noop.test (829 of 2121)
PASS: lldb-api :: functionalities/data-formatter/data-formatter-proper-plurals/TestFormattersOneIsSingular.py (830 of 2121)
PASS: lldb-api :: functionalities/data-formatter/synthcapping/TestSyntheticCapping.py (831 of 2121)
PASS: lldb-unit :: Utility/./UtilityTests/ConstStringTest.CompareConstString (832 of 2121)
PASS: lldb-api :: lang/c/local_variables/TestLocalVariables.py (833 of 2121)
PASS: lldb-shell :: Driver/TestPositionalArgs.test (834 of 2121)
PASS: lldb-api :: commands/log/invalid-args/TestInvalidArgsLog.py (835 of 2121)
PASS: lldb-api :: functionalities/data-formatter/data-formatter-stl/libstdcpp/unique_ptr/invalid/TestDataFormatterInvalidStdUniquePtr.py (836 of 2121)
PASS: lldb-api :: functionalities/data-formatter/data-formatter-enum-format/TestDataFormatterEnumFormat.py (837 of 2121)
PASS: lldb-api :: commands/target/basic/TestTargetCommand.py (838 of 2121)
PASS: lldb-api :: functionalities/exec/TestExec.py (839 of 2121)
PASS: lldb-shell :: SymbolFile/DWARF/debug-types-basic.test (840 of 2121)
PASS: lldb-api :: commands/expression/ir-interpreter-phi-nodes/TestIRInterpreterPHINodes.py (841 of 2121)
PASS: lldb-unit :: Utility/./UtilityTests/Flags.AllSet (842 of 2121)
PASS: lldb-unit :: Utility/./UtilityTests/AnsiTerminal.Twice (843 of 2121)
PASS: lldb-unit :: Utility/./UtilityTests/ProcessInstanceInfo.DumpTable_invalidUID (844 of 2121)
PASS: lldb-api :: commands/watchpoints/watchpoint_size/TestWatchpointSizes.py (845 of 2121)
UNSUPPORTED: lldb-api :: tools/lldb-server/TestGdbRemoteModuleInfo.py (846 of 2121)
PASS: lldb-shell :: ObjectFile/ELF/base-address.yaml (847 of 2121)
PASS: lldb-api :: commands/expression/completion-in-lambda-and-unnamed-class/TestCompletionInLambdaAndUnnamedClass.py (848 of 2121)
PASS: lldb-unit :: Symbol/./SymbolTests/DWARFCallFrameInfoTest.Basic_dwarf3 (849 of 2121)
PASS: lldb-unit :: Process/gdb-remote/./ProcessGdbRemoteTests/GDBRemoteCommunicationClientTest.WriteRegister (850 of 2121)
PASS: lldb-api :: commands/expression/import-std-module/shared_ptr/TestSharedPtrFromStdModule.py (851 of 2121)
PASS: lldb-api :: functionalities/thread/exit_during_break/TestExitDuringBreak.py (852 of 2121)
PASS: lldb-shell :: SymbolFile/DWARF/find-variable-dwo.cpp (853 of 2121)
PASS: lldb-api :: python_api/watchpoint/TestWatchpointIter.py (854 of 2121)
PASS: lldb-api :: functionalities/data-formatter/data-formatter-stl/libcxx/initializerlist/TestInitializerList.py (855 of 2121)
PASS: lldb-api :: python_api/lldbutil/iter/TestLLDBIterator.py (856 of 2121)
PASS: lldb-shell :: SymbolFile/Breakpad/unwind-via-stack-win-no-memory-info.yaml (857 of 2121)
UNSUPPORTED: lldb-api :: linux/add-symbols/TestTargetSymbolsAddCommand.py (858 of 2121)
PASS: lldb-unit :: SymbolFile/NativePDB/./SymbolFileNativePDBTests/PDBFPOProgramToDWARFExpressionTests.InvalidAssignmentMultiple (859 of 2121)
PASS: lldb-unit :: ScriptInterpreter/Python/./ScriptInterpreterPythonTests/PythonDataObjectsTest.TestPythonIntegerToStr (860 of 2121)
PASS: lldb-unit :: ScriptInterpreter/Python/./ScriptInterpreterPythonTests/PythonDataObjectsTest.TestPythonDictionaryValueEquality (861 of 2121)
PASS: lldb-api :: macosx/macCatalyst/TestMacCatalyst.py (862 of 2121)
PASS: lldb-unit :: Utility/./UtilityTests/StreamTest.PutBytesAsRawHex8ToLittleEndian (863 of 2121)
PASS: lldb-api :: sanity/TestSettingSkipping.py (864 of 2121)
PASS: lldb-api :: functionalities/data-formatter/data-formatter-objc/TestDataFormatterObjCNSDate.py (865 of 2121)
UNSUPPORTED: lldb-api :: benchmarks/expression/TestRepeatedExprs.py (866 of 2121)
PASS: lldb-unit :: Utility/./UtilityTests/RangeTest.Clear (867 of 2121)
PASS: lldb-shell :: Register/x86-64-ymm-read.test (868 of 2121)
PASS: lldb-unit :: Process/minidump/./LLDBMinidumpTests/RegisterContextMinidump.ConvertMinidumpContext_x86_64 (869 of 2121)
PASS: lldb-unit :: UnwindAssembly/x86/./UnwindAssemblyx86Tests/Testx86AssemblyInspectionEngine.TestPopRBPWithREX (870 of 2121)
PASS: lldb-api :: functionalities/breakpoint/cpp_exception/TestCPPExceptionBreakpoint.py (871 of 2121)
PASS: lldb-unit :: Symbol/./SymbolTests/TestTypeSystemClang.AddMethodToObjCObjectType (872 of 2121)
PASS: lldb-api :: commands/expression/rdar44436068/Test128BitsInteger.py (873 of 2121)
PASS: lldb-unit :: UnwindAssembly/x86/./UnwindAssemblyx86Tests/Testx86AssemblyInspectionEngine.TestDisassemblyJunkBytes (874 of 2121)
PASS: lldb-api :: tools/lldb-vscode/breakpoint/TestVSCode_setBreakpoints.py (875 of 2121)
PASS: lldb-api :: commands/apropos/basic/TestApropos.py (876 of 2121)
PASS: lldb-api :: commands/expression/import-std-module/vector-dbg-info-content/TestDbgInfoContentVectorFromStdModule.py (877 of 2121)
PASS: lldb-api :: commands/expression/import-std-module/list-dbg-info-content/TestDbgInfoContentListFromStdModule.py (878 of 2121)
PASS: lldb-unit :: SymbolFile/NativePDB/./SymbolFileNativePDBTests/PDBFPOProgramToDWARFExpressionTests.InvalidAssignmentSingle (879 of 2121)
PASS: lldb-shell :: ObjectFile/ELF/aarch64-relocations.yaml (880 of 2121)
PASS: lldb-api :: tools/lldb-server/TestGdbRemote_qThreadStopInfo.py (881 of 2121)
PASS: lldb-api :: commands/apropos/with-process/TestAproposWithProcess.py (882 of 2121)
PASS: lldb-unit :: Utility/./UtilityTests/StringExtractorTest.DecodeHexU8_InvalidHex2 (883 of 2121)
PASS: lldb-unit :: Utility/./UtilityTests/StreamTest.AddressRangeEmptyRange (884 of 2121)
PASS: lldb-api :: types/TestLongTypesExpr.py (885 of 2121)
UNSUPPORTED: lldb-shell :: SymbolFile/PDB/func-symbols.test (886 of 2121)
PASS: lldb-api :: functionalities/object-file/TestImageListMultiArchitecture.py (887 of 2121)
PASS: lldb-unit :: ScriptInterpreter/Python/./ScriptInterpreterPythonTests/PythonDataObjectsTest.TestPythonBoolean (888 of 2121)
UNSUPPORTED: lldb-shell :: ScriptInterpreter/Lua/watchpoint_callback.test (889 of 2121)
PASS: lldb-api :: functionalities/data-formatter/data-formatter-ptr-to-array/TestPtrToArrayFormatting.py (890 of 2121)
PASS: lldb-shell :: SymbolFile/NativePDB/ast-methods.cpp (891 of 2121)
PASS: lldb-shell :: SymbolFile/DWARF/debug_rnglists-dwo.s (892 of 2121)
PASS: lldb-api :: driver/batch_mode/TestBatchMode.py (893 of 2121)
PASS: lldb-api :: commands/frame/diagnose/dereference-argument/TestDiagnoseDereferenceArgument.py (894 of 2121)
UNSUPPORTED: lldb-api :: functionalities/darwin_log/filter/exact_match/activity/TestDarwinLogFilterMatchActivity.py (895 of 2121)
PASS: lldb-api :: functionalities/postmortem/minidump-new/TestMiniDumpUUID.py (896 of 2121)
PASS: lldb-api :: python_api/debugger/TestDebuggerAPI.py (897 of 2121)
PASS: lldb-unit :: UnwindAssembly/PPC64/./PPC64InstEmulationTests/TestPPC64InstEmulation.TestSimpleFunction (898 of 2121)
PASS: lldb-unit :: UnwindAssembly/x86/./UnwindAssemblyx86Tests/Testx86AssemblyInspectionEngine.TestPopEBP (899 of 2121)
PASS: lldb-unit :: UnwindAssembly/x86/./UnwindAssemblyx86Tests/Testx86AssemblyInspectionEngine.Test64bitFramelessBigStackFrame (900 of 2121)
PASS: lldb-api :: functionalities/thread/step_until/TestStepUntil.py (901 of 2121)
PASS: lldb-unit :: UnwindAssembly/x86/./UnwindAssemblyx86Tests/Testx86AssemblyInspectionEngine.TestSubESP (902 of 2121)
PASS: lldb-unit :: ObjectFile/ELF/./ObjectFileELFTests/ObjectFileELFTest.SectionsResolveConsistently (903 of 2121)
PASS: lldb-unit :: UnwindAssembly/x86/./UnwindAssemblyx86Tests/Testx86AssemblyInspectionEngine.TestPushExtended (904 of 2121)
PASS: lldb-unit :: ScriptInterpreter/Python/./ScriptInterpreterPythonTests/PythonDataObjectsTest.TestResetting (905 of 2121)
PASS: lldb-unit :: UnwindAssembly/x86/./UnwindAssemblyx86Tests/Testx86AssemblyInspectionEngine.TestAddRSP (906 of 2121)
PASS: lldb-shell :: SymbolFile/DWARF/split-dwarf-multiple-cu.ll (907 of 2121)
PASS: lldb-unit :: Utility/./UtilityTests/Predicate.WaitForValueEqualTo (908 of 2121)
PASS: lldb-api :: lang/cpp/operator-overload/TestOperatorOverload.py (909 of 2121)
UNSUPPORTED: lldb-api :: functionalities/darwin_log/basic/TestDarwinLogBasic.py (910 of 2121)
PASS: lldb-api :: functionalities/breakpoint/source_regexp/TestSourceRegexBreakpoints.py (911 of 2121)
PASS: lldb-api :: types/TestLongTypes.py (912 of 2121)
PASS: lldb-unit :: UnwindAssembly/x86/./UnwindAssemblyx86Tests/Testx86AssemblyInspectionEngine.TestPushRBX (913 of 2121)
PASS: lldb-api :: lang/c/struct_types/TestStructTypes.py (914 of 2121)
PASS: lldb-api :: commands/watchpoints/watchpoint_on_vectors/TestValueOfVectorVariable.py (915 of 2121)
PASS: lldb-api :: commands/expression/pr35310/TestExprsBug35310.py (916 of 2121)
UNSUPPORTED: lldb-shell :: ScriptInterpreter/Lua/quit.test (917 of 2121)
PASS: lldb-api :: functionalities/data-formatter/data-formatter-synthval/TestDataFormatterSynthVal.py (918 of 2121)
PASS: lldb-unit :: Expression/./ExpressionTests/DiagnosticManagerTest.GetStringMultipleDiags (919 of 2121)
PASS: lldb-unit :: debugserver/./debugserverTests/RNBSocket.AnyListen (920 of 2121)
PASS: lldb-api :: commands/platform/basic/TestPlatformCommand.py (921 of 2121)
PASS: lldb-shell :: SymbolFile/symbol-binding.test (922 of 2121)
PASS: lldb-shell :: Host/TestCustomShell.test (923 of 2121)
PASS: lldb-unit :: Utility/./UtilityTests/StringExtractorTest.GetHexU8_Exact (924 of 2121)
PASS: lldb-unit :: Utility/./UtilityTests/StringListTest.InsertStringAtIndexOutOfBounds (925 of 2121)
PASS: lldb-unit :: Utility/./UtilityTests/FileSpecTest.Match (926 of 2121)
PASS: lldb-api :: functionalities/data-formatter/format-propagation/TestFormatPropagation.py (927 of 2121)
PASS: lldb-unit :: Host/./HostTests/NativeProcessProtocolTest.SetBreakpointFailRead (928 of 2121)
PASS: lldb-api :: commands/watchpoints/watchpoint_count/TestWatchpointCount.py (929 of 2121)
PASS: lldb-unit :: Expression/./ExpressionTests/CppModuleConfigurationTest.Linux (930 of 2121)
PASS: lldb-unit :: Language/Highlighting/./HighlighterTests/HighlighterTest.ClangCursorOutOfBounds (931 of 2121)
PASS: lldb-api :: functionalities/thread/concurrent_events/TestConcurrentSignalNWatchNBreak.py (932 of 2121)
PASS: lldb-api :: functionalities/dlopen_other_executable/TestDlopenOtherExecutable.py (933 of 2121)
PASS: lldb-api :: lang/objc/rdar-10967107/TestRdar10967107.py (934 of 2121)
PASS: lldb-api :: python_api/disassemble-raw-data/TestDisassembleRawData.py (935 of 2121)
PASS: lldb-unit :: Process/gdb-remote/./ProcessGdbRemoteTests/GDBRemoteCommunicationClientTest.GetMemoryRegionInfoInvalidResponse (936 of 2121)
PASS: lldb-api :: commands/command/source/TestCommandSource.py (937 of 2121)
UNSUPPORTED: lldb-api :: benchmarks/turnaround/TestCompileRunToBreakpointTurnaround.py (938 of 2121)
PASS: lldb-api :: commands/expression/fixits/TestFixIts.py (939 of 2121)
PASS: lldb-api :: functionalities/unwind/noreturn/module-end/TestNoReturnModuleEnd.py (940 of 2121)
PASS: lldb-unit :: Utility/./UtilityTests/IndexToObjectTest.ObjectForIndex (941 of 2121)
PASS: lldb-api :: functionalities/float-display/TestFloatDisplay.py (942 of 2121)
PASS: lldb-unit :: Utility/./UtilityTests/ScalarTest.ComparisonFloat (943 of 2121)
PASS: lldb-api :: lang/c/anonymous/TestAnonymous.py (944 of 2121)
PASS: lldb-api :: lang/objc/ptr_refs/TestPtrRefsObjC.py (945 of 2121)
PASS: lldb-unit :: Utility/./UtilityTests/AnsiTerminal.Incomplete (946 of 2121)
UNSUPPORTED: lldb-api :: functionalities/data-formatter/data-formatter-stl/libstdcpp/vbool/TestDataFormatterStdVBool.py (947 of 2121)
PASS: lldb-api :: python_api/formatters/TestFormattersSBAPI.py (948 of 2121)
PASS: lldb-shell :: Breakpoint/split-dwarf-5-addrbase.test (949 of 2121)
PASS: lldb-unit :: UnwindAssembly/x86/./UnwindAssemblyx86Tests/Testx86AssemblyInspectionEngine.TestPopESI (950 of 2121)
PASS: lldb-unit :: Utility/./UtilityTests/StringLexerTest.NextIf (951 of 2121)
PASS: lldb-unit :: ScriptInterpreter/Python/./ScriptInterpreterPythonTests/PythonDataObjectsTest.TestPythonTupleSize (952 of 2121)
PASS: lldb-unit :: Language/Highlighting/./HighlighterTests/HighlighterTest.HighlighterSelectionType (953 of 2121)
PASS: lldb-api :: functionalities/data-formatter/data-formatter-advanced/TestDataFormatterAdv.py (954 of 2121)
PASS: lldb-api :: functionalities/process_group/TestChangeProcessGroup.py (955 of 2121)
PASS: lldb-api :: commands/expression/import_base_class_when_class_has_derived_member/TestImportBaseClassWhenClassHasDerivedMember.py (956 of 2121)
PASS: lldb-api :: lang/objc/radar-9691614/TestObjCMethodReturningBOOL.py (957 of 2121)
PASS: lldb-unit :: UnwindAssembly/x86/./UnwindAssemblyx86Tests/Testx86AssemblyInspectionEngine.TestPopRBX (958 of 2121)
PASS: lldb-shell :: Settings/TestFrameFormatNoColor.test (959 of 2121)
PASS: lldb-unit :: Utility/./UtilityTests/VMRange.CollectionContains (960 of 2121)
PASS: lldb-unit :: SymbolFile/NativePDB/./SymbolFileNativePDBTests/PDBFPOProgramToDWARFExpressionTests.InvalidOpBinary (961 of 2121)
PASS: lldb-unit :: Utility/./UtilityTests/ScalarTest.Equality (962 of 2121)
PASS: lldb-shell :: ObjectFile/PECOFF/basic-info.yaml (963 of 2121)
PASS: lldb-api :: python_api/watchpoint/condition/TestWatchpointConditionAPI.py (964 of 2121)
XFAIL: lldb-shell :: Register/x86-64-write.test (965 of 2121)
PASS: lldb-unit :: Utility/./UtilityTests/RangeTest.ContainsRange (966 of 2121)
PASS: lldb-shell :: SymbolFile/DWARF/win-i386-line-table.s (967 of 2121)
PASS: lldb-unit :: Utility/./UtilityTests/TimerTest.CategoryTimes2 (968 of 2121)
UNSUPPORTED: lldb-shell :: SymbolFile/PDB/variables-locations.test (969 of 2121)
PASS: lldb-unit :: Utility/./UtilityTests/AnsiTerminal.Unknown (970 of 2121)
PASS: lldb-api :: commands/expression/radar_8638051/Test8638051.py (971 of 2121)
PASS: lldb-unit :: Utility/./UtilityTests/StatusTest.ErrorConversion (972 of 2121)
PASS: lldb-unit :: Utility/./UtilityTests/LogChannelEnabledTest.LogThread (973 of 2121)
PASS: lldb-api :: commands/expression/import-std-module/sysroot/TestStdModuleSysroot.py (974 of 2121)
PASS: lldb-unit :: Process/gdb-remote/./ProcessGdbRemoteTests/GDBRemoteCommunicationClientTest.GetMemoryRegionInfo (975 of 2121)
PASS: lldb-api :: functionalities/data-formatter/data-formatter-stl/libcxx/atomic/TestLibCxxAtomic.py (976 of 2121)
PASS: lldb-unit :: Utility/./UtilityTests/SerializationRountripTest.SerializeDeserializeCStringNull (977 of 2121)
PASS: lldb-unit :: Symbol/./SymbolTests/Type.GetTypeScopeAndBasename (978 of 2121)
PASS: lldb-shell :: ObjectFile/ELF/PT_LOAD-overlap-PT_INTERP.yaml (979 of 2121)
PASS: lldb-unit :: Utility/./UtilityTests/StreamTest.PutCString (980 of 2121)
PASS: lldb-api :: commands/watchpoints/hello_watchpoint/TestMyFirstWatchpoint.py (981 of 2121)
PASS: lldb-unit :: Symbol/./SymbolTests/TestTypeSystemClang.TemplateArguments (982 of 2121)
PASS: lldb-unit :: ObjectFile/ELF/./ObjectFileELFTests/ObjectFileELFTest.GetModuleSpecifications_EarlySectionHeaders (983 of 2121)
PASS: lldb-shell :: Watchpoint/SetErrorCases.test (984 of 2121)
PASS: lldb-shell :: SymbolFile/DWARF/module-ownership.mm (985 of 2121)
PASS: lldb-unit :: UnwindAssembly/x86/./UnwindAssemblyx86Tests/Testx86AssemblyInspectionEngine.TestPushRBP (986 of 2121)
PASS: lldb-unit :: Utility/./UtilityTests/XcodeSDKTest.SDKSupportsSwift (987 of 2121)
PASS: lldb-unit :: Host/./HostTests/NativeProcessProtocolTest.ReadCStringFromMemory (988 of 2121)
PASS: lldb-api :: sample_test/TestSampleTest.py (989 of 2121)
PASS: lldb-api :: commands/frame/recognizer/TestFrameRecognizer.py (990 of 2121)
PASS: lldb-shell :: Driver/TestFile.test (991 of 2121)
PASS: lldb-unit :: ScriptInterpreter/Python/./ScriptInterpreterPythonTests/PythonDataObjectsTest.TestTypeNameResolutionNoDot (992 of 2121)
PASS: lldb-unit :: ScriptInterpreter/Python/./ScriptInterpreterPythonTests/PythonDataObjectsTest.TestScript (993 of 2121)
PASS: lldb-shell :: ScriptInterpreter/Python/eof.test (994 of 2121)
PASS: lldb-shell :: ObjectFile/PECOFF/section-types.yaml (995 of 2121)
PASS: lldb-unit :: Symbol/./SymbolTests/TestClangASTImporter.CopyDeclTagDecl (996 of 2121)
UNSUPPORTED: lldb-api :: benchmarks/stepping/TestSteppingSpeed.py (997 of 2121)
PASS: lldb-unit :: ScriptInterpreter/Python/./ScriptInterpreterPythonTests/PythonDataObjectsTest.TestDictionaryResolutionWithDot (998 of 2121)
PASS: lldb-unit :: Utility/./UtilityTests/PassiveReplayTest.InstrumentedBar (999 of 2121)
PASS: lldb-unit :: Utility/./UtilityTests/UriParserTest.BracketedHostnamePort (1000 of 2121)
PASS: lldb-unit :: Utility/./UtilityTests/BinaryStreamTest.PutSLEB128SevenBytes (1001 of 2121)
PASS: lldb-api :: python_api/target/TestTargetAPI.py (1002 of 2121)
PASS: lldb-unit :: ScriptInterpreter/Python/./ScriptInterpreterPythonTests/PythonDataObjectsTest.TestPythonCallableInvoke (1003 of 2121)
PASS: lldb-shell :: SymbolFile/DWARF/compilercontext.ll (1004 of 2121)
PASS: lldb-api :: functionalities/breakpoint/breakpoint_callback_command_source/TestBreakpointCallbackCommandSource.py (1005 of 2121)
PASS: lldb-unit :: Expression/./ExpressionTests/DiagnosticManagerTest.PutStringMultiple (1006 of 2121)
PASS: lldb-api :: functionalities/asan/TestMemoryHistory.py (1007 of 2121)
PASS: lldb-api :: python_api/breakpoint/TestBreakpointAPI.py (1008 of 2121)
PASS: lldb-api :: lang/objc/objc-property/TestObjCProperty.py (1009 of 2121)
PASS: lldb-api :: functionalities/gdb_remote_client/TestWasm.py (1010 of 2121)
PASS: lldb-unit :: UnwindAssembly/x86/./UnwindAssemblyx86Tests/Testx86AssemblyInspectionEngine.TestSpillRegToStackViaMOVi386 (1011 of 2121)
PASS: lldb-unit :: Expression/./ExpressionTests/ClangExpressionDeclMapTest.TestPersistentDeclLookup (1012 of 2121)
PASS: lldb-unit :: Utility/./UtilityTests/AnsiTerminal.WhiteSpace (1013 of 2121)
PASS: lldb-shell :: ObjectFile/PECOFF/sections.yaml (1014 of 2121)
PASS: lldb-unit :: ScriptInterpreter/Python/./ScriptInterpreterPythonTests/PythonDataObjectsTest.TestPythonStringToStr (1015 of 2121)
PASS: lldb-unit :: Host/./HostTests/MainLoopTest.TerminatesImmediately (1016 of 2121)
PASS: lldb-shell :: Settings/TestStopCommandSourceOnError.test (1017 of 2121)
PASS: lldb-api :: lang/objc/modules-cache/TestClangModulesCache.py (1018 of 2121)
PASS: lldb-unit :: Process/minidump/./LLDBMinidumpTests/MinidumpParserTest.GetPidWindows (1019 of 2121)
UNSUPPORTED: lldb-api :: tools/lldb-server/platform-process-connect/TestPlatformProcessConnect.py (1020 of 2121)
PASS: lldb-api :: functionalities/memory/find/TestMemoryFind.py (1021 of 2121)
PASS: lldb-api :: functionalities/data-formatter/data-formatter-stl/libcxx/map/TestDataFormatterLibccMap.py (1022 of 2121)
UNSUPPORTED: lldb-api :: commands/watchpoints/hello_watchlocation/TestWatchLocation.py (1023 of 2121)
PASS: lldb-shell :: Reproducer/TestCaptureEnvOverride.test (1024 of 2121)
UNSUPPORTED: lldb-api :: lang/cpp/function-template-parameter-pack/TestFunctionTemplateParameterPack.py (1025 of 2121)
UNSUPPORTED: lldb-shell :: ScriptInterpreter/Lua/convenience_variables.test (1026 of 2121)
PASS: lldb-unit :: SymbolFile/NativePDB/./SymbolFileNativePDBTests/PDBFPOProgramToDWARFExpressionTests.UnsupportedRASearch (1027 of 2121)
PASS: lldb-api :: types/TestFloatTypesExpr.py (1028 of 2121)
PASS: lldb-api :: functionalities/breakpoint/breakpoint_ids/TestBreakpointIDs.py (1029 of 2121)
PASS: lldb-api :: functionalities/data-formatter/data-formatter-caching/TestDataFormatterCaching.py (1030 of 2121)
PASS: lldb-unit :: Disassembler/./DisassemblerTests/TestArmv7Disassembly.TestCortexFPDisass (1031 of 2121)
PASS: lldb-shell :: SymbolFile/NativePDB/function-types-classes.cpp (1032 of 2121)
PASS: lldb-api :: functionalities/plugins/command_plugin/TestPluginCommands.py (1033 of 2121)
PASS: lldb-api :: functionalities/tail_call_frames/disambiguate_call_site/TestDisambiguateCallSite.py (1034 of 2121)
PASS: lldb-unit :: Interpreter/./InterpreterTests/OptionArgParserTest.toBoolean (1035 of 2121)
PASS: lldb-api :: lang/cpp/inlines/TestInlines.py (1036 of 2121)
UNSUPPORTED: lldb-api :: functionalities/darwin_log/filter/exact_match/message/TestDarwinLogFilterMatchMessage.py (1037 of 2121)
UNSUPPORTED: lldb-api :: benchmarks/startup/TestStartupDelays.py (1038 of 2121)
PASS: lldb-unit :: Utility/./UtilityTests/VMRange.SetEndAddress (1039 of 2121)
PASS: lldb-api :: macosx/add-dsym/TestAddDsymMidExecutionCommand.py (1040 of 2121)
PASS: lldb-unit :: Symbol/./SymbolTests/TestClangASTImporter.CanImportInvalidType (1041 of 2121)
PASS: lldb-unit :: Process/minidump/./LLDBMinidumpTests/RegisterContextMinidump.CheckRegisterContextMinidump_ARM (1042 of 2121)
PASS: lldb-api :: lang/cpp/namespace_conflicts/TestNamespaceConflicts.py (1043 of 2121)
PASS: lldb-api :: lang/objc/objc-ivar-offsets/TestObjCIvarOffsets.py (1044 of 2121)
PASS: lldb-api :: macosx/thread-names/TestInterruptThreadNames.py (1045 of 2121)
PASS: lldb-unit :: Utility/./UtilityTests/ProcessInfoTest.Constructor (1046 of 2121)
PASS: lldb-api :: functionalities/thread/state_after_expression/TestStateAfterExpression.py (1047 of 2121)
PASS: lldb-api :: commands/expression/diagnostics/TestExprDiagnostics.py (1048 of 2121)
PASS: lldb-unit :: Utility/./UtilityTests/StreamTest.PutHex32ByteOrderLittle (1049 of 2121)
PASS: lldb-api :: commands/expression/import-std-module/deque-basic/TestDequeFromStdModule.py (1050 of 2121)
PASS: lldb-api :: macosx/find-dsym/bundle-with-dot-in-filename/TestBundleWithDotInFilename.py (1051 of 2121)
PASS: lldb-unit :: Utility/./UtilityTests/VASprintfTest.EncodingError (1052 of 2121)
PASS: lldb-api :: commands/platform/process/list/TestProcessList.py (1053 of 2121)
PASS: lldb-api :: python_api/thread/TestThreadAPI.py (1054 of 2121)
UNSUPPORTED: lldb-api :: functionalities/unwind/ehframe/TestEhFrameUnwind.py (1055 of 2121)
PASS: lldb-shell :: ObjectFile/ELF/PT_LOAD-overlap-section.yaml (1056 of 2121)
PASS: lldb-unit :: Utility/./UtilityTests/BinaryStreamTest.PutULEB128FiveBytes (1057 of 2121)
PASS: lldb-unit :: Host/./HostTests/ConnectionFileDescriptorTest.TCPGetURIv6 (1058 of 2121)
PASS: lldb-api :: functionalities/return-value/TestReturnValue.py (1059 of 2121)
PASS: lldb-unit :: Utility/./UtilityTests/AnsiTerminal.Empty (1060 of 2121)
PASS: lldb-api :: commands/expression/completion/TestExprCompletion.py (1061 of 2121)
PASS: lldb-unit :: Utility/./UtilityTests/StringListTest.GetSize (1062 of 2121)
PASS: lldb-unit :: Utility/./UtilityTests/StringExtractorTest.DecodeHexU8_Extra (1063 of 2121)
PASS: lldb-unit :: Host/./HostTests/FileSystemTest.EnumerateDirectory (1064 of 2121)
PASS: lldb-api :: commands/expression/import-std-module/unique_ptr-dbg-info-content/TestUniquePtrDbgInfoContent.py (1065 of 2121)
PASS: lldb-unit :: Utility/./UtilityTests/StringExtractorTest.GetHexBytesAvail (1066 of 2121)
PASS: lldb-api :: iohandler/resize/TestIOHandlerResizeNoEditline.py (1067 of 2121)
PASS: lldb-api :: commands/expression/char/TestExprsChar.py (1068 of 2121)
PASS: lldb-api :: lang/objc/objc-ivar-stripped/TestObjCIvarStripped.py (1069 of 2121)
PASS: lldb-unit :: UnwindAssembly/x86/./UnwindAssemblyx86Tests/Testx86AssemblyInspectionEngine.TestDisassemblyMidFunctionEpilogues (1070 of 2121)
PASS: lldb-shell :: Driver/TestNoUseColor.test (1071 of 2121)
PASS: lldb-unit :: Utility/./UtilityTests/ListenerTest.GetEventImmediate (1072 of 2121)
PASS: lldb-api :: lang/cpp/global_operators/TestCppGlobalOperators.py (1073 of 2121)
PASS: lldb-unit :: Utility/./UtilityTests/EnvironmentTest.EnvpConstruction (1074 of 2121)
PASS: lldb-unit :: Utility/./UtilityTests/StringListTest.SplitIntoLinesEmpty (1075 of 2121)
PASS: lldb-api :: functionalities/signal/raise/TestRaise.py (1076 of 2121)
PASS: lldb-unit :: Process/gdb-remote/./ProcessGdbRemoteTests/GDBRemoteCommunicationClientTest.TestPacketSpeedJSON (1077 of 2121)
PASS: lldb-shell :: SymbolFile/DWARF/anon_class_w_and_wo_export_symbols.ll (1078 of 2121)
PASS: lldb-unit :: Expression/./ExpressionTests/CppModuleConfigurationTest.LinuxLocalLibCpp (1079 of 2121)
PASS: lldb-api :: functionalities/mtc/simple/TestMTCSimple.py (1080 of 2121)
UNSUPPORTED: lldb-shell :: ScriptInterpreter/Lua/command_script_import.test (1081 of 2121)
PASS: lldb-unit :: Process/minidump/./LLDBMinidumpTests/MinidumpParserTest.GetFilteredModuleList (1082 of 2121)
PASS: lldb-unit :: Utility/./UtilityTests/UriParserTest.BracketedHostnameWithColon (1083 of 2121)
PASS: lldb-unit :: UnwindAssembly/x86/./UnwindAssemblyx86Tests/Testx86AssemblyInspectionEngine.TestPush0 (1084 of 2121)
PASS: lldb-api :: functionalities/gdb_remote_client/TestIOSSimulator.py (1085 of 2121)
UNSUPPORTED: lldb-shell :: SymbolFile/PDB/ast-restore.test (1086 of 2121)
PASS: lldb-shell :: Minidump/no-process-id.yaml (1087 of 2121)
PASS: lldb-unit :: ScriptInterpreter/Python/./ScriptInterpreterPythonTests/PythonDataObjectsTest.TestPythonFile (1088 of 2121)
PASS: lldb-unit :: Utility/./UtilityTests/RangeTest.ContainsAddrInvalid (1089 of 2121)
PASS: lldb-unit :: SymbolFile/NativePDB/./SymbolFileNativePDBTests/PDBFPOProgramToDWARFExpressionTests.MultipleIndependentAssignments (1090 of 2121)
PASS: lldb-unit :: Utility/./UtilityTests/ConstStringTest.NullAndEmptyStates (1091 of 2121)
PASS: lldb-unit :: Symbol/./SymbolTests/TestClangASTImporter.RecordLayout (1092 of 2121)
PASS: lldb-api :: commands/expression/import-std-module/basic/TestImportStdModule.py (1093 of 2121)
PASS: lldb-unit :: Utility/./UtilityTests/StringExtractorTest.GetHexBytesAvail_Partial (1094 of 2121)
UNSUPPORTED: lldb-api :: functionalities/darwin_log/filter/exact_match/category/TestDarwinLogFilterMatchCategory.py (1095 of 2121)
PASS: lldb-api :: commands/target/modules/search-paths/insert/TestTargetModulesSearchpathsInsert.py (1096 of 2121)
PASS: lldb-api :: functionalities/breakpoint/breakpoint_language/TestBreakpointLanguage.py (1097 of 2121)
PASS: lldb-shell :: Quit/TestQuitExitCodeHex0.test (1098 of 2121)
PASS: lldb-shell :: ObjectFile/wasm/stripped-debug-sections.yaml (1099 of 2121)
PASS: lldb-api :: functionalities/data-formatter/refpointer-recursion/TestDataFormatterRefPtrRecursion.py (1100 of 2121)
PASS: lldb-unit :: UnwindAssembly/x86/./UnwindAssemblyx86Tests/Testx86AssemblyInspectionEngine.TestPushEBP (1101 of 2121)
UNSUPPORTED: lldb-shell :: ScriptInterpreter/Lua/bindings.test (1102 of 2121)
PASS: lldb-api :: functionalities/breakpoint/breakpoint_by_line_and_column/TestBreakpointByLineAndColumn.py (1103 of 2121)
PASS: lldb-unit :: Symbol/./SymbolTests/LineEntryTest.GetSameLineContiguousAddressRangeNestedInline (1104 of 2121)
PASS: lldb-unit :: Core/./LLDBCoreTests/MangledTest.ResultForValidName (1105 of 2121)
PASS: lldb-unit :: Expression/./ExpressionTests/DiagnosticManagerTest.GetStringSeverityLabels (1106 of 2121)
PASS: lldb-unit :: SymbolFile/DWARF/./SymbolFileDWARFTests/SymbolFileDWARFTests.TestAbilitiesForDWARF (1107 of 2121)
PASS: lldb-unit :: Symbol/./SymbolTests/SymbolsTest.LocateExecutableSymbolFileForUnknownExecutableAndMissingSymbolFile (1108 of 2121)
UNSUPPORTED: lldb-api :: benchmarks/continue/TestBenchmarkContinue.py (1109 of 2121)
UNSUPPORTED: lldb-shell :: Register/arm-gp-read.test (1110 of 2121)
PASS: lldb-unit :: Utility/./UtilityTests/OptionsWithRawTest.WhitespaceInput (1111 of 2121)
PASS: lldb-unit :: Host/./HostTests/FileSystemTest.Readable (1112 of 2121)
PASS: lldb-shell :: Driver/TestTarget.test (1113 of 2121)
PASS: lldb-api :: commands/platform/basic/TestPlatformPython.py (1114 of 2121)
PASS: lldb-api :: commands/expression/timeout/TestCallWithTimeout.py (1115 of 2121)
PASS: lldb-api :: lang/objc/objc-baseclass-sbtype/TestObjCBaseClassSBType.py (1116 of 2121)
PASS: lldb-shell :: SymbolFile/DWARF/debug-names-compressed.cpp (1117 of 2121)
PASS: lldb-api :: commands/process/launch/TestProcessLaunch.py (1118 of 2121)
PASS: lldb-api :: functionalities/postmortem/mach-core/TestMachCore.py (1119 of 2121)
PASS: lldb-unit :: API/./APITests/SBCommandInterpreterTest.MultiWordCommand (1120 of 2121)
PASS: lldb-unit :: UnwindAssembly/x86/./UnwindAssemblyx86Tests/Testx86AssemblyInspectionEngine.TestPushR13 (1121 of 2121)
PASS: lldb-api :: macosx/order/TestOrderFile.py (1122 of 2121)
PASS: lldb-api :: lang/cpp/class_static/TestStaticVariables.py (1123 of 2121)
PASS: lldb-unit :: Utility/./UtilityTests/LogChannelEnabledTest.LogVerboseThread (1124 of 2121)
PASS: lldb-unit :: Utility/./UtilityTests/StreamTeeTest.Constructor1Stream (1125 of 2121)
PASS: lldb-unit :: Language/CPlusPlus/./LanguageCPlusPlusTests/CPlusPlusLanguage.ExtractContextAndIdentifier (1126 of 2121)
UNSUPPORTED: lldb-api :: tools/lldb-vscode/completions/TestVSCode_completions.py (1127 of 2121)
PASS: lldb-api :: lang/cpp/class-template-parameter-pack/TestClassTemplateParameterPack.py (1128 of 2121)
PASS: lldb-shell :: SymbolFile/DWARF/debug_line-tombstone.s (1129 of 2121)
PASS: lldb-api :: lang/cpp/trivial_abi/TestTrivialABI.py (1130 of 2121)
PASS: lldb-api :: macosx/safe-to-func-call/TestSafeFuncCalls.py (1131 of 2121)
PASS: lldb-api :: commands/expression/dont_allow_jit/TestAllowJIT.py (1132 of 2121)
PASS: lldb-api :: commands/expression/scoped_enums/TestScopedEnumType.py (1133 of 2121)
PASS: lldb-api :: commands/gui/viewlarge/TestGuiViewLarge.py (1134 of 2121)
PASS: lldb-api :: functionalities/data-formatter/var-in-aggregate-misuse/TestVarInAggregateMisuse.py (1135 of 2121)
PASS: lldb-api :: python_api/sbstructureddata/TestStructuredDataAPI.py (1136 of 2121)
PASS: lldb-api :: lang/objc/modules-update/TestClangModulesUpdate.py (1137 of 2121)
PASS: lldb-api :: python_api/watchpoint/watchlocation/TestSetWatchlocation.py (1138 of 2121)
PASS: lldb-unit :: Core/./LLDBCoreTests/ModuleSpecTest.TestCOFFFile (1139 of 2121)
PASS: lldb-unit :: Target/./TargetTests/MCBasedABI.MapRegisterName (1140 of 2121)
PASS: lldb-unit :: Utility/./UtilityTests/ScalarTest.ExtractBitfield (1141 of 2121)
PASS: lldb-unit :: ObjectFile/Breakpad/./ObjectFileBreakpadTests/PublicRecord.parse (1142 of 2121)
PASS: lldb-shell :: Quit/TestQuitExitCode0.test (1143 of 2121)
PASS: lldb-unit :: Symbol/./SymbolTests/LineEntryTest.GetSameLineContiguousAddressRangeNoInlines (1144 of 2121)
PASS: lldb-api :: python_api/get-value-32bit-int/TestGetValue32BitInt.py (1145 of 2121)
PASS: lldb-api :: tools/lldb-server/TestGdbRemoteExpeditedRegisters.py (1146 of 2121)
PASS: lldb-shell :: SymbolFile/DWARF/clang-ast-from-dwarf-objc-property.m (1147 of 2121)
PASS: lldb-api :: lang/cpp/dynamic-value-same-basename/TestDynamicValueSameBase.py (1148 of 2121)
PASS: lldb-api :: lang/c/shared_lib/TestSharedLib.py (1149 of 2121)
PASS: lldb-shell :: SymbolFile/DWARF/DW_AT_declaration-with-children.s (1150 of 2121)
PASS: lldb-api :: lang/cpp/virtual-overload/TestVirtualOverload.py (1151 of 2121)
PASS: lldb-unit :: Disassembler/./DisassemblerTests/TestArm64Disassembly.TestArmv81Instruction (1152 of 2121)
PASS: lldb-unit :: ScriptInterpreter/Python/./ScriptInterpreterPythonTests/PythonDataObjectsTest.TestModuleNameResolutionNoDot (1153 of 2121)
PASS: lldb-api :: functionalities/gdb_remote_client/TestWriteMemory.py (1154 of 2121)
UNSUPPORTED: lldb-api :: commands/target/auto-install-main-executable/TestAutoInstallMainExecutable.py (1155 of 2121)
UNSUPPORTED: lldb-api :: commands/watchpoints/multi_watchpoint_slots/TestWatchpointMultipleSlots.py (1156 of 2121)
PASS: lldb-shell :: Settings/TestModuleCacheSanity.test (1157 of 2121)
PASS: lldb-shell :: SymbolFile/Breakpad/unwind-via-stack-cfi.test (1158 of 2121)
PASS: lldb-shell :: SymbolFile/Breakpad/symtab.test (1159 of 2121)
PASS: lldb-unit :: Utility/./UtilityTests/BinaryStreamTest.PutULEB128ThreeBytes (1160 of 2121)
PASS: lldb-api :: commands/expression/test/TestExprs2.py (1161 of 2121)
PASS: lldb-api :: lang/cpp/static_methods/TestCPPStaticMethods.py (1162 of 2121)
PASS: lldb-unit :: Utility/./UtilityTests/StringExtractorTest.GetNameColonValueNoSemicolon (1163 of 2121)
PASS: lldb-shell :: SymbolFile/DWARF/deterministic-build.cpp (1164 of 2121)
PASS: lldb-api :: functionalities/thread/concurrent_events/TestConcurrentWatchBreakDelay.py (1165 of 2121)
PASS: lldb-api :: lang/cpp/member-and-local-vars-with-same-name/TestMembersAndLocalsWithSameName.py (1166 of 2121)
PASS: lldb-api :: functionalities/data-formatter/cstring-utf8-summary/TestCstringUnicode.py (1167 of 2121)
UNSUPPORTED: lldb-api :: benchmarks/libcxxlist/TestBenchmarkLibcxxList.py (1168 of 2121)
PASS: lldb-api :: macosx/duplicate-archive-members/TestDuplicateMembers.py (1169 of 2121)
PASS: lldb-unit :: ObjectFile/Breakpad/./ObjectFileBreakpadTests/FuncRecord.parse (1170 of 2121)
PASS: lldb-unit :: UnwindAssembly/x86/./UnwindAssemblyx86Tests/Testx86AssemblyInspectionEngine.TestSimplex86_64Augmented (1171 of 2121)
PASS: lldb-api :: functionalities/gdb_remote_client/TestRestartBug.py (1172 of 2121)
PASS: lldb-shell :: SymbolFile/NativePDB/bitfields.cpp (1173 of 2121)
PASS: lldb-api :: lang/cpp/virtual-functions/TestCppVirtualFunctions.py (1174 of 2121)
PASS: lldb-api :: types/TestCharType.py (1175 of 2121)
PASS: lldb-api :: tools/lldb-vscode/breakpoint/TestVSCode_setExceptionBreakpoints.py (1176 of 2121)
PASS: lldb-unit :: Utility/./UtilityTests/UriParserTest.Empty (1177 of 2121)
PASS: lldb-unit :: Utility/./UtilityTests/StringExtractorTest.GetHexBytes_Underflow (1178 of 2121)
PASS: lldb-api :: lang/objc/objc-super/TestObjCSuper.py (1179 of 2121)
PASS: lldb-unit :: Utility/./UtilityTests/SerializationRountripTest.SerializeDeserializeCStringArray (1180 of 2121)
PASS: lldb-unit :: Process/gdb-remote/./ProcessGdbRemoteTests/GDBRemoteCommunicationClientTest.SendGetTraceConfigPacket (1181 of 2121)
PASS: lldb-api :: functionalities/unwind/zeroth_frame/TestZerothFrame.py (1182 of 2121)
PASS: lldb-api :: commands/expression/call-function/TestCallUserDefinedFunction.py (1183 of 2121)
PASS: lldb-unit :: SymbolFile/DWARF/./SymbolFileDWARFTests/SymbolFileDWARFTests.TestAbbrevOrder1Start5 (1184 of 2121)
PASS: lldb-api :: functionalities/inline-stepping/TestInlineStepping.py (1185 of 2121)
PASS: lldb-api :: functionalities/breakpoint/cpp/TestCPPBreakpointLocations.py (1186 of 2121)
PASS: lldb-api :: commands/watchpoints/multiple_threads/TestWatchpointMultipleThreads.py (1187 of 2121)
PASS: lldb-unit :: Utility/./UtilityTests/LogChannelTest.EnableOptions (1188 of 2121)
UNSUPPORTED: lldb-api :: functionalities/darwin_log/source/debug/TestDarwinLogSourceDebug.py (1189 of 2121)
PASS: lldb-unit :: Utility/./UtilityTests/StringExtractorTest.GetHexBytesAvail_Underflow (1190 of 2121)
PASS: lldb-unit :: Process/gdb-remote/./ProcessGdbRemoteTests/GDBRemoteCommunicationClientTest.SaveRestoreRegistersNoSuffix (1191 of 2121)
PASS: lldb-api :: macosx/dyld-trie-symbols/TestDyldTrieSymbols.py (1192 of 2121)
PASS: lldb-api :: functionalities/thread/concurrent_events/TestConcurrentDelayedCrashWithBreakpointWatchpoint.py (1193 of 2121)
PASS: lldb-api :: lang/objc/objc-new-syntax/TestObjCNewSyntaxDictionary.py (1194 of 2121)
PASS: lldb-api :: functionalities/data-formatter/data-formatter-named-summaries/TestDataFormatterNamedSummaries.py (1195 of 2121)
PASS: lldb-unit :: Utility/./UtilityTests/StreamTest.PutULEB128 (1196 of 2121)
PASS: lldb-unit :: Process/minidump/./LLDBMinidumpTests/MinidumpParserTest.GetMemoryRegionInfoFromMemoryList (1197 of 2121)
PASS: lldb-api :: commands/process/signal/TestProcessSignal.py (1198 of 2121)
TIMEOUT: lldb-api :: macosx/simulator/TestSimulatorPlatform.py (1199 of 2121)
******************** TEST 'lldb-api :: macosx/simulator/TestSimulatorPlatform.py' FAILED ********************
Script:
--
/usr/local/Frameworks/Python.framework/Versions/3.7/bin/python3.7 /Users/buildslave/jenkins/workspace/lldb-cmake/llvm-project/lldb/test/API/dotest.py --arch x86_64 -s /Users/buildslave/jenkins/workspace/lldb-cmake/lldb-build/lldb-test-traces -S nm -u CXXFLAGS -u CFLAGS --codesign-identity - --server /Users/buildslave/jenkins/workspace/lldb-cmake/lldb-build/./bin/debugserver --arch x86_64 --build-dir /Users/buildslave/jenkins/workspace/lldb-cmake/lldb-build/lldb-test-build.noindex -s=/Users/buildslave/jenkins/workspace/lldb-cmake/test/logs -t --env TERM=vt100 --env LLVM_LIBS_DIR=/Users/buildslave/jenkins/workspace/lldb-cmake/lldb-build/./lib --build-dir /Users/buildslave/jenkins/workspace/lldb-cmake/lldb-build/lldb-test-build.noindex --lldb-module-cache-dir /Users/buildslave/jenkins/workspace/lldb-cmake/lldb-build/lldb-test-build.noindex/module-cache-lldb/lldb-api --clang-module-cache-dir /Users/buildslave/jenkins/workspace/lldb-cmake/lldb-build/lldb-test-build.noindex/module-cache-clang/lldb-api --executable /Users/buildslave/jenkins/workspace/lldb-cmake/lldb-build/./bin/lldb --compiler /Users/buildslave/jenkins/workspace/lldb-cmake/lldb-build/./bin/clang --dsymutil /Users/buildslave/jenkins/workspace/lldb-cmake/lldb-build/./bin/dsymutil --filecheck /Users/buildslave/jenkins/workspace/lldb-cmake/lldb-build/./bin/FileCheck --yaml2obj /Users/buildslave/jenkins/workspace/lldb-cmake/lldb-build/./bin/yaml2obj --lldb-libs-dir /Users/buildslave/jenkins/workspace/lldb-cmake/lldb-build/./lib /Users/buildslave/jenkins/workspace/lldb-cmake/llvm-project/lldb/test/API/macosx/simulator -p TestSimulatorPlatform.py
--
Exit Code: -9
Timeout: Reached timeout of 600 seconds

Hide Details

Command Output (stdout): -- lldb version 12.0.99 clang revision 5c1fe4e20f887286baac6989943a0875e12834fe llvm revision 5c1fe4e20f887286baac6989943a0875e12834fe

Hide Details

-- Command Output (stderr): --

Hide Details

Session logs for test failures/errors/unexpected successes will go into directory '/Users/buildslave/jenkins/workspace/lldb-cmake/test/logs' Change dir to: /Users/buildslave/jenkins/workspace/lldb-cmake/llvm-project/lldb/test/API/macosx/simulator runCmd: settings clear -all output:

Hide Details

runCmd: settings set symbols.enable-external-lookup false output:

Hide Details

runCmd: settings set target.inherit-tcc true output:

Hide Details

runCmd: settings set target.auto-apply-fixits false output:

Hide Details

runCmd: settings set plugin.process.gdb-remote.packet-timeout 60 output:

Hide Details

runCmd: settings set symbols.clang-modules-cache-path "/Users/buildslave/jenkins/workspace/lldb-cmake/lldb-build/lldb-test-build.noindex/module-cache-lldb/lldb-api" output:

Hide Details

runCmd: settings set use-color false output:

Hide Details

runCmd: setting set target.prefer-dynamic-value no-dynamic-values output:

Hide Details

runCmd: log enable gdb-remote packets -f /Users/buildslave/jenkins/workspace/lldb-cmake/lldb-build/lldb-test-build.noindex/macosx/simulator/TestSimulatorPlatform.test_ios/packets.log output:

Hide Details

runCmd: image list -b -t output: [ 0] a.out x86_64-apple-ios13.5.0-simulator [ 1] dyld x86_64-apple-macosx10.15.0 [ 2] dyld_sim x86_64-apple-ios13.5.0-simulator [ 3] libc++.1.dylib x86_64-apple-ios13.5.0-simulator [ 4] libSystem.B.dylib x86_64-apple-ios13.5.0-simulator [ 5] libc++abi.dylib x86_64-apple-ios13.5.0-simulator [ 6] libcache.dylib x86_64-apple-ios13.5.0-simulator [ 7] libcommonCrypto.dylib x86_64-apple-ios13.5.0-simulator [ 8] libcompiler_rt.dylib x86_64-apple-ios13.5.0-simulator [ 9] libcopyfile.dylib x86_64-apple-ios13.5.0-simulator [ 10] libcorecrypto.dylib x86_64-apple-ios13.5.0-simulator [ 11] libdispatch.dylib x86_64-apple-ios13.5.0-simulator [ 12] libdyld.dylib x86_64-apple-ios13.5.0-simulator [ 13] liblaunch.dylib x86_64-apple-ios13.5.0-simulator [ 14] libmacho.dylib x86_64-apple-ios13.5.0-simulator [ 15] libremovefile.dylib x86_64-apple-ios13.5.0-simulator [ 16] libsystem_asl.dylib x86_64-apple-ios13.5.0-simulator [ 17] libsystem_blocks.dylib x86_64-apple-ios13.5.0-simulator [ 18] libsystem_c.dylib x86_64-apple-ios13.5.0-simulator [ 19] libsystem_configuration.dylib x86_64-apple-ios13.5.0-simulator [ 20] libsystem_containermanager.dylib x86_64-apple-ios13.5.0-simulator [ 21] libsystem_coreservices.dylib x86_64-apple-ios13.5.0-simulator [ 22] libsystem_darwin.dylib x86_64-apple-ios13.5.0-simulator [ 23] libsystem_dnssd.dylib x86_64-apple-ios13.5.0-simulator [ 24] libsystem_featureflags.dylib x86_64-apple-ios13.5.0-simulator [ 25] libsystem_info.dylib x86_64-apple-ios13.5.0-simulator [ 26] libsystem_m.dylib x86_64-apple-ios13.5.0-simulator [ 27] libsystem_malloc.dylib x86_64-apple-ios13.5.0-simulator [ 28] libsystem_notify.dylib x86_64-apple-ios13.5.0-simulator [ 29] libsystem_sandbox.dylib x86_64-apple-ios13.5.0-simulator [ 30] libsystem_sim_kernel.dylib x86_64-apple-ios13.5.0-simulator [ 31] libsystem_sim_platform.dylib x86_64-apple-ios13.5.0-simulator [ 32] libsystem_sim_pthread.dylib x86_64-apple-ios13.5.0-simulator [ 33] libsystem_trace.dylib x86_64-apple-ios13.5.0-simulator [ 34] libunwind.dylib x86_64-apple-ios13.5.0-simulator [ 35] libxpc.dylib x86_64-apple-ios13.5.0-simulator [ 36] libsystem_sim_pthread_host.dylib x86_64-apple-ios13.5.0-simulator [ 37] libsystem_sim_platform_host.dylib x86_64-apple-ios13.5.0-simulator [ 38] libsystem_sim_kernel_host.dylib x86_64-apple-ios13.5.0-simulator [ 39] libsystem_kernel.dylib x86_64-apple-macosx10.15.0-simulator(0x00007fff51b5a000) [ 40] libobjc.A.dylib x86_64-apple-ios13.5.0-simulator [ 41] libsystem_platform.dylib x86_64-apple-macosx10.15.0-simulator(0x00007fff51bfd000) [ 42] libsystem_pthread.dylib x86_64-apple-macosx10.15.0-simulator(0x00007fff51c06000)

Hide Details

Hide Details

Expecting pattern: a\.out x86_64-apple-ios.*-simulator Matched

Hide Details

<bound method SBProcess.Kill of <lldb.SBProcess; proxy of <Swig Object of type 'lldb::SBProcess *' at 0x102c829c0> >>: success

Hide Details

PASS: LLDB (/Users/buildslave/jenkins/workspace/lldb-cmake/lldb-build/bin/clang-x86_64) :: test_ios (TestSimulatorPlatform.TestSimulatorPlatformLaunching) runCmd: settings clear -all output:

Hide Details

runCmd: settings set symbols.enable-external-lookup false output:

Hide Details

runCmd: settings set target.inherit-tcc true output:

Hide Details

runCmd: settings set target.auto-apply-fixits false output:

Hide Details

runCmd: settings set plugin.process.gdb-remote.packet-timeout 60 output:

Hide Details

runCmd: settings set symbols.clang-modules-cache-path "/Users/buildslave/jenkins/workspace/lldb-cmake/lldb-build/lldb-test-build.noindex/module-cache-lldb/lldb-api" output:

Hide Details

runCmd: settings set use-color false output:

Hide Details

runCmd: setting set target.prefer-dynamic-value no-dynamic-values output:

Hide Details

UNSUPPORTED: LLDB (/Users/buildslave/jenkins/workspace/lldb-cmake/lldb-build/bin/clang-x86_64) :: test_ios_backdeploy_apple_silicon (TestSimulatorPlatform.TestSimulatorPlatformLaunching) (skipping due to the following parameter(s): architecture) runCmd: settings clear -all output:

Hide Details

runCmd: settings set symbols.enable-external-lookup false output:

Hide Details

runCmd: settings set target.inherit-tcc true output:

Hide Details

runCmd: settings set target.auto-apply-fixits false output:

Hide Details

runCmd: settings set plugin.process.gdb-remote.packet-timeout 60 output:

Hide Details

runCmd: settings set symbols.clang-modules-cache-path "/Users/buildslave/jenkins/workspace/lldb-cmake/lldb-build/lldb-test-build.noindex/module-cache-lldb/lldb-api" output:

Hide Details

runCmd: settings set use-color false output:

Hide Details

runCmd: setting set target.prefer-dynamic-value no-dynamic-values output:

Hide Details

runCmd: log enable gdb-remote packets -f /Users/buildslave/jenkins/workspace/lldb-cmake/lldb-build/lldb-test-build.noindex/macosx/simulator/TestSimulatorPlatform.test_ios_backdeploy_x86/packets.log output:

Hide Details

runCmd: image list -b -t output: [ 0] a.out x86_64-apple-ios13.0.0-simulator [ 1] dyld x86_64-apple-macosx10.15.0 [ 2] dyld_sim x86_64-apple-ios13.5.0-simulator [ 3] libc++.1.dylib x86_64-apple-ios13.5.0-simulator [ 4] libSystem.B.dylib x86_64-apple-ios13.5.0-simulator [ 5] libc++abi.dylib x86_64-apple-ios13.5.0-simulator [ 6] libcache.dylib x86_64-apple-ios13.5.0-simulator [ 7] libcommonCrypto.dylib x86_64-apple-ios13.5.0-simulator [ 8] libcompiler_rt.dylib x86_64-apple-ios13.5.0-simulator [ 9] libcopyfile.dylib x86_64-apple-ios13.5.0-simulator [ 10] libcorecrypto.dylib x86_64-apple-ios13.5.0-simulator [ 11] libdispatch.dylib x86_64-apple-ios13.5.0-simulator [ 12] libdyld.dylib x86_64-apple-ios13.5.0-simulator [ 13] liblaunch.dylib x86_64-apple-ios13.5.0-simulator [ 14] libmacho.dylib x86_64-apple-ios13.5.0-simulator [ 15] libremovefile.dylib x86_64-apple-ios13.5.0-simulator [ 16] libsystem_asl.dylib x86_64-apple-ios13.5.0-simulator [ 17] libsystem_blocks.dylib x86_64-apple-ios13.5.0-simulator [ 18] libsystem_c.dylib x86_64-apple-ios13.5.0-simulator [ 19] libsystem_configuration.dylib x86_64-apple-ios13.5.0-simulator [ 20] libsystem_containermanager.dylib x86_64-apple-ios13.5.0-simulator [ 21] libsystem_coreservices.dylib x86_64-apple-ios13.5.0-simulator [ 22] libsystem_darwin.dylib x86_64-apple-ios13.5.0-simulator [ 23] libsystem_dnssd.dylib x86_64-apple-ios13.5.0-simulator [ 24] libsystem_featureflags.dylib x86_64-apple-ios13.5.0-simulator [ 25] libsystem_info.dylib x86_64-apple-ios13.5.0-simulator [ 26] libsystem_m.dylib x86_64-apple-ios13.5.0-simulator [ 27] libsystem_malloc.dylib x86_64-apple-ios13.5.0-simulator [ 28] libsystem_notify.dylib x86_64-apple-ios13.5.0-simulator [ 29] libsystem_sandbox.dylib x86_64-apple-ios13.5.0-simulator [ 30] libsystem_sim_kernel.dylib x86_64-apple-ios13.5.0-simulator [ 31] libsystem_sim_platform.dylib x86_64-apple-ios13.5.0-simulator [ 32] libsystem_sim_pthread.dylib x86_64-apple-ios13.5.0-simulator [ 33] libsystem_trace.dylib x86_64-apple-ios13.5.0-simulator [ 34] libunwind.dylib x86_64-apple-ios13.5.0-simulator [ 35] libxpc.dylib x86_64-apple-ios13.5.0-simulator [ 36] libsystem_sim_pthread_host.dylib x86_64-apple-ios13.5.0-simulator [ 37] libsystem_sim_platform_host.dylib x86_64-apple-ios13.5.0-simulator [ 38] libsystem_sim_kernel_host.dylib x86_64-apple-ios13.5.0-simulator [ 39] libsystem_kernel.dylib x86_64-apple-macosx10.15.0-simulator(0x00007fff51b5a000) [ 40] libobjc.A.dylib x86_64-apple-ios13.5.0-simulator [ 41] libsystem_platform.dylib x86_64-apple-macosx10.15.0-simulator(0x00007fff51bfd000) [ 42] libsystem_pthread.dylib x86_64-apple-macosx10.15.0-simulator(0x00007fff51c06000)

Hide Details

Hide Details

--

Hide Details

******************** PASS: lldb-unit :: Process/minidump/./LLDBMinidumpTests/MinidumpParserTest.GetArchitectureWindows (1200 of 2121) PASS: lldb-api :: functionalities/postmortem/netbsd-core/TestNetBSDCore.py (1201 of 2121) PASS: lldb-unit :: Utility/./UtilityTests/PassiveReplayTest.InstrumentedBarRef (1202 of 2121) PASS: lldb-api :: commands/watchpoints/watchpoint_commands/command/TestWatchpointCommandLLDB.py (1203 of 2121) PASS: lldb-api :: functionalities/backticks/TestBackticksWithoutATarget.py (1204 of 2121) PASS: lldb-unit :: Utility/./UtilityTests/OptionsWithRawTest.UnterminatedQuote (1205 of 2121) PASS: lldb-api :: lang/cpp/breakpoint_in_member_func_w_non_primitive_params/TestBreakpointInMemberFuncWNonPrimitiveParams.py (1206 of 2121) PASS: lldb-unit :: Language/Highlighting/./HighlighterTests/HighlighterTest.ClangUnterminatedString (1207 of 2121) PASS: lldb-unit :: Utility/./UtilityTests/StringLexerTest.Peek (1208 of 2121) PASS: lldb-api :: functionalities/thread_plan/TestThreadPlanCommands.py (1209 of 2121) PASS: lldb-unit :: Utility/./UtilityTests/ArgsTest.ReplaceArgumentAtIndexLonger (1210 of 2121) PASS: lldb-unit :: Utility/./UtilityTests/DataExtractorTest.GetMaxU64 (1211 of 2121) UNSUPPORTED: lldb-api :: functionalities/thread/concurrent_events/TestConcurrentManySignals.py (1212 of 2121) PASS: lldb-api :: tools/lldb-vscode/coreFile/TestVSCode_coreFile.py (1213 of 2121) PASS: lldb-unit :: Process/gdb-remote/./ProcessGdbRemoteTests/GDBRemoteClientBaseTest.SendContinueAndLateInterrupt (1214 of 2121) PASS: lldb-api :: lang/cpp/template/TestTemplateArgs.py (1215 of 2121) PASS: lldb-unit :: DataFormatter/./LLDBFormatterTests/FormatManagerTests.CompatibleLangs (1216 of 2121) PASS: lldb-api :: functionalities/breakpoint/comp_dir_symlink/TestCompDirSymLink.py (1217 of 2121) PASS: lldb-unit :: Utility/./UtilityTests/BinaryStreamTest.PutSLEB128EightBytes (1218 of 2121) PASS: lldb-api :: commands/expression/ignore-artificial-constructors/TestIgnoreArtificialConstructors.py (1219 of 2121) PASS: lldb-unit :: UnwindAssembly/x86/./UnwindAssemblyx86Tests/Testx86AssemblyInspectionEngine.Test32BitOnlyInstruction (1220 of 2121) PASS: lldb-unit :: Utility/./UtilityTests/UriParserTest.BracketedHostnameWithPortIPv4 (1221 of 2121) PASS: lldb-api :: lang/objc/ivar-IMP/TestObjCiVarIMP.py (1222 of 2121) PASS: lldb-unit :: Utility/./UtilityTests/UriParserTest.MinimalPath (1223 of 2121) PASS: lldb-unit :: debugserver/./debugserverTests/RNBSocket.LoopBackListenIPv6 (1224 of 2121) PASS: lldb-api :: macosx/indirect_symbol/TestIndirectSymbols.py (1225 of 2121) PASS: lldb-api :: python_api/name_lookup/TestNameLookup.py (1226 of 2121) PASS: lldb-unit :: Utility/./UtilityTests/ArgsTest.TestUnknownEscape (1227 of 2121) PASS: lldb-api :: functionalities/set-data/TestSetData.py (1228 of 2121) PASS: lldb-unit :: UnwindAssembly/x86/./UnwindAssemblyx86Tests/Testx86AssemblyInspectionEngine.TestStackRealign32BitDisp_x86_64 (1229 of 2121) PASS: lldb-api :: lang/objcxx/objcxx-ivar-vector/TestIvarVector.py (1230 of 2121) PASS: lldb-unit :: Utility/./UtilityTests/NameMatchesTest.Contains (1231 of 2121) PASS: lldb-unit :: Process/gdb-remote/./ProcessGdbRemoteTests/GDBRemoteClientBaseTest.SendContinueAndInterrupt (1232 of 2121) PASS: lldb-shell :: ExecControl/StopHook/stop-hook.test (1233 of 2121) PASS: lldb-unit :: Target/./TargetTests/PathMappingListTest.AbsoluteTests (1234 of 2121) PASS: lldb-unit :: Utility/./UtilityTests/StringExtractorTest.GetHexBytesAvail_OddPair (1235 of 2121) PASS: lldb-shell :: Settings/TestSettingsSet.test (1236 of 2121) PASS: lldb-unit :: Utility/./UtilityTests/StringListTest.SetSize (1237 of 2121) PASS: lldb-unit :: Utility/./UtilityTests/VMRange.IsValid (1238 of 2121) PASS: lldb-shell :: Unwind/thread-step-out-ret-addr-check.test (1239 of 2121) PASS: lldb-api :: functionalities/thread/concurrent_events/TestConcurrentCrashWithSignal.py (1240 of 2121) PASS: lldb-api :: lang/objc/modules-non-objc-target/TestObjCModulesNonObjCTarget.py (1241 of 2121) PASS: lldb-shell :: ObjectFile/ELF/section-permissions.yaml (1242 of 2121) PASS: lldb-unit :: Utility/./UtilityTests/RangeTest.SizeTypes (1243 of 2121) PASS: lldb-api :: lang/objc/blocks/TestObjCIvarsInBlocks.py (1244 of 2121) PASS: lldb-api :: functionalities/wrong_commands/TestWrongCommands.py (1245 of 2121) PASS: lldb-unit :: Process/gdb-remote/./ProcessGdbRemoteTests/GDBRemoteCommunicationTest.ReadPacket_checksum (1246 of 2121) PASS: lldb-unit :: Utility/./UtilityTests/StringExtractorTest.DecodeHexU8_Underflow2 (1247 of 2121) UNSUPPORTED: lldb-api :: api/multiple-debuggers/TestMultipleDebuggers.py (1248 of 2121) PASS: lldb-api :: functionalities/step-avoids-no-debug/TestStepNoDebug.py (1249 of 2121) XFAIL: lldb-shell :: SymbolFile/DWARF/find-type-in-function.cpp (1250 of 2121) PASS: lldb-unit :: Host/./HostTests/File.GetStreamFromDescriptor (1251 of 2121) PASS: lldb-api :: lang/cpp/nsimport/TestCppNsImport.py (1252 of 2121) PASS: lldb-api :: commands/expression/class_template_specialization_empty_pack/TestClassTemplateSpecializationParametersHandling.py (1253 of 2121) UNSUPPORTED: lldb-api :: functionalities/darwin_log/format/TestDarwinLogMessageFormat.py (1254 of 2121) PASS: lldb-api :: python_api/watchpoint/TestSetWatchpoint.py (1255 of 2121) PASS: lldb-api :: functionalities/data-formatter/data-formatter-cpp/TestDataFormatterCpp.py (1256 of 2121) PASS: lldb-api :: functionalities/thread/ignore_suspended/TestIgnoreSuspendedThread.py (1257 of 2121) PASS: lldb-shell :: ObjectFile/ELF/section-types.yaml (1258 of 2121) PASS: lldb-api :: functionalities/thread/exit_during_expression/TestExitDuringExpression.py (1259 of 2121) PASS: lldb-unit :: Process/gdb-remote/./ProcessGdbRemoteTests/GDBRemoteCommunicationServerTest.SendErrorResponse_ErrorList (1260 of 2121) PASS: lldb-api :: python_api/symbol-context/TestSymbolContext.py (1261 of 2121) PASS: lldb-shell :: ScriptInterpreter/None/none.test (1262 of 2121) PASS: lldb-unit :: Host/./HostTests/Host.WaitStatusFormat (1263 of 2121) PASS: lldb-api :: lang/objc/objc-static-method-stripped/TestObjCStaticMethodStripped.py (1264 of 2121) PASS: lldb-api :: functionalities/breakpoint/breakpoint_conditions/TestBreakpointConditions.py (1265 of 2121) PASS: lldb-unit :: Utility/./UtilityTests/GeneratorTest.Get (1266 of 2121) PASS: lldb-api :: functionalities/thread/concurrent_events/TestConcurrentCrashWithWatchpoint.py (1267 of 2121) PASS: lldb-unit :: Utility/./UtilityTests/StringExtractorTest.GetHexBytes_OddPair2 (1268 of 2121) PASS: lldb-api :: commands/target/select/TestTargetSelect.py (1269 of 2121) PASS: lldb-unit :: Utility/./UtilityTests/StringListTest.InsertStringAtIndexMove (1270 of 2121) PASS: lldb-unit :: Utility/./UtilityTests/ArgsTest.ReplaceArgumentAtIndexShort (1271 of 2121) PASS: lldb-shell :: Reproducer/TestGDBRemoteRepro.test (1272 of 2121) PASS: lldb-api :: lang/cpp/namespace_definitions/TestNamespaceDefinitions.py (1273 of 2121) UNSUPPORTED: lldb-api :: functionalities/darwin_log/filter/regex/category/TestDarwinLogFilterRegexCategory.py (1274 of 2121) PASS: lldb-api :: commands/frame/diagnose/local-variable/TestLocalVariable.py (1275 of 2121) PASS: lldb-api :: functionalities/data-formatter/nsarraysynth/TestNSArraySynthetic.py (1276 of 2121) PASS: lldb-api :: types/TestShortType.py (1277 of 2121) PASS: lldb-unit :: Utility/./UtilityTests/RangeTest.Slide (1278 of 2121) PASS: lldb-api :: lang/objc/print-obj/TestPrintObj.py (1279 of 2121) PASS: lldb-unit :: Host/./HostTests/MainLoopTest.ReadObject (1280 of 2121) PASS: lldb-api :: functionalities/thread/concurrent_events/TestConcurrentManyBreakpoints.py (1281 of 2121) PASS: lldb-unit :: Core/./LLDBCoreTests/MangledTest.ResultForBlockInvocation (1282 of 2121) PASS: lldb-api :: functionalities/data-formatter/data-formatter-objc/TestDataFormatterObjCNSError.py (1283 of 2121) PASS: lldb-unit :: Utility/./UtilityTests/RangeTest.ClearWithStarAddress (1284 of 2121) PASS: lldb-unit :: Process/minidump/./LLDBMinidumpTests/MinidumpParserTest.GetArchitecture (1285 of 2121) PASS: lldb-unit :: Utility/./UtilityTests/Flags.Test (1286 of 2121) PASS: lldb-unit :: ScriptInterpreter/Python/./ScriptInterpreterPythonTests/PythonDataObjectsTest.TestRun (1287 of 2121) PASS: lldb-api :: commands/expression/cast_int_to_anonymous_enum/TestCastIntToAnonymousEnum.py (1288 of 2121) PASS: lldb-shell :: Minidump/fb-dump.test (1289 of 2121) PASS: lldb-unit :: Symbol/./SymbolTests/TestTypeSystemClang.TestRemoveFastQualifiers (1290 of 2121) PASS: lldb-shell :: Unwind/trap_frame_sym_ctx.test (1291 of 2121) PASS: lldb-unit :: Utility/./UtilityTests/StreamTeeTest.SetStreamAtIndexOutOfBounds (1292 of 2121) PASS: lldb-unit :: Language/Highlighting/./HighlighterTests/HighlighterTest.ClangOperators (1293 of 2121) PASS: lldb-unit :: Utility/./UtilityTests/PassiveReplayTest.InstrumentedFoo (1294 of 2121) PASS: lldb-unit :: Utility/./UtilityTests/FileSpecTest.PrependPathComponent (1295 of 2121) PASS: lldb-api :: lang/objc/forward-decl/TestForwardDecl.py (1296 of 2121) UNSUPPORTED: lldb-shell :: Register/x86-ymm-write.test (1297 of 2121) PASS: lldb-unit :: DataFormatter/./LLDBFormatterTests/StringPrinterTests.CxxASCII (1298 of 2121) PASS: lldb-unit :: Utility/./UtilityTests/StreamTest.AddressRangeSize (1299 of 2121) PASS: lldb-unit :: ScriptInterpreter/Python/./ScriptInterpreterPythonTests/PythonDataObjectsTest.TestPythonString (1300 of 2121) PASS: lldb-api :: functionalities/data-formatter/data-formatter-stl/libcxx/optional/TestDataFormatterLibcxxOptional.py (1301 of 2121) PASS: lldb-unit :: Thread/./ThreadTests/ThreadTest.GetPrivateStopInfo (1302 of 2121) PASS: lldb-unit :: Utility/./UtilityTests/StreamTest.PutCharWhitespace (1303 of 2121) PASS: lldb-api :: functionalities/data-formatter/data-formatter-objc/TestDataFormatterObjCKVO.py (1304 of 2121) PASS: lldb-shell :: ObjectFile/MachO/lc_build_version.yaml (1305 of 2121) PASS: lldb-unit :: ObjectFile/PECOFF/./ObjectFilePECOFFTests/PECallFrameInfoTest.Basic_eh (1306 of 2121) PASS: lldb-api :: functionalities/breakpoint/breakpoint_command/TestBreakpointCommandsFromPython.py (1307 of 2121) PASS: lldb-unit :: Host/./HostTests/NativeProcessProtocolTest.ReadMemoryWithoutTrap (1308 of 2121) PASS: lldb-api :: functionalities/non-overlapping-index-variable-i/TestIndexVariable.py (1309 of 2121) PASS: lldb-shell :: Commands/CommandScriptImmediateOutput/CommandScriptImmediateOutputConsole.test (1310 of 2121) PASS: lldb-unit :: Utility/./UtilityTests/UriParserTest.PortOverflow (1311 of 2121) PASS: lldb-shell :: SymbolFile/DWARF/DW_TAG_basic_type_DW_ATE_UTF_nonC.ll (1312 of 2121) PASS: lldb-unit :: Utility/./UtilityTests/ArchSpecTest.TestSetTriple (1313 of 2121) PASS: lldb-api :: tools/lldb-vscode/module/TestVSCode_module.py (1314 of 2121) PASS: lldb-unit :: Utility/./UtilityTests/StringListTest.SplitIntoLinesSingleTrailingCR (1315 of 2121) PASS: lldb-api :: lang/objc/foundation/TestObjCMethodsNSError.py (1316 of 2121) PASS: lldb-shell :: SymbolFile/NativePDB/break-by-line.cpp (1317 of 2121) PASS: lldb-unit :: DataFormatter/./LLDBFormatterTests/StringPrinterTests.CxxUTF8 (1318 of 2121) PASS: lldb-unit :: Utility/./UtilityTests/LogTest.Unregister (1319 of 2121) PASS: lldb-shell :: SymbolFile/NativePDB/global-classes.cpp (1320 of 2121) PASS: lldb-unit :: Utility/./UtilityTests/EventTest.DumpEventDataBytes (1321 of 2121) PASS: lldb-shell :: BuildScript/compiler-full-path.test (1322 of 2121) PASS: lldb-api :: commands/frame/var/TestFrameVar.py (1323 of 2121) PASS: lldb-api :: functionalities/gdb_remote_client/TestArmRegisterDefinition.py (1324 of 2121) PASS: lldb-unit :: Process/gdb-remote/./ProcessGdbRemoteTests/GDBRemoteCommunicationClientTest.SyncThreadState (1325 of 2121) PASS: lldb-unit :: UnwindAssembly/x86/./UnwindAssemblyx86Tests/Testx86AssemblyInspectionEngine.TestCALLNextInsn (1326 of 2121) PASS: lldb-api :: macosx/DBGSourcePathRemapping/TestDSYMSourcePathRemapping.py (1327 of 2121) PASS: lldb-unit :: Utility/./UtilityTests/NameMatchesTest.Ignore (1328 of 2121) PASS: lldb-unit :: Process/minidump/./LLDBMinidumpTests/RegisterContextMinidump.ConvertMinidumpContext_x86_32 (1329 of 2121) UNSUPPORTED: lldb-shell :: SymbolFile/PDB/variables.test (1330 of 2121) PASS: lldb-unit :: Utility/./UtilityTests/UUIDTest.SetFromStringRef (1331 of 2121) PASS: lldb-unit :: Utility/./UtilityTests/StringExtractorTest.GetHexU8_InvalidHex (1332 of 2121) PASS: lldb-unit :: Symbol/./SymbolTests/PostfixExpression.ParseOneExpression (1333 of 2121) PASS: lldb-api :: functionalities/var_path/TestVarPath.py (1334 of 2121) PASS: lldb-shell :: Quit/TestQuitExitCode-30.test (1335 of 2121) PASS: lldb-shell :: SymbolFile/NativePDB/function-types-calling-conv.cpp (1336 of 2121) PASS: lldb-unit :: Utility/./UtilityTests/ConstStringTest.UpdateMangledCounterpart (1337 of 2121) PASS: lldb-unit :: Utility/./UtilityTests/StringExtractorTest.DecodeHexU8_Underflow (1338 of 2121) PASS: lldb-api :: tools/lldb-vscode/attach/TestVSCode_attach.py (1339 of 2121) PASS: lldb-api :: commands/expression/static-initializers/TestStaticInitializers.py (1340 of 2121) PASS: lldb-unit :: Expression/./ExpressionTests/ClangHostTest.MacOSX (1341 of 2121) PASS: lldb-unit :: Platform/./LLDBPlatformTests/PlatformAppleSimulatorTest.TestHostPlatformToSim (1342 of 2121) PASS: lldb-shell :: SymbolFile/DWARF/dwp-separate-debug-file.cpp (1343 of 2121) PASS: lldb-api :: commands/command/delete/TestCommandDelete.py (1344 of 2121) PASS: lldb-api :: lang/cpp/stl/TestSTL.py (1345 of 2121) PASS: lldb-api :: functionalities/tail_call_frames/disambiguate_paths_to_common_sink/TestDisambiguatePathsToCommonSink.py (1346 of 2121) UNSUPPORTED: lldb-api :: linux/mix-dwo-and-regular-objects/TestMixedDwarfBinary.py (1347 of 2121) PASS: lldb-api :: python_api/lldbutil/frame/TestFrameUtils.py (1348 of 2121) PASS: lldb-unit :: Platform/Android/./AdbClientTests/AdbClientTest.CreateByDeviceId (1349 of 2121) PASS: lldb-api :: functionalities/thread/step_out/TestThreadStepOut.py (1350 of 2121) PASS: lldb-api :: functionalities/multiword-commands/TestMultiWordCommands.py (1351 of 2121) PASS: lldb-unit :: Utility/./UtilityTests/StringExtractorTest.GetU32BigEndian (1352 of 2121) PASS: lldb-unit :: Host/./HostTests/ConnectionFileDescriptorTest.TCPGetURIv4 (1353 of 2121) PASS: lldb-unit :: Target/./TargetTests/ModuleCacheTest.GetAndPutStrangeHostname (1354 of 2121) PASS: lldb-api :: functionalities/thread/concurrent_events/TestConcurrentBreakpointDelayBreakpointOneSignal.py (1355 of 2121) PASS: lldb-api :: functionalities/data-formatter/data-formatter-python-synth/TestDataFormatterPythonSynth.py (1356 of 2121) PASS: lldb-shell :: Reproducer/TestCrash.test (1357 of 2121) PASS: lldb-unit :: Symbol/./SymbolTests/TestClangASTImporter.MetadataPropagation (1358 of 2121) PASS: lldb-shell :: SymbolFile/DWARF/dwp-debug-types.s (1359 of 2121) PASS: lldb-api :: commands/disassemble/basic/TestDisassembleBreakpoint.py (1360 of 2121) PASS: lldb-unit :: UnwindAssembly/x86/./UnwindAssemblyx86Tests/Testx86AssemblyInspectionEngine.TestMovRSPtoRBP (1361 of 2121) PASS: lldb-unit :: Utility/./UtilityTests/DataExtractorTest.GetULEB128_bit63 (1362 of 2121) PASS: lldb-unit :: Utility/./UtilityTests/StreamTest.PutNHex8 (1363 of 2121) PASS: lldb-unit :: Utility/./UtilityTests/ScalarTest.Division (1364 of 2121) PASS: lldb-unit :: Host/./HostTests/FileActionTest.Open (1365 of 2121) PASS: lldb-api :: commands/frame/diagnose/virtual-method-call/TestDiagnoseDereferenceVirtualMethodCall.py (1366 of 2121) PASS: lldb-api :: lang/cpp/type_lookup/TestCppTypeLookup.py (1367 of 2121) PASS: lldb-unit :: Target/./TargetTests/StackFrameRecognizerTest.NullModuleRegex (1368 of 2121) PASS: lldb-unit :: Thread/./ThreadTests/ThreadTest.SetStopInfo (1369 of 2121) PASS: lldb-shell :: SymbolFile/DWARF/dwo-type-in-main-file.s (1370 of 2121) PASS: lldb-api :: functionalities/data-formatter/boolreference/TestFormattersBoolRefPtr.py (1371 of 2121) PASS: lldb-unit :: Symbol/./SymbolTests/LineEntryTest.GetSameLineContiguousAddressRangeOneInline (1372 of 2121) PASS: lldb-api :: python_api/value/change_values/TestChangeValueAPI.py (1373 of 2121) PASS: lldb-shell :: Settings/TestSettingsWrite.test (1374 of 2121) PASS: lldb-api :: commands/frame/diagnose/bad-reference/TestBadReference.py (1375 of 2121) PASS: lldb-unit :: Utility/./UtilityTests/NameMatchesTest.Equals (1376 of 2121) UNSUPPORTED: lldb-api :: functionalities/darwin_log/source/info/TestDarwinLogSourceInfo.py (1377 of 2121) PASS: lldb-api :: python_api/frame/TestFrames.py (1378 of 2121) PASS: lldb-api :: commands/target/stop-hooks/TestStopHooks.py (1379 of 2121) PASS: lldb-shell :: SymbolFile/DWARF/debug_loc_and_loclists.s (1380 of 2121) PASS: lldb-unit :: Expression/./ExpressionTests/DiagnosticManagerTest.PutStringSeverities (1381 of 2121) PASS: lldb-unit :: Process/minidump/./LLDBMinidumpTests/MinidumpParserTest.GetMiscInfoWindows (1382 of 2121) PASS: lldb-unit :: Utility/./UtilityTests/DeserializerTest.HasData (1383 of 2121) PASS: lldb-api :: macosx/profile_vrs_detach/TestDetachVrsProfile.py (1384 of 2121) UNSUPPORTED: lldb-shell :: SymbolFile/DWARF/DW_TAG_GNU_call_site-DW_AT_low_pc.s (1385 of 2121) PASS: lldb-shell :: SymbolFile/DWARF/dwp.s (1386 of 2121) PASS: lldb-shell :: SymbolFile/DWARF/debug-types-signature-loop.s (1387 of 2121) PASS: lldb-unit :: Utility/./UtilityTests/StreamTest.ChangingByteOrder (1388 of 2121) PASS: lldb-shell :: Minidump/Windows/arm-fp-unwind.test (1389 of 2121) PASS: lldb-api :: lang/c/stepping/TestStepAndBreakpoints.py (1390 of 2121) PASS: lldb-unit :: UnwindAssembly/x86/./UnwindAssemblyx86Tests/Testx86AssemblyInspectionEngine.Test32bitFramelessBigStackFrame (1391 of 2121) PASS: lldb-api :: functionalities/thread/concurrent_events/TestConcurrentSignalDelayWatch.py (1392 of 2121) PASS: lldb-unit :: Utility/./UtilityTests/BinaryStreamTest.PutSLEB128FiveBytes (1393 of 2121) UNSUPPORTED: lldb-shell :: SymbolFile/PDB/expressions.test (1394 of 2121) PASS: lldb-unit :: Utility/./UtilityTests/StreamTest.PutPtr (1395 of 2121) PASS: lldb-shell :: ObjectFile/ELF/PT_LOAD-overlap-PT_TLS.yaml (1396 of 2121) PASS: lldb-api :: lang/cpp/class_types/TestClassTypesDisassembly.py (1397 of 2121) PASS: lldb-unit :: Language/Highlighting/./HighlighterTests/HighlighterTest.FallbackHighlighter (1398 of 2121) PASS: lldb-unit :: Utility/./UtilityTests/RangeDataVector.FindEntryThatContains (1399 of 2121) PASS: lldb-api :: functionalities/postmortem/minidump-new/TestMiniDumpNew.py (1400 of 2121) PASS: lldb-unit :: Process/minidump/./LLDBMinidumpTests/MinidumpParserTest.GetThreadContext_x86_32 (1401 of 2121) PASS: lldb-unit :: Utility/./UtilityTests/ArgsTest.TestMultipleArgs (1402 of 2121) PASS: lldb-shell :: Heap/heap-cstr.test (1403 of 2121) PASS: lldb-api :: functionalities/tsan/thread_leak/TestTsanThreadLeak.py (1404 of 2121) PASS: lldb-unit :: ObjectFile/MachO/./ObjectFileMachOTests/ObjectFileMachOTest.ModuleFromSharedCacheInfo (1405 of 2121) PASS: lldb-unit :: Expression/./ExpressionTests/CppModuleConfigurationTest.UnrelatedLibrary (1406 of 2121) PASS: lldb-api :: lang/c/offsetof/TestOffsetof.py (1407 of 2121) PASS: lldb-unit :: Utility/./UtilityTests/StringExtractorTest.GetHexBytes_OddPair (1408 of 2121) PASS: lldb-api :: commands/settings/use_source_cache/TestUseSourceCache.py (1409 of 2121) PASS: lldb-unit :: Utility/./UtilityTests/VMRange.Clear (1410 of 2121) PASS: lldb-shell :: SymbolFile/DWARF/array-sizes.s (1411 of 2121) PASS: lldb-unit :: Utility/./UtilityTests/StatusTest.ErrorConstructor (1412 of 2121) PASS: lldb-shell :: Breakpoint/single-file-split-dwarf.test (1413 of 2121) PASS: lldb-unit :: Utility/./UtilityTests/OptionsWithRawTest.EmptyInput (1414 of 2121) PASS: lldb-unit :: Language/Highlighting/./HighlighterTests/HighlighterTest.ClangTrailingBackslashMissingNewLine (1415 of 2121) PASS: lldb-shell :: Minidump/breakpad-symbols.test (1416 of 2121) PASS: lldb-shell :: ObjectFile/ELF/basic-info.yaml (1417 of 2121) PASS: lldb-unit :: Utility/./UtilityTests/StringExtractorTest.GetHexU8_Exact_NoEof (1418 of 2121) PASS: lldb-api :: commands/expression/import-std-module/unique_ptr/TestUniquePtrFromStdModule.py (1419 of 2121) PASS: lldb-api :: functionalities/asan/TestReportData.py (1420 of 2121) PASS: lldb-api :: lang/c/step-target/TestStepTarget.py (1421 of 2121) PASS: lldb-shell :: ObjectFile/ELF/short-build-id.yaml (1422 of 2121) PASS: lldb-unit :: Utility/./UtilityTests/UriParserTest.SchemeHostSeparator2 (1423 of 2121) PASS: lldb-shell :: Minidump/memory-region-from-module.yaml (1424 of 2121) PASS: lldb-api :: commands/process/attach/TestProcessAttach.py (1425 of 2121) PASS: lldb-unit :: Utility/./UtilityTests/PassiveReplayTest.InstrumentedFooInvalid (1426 of 2121) PASS: lldb-shell :: SymbolFile/DWARF/inline-function-address-shared.test (1427 of 2121) PASS: lldb-unit :: Language/Highlighting/./HighlighterTests/HighlighterTest.DefaultHighlighterWithCursor (1428 of 2121) PASS: lldb-api :: python_api/process/read-mem-cstring/TestReadMemCString.py (1429 of 2121) PASS: lldb-api :: tools/lldb-server/TestGdbRemoteRegisterState.py (1430 of 2121) PASS: lldb-api :: lang/objc/modules-app-update/TestClangModulesAppUpdate.py (1431 of 2121) PASS: lldb-api :: lang/cpp/chained-calls/TestCppChainedCalls.py (1432 of 2121) PASS: lldb-api :: tools/lldb-server/TestGdbRemoteKill.py (1433 of 2121) PASS: lldb-unit :: Utility/./UtilityTests/StreamTest.AddressPrefix (1434 of 2121) PASS: lldb-api :: commands/expression/import-std-module/forward_list/TestForwardListFromStdModule.py (1435 of 2121) PASS: lldb-api :: macosx/nslog/TestDarwinNSLogOutput.py (1436 of 2121) PASS: lldb-unit :: Host/./HostTests/ProcessLaunchInfoTest.Constructor (1437 of 2121) PASS: lldb-api :: lang/c/enum_types/TestEnumTypes.py (1438 of 2121) PASS: lldb-shell :: SymbolFile/DWARF/static_scope.s (1439 of 2121) PASS: lldb-unit :: Utility/./UtilityTests/VMRange.ContainsAddr (1440 of 2121) PASS: lldb-unit :: Process/minidump/./LLDBMinidumpTests/MinidumpParserTest.MinidumpModuleOrder (1441 of 2121) PASS: lldb-unit :: UnwindAssembly/x86/./UnwindAssemblyx86Tests/Testx86AssemblyInspectionEngine.TestSpillRegToStackViaMOVx86_64 (1442 of 2121) PASS: lldb-api :: functionalities/memory/read/TestMemoryRead.py (1443 of 2121) UNSUPPORTED: lldb-shell :: SymbolFile/NativePDB/typedefs.cpp (1444 of 2121) PASS: lldb-unit :: Expression/./ExpressionTests/ClangHostTest.ComputeClangResourceDirectory (1445 of 2121) PASS: lldb-unit :: Host/./HostTests/MainLoopTest.UnmonitoredSignal (1446 of 2121) PASS: lldb-unit :: ObjectFile/ELF/./ObjectFileELFTests/ObjectFileELFTest.GetSymtab_NoSymEntryPointArmAddressClass (1447 of 2121) PASS: lldb-unit :: Utility/./UtilityTests/StringExtractorTest.GetHexBytes (1448 of 2121) PASS: lldb-unit :: Symbol/./SymbolTests/TestTypeSystemClang.TestDisplayNameEmpty (1449 of 2121) PASS: lldb-shell :: Reproducer/TestMultipleTargets.test (1450 of 2121) PASS: lldb-api :: functionalities/memory-region/TestMemoryRegion.py (1451 of 2121) PASS: lldb-unit :: Utility/./UtilityTests/StringListTest.JoinThree (1452 of 2121) PASS: lldb-api :: lang/cpp/alignas_base_class/TestAlignAsBaseClass.py (1453 of 2121) PASS: lldb-api :: functionalities/data-formatter/builtin-formats/TestBuiltinFormats.py (1454 of 2121) PASS: lldb-api :: commands/settings/TestSettings.py (1455 of 2121) PASS: lldb-unit :: Utility/./UtilityTests/StringExtractorTest.GetHexBytes_Partial (1456 of 2121) PASS: lldb-unit :: Core/./LLDBCoreTests/RichManglingContextTest.Basic (1457 of 2121) PASS: lldb-api :: functionalities/data-formatter/varscript_formatting/TestDataFormatterVarScriptFormatting.py (1458 of 2121) PASS: lldb-unit :: Expression/./ExpressionTests/DiagnosticManagerTest.AddDiagnostic (1459 of 2121) PASS: lldb-unit :: Utility/./UtilityTests/ReproducerTest.SetReplay (1460 of 2121) PASS: lldb-api :: functionalities/ptr_refs/TestPtrRefs.py (1461 of 2121) PASS: lldb-api :: commands/expression/unwind_expression/TestUnwindExpression.py (1462 of 2121) PASS: lldb-api :: lang/cpp/bitfields/TestCppBitfields.py (1463 of 2121) PASS: lldb-api :: functionalities/thread/concurrent_events/TestConcurrentManyCrash.py (1464 of 2121) UNSUPPORTED: lldb-api :: arm/breakpoint-thumb-codesection/TestBreakpointThumbCodesection.py (1465 of 2121) PASS: lldb-unit :: ScriptInterpreter/Python/./ScriptInterpreterPythonTests/PythonDataObjectsTest.TestPythonByteArray (1466 of 2121) PASS: lldb-api :: commands/expression/import-std-module/shared_ptr-dbg-info-content/TestSharedPtrDbgInfoContentFromStdModule.py (1467 of 2121) PASS: lldb-unit :: Utility/./UtilityTests/BinaryStreamTest.PutSLEB128One (1468 of 2121) PASS: lldb-api :: lang/objc/conflicting-definition/TestConflictingDefinition.py (1469 of 2121) PASS: lldb-unit :: Host/./HostTests/File.GetWaitableHandleFileno (1470 of 2121) PASS: lldb-api :: lang/objc/objc-dyn-sbtype/TestObjCDynamicSBType.py (1471 of 2121) PASS: lldb-api :: python_api/lldbutil/iter/TestRegistersIterator.py (1472 of 2121) PASS: lldb-api :: commands/platform/file/close/TestPlatformFileClose.py (1473 of 2121) PASS: lldb-api :: lang/objc/objc-struct-return/TestObjCStructReturn.py (1474 of 2121) PASS: lldb-unit :: Utility/./UtilityTests/XcodeSDKTest.ParseTest (1475 of 2121) PASS: lldb-unit :: Utility/./UtilityTests/CompletionRequest.DuplicateFilteringWithComments (1476 of 2121) PASS: lldb-api :: tools/lldb-server/TestGdbRemoteSingleStep.py (1477 of 2121) PASS: lldb-unit :: Utility/./UtilityTests/StreamTest.PutCStringWithStringRef (1478 of 2121) PASS: lldb-api :: commands/watchpoints/watchpoint_commands/TestWatchpointCommands.py (1479 of 2121) PASS: lldb-api :: commands/expression/regression-access-function-template-in-record/TestRegressionAccessFunctionTemplateInRecord.py (1480 of 2121) PASS: lldb-unit :: Utility/./UtilityTests/UriParserTest.SchemeHostSeparator3 (1481 of 2121) PASS: lldb-api :: commands/expression/rdar42038760/TestScalarURem.py (1482 of 2121) UNSUPPORTED: lldb-api :: functionalities/darwin_log/filter/exact_match/subsystem/TestDarwinLogFilterMatchSubsystem.py (1483 of 2121) PASS: lldb-api :: functionalities/data-formatter/data-formatter-objc/TestDataFormatterObjNSException.py (1484 of 2121) PASS: lldb-api :: functionalities/data-formatter/data-formatter-stl/libcxx/bitset/TestDataFormatterLibcxxBitset.py (1485 of 2121) UNSUPPORTED: lldb-api :: commands/expression/call-restarts/TestCallThatRestarts.py (1486 of 2121) PASS: lldb-shell :: Commands/command-regex-delete.test (1487 of 2121) PASS: lldb-api :: functionalities/data-formatter/language_category_updates/TestDataFormatterLanguageCategoryUpdates.py (1488 of 2121) PASS: lldb-api :: functionalities/postmortem/elf-core/gcore/TestGCore.py (1489 of 2121) PASS: lldb-shell :: ObjectFile/PECOFF/uuid.yaml (1490 of 2121) PASS: lldb-api :: python_api/file_handle/TestFileHandle.py (1491 of 2121) PASS: lldb-shell :: Breakpoint/debug_rnglist_offset_pair.test (1492 of 2121) PASS: lldb-unit :: Expression/./ExpressionTests/CppModuleConfigurationTest.MissingUsrInclude (1493 of 2121) PASS: lldb-unit :: Target/./TargetTests/MemoryRegionInfoTest.Formatv (1494 of 2121) PASS: lldb-api :: lang/cpp/symbols/TestSymbols.py (1495 of 2121) PASS: lldb-unit :: Utility/./UtilityTests/StringListTest.AppendStringCString (1496 of 2121) PASS: lldb-shell :: Reproducer/Modules/TestModuleCXX.test (1497 of 2121) PASS: lldb-unit :: Symbol/./SymbolTests/TestTypeSystemClang.TestGetBasicTypeFromEnum (1498 of 2121) PASS: lldb-unit :: Process/minidump/./LLDBMinidumpTests/MinidumpParserTest.FindMemoryRange (1499 of 2121) PASS: lldb-unit :: Utility/./UtilityTests/StringExtractorTest.DecodeHexU8_Exact (1500 of 2121) PASS: lldb-unit :: Utility/./UtilityTests/SerializationRountripTest.SerializeDeserializeCString (1501 of 2121) PASS: lldb-api :: macosx/queues/TestQueues.py (1502 of 2121) PASS: lldb-shell :: SymbolFile/DWARF/debug-line-basic.s (1503 of 2121) PASS: lldb-unit :: Utility/./UtilityTests/StringExtractorTest.GetHexBytesAvail_FullString (1504 of 2121) PASS: lldb-api :: lang/cpp/scope/TestCppScope.py (1505 of 2121) PASS: lldb-shell :: SymbolFile/DWARF/find-method-local-struct.cpp (1506 of 2121) PASS: lldb-unit :: Utility/./UtilityTests/UriParserTest.BadPort2 (1507 of 2121) PASS: lldb-shell :: ObjectFile/ELF/PT_LOAD-empty.yaml (1508 of 2121) PASS: lldb-unit :: Utility/./UtilityTests/StringExtractorTest.GetHexU8_InvalidHex_NoEof (1509 of 2121) PASS: lldb-unit :: Utility/./UtilityTests/SerializationRountripTest.SerializeDeserializePodReferences (1510 of 2121) PASS: lldb-unit :: Symbol/./SymbolTests/TestTypeSystemClang.TestRecordHasFields (1511 of 2121) PASS: lldb-api :: commands/expression/call-function/TestCallStopAndContinue.py (1512 of 2121) PASS: lldb-api :: lang/cpp/overloaded-functions/TestOverloadedFunctions.py (1513 of 2121) PASS: lldb-api :: functionalities/dynamic_value_child_count/TestDynamicValueChildCount.py (1514 of 2121) PASS: lldb-unit :: Editline/./EditlineTests/EditlineTestFixture.EditlineReceivesMultiLineText (1515 of 2121) PASS: lldb-shell :: ScriptInterpreter/Python/sb_address_exception.test (1516 of 2121) PASS: lldb-unit :: Utility/./UtilityTests/TimeoutTest.Format (1517 of 2121) PASS: lldb-shell :: SymbolFile/DWARF/find-function-regex.cpp (1518 of 2121) PASS: lldb-api :: lang/c/forward/TestForwardDeclaration.py (1519 of 2121) PASS: lldb-shell :: SymbolFile/DWARF/clang-ast-from-dwarf-unamed-and-anon-structs.cpp (1520 of 2121) PASS: lldb-unit :: Utility/./UtilityTests/LogTest.LLDB_LOG_nullptr (1521 of 2121) PASS: lldb-shell :: SymbolFile/DWARF/find-variable-file.cpp (1522 of 2121) PASS: lldb-api :: functionalities/breakpoint/breakpoint_hit_count/TestBreakpointHitCount.py (1523 of 2121) PASS: lldb-unit :: Utility/./UtilityTests/StreamTest.AddressRangeInvalidRange (1524 of 2121) PASS: lldb-unit :: Process/gdb-remote/./ProcessGdbRemoteTests/GDBRemoteCommunicationClientTest.GetQOffsets (1525 of 2121) PASS: lldb-api :: commands/platform/file/read/TestPlatformFileRead.py (1526 of 2121) PASS: lldb-api :: functionalities/gdb_remote_client/TestStopPCs.py (1527 of 2121) PASS: lldb-api :: lang/cpp/nested-class-other-compilation-unit/TestNestedClassWithParentInAnotherCU.py (1528 of 2121) PASS: lldb-api :: functionalities/data-formatter/data-formatter-stl/libcxx/set/TestDataFormatterLibcxxSet.py (1529 of 2121) UNSUPPORTED: lldb-shell :: Unwind/unwind-plan-dwarf-dump.test (1530 of 2121) PASS: lldb-unit :: Utility/./UtilityTests/RangeTest.Constructor (1531 of 2121) PASS: lldb-unit :: Utility/./UtilityTests/StringLexerTest.NextIfList (1532 of 2121) PASS: lldb-unit :: Utility/./UtilityTests/RegisterValueTest.GetSet8 (1533 of 2121) PASS: lldb-unit :: Host/./HostTests/MainLoopTest.Signal (1534 of 2121) PASS: lldb-shell :: ObjectFile/MachO/symtab.yaml (1535 of 2121) PASS: lldb-unit :: Host/./HostTests/FileSystemTest.EmptyTest (1536 of 2121) PASS: lldb-unit :: Symbol/./SymbolTests/DWARFCallFrameInfoTest.Basic_eh (1537 of 2121) PASS: lldb-shell :: SymbolFile/DWARF/dwarf5-debug_line.s (1538 of 2121) PASS: lldb-api :: tools/lldb-server/TestGdbRemoteThreadsInStopReply.py (1539 of 2121) PASS: lldb-unit :: Host/./HostTests/FileSystemTest.Resolve (1540 of 2121) PASS: lldb-unit :: Process/minidump/./LLDBMinidumpTests/MinidumpParserTest.InvalidMinidump (1541 of 2121) PASS: lldb-shell :: ObjectFile/PECOFF/basic-info-arm.yaml (1542 of 2121) PASS: lldb-shell :: BuildScript/script-args.test (1543 of 2121) PASS: lldb-unit :: Utility/./UtilityTests/StreamTest.PutRawBytesToLittleEndian (1544 of 2121) PASS: lldb-unit :: Host/./HostTests/FileSystemTest.GetPermissions (1545 of 2121) PASS: lldb-api :: functionalities/data-formatter/data-formatter-categories/TestDataFormatterCategories.py (1546 of 2121) PASS: lldb-unit :: Symbol/./SymbolTests/TestTypeSystemClang.TestGetTypeClassTypeOf (1547 of 2121) PASS: lldb-unit :: Utility/./UtilityTests/FileSpecTest.GuessPathStyle (1548 of 2121) PASS: lldb-api :: commands/command/nested_alias/TestNestedAlias.py (1549 of 2121) PASS: lldb-unit :: Breakpoint/./LLDBBreakpointTests/BreakpointIDTest.StringIsBreakpointName (1550 of 2121) PASS: lldb-api :: functionalities/multidebugger_commands/TestMultipleDebuggersCommands.py (1551 of 2121) PASS: lldb-api :: lang/cpp/typedef/TestCppTypedef.py (1552 of 2121) PASS: lldb-unit :: Utility/./UtilityTests/StreamTest.PutHex64ByteOrderBig (1553 of 2121) PASS: lldb-unit :: Utility/./UtilityTests/ScalarTest.GetValue (1554 of 2121) PASS: lldb-api :: functionalities/data-formatter/stringprinter/TestStringPrinter.py (1555 of 2121) PASS: lldb-api :: lang/c/stepping/TestThreadStepping.py (1556 of 2121) PASS: lldb-shell :: Process/UnsupportedLanguage.test (1557 of 2121) PASS: lldb-unit :: Utility/./UtilityTests/RegularExpression.Match (1558 of 2121) PASS: lldb-shell :: Process/TestEnvironment.test (1559 of 2121) PASS: lldb-api :: functionalities/thread/concurrent_events/TestConcurrentCrashWithWatchpointBreakpointSignal.py (1560 of 2121) PASS: lldb-api :: macosx/function-starts/TestFunctionStarts.py (1561 of 2121) PASS: lldb-api :: python_api/sblaunchinfo/TestSBLaunchInfo.py (1562 of 2121) PASS: lldb-api :: commands/expression/import-std-module/vector/TestVectorFromStdModule.py (1563 of 2121) PASS: lldb-api :: functionalities/unwind/noreturn/TestNoreturnUnwind.py (1564 of 2121) PASS: lldb-api :: functionalities/thread/concurrent_events/TestConcurrentManyWatchpoints.py (1565 of 2121) PASS: lldb-unit :: Utility/./UtilityTests/ConstStringTest.YAML (1566 of 2121) PASS: lldb-shell :: SymbolFile/NativePDB/globals-fundamental.cpp (1567 of 2121) PASS: lldb-shell :: Breakpoint/debug_addrx.test (1568 of 2121) PASS: lldb-shell :: SymbolFile/DWARF/find-basic-type.cpp (1569 of 2121) PASS: lldb-unit :: Utility/./UtilityTests/DataExtractorTest.GetMaxU64_unchecked (1570 of 2121) UNSUPPORTED: lldb-api :: tools/lldb-server/libraries-svr4/TestGdbRemoteLibrariesSvr4Support.py (1571 of 2121) PASS: lldb-unit :: Utility/./UtilityTests/UriParserTest.TypicalPortPathIPv6 (1572 of 2121) PASS: lldb-api :: commands/expression/context-object-objc/TestContextObjectObjc.py (1573 of 2121) PASS: lldb-api :: functionalities/data-formatter/data-formatter-stl/libcxx/unordered/TestDataFormatterUnordered.py (1574 of 2121) PASS: lldb-api :: tools/lldb-server/TestGdbRemote_vCont.py (1575 of 2121) PASS: lldb-unit :: Utility/./UtilityTests/SerializationRountripTest.SerializeDeserializePodPointers (1576 of 2121) PASS: lldb-shell :: SymbolFile/Breakpad/unwind-via-raSearch.test (1577 of 2121) PASS: lldb-unit :: SymbolFile/NativePDB/./SymbolFileNativePDBTests/PDBFPOProgramToDWARFExpressionTests.MissingTargetRegister (1578 of 2121) PASS: lldb-api :: functionalities/gdb_remote_client/TestJLink6Armv7RegisterDefinition.py (1579 of 2121) PASS: lldb-unit :: Process/gdb-remote/./ProcessGdbRemoteTests/GDBRemoteCommunicationClientTest.SendStartTracePacket (1580 of 2121) PASS: lldb-api :: python_api/value_var_update/TestValueVarUpdate.py (1581 of 2121) PASS: lldb-shell :: Breakpoint/debug_rnglistx_rlex.test (1582 of 2121) UNSUPPORTED: lldb-api :: lang/cpp/static_members/TestCPPStaticMembers.py (1583 of 2121) PASS: lldb-unit :: Utility/./UtilityTests/UriParserTest.SchemeHostSeparator (1584 of 2121) PASS: lldb-api :: functionalities/avoids-fd-leak/TestFdLeak.py (1585 of 2121) PASS: lldb-api :: functionalities/data-formatter/data-formatter-stl/libcxx/queue/TestDataFormatterLibcxxQueue.py (1586 of 2121) PASS: lldb-api :: commands/watchpoints/watchpoint_set_command/TestWatchLocationWithWatchSet.py (1587 of 2121) PASS: lldb-shell :: SymbolFile/DWARF/dir-separator-no-comp-dir.s (1588 of 2121) PASS: lldb-api :: lang/cpp/gmodules/TestWithModuleDebugging.py (1589 of 2121) PASS: lldb-unit :: ScriptInterpreter/Python/./ScriptInterpreterPythonTests/PythonDataObjectsTest.TestPythonTupleInitializerList (1590 of 2121) PASS: lldb-unit :: Process/gdb-remote/./ProcessGdbRemoteTests/GDBRemoteCommunicationServerTest.SendErrorResponse_Status (1591 of 2121) UNSUPPORTED: lldb-shell :: BuildScript/toolchain-clang-cl.test (1592 of 2121) PASS: lldb-unit :: UnwindAssembly/x86/./UnwindAssemblyx86Tests/Testx86AssemblyInspectionEngine.TestPushECX (1593 of 2121) PASS: lldb-unit :: Language/Highlighting/./HighlighterTests/HighlighterTest.ClangTrailingBackslashBeforeNewline (1594 of 2121) PASS: lldb-api :: lang/cpp/modules-import/TestCXXModulesImport.py (1595 of 2121) PASS: lldb-unit :: Utility/./UtilityTests/RecordReplayTest.InstrumentedFoo (1596 of 2121) PASS: lldb-unit :: Utility/./UtilityTests/StreamTest.PutHex8 (1597 of 2121) PASS: lldb-unit :: Utility/./UtilityTests/ArgsTest.ReplaceArgumentAtIndexFarOutOfRange (1598 of 2121) PASS: lldb-shell :: Commands/command-target-modules-dump-sections.yaml (1599 of 2121) PASS: lldb-unit :: DataFormatter/./LLDBFormatterTests/StringPrinterTests.SwiftUTF8 (1600 of 2121) PASS: lldb-unit :: Symbol/./SymbolTests/TestTypeSystemClang.TestBuiltinTypeForEncodingAndBitSize (1601 of 2121) PASS: lldb-api :: commands/register/register/register_command/TestRegisters.py (1602 of 2121) PASS: lldb-unit :: Utility/./UtilityTests/StringListTest.ForRangeEmpty (1603 of 2121) PASS: lldb-unit :: Process/./ProcessEventDataTests/ProcessEventDataTest.DoOnRemoval (1604 of 2121) UNSUPPORTED: lldb-api :: functionalities/darwin_log/filter/regex/activity-chain/TestDarwinLogFilterRegexActivityChain.py (1605 of 2121) PASS: lldb-unit :: Utility/./UtilityTests/DataExtractorTest.GetFloat (1606 of 2121) PASS: lldb-unit :: Language/Highlighting/./HighlighterTests/HighlighterTest.ClangEmptyInput (1607 of 2121) PASS: lldb-unit :: SymbolFile/DWARF/./SymbolFileDWARFTests/SymbolFileDWARFTests.TestAbbrevOrder1Start1 (1608 of 2121) PASS: lldb-api :: commands/expression/entry-bp/TestExprEntryBP.py (1609 of 2121) PASS: lldb-api :: functionalities/testid/TestTestId.py (1610 of 2121) PASS: lldb-api :: functionalities/plugins/python_os_plugin/TestPythonOSPlugin.py (1611 of 2121) PASS: lldb-api :: functionalities/breakpoint/debugbreak/TestDebugBreak.py (1612 of 2121) PASS: lldb-api :: functionalities/pointer_num_children/TestPointerNumChildren.py (1613 of 2121) UNSUPPORTED: lldb-shell :: Breakpoint/case-insensitive.test (1614 of 2121) PASS: lldb-unit :: Core/./LLDBCoreTests/CommunicationTest.SynchronizeWhileClosing (1615 of 2121) PASS: lldb-unit :: Utility/./UtilityTests/StateTest.Formatv (1616 of 2121) PASS: lldb-api :: functionalities/thread/thread_specific_break/TestThreadSpecificBreakpoint.py (1617 of 2121) PASS: lldb-api :: lang/cpp/constructors/TestCppConstructors.py (1618 of 2121) PASS: lldb-unit :: Host/./HostTests/SocketTest.DecodeHostAndPort (1619 of 2121) PASS: lldb-unit :: Utility/./UtilityTests/ArchSpecTest.MergeFromMachOUnknown (1620 of 2121) PASS: lldb-unit :: Utility/./UtilityTests/XcodeSDKTest.GetCanonicalNameAndConstruct (1621 of 2121) PASS: lldb-api :: lang/c/unions/TestUnionMembers.py (1622 of 2121) PASS: lldb-unit :: Process/gdb-remote/./ProcessGdbRemoteTests/GDBRemoteCommunicationClientTest.SendSignalsToIgnore (1623 of 2121) PASS: lldb-unit :: Utility/./UtilityTests/StreamTest.PutCharNull (1624 of 2121) PASS: lldb-unit :: Language/Highlighting/./HighlighterTests/HighlighterTest.Colons (1625 of 2121) PASS: lldb-unit :: Utility/./UtilityTests/BinaryStreamTest.PutULEB128TwoBytes (1626 of 2121) PASS: lldb-api :: lang/objc/modules-compile-error/TestModulesCompileError.py (1627 of 2121) PASS: lldb-unit :: Utility/./UtilityTests/UriParserTest.BracketedHostnameWithPortIPv6 (1628 of 2121) PASS: lldb-unit :: ScriptInterpreter/Python/./ScriptInterpreterPythonTests/PythonDataObjectsTest.TestPythonListValueEquality (1629 of 2121) PASS: lldb-unit :: Utility/./UtilityTests/ArgsTest.ReplaceArgumentAtIndexEqual (1630 of 2121) PASS: lldb-unit :: Language/Highlighting/./HighlighterTests/HighlighterTest.DefaultHighlighterWithCursorOutOfBounds (1631 of 2121) PASS: lldb-unit :: Utility/./UtilityTests/FileSpecTest.IsRelative (1632 of 2121) PASS: lldb-shell :: Quit/TestQuitExitCodeHexA.test (1633 of 2121) PASS: lldb-api :: lang/cpp/bool/TestCPPBool.py (1634 of 2121) PASS: lldb-unit :: Host/./HostTests/SocketAddressTest.Set (1635 of 2121) PASS: lldb-shell :: Unwind/eh-frame-dwarf-unwind.test (1636 of 2121) PASS: lldb-api :: commands/expression/two-files/TestObjCTypeQueryFromOtherCompileUnit.py (1637 of 2121) PASS: lldb-shell :: ObjectFile/wasm/basic.yaml (1638 of 2121) PASS: lldb-unit :: Utility/./UtilityTests/DataExtractorTest.GetSLEB128_bit63 (1639 of 2121) PASS: lldb-api :: lang/objc/foundation/TestObjCMethodsNSArray.py (1640 of 2121) PASS: lldb-unit :: Utility/./UtilityTests/NameMatchesTest.StartsWith (1641 of 2121) PASS: lldb-shell :: SymbolFile/DWARF/dwarf5-partial-index.cpp (1642 of 2121) PASS: lldb-api :: lang/cpp/operators/TestCppOperators.py (1643 of 2121) PASS: lldb-api :: functionalities/data-formatter/vector-types/TestVectorTypesFormatting.py (1644 of 2121) UNSUPPORTED: lldb-shell :: Register/x86-64-ymm16-read.test (1645 of 2121) PASS: lldb-unit :: Symbol/./SymbolTests/TestTypeSystemClang.TestGetTypeClassTypeOfExpr (1646 of 2121) PASS: lldb-unit :: UnwindAssembly/ARM64/./Arm64InstEmulationTests/TestArm64InstEmulation.TestFramelessThreeEpilogueFunction (1647 of 2121) PASS: lldb-api :: commands/expression/context-object/TestContextObject.py (1648 of 2121) PASS: lldb-api :: commands/target/dump-symtab-demangle/TestDumpSymtabDemangle.py (1649 of 2121) PASS: lldb-unit :: Interpreter/./InterpreterTests/OptionValueFileColonLine.setFromString (1650 of 2121) PASS: lldb-api :: lang/objc/modules-hash-mismatch/TestClangModulesHashMismatch.py (1651 of 2121) PASS: lldb-api :: functionalities/breakpoint/hardware_breakpoints/require_hw_breakpoints/TestRequireHWBreakpoints.py (1652 of 2121) PASS: lldb-api :: commands/frame/select/TestFrameSelect.py (1653 of 2121) PASS: lldb-unit :: Symbol/./SymbolTests/TestTypeSystemClang.TestGetEnumIntegerTypeBasicTypes (1654 of 2121) PASS: lldb-unit :: Utility/./UtilityTests/ArgsTest.TestAppendArg (1655 of 2121) PASS: lldb-unit :: Core/./LLDBCoreTests/RichManglingContextTest.SwitchProvider (1656 of 2121) PASS: lldb-unit :: Utility/./UtilityTests/FileSpecTest.EqualDotsPosixRoot (1657 of 2121) PASS: lldb-unit :: Utility/./UtilityTests/StringListTest.ForRange (1658 of 2121) PASS: lldb-unit :: Process/minidump/./LLDBMinidumpTests/MinidumpParserTest.MinidumpDuplicateModuleMinAddress (1659 of 2121) PASS: lldb-api :: python_api/symbol-context/two-files/TestSymbolContextTwoFiles.py (1660 of 2121) PASS: lldb-unit :: Utility/./UtilityTests/StringListTest.InsertStringAtIndexStart (1661 of 2121) PASS: lldb-unit :: Utility/./UtilityTests/StringListTest.JoinNonSpace (1662 of 2121) PASS: lldb-unit :: ScriptInterpreter/Python/./ScriptInterpreterPythonTests/PythonDataObjectsTest.TestPythonTupleInitializerList2 (1663 of 2121) PASS: lldb-api :: functionalities/data-formatter/nsdictionarysynth/TestNSDictionarySynthetic.py (1664 of 2121) PASS: lldb-unit :: Symbol/./SymbolTests/TestTypeSystemClang.TestGetTypeClassNested (1665 of 2121) PASS: lldb-unit :: Utility/./UtilityTests/StringListTest.RemoveBlankLines (1666 of 2121) PASS: lldb-api :: lang/c/function_types/TestFunctionTypes.py (1667 of 2121) PASS: lldb-unit :: Process/gdb-remote/./ProcessGdbRemoteTests/GDBRemoteCommunicationClientTest.GetModulesInfo (1668 of 2121) PASS: lldb-unit :: Utility/./UtilityTests/CompletionRequest.TryCompleteCurrentArgBad (1669 of 2121) PASS: lldb-unit :: Utility/./UtilityTests/ArgsTest.TestSingleQuotedArgWithSpace (1670 of 2121) PASS: lldb-unit :: Utility/./UtilityTests/PassiveReplayTest.InstrumentedBarPtr (1671 of 2121) PASS: lldb-shell :: ObjectFile/ELF/minidebuginfo-corrupt-xz.yaml (1672 of 2121) PASS: lldb-shell :: Driver/TestRepl.test (1673 of 2121) PASS: lldb-unit :: Language/Highlighting/./HighlighterTests/HighlighterTest.ClangIdentifiers (1674 of 2121) PASS: lldb-unit :: Utility/./UtilityTests/CompletionRequest.Constructor (1675 of 2121) UNSUPPORTED: lldb-shell :: SymbolFile/target-symbols-add-unwind.test (1676 of 2121) PASS: lldb-api :: lang/cpp/global_variables/TestCPPGlobalVariables.py (1677 of 2121) PASS: lldb-unit :: Language/Highlighting/./HighlighterTests/HighlighterTest.ClangPreserveNewLine (1678 of 2121) PASS: lldb-api :: functionalities/tsan/multiple/TestTsanMultiple.py (1679 of 2121) PASS: lldb-unit :: Symbol/./SymbolTests/TestTypeSystemClang.TestGetTypeClassDeclType (1680 of 2121) PASS: lldb-unit :: Utility/./UtilityTests/RangeTest.Copy (1681 of 2121) PASS: lldb-shell :: SymbolFile/Breakpad/line-table-missing-file.test (1682 of 2121) PASS: lldb-unit :: Utility/./UtilityTests/FileSpecTest.FileAndDirectoryComponents (1683 of 2121) PASS: lldb-shell :: SymbolFile/NativePDB/globals-bss.cpp (1684 of 2121) PASS: lldb-shell :: SymbolFile/DWARF/limit-debug-info.s (1685 of 2121) PASS: lldb-unit :: Utility/./UtilityTests/VMRange.Ordering (1686 of 2121) PASS: lldb-unit :: Utility/./UtilityTests/StringListTest.SplitIntoLines (1687 of 2121) PASS: lldb-unit :: UnwindAssembly/x86/./UnwindAssemblyx86Tests/Testx86AssemblyInspectionEngine.TestPopR13 (1688 of 2121) PASS: lldb-unit :: Utility/./UtilityTests/ConstStringTest.MangledCounterpart (1689 of 2121) PASS: lldb-shell :: SymbolFile/DWARF/debug_aranges-empty-section.s (1690 of 2121) PASS: lldb-shell :: Expr/TestMultilineExpr.test (1691 of 2121) PASS: lldb-unit :: Utility/./UtilityTests/StreamTest.QuotedCString (1692 of 2121) PASS: lldb-unit :: Process/minidump/./LLDBMinidumpTests/MinidumpParserTest.GetThreadContext_x86_32_wow64 (1693 of 2121) PASS: lldb-shell :: Commands/command-script-import.test (1694 of 2121) PASS: lldb-unit :: Utility/./UtilityTests/RangeTest.DoesIntersect (1695 of 2121) PASS: lldb-api :: commands/expression/inline-namespace/TestInlineNamespace.py (1696 of 2121) PASS: lldb-shell :: SymbolFile/NativePDB/tag-types.cpp (1697 of 2121) PASS: lldb-unit :: ScriptInterpreter/Python/./ScriptInterpreterPythonTests/PythonDataObjectsTest.TestPythonDictionaryToStructuredDictionary (1698 of 2121) PASS: lldb-unit :: Utility/./UtilityTests/RangeTest.ContainsEndInclusiveInvalid (1699 of 2121) UNSUPPORTED: lldb-api :: benchmarks/frame_variable/TestFrameVariableResponse.py (1700 of 2121) UNSUPPORTED: lldb-api :: functionalities/data-formatter/data-formatter-stl/libstdcpp/map/TestDataFormatterStdMap.py (1701 of 2121) PASS: lldb-shell :: Driver/TestUseColor.test (1702 of 2121) PASS: lldb-unit :: Process/gdb-remote/./ProcessGdbRemoteTests/GDBRemoteClientBaseTest.SendPacketAndReceiveResponseWithOutputSupport (1703 of 2121) PASS: lldb-unit :: Symbol/./SymbolTests/TestClangASTImporter.MetadataPropagationAfterCopying (1704 of 2121) PASS: lldb-unit :: Utility/./UtilityTests/XcodeSDKTest.MergeTest (1705 of 2121) PASS: lldb-unit :: Utility/./UtilityTests/StreamTest.PutHex16ByteOrderLittle (1706 of 2121) UNSUPPORTED: lldb-shell :: Expr/TestIRMemoryMapWindows.test (1707 of 2121) UNSUPPORTED: lldb-shell :: Reproducer/TestLuaImport.test (1708 of 2121) PASS: lldb-api :: commands/target/create-deps/TestTargetCreateDeps.py (1709 of 2121) PASS: lldb-api :: functionalities/optimized_code/TestNoASanExceptionAfterEvalOP_piece.py (1710 of 2121) UNSUPPORTED: lldb-api :: functionalities/darwin_log/filter/regex/message/TestDarwinLogFilterRegexMessage.py (1711 of 2121) PASS: lldb-api :: functionalities/postmortem/wow64_minidump/TestWow64MiniDump.py (1712 of 2121) PASS: lldb-unit :: debugserver/./debugserverTests/RNBSocket.LoopBackConnectIPv4 (1713 of 2121) PASS: lldb-api :: functionalities/dead-strip/TestDeadStrip.py (1714 of 2121) PASS: lldb-api :: commands/gui/basicdebug/TestGuiBasicDebug.py (1715 of 2121) PASS: lldb-unit :: Utility/./UtilityTests/StreamTest.PutRawBytesToMixedEndian (1716 of 2121) PASS: lldb-unit :: UnwindAssembly/x86/./UnwindAssemblyx86Tests/Testx86AssemblyInspectionEngine.TestPushEDX (1717 of 2121) UNSUPPORTED: lldb-api :: commands/register/register/intel_xtended_registers/mpx_offset_intersection/TestMPXOffsetIntersection.py (1718 of 2121) UNSUPPORTED: lldb-api :: functionalities/thread/state/TestThreadStates.py (1719 of 2121) PASS: lldb-unit :: Signals/./SignalsTests/UnixSignalsTest.GetInfo (1720 of 2121) PASS: lldb-unit :: Utility/./UtilityTests/StringListTest.JoinSingle (1721 of 2121) PASS: lldb-api :: api/multiple-targets/TestMultipleTargets.py (1722 of 2121) PASS: lldb-unit :: Symbol/./SymbolTests/TestClangASTImporter.DeportTypeTagDecl (1723 of 2121) PASS: lldb-shell :: Quit/TestQuitExitCodeTooManyArgs.test (1724 of 2121) PASS: lldb-unit :: ObjectFile/PECOFF/./ObjectFilePECOFFTests/PECallFrameInfoTest.Frame_reg_eh (1725 of 2121) PASS: lldb-unit :: Utility/./UtilityTests/FileSpecTest.GetPath (1726 of 2121) PASS: lldb-api :: lang/c/local_types/TestUseClosestType.py (1727 of 2121) PASS: lldb-api :: functionalities/thread/concurrent_events/TestConcurrentTwoWatchpointsOneDelayBreakpoint.py (1728 of 2121) PASS: lldb-unit :: Interpreter/./InterpreterTests/CompletionTest.DirCompletionUsername (1729 of 2121) PASS: lldb-api :: commands/expression/anonymous-struct/TestCallUserAnonTypedef.py (1730 of 2121) PASS: lldb-shell :: Commands/CommandScriptImmediateOutput/CommandScriptImmediateOutputFile.test (1731 of 2121) PASS: lldb-shell :: SymbolFile/DWARF/DW_OP_piece-struct.s (1732 of 2121) PASS: lldb-api :: lang/cpp/this_class_type_mixing/TestThisClassTypeMixing.py (1733 of 2121) PASS: lldb-unit :: Language/Highlighting/./HighlighterTests/HighlighterTest.ClangCursorPos (1734 of 2121) PASS: lldb-unit :: Language/CPlusPlus/./LanguageCPlusPlusTests/CPlusPlusLanguage.FindAlternateFunctionManglings (1735 of 2121) PASS: lldb-unit :: Utility/./UtilityTests/FileSpecTest.AppendPathComponent (1736 of 2121) PASS: lldb-unit :: Utility/./UtilityTests/StreamTest.ShiftOperatorChars (1737 of 2121) PASS: lldb-unit :: Expression/./ExpressionTests/CppModuleConfigurationTest.Sysroot (1738 of 2121) PASS: lldb-api :: functionalities/param_entry_vals/basic_entry_values/TestBasicEntryValues.py (1739 of 2121) PASS: lldb-unit :: DataFormatter/./LLDBFormatterTests/TypeMatcherTests.ExactName (1740 of 2121) PASS: lldb-unit :: Utility/./UtilityTests/LogChannelTest.Enable (1741 of 2121) UNSUPPORTED: lldb-shell :: ObjectFile/ELF/minidebuginfo-set-and-hit-breakpoint.test (1742 of 2121) PASS: lldb-unit :: Host/./HostTests/FileSystemTest.GetByteSize (1743 of 2121) PASS: lldb-api :: functionalities/gdb_remote_client/TestRegDefinitionInParts.py (1744 of 2121) PASS: lldb-unit :: Process/minidump/./LLDBMinidumpTests/MinidumpParserTest.GetLinuxProcStatus_no_stream (1745 of 2121) PASS: lldb-shell :: Driver/TestConvenienceVariables.test (1746 of 2121) PASS: lldb-api :: functionalities/data-formatter/data-formatter-objc/nsindexpath/TestDataFormatterNSIndexPath.py (1747 of 2121) PASS: lldb-unit :: Utility/./UtilityTests/ScalarTest.SetValueFromData (1748 of 2121) PASS: lldb-unit :: Utility/./UtilityTests/XcodeSDKTest.GetSDKTypeForTriple (1749 of 2121) PASS: lldb-api :: commands/expression/persistent_types/TestNestedPersistentTypes.py (1750 of 2121) PASS: lldb-api :: functionalities/tail_call_frames/thread_step_out_message/TestArtificialFrameStepOutMessage.py (1751 of 2121) PASS: lldb-unit :: Utility/./UtilityTests/SerializationRountripTest.SerializeDeserializeCStringArrayNullptrElem (1752 of 2121) PASS: lldb-unit :: Utility/./UtilityTests/SharedCluster.ClusterManager (1753 of 2121) PASS: lldb-api :: commands/gui/breakpoints/TestGuiBreakpoints.py (1754 of 2121) PASS: lldb-unit :: Utility/./UtilityTests/StringListTest.InsertStringAtIndexEnd (1755 of 2121) PASS: lldb-api :: functionalities/thread/concurrent_events/TestConcurrentSignalWatch.py (1756 of 2121) PASS: lldb-unit :: Signals/./SignalsTests/UnixSignalsTest.VersionChange (1757 of 2121) PASS: lldb-shell :: Reproducer/TestPythonImport.test (1758 of 2121) UNSUPPORTED: lldb-api :: macosx/macCatalystAppMacOSFramework/TestMacCatalystAppWithMacOSFramework.py (1759 of 2121) PASS: lldb-api :: functionalities/paths/TestPaths.py (1760 of 2121) PASS: lldb-api :: functionalities/tail_call_frames/ambiguous_tail_call_seq2/TestAmbiguousTailCallSeq2.py (1761 of 2121) PASS: lldb-api :: terminal/TestEditline.py (1762 of 2121) PASS: lldb-api :: tools/lldb-vscode/variables/TestVSCode_variables.py (1763 of 2121) PASS: lldb-api :: functionalities/breakpoint/step_over_breakpoint/TestStepOverBreakpoint.py (1764 of 2121) PASS: lldb-unit :: Utility/./UtilityTests/RangeTest.ContainsEndInclusive (1765 of 2121) PASS: lldb-unit :: Core/./LLDBCoreTests/ModuleSpecTest.TestELFFile (1766 of 2121) PASS: lldb-api :: commands/expression/import-std-module/vector-bool/TestVectorBoolFromStdModule.py (1767 of 2121) PASS: lldb-unit :: ScriptInterpreter/Python/./ScriptInterpreterPythonTests/PythonDataObjectsTest.TestPythonTupleToStructuredList (1768 of 2121) PASS: lldb-api :: functionalities/breakpoint/auto_continue/TestBreakpointAutoContinue.py (1769 of 2121) PASS: lldb-unit :: Utility/./UtilityTests/ArchSpecTest.Compatibility (1770 of 2121) UNSUPPORTED: lldb-shell :: SymbolFile/NativePDB/ast-functions-msvc.cpp (1771 of 2121) PASS: lldb-api :: functionalities/data-formatter/type_summary_list_arg/TestTypeSummaryListArg.py (1772 of 2121) PASS: lldb-api :: functionalities/conditional_break/TestConditionalBreak.py (1773 of 2121) PASS: lldb-shell :: ObjectFile/MachO/lc_build_version_notools.yaml (1774 of 2121) PASS: lldb-unit :: Utility/./UtilityTests/StreamTest.PutMaxHex64ByteOrderBig (1775 of 2121) UNSUPPORTED: lldb-api :: arm/breakpoint-it/TestBreakpointIt.py (1776 of 2121) PASS: lldb-shell :: SymbolFile/DWARF/find-method.cpp (1777 of 2121) PASS: lldb-shell :: BuildScript/modes.test (1778 of 2121) PASS: lldb-api :: commands/expression/unicode-in-variable/TestUnicodeInVariable.py (1779 of 2121) PASS: lldb-api :: source-manager/TestSourceManager.py (1780 of 2121) PASS: lldb-unit :: ScriptInterpreter/Python/./ScriptInterpreterPythonTests/PythonDataObjectsTest.TestPythonDictionaryManipulation (1781 of 2121) PASS: lldb-unit :: Utility/./UtilityTests/UriParserTest.TypicalPortPathIPv4 (1782 of 2121) UNSUPPORTED: lldb-api :: functionalities/thread/thread_specific_break_plus_condition/TestThreadSpecificBpPlusCondition.py (1783 of 2121) PASS: lldb-api :: tools/lldb-vscode/launch/TestVSCode_launch.py (1784 of 2121) PASS: lldb-api :: python_api/module_section/TestModuleAndSection.py (1785 of 2121) PASS: lldb-api :: functionalities/lazy-loading/TestLazyLoading.py (1786 of 2121) PASS: lldb-shell :: Minidump/Windows/broken-unwind.test (1787 of 2121) PASS: lldb-shell :: Reproducer/Functionalities/TestStepping.test (1788 of 2121) PASS: lldb-shell :: Minidump/Windows/Sigsegv/sigsegv.test (1789 of 2121) PASS: lldb-api :: functionalities/tail_call_frames/thread_step_out_or_return/TestSteppingOutWithArtificialFrames.py (1790 of 2121) PASS: lldb-api :: commands/expression/test/TestExprs.py (1791 of 2121) PASS: lldb-unit :: Platform/Android/./AdbClientTests/AdbClientTest.CreateByDeviceId_ByEnvVar (1792 of 2121) PASS: lldb-shell :: ScriptInterpreter/None/import_module.test (1793 of 2121) PASS: lldb-unit :: Utility/./UtilityTests/TimerTest.CategoryTimesStats (1794 of 2121) PASS: lldb-api :: commands/watchpoints/watchpoint_events/TestWatchpointEvents.py (1795 of 2121) PASS: lldb-shell :: Commands/command-regex-unalias.test (1796 of 2121) PASS: lldb-unit :: Utility/./UtilityTests/StreamTest.ShiftOperatorStrings (1797 of 2121) PASS: lldb-api :: functionalities/data-formatter/ostypeformatting/TestFormattersOsType.py (1798 of 2121) PASS: lldb-api :: commands/expression/radar_9531204/TestPrintfAfterUp.py (1799 of 2121) PASS: lldb-api :: commands/expression/calculator_mode/TestCalculatorMode.py (1800 of 2121) PASS: lldb-api :: functionalities/process_crash_info/TestProcessCrashInfo.py (1801 of 2121) PASS: lldb-unit :: Utility/./UtilityTests/FileSpecTest.CopyByAppendingPathComponent (1802 of 2121) PASS: lldb-api :: functionalities/abbreviation/TestAbbreviations.py (1803 of 2121) PASS: lldb-unit :: Language/Highlighting/./HighlighterTests/HighlighterTest.ClangCursorPosBeforeOtherToken (1804 of 2121) PASS: lldb-unit :: Symbol/./SymbolTests/TestClangASTImporter.MetadataPropagationIndirectImport (1805 of 2121) PASS: lldb-api :: commands/command/script/import/rdar-12586188/TestRdar12586188.py (1806 of 2121) PASS: lldb-unit :: Utility/./UtilityTests/StringListTest.LongestCommonPrefixDuplicateElement (1807 of 2121) PASS: lldb-unit :: SymbolFile/DWARF/./SymbolFileDWARFTests/SymbolFileDWARFTests.TestAbbrevInvalidNULLTag (1808 of 2121) PASS: lldb-unit :: Utility/./UtilityTests/ArchSpecTest.TestParseMachCPUDashSubtypeTripleExtra (1809 of 2121) PASS: lldb-shell :: Commands/command-source.test (1810 of 2121) PASS: lldb-api :: lang/cpp/multiple-inheritance/TestCppMultipleInheritance.py (1811 of 2121) PASS: lldb-api :: tools/lldb-server/TestGdbRemoteHostInfo.py (1812 of 2121) PASS: lldb-unit :: Utility/./UtilityTests/RecordReplayTest.InstrumentedBarPtr (1813 of 2121) PASS: lldb-unit :: Symbol/./SymbolTests/DWARFCallFrameInfoTest.Basic_dwarf4 (1814 of 2121) PASS: lldb-api :: lang/cpp/unsigned_types/TestUnsignedTypes.py (1815 of 2121) PASS: lldb-unit :: Utility/./UtilityTests/DataExtractorTest.GetBitfield (1816 of 2121) PASS: lldb-api :: lang/cpp/template-specialization-type/TestTemplateSpecializationType.py (1817 of 2121) PASS: lldb-unit :: Host/./HostTests/NativeProcessProtocolTest.SetBreakpointFailWrite (1818 of 2121) PASS: lldb-unit :: Utility/./UtilityTests/StringListTest.PopBack (1819 of 2121) PASS: lldb-api :: lang/c/tls_globals/TestTlsGlobals.py (1820 of 2121) PASS: lldb-unit :: Host/./HostTests/SocketTest.TCPGetConnectURI (1821 of 2121) PASS: lldb-api :: lang/c/global_variables/TestGlobalVariables.py (1822 of 2121) PASS: lldb-shell :: ObjectFile/ELF/PT_LOAD-overlap.yaml (1823 of 2121) PASS: lldb-unit :: Utility/./UtilityTests/StreamTest.PutChar (1824 of 2121) PASS: lldb-api :: functionalities/data-formatter/data-formatter-synthtype/TestDataFormatterSynthType.py (1825 of 2121) PASS: lldb-unit :: SymbolFile/NativePDB/./SymbolFileNativePDBTests/PDBFPOProgramToDWARFExpressionTests.UnresolvedCyclicRegisterAssignmentReference (1826 of 2121) PASS: lldb-unit :: Utility/./UtilityTests/StructuredDataTest.ParseJSONFromFile (1827 of 2121) PASS: lldb-unit :: Utility/./UtilityTests/BinaryStreamTest.PutSLEB128OneByte (1828 of 2121) PASS: lldb-unit :: Utility/./UtilityTests/UserIDResolver.GetGroupName (1829 of 2121) PASS: lldb-unit :: ScriptInterpreter/Python/./ScriptInterpreterPythonTests/PythonDataObjectsTest.TestInstanceNameResolutionNoDot (1830 of 2121) PASS: lldb-unit :: Utility/./UtilityTests/StreamTest.AddressSuffix (1831 of 2121) PASS: lldb-unit :: Utility/./UtilityTests/RangeTest.SlideZero (1832 of 2121) PASS: lldb-api :: functionalities/jitloader_gdb/TestJITLoaderGDB.py (1833 of 2121) PASS: lldb-api :: lang/objc/global_ptrs/TestGlobalObjects.py (1834 of 2121) UNSUPPORTED: lldb-shell :: Register/aarch64-fp-read.test (1835 of 2121) PASS: lldb-api :: lang/objcxx/hide-runtime-values/TestObjCXXHideRuntimeValues.py (1836 of 2121) PASS: lldb-unit :: Host/./HostTests/SocketTest.UDPConnect (1837 of 2121) PASS: lldb-shell :: SymbolFile/DWARF/debug-types-address-ranges.s (1838 of 2121) PASS: lldb-unit :: Symbol/./SymbolTests/TestTypeSystemClang.TestDeletingImplicitCopyCstrDueToMoveCStr (1839 of 2121) PASS: lldb-api :: lang/cpp/std-function-step-into-callable/TestStdFunctionStepIntoCallable.py (1840 of 2121) PASS: lldb-api :: functionalities/history/TestHistoryRecall.py (1841 of 2121) PASS: lldb-shell :: Minidump/dump-all.test (1842 of 2121) PASS: lldb-api :: api/command-return-object/TestSBCommandReturnObject.py (1843 of 2121) UNSUPPORTED: lldb-shell :: SymbolFile/PDB/udt-layout.test (1844 of 2121) PASS: lldb-api :: functionalities/data-formatter/data-formatter-objc/TestDataFormatterObjCCF.py (1845 of 2121) XFAIL: lldb-shell :: Register/x86-mm-xmm-write.test (1846 of 2121) PASS: lldb-api :: lang/cpp/namespace/TestNamespaceLookup.py (1847 of 2121) UNSUPPORTED: lldb-api :: functionalities/longjmp/TestLongjmp.py (1848 of 2121) PASS: lldb-unit :: ScriptInterpreter/Python/./ScriptInterpreterPythonTests/PythonDataObjectsTest.TestPythonStringToStructuredString (1849 of 2121) PASS: lldb-unit :: Utility/./UtilityTests/StringListTest.GetMaxStringLengthDecreasingSize (1850 of 2121) PASS: lldb-shell :: SymbolFile/Breakpad/stack-cfi-arm.yaml (1851 of 2121) PASS: lldb-shell :: SymbolFile/DWARF/DW_AT_low_pc-addrx.s (1852 of 2121) PASS: lldb-api :: lang/cpp/exceptions/TestCPPExceptionBreakpoints.py (1853 of 2121) PASS: lldb-api :: lang/c/const_variables/TestConstVariables.py (1854 of 2121) PASS: lldb-shell :: Quit/TestQuitExitCodeNonInt.test (1855 of 2121) PASS: lldb-unit :: ObjectFile/Breakpad/./ObjectFileBreakpadTests/FileRecord.parse (1856 of 2121) PASS: lldb-api :: lang/cpp/breakpoint-commands/TestCPPBreakpointCommands.py (1857 of 2121) PASS: lldb-unit :: UnwindAssembly/x86/./UnwindAssemblyx86Tests/Testx86AssemblyInspectionEngine.TestPopEBX (1858 of 2121) PASS: lldb-api :: commands/expression/vector_of_enums/TestVectorOfEnums.py (1859 of 2121) PASS: lldb-unit :: Utility/./UtilityTests/BinaryStreamTest.PutSLEB128NineBytes (1860 of 2121) PASS: lldb-unit :: UnwindAssembly/x86/./UnwindAssemblyx86Tests/Testx86AssemblyInspectionEngine.TestPopEDI (1861 of 2121) PASS: lldb-unit :: Process/gdb-remote/./ProcessGdbRemoteTests/GDBRemoteCommunicationClientTest.GetModulesInfoInvalidResponse (1862 of 2121) PASS: lldb-shell :: SymbolFile/Breakpad/line-table-edgecases.test (1863 of 2121) PASS: lldb-unit :: Expression/./ExpressionTests/DiagnosticManagerTest.PutString (1864 of 2121) PASS: lldb-unit :: Utility/./UtilityTests/StringListTest.AppendListCStringArray (1865 of 2121) PASS: lldb-unit :: Utility/./UtilityTests/BinaryStreamTest.PutULEB128MaxValue (1866 of 2121) PASS: lldb-unit :: Language/Highlighting/./HighlighterTests/HighlighterTest.ClangCursorPosAfterOtherToken (1867 of 2121) UNSUPPORTED: lldb-shell :: Register/x86-gp-write.test (1868 of 2121) PASS: lldb-api :: functionalities/breakpoint/move_nearest/TestMoveNearest.py (1869 of 2121) PASS: lldb-api :: lang/cpp/rvalue-references/TestRvalueReferences.py (1870 of 2121) PASS: lldb-unit :: Utility/./UtilityTests/RangeTest.DoesAdjoinOrIntersect (1871 of 2121) PASS: lldb-unit :: Process/minidump/./LLDBMinidumpTests/MinidumpParserTest.FindMemoryRangeWithFullMemoryMinidump (1872 of 2121) PASS: lldb-unit :: Process/gdb-remote/./ProcessGdbRemoteTests/GDBRemoteCommunicationClientTest.ReadRegister (1873 of 2121) PASS: lldb-api :: iohandler/resize/TestIOHandlerResize.py (1874 of 2121) PASS: lldb-api :: commands/add-dsym/uuid/TestAddDsymCommand.py (1875 of 2121) PASS: lldb-unit :: Host/./HostTests/FileSystemTest.Exists (1876 of 2121) PASS: lldb-unit :: Process/gdb-remote/./ProcessGdbRemoteTests/GDBRemoteClientBaseTest.SendContinueAndAsyncPacket (1877 of 2121) PASS: lldb-unit :: UnwindAssembly/x86/./UnwindAssemblyx86Tests/Testx86AssemblyInspectionEngine.TestSimple64bitFrameFunction (1878 of 2121) PASS: lldb-api :: functionalities/gdb_remote_client/TestqOffsets.py (1879 of 2121) UNSUPPORTED: lldb-shell :: ScriptInterpreter/Lua/independent_state.test (1880 of 2121) PASS: lldb-api :: lang/cpp/auto/TestCPPAuto.py (1881 of 2121) PASS: lldb-api :: functionalities/postmortem/elf-core/thread_crash/TestLinuxCoreThreads.py (1882 of 2121) PASS: lldb-unit :: Utility/./UtilityTests/ProcessInstanceInfo.Dump (1883 of 2121) PASS: lldb-unit :: Utility/./UtilityTests/TimeoutTest.Construction (1884 of 2121) PASS: lldb-unit :: Utility/./UtilityTests/StringExtractorTest.GetNameColonValueNoColon (1885 of 2121) PASS: lldb-unit :: Utility/./UtilityTests/StreamTest.PutBytesAsRawHex8ToMixedEndian (1886 of 2121) PASS: lldb-shell :: SymbolFile/DWARF/find-basic-namespace.cpp (1887 of 2121) PASS: lldb-unit :: Expression/./ExpressionTests/DiagnosticManagerTest.AppendMessageSubsequentDiags (1888 of 2121) PASS: lldb-unit :: Language/Highlighting/./HighlighterTests/HighlighterTest.ClangScalarLiterals (1889 of 2121) PASS: lldb-shell :: SymbolFile/DWARF/parallel-indexing-stress.s (1890 of 2121) PASS: lldb-unit :: Expression/./ExpressionTests/DWARFExpression.DW_OP_pick (1891 of 2121) PASS: lldb-api :: lang/c/complex_int/TestComplexInt.py (1892 of 2121) PASS: lldb-shell :: ObjectFile/ELF/minidebuginfo-find-symbols.yaml (1893 of 2121) PASS: lldb-unit :: Utility/./UtilityTests/StringListTest.JoinEmpty (1894 of 2121) PASS: lldb-unit :: Symbol/./SymbolTests/TestClangASTImporter.CompleteFwdDeclWithOtherOrigin (1895 of 2121) PASS: lldb-shell :: Reproducer/Functionalities/TestImageList.test (1896 of 2121) PASS: lldb-shell :: Settings/TestEchoCommands.test (1897 of 2121) PASS: lldb-api :: functionalities/inferior-crashing/recursive-inferior/TestRecursiveInferior.py (1898 of 2121) UNSUPPORTED: lldb-shell :: SymbolFile/PDB/class-layout.test (1899 of 2121) PASS: lldb-unit :: Utility/./UtilityTests/StringListTest.AppendList (1900 of 2121) PASS: lldb-unit :: Process/./ProcessEventDataTests/ProcessEventDataTest.ShouldStop (1901 of 2121) PASS: lldb-api :: lang/c/shared_lib_stripped_symbols/TestSharedLibStrippedSymbols.py (1902 of 2121) PASS: lldb-unit :: Core/./LLDBCoreTests/RichManglingContextTest.FromCxxMethodName (1903 of 2121) PASS: lldb-unit :: Core/./LLDBCoreTests/UniqueCStringMap.NoDefaultConstructor (1904 of 2121) PASS: lldb-api :: lang/objc/foundation/TestConstStrings.py (1905 of 2121) PASS: lldb-api :: commands/expression/call-throws/TestCallThatThrows.py (1906 of 2121) UNSUPPORTED: lldb-api :: functionalities/data-formatter/data-formatter-stl/libstdcpp/smart_ptr/TestDataFormatterStdSmartPtr.py (1907 of 2121) PASS: lldb-unit :: ScriptInterpreter/Python/./ScriptInterpreterPythonTests/PythonDataObjectsTest.TestPythonTupleValues (1908 of 2121) PASS: lldb-unit :: Utility/./UtilityTests/RangeDataVector.FindEntryThatContains_Overlap (1909 of 2121) PASS: lldb-unit :: ScriptInterpreter/Python/./ScriptInterpreterPythonTests/PythonDataObjectsTest.TestObjectAttributes (1910 of 2121) PASS: lldb-unit :: Utility/./UtilityTests/ArgsTest.GetQuotedCommandString (1911 of 2121) PASS: lldb-unit :: UnwindAssembly/x86/./UnwindAssemblyx86Tests/Testx86AssemblyInspectionEngine.TestPopR12 (1912 of 2121) PASS: lldb-unit :: UnwindAssembly/ARM64/./Arm64InstEmulationTests/TestArm64InstEmulation.TestMediumDarwinFunction (1913 of 2121) PASS: lldb-unit :: Utility/./UtilityTests/Flags.Reset (1914 of 2121) PASS: lldb-unit :: ObjectFile/Breakpad/./ObjectFileBreakpadTests/LineRecord.parse (1915 of 2121) PASS: lldb-api :: functionalities/breakpoint/breakpoint_ignore_count/TestBreakpointIgnoreCount.py (1916 of 2121) PASS: lldb-shell :: SymbolFile/DWARF/debug_ranges_and_rnglists.test (1917 of 2121) PASS: lldb-api :: lang/objc/hidden-ivars/TestHiddenIvars.py (1918 of 2121) PASS: lldb-shell :: ObjectFile/PECOFF/sections-names.yaml (1919 of 2121) PASS: lldb-api :: functionalities/limit-debug-info/TestLimitDebugInfo.py (1920 of 2121) PASS: lldb-unit :: Expression/./ExpressionTests/DiagnosticManagerTest.FixedExpression (1921 of 2121) PASS: lldb-shell :: ObjectFile/ELF/compressed-sections.yaml (1922 of 2121) PASS: lldb-shell :: Driver/TestCore.test (1923 of 2121) PASS: lldb-unit :: Symbol/./SymbolTests/TestTypeSystemClang.TestDisplayName (1924 of 2121) PASS: lldb-api :: types/TestFloatTypes.py (1925 of 2121) PASS: lldb-api :: functionalities/rerun/TestRerun.py (1926 of 2121) PASS: lldb-shell :: ObjectFile/PECOFF/invalid-export-table.yaml (1927 of 2121) PASS: lldb-unit :: Utility/./UtilityTests/StreamTest.PutSLEB128 (1928 of 2121) PASS: lldb-shell :: SymbolFile/NativePDB/locate-pdb.cpp (1929 of 2121) UNSUPPORTED: lldb-shell :: Register/x86-64-xmm16-write.test (1930 of 2121) PASS: lldb-unit :: Utility/./UtilityTests/StringListTest.Join (1931 of 2121) PASS: lldb-unit :: Utility/./UtilityTests/BinaryStreamTest.PutSLEB128TwoBytes (1932 of 2121) PASS: lldb-unit :: Utility/./UtilityTests/ArgsTest.DoubleQuotedItem (1933 of 2121) PASS: lldb-api :: commands/process/attach/attach_denied/TestAttachDenied.py (1934 of 2121) PASS: lldb-api :: functionalities/unwind/sigtramp/TestSigtrampUnwind.py (1935 of 2121) PASS: lldb-unit :: Target/./TargetTests/ExecutionContextTest.GetByteOrderProcess (1936 of 2121) PASS: lldb-unit :: Utility/./UtilityTests/DataExtractorTest.GetCStr (1937 of 2121) PASS: lldb-unit :: UnwindAssembly/x86/./UnwindAssemblyx86Tests/Testx86AssemblyInspectionEngine.TestLEAVE (1938 of 2121) PASS: lldb-unit :: Utility/./UtilityTests/DataExtractorTest.GetCStrAtNullOffset (1939 of 2121) PASS: lldb-unit :: Language/Highlighting/./HighlighterTests/HighlighterTest.HighlighterSelectionPath (1940 of 2121) PASS: lldb-unit :: SymbolFile/DWARF/./SymbolFileDWARFTests/SymbolFileDWARFTests.TestAbbrevOutOfOrder (1941 of 2121) PASS: lldb-api :: commands/watchpoints/watchpoint_commands/condition/TestWatchpointConditionCmd.py (1942 of 2121) PASS: lldb-api :: functionalities/data-formatter/data-formatter-objc/nsstring/TestDataFormatterNSString.py (1943 of 2121) PASS: lldb-api :: macosx/universal/TestUniversal.py (1944 of 2121) PASS: lldb-api :: commands/expression/top-level/TestTopLevelExprs.py (1945 of 2121) PASS: lldb-api :: functionalities/data-formatter/data-formatter-objc/cmtime/TestDataFormatterCMTime.py (1946 of 2121) PASS: lldb-api :: functionalities/thread/concurrent_events/TestConcurrentTwoBreakpointsOneWatchpoint.py (1947 of 2121) PASS: lldb-unit :: Utility/./UtilityTests/UUIDTest.RelationalOperators (1948 of 2121) PASS: lldb-unit :: Host/./HostTests/NativeProcessProtocolTest.SetBreakpointFailVerify (1949 of 2121) PASS: lldb-unit :: Signals/./SignalsTests/UnixSignalsTest.Iteration (1950 of 2121) PASS: lldb-api :: functionalities/data-formatter/data-formatter-stl/libcxx/multimap/TestDataFormatterLibccMultiMap.py (1951 of 2121) PASS: lldb-unit :: Utility/./UtilityTests/LogChannelEnabledTest.LLDB_LOG_ERROR (1952 of 2121) PASS: lldb-unit :: Utility/./UtilityTests/ArgsTest.TestArgv (1953 of 2121) PASS: lldb-unit :: Utility/./UtilityTests/BroadcasterTest.BroadcastEvent (1954 of 2121) PASS: lldb-unit :: UnwindAssembly/ARM64/./Arm64InstEmulationTests/TestArm64InstEmulation.TestSimpleDarwinFunction (1955 of 2121) PASS: lldb-shell :: ObjectFile/Breakpad/sections.test (1956 of 2121) PASS: lldb-api :: functionalities/type_completion/TestTypeCompletion.py (1957 of 2121) PASS: lldb-unit :: Core/./LLDBCoreTests/MangledTest.EmptyForInvalidName (1958 of 2121) PASS: lldb-api :: python_api/hello_world/TestHelloWorld.py (1959 of 2121) PASS: lldb-unit :: Symbol/./SymbolTests/TestTypeSystemClang.TestGetEnumIntegerTypeUnexpectedType (1960 of 2121) PASS: lldb-shell :: SymbolFile/Breakpad/symtab-macho.test (1961 of 2121) PASS: lldb-api :: commands/expression/completion-crash-incomplete-record/TestCompletionCrashIncompleteRecord.py (1962 of 2121) UNSUPPORTED: lldb-shell :: Process/Windows/exception_access_violation.cpp (1963 of 2121) PASS: lldb-api :: commands/help/TestHelp.py (1964 of 2121) PASS: lldb-api :: functionalities/thread/concurrent_events/TestConcurrentTwoWatchpointsOneSignal.py (1965 of 2121) UNSUPPORTED: lldb-shell :: Register/aarch64-gp-read.test (1966 of 2121) PASS: lldb-api :: commands/expression/multiline-completion/TestMultilineCompletion.py (1967 of 2121) XFAIL: lldb-shell :: Register/x86-64-ymm-write.test (1968 of 2121) PASS: lldb-unit :: Utility/./UtilityTests/BinaryStreamTest.PutSLEB128Zero (1969 of 2121) PASS: lldb-api :: functionalities/data-formatter/array_typedef/TestArrayTypedef.py (1970 of 2121) PASS: lldb-api :: functionalities/tsan/basic/TestTsanBasic.py (1971 of 2121) PASS: lldb-unit :: Utility/./UtilityTests/StringListTest.GetMaxStringLengthEmpty (1972 of 2121) PASS: lldb-api :: functionalities/breakpoint/global_constructor/TestBreakpointInGlobalConstructor.py (1973 of 2121) PASS: lldb-shell :: Breakpoint/ppc64-localentry.test (1974 of 2121) PASS: lldb-shell :: SymbolFile/NativePDB/ast-functions.cpp (1975 of 2121) UNSUPPORTED: lldb-api :: python_api/event/TestEvents.py (1976 of 2121) PASS: lldb-api :: commands/expression/po_verbosity/TestPoVerbosity.py (1977 of 2121) PASS: lldb-unit :: Symbol/./SymbolTests/TestTypeSystemClang.TestGetBasicTypeFromName (1978 of 2121) PASS: lldb-api :: functionalities/tail_call_frames/sbapi_support/TestTailCallFrameSBAPI.py (1979 of 2121) PASS: lldb-unit :: Utility/./UtilityTests/BinaryStreamTest.PutULEB128NineBytes (1980 of 2121) PASS: lldb-unit :: Utility/./UtilityTests/XcodeSDKTest.FindXcodeContentsDirectoryInPath (1981 of 2121) PASS: lldb-unit :: Utility/./UtilityTests/StringExtractorTest.GetHexU8_Extra_NoEof (1982 of 2121) PASS: lldb-unit :: Utility/./UtilityTests/OptionsWithRawTest.EmptyArgsOnlySuffix (1983 of 2121) PASS: lldb-api :: lang/objc/unicode-string/TestUnicodeString.py (1984 of 2121) XFAIL: lldb-shell :: Unwind/prefer-debug-over-eh-frame.test (1985 of 2121) PASS: lldb-api :: functionalities/tail_call_frames/cross_dso/TestCrossDSOTailCalls.py (1986 of 2121) PASS: lldb-unit :: ScriptInterpreter/Python/./ScriptInterpreterPythonTests/PythonDataObjectsTest.TestPythonListToStructuredList (1987 of 2121) PASS: lldb-unit :: Utility/./UtilityTests/ArgsTest.EscapeLLDBCommandArgument (1988 of 2121) PASS: lldb-api :: functionalities/source-map/TestTargetSourceMap.py (1989 of 2121) PASS: lldb-api :: sample_test/TestSampleInlineTest.py (1990 of 2121) PASS: lldb-api :: functionalities/inferior-changed/TestInferiorChanged.py (1991 of 2121) UNSUPPORTED: lldb-api :: functionalities/data-formatter/data-formatter-stl/libstdcpp/iterator/TestDataFormatterStdIterator.py (1992 of 2121) PASS: lldb-api :: commands/expression/deleting-implicit-copy-constructor/TestDeletingImplicitCopyConstructor.py (1993 of 2121) PASS: lldb-api :: functionalities/thread/backtrace_limit/TestBacktraceLimit.py (1994 of 2121) PASS: lldb-unit :: Expression/./ExpressionTests/CppModuleConfigurationTest.AmbiguousLibCpp (1995 of 2121) PASS: lldb-api :: functionalities/deleted-executable/TestDeletedExecutable.py (1996 of 2121) PASS: lldb-api :: functionalities/memory/cache/TestMemoryCache.py (1997 of 2121) PASS: lldb-unit :: Utility/./UtilityTests/BinaryStreamTest.PutULEB128FourBytes (1998 of 2121) UNSUPPORTED: lldb-shell :: Register/x86-gp-read.test (1999 of 2121) PASS: lldb-api :: commands/watchpoints/watchpoint_disable/TestWatchpointDisable.py (2000 of 2121) PASS: lldb-unit :: Expression/./ExpressionTests/CppModuleConfigurationTest.Xcode (2001 of 2121) PASS: lldb-unit :: Process/minidump/./LLDBMinidumpTests/MinidumpParserTest.GetMemoryRegionInfoLinuxMaps (2002 of 2121) PASS: lldb-unit :: Language/CPlusPlus/./LanguageCPlusPlusTests/CPlusPlusLanguage.MethodNameParsing (2003 of 2121) PASS: lldb-unit :: Host/./HostTests/NativeProcessProtocolTest.ReadCStringFromMemory_MaxSize (2004 of 2121) PASS: lldb-api :: commands/expression/import-std-module/queue/TestQueueFromStdModule.py (2005 of 2121) PASS: lldb-shell :: SymbolFile/DWARF/DW_AT_loclists_base.s (2006 of 2121) PASS: lldb-unit :: Utility/./UtilityTests/LogChannelEnabledTest.LogGetLogThread (2007 of 2121) PASS: lldb-unit :: Utility/./UtilityTests/SerializationRountripTest.SerializeDeserializeObjectPointer (2008 of 2121) PASS: lldb-api :: lang/c/bitfields/TestBitfields.py (2009 of 2121) PASS: lldb-api :: functionalities/breakpoint/breakpoint_options/TestBreakpointOptions.py (2010 of 2121) PASS: lldb-api :: lang/objc/modules-auto-import/TestModulesAutoImport.py (2011 of 2121) PASS: lldb-unit :: Host/./HostTests/SocketTest.TCPListen0ConnectAccept (2012 of 2121) PASS: lldb-api :: functionalities/type_lookup/TestTypeLookup.py (2013 of 2121) PASS: lldb-unit :: Utility/./UtilityTests/GeneratorTest.GetOrCreate (2014 of 2121) PASS: lldb-unit :: Utility/./UtilityTests/RangeTest.SetRangeBase (2015 of 2121) PASS: lldb-unit :: Utility/./UtilityTests/ArgsTest.BareSingleQuote (2016 of 2121) PASS: lldb-unit :: Utility/./UtilityTests/RangeDataVector.FindEntryIndexesThatContain_Overlap (2017 of 2121) PASS: lldb-unit :: Utility/./UtilityTests/StreamTest.AddressPrefixAndSuffix (2018 of 2121) PASS: lldb-unit :: Utility/./UtilityTests/StringListTest.JoinMultiCharSeparator (2019 of 2121) PASS: lldb-unit :: Utility/./UtilityTests/FileSpecTest.Yaml (2020 of 2121) PASS: lldb-api :: functionalities/breakpoint/address_breakpoints/TestAddressBreakpoints.py (2021 of 2121) PASS: lldb-unit :: Utility/./UtilityTests/RangeTest.ContainsAddr (2022 of 2121) PASS: lldb-unit :: Symbol/./SymbolTests/TestTypeSystemClang.TestOwningModule (2023 of 2121) PASS: lldb-api :: commands/expression/persist_objc_pointeetype/TestPersistObjCPointeeType.py (2024 of 2121) PASS: lldb-unit :: Utility/./UtilityTests/SerializationRountripTest.SerializeDeserializeObjectReference (2025 of 2121) PASS: lldb-unit :: Utility/./UtilityTests/UUIDTest.Validity (2026 of 2121) PASS: lldb-api :: functionalities/thread/concurrent_events/TestConcurrentTwoBreakpointsOneDelaySignal.py (2027 of 2121) PASS: lldb-unit :: Expression/./ExpressionTests/DiagnosticManagerTest.HasFixits (2028 of 2121) UNSUPPORTED: lldb-api :: android/platform/TestDefaultCacheLineSize.py (2029 of 2121) PASS: lldb-unit :: Utility/./UtilityTests/BinaryStreamTest.PutULEB128OneByte (2030 of 2121) PASS: lldb-unit :: Expression/./ExpressionTests/CppModuleConfigurationTest.LibCppV2 (2031 of 2121) UNSUPPORTED: lldb-shell :: SymbolFile/PDB/function-level-linking.test (2032 of 2121) PASS: lldb-unit :: Utility/./UtilityTests/DataExtractorTest.GetFloatUnaligned (2033 of 2121) PASS: lldb-unit :: Utility/./UtilityTests/BinaryStreamTest.PutULEB128EightBytes (2034 of 2121) PASS: lldb-api :: sanity/TestModuleCacheSanity.py (2035 of 2121) PASS: lldb-unit :: Utility/./UtilityTests/StreamTest.PutMaxHex64ByteOrderLittle (2036 of 2121) PASS: lldb-api :: functionalities/data-formatter/synthupdate/TestSyntheticFilterRecompute.py (2037 of 2121) PASS: lldb-shell :: Driver/LocalLLDBInit.test (2038 of 2121) PASS: lldb-unit :: Utility/./UtilityTests/GeneratorTest.Create (2039 of 2121) PASS: lldb-unit :: SymbolFile/NativePDB/./SymbolFileNativePDBTests/PDBFPOProgramToDWARFExpressionTests.UnresolvedDependentCyclicRegisterAssignmentReference (2040 of 2121) PASS: lldb-unit :: tools/lldb-server/tests/./LLDBServerTests/TestBase.DebugserverEnv (2041 of 2121) PASS: lldb-shell :: ObjectFile/PECOFF/export-dllfunc.yaml (2042 of 2121) PASS: lldb-unit :: Utility/./UtilityTests/BinaryStreamTest.PutULEB128One (2043 of 2121) PASS: lldb-api :: commands/expression/call-function/TestCallStdStringFunction.py (2044 of 2121) PASS: lldb-api :: tools/lldb-server/commandline/TestStubReverseConnect.py (2045 of 2121) PASS: lldb-api :: functionalities/data-formatter/parray/TestPrintArray.py (2046 of 2121) PASS: lldb-unit :: Utility/./UtilityTests/RecordReplayTest.InstrumentedBar (2047 of 2121) PASS: lldb-unit :: Utility/./UtilityTests/DataExtractorTest.PeekData (2048 of 2121) PASS: lldb-api :: lang/cpp/const_this/TestConstThis.py (2049 of 2121) PASS: lldb-unit :: Utility/./UtilityTests/StringExtractorTest.GetHexU8_Underflow2_NoEof (2050 of 2121) PASS: lldb-unit :: tools/lldb-server/tests/./LLDBServerTests/TestBase.LaunchModePreservesEnvironment (2051 of 2121) PASS: lldb-unit :: UnwindAssembly/ARM64/./Arm64InstEmulationTests/TestArm64InstEmulation.TestRegisterSavedTwice (2052 of 2121) PASS: lldb-api :: functionalities/breakpoint/inlined_breakpoints/TestInlinedBreakpoints.py (2053 of 2121) PASS: lldb-unit :: Utility/./UtilityTests/AnsiTerminal.Basic (2054 of 2121) PASS: lldb-api :: tools/lldb-server/TestGdbRemoteExitCode.py (2055 of 2121) UNSUPPORTED: lldb-api :: commands/expression/completion-crash-invalid-iterator/TestInvalidIteratorCompletionCrash.py (2056 of 2121) PASS: lldb-unit :: SymbolFile/NativePDB/./SymbolFileNativePDBTests/PDBFPOProgramToDWARFExpressionTests.MultipleDependentAssignments (2057 of 2121) PASS: lldb-unit :: Utility/./UtilityTests/StringExtractorTest.GetHexU8_Underflow_NoEof (2058 of 2121) PASS: lldb-api :: python_api/function_symbol/TestSymbolAPI.py (2059 of 2121) PASS: lldb-api :: commands/gui/basic/TestGuiBasic.py (2060 of 2121) PASS: lldb-unit :: Utility/./UtilityTests/StringListTest.Clear (2061 of 2121) PASS: lldb-api :: functionalities/abbreviation/TestCommonShortSpellings.py (2062 of 2121) PASS: lldb-api :: functionalities/target_var/TestTargetVar.py (2063 of 2121) PASS: lldb-unit :: Expression/./ExpressionTests/DWARFExpression.DW_OP_unknown (2064 of 2121) UNSUPPORTED: lldb-api :: lang/cpp/printf/TestPrintf.py (2065 of 2121) PASS: lldb-api :: functionalities/data-formatter/data-formatter-stl/libcxx/variant/TestDataFormatterLibcxxVariant.py (2066 of 2121) PASS: lldb-unit :: Utility/./UtilityTests/StringLexerTest.AdvanceIf (2067 of 2121) PASS: lldb-unit :: Target/./TargetTests/ExecutionContextTest.GetByteOrder (2068 of 2121) UNSUPPORTED: lldb-api :: lang/objc/rdar-12408181/TestRdar12408181.py (2069 of 2121) PASS: lldb-shell :: SymbolFile/DWARF/dwarf5-atomic.s (2070 of 2121) PASS: lldb-shell :: Settings/TestDisassemblyFormat.test (2071 of 2121) PASS: lldb-api :: commands/expression/persistent_types/TestPersistentTypes.py (2072 of 2121) PASS: lldb-unit :: ScriptInterpreter/Python/./ScriptInterpreterPythonTests/PythonDataObjectsTest.TestPythonBytes (2073 of 2121) PASS: lldb-unit :: ObjectFile/Breakpad/./ObjectFileBreakpadTests/ModuleRecord.parse (2074 of 2121) UNSUPPORTED: lldb-api :: tools/lldb-server/thread-name/TestGdbRemoteThreadName.py (2075 of 2121) PASS: lldb-unit :: Utility/./UtilityTests/DataExtractorTest.GetMaxS64 (2076 of 2121) PASS: lldb-unit :: ScriptInterpreter/Python/./ScriptInterpreterPythonTests/PythonDataObjectsTest.TestGlobalNameResolutionWithDot (2077 of 2121) PASS: lldb-unit :: ScriptInterpreter/Python/./ScriptInterpreterPythonTests/PythonDataObjectsTest.TestGlobalNameResolutionNoDot (2078 of 2121) PASS: lldb-unit :: SymbolFile/NativePDB/./SymbolFileNativePDBTests/PDBFPOProgramToDWARFExpressionTests.UnresolvedRegisterAssignmentReference (2079 of 2121) PASS: lldb-unit :: UnwindAssembly/x86/./UnwindAssemblyx86Tests/Testx86AssemblyInspectionEngine.TestPushImm (2080 of 2121) PASS: lldb-unit :: Expression/./ExpressionTests/CppModuleConfigurationTest.IgnoreLibStdCpp (2081 of 2121) PASS: lldb-api :: lang/cpp/unicode-literals/TestUnicodeLiterals.py (2082 of 2121) PASS: lldb-api :: commands/expression/options/TestExprOptions.py (2083 of 2121) PASS: lldb-api :: functionalities/data-formatter/data-formatter-stl/libcxx/unique_ptr/TestDataFormatterLibcxxUniquePtr.py (2084 of 2121) PASS: lldb-unit :: Language/CPlusPlus/./LanguageCPlusPlusTests/CPlusPlusLanguage.CPlusPlusNameParser (2085 of 2121) PASS: lldb-unit :: ObjectFile/PECOFF/./ObjectFilePECOFFTests/PECallFrameInfoTest.Chained_eh (2086 of 2121) PASS: lldb-api :: python_api/process/TestProcessAPI.py (2087 of 2121) PASS: lldb-unit :: Utility/./UtilityTests/OptionsWithRawTest.ArgsButNoDelimiter (2088 of 2121) PASS: lldb-api :: lang/objc/orderedset/TestOrderedSet.py (2089 of 2121) PASS: lldb-unit :: Utility/./UtilityTests/StreamTest.PutStringAsRawHex8 (2090 of 2121) PASS: lldb-unit :: ObjectFile/Breakpad/./ObjectFileBreakpadTests/Record.classify (2091 of 2121) PASS: lldb-api :: lang/objc/single-entry-dictionary/TestObjCSingleEntryDictionary.py (2092 of 2121) UNSUPPORTED: lldb-api :: tools/intel-features/intel-pt/test/TestIntelPTSimpleBinary.py (2093 of 2121) PASS: lldb-unit :: Utility/./UtilityTests/BinaryStreamTest.PutSLEB128SixBytes (2094 of 2121) PASS: lldb-unit :: Utility/./UtilityTests/ArgsTest.TestQuotedUnknownEscape (2095 of 2121) PASS: lldb-unit :: Utility/./UtilityTests/ConstStringTest.CompareStringRef (2096 of 2121) PASS: lldb-api :: functionalities/data-formatter/data-formatter-stl/libcxx/forward_list/TestDataFormatterLibcxxForwardList.py (2097 of 2121) PASS: lldb-unit :: Utility/./UtilityTests/OptionsWithRawTest.EmptySuffix (2098 of 2121) PASS: lldb-unit :: Host/./HostTests/MainLoopTest.DetectsEOF (2099 of 2121) PASS: lldb-api :: functionalities/tail_call_frames/disambiguate_tail_call_seq/TestDisambiguateTailCallSeq.py (2100 of 2121) PASS: lldb-api :: functionalities/data-formatter/user-format-vs-summary/TestUserFormatVsSummary.py (2101 of 2121) PASS: lldb-unit :: Process/gdb-remote/./ProcessGdbRemoteTests/GDBRemoteClientBaseTest.SendContinueDelegateInterface (2102 of 2121) PASS: lldb-unit :: Utility/./UtilityTests/OptionsWithRawTest.MultiWordSuffix (2103 of 2121) PASS: lldb-api :: commands/thread/select/TestThreadSelect.py (2104 of 2121) PASS: lldb-unit :: Process/gdb-remote/./ProcessGdbRemoteTests/GDBRemoteClientBaseTest.InterruptNoResponse (2105 of 2121) PASS: lldb-api :: functionalities/breakpoint/breakpoint_by_file_colon_line/TestBreakpointByFileColonLine.py (2106 of 2121) UNSUPPORTED: lldb-api :: functionalities/darwin_log/filter/regex/activity/TestDarwinLogFilterRegexActivity.py (2107 of 2121) PASS: lldb-api :: macosx/find-dsym/deep-bundle/TestDeepBundle.py (2108 of 2121) PASS: lldb-api :: commands/expression/import-std-module/list/TestListFromStdModule.py (2109 of 2121) PASS: lldb-shell :: SymbolFile/DWARF/DW_TAG_variable-invalid_location.s (2110 of 2121) PASS: lldb-unit :: Utility/./UtilityTests/RangeDataVector.FindEntryIndexesThatContain (2111 of 2121) PASS: lldb-api :: commands/session/history/TestSessionHistory.py (2112 of 2121) PASS: lldb-api :: commands/expression/import-std-module/empty-module/TestEmptyStdModule.py (2113 of 2121) PASS: lldb-api :: tools/lldb-vscode/step/TestVSCode_step.py (2114 of 2121) PASS: lldb-api :: functionalities/thread/create_after_attach/TestCreateAfterAttach.py (2115 of 2121) PASS: lldb-api :: python_api/lldbutil/TestSwigVersion.py (2116 of 2121) PASS: lldb-shell :: ScriptInterpreter/Python/crashlog.test (2117 of 2121) PASS: lldb-api :: lang/objc/real-definition/TestRealDefinition.py (2118 of 2121) PASS: lldb-api :: commands/expression/import-std-module/forward_list-dbg-info-content/TestDbgInfoContentForwardListFromStdModule.py (2119 of 2121) PASS: lldb-api :: functionalities/recursion/TestValueObjectRecursion.py (2120 of 2121) PASS: lldb-api :: lang/objc/objc-new-syntax/TestObjCNewSyntaxArray.py (2121 of 2121) Slowest Tests: -------------------------------------------------------------------------- 600.84s: lldb-api :: macosx/simulator/TestSimulatorPlatform.py 213.02s: lldb-api :: lang/objc/objc-new-syntax/TestObjCNewSyntaxDictionary.py 186.90s: lldb-api :: lang/objc/objc-super/TestObjCSuper.py 169.35s: lldb-api :: types/TestCharType.py 160.54s: lldb-api :: lang/cpp/virtual-functions/TestCppVirtualFunctions.py 114.26s: lldb-api :: functionalities/postmortem/mach-core/TestMachCore.py 111.51s: lldb-api :: functionalities/gdb_remote_client/TestRestartBug.py 99.28s: lldb-api :: tools/lldb-server/TestLldbGdbServer.py 84.89s: lldb-api :: functionalities/inline-stepping/TestInlineStepping.py 68.42s: lldb-api :: lang/objc/hidden-ivars/TestHiddenIvars.py 61.80s: lldb-api :: lang/cpp/enum_types/TestCPP11EnumTypes.py 61.35s: lldb-api :: functionalities/postmortem/netbsd-core/TestNetBSDCore.py 59.08s: lldb-api :: lang/cpp/template/TestTemplateArgs.py 53.75s: lldb-api :: macosx/dyld-trie-symbols/TestDyldTrieSymbols.py 53.39s: lldb-api :: lang/cpp/member-and-local-vars-with-same-name/TestMembersAndLocalsWithSameName.py 50.95s: lldb-api :: lang/objc/foundation/TestObjCMethods.py 50.84s: lldb-api :: lang/objc/exceptions/TestObjCExceptions.py 50.56s: lldb-api :: lang/objc/foundation/TestFoundationDisassembly.py 48.76s: lldb-shell :: SymbolFile/NativePDB/bitfields.cpp 47.60s: lldb-api :: api/multithreaded/TestMultithreaded.py

Hide Details

Tests Times: -------------------------------------------------------------------------- [ Range ] :: [ Percentage ] :: [ Count ] -------------------------------------------------------------------------- [600s,650s) :: [ ] :: [ 1/2121] [550s,600s) :: [ ] :: [ 0/2121] [500s,550s) :: [ ] :: [ 0/2121] [450s,500s) :: [ ] :: [ 0/2121] [400s,450s) :: [ ] :: [ 0/2121] [350s,400s) :: [ ] :: [ 0/2121] [300s,350s) :: [ ] :: [ 0/2121] [250s,300s) :: [ ] :: [ 0/2121] [200s,250s) :: [ ] :: [ 2/2121] [150s,200s) :: [ ] :: [ 2/2121] [100s,150s) :: [ ] :: [ 3/2121] [ 50s,100s) :: [ ] :: [ 12/2121] [ 0s, 50s) :: [*************************************** ] :: [2101/2121] -------------------------------------------------------------------------- ******************** Timed Out Tests (1): lldb-api :: macosx/simulator/TestSimulatorPlatform.py

Hide Details

Hide Details

Testing Time: 2093.40s Unsupported : 150 Passed : 1964 Expectedly Failed: 6 Timed Out : 1 FAILED: tools/lldb/test/CMakeFiles/check-lldb-lit cd /Users/buildslave/jenkins/workspace/lldb-cmake/lldb-build/tools/lldb/test && /usr/local/Frameworks/Python.framework/Versions/3.7/bin/python3.7 /Users/buildslave/jenkins/workspace/lldb-cmake/lldb-build/./bin/llvm-lit -v --time-tests --shuffle --xunit-xml-output=/Users/buildslave/jenkins/workspace/lldb-cmake/test/results.xml -v -j 4 /Users/buildslave/jenkins/workspace/lldb-cmake/lldb-build/tools/lldb/test ninja: build stopped: subcommand failed. Command failed: Command '['/usr/bin/env', 'TERM=vt100', '/usr/local/bin/ninja', '-v', 'check-lldb']' returned non-zero exit status 1 Command: ['/usr/bin/env', 'TERM=vt100', '/usr/local/bin/ninja', '-v', 'check-lldb'] [Pipeline] } [Pipeline] // timeout [Pipeline] } [Pipeline] // stage [Pipeline] stage [Pipeline] { (Declarative: Post Actions) [Pipeline] scanForIssues [Clang (LLVM based)] Sleeping for 5 seconds due to JENKINS-32191... [Clang (LLVM based)] Parsing console log (workspace: '/Users/buildslave/jenkins/workspace/lldb-cmake') [Clang (LLVM based)] Successfully parsed console log [Clang (LLVM based)] -> found 14 issues (skipped 101 duplicates) [Clang (LLVM based)] Post processing issues on 'green-dragon-10' with source code encoding 'UTF-8' [Clang (LLVM based)] Creating SCM blamer to obtain author and commit information for affected files [Clang (LLVM based)] Creating SCM miner to obtain statistics for affected repository files [Clang (LLVM based)] Resolving file names for all issues in source directory '/Users/buildslave/jenkins/workspace/lldb-cmake' [Clang (LLVM based)] -> resolved paths in source directory (9 found, 0 not found) [Clang (LLVM based)] Resolving module names from module definitions (build.xml, pom.xml, or Manifest.mf files) [Clang (LLVM based)] -> resolved module names for 14 issues [Clang (LLVM based)] Resolving package names (or namespaces) by parsing the affected files [Clang (LLVM based)] -> resolved package names of 8 affected files [Clang (LLVM based)] No filter has been set, publishing all 13 issues [Clang (LLVM based)] Creating fingerprints for all affected code blocks to track issues over different builds [Clang (LLVM based)] -> created fingerprints for 13 issues (skipped 0 issues) [Clang (LLVM based)] Copying affected files to Jenkins' build folder '/Users/Shared/Jenkins/Home/jobs/lldb-cmake/builds/23339/files-with-issues' [Clang (LLVM based)] -> 6 copied, 2 not in workspace, 0 not-found, 0 with I/O error [Pipeline] junit Recording test results [Pipeline] } [Pipeline] // stage [Pipeline] } [Pipeline] // withEnv [Pipeline] } [Pipeline] // node [Pipeline] End of Pipeline ERROR: script returned exit code 1 Finished: FAILURE