FailedConsole Output

Skipping 6,839 KB.. Full Log
t.PutCStringWithStringRef (673 of 2150)
PASS: lldb-api :: commands/expression/radar_9673664/TestExprHelpExamples.py (674 of 2150)
PASS: lldb-unit :: Utility/./UtilityTests/XcodeSDKTest.ParseTest (675 of 2150)
PASS: lldb-unit :: Utility/./UtilityTests/RangeTest.DefaultConstructor (676 of 2150)
PASS: lldb-unit :: Utility/./UtilityTests/ArchSpecTest.YAML (677 of 2150)
PASS: lldb-unit :: Core/./LLDBCoreTests/StreamCallbackTest.Callback (678 of 2150)
PASS: lldb-api :: commands/expression/ignore-artificial-constructors/TestIgnoreArtificialConstructors.py (679 of 2150)
PASS: lldb-unit :: Utility/./UtilityTests/StringExtractorTest.GetHexBytes_OddPair2 (680 of 2150)
PASS: lldb-unit :: UnwindAssembly/x86/./UnwindAssemblyx86Tests/Testx86AssemblyInspectionEngine.TestDisassemblyJunkBytes (681 of 2150)
PASS: lldb-api :: commands/expression/entry-bp/TestExprEntryBP.py (682 of 2150)
PASS: lldb-api :: functionalities/gdb_remote_client/TestWasm.py (683 of 2150)
PASS: lldb-api :: python_api/debugger/TestDebuggerAPI.py (684 of 2150)
UNSUPPORTED: lldb-api :: functionalities/data-formatter/data-formatter-stl/libstdcpp/string/TestDataFormatterStdString.py (685 of 2150)
PASS: lldb-api :: functionalities/thread/concurrent_events/TestConcurrentTwoWatchpointsOneSignal.py (686 of 2150)
PASS: lldb-api :: commands/expression/call-function/TestCallBuiltinFunction.py (687 of 2150)
PASS: lldb-shell :: SymbolFile/DWARF/DW_OP_piece-smaller-than-struct.s (688 of 2150)
PASS: lldb-unit :: Utility/./UtilityTests/ProcessInstanceInfoMatch.Name (689 of 2150)
PASS: lldb-api :: lang/cpp/thread_local/TestThreadLocal.py (690 of 2150)
PASS: lldb-unit :: SymbolFile/NativePDB/./SymbolFileNativePDBTests/PDBFPOProgramToDWARFExpressionTests.UnknownOp (691 of 2150)
PASS: lldb-api :: functionalities/breakpoint/address_breakpoints/TestAddressBreakpoints.py (692 of 2150)
PASS: lldb-unit :: Core/./LLDBCoreTests/ModuleSpecTest.TestMachOFile (693 of 2150)
PASS: lldb-unit :: Utility/./UtilityTests/StringListTest.SplitIntoLinesEmpty (694 of 2150)
PASS: lldb-unit :: Utility/./UtilityTests/OptionsWithRawTest.EmptySuffixSingleWhitespace (695 of 2150)
PASS: lldb-api :: commands/target/stop-hook/disable/TestTargetStopHookDisable.py (696 of 2150)
PASS: lldb-unit :: Utility/./UtilityTests/ConstStringTest.MangledCounterpart (697 of 2150)
PASS: lldb-unit :: Target/./TargetTests/MemoryRegionInfoTest.Formatv (698 of 2150)
PASS: lldb-shell :: Reproducer/TestFileRepro.test (699 of 2150)
PASS: lldb-unit :: ObjectFile/Breakpad/./ObjectFileBreakpadTests/LineRecord.parse (700 of 2150)
PASS: lldb-shell :: SymbolFile/NativePDB/globals-fundamental.cpp (701 of 2150)
PASS: lldb-shell :: Driver/TestCore.test (702 of 2150)
PASS: lldb-api :: functionalities/tail_call_frames/cross_dso/TestCrossDSOTailCalls.py (703 of 2150)
PASS: lldb-unit :: Platform/Android/./AdbClientTests/AdbClientTest.CreateByDeviceId (704 of 2150)
PASS: lldb-unit :: Platform/./LLDBPlatformTests/PlatformDarwinTest.FindComponentInPath (705 of 2150)
PASS: lldb-unit :: SymbolFile/DWARF/./SymbolFileDWARFTests/SymbolFileDWARFTests.TestAbbrevNullAttrValidForm (706 of 2150)
PASS: lldb-shell :: VSCode/TestOptions.test (707 of 2150)
PASS: lldb-unit :: Host/./HostTests/NativeProcessProtocolTest.SetBreakpoint (708 of 2150)
PASS: lldb-api :: commands/expression/import-std-module/list-dbg-info-content/TestDbgInfoContentListFromStdModule.py (709 of 2150)
PASS: lldb-shell :: Reproducer/Functionalities/TestStepping.test (710 of 2150)
PASS: lldb-unit :: Process/gdb-remote/./ProcessGdbRemoteTests/GDBRemoteCommunicationTest.ReadPacket_checksum (711 of 2150)
PASS: lldb-shell :: SymbolFile/DWARF/DW_AT_data_bit_offset-DW_OP_stack_value.s (712 of 2150)
PASS: lldb-unit :: Expression/./ExpressionTests/DiagnosticManagerTest.HasFixits (713 of 2150)
PASS: lldb-api :: lang/cpp/namespace_conflicts/TestNamespaceConflicts.py (714 of 2150)
PASS: lldb-unit :: ObjectFile/ELF/./ObjectFileELFTests/ObjectFileELFTest.GetModuleSpecifications_EarlySectionHeaders (715 of 2150)
UNSUPPORTED: lldb-api :: functionalities/signal/handle-segv/TestHandleSegv.py (716 of 2150)
PASS: lldb-shell :: Commands/command-backtrace.test (717 of 2150)
UNSUPPORTED: lldb-shell :: Register/x86-64-zmm-read.test (718 of 2150)
PASS: lldb-api :: commands/expression/import-std-module/stack/TestStackFromStdModule.py (719 of 2150)
PASS: lldb-shell :: ObjectFile/ELF/netbsd-core-amd64.test (720 of 2150)
PASS: lldb-shell :: SymbolFile/DWARF/dir-separator-posix.s (721 of 2150)
PASS: lldb-api :: functionalities/postmortem/mach-core/TestMachCore.py (722 of 2150)
UNSUPPORTED: lldb-api :: benchmarks/stepping/TestSteppingSpeed.py (723 of 2150)
PASS: lldb-api :: commands/expression/inline-namespace/TestInlineNamespace.py (724 of 2150)
PASS: lldb-api :: commands/command/script/TestCommandScript.py (725 of 2150)
PASS: lldb-unit :: API/./APITests/SBCommandInterpreterTest.MultiWordCommand (726 of 2150)
PASS: lldb-unit :: Expression/./ExpressionTests/DWARFExpression.DW_OP_stack_value (727 of 2150)
PASS: lldb-unit :: Utility/./UtilityTests/LogChannelEnabledTest.log_options (728 of 2150)
PASS: lldb-unit :: Expression/./ExpressionTests/DiagnosticManagerTest.PutString (729 of 2150)
PASS: lldb-unit :: Utility/./UtilityTests/BinaryStreamTest.PutULEB128FiveBytes (730 of 2150)
PASS: lldb-api :: lang/cpp/function-qualifiers/TestCppFunctionQualifiers.py (731 of 2150)
PASS: lldb-shell :: SymbolFile/DWARF/debug_rnglists-dwo.s (732 of 2150)
PASS: lldb-unit :: ScriptInterpreter/Python/./ScriptInterpreterPythonTests/PythonDataObjectsTest.TestPythonCallableCheck (733 of 2150)
PASS: lldb-api :: functionalities/thread/concurrent_events/TestConcurrentTwoBreakpointThreads.py (734 of 2150)
PASS: lldb-shell :: SymbolFile/DWARF/dir-separator-no-comp-dir.s (735 of 2150)
PASS: lldb-api :: lang/objc/rdar-10967107/TestRdar10967107.py (736 of 2150)
PASS: lldb-unit :: Expression/./ExpressionTests/ClangExpressionDeclMapTest.TestPersistentDeclLookup (737 of 2150)
UNSUPPORTED: lldb-shell :: SymbolFile/PDB/ast-restore.test (738 of 2150)
PASS: lldb-unit :: UnwindAssembly/ARM64/./Arm64InstEmulationTests/TestArm64InstEmulation.TestRegisterDoubleSpills (739 of 2150)
XFAIL: lldb-shell :: Register/x86-mm-xmm-write.test (740 of 2150)
PASS: lldb-api :: commands/expression/cast_int_to_anonymous_enum/TestCastIntToAnonymousEnum.py (741 of 2150)
PASS: lldb-unit :: Utility/./UtilityTests/LogChannelTest.EnableOptions (742 of 2150)
PASS: lldb-unit :: UnwindAssembly/x86/./UnwindAssemblyx86Tests/Testx86AssemblyInspectionEngine.TestPushEDI (743 of 2150)
PASS: lldb-shell :: ObjectFile/ELF/PT_TLS-overlap-PT_LOAD.yaml (744 of 2150)
PASS: lldb-unit :: Process/minidump/./LLDBMinidumpTests/MinidumpParserTest.MinidumpDuplicateModuleMinAddress (745 of 2150)
PASS: lldb-unit :: Utility/./UtilityTests/SubsystemRAIITest.SubsystemWithErrorSuccess (746 of 2150)
PASS: lldb-unit :: Symbol/./SymbolTests/TestTypeSystemClang.AddMethodToObjCObjectType (747 of 2150)
PASS: lldb-api :: functionalities/breakpoint/breakpoint_command/TestRegexpBreakCommand.py (748 of 2150)
PASS: lldb-api :: lang/cpp/gmodules/TestWithModuleDebugging.py (749 of 2150)
PASS: lldb-unit :: Platform/./LLDBPlatformTests/PlatformAppleSimulatorTest.TestSimHasSimEnvionament (750 of 2150)
PASS: lldb-unit :: Process/gdb-remote/./ProcessGdbRemoteTests/GDBRemoteCommunicationClientTest.WriteRegister (751 of 2150)
PASS: lldb-api :: functionalities/target_var/no_vars/TestTargetVarNoVars.py (752 of 2150)
PASS: lldb-unit :: UnwindAssembly/x86/./UnwindAssemblyx86Tests/Testx86AssemblyInspectionEngine.Test32BitOnlyInstruction (753 of 2150)
PASS: lldb-unit :: Utility/./UtilityTests/StringListTest.CopyListSingle (754 of 2150)
PASS: lldb-unit :: Utility/./UtilityTests/StringExtractorTest.GetHexBytesAvail_OddPair2 (755 of 2150)
PASS: lldb-api :: functionalities/thread/concurrent_events/TestConcurrentBreakpointsDelayedBreakpointOneWatchpoint.py (756 of 2150)
PASS: lldb-api :: commands/command/nested_alias/TestNestedAlias.py (757 of 2150)
PASS: lldb-shell :: ScriptInterpreter/None/import_module.test (758 of 2150)
PASS: lldb-api :: commands/expression/radar_9531204/TestPrintfAfterUp.py (759 of 2150)
UNSUPPORTED: lldb-api :: functionalities/unwind/ehframe/TestEhFrameUnwind.py (760 of 2150)
PASS: lldb-api :: tools/lldb-server/TestGdbRemote_vCont.py (761 of 2150)
PASS: lldb-unit :: Utility/./UtilityTests/StreamTeeTest.AppendStream (762 of 2150)
PASS: lldb-shell :: SymbolFile/DWARF/debug_ranges_and_rnglists.test (763 of 2150)
PASS: lldb-api :: lang/c/complex/TestComplexC99.py (764 of 2150)
PASS: lldb-api :: functionalities/data-formatter/cstring-utf8-summary/TestCstringUnicode.py (765 of 2150)
FAIL: lldb-api :: functionalities/gdb_remote_client/TestThreadSelectionBug.py (766 of 2150)
******************** TEST 'lldb-api :: functionalities/gdb_remote_client/TestThreadSelectionBug.py' FAILED ********************
Script:
--
/usr/local/Frameworks/Python.framework/Versions/3.7/bin/python3.7 /Users/buildslave/jenkins/workspace/lldb-cmake/llvm-project/lldb/test/API/dotest.py -s /Users/buildslave/jenkins/workspace/lldb-cmake/lldb-build/lldb-test-traces -S nm -u CXXFLAGS -u CFLAGS --codesign-identity - --server /Users/buildslave/jenkins/workspace/lldb-cmake/lldb-build/./bin/debugserver --arch x86_64 --build-dir /Users/buildslave/jenkins/workspace/lldb-cmake/lldb-build/lldb-test-build.noindex -s=/Users/buildslave/jenkins/workspace/lldb-cmake/test/logs -t --env TERM=vt100 --env LLVM_LIBS_DIR=/Users/buildslave/jenkins/workspace/lldb-cmake/lldb-build/./lib --arch x86_64 --build-dir /Users/buildslave/jenkins/workspace/lldb-cmake/lldb-build/lldb-test-build.noindex --lldb-module-cache-dir /Users/buildslave/jenkins/workspace/lldb-cmake/lldb-build/lldb-test-build.noindex/module-cache-lldb/lldb-api --clang-module-cache-dir /Users/buildslave/jenkins/workspace/lldb-cmake/lldb-build/lldb-test-build.noindex/module-cache-clang/lldb-api --executable /Users/buildslave/jenkins/workspace/lldb-cmake/lldb-build/./bin/lldb --compiler /Users/buildslave/jenkins/workspace/lldb-cmake/lldb-build/./bin/clang --dsymutil /Users/buildslave/jenkins/workspace/lldb-cmake/lldb-build/./bin/dsymutil --filecheck /Users/buildslave/jenkins/workspace/lldb-cmake/lldb-build/./bin/FileCheck --yaml2obj /Users/buildslave/jenkins/workspace/lldb-cmake/lldb-build/./bin/yaml2obj --lldb-libs-dir /Users/buildslave/jenkins/workspace/lldb-cmake/lldb-build/./lib /Users/buildslave/jenkins/workspace/lldb-cmake/llvm-project/lldb/test/API/functionalities/gdb_remote_client -p TestThreadSelectionBug.py
--
Exit Code: 1

Hide Details

Command Output (stdout): -- lldb version 12.0.99 clang revision 4c23cf3ca0e07482b7ab7989b4e480e1cc0d6091 llvm revision 4c23cf3ca0e07482b7ab7989b4e480e1cc0d6091 libstdcxx tests will not be run because: Don't know how to build with libstdcxx on macosx Skipping following debug info categories: ['dwo']

Hide Details

-- Command Output (stderr): --

Hide Details

Session logs for test failures/errors/unexpected successes will go into directory '/Users/buildslave/jenkins/workspace/lldb-cmake/test/logs' Change dir to: /Users/buildslave/jenkins/workspace/lldb-cmake/llvm-project/lldb/test/API/functionalities/gdb_remote_client runCmd: settings clear -all output:

Hide Details

runCmd: settings set symbols.enable-external-lookup false output:

Hide Details

runCmd: settings set target.inherit-tcc true output:

Hide Details

runCmd: settings set target.auto-apply-fixits false output:

Hide Details

runCmd: settings set plugin.process.gdb-remote.packet-timeout 60 output:

Hide Details

runCmd: settings set symbols.clang-modules-cache-path "/Users/buildslave/jenkins/workspace/lldb-cmake/lldb-build/lldb-test-build.noindex/module-cache-lldb/lldb-api" output:

Hide Details

runCmd: settings set use-color false output:

Hide Details

runCmd: setting set target.prefer-dynamic-value no-dynamic-values output:

Hide Details

FAIL: LLDB (/Users/buildslave/jenkins/workspace/lldb-cmake/lldb-build/bin/clang-x86_64) :: test (TestThreadSelectionBug.TestThreadSelectionBug) <bound method SBProcess.Kill of <lldb.SBProcess; proxy of <Swig Object of type 'lldb::SBProcess *' at 0x10b8345a0> >>: success

Hide Details

Restore dir to: /Users/buildslave/jenkins/workspace/lldb-cmake/lldb-build/tools/lldb/test ====================================================================== FAIL: test (TestThreadSelectionBug.TestThreadSelectionBug) ---------------------------------------------------------------------- Traceback (most recent call last): File "/Users/buildslave/jenkins/workspace/lldb-cmake/llvm-project/lldb/test/API/functionalities/gdb_remote_client/TestThreadSelectionBug.py", line 16, in test process = self.connect(target) File "/Users/buildslave/jenkins/workspace/lldb-cmake/llvm-project/lldb/test/API/functionalities/gdb_remote_client/gdbclientutils.py", line 524, in connect self.assertTrue(error.Success(), error.description) AssertionError: False is not True : failed to get reply to handshake packet Config=x86_64-/Users/buildslave/jenkins/workspace/lldb-cmake/lldb-build/bin/clang ---------------------------------------------------------------------- Ran 1 test in 93.622s

Hide Details

RESULT: FAILED (0 passes, 1 failures, 0 errors, 0 skipped, 0 expected failures, 0 unexpected successes)

Hide Details

--

Hide Details

******************** UNSUPPORTED: lldb-api :: lang/cpp/printf/TestPrintf.py (767 of 2150) PASS: lldb-api :: functionalities/breakpoint/cpp/TestCPPBreakpointLocations.py (768 of 2150) PASS: lldb-api :: lang/objc/objc-super/TestObjCSuper.py (769 of 2150) UNSUPPORTED: lldb-shell :: Register/x86-ymm-read.test (770 of 2150) PASS: lldb-api :: functionalities/breakpoint/breakpoint_set_restart/TestBreakpointSetRestart.py (771 of 2150) PASS: lldb-api :: lang/cpp/stl/TestSTL.py (772 of 2150) PASS: lldb-api :: functionalities/gdb_remote_client/TestWriteMemory.py (773 of 2150) PASS: lldb-api :: functionalities/thread/concurrent_events/TestConcurrentCrashWithWatchpoint.py (774 of 2150) PASS: lldb-api :: lang/objc/direct-dispatch-step/TestObjCDirectDispatchStepping.py (775 of 2150) PASS: lldb-unit :: Utility/./UtilityTests/UriParserTest.TypicalPortPathIPv6 (776 of 2150) PASS: lldb-api :: python_api/target/TestTargetAPI.py (777 of 2150) PASS: lldb-api :: api/command-return-object/TestSBCommandReturnObject.py (778 of 2150) PASS: lldb-api :: functionalities/var_path/TestVarPath.py (779 of 2150) PASS: lldb-unit :: Utility/./UtilityTests/StringLexerTest.NextIfList (780 of 2150) UNSUPPORTED: lldb-shell :: Register/x86-ymm-write.test (781 of 2150) PASS: lldb-shell :: Minidump/Windows/find-module.test (782 of 2150) PASS: lldb-unit :: Utility/./UtilityTests/DataExtractorTest.GetDoubleUnaligned (783 of 2150) PASS: lldb-api :: functionalities/postmortem/wow64_minidump/TestWow64MiniDump.py (784 of 2150) PASS: lldb-unit :: Process/gdb-remote/./ProcessGdbRemoteTests/GDBRemoteCommunicationClientTest.GetModulesInfoInvalidResponse (785 of 2150) UNSUPPORTED: lldb-shell :: ScriptInterpreter/Lua/lua-python.test (786 of 2150) PASS: lldb-shell :: Reproducer/TestSynchronous.test (787 of 2150) PASS: lldb-shell :: Unwind/trap_frame_sym_ctx.test (788 of 2150) UNSUPPORTED: lldb-shell :: Watchpoint/netbsd-nouserdbregs.test (789 of 2150) PASS: lldb-api :: commands/target/stop-hook/delete/TestTargetStopHookDelete.py (790 of 2150) PASS: lldb-api :: commands/expression/namespace_local_var_same_name_obj_c/TestNamespaceLocalVarSameNameObjC.py (791 of 2150) PASS: lldb-shell :: SymbolFile/DWARF/debug-types-dwo-cross-reference.cpp (792 of 2150) PASS: lldb-shell :: ObjectFile/ELF/section-types.yaml (793 of 2150) PASS: lldb-unit :: ScriptInterpreter/Python/./ScriptInterpreterPythonTests/PythonDataObjectsTest.TestPythonTupleSize (794 of 2150) PASS: lldb-unit :: Process/gdb-remote/./ProcessGdbRemoteTests/GDBRemoteCommunicationClientTest.GetMemoryRegionInfo (795 of 2150) PASS: lldb-api :: functionalities/deleted-executable/TestDeletedExecutable.py (796 of 2150) PASS: lldb-api :: functionalities/ubsan/basic/TestUbsanBasic.py (797 of 2150) UNSUPPORTED: lldb-api :: arm/breakpoint-it/TestBreakpointIt.py (798 of 2150) UNSUPPORTED: lldb-api :: commands/register/register/intel_xtended_registers/TestMPXRegisters.py (799 of 2150) PASS: lldb-unit :: Host/./HostTests/SocketTest.DecodeHostAndPort (800 of 2150) PASS: lldb-shell :: ObjectFile/ELF/section-permissions.yaml (801 of 2150) UNSUPPORTED: lldb-api :: functionalities/darwin_log/filter/regex/message/TestDarwinLogFilterRegexMessage.py (802 of 2150) PASS: lldb-api :: functionalities/thread/jump/TestThreadJump.py (803 of 2150) PASS: lldb-api :: functionalities/gdb_remote_client/TestIOSSimulator.py (804 of 2150) PASS: lldb-shell :: SymbolFile/DWARF/find-method-local-struct.cpp (805 of 2150) PASS: lldb-api :: tools/lldb-server/commandline/TestStubReverseConnect.py (806 of 2150) PASS: lldb-unit :: Utility/./UtilityTests/StringListTest.ShiftStdString (807 of 2150) PASS: lldb-shell :: ScriptInterpreter/Python/python.test (808 of 2150) PASS: lldb-shell :: SymbolFile/DWARF/DW_AT_const_value-bitfields.s (809 of 2150) PASS: lldb-unit :: Host/./HostTests/ProcessLaunchInfoTest.Constructor (810 of 2150) PASS: lldb-shell :: Driver/TestPositionalArgs.test (811 of 2150) UNSUPPORTED: lldb-api :: functionalities/data-formatter/data-formatter-stl/libstdcpp/vbool/TestDataFormatterStdVBool.py (812 of 2150) UNSUPPORTED: lldb-shell :: Register/x86-gp-read.test (813 of 2150) PASS: lldb-unit :: Host/./HostTests/MainLoopTest.Signal (814 of 2150) PASS: lldb-unit :: Utility/./UtilityTests/AnsiTerminal.Basic (815 of 2150) PASS: lldb-unit :: Utility/./UtilityTests/VMRange.Comparison (816 of 2150) PASS: lldb-api :: functionalities/data-formatter/data-formatter-objc/TestDataFormatterObjNSException.py (817 of 2150) PASS: lldb-unit :: Utility/./UtilityTests/StringListTest.LongestCommonPrefixEmpty (818 of 2150) PASS: lldb-unit :: Core/./LLDBCoreTests/ModuleSpecTest.TestELFFile (819 of 2150) PASS: lldb-unit :: Utility/./UtilityTests/UriParserTest.MinimalPortPath (820 of 2150) PASS: lldb-unit :: Process/minidump/./LLDBMinidumpTests/MinidumpParserTest.MinidumpDuplicateModuleMappedFirst (821 of 2150) PASS: lldb-shell :: SymbolFile/NativePDB/ast-methods.cpp (822 of 2150) PASS: lldb-unit :: Utility/./UtilityTests/StreamTest.PutSLEB128 (823 of 2150) PASS: lldb-unit :: Process/minidump/./LLDBMinidumpTests/RegisterContextMinidump.ConvertMinidumpContext_x86_64 (824 of 2150) PASS: lldb-unit :: Utility/./UtilityTests/RegularExpression.CopyAssignment (825 of 2150) PASS: lldb-unit :: Utility/./UtilityTests/DataExtractorTest.UncommonAddressSize (826 of 2150) PASS: lldb-api :: lang/cpp/chained-calls/TestCppChainedCalls.py (827 of 2150) PASS: lldb-unit :: Utility/./UtilityTests/ArchSpecTest.TestSetTriple (828 of 2150) PASS: lldb-unit :: Utility/./UtilityTests/ConstStringTest.CompareStringRef (829 of 2150) PASS: lldb-api :: lang/objc/variadic_methods/TestVariadicMethods.py (830 of 2150) UNSUPPORTED: lldb-api :: functionalities/darwin_log/filter/exact_match/subsystem/TestDarwinLogFilterMatchSubsystem.py (831 of 2150) PASS: lldb-api :: lang/cpp/dynamic-value/TestDynamicValue.py (832 of 2150) PASS: lldb-api :: functionalities/tsan/multiple/TestTsanMultiple.py (833 of 2150) PASS: lldb-unit :: Utility/./UtilityTests/StreamTest.PutBytesAsRawHex8ToLittleEndian (834 of 2150) PASS: lldb-unit :: Utility/./UtilityTests/UriParserTest.BadPort2 (835 of 2150) PASS: lldb-shell :: SymbolFile/DWARF/debug_loclists-dwo.s (836 of 2150) PASS: lldb-unit :: Utility/./UtilityTests/ScalarTest.GetValue (837 of 2150) PASS: lldb-unit :: Utility/./UtilityTests/ArgsTest.EscapeLLDBCommandArgument (838 of 2150) PASS: lldb-api :: lang/c/bitfields/TestBitfields.py (839 of 2150) PASS: lldb-api :: lang/objc/foundation/TestRuntimeTypes.py (840 of 2150) UNSUPPORTED: lldb-api :: benchmarks/frame_variable/TestFrameVariableResponse.py (841 of 2150) PASS: lldb-api :: commands/session/history/TestSessionHistory.py (842 of 2150) PASS: lldb-shell :: Driver/TestRepl.test (843 of 2150) PASS: lldb-api :: functionalities/breakpoint/breakpoint_locations/TestBreakpointLocations.py (844 of 2150) PASS: lldb-unit :: Utility/./UtilityTests/ArgsTest.TestOverwriteArgs (845 of 2150) PASS: lldb-unit :: Language/Highlighting/./HighlighterTests/HighlighterTest.DefaultHighlighterWithCursor (846 of 2150) PASS: lldb-unit :: ScriptInterpreter/Python/./ScriptInterpreterPythonTests/PythonDataObjectsTest.TestPythonBytes (847 of 2150) PASS: lldb-unit :: Utility/./UtilityTests/StringExtractorTest.GetHexU8_InvalidHex_NoEof (848 of 2150) PASS: lldb-unit :: Utility/./UtilityTests/StreamTest.QuotedCString (849 of 2150) PASS: lldb-shell :: ScriptInterpreter/Python/scripted_breakpoint.test (850 of 2150) UNSUPPORTED: lldb-shell :: Register/arm-gp-read.test (851 of 2150) UNSUPPORTED: lldb-api :: functionalities/darwin_log/source/debug/TestDarwinLogSourceDebug.py (852 of 2150) PASS: lldb-unit :: Expression/./ExpressionTests/ClangHostTest.MacOSX (853 of 2150) PASS: lldb-api :: lang/c/offsetof/TestOffsetof.py (854 of 2150) PASS: lldb-unit :: Language/Highlighting/./HighlighterTests/HighlighterTest.ClangCursorPos (855 of 2150) PASS: lldb-api :: lang/objc/radar-9691614/TestObjCMethodReturningBOOL.py (856 of 2150) PASS: lldb-unit :: Symbol/./SymbolTests/TestTypeSystemClang.TestBuiltinTypeForEncodingAndBitSize (857 of 2150) PASS: lldb-shell :: Reproducer/TestDebugSymbols.test (858 of 2150) PASS: lldb-api :: lang/objc/objc-ivar-offsets/TestObjCIvarOffsets.py (859 of 2150) PASS: lldb-api :: commands/frame/language/TestGuessLanguage.py (860 of 2150) PASS: lldb-unit :: Host/./HostTests/FileSystemTest.Readable (861 of 2150) PASS: lldb-shell :: SymbolFile/DWARF/DW_TAG_basic_type_DW_ATE_UTF_nonC.ll (862 of 2150) PASS: lldb-unit :: Thread/./ThreadTests/ThreadTest.SetStopInfo (863 of 2150) PASS: lldb-api :: lang/objc/conflicting-definition/TestConflictingDefinition.py (864 of 2150) PASS: lldb-unit :: Utility/./UtilityTests/RecordReplayTest.InstrumentedBar (865 of 2150) PASS: lldb-unit :: Symbol/./SymbolTests/TestTypeSystemClang.TestDeletingImplicitCopyCstrDueToMoveCStr (866 of 2150) PASS: lldb-unit :: Utility/./UtilityTests/ArchSpecTest.MergeFromMachOUnknown (867 of 2150) PASS: lldb-api :: functionalities/thread/concurrent_events/TestConcurrentSignalWatch.py (868 of 2150) PASS: lldb-api :: commands/expression/persist_objc_pointeetype/TestPersistObjCPointeeType.py (869 of 2150) PASS: lldb-api :: commands/watchpoints/watchpoint_events/TestWatchpointEvents.py (870 of 2150) PASS: lldb-api :: lang/c/global_variables/TestGlobalVariables.py (871 of 2150) PASS: lldb-unit :: Host/./HostTests/NativeProcessProtocolTest.ReadCStringFromMemory_MaxSize (872 of 2150) PASS: lldb-api :: commands/frame/diagnose/complicated-expression/TestComplicatedExpression.py (873 of 2150) PASS: lldb-shell :: ObjectFile/PECOFF/dep-modules.yaml (874 of 2150) PASS: lldb-unit :: Host/./HostTests/FileSystemTest.EmptyTest (875 of 2150) PASS: lldb-unit :: Utility/./UtilityTests/VMRange.ContainsRange (876 of 2150) PASS: lldb-api :: functionalities/breakpoint/breakpoint_ignore_count/TestBreakpointIgnoreCount.py (877 of 2150) PASS: lldb-unit :: Utility/./UtilityTests/VMRange.SetEndAddress (878 of 2150) PASS: lldb-api :: commands/expression/import-std-module/list/TestListFromStdModule.py (879 of 2150) PASS: lldb-api :: functionalities/show_location/TestShowLocationDwarf5.py (880 of 2150) PASS: lldb-api :: lang/objc/objc-static-method/TestObjCStaticMethod.py (881 of 2150) UNSUPPORTED: lldb-api :: tools/lldb-vscode/completions/TestVSCode_completions.py (882 of 2150) PASS: lldb-unit :: SymbolFile/NativePDB/./SymbolFileNativePDBTests/PDBFPOProgramToDWARFExpressionTests.SingleAssignmentRegisterRef (883 of 2150) PASS: lldb-api :: lang/cpp/enum_types/TestCPP11EnumTypes.py (884 of 2150) PASS: lldb-api :: functionalities/breakpoint/address_breakpoints/TestBadAddressBreakpoints.py (885 of 2150) PASS: lldb-unit :: Target/./TargetTests/ModuleCacheTest.GetAndPutStrangeHostname (886 of 2150) PASS: lldb-unit :: Utility/./UtilityTests/ScalarTest.Getters (887 of 2150) PASS: lldb-shell :: BuildScript/modes.test (888 of 2150) PASS: lldb-unit :: Utility/./UtilityTests/VMRange.CollectionContains (889 of 2150) PASS: lldb-shell :: Reproducer/TestVersionCheck.test (890 of 2150) PASS: lldb-shell :: SymbolFile/DWARF/dwarf5-index-is-used.cpp (891 of 2150) PASS: lldb-unit :: Expression/./ExpressionTests/CppModuleConfigurationTest.UnknownLibCppFile (892 of 2150) UNSUPPORTED: lldb-shell :: SymbolFile/NativePDB/typedefs.cpp (893 of 2150) PASS: lldb-unit :: Language/Highlighting/./HighlighterTests/HighlighterTest.HighlighterSelectionPath (894 of 2150) PASS: lldb-shell :: SymbolFile/DWARF/find-function-regex.cpp (895 of 2150) PASS: lldb-api :: lang/objc/foundation/TestObjCMethodsNSArray.py (896 of 2150) PASS: lldb-unit :: Utility/./UtilityTests/Flags.GetBitSize (897 of 2150) PASS: lldb-api :: functionalities/step_scripted/TestStepScripted.py (898 of 2150) PASS: lldb-unit :: Utility/./UtilityTests/StringListTest.InsertStringAtIndexEnd (899 of 2150) PASS: lldb-api :: functionalities/plugins/command_plugin/TestPluginCommands.py (900 of 2150) UNSUPPORTED: lldb-api :: functionalities/darwin_log/filter/regex/subsystem/TestDarwinLogFilterRegexSubsystem.py (901 of 2150) PASS: lldb-api :: commands/expression/dont_allow_jit/TestAllowJIT.py (902 of 2150) UNSUPPORTED: lldb-shell :: SymbolFile/DWARF/split-dwarf-expression-eval-bug.cpp (903 of 2150) PASS: lldb-unit :: UnwindAssembly/x86/./UnwindAssemblyx86Tests/Testx86AssemblyInspectionEngine.TestPushRBX (904 of 2150) PASS: lldb-unit :: debugserver/./debugserverTests/RNBSocket.AnyListen (905 of 2150) PASS: lldb-api :: tools/lldb-vscode/breakpoint/TestVSCode_setBreakpoints.py (906 of 2150) PASS: lldb-unit :: ScriptInterpreter/Python/./ScriptInterpreterPythonTests/PythonDataObjectsTest.TestPythonStringToStructuredString (907 of 2150) PASS: lldb-unit :: Utility/./UtilityTests/StreamTest.PutNHex8 (908 of 2150) PASS: lldb-unit :: Process/gdb-remote/./ProcessGdbRemoteTests/GDBRemoteCommunicationClientTest.SendSignalsToIgnore (909 of 2150) PASS: lldb-unit :: Utility/./UtilityTests/LogChannelEnabledTest.LogGetLogThread (910 of 2150) PASS: lldb-unit :: Expression/./ExpressionTests/CppModuleConfigurationTest.AmbiguousCLib (911 of 2150) PASS: lldb-unit :: Utility/./UtilityTests/StringExtractorTest.GetHexBytesAvail_FullString (912 of 2150) PASS: lldb-api :: functionalities/data-formatter/data-formatter-stl/libstdcpp/unique_ptr/invalid/TestDataFormatterInvalidStdUniquePtr.py (913 of 2150) PASS: lldb-unit :: Utility/./UtilityTests/ScalarTest.LongLongAssigmentOperator (914 of 2150) PASS: lldb-api :: functionalities/tail_call_frames/disambiguate_tail_call_seq/TestDisambiguateTailCallSeq.py (915 of 2150) PASS: lldb-unit :: Utility/./UtilityTests/StringListTest.Assignment (916 of 2150) PASS: lldb-unit :: Core/./LLDBCoreTests/SourceFileCache.FindSourceFileNotFound (917 of 2150) UNSUPPORTED: lldb-api :: linux/add-symbols/TestTargetSymbolsAddCommand.py (918 of 2150) PASS: lldb-unit :: UnwindAssembly/x86/./UnwindAssemblyx86Tests/Testx86AssemblyInspectionEngine.TestPopRBX (919 of 2150) PASS: lldb-unit :: Symbol/./SymbolTests/Type.GetTypeScopeAndBasename (920 of 2150) PASS: lldb-unit :: Symbol/./SymbolTests/TestTypeSystemClang.TestIsClangType (921 of 2150) PASS: lldb-api :: commands/disassemble/basic/TestDisassembleBreakpoint.py (922 of 2150) PASS: lldb-unit :: Host/./HostTests/NativeProcessProtocolTest.ReadCStringFromMemory (923 of 2150) PASS: lldb-api :: functionalities/ubsan/user-expression/TestUbsanUserExpression.py (924 of 2150) PASS: lldb-api :: commands/command/delete/TestCommandDelete.py (925 of 2150) PASS: lldb-unit :: debugserver/./debugserverTests/RNBSocket.LoopBackListenIPv6 (926 of 2150) PASS: lldb-unit :: Utility/./UtilityTests/OptionsWithRawTest.SingleWordSuffix (927 of 2150) PASS: lldb-unit :: Instruction/./EmulatorTests/TestAArch64Emulator.TestOverflow (928 of 2150) PASS: lldb-unit :: UnwindAssembly/x86/./UnwindAssemblyx86Tests/Testx86AssemblyInspectionEngine.TestPopESI (929 of 2150) PASS: lldb-unit :: ScriptInterpreter/Python/./ScriptInterpreterPythonTests/PythonDataObjectsTest.TestPythonTupleInitializerList2 (930 of 2150) PASS: lldb-unit :: Utility/./UtilityTests/OptionsWithRawTest.WhitespaceInput (931 of 2150) PASS: lldb-unit :: Utility/./UtilityTests/BinaryStreamTest.PutSLEB128FiveBytes (932 of 2150) PASS: lldb-unit :: Utility/./UtilityTests/FileSpecTest.CopyByAppendingPathComponent (933 of 2150) PASS: lldb-unit :: Utility/./UtilityTests/FileSpecTest.FormatFileSpec (934 of 2150) PASS: lldb-shell :: SymbolFile/DWARF/find-inline-method.s (935 of 2150) UNSUPPORTED: lldb-api :: commands/watchpoints/multi_watchpoint_slots/TestWatchpointMultipleSlots.py (936 of 2150) PASS: lldb-api :: driver/batch_mode/TestBatchMode.py (937 of 2150) PASS: lldb-api :: commands/command/script/import/TestImport.py (938 of 2150) PASS: lldb-unit :: Utility/./UtilityTests/TimerTest.CategoryTimesStats (939 of 2150) PASS: lldb-unit :: Process/./ProcessEventDataTests/ProcessEventDataTest.DoOnRemoval (940 of 2150) PASS: lldb-api :: api/multiple-targets/TestMultipleTargets.py (941 of 2150) PASS: lldb-api :: functionalities/exec/TestExec.py (942 of 2150) PASS: lldb-api :: functionalities/fat_archives/TestFatArchives.py (943 of 2150) PASS: lldb-api :: functionalities/thread/thread_specific_break/TestThreadSpecificBreakpoint.py (944 of 2150) PASS: lldb-unit :: Utility/./UtilityTests/StringListTest.ForRange (945 of 2150) PASS: lldb-unit :: Utility/./UtilityTests/StringExtractorTest.GetU32BigEndian (946 of 2150) PASS: lldb-api :: functionalities/thread/concurrent_events/TestConcurrentTwoWatchpointsOneDelayBreakpoint.py (947 of 2150) PASS: lldb-unit :: ObjectFile/Breakpad/./ObjectFileBreakpadTests/PublicRecord.parse (948 of 2150) PASS: lldb-api :: lang/c/step_over_no_deadlock/TestStepOverDoesntBlock.py (949 of 2150) PASS: lldb-api :: functionalities/gdb_remote_client/TestQemuAArch64TargetXml.py (950 of 2150) PASS: lldb-unit :: Utility/./UtilityTests/StreamTest.AddressRangeInvalidRange (951 of 2150) PASS: lldb-unit :: Process/gdb-remote/./ProcessGdbRemoteTests/GDBRemoteCommunicationServerTest.SendErrorResponse_UnimplementedError (952 of 2150) PASS: lldb-unit :: Language/Highlighting/./HighlighterTests/HighlighterTest.ClangTrailingBackslashWithWhitespace (953 of 2150) PASS: lldb-unit :: UnwindAssembly/x86/./UnwindAssemblyx86Tests/Testx86AssemblyInspectionEngine.TestPushR14 (954 of 2150) PASS: lldb-unit :: Signals/./SignalsTests/UnixSignalsTest.GetFilteredSignals (955 of 2150) PASS: lldb-api :: commands/expression/argument_passing_restrictions/TestArgumentPassingRestrictions.py (956 of 2150) PASS: lldb-api :: functionalities/data-formatter/ptr_ref_typedef/TestPtrRef2Typedef.py (957 of 2150) PASS: lldb-unit :: Process/minidump/./LLDBMinidumpTests/MinidumpParserTest.FindMemoryRange (958 of 2150) PASS: lldb-api :: functionalities/data-formatter/data-formatter-objc/TestDataFormatterObjCNSContainer.py (959 of 2150) XFAIL: lldb-shell :: Register/x86-64-ymm-write.test (960 of 2150) PASS: lldb-unit :: Utility/./UtilityTests/BinaryStreamTest.PutULEB128ThreeBytes (961 of 2150) PASS: lldb-unit :: Utility/./UtilityTests/ArchSpecTest.MergeFrom (962 of 2150) PASS: lldb-unit :: Utility/./UtilityTests/StringLexerTest.GetUnlexed (963 of 2150) PASS: lldb-api :: commands/expression/namespace_local_var_same_name_cpp_and_c/TestNamespaceLocalVarSameNameCppAndC.py (964 of 2150) UNSUPPORTED: lldb-shell :: SymbolFile/PDB/enums-layout.test (965 of 2150) UNSUPPORTED: lldb-api :: functionalities/thread/state/TestThreadStates.py (966 of 2150) PASS: lldb-shell :: SymbolFile/DWARF/dwarf5-debug_line.s (967 of 2150) PASS: lldb-api :: lang/objc/foundation/TestObjCMethodsNSError.py (968 of 2150) PASS: lldb-api :: lang/objc/objc-dyn-sbtype/TestObjCDynamicSBType.py (969 of 2150) PASS: lldb-api :: functionalities/step-avoids-no-debug/TestStepNoDebug.py (970 of 2150) PASS: lldb-api :: commands/watchpoints/multiple_threads/TestWatchpointMultipleThreads.py (971 of 2150) PASS: lldb-unit :: Utility/./UtilityTests/Flags.IsClear (972 of 2150) PASS: lldb-api :: functionalities/plugins/python_os_plugin/TestPythonOSPlugin.py (973 of 2150) UNSUPPORTED: lldb-shell :: SymbolFile/target-symbols-add-unwind.test (974 of 2150) PASS: lldb-unit :: Utility/./UtilityTests/StringListTest.LongestCommonPrefixNoPrefix (975 of 2150) PASS: lldb-unit :: Utility/./UtilityTests/ArchSpecTest.TripleComponentsWereSpecified (976 of 2150) PASS: lldb-unit :: Utility/./UtilityTests/RangeTest.Constructor (977 of 2150) PASS: lldb-api :: commands/expression/persistent_types/TestNestedPersistentTypes.py (978 of 2150) PASS: lldb-unit :: UnwindAssembly/x86/./UnwindAssemblyx86Tests/Testx86AssemblyInspectionEngine.TestPopR15 (979 of 2150) PASS: lldb-unit :: Process/./ProcessEventDataTests/ProcessEventDataTest.ShouldStop (980 of 2150) PASS: lldb-api :: commands/expression/two-files/TestObjCTypeQueryFromOtherCompileUnit.py (981 of 2150) UNSUPPORTED: lldb-shell :: SymbolFile/NativePDB/ast-functions-msvc.cpp (982 of 2150) PASS: lldb-shell :: Driver/TestProcessAttach.test (983 of 2150) PASS: lldb-unit :: ScriptInterpreter/Python/./ScriptInterpreterPythonTests/PythonDataObjectsTest.TestResetting (984 of 2150) PASS: lldb-shell :: Minidump/memory-region-from-module.yaml (985 of 2150) PASS: lldb-unit :: Utility/./UtilityTests/UUIDTest.SetFromStringRef (986 of 2150) PASS: lldb-api :: terminal/TestEditline.py (987 of 2150) PASS: lldb-api :: commands/frame/diagnose/virtual-method-call/TestDiagnoseDereferenceVirtualMethodCall.py (988 of 2150) PASS: lldb-unit :: Language/Highlighting/./HighlighterTests/HighlighterTest.ClangComments (989 of 2150) PASS: lldb-api :: macosx/version_zero/TestGetVersionZeroVersion.py (990 of 2150) PASS: lldb-api :: functionalities/data-formatter/data-formatter-objc/TestDataFormatterObjCPlain.py (991 of 2150) PASS: lldb-unit :: Language/CPlusPlus/./LanguageCPlusPlusTests/CPlusPlusLanguage.MethodNameParsing (992 of 2150) PASS: lldb-api :: lang/objc/self/TestObjCSelf.py (993 of 2150) PASS: lldb-unit :: Utility/./UtilityTests/Flags.AnyClear (994 of 2150) PASS: lldb-unit :: ObjectFile/Breakpad/./ObjectFileBreakpadTests/StackCFIRecord.parse (995 of 2150) PASS: lldb-api :: functionalities/breakpoint/hardware_breakpoints/require_hw_breakpoints/TestRequireHWBreakpoints.py (996 of 2150) PASS: lldb-unit :: Utility/./UtilityTests/StreamTeeTest.GetStreamAtIndexOutOfBoundsEmpty (997 of 2150) PASS: lldb-shell :: SymbolFile/NativePDB/nested-types.cpp (998 of 2150) PASS: lldb-api :: commands/settings/use_source_cache/TestUseSourceCache.py (999 of 2150) PASS: lldb-unit :: Process/gdb-remote/./ProcessGdbRemoteTests/GDBRemoteClientBaseTest.InterruptNoResponse (1000 of 2150) PASS: lldb-api :: commands/expression/import_base_class_when_class_has_derived_member/TestImportBaseClassWhenClassHasDerivedMember.py (1001 of 2150) PASS: lldb-shell :: SymbolFile/DWARF/module-ownership.mm (1002 of 2150) PASS: lldb-unit :: UnwindAssembly/x86/./UnwindAssemblyx86Tests/Testx86AssemblyInspectionEngine.TestStackRealign8BitDisp_i386 (1003 of 2150) PASS: lldb-shell :: SymbolFile/dissassemble-entry-point.s (1004 of 2150) PASS: lldb-unit :: Utility/./UtilityTests/DataExtractorTest.GetFloatUnaligned (1005 of 2150) PASS: lldb-unit :: UnwindAssembly/x86/./UnwindAssemblyx86Tests/Testx86AssemblyInspectionEngine.TestPushEAX (1006 of 2150) PASS: lldb-unit :: Utility/./UtilityTests/VMRange.ContainsAddr (1007 of 2150) PASS: lldb-shell :: SymbolFile/DWARF/debug-types-dwarf5.s (1008 of 2150) PASS: lldb-shell :: Recognizer/assert.test (1009 of 2150) PASS: lldb-unit :: Symbol/./SymbolTests/TestTypeSystemClang.TestGetBasicTypeFromName (1010 of 2150) PASS: lldb-api :: commands/watchpoints/watchpoint_disable/TestWatchpointDisable.py (1011 of 2150) PASS: lldb-api :: functionalities/tsan/thread_numbers/TestTsanThreadNumbers.py (1012 of 2150) PASS: lldb-api :: lang/c/tls_globals/TestTlsGlobals.py (1013 of 2150) UNSUPPORTED: lldb-api :: benchmarks/continue/TestBenchmarkContinue.py (1014 of 2150) PASS: lldb-api :: commands/disassemble/basic/TestFrameDisassemble.py (1015 of 2150) PASS: lldb-api :: functionalities/breakpoint/breakpoint_callback_command_source/TestBreakpointCallbackCommandSource.py (1016 of 2150) PASS: lldb-unit :: Utility/./UtilityTests/StringListTest.Clear (1017 of 2150) PASS: lldb-api :: python_api/process/io/TestProcessIO.py (1018 of 2150) PASS: lldb-api :: types/TestLongTypes.py (1019 of 2150) PASS: lldb-api :: functionalities/data-formatter/data-formatter-skip-summary/TestDataFormatterSkipSummary.py (1020 of 2150) PASS: lldb-unit :: Utility/./UtilityTests/UriParserTest.BracketedHostnameWithPortIPv6 (1021 of 2150) PASS: lldb-api :: commands/expression/import-std-module/conflicts/TestStdModuleWithConflicts.py (1022 of 2150) PASS: lldb-api :: functionalities/data-formatter/compactvectors/TestCompactVectors.py (1023 of 2150) PASS: lldb-api :: commands/expression/vector_of_enums/TestVectorOfEnums.py (1024 of 2150) PASS: lldb-unit :: Utility/./UtilityTests/ArchSpecTest.OperatorBool (1025 of 2150) UNSUPPORTED: lldb-api :: functionalities/data-formatter/data-formatter-stl/libstdcpp/tuple/TestDataFormatterStdTuple.py (1026 of 2150) PASS: lldb-api :: terminal/TestSTTYBeforeAndAfter.py (1027 of 2150) PASS: lldb-api :: commands/gui/invalid-args/TestInvalidArgsGui.py (1028 of 2150) PASS: lldb-api :: functionalities/thread/concurrent_events/TestConcurrentManyWatchpoints.py (1029 of 2150) PASS: lldb-api :: functionalities/breakpoint/breakpoint_names/TestBreakpointNames.py (1030 of 2150) PASS: lldb-shell :: Commands/command-breakpoint-col.test (1031 of 2150) PASS: lldb-api :: lang/c/const_variables/TestConstVariables.py (1032 of 2150) PASS: lldb-api :: commands/expression/char/TestExprsChar.py (1033 of 2150) PASS: lldb-api :: python_api/process/TestProcessAPI.py (1034 of 2150) PASS: lldb-shell :: Settings/TestEchoCommands.test (1035 of 2150) PASS: lldb-unit :: Utility/./UtilityTests/UriParserTest.BracketedHostnamePort (1036 of 2150) PASS: lldb-api :: functionalities/thread/concurrent_events/TestConcurrentWatchpointWithDelayWatchpointThreads.py (1037 of 2150) PASS: lldb-unit :: Utility/./UtilityTests/StringExtractorTest.GetNameColonValueSuccess (1038 of 2150) UNSUPPORTED: lldb-shell :: ScriptInterpreter/Lua/nested_sessions.test (1039 of 2150) PASS: lldb-unit :: Utility/./UtilityTests/StateTest.Formatv (1040 of 2150) PASS: lldb-api :: tools/lldb-vscode/breakpoint/TestVSCode_setExceptionBreakpoints.py (1041 of 2150) PASS: lldb-unit :: Utility/./UtilityTests/RangeTest.Union (1042 of 2150) PASS: lldb-api :: commands/settings/TestSettings.py (1043 of 2150) PASS: lldb-unit :: Utility/./UtilityTests/StringListTest.GetMaxStringLengthIncreasingSize (1044 of 2150) PASS: lldb-shell :: Breakpoint/debug_rnglist_offset_pair.test (1045 of 2150) PASS: lldb-shell :: Quit/TestQuitExitCode0.test (1046 of 2150) PASS: lldb-shell :: SymbolFile/DWARF/limit-debug-info.s (1047 of 2150) PASS: lldb-api :: functionalities/target-new-solib-notifications/TestModuleLoadedNotifys.py (1048 of 2150) PASS: lldb-unit :: Utility/./UtilityTests/LogTest.LLDB_LOG_nullptr (1049 of 2150) PASS: lldb-api :: functionalities/gdb_remote_client/TestNoWatchpointSupportInfo.py (1050 of 2150) UNSUPPORTED: lldb-shell :: BuildScript/toolchain-clang-cl.test (1051 of 2150) PASS: lldb-unit :: Process/minidump/./LLDBMinidumpTests/MinidumpParserTest.GetMemoryRegionInfoLinuxMaps (1052 of 2150) PASS: lldb-unit :: Language/CLanguages/./LanguageCLanguagesTests/CLanguages.LookupCLanguagesByLanguageType (1053 of 2150) PASS: lldb-api :: commands/watchpoints/watchpoint_count/TestWatchpointCount.py (1054 of 2150) PASS: lldb-unit :: Utility/./UtilityTests/ArgsTest.StringListConstructor (1055 of 2150) PASS: lldb-shell :: Commands/command-thread-select.test (1056 of 2150) PASS: lldb-unit :: Utility/./UtilityTests/StringExtractorTest.GetHexU8_Underflow (1057 of 2150) PASS: lldb-shell :: SymbolFile/DWARF/debug-types-signature-loop.s (1058 of 2150) PASS: lldb-api :: functionalities/pointer_num_children/TestPointerNumChildren.py (1059 of 2150) PASS: lldb-unit :: Utility/./UtilityTests/LogTest.Register (1060 of 2150) PASS: lldb-unit :: UnwindAssembly/x86/./UnwindAssemblyx86Tests/Testx86AssemblyInspectionEngine.TestPopR13 (1061 of 2150) PASS: lldb-shell :: Reproducer/TestMultipleTargets.test (1062 of 2150) PASS: lldb-unit :: UnwindAssembly/x86/./UnwindAssemblyx86Tests/Testx86AssemblyInspectionEngine.TestPopR12 (1063 of 2150) XFAIL: lldb-shell :: Register/x86-mm-xmm-read.test (1064 of 2150) PASS: lldb-unit :: Utility/./UtilityTests/StringExtractorTest.InitMisc (1065 of 2150) UNSUPPORTED: lldb-api :: lang/cpp/static_members/TestCPPStaticMembers.py (1066 of 2150) PASS: lldb-api :: tools/lldb-server/TestGdbRemoteThreadsInStopReply.py (1067 of 2150) PASS: lldb-api :: python_api/watchpoint/TestWatchpointIgnoreCount.py (1068 of 2150) PASS: lldb-unit :: SymbolFile/DWARF/./SymbolFileDWARFTests/SymbolFileDWARFTests.TestAbilitiesForDWARF (1069 of 2150) UNSUPPORTED: lldb-shell :: Unwind/unwind-plan-dwarf-dump.test (1070 of 2150) PASS: lldb-api :: lang/cpp/covariant-return-types/TestCovariantReturnTypes.py (1071 of 2150) UNSUPPORTED: lldb-api :: tools/lldb-server/libraries-svr4/TestGdbRemoteLibrariesSvr4Support.py (1072 of 2150) PASS: lldb-api :: tools/lldb-vscode/step/TestVSCode_step.py (1073 of 2150) UNSUPPORTED: lldb-api :: functionalities/thread/break_after_join/TestBreakAfterJoin.py (1074 of 2150) PASS: lldb-unit :: Symbol/./SymbolTests/TestTypeSystemClang.TestGetEnumIntegerTypeBasicTypes (1075 of 2150) PASS: lldb-unit :: Utility/./UtilityTests/BinaryStreamTest.PutSLEB128OneByte (1076 of 2150) PASS: lldb-unit :: Process/minidump/./LLDBMinidumpTests/MinidumpParserTest.InvalidMinidump (1077 of 2150) PASS: lldb-api :: commands/watchpoints/hello_watchpoint/TestMyFirstWatchpoint.py (1078 of 2150) PASS: lldb-api :: macosx/queues/TestQueues.py (1079 of 2150) PASS: lldb-unit :: Symbol/./SymbolTests/TestClangASTImporter.RecordLayout (1080 of 2150) PASS: lldb-shell :: ObjectFile/ELF/PT_LOAD-overlap-PT_TLS.yaml (1081 of 2150) PASS: lldb-unit :: Utility/./UtilityTests/FileSpecTest.RemoveLastPathComponent (1082 of 2150) PASS: lldb-shell :: BuildScript/toolchain-clang.test (1083 of 2150) PASS: lldb-unit :: Host/./HostTests/SocketTest.TCPListen0ConnectAccept (1084 of 2150) PASS: lldb-api :: python_api/value/empty_class/TestValueAPIEmptyClass.py (1085 of 2150) PASS: lldb-api :: lang/cpp/nested-class-other-compilation-unit/TestNestedClassWithParentInAnotherCU.py (1086 of 2150) PASS: lldb-unit :: ScriptInterpreter/Python/./ScriptInterpreterPythonTests/PythonDataObjectsTest.TestPythonTupleValues (1087 of 2150) PASS: lldb-unit :: Symbol/./SymbolTests/TestTypeSystemClang.TestUnifyAccessSpecifiers (1088 of 2150) PASS: lldb-api :: functionalities/tail_call_frames/ambiguous_tail_call_seq2/TestAmbiguousTailCallSeq2.py (1089 of 2150) PASS: lldb-unit :: Utility/./UtilityTests/BinaryStreamTest.PutULEB128OneByte (1090 of 2150) PASS: lldb-shell :: ObjectFile/wasm/unified-debug-sections.yaml (1091 of 2150) PASS: lldb-api :: commands/session/save/TestSessionSave.py (1092 of 2150) PASS: lldb-api :: lang/cpp/static_methods/TestCPPStaticMethods.py (1093 of 2150) PASS: lldb-unit :: Target/./TargetTests/ModuleCacheTest.GetAndPut (1094 of 2150) PASS: lldb-api :: python_api/frame/TestFrames.py (1095 of 2150) PASS: lldb-api :: lang/c/local_variables/TestLocalVariables.py (1096 of 2150) PASS: lldb-unit :: Language/Highlighting/./HighlighterTests/HighlighterTest.ClangScalarLiterals (1097 of 2150) PASS: lldb-api :: functionalities/breakpoint/breakpoint_command/TestBreakpointCommandsFromPython.py (1098 of 2150) PASS: lldb-api :: tools/lldb-vscode/runInTerminal/TestVSCode_runInTerminal.py (1099 of 2150) PASS: lldb-api :: lang/objcxx/objcxx-ivar-vector/TestIvarVector.py (1100 of 2150) UNSUPPORTED: lldb-shell :: ScriptInterpreter/Lua/command_script_import.test (1101 of 2150) PASS: lldb-unit :: Process/gdb-remote/./ProcessGdbRemoteTests/GDBRemoteClientBaseTest.SendContinueAndAsyncSignal (1102 of 2150) PASS: lldb-unit :: Utility/./UtilityTests/StringExtractorTest.GetHexBytes (1103 of 2150) PASS: lldb-api :: commands/expression/call-function/TestCallStopAndContinue.py (1104 of 2150) PASS: lldb-unit :: Utility/./UtilityTests/NameMatchesTest.EndsWith (1105 of 2150) PASS: lldb-unit :: Utility/./UtilityTests/ArgsTest.ReplaceArgumentAtIndexLonger (1106 of 2150) UNSUPPORTED: lldb-shell :: ScriptInterpreter/Lua/io.test (1107 of 2150) PASS: lldb-shell :: Commands/command-disassemble.s (1108 of 2150) PASS: lldb-api :: tools/lldb-vscode/breakpoint-events/TestVSCode_breakpointEvents.py (1109 of 2150) PASS: lldb-unit :: Utility/./UtilityTests/StringExtractorTest.GetU32LittleEndian (1110 of 2150) PASS: lldb-api :: python_api/sbtype_typeclass/TestSBTypeTypeClass.py (1111 of 2150) PASS: lldb-unit :: Utility/./UtilityTests/DataExtractorTest.GetULEB128_bit63 (1112 of 2150) PASS: lldb-api :: commands/expression/rdar42038760/TestScalarURem.py (1113 of 2150) PASS: lldb-api :: python_api/watchpoint/watchlocation/TestTargetWatchAddress.py (1114 of 2150) PASS: lldb-unit :: Utility/./UtilityTests/RegularExpression.Empty (1115 of 2150) PASS: lldb-shell :: SymbolFile/DWARF/split-dwarf-multiple-cu.ll (1116 of 2150) PASS: lldb-shell :: Minidump/breakpad-symbols.test (1117 of 2150) PASS: lldb-api :: functionalities/thread/backtrace_all/TestBacktraceAll.py (1118 of 2150) PASS: lldb-api :: lang/objc/exceptions/TestObjCExceptions.py (1119 of 2150) PASS: lldb-unit :: DataFormatter/./LLDBFormatterTests/StringPrinterTests.CxxUTF8 (1120 of 2150) PASS: lldb-unit :: Utility/./UtilityTests/StringExtractorTest.GetHexU8_InvalidHex (1121 of 2150) PASS: lldb-unit :: Utility/./UtilityTests/DataExtractorTest.GetBitfield (1122 of 2150) PASS: lldb-shell :: SymbolFile/DWARF/debug_loc-aslr.s (1123 of 2150) PASS: lldb-unit :: UnwindAssembly/x86/./UnwindAssemblyx86Tests/Testx86AssemblyInspectionEngine.TestDisassemblyMidFunctionEpilogues (1124 of 2150) PASS: lldb-api :: functionalities/paths/TestPaths.py (1125 of 2150) PASS: lldb-api :: functionalities/testid/TestTestId.py (1126 of 2150) PASS: lldb-unit :: Utility/./UtilityTests/RangeTest.ContainsEndInclusive (1127 of 2150) PASS: lldb-unit :: ScriptInterpreter/Python/./ScriptInterpreterPythonTests/PythonDataObjectsTest.TestPythonByteArray (1128 of 2150) PASS: lldb-unit :: Utility/./UtilityTests/StreamTest.PutCharNull (1129 of 2150) PASS: lldb-api :: commands/target/stop-hooks/TestStopHooks.py (1130 of 2150) PASS: lldb-api :: lang/cpp/llvm-style/TestLLVMStyle.py (1131 of 2150) PASS: lldb-unit :: Utility/./UtilityTests/StreamTest.PutRawBytesToBigEndian (1132 of 2150) PASS: lldb-unit :: tools/lldb-server/tests/./LLDBServerTests/TestBase.LaunchModePreservesEnvironment (1133 of 2150) PASS: lldb-shell :: Settings/TestSettingsSet.test (1134 of 2150) PASS: lldb-unit :: DataFormatter/./LLDBFormatterTests/TypeMatcherTests.CreatedBySameMatchString (1135 of 2150) PASS: lldb-unit :: Utility/./UtilityTests/RangeDataVector.FindEntryIndexesThatContain_Overlap (1136 of 2150) PASS: lldb-unit :: Expression/./ExpressionTests/CppModuleConfigurationTest.Xcode (1137 of 2150) PASS: lldb-api :: commands/frame/diagnose/dereference-function-return/TestDiagnoseDereferenceFunctionReturn.py (1138 of 2150) PASS: lldb-shell :: SymbolFile/DWARF/DW_AT_const_value.s (1139 of 2150) PASS: lldb-api :: functionalities/breakpoint/global_constructor/TestBreakpointInGlobalConstructor.py (1140 of 2150) PASS: lldb-api :: functionalities/data-formatter/refpointer-recursion/TestDataFormatterRefPtrRecursion.py (1141 of 2150) PASS: lldb-api :: functionalities/process_crash_info/TestProcessCrashInfo.py (1142 of 2150) PASS: lldb-unit :: Utility/./UtilityTests/ConstStringTest.FromMidOfBufferStringRef (1143 of 2150) PASS: lldb-unit :: UnwindAssembly/PPC64/./PPC64InstEmulationTests/TestPPC64InstEmulation.TestMediumFunction (1144 of 2150) PASS: lldb-shell :: SymbolFile/DWARF/debug_loc.s (1145 of 2150) PASS: lldb-api :: commands/expression/no-deadlock/TestExprDoesntBlock.py (1146 of 2150) PASS: lldb-unit :: Utility/./UtilityTests/StreamTest.PutULEB128 (1147 of 2150) PASS: lldb-unit :: Utility/./UtilityTests/ArgsTest.TestUnknownEscape (1148 of 2150) PASS: lldb-api :: commands/watchpoints/watchpoint_commands/command/TestWatchpointCommandPython.py (1149 of 2150) PASS: lldb-api :: functionalities/data-formatter/data-formatter-objc/nsindexpath/TestDataFormatterNSIndexPath.py (1150 of 2150) UNSUPPORTED: lldb-api :: functionalities/breakpoint/hardware_breakpoints/hardware_breakpoint_on_multiple_threads/TestHWBreakMultiThread.py (1151 of 2150) UNSUPPORTED: lldb-shell :: ScriptInterpreter/Lua/breakpoint_callback.test (1152 of 2150) PASS: lldb-api :: lang/cpp/typedef/TestCppTypedef.py (1153 of 2150) PASS: lldb-api :: commands/help/TestHelp.py (1154 of 2150) PASS: lldb-api :: lang/objc/modules-cache/TestClangModulesCache.py (1155 of 2150) PASS: lldb-api :: functionalities/completion/TestCompletion.py (1156 of 2150) PASS: lldb-unit :: Utility/./UtilityTests/PassiveReplayTest.InstrumentedFooInvalid (1157 of 2150) PASS: lldb-unit :: Process/minidump/./LLDBMinidumpTests/MinidumpParserTest.GetMiscInfoWindows (1158 of 2150) PASS: lldb-unit :: Utility/./UtilityTests/TimerTest.CategoryTimes (1159 of 2150) PASS: lldb-unit :: Utility/./UtilityTests/StringListTest.AppendStringMove (1160 of 2150) PASS: lldb-shell :: SymbolFile/NativePDB/ast-types.cpp (1161 of 2150) PASS: lldb-shell :: SymbolFile/Breakpad/symtab.test (1162 of 2150) PASS: lldb-api :: commands/frame/diagnose/dereference-argument/TestDiagnoseDereferenceArgument.py (1163 of 2150) PASS: lldb-unit :: Utility/./UtilityTests/RecordReplayTest.InstrumentedFoo (1164 of 2150) PASS: lldb-api :: functionalities/data-formatter/data-formatter-objc/TestDataFormatterObjCExpr.py (1165 of 2150) PASS: lldb-unit :: Expression/./ExpressionTests/DiagnosticManagerTest.AppendMessageAttachToLastDiag (1166 of 2150) PASS: lldb-unit :: Utility/./UtilityTests/StringExtractorTest.GetHexBytesAvail_Underflow (1167 of 2150) PASS: lldb-unit :: Utility/./UtilityTests/RangeTest.LessThan (1168 of 2150) PASS: lldb-unit :: Process/minidump/./LLDBMinidumpTests/MinidumpParserTest.GetPidWow64 (1169 of 2150) PASS: lldb-unit :: Host/./HostTests/MainLoopTest.UnmonitoredSignal (1170 of 2150) PASS: lldb-unit :: Utility/./UtilityTests/StreamTest.PutStringAsRawHex8 (1171 of 2150) PASS: lldb-api :: functionalities/thread/exit_during_break/TestExitDuringBreak.py (1172 of 2150) PASS: lldb-api :: python_api/lldbutil/iter/TestRegistersIterator.py (1173 of 2150) PASS: lldb-unit :: Utility/./UtilityTests/DataExtractorTest.GetDouble (1174 of 2150) PASS: lldb-unit :: Utility/./UtilityTests/RangeTest.ContainsRange (1175 of 2150) PASS: lldb-api :: functionalities/data-formatter/data-formatter-objc/TestDataFormatterObjCNSData.py (1176 of 2150) PASS: lldb-unit :: Symbol/./SymbolTests/TestTypeSystemClang.TestDisplayNameEmpty (1177 of 2150) PASS: lldb-api :: commands/command/source/TestCommandSource.py (1178 of 2150) PASS: lldb-api :: lang/c/register_variables/TestRegisterVariables.py (1179 of 2150) PASS: lldb-unit :: Symbol/./SymbolTests/LineEntryTest.GetSameLineContiguousAddressRangeOneInline (1180 of 2150) PASS: lldb-shell :: Breakpoint/debug_rnglistx_rlex.test (1181 of 2150) PASS: lldb-unit :: ObjectFile/Breakpad/./ObjectFileBreakpadTests/StackWinRecord.parse (1182 of 2150) PASS: lldb-unit :: Target/./TargetTests/PathMappingListTest.RemapRoot (1183 of 2150) PASS: lldb-api :: commands/process/attach/TestProcessAttach.py (1184 of 2150) PASS: lldb-api :: lang/cpp/limit-debug-info/TestWithLimitDebugInfo.py (1185 of 2150) UNSUPPORTED: lldb-api :: benchmarks/expression/TestRepeatedExprs.py (1186 of 2150) UNSUPPORTED: lldb-api :: commands/register/register/aarch64_sve_registers/rw_access_static_config/TestSVERegisters.py (1187 of 2150) PASS: lldb-unit :: DataFormatter/./LLDBFormatterTests/TypeMatcherTests.GetMatchStringExactName (1188 of 2150) PASS: lldb-api :: commands/expression/timeout/TestCallWithTimeout.py (1189 of 2150) PASS: lldb-unit :: debugserver/./debugserverTests/RNBSocket.LoopBackConnectIPv4 (1190 of 2150) PASS: lldb-unit :: Utility/./UtilityTests/SubsystemRAIITest.NormalSubsystem (1191 of 2150) PASS: lldb-unit :: Utility/./UtilityTests/UriParserTest.BracketedHostnameWithColon (1192 of 2150) PASS: lldb-unit :: Utility/./UtilityTests/StringListTest.LongestCommonPrefixSingleElement (1193 of 2150) PASS: lldb-unit :: Core/./LLDBCoreTests/MangledTest.NameIndexes_FindFunctionSymbols (1194 of 2150) PASS: lldb-shell :: Reproducer/TestWorkingDir.test (1195 of 2150) PASS: lldb-api :: lang/cpp/breakpoint-commands/TestCPPBreakpointCommands.py (1196 of 2150) PASS: lldb-unit :: ScriptInterpreter/Python/./ScriptInterpreterPythonTests/PythonDataObjectsTest.TestPythonDictionaryValueEquality (1197 of 2150) UNSUPPORTED: lldb-api :: tools/lldb-vscode/disconnect/TestVSCode_disconnect.py (1198 of 2150) PASS: lldb-api :: functionalities/tail_call_frames/thread_step_out_message/TestArtificialFrameStepOutMessage.py (1199 of 2150) PASS: lldb-api :: functionalities/thread/concurrent_events/TestConcurrentDelayWatchBreak.py (1200 of 2150) PASS: lldb-api :: functionalities/data-formatter/synthcapping/TestSyntheticCapping.py (1201 of 2150) PASS: lldb-unit :: Symbol/./SymbolTests/TestTypeSystemClang.TestGetTypeClassTypeOfExpr (1202 of 2150) PASS: lldb-unit :: UnwindAssembly/x86/./UnwindAssemblyx86Tests/Testx86AssemblyInspectionEngine.TestSimple32bitFrameFunction (1203 of 2150) PASS: lldb-unit :: Utility/./UtilityTests/OptionsWithRawTest.ArgsButNoLeadingDash (1204 of 2150) PASS: lldb-api :: lang/cpp/class_types/TestClassTypes.py (1205 of 2150) PASS: lldb-api :: functionalities/tsan/cpp_global_location/TestTsanCPPGlobalLocation.py (1206 of 2150) XFAIL: lldb-shell :: SymbolFile/DWARF/find-type-in-function.cpp (1207 of 2150) PASS: lldb-unit :: Interpreter/./InterpreterTests/CompletionTest.DirCompletionAbsolute (1208 of 2150) PASS: lldb-unit :: Utility/./UtilityTests/StringExtractorTest.GetHexBytes_FullString (1209 of 2150) PASS: lldb-shell :: SymbolFile/DWARF/debug-types-address-ranges.s (1210 of 2150) PASS: lldb-unit :: Utility/./UtilityTests/StreamTest.PutPtr (1211 of 2150) PASS: lldb-unit :: Process/gdb-remote/./ProcessGdbRemoteTests/GDBRemoteCommunicationClientTest.SendStartTracePacket (1212 of 2150) UNSUPPORTED: lldb-api :: tools/lldb-server/registers-target-xml-reading/TestGdbRemoteTargetXmlPacket.py (1213 of 2150) PASS: lldb-unit :: Utility/./UtilityTests/StreamTest.PutRawBytesToMixedEndian (1214 of 2150) PASS: lldb-api :: lang/c/struct_types/TestStructTypes.py (1215 of 2150) PASS: lldb-shell :: ObjectFile/ELF/short-build-id.yaml (1216 of 2150) PASS: lldb-api :: functionalities/object-file/TestImageListMultiArchitecture.py (1217 of 2150) PASS: lldb-api :: lang/cpp/bool/TestCPPBool.py (1218 of 2150) PASS: lldb-api :: functionalities/thread/concurrent_events/TestConcurrentWatchBreak.py (1219 of 2150) PASS: lldb-api :: linux/builtin_trap/TestBuiltinTrap.py (1220 of 2150) PASS: lldb-api :: lang/objc/objc-new-syntax/TestObjCNewSyntaxArray.py (1221 of 2150) PASS: lldb-api :: python_api/sbplatform/TestSBPlatform.py (1222 of 2150) PASS: lldb-unit :: Utility/./UtilityTests/NameMatchesTest.Equals (1223 of 2150) PASS: lldb-shell :: SymbolFile/DWARF/DW_TAG_variable-invalid_location.s (1224 of 2150) PASS: lldb-unit :: Expression/./ExpressionTests/DiagnosticManagerTest.AddDiagnostic (1225 of 2150) PASS: lldb-unit :: ObjectFile/Breakpad/./ObjectFileBreakpadTests/FuncRecord.parse (1226 of 2150) PASS: lldb-unit :: UnwindAssembly/x86/./UnwindAssemblyx86Tests/Testx86AssemblyInspectionEngine.TestReturnDetect (1227 of 2150) PASS: lldb-unit :: SymbolFile/NativePDB/./SymbolFileNativePDBTests/PDBFPOProgramToDWARFExpressionTests.UnresolvedRegisterReference (1228 of 2150) PASS: lldb-unit :: ScriptInterpreter/Python/./ScriptInterpreterPythonTests/PythonDataObjectsTest.TestExceptions (1229 of 2150) PASS: lldb-api :: commands/apropos/basic/TestApropos.py (1230 of 2150) PASS: lldb-api :: functionalities/postmortem/minidump/TestMiniDump.py (1231 of 2150) UNSUPPORTED: lldb-api :: tools/intel-features/intel-pt/test/TestIntelPTSimpleBinary.py (1232 of 2150) PASS: lldb-api :: functionalities/breakpoint/objc/TestObjCBreakpoints.py (1233 of 2150) PASS: lldb-api :: macosx/DBGSourcePathRemapping/TestDSYMSourcePathRemapping.py (1234 of 2150) PASS: lldb-unit :: Core/./LLDBCoreTests/ModuleSpecTest.TestCOFFFile (1235 of 2150) PASS: lldb-unit :: Utility/./UtilityTests/UriParserTest.SchemeHostSeparator3 (1236 of 2150) PASS: lldb-api :: functionalities/data-formatter/vector-types/TestVectorTypesFormatting.py (1237 of 2150) PASS: lldb-unit :: Expression/./ExpressionTests/DiagnosticManagerTest.GetStringNoDiags (1238 of 2150) PASS: lldb-unit :: SymbolFile/DWARF/./SymbolFileDWARFTests/SymbolFileDWARFTests.TestAbbrevValidAttrNullForm (1239 of 2150) PASS: lldb-shell :: SymbolFile/DWARF/anon_class_w_and_wo_export_symbols.ll (1240 of 2150) PASS: lldb-api :: macosx/duplicate-archive-members/TestDuplicateMembers.py (1241 of 2150) PASS: lldb-unit :: Utility/./UtilityTests/StringLexerTest.PutBack (1242 of 2150) PASS: lldb-api :: lang/mixed/TestMixedLanguages.py (1243 of 2150) PASS: lldb-unit :: Host/./HostTests/File.GetStreamFromDescriptor (1244 of 2150) PASS: lldb-unit :: Core/./LLDBCoreTests/RichManglingContextTest.SwitchProvider (1245 of 2150) PASS: lldb-unit :: Utility/./UtilityTests/TimerTest.CategoryTimesNested (1246 of 2150) PASS: lldb-api :: commands/watchpoints/multiple_hits/TestMultipleHits.py (1247 of 2150) PASS: lldb-unit :: Process/minidump/./LLDBMinidumpTests/MinidumpParserTest.GetMiscInfo_no_stream (1248 of 2150) PASS: lldb-unit :: ObjectFile/PECOFF/./ObjectFilePECOFFTests/PECallFrameInfoTest.Frame_reg_eh (1249 of 2150) PASS: lldb-api :: functionalities/abbreviation/TestAbbreviations.py (1250 of 2150) PASS: lldb-unit :: Utility/./UtilityTests/StreamTest.PutHex16ByteOrderLittle (1251 of 2150) PASS: lldb-shell :: Process/UnsupportedLanguage.test (1252 of 2150) PASS: lldb-unit :: Core/./LLDBCoreTests/MangledTest.ResultForBlockInvocation (1253 of 2150) PASS: lldb-shell :: ScriptInterpreter/Python/eof.test (1254 of 2150) PASS: lldb-unit :: Expression/./ExpressionTests/DiagnosticManagerTest.PutStringMultiple (1255 of 2150) PASS: lldb-api :: functionalities/data-formatter/setvaluefromcstring/TestSetValueFromCString.py (1256 of 2150) PASS: lldb-api :: commands/expression/import-std-module/shared_ptr-dbg-info-content/TestSharedPtrDbgInfoContentFromStdModule.py (1257 of 2150) PASS: lldb-api :: types/TestIntegerTypeExpr.py (1258 of 2150) PASS: lldb-api :: functionalities/data-formatter/data-formatter-objc/TestDataFormatterObjCNSDate.py (1259 of 2150) PASS: lldb-unit :: Utility/./UtilityTests/StringExtractorTest.GetNameColonValueContainsColon (1260 of 2150) PASS: lldb-unit :: Utility/./UtilityTests/StreamTest.PutMaxHex64ByteOrderBig (1261 of 2150) PASS: lldb-unit :: Process/minidump/./LLDBMinidumpTests/MinidumpParserTest.GetMemoryRegionInfoFromMemory64List (1262 of 2150) PASS: lldb-shell :: SymbolFile/NativePDB/function-types-builtins.cpp (1263 of 2150) PASS: lldb-unit :: Utility/./UtilityTests/FileSpecTest.GetPath (1264 of 2150) UNSUPPORTED: lldb-api :: benchmarks/libcxxlist/TestBenchmarkLibcxxList.py (1265 of 2150) PASS: lldb-unit :: Process/minidump/./LLDBMinidumpTests/MinidumpParserTest.GetThreadContext_x86_64 (1266 of 2150) PASS: lldb-shell :: Driver/TestError.test (1267 of 2150) PASS: lldb-shell :: SymbolFile/DWARF/dir-separator-windows.s (1268 of 2150) PASS: lldb-unit :: Utility/./UtilityTests/StreamTest.ChangingByteOrder (1269 of 2150) PASS: lldb-unit :: Host/./HostTests/FileSystemTest.OpenErrno (1270 of 2150) PASS: lldb-unit :: Core/./LLDBCoreTests/MangledTest.ResultForValidName (1271 of 2150) PASS: lldb-api :: functionalities/inferior-crashing/TestInferiorCrashingStep.py (1272 of 2150) PASS: lldb-api :: macosx/simulator/TestSimulatorPlatform.py (1273 of 2150) PASS: lldb-api :: functionalities/abbreviation/TestCommonShortSpellings.py (1274 of 2150) PASS: lldb-api :: functionalities/data-formatter/data-formatter-advanced/TestDataFormatterAdv.py (1275 of 2150) PASS: lldb-api :: functionalities/gdb_remote_client/TestPlatformClient.py (1276 of 2150) PASS: lldb-api :: functionalities/breakpoint/comp_dir_symlink/TestCompDirSymLink.py (1277 of 2150) PASS: lldb-unit :: Utility/./UtilityTests/PassiveReplayTest.InstrumentedFoo (1278 of 2150) PASS: lldb-unit :: Expression/./ExpressionTests/CppModuleConfigurationTest.MissingLibCpp (1279 of 2150) PASS: lldb-unit :: UnwindAssembly/x86/./UnwindAssemblyx86Tests/Testx86AssemblyInspectionEngine.TestPushExtended (1280 of 2150) PASS: lldb-api :: lang/c/forward/TestForwardDeclaration.py (1281 of 2150) PASS: lldb-api :: functionalities/memory/find/TestMemoryFind.py (1282 of 2150) PASS: lldb-shell :: ObjectFile/MachO/lc_build_version_notools.yaml (1283 of 2150) PASS: lldb-shell :: SymbolFile/symbol-binding.test (1284 of 2150) PASS: lldb-api :: functionalities/breakpoint/cpp_exception/TestCPPExceptionBreakpoint.py (1285 of 2150) PASS: lldb-shell :: ObjectFile/ELF/duplicate-section.yaml (1286 of 2150) PASS: lldb-api :: functionalities/thread/num_threads/TestNumThreads.py (1287 of 2150) PASS: lldb-unit :: Utility/./UtilityTests/StreamTest.PutHex64ByteOrderBig (1288 of 2150) PASS: lldb-unit :: ObjectFile/Breakpad/./ObjectFileBreakpadTests/InfoRecord.parse (1289 of 2150) PASS: lldb-shell :: ObjectFile/PECOFF/sections-names.yaml (1290 of 2150) PASS: lldb-api :: commands/expression/import-std-module/deque-dbg-info-content/TestDbgInfoContentDequeFromStdModule.py (1291 of 2150) PASS: lldb-unit :: Utility/./UtilityTests/StreamTest.PutCString (1292 of 2150) PASS: lldb-unit :: Utility/./UtilityTests/StreamTest.ShiftOperatorStrings (1293 of 2150) PASS: lldb-shell :: Reproducer/TestGDBRemoteRepro.test (1294 of 2150) PASS: lldb-unit :: ScriptInterpreter/Python/./ScriptInterpreterPythonTests/PythonDataObjectsTest.TestModuleNameResolutionNoDot (1295 of 2150) PASS: lldb-api :: functionalities/gdb_remote_client/TestTargetXMLArch.py (1296 of 2150) PASS: lldb-unit :: SymbolFile/DWARF/./SymbolFileDWARFTests/SymbolFileDWARFTests.ParseAranges (1297 of 2150) PASS: lldb-unit :: Utility/./UtilityTests/DataExtractorTest.GetSLEB128_bit63 (1298 of 2150) PASS: lldb-unit :: Utility/./UtilityTests/StringListTest.JoinSingle (1299 of 2150) PASS: lldb-api :: macosx/find-dsym/bundle-with-dot-in-filename/TestBundleWithDotInFilename.py (1300 of 2150) PASS: lldb-api :: commands/expression/unwind_expression/TestUnwindExpression.py (1301 of 2150) PASS: lldb-unit :: Host/./HostTests/MainLoopTest.DetectsEOF (1302 of 2150) PASS: lldb-shell :: SymbolFile/DWARF/debug_line-relative_path.s (1303 of 2150) PASS: lldb-unit :: Interpreter/./InterpreterTests/CompletionTest.FileCompletionAbsolute (1304 of 2150) PASS: lldb-api :: functionalities/type_completion/TestTypeCompletion.py (1305 of 2150) PASS: lldb-unit :: Target/./TargetTests/ModuleCacheTest.GetAndPutUuidExists (1306 of 2150) PASS: lldb-api :: tools/lldb-server/TestGdbRemoteExitCode.py (1307 of 2150) PASS: lldb-api :: tools/lldb-server/TestGdbRemoteExpeditedRegisters.py (1308 of 2150) UNSUPPORTED: lldb-api :: functionalities/thread/multi_break/TestMultipleBreakpoints.py (1309 of 2150) PASS: lldb-api :: python_api/lldbutil/TestSwigVersion.py (1310 of 2150) PASS: lldb-api :: lang/objc/foundation/TestObjectDescriptionAPI.py (1311 of 2150) PASS: lldb-unit :: Utility/./UtilityTests/UriParserTest.Minimal (1312 of 2150) PASS: lldb-api :: lang/cpp/accelerator-table/TestCPPAccelerator.py (1313 of 2150) PASS: lldb-api :: commands/expression/ir-interpreter-phi-nodes/TestIRInterpreterPHINodes.py (1314 of 2150) PASS: lldb-api :: functionalities/unwind/sigtramp/TestSigtrampUnwind.py (1315 of 2150) PASS: lldb-api :: commands/expression/scoped_enums/TestScopedEnumType.py (1316 of 2150) PASS: lldb-unit :: Process/minidump/./LLDBMinidumpTests/MinidumpParserTest.GetLinuxProcStatus_no_stream (1317 of 2150) PASS: lldb-shell :: SymbolFile/Breakpad/line-table-edgecases.test (1318 of 2150) PASS: lldb-unit :: Utility/./UtilityTests/StreamTeeTest.Constructor2Streams (1319 of 2150) PASS: lldb-unit :: Utility/./UtilityTests/BinaryStreamTest.PutSLEB128Zero (1320 of 2150) PASS: lldb-shell :: ObjectFile/ELF/gnu-debuglink.yaml (1321 of 2150) PASS: lldb-unit :: Utility/./UtilityTests/XcodeSDKTest.GetCanonicalNameAndConstruct (1322 of 2150) PASS: lldb-unit :: Utility/./UtilityTests/ArgsTest.GetQuotedCommandString (1323 of 2150) PASS: lldb-shell :: SymbolFile/NativePDB/disassembly.cpp (1324 of 2150) PASS: lldb-api :: lang/objc/objc-foundation-dictionary-empty/TestNSDictionary0.py (1325 of 2150) PASS: lldb-unit :: Disassembler/./DisassemblerTests/TestArmv7Disassembly.TestCortexFPDisass (1326 of 2150) PASS: lldb-api :: lang/cpp/dynamic-value/TestCppValueCast.py (1327 of 2150) PASS: lldb-unit :: UnwindAssembly/x86/./UnwindAssemblyx86Tests/Testx86AssemblyInspectionEngine.TestPushEDX (1328 of 2150) PASS: lldb-shell :: ObjectFile/ELF/aarch64-relocations.yaml (1329 of 2150) PASS: lldb-unit :: Utility/./UtilityTests/ArgsTest.ReplaceArgumentAtIndexShort (1330 of 2150) PASS: lldb-api :: macosx/save_crashlog/TestSaveCrashlog.py (1331 of 2150) PASS: lldb-api :: functionalities/signal/raise/TestRaise.py (1332 of 2150) PASS: lldb-api :: commands/expression/completion/TestExprCompletion.py (1333 of 2150) PASS: lldb-unit :: Utility/./UtilityTests/StreamTest.AddressSize (1334 of 2150) PASS: lldb-api :: commands/add-dsym/uuid/TestAddDsymCommand.py (1335 of 2150) PASS: lldb-unit :: Utility/./UtilityTests/StreamTest.SetIndentLevel (1336 of 2150) UNSUPPORTED: lldb-api :: benchmarks/expression/TestExpressionCmd.py (1337 of 2150) PASS: lldb-api :: commands/frame/diagnose/dereference-this/TestDiagnoseDereferenceThis.py (1338 of 2150) PASS: lldb-api :: macosx/find-app-in-bundle/TestFindAppInBundle.py (1339 of 2150) PASS: lldb-api :: commands/expression/xvalue/TestXValuePrinting.py (1340 of 2150) UNSUPPORTED: lldb-api :: functionalities/darwin_log/filter/regex/category/TestDarwinLogFilterRegexCategory.py (1341 of 2150) PASS: lldb-unit :: UnwindAssembly/x86/./UnwindAssemblyx86Tests/Testx86AssemblyInspectionEngine.TestStackRealignMSVC_i386 (1342 of 2150) UNSUPPORTED: lldb-shell :: SymbolFile/PDB/compilands.test (1343 of 2150) PASS: lldb-api :: lang/cpp/breakpoint_in_member_func_w_non_primitive_params/TestBreakpointInMemberFuncWNonPrimitiveParams.py (1344 of 2150) PASS: lldb-shell :: Reproducer/TestPythonImport.test (1345 of 2150) PASS: lldb-unit :: Host/./HostTests/MainLoopTest.TerminatesImmediately (1346 of 2150) PASS: lldb-api :: lang/cpp/function_refs/TestFunctionRefs.py (1347 of 2150) PASS: lldb-api :: functionalities/unwind/zeroth_frame/TestZerothFrame.py (1348 of 2150) PASS: lldb-unit :: Utility/./UtilityTests/SerializationRountripTest.SerializeDeserializeCStringArrayNullptrElem (1349 of 2150) PASS: lldb-unit :: Core/./LLDBCoreTests/CommunicationTest.SynchronizeWhileClosing (1350 of 2150) UNSUPPORTED: lldb-api :: tools/lldb-server/TestGdbRemote_vContThreads.py (1351 of 2150) PASS: lldb-api :: api/multiple-debuggers/TestMultipleDebuggers.py (1352 of 2150) PASS: lldb-api :: lang/cpp/unsigned_types/TestUnsignedTypes.py (1353 of 2150) PASS: lldb-unit :: Utility/./UtilityTests/StringListTest.JoinThree (1354 of 2150) PASS: lldb-api :: macosx/thread-names/TestInterruptThreadNames.py (1355 of 2150) PASS: lldb-shell :: Settings/TestSettingsWrite.test (1356 of 2150) PASS: lldb-shell :: Minidump/fb-dump.test (1357 of 2150) PASS: lldb-unit :: Utility/./UtilityTests/StreamTeeTest.Write (1358 of 2150) PASS: lldb-unit :: ScriptInterpreter/Python/./ScriptInterpreterPythonTests/PythonDataObjectsTest.TestPythonTupleInitializerList (1359 of 2150) PASS: lldb-api :: lang/objc/bitfield_ivars/TestBitfieldIvars.py (1360 of 2150) PASS: lldb-unit :: Utility/./UtilityTests/RangeTest.Slide (1361 of 2150) PASS: lldb-api :: tools/lldb-vscode/console/TestVSCode_console.py (1362 of 2150) PASS: lldb-unit :: ScriptInterpreter/Python/./ScriptInterpreterPythonTests/PythonDataObjectsTest.TestPythonStringToStr (1363 of 2150) PASS: lldb-api :: functionalities/history/TestHistoryRecall.py (1364 of 2150) PASS: lldb-shell :: ObjectFile/PECOFF/export-dllfunc.yaml (1365 of 2150) UNSUPPORTED: lldb-shell :: Register/x86-zmm-write.test (1366 of 2150) PASS: lldb-unit :: Language/Highlighting/./HighlighterTests/HighlighterTest.Colons (1367 of 2150) PASS: lldb-api :: commands/expression/rdar44436068/Test128BitsInteger.py (1368 of 2150) PASS: lldb-unit :: Utility/./UtilityTests/StringExtractorTest.GetHexU8_Extra_NoEof (1369 of 2150) PASS: lldb-unit :: Expression/./ExpressionTests/ClangHostTest.ComputeClangResourceDirectory (1370 of 2150) UNSUPPORTED: lldb-api :: linux/mix-dwo-and-regular-objects/TestMixedDwarfBinary.py (1371 of 2150) PASS: lldb-shell :: Quit/TestQuitExitCode30.test (1372 of 2150) PASS: lldb-unit :: Utility/./UtilityTests/ArgsTest.TestQuotedUnknownEscape (1373 of 2150) PASS: lldb-api :: commands/platform/file/read/TestPlatformFileRead.py (1374 of 2150) PASS: lldb-api :: commands/watchpoints/watchpoint_commands/condition/TestWatchpointConditionCmd.py (1375 of 2150) PASS: lldb-api :: python_api/disassemble-raw-data/TestDisassemble_VST1_64.py (1376 of 2150) PASS: lldb-api :: functionalities/breakpoint/auto_continue/TestBreakpointAutoContinue.py (1377 of 2150) PASS: lldb-api :: functionalities/thread/create_after_attach/TestCreateAfterAttach.py (1378 of 2150) PASS: lldb-shell :: SymbolFile/Breakpad/line-table.test (1379 of 2150) PASS: lldb-unit :: Utility/./UtilityTests/StringExtractorTest.GetHexU8_Extra (1380 of 2150) PASS: lldb-unit :: Expression/./ExpressionTests/DiagnosticManagerTest.FixedExpression (1381 of 2150) PASS: lldb-unit :: Utility/./UtilityTests/StringListTest.GetMaxStringLengthEqualSize (1382 of 2150) PASS: lldb-shell :: SymbolFile/Breakpad/line-table-missing-file.test (1383 of 2150) PASS: lldb-unit :: Utility/./UtilityTests/UriParserTest.MinimalPath (1384 of 2150) PASS: lldb-api :: lang/c/shared_lib/TestSharedLib.py (1385 of 2150) PASS: lldb-api :: commands/expression/import-std-module/vector/TestVectorFromStdModule.py (1386 of 2150) PASS: lldb-api :: lang/objc/objc_direct-methods/TestObjCDirectMethods.py (1387 of 2150) UNSUPPORTED: lldb-api :: android/platform/TestDefaultCacheLineSize.py (1388 of 2150) PASS: lldb-unit :: Utility/./UtilityTests/StringListTest.GetMaxStringLengthMixed (1389 of 2150) PASS: lldb-api :: functionalities/thread/crash_during_step/TestCrashDuringStep.py (1390 of 2150) PASS: lldb-unit :: Utility/./UtilityTests/SerializationRountripTest.SerializeDeserializePodPointers (1391 of 2150) PASS: lldb-api :: functionalities/data-formatter/parray/TestPrintArray.py (1392 of 2150) PASS: lldb-unit :: Utility/./UtilityTests/FileSpecTest.FileAndDirectoryComponents (1393 of 2150) PASS: lldb-unit :: Host/./HostTests/FileSystemTest.MakeAbsolute (1394 of 2150) UNSUPPORTED: lldb-shell :: ScriptInterpreter/Lua/lua.test (1395 of 2150) PASS: lldb-unit :: Utility/./UtilityTests/StreamTest.AddressRange (1396 of 2150) PASS: lldb-unit :: ObjectFile/ELF/./ObjectFileELFTests/ObjectFileELFTest.GetSymtab_NoSymEntryPointArmAddressClass (1397 of 2150) PASS: lldb-api :: types/TestFloatTypesExpr.py (1398 of 2150) UNSUPPORTED: lldb-api :: functionalities/thread/thread_specific_break_plus_condition/TestThreadSpecificBpPlusCondition.py (1399 of 2150) PASS: lldb-api :: lang/cpp/class-template-parameter-pack/TestClassTemplateParameterPack.py (1400 of 2150) PASS: lldb-shell :: Watchpoint/SetErrorCases.test (1401 of 2150) PASS: lldb-unit :: UnwindAssembly/x86/./UnwindAssemblyx86Tests/Testx86AssemblyInspectionEngine.Test32bitFramelessBigStackFrame (1402 of 2150) PASS: lldb-unit :: Process/gdb-remote/./ProcessGdbRemoteTests/GDBRemoteCommunicationServerTest.SendErrorResponse_ErrorNumber (1403 of 2150) PASS: lldb-unit :: UnwindAssembly/x86/./UnwindAssemblyx86Tests/Testx86AssemblyInspectionEngine.TestSimplei386ugmented (1404 of 2150) PASS: lldb-api :: commands/frame/recognizer/TestFrameRecognizer.py (1405 of 2150) PASS: lldb-api :: functionalities/data-formatter/data-formatter-stl/libcxx/unique_ptr/TestDataFormatterLibcxxUniquePtr.py (1406 of 2150) PASS: lldb-api :: functionalities/data-formatter/data-formatter-stl/libcxx/variant/TestDataFormatterLibcxxVariant.py (1407 of 2150) PASS: lldb-unit :: Language/Highlighting/./HighlighterTests/HighlighterTest.ClangPPDirectives (1408 of 2150) PASS: lldb-shell :: Process/TestAbortExitCode.test (1409 of 2150) UNSUPPORTED: lldb-api :: commands/watchpoints/hello_watchlocation/TestWatchLocation.py (1410 of 2150) PASS: lldb-api :: functionalities/backticks/TestBackticksWithoutATarget.py (1411 of 2150) PASS: lldb-shell :: Quit/TestQuitExitCodeHex0.test (1412 of 2150) PASS: lldb-unit :: Utility/./UtilityTests/ArgsTest.DoubleQuotedItem (1413 of 2150) PASS: lldb-api :: lang/objc/modules-incomplete/TestIncompleteModules.py (1414 of 2150) PASS: lldb-api :: functionalities/target_var/TestTargetVar.py (1415 of 2150) PASS: lldb-shell :: Driver/TestConvenienceVariables.test (1416 of 2150) PASS: lldb-unit :: Utility/./UtilityTests/RangeTest.SizeTypes (1417 of 2150) PASS: lldb-shell :: Breakpoint/implicit_const_form_support.test (1418 of 2150) PASS: lldb-unit :: Host/./HostTests/FileSystemTest.Resolve (1419 of 2150) UNSUPPORTED: lldb-shell :: SymbolFile/PDB/function-level-linking.test (1420 of 2150) PASS: lldb-api :: functionalities/thread/concurrent_events/TestConcurrentBreakpointOneDelayBreakpointThreads.py (1421 of 2150) PASS: lldb-api :: functionalities/tsan/basic/TestTsanBasic.py (1422 of 2150) PASS: lldb-unit :: ScriptInterpreter/Python/./ScriptInterpreterPythonTests/PythonDataObjectsTest.TestDictionaryResolutionWithDot (1423 of 2150) PASS: lldb-api :: commands/settings/quoting/TestQuoting.py (1424 of 2150) PASS: lldb-unit :: Process/gdb-remote/./ProcessGdbRemoteTests/GDBRemoteCommunicationClientTest.SendStopTracePacket (1425 of 2150) PASS: lldb-api :: tools/lldb-server/commandline/TestStubSetSID.py (1426 of 2150) PASS: lldb-unit :: Interpreter/./InterpreterTests/OptionArgParserTest.toChar (1427 of 2150) PASS: lldb-unit :: Utility/./UtilityTests/UriParserTest.MinimalPort (1428 of 2150) PASS: lldb-unit :: UnwindAssembly/x86/./UnwindAssemblyx86Tests/Testx86AssemblyInspectionEngine.TestSpillRegToStackViaMOVi386 (1429 of 2150) PASS: lldb-unit :: Symbol/./SymbolTests/TestTypeSystemClang.TestGetEnumIntegerTypeUnexpectedType (1430 of 2150) PASS: lldb-unit :: Utility/./UtilityTests/StreamTest.AddressRangeSize (1431 of 2150) PASS: lldb-api :: commands/command/invalid-args/TestInvalidArgsCommand.py (1432 of 2150) PASS: lldb-api :: tools/lldb-vscode/launch/TestVSCode_launch.py (1433 of 2150) PASS: lldb-shell :: Breakpoint/jitbp_elf.test (1434 of 2150) PASS: lldb-unit :: Utility/./UtilityTests/CompletionRequest.DuplicateFiltering (1435 of 2150) PASS: lldb-unit :: Expression/./ExpressionTests/DiagnosticManagerTest.AppendMessageNoDiag (1436 of 2150) PASS: lldb-unit :: Host/./HostTests/HostInfoTest.GetAugmentedArchSpec (1437 of 2150) PASS: lldb-unit :: Utility/./UtilityTests/DataExtractorTest.GetCStrAtEnd (1438 of 2150) PASS: lldb-shell :: Commands/command-regex-unalias.test (1439 of 2150) PASS: lldb-api :: lang/cpp/virtual-overload/TestVirtualOverload.py (1440 of 2150) PASS: lldb-unit :: ScriptInterpreter/Python/./ScriptInterpreterPythonTests/PythonDataObjectsTest.TestPythonListToStructuredList (1441 of 2150) PASS: lldb-unit :: Symbol/./SymbolTests/TestClangASTImporter.MetadataPropagationIndirectImport (1442 of 2150) PASS: lldb-unit :: Expression/./ExpressionTests/CppModuleConfigurationTest.LinuxLocalLibCpp (1443 of 2150) PASS: lldb-api :: python_api/exprpath_synthetic/TestExprPathSynthetic.py (1444 of 2150) UNSUPPORTED: lldb-api :: linux/thread/create_during_instruction_step/TestCreateDuringInstructionStep.py (1445 of 2150) PASS: lldb-api :: lang/c/vla/TestVLA.py (1446 of 2150) PASS: lldb-unit :: Language/Highlighting/./HighlighterTests/HighlighterTest.ClangEmptyInput (1447 of 2150) PASS: lldb-api :: commands/expression/import-std-module/unique_ptr/TestUniquePtrFromStdModule.py (1448 of 2150) PASS: lldb-unit :: Process/gdb-remote/./ProcessGdbRemoteTests/GDBRemoteCommunicationClientTest.SendGetDataPacket (1449 of 2150) PASS: lldb-unit :: Host/./HostTests/Host.GetEnvironment (1450 of 2150) PASS: lldb-api :: commands/watchpoints/watchpoint_commands/command/TestWatchpointCommandLLDB.py (1451 of 2150) PASS: lldb-shell :: Reproducer/TestReuseDirectory.test (1452 of 2150) PASS: lldb-api :: commands/expression/pr35310/TestExprsBug35310.py (1453 of 2150) PASS: lldb-unit :: Symbol/./SymbolTests/TestClangASTImporter.CompleteFwdDeclWithOtherOrigin (1454 of 2150) PASS: lldb-api :: lang/objcxx/hide-runtime-values/TestObjCXXHideRuntimeValues.py (1455 of 2150) PASS: lldb-unit :: Process/gdb-remote/./ProcessGdbRemoteTests/GDBRemoteCommunicationServerTest.SendErrorResponse_StringError (1456 of 2150) UNSUPPORTED: lldb-shell :: SymbolFile/DWARF/debug-types-expressions.test (1457 of 2150) PASS: lldb-unit :: Process/gdb-remote/./ProcessGdbRemoteTests/GDBRemoteCommunicationClientTest.ReadRegister (1458 of 2150) PASS: lldb-api :: lang/cpp/alignas_base_class/TestAlignAsBaseClass.py (1459 of 2150) PASS: lldb-api :: functionalities/thread/concurrent_events/TestConcurrentTwoBreakpointsOneDelaySignal.py (1460 of 2150) PASS: lldb-unit :: Utility/./UtilityTests/AnsiTerminal.Twice (1461 of 2150) PASS: lldb-unit :: Utility/./UtilityTests/StringExtractorTest.GetHexBytes_Partial (1462 of 2150) PASS: lldb-api :: functionalities/breakpoint/scripted_bkpt/TestScriptedResolver.py (1463 of 2150) PASS: lldb-unit :: Utility/./UtilityTests/ArgsTest.BareSingleQuote (1464 of 2150) PASS: lldb-shell :: ObjectFile/ELF/PT_LOAD-overlap.yaml (1465 of 2150) PASS: lldb-unit :: Host/./HostTests/SocketAddressTest.Set (1466 of 2150) PASS: lldb-api :: lang/cpp/unique-types/TestUniqueTypes.py (1467 of 2150) PASS: lldb-unit :: Utility/./UtilityTests/NameMatchesTest.StartsWith (1468 of 2150) PASS: lldb-unit :: Process/gdb-remote/./ProcessGdbRemoteTests/GDBRemoteCommunicationClientTest.GetQOffsets (1469 of 2150) PASS: lldb-api :: lang/cpp/incomplete-types/TestCppIncompleteTypes.py (1470 of 2150) PASS: lldb-unit :: Language/Highlighting/./HighlighterTests/HighlighterTest.ClangCursorPosEndOfLine (1471 of 2150) PASS: lldb-unit :: Target/./TargetTests/MCBasedABI.MapRegisterName (1472 of 2150) UNSUPPORTED: lldb-shell :: Register/x86-gp-write.test (1473 of 2150) PASS: lldb-unit :: Process/gdb-remote/./ProcessGdbRemoteTests/GDBRemoteCommunicationClientTest.TestPacketSpeedJSON (1474 of 2150) PASS: lldb-unit :: Utility/./UtilityTests/VASprintfTest.BufferResize (1475 of 2150) PASS: lldb-api :: commands/expression/import-std-module/unique_ptr-dbg-info-content/TestUniquePtrDbgInfoContent.py (1476 of 2150) PASS: lldb-unit :: Utility/./UtilityTests/DataExtractorTest.GetMaxU64 (1477 of 2150) PASS: lldb-shell :: Breakpoint/ppc64-localentry.test (1478 of 2150) PASS: lldb-api :: api/check_public_api_headers/TestPublicAPIHeaders.py (1479 of 2150) PASS: lldb-api :: macosx/macCatalyst/TestMacCatalyst.py (1480 of 2150) PASS: lldb-shell :: SymbolFile/DWARF/find-basic-variable.cpp (1481 of 2150) PASS: lldb-unit :: Utility/./UtilityTests/BinaryStreamTest.PutSLEB128SevenBytes (1482 of 2150) UNSUPPORTED: lldb-api :: benchmarks/libcxxmap/TestBenchmarkLibcxxMap.py (1483 of 2150) PASS: lldb-api :: python_api/frame/inlines/TestInlinedFrame.py (1484 of 2150) PASS: lldb-api :: functionalities/return-value/TestReturnValue.py (1485 of 2150) PASS: lldb-unit :: Process/gdb-remote/./ProcessGdbRemoteTests/GDBRemoteCommunicationClientTest.SaveRestoreRegistersNoSuffix (1486 of 2150) PASS: lldb-api :: commands/target/dump-symtab-demangle/TestDumpSymtabDemangle.py (1487 of 2150) PASS: lldb-api :: functionalities/gdb_remote_client/TestRecognizeBreakpoint.py (1488 of 2150) PASS: lldb-unit :: Utility/./UtilityTests/ArgsTest.TestInsertArg (1489 of 2150) PASS: lldb-unit :: Utility/./UtilityTests/ArgsTest.TestAppendArg (1490 of 2150) PASS: lldb-api :: functionalities/thread/concurrent_events/TestConcurrentCrashWithBreak.py (1491 of 2150) PASS: lldb-api :: commands/expression/radar_8638051/Test8638051.py (1492 of 2150) PASS: lldb-api :: functionalities/gdb_remote_client/TestArmRegisterDefinition.py (1493 of 2150) UNSUPPORTED: lldb-api :: commands/expression/macros/TestMacros.py (1494 of 2150) PASS: lldb-unit :: Utility/./UtilityTests/TimeoutTest.Format (1495 of 2150) PASS: lldb-api :: commands/reproducer/invalid-args/TestInvalidArgsReproducer.py (1496 of 2150) PASS: lldb-shell :: Process/TestEnvironment.test (1497 of 2150) PASS: lldb-api :: functionalities/data-formatter/data-formatter-stl/libcxx/forward_list/TestDataFormatterLibcxxForwardList.py (1498 of 2150) PASS: lldb-unit :: ScriptInterpreter/Python/./ScriptInterpreterPythonTests/PythonDataObjectsTest.TestPythonListManipulation (1499 of 2150) PASS: lldb-api :: lang/objc/ivar-IMP/TestObjCiVarIMP.py (1500 of 2150) PASS: lldb-unit :: Utility/./UtilityTests/StructuredDataTest.ParseJSONFromFile (1501 of 2150) PASS: lldb-unit :: Process/minidump/./LLDBMinidumpTests/MinidumpParserTest.GetPidWindows (1502 of 2150) PASS: lldb-api :: functionalities/postmortem/netbsd-core/TestNetBSDCore.py (1503 of 2150) PASS: lldb-unit :: Utility/./UtilityTests/TimeoutTest.Construction (1504 of 2150) PASS: lldb-unit :: UnwindAssembly/ARM64/./Arm64InstEmulationTests/TestArm64InstEmulation.TestRegisterSavedTwice (1505 of 2150) PASS: lldb-shell :: Settings/TestFrameFormatColor.test (1506 of 2150) PASS: lldb-unit :: UnwindAssembly/x86/./UnwindAssemblyx86Tests/Testx86AssemblyInspectionEngine.TestPushESI (1507 of 2150) PASS: lldb-shell :: SymbolFile/DWARF/debug_aranges-empty-section.s (1508 of 2150) PASS: lldb-api :: python_api/sbdata/TestSBData.py (1509 of 2150) PASS: lldb-unit :: Utility/./UtilityTests/ArchSpecTest.Compatibility (1510 of 2150) PASS: lldb-api :: macosx/thread_suspend/TestInternalThreadSuspension.py (1511 of 2150) PASS: lldb-unit :: ScriptInterpreter/Python/./ScriptInterpreterPythonTests/PythonDataObjectsTest.TestGlobalNameResolutionWithDot (1512 of 2150) PASS: lldb-unit :: Utility/./UtilityTests/ProcessInstanceInfo.DumpTable_invalidUID (1513 of 2150) PASS: lldb-api :: types/TestDoubleTypesExpr.py (1514 of 2150) PASS: lldb-shell :: Breakpoint/case-sensitive.test (1515 of 2150) PASS: lldb-api :: commands/expression/import-std-module/shared_ptr/TestSharedPtrFromStdModule.py (1516 of 2150) PASS: lldb-unit :: Utility/./UtilityTests/ScalarTest.SetValueFromData (1517 of 2150) PASS: lldb-shell :: Breakpoint/single-file-split-dwarf.test (1518 of 2150) PASS: lldb-api :: functionalities/postmortem/elf-core/TestLinuxCore.py (1519 of 2150) PASS: lldb-api :: functionalities/source-map/TestTargetSourceMap.py (1520 of 2150) PASS: lldb-unit :: Utility/./UtilityTests/StringExtractorTest.DecodeHexU8_Underflow2 (1521 of 2150) PASS: lldb-api :: lang/cpp/namespace_definitions/TestNamespaceDefinitions.py (1522 of 2150) PASS: lldb-shell :: SymbolFile/DWARF/static_scope.s (1523 of 2150) PASS: lldb-unit :: Utility/./UtilityTests/PassiveReplayTest.InstrumentedBar (1524 of 2150) UNSUPPORTED: lldb-api :: commands/register/register/intel_xtended_registers/mpx_bound_violation/TestBoundViolation.py (1525 of 2150) PASS: lldb-shell :: ObjectFile/PECOFF/invalid-export-table.yaml (1526 of 2150) PASS: lldb-shell :: ObjectFile/ELF/build-id-case.yaml (1527 of 2150) PASS: lldb-api :: functionalities/thread/concurrent_events/TestConcurrentNWatchNBreak.py (1528 of 2150) PASS: lldb-api :: commands/expression/import-std-module/vector-dbg-info-content/TestDbgInfoContentVectorFromStdModule.py (1529 of 2150) PASS: lldb-unit :: UnwindAssembly/x86/./UnwindAssemblyx86Tests/Testx86AssemblyInspectionEngine.TestSubESP (1530 of 2150) PASS: lldb-api :: lang/cpp/namespace/TestNamespaceLookup.py (1531 of 2150) PASS: lldb-unit :: Utility/./UtilityTests/StreamTest.AddressEmptyPrefix (1532 of 2150) PASS: lldb-unit :: Utility/./UtilityTests/SerializationRountripTest.SerializeDeserializeCStringArrayNullptr (1533 of 2150) PASS: lldb-unit :: Utility/./UtilityTests/ArgsTest.TestTrailingBackslash (1534 of 2150) PASS: lldb-api :: lang/objc/objc-static-method-stripped/TestObjCStaticMethodStripped.py (1535 of 2150) PASS: lldb-shell :: ObjectFile/ELF/PT_LOAD.yaml (1536 of 2150) UNSUPPORTED: lldb-api :: functionalities/darwin_log/source/info/TestDarwinLogSourceInfo.py (1537 of 2150) PASS: lldb-unit :: UnwindAssembly/x86/./UnwindAssemblyx86Tests/Testx86AssemblyInspectionEngine.TestPushEBX (1538 of 2150) PASS: lldb-api :: functionalities/tail_call_frames/ambiguous_tail_call_seq1/TestAmbiguousTailCallSeq1.py (1539 of 2150) PASS: lldb-unit :: Utility/./UtilityTests/GeneratorTest.Get (1540 of 2150) PASS: lldb-api :: functionalities/data-formatter/data-formatter-stl/libcxx/map/TestDataFormatterLibccMap.py (1541 of 2150) PASS: lldb-api :: lang/cpp/inlines/TestInlines.py (1542 of 2150) PASS: lldb-unit :: Host/./HostTests/MainLoopTest.ReadObject (1543 of 2150) PASS: lldb-unit :: Utility/./UtilityTests/ArgsTest.TestSingleQuotedArgWithSpace (1544 of 2150) PASS: lldb-api :: lang/c/stepping/TestThreadStepping.py (1545 of 2150) PASS: lldb-unit :: Utility/./UtilityTests/OptionsWithRawTest.MultiWordSuffix (1546 of 2150) PASS: lldb-unit :: Utility/./UtilityTests/StringListTest.ForRangeEmpty (1547 of 2150) PASS: lldb-unit :: ScriptInterpreter/Python/./ScriptInterpreterPythonTests/PythonDataObjectsTest.TestGlobalNameResolutionNoDot (1548 of 2150) UNSUPPORTED: lldb-api :: functionalities/breakpoint/breakpoint_in_delayslot/TestAvoidBreakpointInDelaySlot.py (1549 of 2150) PASS: lldb-api :: functionalities/thread/step_until/TestStepUntil.py (1550 of 2150) PASS: lldb-shell :: Minidump/memory-region.yaml (1551 of 2150) PASS: lldb-api :: commands/expression/top-level/TestTopLevelExprs.py (1552 of 2150) PASS: lldb-api :: functionalities/breakpoint/debugbreak/TestDebugBreak.py (1553 of 2150) PASS: lldb-shell :: Commands/CommandScriptImmediateOutput/CommandScriptImmediateOutputFile.test (1554 of 2150) PASS: lldb-api :: functionalities/data-formatter/data-formatter-stl/libcxx/initializerlist/TestInitializerList.py (1555 of 2150) PASS: lldb-api :: functionalities/data-formatter/synthupdate/TestSyntheticFilterRecompute.py (1556 of 2150) PASS: lldb-unit :: Symbol/./SymbolTests/TestTypeSystemClang.TestConvertAccessTypeToAccessSpecifier (1557 of 2150) PASS: lldb-api :: functionalities/data-formatter/type_summary_list_arg/TestTypeSummaryListArg.py (1558 of 2150) PASS: lldb-api :: functionalities/tsan/thread_leak/TestTsanThreadLeak.py (1559 of 2150) PASS: lldb-api :: functionalities/breakpoint/breakpoint_by_line_and_column/TestBreakpointByLineAndColumn.py (1560 of 2150) PASS: lldb-shell :: Register/x86-64-ymm-read.test (1561 of 2150) PASS: lldb-unit :: Utility/./UtilityTests/EnvironmentTest.EnvpConversion (1562 of 2150) PASS: lldb-api :: types/TestFloatTypes.py (1563 of 2150) PASS: lldb-shell :: SymbolFile/Breakpad/unwind-via-raSearch.test (1564 of 2150) PASS: lldb-unit :: Utility/./UtilityTests/UriParserTest.TypicalPortPathIPv4 (1565 of 2150) PASS: lldb-api :: functionalities/tail_call_frames/inlining_and_tail_calls/TestInliningAndTailCalls.py (1566 of 2150) PASS: lldb-api :: functionalities/value_md5_crash/TestValueMD5Crash.py (1567 of 2150) PASS: lldb-unit :: Process/minidump/./LLDBMinidumpTests/MinidumpParserTest.GetPid (1568 of 2150) PASS: lldb-unit :: Language/Highlighting/./HighlighterTests/HighlighterTest.ClangBraces (1569 of 2150) PASS: lldb-shell :: Unwind/thread-step-out-ret-addr-check.test (1570 of 2150) PASS: lldb-shell :: Breakpoint/split-dwarf5-debug-stroffsets.test (1571 of 2150) PASS: lldb-unit :: Expression/./ExpressionTests/DiagnosticManagerTest.GetStringMultipleDiags (1572 of 2150) PASS: lldb-api :: functionalities/data-formatter/stringprinter/TestStringPrinter.py (1573 of 2150) UNSUPPORTED: lldb-shell :: Register/x86-64-ymm16-write.test (1574 of 2150) PASS: lldb-unit :: UnwindAssembly/ARM64/./Arm64InstEmulationTests/TestArm64InstEmulation.TestMediumDarwinFunction (1575 of 2150) PASS: lldb-api :: functionalities/thread/ignore_suspended/TestIgnoreSuspendedThread.py (1576 of 2150) PASS: lldb-unit :: Utility/./UtilityTests/BinaryStreamTest.PutULEB128EightBytes (1577 of 2150) PASS: lldb-unit :: Utility/./UtilityTests/BinaryStreamTest.PutULEB128FourBytes (1578 of 2150) UNSUPPORTED: lldb-shell :: SymbolFile/PDB/class-layout.test (1579 of 2150) PASS: lldb-shell :: BuildScript/script-args.test (1580 of 2150) UNSUPPORTED: lldb-api :: functionalities/data-formatter/data-formatter-stl/libstdcpp/unique_ptr/TestDataFormatterStdUniquePtr.py (1581 of 2150) PASS: lldb-api :: lang/cpp/frame-var-anon-unions/TestFrameVariableAnonymousUnions.py (1582 of 2150) PASS: lldb-api :: functionalities/data-formatter/data-formatter-objc/TestDataFormatterObjCKVO.py (1583 of 2150) PASS: lldb-api :: commands/gui/basicdebug/TestGuiBasicDebug.py (1584 of 2150) PASS: lldb-api :: python_api/process/read-mem-cstring/TestReadMemCString.py (1585 of 2150) PASS: lldb-api :: python_api/value/TestValueAPI.py (1586 of 2150) PASS: lldb-unit :: SymbolFile/NativePDB/./SymbolFileNativePDBTests/PDBFPOProgramToDWARFExpressionTests.MissingTargetRegister (1587 of 2150) PASS: lldb-api :: commands/frame/var-scope/TestFrameVariableScope.py (1588 of 2150) PASS: lldb-shell :: SymbolFile/Breakpad/unwind-via-stack-win-no-memory-info.yaml (1589 of 2150) PASS: lldb-unit :: Process/minidump/./LLDBMinidumpTests/RegisterContextMinidump.ConvertMinidumpContext_x86_32 (1590 of 2150) PASS: lldb-api :: macosx/safe-to-func-call/TestSafeFuncCalls.py (1591 of 2150) UNSUPPORTED: lldb-api :: commands/trace/TestTraceSchema.py (1592 of 2150) PASS: lldb-api :: commands/expression/import-std-module/no-std-module/TestMissingStdModule.py (1593 of 2150) PASS: lldb-unit :: ScriptInterpreter/Python/./ScriptInterpreterPythonTests/PythonDataObjectsTest.TestRun (1594 of 2150) PASS: lldb-api :: lang/c/complex_int/TestComplexInt.py (1595 of 2150) PASS: lldb-api :: lang/objc/objc-ivar-protocols/TestIvarProtocols.py (1596 of 2150) PASS: lldb-shell :: ScriptInterpreter/Python/crashlog.test (1597 of 2150) PASS: lldb-shell :: Driver/TestCommands.test (1598 of 2150) PASS: lldb-api :: commands/expression/weak_symbols/TestWeakSymbols.py (1599 of 2150) UNSUPPORTED: lldb-api :: functionalities/darwin_log/filter/regex/activity-chain/TestDarwinLogFilterRegexActivityChain.py (1600 of 2150) PASS: lldb-unit :: Target/./TargetTests/RemoteAwarePlatformTest.TestResolveExecutabelOnClientByPlatform (1601 of 2150) PASS: lldb-api :: functionalities/type_lookup/TestTypeLookup.py (1602 of 2150) PASS: lldb-api :: functionalities/memory-region/TestMemoryRegion.py (1603 of 2150) PASS: lldb-shell :: Breakpoint/split-dwarf-5-addrbase.test (1604 of 2150) PASS: lldb-api :: functionalities/breakpoint/breakpoint_command/TestBreakpointCommand.py (1605 of 2150) PASS: lldb-api :: python_api/watchpoint/condition/TestWatchpointConditionAPI.py (1606 of 2150) PASS: lldb-api :: python_api/get-value-32bit-int/TestGetValue32BitInt.py (1607 of 2150) PASS: lldb-api :: sample_test/TestSampleTest.py (1608 of 2150) PASS: lldb-api :: functionalities/data-formatter/pyobjsynthprovider/TestPyObjSynthProvider.py (1609 of 2150) PASS: lldb-unit :: Language/Highlighting/./HighlighterTests/HighlighterTest.ClangCursorPosAfterOtherToken (1610 of 2150) PASS: lldb-shell :: SymbolFile/DWARF/debug-names-compressed.cpp (1611 of 2150) PASS: lldb-api :: functionalities/inline-stepping/TestInlineStepping.py (1612 of 2150) PASS: lldb-shell :: ObjectFile/Breakpad/discontiguous-sections.test (1613 of 2150) PASS: lldb-unit :: ObjectFile/ELF/./ObjectFileELFTests/ObjectFileELFTest.SectionsResolveConsistently (1614 of 2150) PASS: lldb-shell :: ObjectFile/ELF/section-types-edgecases.yaml (1615 of 2150) PASS: lldb-api :: functionalities/breakpoint/dummy_target_breakpoints/TestBreakpointsWithNoTargets.py (1616 of 2150) PASS: lldb-unit :: Utility/./UtilityTests/RangeTest.NotEqualInvalid (1617 of 2150) PASS: lldb-unit :: Language/Highlighting/./HighlighterTests/HighlighterTest.ClangStringLiterals (1618 of 2150) PASS: lldb-unit :: Utility/./UtilityTests/StringListTest.LongestCommonPrefix (1619 of 2150) PASS: lldb-api :: functionalities/data-formatter/type_summary_list_script/TestTypeSummaryListScript.py (1620 of 2150) PASS: lldb-unit :: Utility/./UtilityTests/ArgsTest.Yaml (1621 of 2150) PASS: lldb-shell :: SymbolFile/DWARF/DW_OP_piece-struct.s (1622 of 2150) PASS: lldb-shell :: Commands/command-regex-delete.test (1623 of 2150) PASS: lldb-unit :: Process/minidump/./LLDBMinidumpTests/MinidumpParserTest.GetThreadsAndGetThreadContext (1624 of 2150) UNSUPPORTED: lldb-shell :: SymbolFile/PDB/type-quals.test (1625 of 2150) UNSUPPORTED: lldb-shell :: ExecControl/StopHook/stop-hook-threads.test (1626 of 2150) PASS: lldb-unit :: Utility/./UtilityTests/LogTest.Unregister (1627 of 2150) PASS: lldb-unit :: ObjectFile/PECOFF/./ObjectFilePECOFFTests/PECallFrameInfoTest.Chained_eh (1628 of 2150) PASS: lldb-api :: functionalities/data-formatter/data-formatter-enum-format/TestDataFormatterEnumFormat.py (1629 of 2150) PASS: lldb-api :: lang/cpp/bitfields/TestCppBitfields.py (1630 of 2150) PASS: lldb-api :: lang/cpp/global_operators/TestCppGlobalOperators.py (1631 of 2150) PASS: lldb-unit :: Process/minidump/./LLDBMinidumpTests/MinidumpParserTest.GetMemoryRegionInfo (1632 of 2150) PASS: lldb-unit :: Process/minidump/./LLDBMinidumpTests/MinidumpParserTest.GetFilteredModuleList (1633 of 2150) PASS: lldb-api :: assert_messages_test/TestAssertMessages.py (1634 of 2150) PASS: lldb-unit :: Utility/./UtilityTests/StringListTest.InsertStringAtIndexStdString (1635 of 2150) PASS: lldb-unit :: Utility/./UtilityTests/UserIDResolver.GetUserName (1636 of 2150) PASS: lldb-api :: functionalities/data-formatter/data-formatter-stl/libcxx/string/TestDataFormatterLibcxxString.py (1637 of 2150) PASS: lldb-unit :: Utility/./UtilityTests/ScalarTest.Promotion (1638 of 2150) PASS: lldb-api :: commands/expression/import-std-module/forward_decl_from_module/TestForwardDeclFromStdModule.py (1639 of 2150) PASS: lldb-api :: macosx/find-dsym/deep-bundle/TestDeepBundle.py (1640 of 2150) PASS: lldb-unit :: UnwindAssembly/ARM64/./Arm64InstEmulationTests/TestArm64InstEmulation.TestSimpleDarwinFunction (1641 of 2150) PASS: lldb-unit :: Utility/./UtilityTests/SharedCluster.ClusterManager (1642 of 2150) PASS: lldb-unit :: Utility/./UtilityTests/RangeTest.EqualInvalid (1643 of 2150) PASS: lldb-unit :: Utility/./UtilityTests/StringExtractorTest.GetU64LittleEndian (1644 of 2150) PASS: lldb-unit :: Utility/./UtilityTests/StreamTeeTest.CopyConstructor (1645 of 2150) UNSUPPORTED: lldb-shell :: Register/arm-fp-read.test (1646 of 2150) UNSUPPORTED: lldb-shell :: SymbolFile/PDB/vbases.test (1647 of 2150) PASS: lldb-api :: functionalities/breakpoint/move_nearest/TestMoveNearest.py (1648 of 2150) PASS: lldb-unit :: Utility/./UtilityTests/Predicate.WaitForValueEqualTo (1649 of 2150) PASS: lldb-unit :: Process/minidump/./LLDBMinidumpTests/MinidumpParserTest.GetArchitectureWindows (1650 of 2150) PASS: lldb-unit :: Utility/./UtilityTests/StringListTest.AppendList (1651 of 2150) PASS: lldb-api :: lang/c/array_types/TestArrayTypes.py (1652 of 2150) PASS: lldb-unit :: Symbol/./SymbolTests/TestTypeSystemClang.TestFunctionTemplateInRecordConstruction (1653 of 2150) PASS: lldb-api :: commands/expression/unicode-in-variable/TestUnicodeInVariable.py (1654 of 2150) PASS: lldb-unit :: Signals/./SignalsTests/UnixSignalsTest.GetInfo (1655 of 2150) PASS: lldb-unit :: Utility/./UtilityTests/OptionsWithRawTest.EmptySuffix (1656 of 2150) PASS: lldb-unit :: Utility/./UtilityTests/StringExtractorTest.GetHexU8_Exact (1657 of 2150) PASS: lldb-api :: lang/cpp/this_class_type_mixing/TestThisClassTypeMixing.py (1658 of 2150) PASS: lldb-shell :: BuildScript/compiler-full-path.test (1659 of 2150) PASS: lldb-unit :: Utility/./UtilityTests/StreamTest.PutHex64ByteOrderLittle (1660 of 2150) PASS: lldb-unit :: Utility/./UtilityTests/RangeTest.LessThanInvalid (1661 of 2150) PASS: lldb-unit :: Utility/./UtilityTests/EnvironmentTest.EnvpConstruction (1662 of 2150) UNSUPPORTED: lldb-shell :: Expr/TestIRMemoryMapWindows.test (1663 of 2150) UNSUPPORTED: lldb-shell :: Register/x86-64-ymm16-read.test (1664 of 2150) PASS: lldb-unit :: SymbolFile/NativePDB/./SymbolFileNativePDBTests/PDBFPOProgramToDWARFExpressionTests.MultipleDependentAssignments (1665 of 2150) PASS: lldb-api :: commands/expression/dollar-in-variable/TestDollarInVariable.py (1666 of 2150) PASS: lldb-api :: lang/cpp/modules-import/TestCXXModulesImport.py (1667 of 2150) PASS: lldb-shell :: Driver/TestTarget.test (1668 of 2150) PASS: lldb-unit :: Core/./LLDBCoreTests/ModuleSpecTest.InvalidInMemoryBuffer (1669 of 2150) PASS: lldb-unit :: Process/gdb-remote/./ProcessGdbRemoteTests/GDBRemoteCommunicationClientTest.WriteRegisterNoSuffix (1670 of 2150) PASS: lldb-unit :: Utility/./UtilityTests/ArgsTest.AppendArguments (1671 of 2150) PASS: lldb-shell :: Expr/TestMultilineExpr.test (1672 of 2150) PASS: lldb-shell :: ExecControl/StopHook/stop-hook.test (1673 of 2150) PASS: lldb-shell :: SymbolFile/DWARF/dwarf5_locations.s (1674 of 2150) PASS: lldb-api :: lang/objc/modules-app-update/TestClangModulesAppUpdate.py (1675 of 2150) PASS: lldb-unit :: Utility/./UtilityTests/StringExtractorTest.GetHexBytesAvail (1676 of 2150) PASS: lldb-api :: commands/expression/import_builtin_fileid/TestImportBuiltinFileID.py (1677 of 2150) PASS: lldb-api :: types/TestCharType.py (1678 of 2150) UNSUPPORTED: lldb-shell :: SymbolFile/PDB/expressions.test (1679 of 2150) PASS: lldb-shell :: Commands/command-script-import.test (1680 of 2150) PASS: lldb-unit :: Utility/./UtilityTests/VASprintfTest.EncodingError (1681 of 2150) PASS: lldb-unit :: Utility/./UtilityTests/StringLexerTest.AdvanceIf (1682 of 2150) PASS: lldb-shell :: SymbolFile/DWARF/parallel-indexing-stress.s (1683 of 2150) PASS: lldb-api :: functionalities/data-formatter/nsarraysynth/TestNSArraySynthetic.py (1684 of 2150) PASS: lldb-unit :: ScriptInterpreter/Python/./ScriptInterpreterPythonTests/PythonDataObjectsTest.TestExtractingUInt64ThroughStructuredData (1685 of 2150) PASS: lldb-shell :: SymbolFile/Breakpad/line-table-discontinuous-file-ids.test (1686 of 2150) PASS: lldb-unit :: Target/./TargetTests/StackFrameRecognizerTest.NullModuleRegex (1687 of 2150) UNSUPPORTED: lldb-api :: tools/lldb-server/TestGdbRemoteCompletion.py (1688 of 2150) PASS: lldb-api :: lang/cpp/auto/TestCPPAuto.py (1689 of 2150) UNSUPPORTED: lldb-shell :: ObjectFile/ELF/minidebuginfo-no-lzma.yaml (1690 of 2150) PASS: lldb-unit :: Process/gdb-remote/./ProcessGdbRemoteTests/GDBRemoteCommunicationServerTest.SendErrorResponse_ErrorList (1691 of 2150) PASS: lldb-unit :: Utility/./UtilityTests/StreamTest.ShiftOperatorPtr (1692 of 2150) PASS: lldb-unit :: Utility/./UtilityTests/RangeVector.CombineConsecutiveRanges (1693 of 2150) PASS: lldb-unit :: Host/./HostTests/SocketAddressTest.GetAddressInfo (1694 of 2150) PASS: lldb-api :: functionalities/data-formatter/data-formatter-stl/libcxx/list/TestDataFormatterLibcxxList.py (1695 of 2150) PASS: lldb-api :: python_api/name_lookup/TestNameLookup.py (1696 of 2150) PASS: lldb-unit :: Utility/./UtilityTests/RangeTest.ContainsAddr (1697 of 2150) PASS: lldb-api :: functionalities/thread/exit_during_expression/TestExitDuringExpression.py (1698 of 2150) PASS: lldb-unit :: ObjectFile/Breakpad/./ObjectFileBreakpadTests/ModuleRecord.parse (1699 of 2150) PASS: lldb-unit :: Language/Highlighting/./HighlighterTests/HighlighterTest.FallbackHighlighter (1700 of 2150) PASS: lldb-shell :: ObjectFile/PECOFF/sections.yaml (1701 of 2150) PASS: lldb-api :: functionalities/data-formatter/format-propagation/TestFormatPropagation.py (1702 of 2150) PASS: lldb-api :: commands/expression/context-object-objc/TestContextObjectObjc.py (1703 of 2150) PASS: lldb-api :: commands/target/basic/TestTargetCommand.py (1704 of 2150) PASS: lldb-unit :: Host/./HostTests/SocketTest.TCPGetAddress (1705 of 2150) PASS: lldb-unit :: Host/./HostTests/NativeProcessProtocolTest.SetBreakpointFailVerify (1706 of 2150) PASS: lldb-unit :: Host/./HostTests/NativeProcessProtocolTest.ReadCStringFromMemory_CrossPageBoundary (1707 of 2150) PASS: lldb-api :: commands/command/script/import/rdar-12586188/TestRdar12586188.py (1708 of 2150) PASS: lldb-shell :: ObjectFile/ELF/netbsd-exec-8.99.30-amd64.yaml (1709 of 2150) PASS: lldb-unit :: Host/./HostTests/FileActionTest.Open (1710 of 2150) PASS: lldb-api :: functionalities/data-formatter/boolreference/TestFormattersBoolRefPtr.py (1711 of 2150) PASS: lldb-api :: lang/objcxx/cxx-bridged-po/TestObjCXXBridgedPO.py (1712 of 2150) PASS: lldb-api :: lang/objc/objc-runtime-ivars/TestRuntimeIvars.py (1713 of 2150) PASS: lldb-api :: functionalities/load_using_paths/TestLoadUsingPaths.py (1714 of 2150) PASS: lldb-unit :: Utility/./UtilityTests/XcodeSDKTest.SDKSupportsSwift (1715 of 2150) PASS: lldb-api :: functionalities/data-formatter/summary-string-onfail/Test-rdar-9974002.py (1716 of 2150) PASS: lldb-unit :: Language/Highlighting/./HighlighterTests/HighlighterTest.ClangCommas (1717 of 2150) PASS: lldb-api :: types/TestLongTypesExpr.py (1718 of 2150) PASS: lldb-unit :: Utility/./UtilityTests/NameMatchesTest.Contains (1719 of 2150) PASS: lldb-api :: functionalities/avoids-fd-leak/TestFdLeak.py (1720 of 2150) PASS: lldb-api :: commands/expression/import-std-module/empty-module/TestEmptyStdModule.py (1721 of 2150) PASS: lldb-unit :: UnwindAssembly/x86/./UnwindAssemblyx86Tests/Testx86AssemblyInspectionEngine.Test32bitFramelessSmallStackFrame (1722 of 2150) PASS: lldb-api :: functionalities/postmortem/elf-core/thread_crash/TestLinuxCoreThreads.py (1723 of 2150) PASS: lldb-api :: arm/emulation/TestEmulations.py (1724 of 2150) PASS: lldb-shell :: Breakpoint/dummy-target.test (1725 of 2150) PASS: lldb-unit :: Utility/./UtilityTests/BinaryStreamTest.PutULEB128NineBytes (1726 of 2150) PASS: lldb-api :: functionalities/gdb_remote_client/TestNoGPacketSupported.py (1727 of 2150) PASS: lldb-unit :: ScriptInterpreter/Python/./ScriptInterpreterPythonTests/PythonDataObjectsTest.TestPythonString (1728 of 2150) PASS: lldb-api :: functionalities/thread/concurrent_events/TestConcurrentSignalDelayWatch.py (1729 of 2150) PASS: lldb-unit :: Utility/./UtilityTests/OptionsWithRawTest.QuotedSuffix (1730 of 2150) PASS: lldb-unit :: Utility/./UtilityTests/GeneratorTest.Create (1731 of 2150) PASS: lldb-shell :: SymbolFile/NativePDB/tag-types.cpp (1732 of 2150) PASS: lldb-api :: python_api/module_section/TestModuleAndSection.py (1733 of 2150) PASS: lldb-api :: commands/breakpoint/set/func-regex/TestBreakpointRegexError.py (1734 of 2150) UNSUPPORTED: lldb-shell :: Register/aarch64-gp-read.test (1735 of 2150) PASS: lldb-unit :: Host/./HostTests/SocketTest.DomainListenConnectAccept (1736 of 2150) PASS: lldb-api :: functionalities/thread/state_after_expression/TestStateAfterExpression.py (1737 of 2150) UNSUPPORTED: lldb-api :: commands/expression/completion-crash-invalid-iterator/TestInvalidIteratorCompletionCrash.py (1738 of 2150) UNSUPPORTED: lldb-api :: macosx/macCatalystAppMacOSFramework/TestMacCatalystAppWithMacOSFramework.py (1739 of 2150) PASS: lldb-api :: functionalities/wrong_commands/TestWrongCommands.py (1740 of 2150) PASS: lldb-api :: lang/cpp/dynamic-value-same-basename/TestDynamicValueSameBase.py (1741 of 2150) PASS: lldb-unit :: Language/Highlighting/./HighlighterTests/HighlighterTest.ClangUnterminatedString (1742 of 2150) PASS: lldb-api :: commands/expression/import-std-module/weak_ptr/TestWeakPtrFromStdModule.py (1743 of 2150) PASS: lldb-unit :: Utility/./UtilityTests/CompletionRequest.ShiftArguments (1744 of 2150) PASS: lldb-shell :: ObjectFile/Breakpad/breakpad-identification.test (1745 of 2150) PASS: lldb-unit :: Utility/./UtilityTests/StringListTest.CopyList (1746 of 2150) PASS: lldb-unit :: Utility/./UtilityTests/UriParserTest.BracketedHostnameWithPortIPv4 (1747 of 2150) PASS: lldb-unit :: SymbolFile/NativePDB/./SymbolFileNativePDBTests/PDBFPOProgramToDWARFExpressionTests.InvalidAssignmentSingle (1748 of 2150) PASS: lldb-shell :: ObjectFile/PECOFF/disassemble-thumb.yaml (1749 of 2150) PASS: lldb-shell :: Breakpoint/debug_rnglist_basic.test (1750 of 2150) PASS: lldb-unit :: Utility/./UtilityTests/CompletionRequest.FakeLastArg (1751 of 2150) PASS: lldb-api :: lang/objc/objc-struct-argument/TestObjCStructArgument.py (1752 of 2150) UNSUPPORTED: lldb-api :: functionalities/process_save_core/TestProcessSaveCore.py (1753 of 2150) PASS: lldb-api :: commands/command/script_alias/TestCommandScriptAlias.py (1754 of 2150) UNSUPPORTED: lldb-shell :: Register/x86-64-zmm-write.test (1755 of 2150) PASS: lldb-unit :: Utility/./UtilityTests/BinaryStreamTest.PutULEB128One (1756 of 2150) UNSUPPORTED: lldb-api :: tools/lldb-server/platform-process-connect/TestPlatformProcessConnect.py (1757 of 2150) PASS: lldb-unit :: Target/./TargetTests/ExecutionContextTest.GetByteOrderTarget (1758 of 2150) PASS: lldb-unit :: Symbol/./SymbolTests/TestClangASTImporter.MetadataPropagationAfterCopying (1759 of 2150) PASS: lldb-api :: functionalities/thread/concurrent_events/TestConcurrentTwoWatchpointsOneBreakpoint.py (1760 of 2150) PASS: lldb-shell :: SymbolFile/DWARF/dwo-type-in-main-file.s (1761 of 2150) PASS: lldb-api :: functionalities/data-formatter/nsdictionarysynth/TestNSDictionarySynthetic.py (1762 of 2150) PASS: lldb-api :: lang/objc/foundation/TestFoundationDisassembly.py (1763 of 2150) PASS: lldb-unit :: Language/CPlusPlus/./LanguageCPlusPlusTests/CPlusPlusLanguage.ExtractContextAndIdentifier (1764 of 2150) PASS: lldb-api :: functionalities/breakpoint/breakpoint_ids/TestBreakpointIDs.py (1765 of 2150) PASS: lldb-api :: python_api/function_symbol/TestDisasmAPI.py (1766 of 2150) PASS: lldb-shell :: Register/x86-64-gp-read.test (1767 of 2150) PASS: lldb-api :: functionalities/thread/concurrent_events/TestConcurrentSignalNWatchNBreak.py (1768 of 2150) PASS: lldb-api :: functionalities/thread/step_out/TestThreadStepOut.py (1769 of 2150) PASS: lldb-unit :: Utility/./UtilityTests/DataExtractorTest.GetMaxS64 (1770 of 2150) PASS: lldb-unit :: ScriptInterpreter/Python/./ScriptInterpreterPythonTests/PythonDataObjectsTest.TestPythonDictionaryToStructuredDictionary (1771 of 2150) PASS: lldb-api :: lang/c/function_types/TestFunctionTypes.py (1772 of 2150) PASS: lldb-unit :: Utility/./UtilityTests/StringListTest.ShiftCString (1773 of 2150) PASS: lldb-unit :: Utility/./UtilityTests/DataExtractorTest.GetCStrAtNullOffset (1774 of 2150) PASS: lldb-shell :: SymbolFile/DWARF/find-method.cpp (1775 of 2150) PASS: lldb-api :: commands/watchpoints/watchpoint_set_command/TestWatchLocationWithWatchSet.py (1776 of 2150) PASS: lldb-api :: lang/cpp/char1632_t/TestChar1632T.py (1777 of 2150) UNSUPPORTED: lldb-api :: functionalities/darwin_log/filter/exact_match/activity/TestDarwinLogFilterMatchActivity.py (1778 of 2150) PASS: lldb-api :: python_api/symbol-context/TestSymbolContext.py (1779 of 2150) PASS: lldb-api :: lang/cpp/virtual-functions/TestCppVirtualFunctions.py (1780 of 2150) PASS: lldb-unit :: SymbolFile/NativePDB/./SymbolFileNativePDBTests/PDBFPOProgramToDWARFExpressionTests.DependencyChain (1781 of 2150) PASS: lldb-api :: commands/expression/class_template_specialization_empty_pack/TestClassTemplateSpecializationParametersHandling.py (1782 of 2150) UNSUPPORTED: lldb-shell :: SymbolFile/PDB/pointers.test (1783 of 2150) PASS: lldb-api :: commands/frame/diagnose/local-variable/TestLocalVariable.py (1784 of 2150) PASS: lldb-unit :: Utility/./UtilityTests/ArgsTest.TestSingleArgWithQuotedSpace (1785 of 2150) PASS: lldb-api :: lang/cpp/call-function/TestCallCPPFunction.py (1786 of 2150) PASS: lldb-api :: lang/cpp/operator-overload/TestOperatorOverload.py (1787 of 2150) PASS: lldb-unit :: ScriptInterpreter/Python/./ScriptInterpreterPythonTests/PythonDataObjectsTest.TestPythonTupleToStructuredList (1788 of 2150) PASS: lldb-api :: functionalities/jitloader_gdb/TestJITLoaderGDB.py (1789 of 2150) PASS: lldb-unit :: UnwindAssembly/x86/./UnwindAssemblyx86Tests/Testx86AssemblyInspectionEngine.TestPushImm (1790 of 2150) PASS: lldb-shell :: SymbolFile/DWARF/clang-ast-from-dwarf-unamed-and-anon-structs.cpp (1791 of 2150) PASS: lldb-unit :: UnwindAssembly/x86/./UnwindAssemblyx86Tests/Testx86AssemblyInspectionEngine.TestPushR13 (1792 of 2150) PASS: lldb-shell :: Commands/command-target-modules-dump-sections.yaml (1793 of 2150) PASS: lldb-api :: functionalities/data-formatter/data-formatter-stl/libcxx/atomic/TestLibCxxAtomic.py (1794 of 2150) PASS: lldb-api :: functionalities/optimized_code/TestNoASanExceptionAfterEvalOP_piece.py (1795 of 2150) XFAIL: lldb-shell :: Register/x86-64-write.test (1796 of 2150) UNSUPPORTED: lldb-api :: functionalities/darwin_log/filter/exact_match/category/TestDarwinLogFilterMatchCategory.py (1797 of 2150) PASS: lldb-api :: commands/expression/ir-interpreter/TestIRInterpreter.py (1798 of 2150) PASS: lldb-api :: lang/c/inlines/TestRedefinitionsInInlines.py (1799 of 2150) PASS: lldb-api :: lang/cpp/char8_t/TestCxxChar8_t.py (1800 of 2150) PASS: lldb-unit :: Host/./HostTests/FileSystemTest.Exists (1801 of 2150) PASS: lldb-unit :: Utility/./UtilityTests/ScalarTest.ComparisonFloat (1802 of 2150) PASS: lldb-api :: tools/lldb-server/TestGdbRemoteHostInfo.py (1803 of 2150) PASS: lldb-api :: lang/objc/objc-class-method/TestObjCClassMethod.py (1804 of 2150) PASS: lldb-unit :: Expression/./ExpressionTests/DiagnosticManagerTest.PutStringSeverities (1805 of 2150) PASS: lldb-unit :: Utility/./UtilityTests/StreamTest.PutHex32ByteOrderLittle (1806 of 2150) PASS: lldb-shell :: ObjectFile/PECOFF/symbol.yaml (1807 of 2150) PASS: lldb-api :: commands/expression/result_numbering/TestResultNumbering.py (1808 of 2150) PASS: lldb-api :: lang/cpp/rvalue-references/TestRvalueReferences.py (1809 of 2150) PASS: lldb-unit :: Core/./LLDBCoreTests/SourceFileCache.FindSourceFileFound (1810 of 2150) PASS: lldb-unit :: Utility/./UtilityTests/CompletionRequest.TestCompletionOwnership (1811 of 2150) PASS: lldb-api :: functionalities/data-formatter/data-formatter-synth/TestDataFormatterSynth.py (1812 of 2150) PASS: lldb-api :: commands/frame/diagnose/inheritance/TestDiagnoseInheritance.py (1813 of 2150) PASS: lldb-api :: python_api/breakpoint/TestBreakpointAPI.py (1814 of 2150) PASS: lldb-shell :: SymbolFile/DWARF/split-dwarf-inlining.cpp (1815 of 2150) PASS: lldb-unit :: Utility/./UtilityTests/StreamTest.PutCharWhitespace (1816 of 2150) PASS: lldb-unit :: SymbolFile/DWARF/./SymbolFileDWARFTests/DWARFASTParserClangTests.EnsureAllDIEsInDeclContextHaveBeenParsedParsesOnlyMatchingEntries (1817 of 2150) PASS: lldb-api :: lang/cpp/offsetof/TestOffsetofCpp.py (1818 of 2150) PASS: lldb-api :: api/listeners/TestListener.py (1819 of 2150) PASS: lldb-unit :: Host/./HostTests/SocketTest.UDPGetConnectURI (1820 of 2150) PASS: lldb-unit :: Process/gdb-remote/./ProcessGdbRemoteTests/GDBRemoteClientBaseTest.SendContinueAndWait (1821 of 2150) PASS: lldb-unit :: ObjectFile/MachO/./ObjectFileMachOTests/ObjectFileMachOTest.ModuleFromSharedCacheInfo (1822 of 2150) PASS: lldb-unit :: Utility/./UtilityTests/UriParserTest.LongPath (1823 of 2150) PASS: lldb-shell :: Reproducer/TestDiscard.test (1824 of 2150) PASS: lldb-api :: commands/platform/basic/TestPlatformCommand.py (1825 of 2150) PASS: lldb-shell :: ObjectFile/ELF/many-sections.s (1826 of 2150) PASS: lldb-api :: functionalities/reproducers/attach/TestReproducerAttach.py (1827 of 2150) UNSUPPORTED: lldb-shell :: Breakpoint/case-insensitive.test (1828 of 2150) PASS: lldb-api :: commands/target/select/TestTargetSelect.py (1829 of 2150) PASS: lldb-unit :: Utility/./UtilityTests/BinaryStreamTest.PutSLEB128FourBytes (1830 of 2150) PASS: lldb-api :: commands/expression/multiline-completion/TestMultilineCompletion.py (1831 of 2150) PASS: lldb-unit :: Utility/./UtilityTests/OptionsWithRawTest.EmptyInput (1832 of 2150) PASS: lldb-unit :: Host/./HostTests/ConnectionFileDescriptorTest.TCPGetURIv6 (1833 of 2150) PASS: lldb-api :: tools/lldb-server/TestGdbRemoteSingleStep.py (1834 of 2150) PASS: lldb-shell :: Minidump/Windows/Sigsegv/sigsegv.test (1835 of 2150) PASS: lldb-api :: functionalities/gdb_remote_client/TestNestedRegDefinitions.py (1836 of 2150) PASS: lldb-api :: commands/frame/var/TestFrameVar.py (1837 of 2150) PASS: lldb-unit :: Utility/./UtilityTests/SerializationRountripTest.SerializeDeserializeCStringNull (1838 of 2150) PASS: lldb-unit :: Utility/./UtilityTests/StringExtractorTest.DecodeHexU8_Extra (1839 of 2150) PASS: lldb-api :: functionalities/unwind/noreturn/TestNoreturnUnwind.py (1840 of 2150) PASS: lldb-shell :: Reproducer/Functionalities/TestExpressionEvaluation.test (1841 of 2150) UNSUPPORTED: lldb-api :: functionalities/tty/TestTerminal.py (1842 of 2150) PASS: lldb-unit :: Utility/./UtilityTests/BinaryStreamTest.PutULEB128SixBytes (1843 of 2150) PASS: lldb-unit :: Utility/./UtilityTests/ScalarTest.Division (1844 of 2150) UNSUPPORTED: lldb-shell :: SymbolFile/PDB/function-nested-block.test (1845 of 2150) PASS: lldb-unit :: Language/Highlighting/./HighlighterTests/HighlighterTest.ClangSquareBrackets (1846 of 2150) PASS: lldb-api :: sample_test/TestSampleInlineTest.py (1847 of 2150) PASS: lldb-unit :: DataFormatter/./LLDBFormatterTests/TypeMatcherTests.GetMatchStringRegex (1848 of 2150) PASS: lldb-api :: iohandler/unicode/TestUnicode.py (1849 of 2150) PASS: lldb-api :: lang/objc/objc-struct-return/TestObjCStructReturn.py (1850 of 2150) PASS: lldb-api :: lang/c/record_decl_in_expr/TestRecordDeclInExpr.py (1851 of 2150) PASS: lldb-unit :: DataFormatter/./LLDBFormatterTests/StringPrinterTests.CxxASCII (1852 of 2150) UNSUPPORTED: lldb-shell :: SymbolFile/PDB/variables-locations.test (1853 of 2150) PASS: lldb-api :: functionalities/dead-strip/TestDeadStrip.py (1854 of 2150) PASS: lldb-api :: macosx/universal/TestUniversal.py (1855 of 2150) PASS: lldb-unit :: debugserver/./debugserverTests/RNBSocket.LoopBackListenIPv4 (1856 of 2150) PASS: lldb-api :: tools/lldb-server/inferior-crash/TestGdbRemoteSegFault.py (1857 of 2150) PASS: lldb-api :: tools/lldb-vscode/variables/TestVSCode_variables.py (1858 of 2150) PASS: lldb-api :: python_api/thread/TestThreadAPI.py (1859 of 2150) PASS: lldb-unit :: Core/./LLDBCoreTests/UniqueCStringMap.NoDefaultConstructor (1860 of 2150) PASS: lldb-shell :: ObjectFile/ELF/PT_LOAD-empty.yaml (1861 of 2150) PASS: lldb-unit :: Symbol/./SymbolTests/TestClangASTImporter.MetadataPropagation (1862 of 2150) PASS: lldb-api :: python_api/objc_type/TestObjCType.py (1863 of 2150) PASS: lldb-api :: functionalities/unwind/noreturn/module-end/TestNoReturnModuleEnd.py (1864 of 2150) PASS: lldb-shell :: Settings/TestLineMarkerColor.test (1865 of 2150) UNSUPPORTED: lldb-api :: linux/sepdebugsymlink/TestTargetSymbolsSepDebugSymlink.py (1866 of 2150) PASS: lldb-api :: functionalities/data-formatter/data-formatter-objc/TestDataFormatterObjCNSBundle.py (1867 of 2150) PASS: lldb-unit :: Utility/./UtilityTests/StreamTeeTest.Flush (1868 of 2150) PASS: lldb-shell :: Quit/TestQuitExitCodeNonInt.test (1869 of 2150) PASS: lldb-api :: functionalities/breakpoint/step_over_breakpoint/TestStepOverBreakpoint.py (1870 of 2150) PASS: lldb-unit :: Utility/./UtilityTests/SerializationRountripTest.SerializeDeserializeObjectReference (1871 of 2150) PASS: lldb-api :: lang/objc/foundation/TestObjCMethods2.py (1872 of 2150) PASS: lldb-api :: functionalities/inferior-crashing/recursive-inferior/TestRecursiveInferiorStep.py (1873 of 2150) PASS: lldb-api :: functionalities/tail_call_frames/unambiguous_sequence/TestUnambiguousTailCalls.py (1874 of 2150) PASS: lldb-unit :: Utility/./UtilityTests/StringListTest.DefaultConstructor (1875 of 2150) PASS: lldb-api :: functionalities/thread_plan/TestThreadPlanCommands.py (1876 of 2150) PASS: lldb-api :: lang/objc/modules-non-objc-target/TestObjCModulesNonObjCTarget.py (1877 of 2150) PASS: lldb-unit :: Utility/./UtilityTests/RecordReplayTest.InstrumentedBarPtr (1878 of 2150) PASS: lldb-unit :: Utility/./UtilityTests/ArchSpecTest.TestParseMachCPUDashSubtypeTripleSimple (1879 of 2150) PASS: lldb-api :: python_api/sblaunchinfo/TestSBLaunchInfo.py (1880 of 2150) PASS: lldb-unit :: Platform/./LLDBPlatformTests/PlatformAppleSimulatorTest.TestHostPlatformToSim (1881 of 2150) PASS: lldb-shell :: Unwind/eh-frame-dwarf-unwind.test (1882 of 2150) PASS: lldb-api :: iohandler/autosuggestion/TestAutosuggestion.py (1883 of 2150) PASS: lldb-unit :: Utility/./UtilityTests/ScalarTest.CastOperations (1884 of 2150) PASS: lldb-unit :: Utility/./UtilityTests/CompletionRequest.TryCompleteCurrentArgGood (1885 of 2150) PASS: lldb-unit :: Language/Highlighting/./HighlighterTests/HighlighterTest.DefaultHighlighterWithCursorOutOfBounds (1886 of 2150) UNSUPPORTED: lldb-shell :: Reproducer/TestLuaImport.test (1887 of 2150) PASS: lldb-api :: lang/cpp/class_types/TestClassTypesDisassembly.py (1888 of 2150) PASS: lldb-unit :: UnwindAssembly/PPC64/./PPC64InstEmulationTests/TestPPC64InstEmulation.TestSimpleFunction (1889 of 2150) PASS: lldb-unit :: Core/./LLDBCoreTests/MangledTest.EmptyForInvalidName (1890 of 2150) PASS: lldb-api :: functionalities/data-formatter/typedef_array/TestTypedefArray.py (1891 of 2150) PASS: lldb-api :: functionalities/thread/concurrent_events/TestConcurrentSignalDelayBreak.py (1892 of 2150) PASS: lldb-unit :: Utility/./UtilityTests/AnsiTerminal.KnownPrefix (1893 of 2150) PASS: lldb-unit :: Utility/./UtilityTests/OptionsWithRawTest.EmptyArgsOnlySuffix (1894 of 2150) PASS: lldb-api :: functionalities/data-formatter/data-formatter-stl/libcxx/unordered/TestDataFormatterUnordered.py (1895 of 2150) PASS: lldb-unit :: Expression/./ExpressionTests/CppModuleConfigurationTest.LibCppV2 (1896 of 2150) PASS: lldb-shell :: SymbolFile/DWARF/debug-types-missing-signature.test (1897 of 2150) PASS: lldb-api :: functionalities/gdb_remote_client/TestqOffsets.py (1898 of 2150) PASS: lldb-shell :: ObjectFile/PECOFF/basic-info-arm64.yaml (1899 of 2150) PASS: lldb-api :: lang/cpp/overloaded-functions/TestOverloadedFunctions.py (1900 of 2150) PASS: lldb-unit :: Utility/./UtilityTests/LogChannelTest.List (1901 of 2150) PASS: lldb-api :: lang/objc/real-definition/TestRealDefinition.py (1902 of 2150) PASS: lldb-unit :: Language/CPlusPlus/./LanguageCPlusPlusTests/CPlusPlusLanguage.CPlusPlusNameParser (1903 of 2150) PASS: lldb-shell :: SymbolFile/NativePDB/break-by-function.cpp (1904 of 2150) PASS: lldb-api :: commands/log/invalid-args/TestInvalidArgsLog.py (1905 of 2150) PASS: lldb-unit :: Utility/./UtilityTests/LogChannelEnabledTest.LLDB_LOG_ERROR (1906 of 2150) PASS: lldb-unit :: DataFormatter/./LLDBFormatterTests/StringPrinterTests.SwiftUTF8 (1907 of 2150) PASS: lldb-api :: functionalities/memory/cache/TestMemoryCache.py (1908 of 2150) PASS: lldb-api :: python_api/value/change_values/TestChangeValueAPI.py (1909 of 2150) UNSUPPORTED: lldb-api :: commands/trace/TestTraceLoad.py (1910 of 2150) PASS: lldb-shell :: SymbolFile/NativePDB/ast-functions.cpp (1911 of 2150) PASS: lldb-api :: lang/cpp/lambdas/TestLambdas.py (1912 of 2150) PASS: lldb-api :: functionalities/multidebugger_commands/TestMultipleDebuggersCommands.py (1913 of 2150) UNSUPPORTED: lldb-api :: tools/lldb-server/TestGdbRemoteAuxvSupport.py (1914 of 2150) PASS: lldb-unit :: ScriptInterpreter/Python/./ScriptInterpreterPythonTests/PythonDataObjectsTest.TestOwnedReferences (1915 of 2150) PASS: lldb-unit :: Symbol/./SymbolTests/TestClangASTImporter.CopyDeclTagDecl (1916 of 2150) PASS: lldb-unit :: Utility/./UtilityTests/LogChannelEnabledTest.LogThread (1917 of 2150) PASS: lldb-unit :: Utility/./UtilityTests/ArgsTest.ReplaceArgumentAtIndexEqual (1918 of 2150) PASS: lldb-unit :: Process/minidump/./LLDBMinidumpTests/MinidumpParserTest.GetThreadContext_x86_32_wow64 (1919 of 2150) PASS: lldb-unit :: Utility/./UtilityTests/StringListTest.AppendStringStdString (1920 of 2150) PASS: lldb-shell :: SymbolFile/DWARF/dwarf5-atomic.s (1921 of 2150) PASS: lldb-api :: tools/lldb-vscode/stackTrace/TestVSCode_stackTrace.py (1922 of 2150) PASS: lldb-unit :: UnwindAssembly/x86/./UnwindAssemblyx86Tests/Testx86AssemblyInspectionEngine.TestStackRealign32BitDisp_x86_64 (1923 of 2150) PASS: lldb-unit :: SymbolFile/NativePDB/./SymbolFileNativePDBTests/PDBFPOProgramToDWARFExpressionTests.InvalidAssignmentMultiple (1924 of 2150) PASS: lldb-unit :: Utility/./UtilityTests/ArgsTest.TestMultipleArgs (1925 of 2150) PASS: lldb-shell :: SymbolFile/DWARF/debug-types-basic.test (1926 of 2150) PASS: lldb-api :: functionalities/data-formatter/data-formatter-categories/TestDataFormatterCategories.py (1927 of 2150) PASS: lldb-unit :: Utility/./UtilityTests/StringListTest.Join (1928 of 2150) PASS: lldb-api :: lang/objc/objc-baseclass-sbtype/TestObjCBaseClassSBType.py (1929 of 2150) PASS: lldb-unit :: Symbol/./SymbolTests/PostfixExpression.ToDWARF (1930 of 2150) PASS: lldb-api :: lang/c/blocks/TestBlocks.py (1931 of 2150) PASS: lldb-unit :: UnwindAssembly/x86/./UnwindAssemblyx86Tests/Testx86AssemblyInspectionEngine.TestPushR12 (1932 of 2150) PASS: lldb-unit :: Utility/./UtilityTests/StringListTest.AppendListCStringArray (1933 of 2150) PASS: lldb-api :: functionalities/thread/concurrent_events/TestConcurrentWatchpointDelayWatchpointOneBreakpoint.py (1934 of 2150) PASS: lldb-api :: functionalities/stats_api/TestStatisticsAPI.py (1935 of 2150) PASS: lldb-api :: types/TestDoubleTypes.py (1936 of 2150) PASS: lldb-unit :: Utility/./UtilityTests/FileSpecTest.EqualDotsPosixRoot (1937 of 2150) PASS: lldb-unit :: Expression/./ExpressionTests/DWARFExpression.DW_OP_convert (1938 of 2150) PASS: lldb-api :: functionalities/data-formatter/poarray/TestPrintObjectArray.py (1939 of 2150) PASS: lldb-shell :: ObjectFile/PECOFF/uuid.yaml (1940 of 2150) PASS: lldb-unit :: Process/gdb-remote/./ProcessGdbRemoteTests/GDBRemoteCommunicationServerTest.SendErrorResponse_Status (1941 of 2150) PASS: lldb-unit :: Editline/./EditlineTests/EditlineTestFixture.EditlineReceivesSingleLineText (1942 of 2150) PASS: lldb-unit :: Process/minidump/./LLDBMinidumpTests/MinidumpParserTest.MinidumpDuplicateModuleMappedSecond (1943 of 2150) PASS: lldb-unit :: Language/CPlusPlus/./LanguageCPlusPlusTests/CPlusPlusLanguage.FindAlternateFunctionManglings (1944 of 2150) PASS: lldb-api :: commands/frame/select/TestFrameSelect.py (1945 of 2150) PASS: lldb-unit :: Utility/./UtilityTests/EventTest.DumpEventDataBytes (1946 of 2150) PASS: lldb-unit :: Utility/./UtilityTests/RangeTest.NotEqual (1947 of 2150) UNSUPPORTED: lldb-shell :: ScriptInterpreter/Lua/independent_state.test (1948 of 2150) PASS: lldb-unit :: Utility/./UtilityTests/StringExtractorTest.DecodeHexU8_InvalidHex (1949 of 2150) PASS: lldb-unit :: UnwindAssembly/x86/./UnwindAssemblyx86Tests/Testx86AssemblyInspectionEngine.TestPushR15 (1950 of 2150) PASS: lldb-shell :: SymbolFile/DWARF/DW_AT_declaration-with-children.s (1951 of 2150) UNSUPPORTED: lldb-api :: lang/objc/rdar-12408181/TestRdar12408181.py (1952 of 2150) PASS: lldb-api :: commands/expression/context-object/TestContextObject.py (1953 of 2150) PASS: lldb-api :: commands/target/create-no-such-arch/TestNoSuchArch.py (1954 of 2150) PASS: lldb-api :: commands/expression/invalid-args/TestInvalidArgsExpression.py (1955 of 2150) PASS: lldb-unit :: Utility/./UtilityTests/RangeDataVector.CustomSort (1956 of 2150) PASS: lldb-unit :: Host/./HostTests/Host.WaitStatusFormat (1957 of 2150) PASS: lldb-unit :: Host/./HostTests/SocketTest.TCPListen0GetPort (1958 of 2150) PASS: lldb-api :: commands/expression/test/TestExprs.py (1959 of 2150) PASS: lldb-api :: lang/objc/unicode-string/TestUnicodeString.py (1960 of 2150) PASS: lldb-shell :: SymbolFile/DWARF/DW_TAG_variable-DW_AT_const_value.s (1961 of 2150) PASS: lldb-unit :: Utility/./UtilityTests/Flags.Test (1962 of 2150) PASS: lldb-api :: functionalities/gdb_remote_client/TestProcessConnect.py (1963 of 2150) PASS: lldb-api :: functionalities/data-formatter/data-formatter-stl/libcxx/optional/TestDataFormatterLibcxxOptional.py (1964 of 2150) PASS: lldb-unit :: Host/./HostTests/SocketTest.UDPConnect (1965 of 2150) PASS: lldb-api :: functionalities/thread/concurrent_events/TestConcurrentTwoBreakpointsOneWatchpoint.py (1966 of 2150) UNSUPPORTED: lldb-api :: functionalities/data-formatter/data-formatter-stl/libstdcpp/iterator/TestDataFormatterStdIterator.py (1967 of 2150) PASS: lldb-unit :: Utility/./UtilityTests/XcodeSDKTest.FindXcodeContentsDirectoryInPath (1968 of 2150) PASS: lldb-unit :: SymbolFile/DWARF/./SymbolFileDWARFTests/SymbolFileDWARFTests.TestAbbrevOrder1Start1 (1969 of 2150) PASS: lldb-shell :: SymbolFile/DWARF/find-basic-type.cpp (1970 of 2150) PASS: lldb-unit :: Interpreter/./InterpreterTests/CompletionTest.DirCompletionUsername (1971 of 2150) PASS: lldb-unit :: Process/minidump/./LLDBMinidumpTests/MinidumpParserTest.GetMemory (1972 of 2150) PASS: lldb-unit :: ObjectFile/Breakpad/./ObjectFileBreakpadTests/Record.classify (1973 of 2150) PASS: lldb-shell :: ObjectFile/ELF/PT_LOAD-overlap-section.yaml (1974 of 2150) PASS: lldb-api :: functionalities/thread/concurrent_events/TestConcurrentDelayedCrashWithBreakpointWatchpoint.py (1975 of 2150) PASS: lldb-api :: functionalities/pre_run_dylibs/TestPreRunDylibs.py (1976 of 2150) PASS: lldb-shell :: ObjectFile/wasm/basic.yaml (1977 of 2150) PASS: lldb-unit :: Editline/./EditlineTests/EditlineTestFixture.EditlineReceivesMultiLineText (1978 of 2150) PASS: lldb-shell :: ObjectFile/ELF/PT_LOAD-overlap-PT_INTERP.yaml (1979 of 2150) PASS: lldb-unit :: Utility/./UtilityTests/Flags.AnySet (1980 of 2150) UNSUPPORTED: lldb-shell :: Process/Windows/exception_access_violation.cpp (1981 of 2150) PASS: lldb-unit :: Utility/./UtilityTests/StreamTeeTest.SetStreamAtIndexOutOfBounds (1982 of 2150) PASS: lldb-shell :: Driver/LocalLLDBInit.test (1983 of 2150) PASS: lldb-unit :: Utility/./UtilityTests/StringListTest.InsertStringAtIndexStart (1984 of 2150) PASS: lldb-api :: python_api/lldbutil/frame/TestFrameUtils.py (1985 of 2150) PASS: lldb-unit :: SymbolFile/NativePDB/./SymbolFileNativePDBTests/PDBFPOProgramToDWARFExpressionTests.InvalidOpBinary (1986 of 2150) PASS: lldb-unit :: Utility/./UtilityTests/StreamTeeTest.Constructor1Stream (1987 of 2150) PASS: lldb-api :: tools/lldb-vscode/attach/TestVSCode_attach.py (1988 of 2150) PASS: lldb-api :: macosx/load-kext/TestLoadKext.py (1989 of 2150) PASS: lldb-unit :: API/./APITests/SBCommandInterpreterTest.SingleWordCommand (1990 of 2150) PASS: lldb-api :: commands/expression/completion-in-lambda-and-unnamed-class/TestCompletionInLambdaAndUnnamedClass.py (1991 of 2150) PASS: lldb-api :: python_api/default-constructor/TestDefaultConstructorForAPIObjects.py (1992 of 2150) PASS: lldb-api :: commands/expression/fixits/TestFixIts.py (1993 of 2150) PASS: lldb-api :: lang/cpp/stl/TestStdCXXDisassembly.py (1994 of 2150) PASS: lldb-api :: commands/quit/TestQuit.py (1995 of 2150) PASS: lldb-unit :: Utility/./UtilityTests/StreamTest.PutMaxHex64ByteOrderLittle (1996 of 2150) PASS: lldb-api :: functionalities/thread/concurrent_events/TestConcurrentSignalWatchBreak.py (1997 of 2150) PASS: lldb-shell :: Reproducer/Modules/TestModuleCXX.test (1998 of 2150) PASS: lldb-api :: commands/expression/persistent_ptr_update/TestPersistentPtrUpdate.py (1999 of 2150) PASS: lldb-unit :: Utility/./UtilityTests/ArgsTest.TestQuotedTrailingBackslash (2000 of 2150) PASS: lldb-unit :: Utility/./UtilityTests/BroadcasterTest.BroadcastEvent (2001 of 2150) PASS: lldb-unit :: Expression/./ExpressionTests/DiagnosticManagerTest.GetStringBasic (2002 of 2150) PASS: lldb-unit :: Utility/./UtilityTests/StreamTest.PutHex8 (2003 of 2150) PASS: lldb-api :: functionalities/inferior-assert/TestInferiorAssert.py (2004 of 2150) PASS: lldb-shell :: Reproducer/TestDump.test (2005 of 2150) PASS: lldb-unit :: Utility/./UtilityTests/PassiveReplayTest.InstrumentedBarPtr (2006 of 2150) PASS: lldb-api :: commands/expression/static-initializers/TestStaticInitializers.py (2007 of 2150) PASS: lldb-api :: lang/objc/foundation/TestObjCMethodsString.py (2008 of 2150) PASS: lldb-api :: lang/cpp/symbols/TestSymbols.py (2009 of 2150) PASS: lldb-unit :: Utility/./UtilityTests/UriParserTest.PortOverflow (2010 of 2150) PASS: lldb-api :: lang/objc/hidden-ivars/TestHiddenIvars.py (2011 of 2150) PASS: lldb-unit :: Utility/./UtilityTests/XcodeSDKTest.SDKSupportsModules (2012 of 2150) PASS: lldb-unit :: Utility/./UtilityTests/CompletionRequest.DuplicateFilteringWithComments (2013 of 2150) PASS: lldb-unit :: Signals/./SignalsTests/UnixSignalsTest.Iteration (2014 of 2150) PASS: lldb-unit :: DataFormatter/./LLDBFormatterTests/TypeMatcherTests.CreatedBySameMatchStringExactNamePrefixes (2015 of 2150) PASS: lldb-unit :: Process/gdb-remote/./ProcessGdbRemoteTests/GDBRemoteCommunicationClientTest.GetMemoryRegionInfoInvalidResponse (2016 of 2150) PASS: lldb-api :: functionalities/data-formatter/var-in-aggregate-misuse/TestVarInAggregateMisuse.py (2017 of 2150) UNSUPPORTED: lldb-api :: commands/target/auto-install-main-executable/TestAutoInstallMainExecutable.py (2018 of 2150) PASS: lldb-unit :: Utility/./UtilityTests/FileSpecTest.EqualDotsWindows (2019 of 2150) PASS: lldb-unit :: Disassembler/./DisassemblerTests/TestArm64Disassembly.TestArmv81Instruction (2020 of 2150) PASS: lldb-unit :: Utility/./UtilityTests/RangeTest.SlideZero (2021 of 2150) PASS: lldb-unit :: Utility/./UtilityTests/StringExtractorTest.DecodeHexU8_Exact (2022 of 2150) PASS: lldb-api :: commands/expression/issue_11588/Test11588.py (2023 of 2150) PASS: lldb-shell :: ScriptInterpreter/Python/sb_address_exception.test (2024 of 2150) PASS: lldb-shell :: SymbolFile/DWARF/find-basic-namespace.cpp (2025 of 2150) PASS: lldb-unit :: Utility/./UtilityTests/VMRange.Clear (2026 of 2150) PASS: lldb-unit :: Utility/./UtilityTests/ScalarTest.Equality (2027 of 2150) UNSUPPORTED: lldb-api :: functionalities/unwind/standard/TestStandardUnwind.py (2028 of 2150) PASS: lldb-api :: functionalities/breakpoint/breakpoint_language/TestBreakpointLanguage.py (2029 of 2150) PASS: lldb-unit :: UnwindAssembly/x86/./UnwindAssemblyx86Tests/Testx86AssemblyInspectionEngine.Test64bitFramelessSmallStackFrame (2030 of 2150) PASS: lldb-api :: api/multithreaded/TestMultithreaded.py (2031 of 2150) PASS: lldb-api :: functionalities/data-formatter/user-format-vs-summary/TestUserFormatVsSummary.py (2032 of 2150) PASS: lldb-unit :: Symbol/./SymbolTests/TestTypeSystemClang.TestGetTypeClassDeclType (2033 of 2150) UNSUPPORTED: lldb-api :: functionalities/darwin_log/filter/exact_match/activity-chain/TestDarwinLogFilterMatchActivityChain.py (2034 of 2150) PASS: lldb-shell :: SymbolFile/Breakpad/unwind-via-stack-cfi.test (2035 of 2150) PASS: lldb-unit :: Utility/./UtilityTests/RangeDataVector.FindEntryIndexesThatContain (2036 of 2150) PASS: lldb-api :: lang/objc/rdar-11355592/TestRdar11355592.py (2037 of 2150) UNSUPPORTED: lldb-shell :: SymbolFile/DWARF/DW_TAG_GNU_call_site-DW_AT_low_pc.s (2038 of 2150) PASS: lldb-api :: functionalities/breakpoint/breakpoint_by_file_colon_line/TestBreakpointByFileColonLine.py (2039 of 2150) PASS: lldb-unit :: Host/./HostTests/FileSystemTest.FileAndDirectoryComponents (2040 of 2150) PASS: lldb-unit :: Utility/./UtilityTests/NameMatchesTest.RegularExpression (2041 of 2150) PASS: lldb-unit :: Utility/./UtilityTests/FileSpecTest.IsRelative (2042 of 2150) PASS: lldb-api :: iohandler/completion/TestIOHandlerCompletion.py (2043 of 2150) PASS: lldb-shell :: Breakpoint/debug_addrx.test (2044 of 2150) PASS: lldb-api :: lang/cpp/template-specialization-type/TestTemplateSpecializationType.py (2045 of 2150) PASS: lldb-api :: macosx/indirect_symbol/TestIndirectSymbols.py (2046 of 2150) PASS: lldb-shell :: Process/Optimization.test (2047 of 2150) PASS: lldb-api :: iohandler/resize/TestIOHandlerResize.py (2048 of 2150) PASS: lldb-shell :: Breakpoint/debug_rnglist_rlestartend.test (2049 of 2150) PASS: lldb-api :: commands/expression/call-function/TestCallUserDefinedFunction.py (2050 of 2150) PASS: lldb-api :: lang/cpp/gmodules-templates/TestGModules.py (2051 of 2150) UNSUPPORTED: lldb-shell :: SymbolFile/PDB/calling-conventions.test (2052 of 2150) PASS: lldb-unit :: ScriptInterpreter/Python/./ScriptInterpreterPythonTests/PythonDataObjectsTest.TestTypeNameResolutionNoDot (2053 of 2150) PASS: lldb-api :: commands/target/create-deps/TestTargetCreateDeps.py (2054 of 2150) PASS: lldb-api :: functionalities/thread/backtrace_limit/TestBacktraceLimit.py (2055 of 2150) PASS: lldb-api :: lang/objc/modules-inline-functions/TestModulesInlineFunctions.py (2056 of 2150) PASS: lldb-api :: commands/process/launch-with-shellexpand/TestLaunchWithShellExpand.py (2057 of 2150) PASS: lldb-unit :: UnwindAssembly/x86/./UnwindAssemblyx86Tests/Testx86AssemblyInspectionEngine.TestSimplex86_64Augmented (2058 of 2150) PASS: lldb-unit :: Host/./HostTests/FileSystemTest.GetByteSize (2059 of 2150) PASS: lldb-api :: functionalities/inferior-changed/TestInferiorChanged.py (2060 of 2150) PASS: lldb-api :: lang/c/conflicting-symbol/TestConflictingSymbol.py (2061 of 2150) PASS: lldb-shell :: SymbolFile/DWARF/dwp-debug-types.s (2062 of 2150) PASS: lldb-api :: commands/watchpoints/watchpoint_commands/TestWatchpointCommands.py (2063 of 2150) PASS: lldb-unit :: Host/./HostTests/NativeProcessProtocolTest.SetBreakpointFailWrite (2064 of 2150) PASS: lldb-api :: functionalities/signal/TestSendSignal.py (2065 of 2150) PASS: lldb-shell :: SymbolFile/DWARF/debug_loc_and_loclists.s (2066 of 2150) UNSUPPORTED: lldb-api :: functionalities/data-formatter/data-formatter-stl/libstdcpp/list/TestDataFormatterStdList.py (2067 of 2150) PASS: lldb-api :: commands/expression/completion-crash-incomplete-record/TestCompletionCrashIncompleteRecord.py (2068 of 2150) PASS: lldb-unit :: Utility/./UtilityTests/ArgsTest.TestSingleArg (2069 of 2150) PASS: lldb-shell :: SymbolFile/Breakpad/line-table-mixed-path-styles.test (2070 of 2150) PASS: lldb-api :: functionalities/thread/concurrent_events/TestConcurrentDelaySignalWatch.py (2071 of 2150) PASS: lldb-unit :: Core/./LLDBCoreTests/RichManglingContextTest.Basic (2072 of 2150) PASS: lldb-shell :: Reproducer/TestProcessList.test (2073 of 2150) PASS: lldb-unit :: UnwindAssembly/x86/./UnwindAssemblyx86Tests/Testx86AssemblyInspectionEngine.TestPushECX (2074 of 2150) PASS: lldb-api :: lang/c/find_struct_type/TestFindStructTypes.py (2075 of 2150) PASS: lldb-shell :: ObjectFile/PECOFF/basic-info-arm.yaml (2076 of 2150) PASS: lldb-api :: commands/expression/save_jit_objects/TestSaveJITObjects.py (2077 of 2150) PASS: lldb-unit :: ScriptInterpreter/Python/./ScriptInterpreterPythonTests/PythonDataObjectsTest.TestPythonInteger (2078 of 2150) PASS: lldb-api :: commands/expression/deleting-implicit-copy-constructor/TestDeletingImplicitCopyConstructor.py (2079 of 2150) PASS: lldb-api :: tools/lldb-server/inferior-crash/TestGdbRemoteAbort.py (2080 of 2150) PASS: lldb-api :: functionalities/thread/exit_during_step/TestExitDuringStep.py (2081 of 2150) UNSUPPORTED: lldb-shell :: Register/x86-64-xmm16-write.test (2082 of 2150) PASS: lldb-unit :: UnwindAssembly/x86/./UnwindAssemblyx86Tests/Testx86AssemblyInspectionEngine.TestMovRSPtoRBP (2083 of 2150) PASS: lldb-api :: functionalities/data-formatter/data-formatter-globals/TestDataFormatterGlobals.py (2084 of 2150) PASS: lldb-unit :: Utility/./UtilityTests/StringListTest.ShiftMove (2085 of 2150) PASS: lldb-api :: functionalities/dlopen_other_executable/TestDlopenOtherExecutable.py (2086 of 2150) PASS: lldb-shell :: SymbolFile/DWARF/debug-types-line-tables.s (2087 of 2150) PASS: lldb-shell :: ObjectFile/Breakpad/uuid-matching-mac.test (2088 of 2150) PASS: lldb-unit :: Symbol/./SymbolTests/LineEntryTest.GetSameLineContiguousAddressRangeNoInlines (2089 of 2150) PASS: lldb-api :: functionalities/gdb_remote_client/TestStopPCs.py (2090 of 2150) UNSUPPORTED: lldb-api :: lang/objc/objc-dynamic-value/TestObjCDynamicValue.py (2091 of 2150) PASS: lldb-unit :: Core/./LLDBCoreTests/ModuleSpecTest.InvalidInMemoryBufferValidFile (2092 of 2150) PASS: lldb-unit :: Language/Highlighting/./HighlighterTests/HighlighterTest.ClangCursorPosInOtherToken (2093 of 2150) PASS: lldb-shell :: Minidump/disassemble-no-module.yaml (2094 of 2150) PASS: lldb-unit :: Utility/./UtilityTests/ProcessInstanceInfoList.Yaml (2095 of 2150) PASS: lldb-api :: lang/objc/ptr_refs/TestPtrRefsObjC.py (2096 of 2150) PASS: lldb-api :: tools/lldb-vscode/breakpoint/TestVSCode_setFunctionBreakpoints.py (2097 of 2150) PASS: lldb-unit :: Breakpoint/./LLDBBreakpointTests/BreakpointIDTest.StringIsBreakpointName (2098 of 2150) PASS: lldb-api :: functionalities/lazy-loading/TestLazyLoading.py (2099 of 2150) PASS: lldb-api :: functionalities/gdb_remote_client/TestRegDefinitionInParts.py (2100 of 2150) PASS: lldb-unit :: Symbol/./SymbolTests/TestClangASTImporter.CanImportInvalidType (2101 of 2150) PASS: lldb-api :: macosx/dyld-trie-symbols/TestDyldTrieSymbols.py (2102 of 2150) PASS: lldb-unit :: Utility/./UtilityTests/GeneratorTest.GetOrCreate (2103 of 2150) UNSUPPORTED: lldb-shell :: ScriptInterpreter/Lua/persistent_state.test (2104 of 2150) PASS: lldb-unit :: ScriptInterpreter/Python/./ScriptInterpreterPythonTests/PythonDataObjectsTest.TestPythonBoolean (2105 of 2150) PASS: lldb-api :: functionalities/tail_call_frames/thread_step_out_or_return/TestSteppingOutWithArtificialFrames.py (2106 of 2150) PASS: lldb-unit :: Process/minidump/./LLDBMinidumpTests/RegisterContextMinidump.CheckRegisterContextMinidump_ARM (2107 of 2150) PASS: lldb-shell :: Commands/CommandScriptImmediateOutput/CommandScriptImmediateOutputConsole.test (2108 of 2150) PASS: lldb-api :: functionalities/non-overlapping-index-variable-i/TestIndexVariable.py (2109 of 2150) PASS: lldb-unit :: Expression/./ExpressionTests/ClangExpressionDeclMapTest.TestUnknownIdentifierLookup (2110 of 2150) PASS: lldb-unit :: Utility/./UtilityTests/ListenerTest.GetEventWait (2111 of 2150) PASS: lldb-unit :: ScriptInterpreter/Python/./ScriptInterpreterPythonTests/PythonDataObjectsTest.TestPythonFile (2112 of 2150) PASS: lldb-api :: tools/lldb-server/register-reading/TestGdbRemoteGPacket.py (2113 of 2150) UNSUPPORTED: lldb-api :: functionalities/darwin_log/filter/exact_match/message/TestDarwinLogFilterMatchMessage.py (2114 of 2150) PASS: lldb-api :: commands/gui/breakpoints/TestGuiBreakpoints.py (2115 of 2150) UNSUPPORTED: lldb-api :: functionalities/data-formatter/data-formatter-stl/libstdcpp/smart_ptr/TestDataFormatterStdSmartPtr.py (2116 of 2150) PASS: lldb-shell :: Quit/TestQuitExitCode-30.test (2117 of 2150) PASS: lldb-api :: functionalities/postmortem/elf-core/gcore/TestGCore.py (2118 of 2150) PASS: lldb-unit :: Utility/./UtilityTests/DeserializerTest.HasData (2119 of 2150) PASS: lldb-api :: commands/gui/viewlarge/TestGuiViewLarge.py (2120 of 2150) PASS: lldb-api :: python_api/sbenvironment/TestSBEnvironment.py (2121 of 2150) PASS: lldb-api :: functionalities/tail_call_frames/sbapi_support/TestTailCallFrameSBAPI.py (2122 of 2150) UNSUPPORTED: lldb-shell :: ScriptInterpreter/Lua/convenience_variables.test (2123 of 2150) PASS: lldb-unit :: Utility/./UtilityTests/ArchSpecTest.TestParseMachCPUDashSubtypeTripleExtra (2124 of 2150) PASS: lldb-api :: commands/target/stop-hook/enable/TestTargetStopHookEnable.py (2125 of 2150) PASS: lldb-unit :: Utility/./UtilityTests/LogChannelEnabledTest.LogVerboseThread (2126 of 2150) PASS: lldb-api :: functionalities/data-formatter/hexcaps/TestDataFormatterHexCaps.py (2127 of 2150) PASS: lldb-api :: macosx/add-dsym/TestAddDsymMidExecutionCommand.py (2128 of 2150) PASS: lldb-unit :: Process/minidump/./LLDBMinidumpTests/MinidumpParserTest.GetLinuxProcStatus (2129 of 2150) PASS: lldb-api :: commands/frame/diagnose/bad-reference/TestBadReference.py (2130 of 2150) PASS: lldb-shell :: Quit/TestQuitExitCodeTooManyArgs.test (2131 of 2150) PASS: lldb-api :: macosx/order/TestOrderFile.py (2132 of 2150) PASS: lldb-unit :: Process/minidump/./LLDBMinidumpTests/MinidumpParserTest.MinidumpModuleOrder (2133 of 2150) PASS: lldb-shell :: Quit/TestQuitExitCodeHexA.test (2134 of 2150) PASS: lldb-api :: lang/c/unions/TestUnionMembers.py (2135 of 2150) PASS: lldb-unit :: Utility/./UtilityTests/ConstStringTest.UpdateMangledCounterpart (2136 of 2150) PASS: lldb-unit :: Process/gdb-remote/./ProcessGdbRemoteTests/GDBRemoteClientBaseTest.SendContinueAndAsyncPacket (2137 of 2150) UNSUPPORTED: lldb-shell :: SymbolFile/NativePDB/stack_unwinding01.cpp (2138 of 2150) PASS: lldb-shell :: SymbolFile/DWARF/find-basic-function.cpp (2139 of 2150) PASS: lldb-api :: functionalities/thread/concurrent_events/TestConcurrentTwoWatchpointThreads.py (2140 of 2150) PASS: lldb-unit :: Utility/./UtilityTests/VMRange.Ordering (2141 of 2150) PASS: lldb-unit :: Utility/./UtilityTests/DataExtractorTest.GetCStrEmpty (2142 of 2150) PASS: lldb-unit :: Symbol/./SymbolTests/TestTypeSystemClang.TestDisplayName (2143 of 2150) UNSUPPORTED: lldb-api :: arm/breakpoint-thumb-codesection/TestBreakpointThumbCodesection.py (2144 of 2150) UNSUPPORTED: lldb-api :: lang/cpp/function-template-parameter-pack/TestFunctionTemplateParameterPack.py (2145 of 2150) PASS: lldb-unit :: UnwindAssembly/x86/./UnwindAssemblyx86Tests/Testx86AssemblyInspectionEngine.Test64bitFramelessBigStackFrame (2146 of 2150) PASS: lldb-unit :: Utility/./UtilityTests/LogChannelTest.Enable (2147 of 2150) PASS: lldb-shell :: SymbolFile/DWARF/compilercontext.ll (2148 of 2150) PASS: lldb-api :: commands/register/register/register_command/TestRegisters.py (2149 of 2150) PASS: lldb-api :: lang/objc/foundation/TestObjCMethods.py (2150 of 2150) Slowest Tests: -------------------------------------------------------------------------- 315.57s: lldb-api :: macosx/simulator/TestSimulatorPlatform.py 114.57s: lldb-api :: functionalities/inferior-crashing/TestInferiorCrashingStep.py 101.27s: lldb-api :: tools/lldb-server/TestLldbGdbServer.py 94.02s: lldb-api :: functionalities/gdb_remote_client/TestThreadSelectionBug.py 68.50s: lldb-api :: functionalities/data-formatter/data-formatter-advanced/TestDataFormatterAdv.py 68.46s: lldb-api :: types/TestIntegerTypeExpr.py 63.98s: lldb-api :: lang/objc/objc-new-syntax/TestObjCNewSyntaxArray.py 55.25s: lldb-api :: functionalities/postmortem/mach-core/TestMachCore.py 54.32s: lldb-api :: lang/objc/foundation/TestFoundationDisassembly.py 54.18s: lldb-api :: lang/objc/hidden-ivars/TestHiddenIvars.py 52.35s: lldb-api :: functionalities/data-formatter/data-formatter-objc/TestDataFormatterObjCNSDate.py 51.66s: lldb-api :: lang/objc/exceptions/TestObjCExceptions.py 49.09s: lldb-shell :: SymbolFile/NativePDB/function-types-builtins.cpp 48.37s: lldb-api :: lang/objc/foundation/TestObjCMethods.py 47.93s: lldb-api :: functionalities/postmortem/minidump/TestMiniDump.py 47.12s: lldb-api :: api/multithreaded/TestMultithreaded.py 44.15s: lldb-api :: lang/cpp/namespace/TestNamespaceLookup.py 43.06s: lldb-api :: types/TestLongTypesExpr.py 43.00s: lldb-api :: functionalities/completion/TestCompletion.py 37.88s: lldb-api :: lang/objc/objc-new-syntax/TestObjCNewSyntaxLiteral.py

Hide Details

Tests Times: -------------------------------------------------------------------------- [ Range ] :: [ Percentage ] :: [ Count ] -------------------------------------------------------------------------- [300s,320s) :: [ ] :: [ 1/2150] [280s,300s) :: [ ] :: [ 0/2150] [260s,280s) :: [ ] :: [ 0/2150] [240s,260s) :: [ ] :: [ 0/2150] [220s,240s) :: [ ] :: [ 0/2150] [200s,220s) :: [ ] :: [ 0/2150] [180s,200s) :: [ ] :: [ 0/2150] [160s,180s) :: [ ] :: [ 0/2150] [140s,160s) :: [ ] :: [ 0/2150] [120s,140s) :: [ ] :: [ 0/2150] [100s,120s) :: [ ] :: [ 2/2150] [ 80s,100s) :: [ ] :: [ 1/2150] [ 60s, 80s) :: [ ] :: [ 3/2150] [ 40s, 60s) :: [ ] :: [ 12/2150] [ 20s, 40s) :: [ ] :: [ 29/2150] [ 0s, 20s) :: [*************************************** ] :: [2102/2150] -------------------------------------------------------------------------- ******************** Failed Tests (1): lldb-api :: functionalities/gdb_remote_client/TestThreadSelectionBug.py

Hide Details

Hide Details

Testing Time: 1759.33s Unsupported : 153 Passed : 1990 Expectedly Failed: 6 Failed : 1 FAILED: tools/lldb/test/CMakeFiles/check-lldb-lit cd /Users/buildslave/jenkins/workspace/lldb-cmake/lldb-build/tools/lldb/test && /usr/local/Frameworks/Python.framework/Versions/3.7/bin/python3.7 /Users/buildslave/jenkins/workspace/lldb-cmake/lldb-build/./bin/llvm-lit -v --time-tests --shuffle --xunit-xml-output=/Users/buildslave/jenkins/workspace/lldb-cmake/test/results.xml -v -j 4 /Users/buildslave/jenkins/workspace/lldb-cmake/lldb-build/tools/lldb/test ninja: build stopped: subcommand failed. Command failed: Command '['/usr/bin/env', 'TERM=vt100', '/usr/local/bin/ninja', '-v', 'check-lldb']' returned non-zero exit status 1 Command: ['/usr/bin/env', 'TERM=vt100', '/usr/local/bin/ninja', '-v', 'check-lldb'] [Pipeline] } [Pipeline] // timeout [Pipeline] } [Pipeline] // stage [Pipeline] stage [Pipeline] { (Declarative: Post Actions) [Pipeline] scanForIssues [Clang (LLVM based)] Sleeping for 5 seconds due to JENKINS-32191... [Clang (LLVM based)] Parsing console log (workspace: '/Users/buildslave/jenkins/workspace/lldb-cmake') [Clang (LLVM based)] Successfully parsed console log [Clang (LLVM based)] -> found 3 issues (skipped 5 duplicates) [Clang (LLVM based)] Post processing issues on 'green-dragon-10' with source code encoding 'UTF-8' [Clang (LLVM based)] Creating SCM blamer to obtain author and commit information for affected files [Clang (LLVM based)] Creating SCM miner to obtain statistics for affected repository files [Clang (LLVM based)] Resolving file names for all issues in source directory '/Users/buildslave/jenkins/workspace/lldb-cmake' [Clang (LLVM based)] -> resolved paths in source directory (2 found, 0 not found) [Clang (LLVM based)] Resolving module names from module definitions (build.xml, pom.xml, or Manifest.mf files) [Clang (LLVM based)] -> resolved module names for 3 issues [Clang (LLVM based)] Resolving package names (or namespaces) by parsing the affected files [Clang (LLVM based)] -> resolved package names of 2 affected files [Clang (LLVM based)] No filter has been set, publishing all 3 issues [Clang (LLVM based)] Creating fingerprints for all affected code blocks to track issues over different builds [Clang (LLVM based)] -> created fingerprints for 3 issues (skipped 0 issues) [Clang (LLVM based)] Copying affected files to Jenkins' build folder '/Users/Shared/Jenkins/Home/jobs/lldb-cmake/builds/23934/files-with-issues' [Clang (LLVM based)] -> 2 copied, 0 not in workspace, 0 not-found, 0 with I/O error [Pipeline] junit Recording test results [Pipeline] emailext Warning: alexandre.ganea@ubisoft.com is not a recognized user, but sending mail anyway Warning: htobonmm7@gmail.com is not a recognized user, but sending mail anyway Warning: daltenty@ibm.com is not a recognized user, but sending mail anyway Warning: gkm@fb.com is not a recognized user, but sending mail anyway Warning: michael.hliao@gmail.com is not a recognized user, but sending mail anyway Warning: mascasa@google.com is not a recognized user, but sending mail anyway Warning: llvm-dev@redking.me.uk is not a recognized user, but sending mail anyway Warning: flo@fhahn.com is not a recognized user, but sending mail anyway Warning: kostyak@google.com is not a recognized user, but sending mail anyway Warning: aeubanks@google.com is not a recognized user, but sending mail anyway Warning: alexandre.ganea@ubisoft.com is not a recognized user, but sending mail anyway Warning: htobonmm7@gmail.com is not a recognized user, but sending mail anyway Warning: daltenty@ibm.com is not a recognized user, but sending mail anyway Warning: gkm@fb.com is not a recognized user, but sending mail anyway Warning: michael.hliao@gmail.com is not a recognized user, but sending mail anyway Warning: mascasa@google.com is not a recognized user, but sending mail anyway Warning: llvm-dev@redking.me.uk is not a recognized user, but sending mail anyway Warning: flo@fhahn.com is not a recognized user, but sending mail anyway Warning: kostyak@google.com is not a recognized user, but sending mail anyway Warning: aeubanks@google.com is not a recognized user, but sending mail anyway

Hide Details

Begin Pre-Send Script... Sending email to: Florian Hahn <florian_hahn@apple.com> Florian Hahn <florian_hahn@apple.com> Azhar Mohammed <azhar@apple.com>
[Pipeline] } [Pipeline] // stage [Pipeline] } [Pipeline] // withEnv [Pipeline] } [Pipeline] // node [Pipeline] End of Pipeline ERROR: script returned exit code 1 Finished: FAILURE