FailedConsole Output

Skipping 14,494 KB.. Full Log
: (unsigned short) $17 = 11001

Hide Details

Hide Details

looking at: unsigned short

Hide Details

Checking string: "unsigned short"

Hide Details

Expecting sub string: "unsigned" (was found) Expecting sub string: "short" (was found)

Hide Details

looking at: (unsigned short) $17 = 11001

Hide Details

Hide Details

Checking string: "(unsigned short) $17 = 11001 "

Hide Details

Expecting sub string: "11001" (was found)

Hide Details

runCmd: expression a_struct_ref.b output: (unsigned short) $18 = 22002

Hide Details

Hide Details

looking at: unsigned short

Hide Details

Checking string: "unsigned short"

Hide Details

Expecting sub string: "unsigned" (was found) Expecting sub string: "short" (was found)

Hide Details

looking at: (unsigned short) $18 = 22002

Hide Details

Hide Details

Checking string: "(unsigned short) $18 = 22002 "

Hide Details

Expecting sub string: "22002" (was found)

Hide Details

runCmd: expression a_union_zero.a output: (unsigned short) $19 = 11001

Hide Details

Hide Details

looking at: unsigned short

Hide Details

Checking string: "unsigned short"

Hide Details

Expecting sub string: "unsigned" (was found) Expecting sub string: "short" (was found)

Hide Details

looking at: (unsigned short) $19 = 11001

Hide Details

Hide Details

Checking string: "(unsigned short) $19 = 11001 "

Hide Details

Expecting sub string: "11001" (was found)

Hide Details

runCmd: expression a_union_zero_ptr->a output: (unsigned short) $20 = 11001

Hide Details

Hide Details

looking at: unsigned short

Hide Details

Checking string: "unsigned short"

Hide Details

Expecting sub string: "unsigned" (was found) Expecting sub string: "short" (was found)

Hide Details

looking at: (unsigned short) $20 = 11001

Hide Details

Hide Details

Checking string: "(unsigned short) $20 = 11001 "

Hide Details

Expecting sub string: "11001" (was found)

Hide Details

runCmd: expression a_union_zero_ref.a output: (unsigned short) $21 = 11001

Hide Details

Hide Details

looking at: unsigned short

Hide Details

Checking string: "unsigned short"

Hide Details

Expecting sub string: "unsigned" (was found) Expecting sub string: "short" (was found)

Hide Details

looking at: (unsigned short) $21 = 11001

Hide Details

Hide Details

Checking string: "(unsigned short) $21 = 11001 "

Hide Details

Expecting sub string: "11001" (was found)

Hide Details

runCmd: expression a_union_nonzero.u.a output: (unsigned short) $22 = 11001

Hide Details

Hide Details

looking at: unsigned short

Hide Details

Checking string: "unsigned short"

Hide Details

Expecting sub string: "unsigned" (was found) Expecting sub string: "short" (was found)

Hide Details

looking at: (unsigned short) $22 = 11001

Hide Details

Hide Details

Checking string: "(unsigned short) $22 = 11001 "

Hide Details

Expecting sub string: "11001" (was found)

Hide Details

runCmd: expression a_union_nonzero_ptr->u.a output: (unsigned short) $23 = 11001

Hide Details

Hide Details

looking at: unsigned short

Hide Details

Checking string: "unsigned short"

Hide Details

Expecting sub string: "unsigned" (was found) Expecting sub string: "short" (was found)

Hide Details

looking at: (unsigned short) $23 = 11001

Hide Details

Hide Details

Checking string: "(unsigned short) $23 = 11001 "

Hide Details

Expecting sub string: "11001" (was found)

Hide Details

runCmd: expression a_union_nonzero_ref.u.a output: (unsigned short) $24 = 11001

Hide Details

Hide Details

looking at: unsigned short

Hide Details

Checking string: "unsigned short"

Hide Details

Expecting sub string: "unsigned" (was found) Expecting sub string: "short" (was found)

Hide Details

looking at: (unsigned short) $24 = 11001

Hide Details

Hide Details

Checking string: "(unsigned short) $24 = 11001 "

Hide Details

Expecting sub string: "11001" (was found)

Hide Details

runCmd: expression a_struct_array_bounded[0].a output: (unsigned short) $25 = 11001

Hide Details

Hide Details

looking at: unsigned short

Hide Details

Checking string: "unsigned short"

Hide Details

Expecting sub string: "unsigned" (was found) Expecting sub string: "short" (was found)

Hide Details

looking at: (unsigned short) $25 = 11001

Hide Details

Hide Details

Checking string: "(unsigned short) $25 = 11001 "

Hide Details

Expecting sub string: "11001" (was found)

Hide Details

runCmd: expression a_struct_array_bounded[0].b output: (unsigned short) $26 = 22002

Hide Details

Hide Details

looking at: unsigned short

Hide Details

Checking string: "unsigned short"

Hide Details

Expecting sub string: "unsigned" (was found) Expecting sub string: "short" (was found)

Hide Details

looking at: (unsigned short) $26 = 22002

Hide Details

Hide Details

Checking string: "(unsigned short) $26 = 22002 "

Hide Details

Expecting sub string: "22002" (was found)

Hide Details

runCmd: expression a_struct_array_bounded[1].a output: (unsigned short) $27 = 0

Hide Details

Hide Details

looking at: unsigned short

Hide Details

Checking string: "unsigned short"

Hide Details

Expecting sub string: "unsigned" (was found) Expecting sub string: "short" (was found)

Hide Details

looking at: (unsigned short) $27 = 0

Hide Details

Hide Details

Checking string: "(unsigned short) $27 = 0 "

Hide Details

Expecting sub string: "0" (was found)

Hide Details

runCmd: expression a_struct_array_bounded[1].b output: (unsigned short) $28 = 65535

Hide Details

Hide Details

looking at: unsigned short

Hide Details

Checking string: "unsigned short"

Hide Details

Expecting sub string: "unsigned" (was found) Expecting sub string: "short" (was found)

Hide Details

looking at: (unsigned short) $28 = 65535

Hide Details

Hide Details

Checking string: "(unsigned short) $28 = 65535 "

Hide Details

Expecting sub string: "65535" (was found)

Hide Details

runCmd: expression a_struct_array_unbounded[0].a output: (unsigned short) $29 = 11001

Hide Details

Hide Details

looking at: unsigned short

Hide Details

Checking string: "unsigned short"

Hide Details

Expecting sub string: "unsigned" (was found) Expecting sub string: "short" (was found)

Hide Details

looking at: (unsigned short) $29 = 11001

Hide Details

Hide Details

Checking string: "(unsigned short) $29 = 11001 "

Hide Details

Expecting sub string: "11001" (was found)

Hide Details

runCmd: expression a_struct_array_unbounded[0].b output: (unsigned short) $30 = 22002

Hide Details

Hide Details

looking at: unsigned short

Hide Details

Checking string: "unsigned short"

Hide Details

Expecting sub string: "unsigned" (was found) Expecting sub string: "short" (was found)

Hide Details

looking at: (unsigned short) $30 = 22002

Hide Details

Hide Details

Checking string: "(unsigned short) $30 = 22002 "

Hide Details

Expecting sub string: "22002" (was found)

Hide Details

runCmd: expression a_struct_array_unbounded[1].a output: (unsigned short) $31 = 0

Hide Details

Hide Details

looking at: unsigned short

Hide Details

Checking string: "unsigned short"

Hide Details

Expecting sub string: "unsigned" (was found) Expecting sub string: "short" (was found)

Hide Details

looking at: (unsigned short) $31 = 0

Hide Details

Hide Details

Checking string: "(unsigned short) $31 = 0 "

Hide Details

Expecting sub string: "0" (was found)

Hide Details

runCmd: expression a_struct_array_unbounded[1].b output: (unsigned short) $32 = 65535

Hide Details

Hide Details

looking at: unsigned short

Hide Details

Checking string: "unsigned short"

Hide Details

Expecting sub string: "unsigned" (was found) Expecting sub string: "short" (was found)

Hide Details

looking at: (unsigned short) $32 = 65535

Hide Details

Hide Details

Checking string: "(unsigned short) $32 = 65535 "

Hide Details

Expecting sub string: "65535" (was found)

Hide Details

runCmd: expression a_union_zero_array_bounded[0].a output: (unsigned short) $33 = 11001

Hide Details

Hide Details

looking at: unsigned short

Hide Details

Checking string: "unsigned short"

Hide Details

Expecting sub string: "unsigned" (was found) Expecting sub string: "short" (was found)

Hide Details

looking at: (unsigned short) $33 = 11001

Hide Details

Hide Details

Checking string: "(unsigned short) $33 = 11001 "

Hide Details

Expecting sub string: "11001" (was found)

Hide Details

runCmd: expression a_union_zero_array_bounded[1].a output: (unsigned short) $34 = 22002

Hide Details

Hide Details

looking at: unsigned short

Hide Details

Checking string: "unsigned short"

Hide Details

Expecting sub string: "unsigned" (was found) Expecting sub string: "short" (was found)

Hide Details

looking at: (unsigned short) $34 = 22002

Hide Details

Hide Details

Checking string: "(unsigned short) $34 = 22002 "

Hide Details

Expecting sub string: "22002" (was found)

Hide Details

runCmd: expression a_union_zero_array_unbounded[0].a output: (unsigned short) $35 = 11001

Hide Details

Hide Details

looking at: unsigned short

Hide Details

Checking string: "unsigned short"

Hide Details

Expecting sub string: "unsigned" (was found) Expecting sub string: "short" (was found)

Hide Details

looking at: (unsigned short) $35 = 11001

Hide Details

Hide Details

Checking string: "(unsigned short) $35 = 11001 "

Hide Details

Expecting sub string: "11001" (was found)

Hide Details

runCmd: expression a_union_zero_array_unbounded[1].a output: (unsigned short) $36 = 22002

Hide Details

Hide Details

looking at: unsigned short

Hide Details

Checking string: "unsigned short"

Hide Details

Expecting sub string: "unsigned" (was found) Expecting sub string: "short" (was found)

Hide Details

looking at: (unsigned short) $36 = 22002

Hide Details

Hide Details

Checking string: "(unsigned short) $36 = 22002 "

Hide Details

Expecting sub string: "22002" (was found)

Hide Details

<bound method SBProcess.Kill of <lldb.SBProcess; proxy of <Swig Object of type 'lldb::SBProcess *' at 0x10ecf0690> >>: success

Hide Details

Executing tearDown hook: self.addTearDownHook(lambda: self.runCmd( "settings set target.inline-breakpoint-strategy headers"))

Hide Details

Hide Details

runCmd: settings set target.inline-breakpoint-strategy headers output:

Hide Details

PASS: LLDB (/Users/buildslave/jenkins/workspace/lldb-cmake/lldb-build/bin/clang-x86_64) :: test_unsigned_short_type_dwarf (TestShortTypeExpr.ShortExprTestCase) UNSUPPORTED: LLDB (/Users/buildslave/jenkins/workspace/lldb-cmake/lldb-build/bin/clang-x86_64) :: test_unsigned_short_type_dwo (TestShortTypeExpr.ShortExprTestCase) (test case does not fall in any category of interest for this run) runCmd: settings clear -all output:

Hide Details

runCmd: settings set symbols.enable-external-lookup false output:

Hide Details

runCmd: settings set target.inherit-tcc true output:

Hide Details

runCmd: settings set target.auto-apply-fixits false output:

Hide Details

runCmd: settings set plugin.process.gdb-remote.packet-timeout 60 output:

Hide Details

runCmd: settings set symbols.clang-modules-cache-path "/Users/buildslave/jenkins/workspace/lldb-cmake/lldb-build/lldb-test-build.noindex/module-cache-lldb/lldb-api" output:

Hide Details

runCmd: settings set use-color false output:

Hide Details

runCmd: setting set target.prefer-dynamic-value no-dynamic-values output:

Hide Details

runCmd: file /Users/buildslave/jenkins/workspace/lldb-cmake/lldb-build/lldb-test-build.noindex/types/TestShortTypeExpr.test_unsigned_short_type_from_block_dsym/test_unsigned_short_type_from_block_dsym output: Current executable set to '/Users/buildslave/jenkins/workspace/lldb-cmake/lldb-build/lldb-test-build.noindex/types/TestShortTypeExpr.test_unsigned_short_type_from_block_dsym/test_unsigned_short_type_from_block_dsym' (x86_64).

Hide Details

Hide Details

runCmd: process launch -o "/Users/buildslave/jenkins/workspace/lldb-cmake/lldb-build/lldb-test-build.noindex/types/TestShortTypeExpr.test_unsigned_short_type_from_block_dsym/test_unsigned_short_type_from_block_dsym-golden-output.txt" output: Process 83746 exited with status = 0 (0x00000000)

Hide Details

Process 83746 launched: '/Users/buildslave/jenkins/workspace/lldb-cmake/lldb-build/lldb-test-build.noindex/types/TestShortTypeExpr.test_unsigned_short_type_from_block_dsym/test_unsigned_short_type_from_block_dsym' (x86_64)

Hide Details

Hide Details

runCmd: settings set target.inline-breakpoint-strategy always output:

Hide Details

Adding tearDown hook: self.addTearDownHook(lambda: self.runCmd( "settings set target.inline-breakpoint-strategy headers"))

Hide Details

Hide Details

runCmd: breakpoint set -f "basic_type.cpp" -l 215 output: Breakpoint 1: where = test_unsigned_short_type_from_block_dsym`__main_block_invoke + 1016 at basic_type.cpp:215:18, address = 0x0000000100001678

Hide Details

Hide Details

Expecting pattern: ^Breakpoint (?P<bpno>[0-9]+): (?P<num_locations>[0-9]+) locations\.$ Not matched

Hide Details

Expecting pattern: ^Breakpoint (?P<bpno>[0-9]+): (?P<num_locations>no) locations \(pending\)\. Not matched

Hide Details

Expecting pattern: ^Breakpoint (?P<bpno>[0-9]+): where = (?P<module>.*)`(?P<symbol>[+\-]{0,1}[^+]+)( \+ (?P<offset>[0-9]+)){0,1}( \[inlined\] (?P<inline_symbol>.*)){0,1} at (?P<file>[^:]+):(?P<line_no>[0-9]+)(?P<column>(:[0-9]+)?), address = (?P<address>0x[0-9a-fA-F]+)$ Matched

Hide Details

runCmd: run output: Process 83750 stopped * thread #1, queue = 'com.apple.main-thread', stop reason = breakpoint 1.1 frame #0: 0x0000000100001678 test_unsigned_short_type_from_block_dsym`__main_block_invoke(.block_descriptor=0x00007ffeefbff690) at basic_type.cpp:215:18 212 fprintf (out, "(a_union_nonzero_t*) a_union_nonzero_ptr = %p, a_union_nonzero_ptr->u.a = '" T_PRINTF_FORMAT "'\n", a_union_nonzero_ptr, a_union_nonzero_ptr->u.a); 213 fprintf (out, "(a_union_nonzero_t&) a_union_nonzero_ref = %p, a_union_nonzero_ref.u.a = '" T_PRINTF_FORMAT "'\n", &a_union_nonzero_ref, a_union_nonzero_ref.u.a); 214 -> 215 fprintf (out, "That's All Folks!\n"); // Break here to test block captured variables. ^ 216 }; 217 218 myBlock();

Hide Details

Process 83750 launched: '/Users/buildslave/jenkins/workspace/lldb-cmake/lldb-build/lldb-test-build.noindex/types/TestShortTypeExpr.test_unsigned_short_type_from_block_dsym/test_unsigned_short_type_from_block_dsym' (x86_64)

Hide Details

Hide Details

runCmd: process status output: Process 83750 stopped * thread #1, queue = 'com.apple.main-thread', stop reason = breakpoint 1.1 frame #0: 0x0000000100001678 test_unsigned_short_type_from_block_dsym`__main_block_invoke(.block_descriptor=0x00007ffeefbff690) at basic_type.cpp:215:18 212 fprintf (out, "(a_union_nonzero_t*) a_union_nonzero_ptr = %p, a_union_nonzero_ptr->u.a = '" T_PRINTF_FORMAT "'\n", a_union_nonzero_ptr, a_union_nonzero_ptr->u.a); 213 fprintf (out, "(a_union_nonzero_t&) a_union_nonzero_ref = %p, a_union_nonzero_ref.u.a = '" T_PRINTF_FORMAT "'\n", &a_union_nonzero_ref, a_union_nonzero_ref.u.a); 214 -> 215 fprintf (out, "That's All Folks!\n"); // Break here to test block captured variables. ^ 216 }; 217 218 myBlock();

Hide Details

Hide Details

Ran command: "process status"

Hide Details

Got output: Process 83750 stopped * thread #1, queue = 'com.apple.main-thread', stop reason = breakpoint 1.1 frame #0: 0x0000000100001678 test_unsigned_short_type_from_block_dsym`__main_block_invoke(.block_descriptor=0x00007ffeefbff690) at basic_type.cpp:215:18 212 fprintf (out, "(a_union_nonzero_t*) a_union_nonzero_ptr = %p, a_union_nonzero_ptr->u.a = '" T_PRINTF_FORMAT "'\n", a_union_nonzero_ptr, a_union_nonzero_ptr->u.a); 213 fprintf (out, "(a_union_nonzero_t&) a_union_nonzero_ref = %p, a_union_nonzero_ref.u.a = '" T_PRINTF_FORMAT "'\n", &a_union_nonzero_ref, a_union_nonzero_ref.u.a); 214 -> 215 fprintf (out, "That's All Folks!\n"); // Break here to test block captured variables. ^ 216 }; 217 218 myBlock();

Hide Details

Expecting sub string: "stop reason = breakpoint" (was found) Expecting sub string: " at basic_type.cpp:215" (was found)

Hide Details

runCmd: expression a output: (unsigned short) $0 = 11001

Hide Details

Hide Details

looking at: unsigned short

Hide Details

Checking string: "unsigned short"

Hide Details

Expecting sub string: "unsigned" (was found) Expecting sub string: "short" (was found)

Hide Details

looking at: (unsigned short) $0 = 11001

Hide Details

Hide Details

Checking string: "(unsigned short) $0 = 11001 "

Hide Details

Expecting sub string: "11001" (was found)

Hide Details

runCmd: expression *a_ptr output: (unsigned short) $1 = 11001

Hide Details

Hide Details

looking at: unsigned short

Hide Details

Checking string: "unsigned short"

Hide Details

Expecting sub string: "unsigned" (was found) Expecting sub string: "short" (was found)

Hide Details

looking at: (unsigned short) $1 = 11001

Hide Details

Hide Details

Checking string: "(unsigned short) $1 = 11001 "

Hide Details

Expecting sub string: "11001" (was found)

Hide Details

runCmd: expression a_ref output: (unsigned short) $2 = 11001

Hide Details

Hide Details

looking at: unsigned short

Hide Details

Checking string: "unsigned short"

Hide Details

Expecting sub string: "unsigned" (was found) Expecting sub string: "short" (was found)

Hide Details

looking at: (unsigned short) $2 = 11001

Hide Details

Hide Details

Checking string: "(unsigned short) $2 = 11001 "

Hide Details

Expecting sub string: "11001" (was found)

Hide Details

runCmd: expression a_class_instance.m_a output: (unsigned short) $3 = 11001

Hide Details

Hide Details

looking at: unsigned short

Hide Details

Checking string: "unsigned short"

Hide Details

Expecting sub string: "unsigned" (was found) Expecting sub string: "short" (was found)

Hide Details

looking at: (unsigned short) $3 = 11001

Hide Details

Hide Details

Checking string: "(unsigned short) $3 = 11001 "

Hide Details

Expecting sub string: "11001" (was found)

Hide Details

runCmd: expression a_class_instance.m_b output: (unsigned short) $4 = 22002

Hide Details

Hide Details

looking at: unsigned short

Hide Details

Checking string: "unsigned short"

Hide Details

Expecting sub string: "unsigned" (was found) Expecting sub string: "short" (was found)

Hide Details

looking at: (unsigned short) $4 = 22002

Hide Details

Hide Details

Checking string: "(unsigned short) $4 = 22002 "

Hide Details

Expecting sub string: "22002" (was found)

Hide Details

runCmd: expression a_class_ptr->m_a output: (unsigned short) $5 = 11001

Hide Details

Hide Details

looking at: unsigned short

Hide Details

Checking string: "unsigned short"

Hide Details

Expecting sub string: "unsigned" (was found) Expecting sub string: "short" (was found)

Hide Details

looking at: (unsigned short) $5 = 11001

Hide Details

Hide Details

Checking string: "(unsigned short) $5 = 11001 "

Hide Details

Expecting sub string: "11001" (was found)

Hide Details

runCmd: expression a_class_ptr->m_b output: (unsigned short) $6 = 22002

Hide Details

Hide Details

looking at: unsigned short

Hide Details

Checking string: "unsigned short"

Hide Details

Expecting sub string: "unsigned" (was found) Expecting sub string: "short" (was found)

Hide Details

looking at: (unsigned short) $6 = 22002

Hide Details

Hide Details

Checking string: "(unsigned short) $6 = 22002 "

Hide Details

Expecting sub string: "22002" (was found)

Hide Details

runCmd: expression a_class_ref.m_a output: (unsigned short) $7 = 11001

Hide Details

Hide Details

looking at: unsigned short

Hide Details

Checking string: "unsigned short"

Hide Details

Expecting sub string: "unsigned" (was found) Expecting sub string: "short" (was found)

Hide Details

looking at: (unsigned short) $7 = 11001

Hide Details

Hide Details

Checking string: "(unsigned short) $7 = 11001 "

Hide Details

Expecting sub string: "11001" (was found)

Hide Details

runCmd: expression a_class_ref.m_b output: (unsigned short) $8 = 22002

Hide Details

Hide Details

looking at: unsigned short

Hide Details

Checking string: "unsigned short"

Hide Details

Expecting sub string: "unsigned" (was found) Expecting sub string: "short" (was found)

Hide Details

looking at: (unsigned short) $8 = 22002

Hide Details

Hide Details

Checking string: "(unsigned short) $8 = 22002 "

Hide Details

Expecting sub string: "22002" (was found)

Hide Details

runCmd: expression a_struct.a output: (unsigned short) $9 = 11001

Hide Details

Hide Details

looking at: unsigned short

Hide Details

Checking string: "unsigned short"

Hide Details

Expecting sub string: "unsigned" (was found) Expecting sub string: "short" (was found)

Hide Details

looking at: (unsigned short) $9 = 11001

Hide Details

Hide Details

Checking string: "(unsigned short) $9 = 11001 "

Hide Details

Expecting sub string: "11001" (was found)

Hide Details

runCmd: expression a_struct.b output: (unsigned short) $10 = 22002

Hide Details

Hide Details

looking at: unsigned short

Hide Details

Checking string: "unsigned short"

Hide Details

Expecting sub string: "unsigned" (was found) Expecting sub string: "short" (was found)

Hide Details

looking at: (unsigned short) $10 = 22002

Hide Details

Hide Details

Checking string: "(unsigned short) $10 = 22002 "

Hide Details

Expecting sub string: "22002" (was found)

Hide Details

runCmd: expression a_struct_ptr->a output: (unsigned short) $11 = 11001

Hide Details

Hide Details

looking at: unsigned short

Hide Details

Checking string: "unsigned short"

Hide Details

Expecting sub string: "unsigned" (was found) Expecting sub string: "short" (was found)

Hide Details

looking at: (unsigned short) $11 = 11001

Hide Details

Hide Details

Checking string: "(unsigned short) $11 = 11001 "

Hide Details

Expecting sub string: "11001" (was found)

Hide Details

runCmd: expression a_struct_ptr->b output: (unsigned short) $12 = 22002

Hide Details

Hide Details

looking at: unsigned short

Hide Details

Checking string: "unsigned short"

Hide Details

Expecting sub string: "unsigned" (was found) Expecting sub string: "short" (was found)

Hide Details

looking at: (unsigned short) $12 = 22002

Hide Details

Hide Details

Checking string: "(unsigned short) $12 = 22002 "

Hide Details

Expecting sub string: "22002" (was found)

Hide Details

runCmd: expression a_struct_ref.a output: (unsigned short) $13 = 11001

Hide Details

Hide Details

looking at: unsigned short

Hide Details

Checking string: "unsigned short"

Hide Details

Expecting sub string: "unsigned" (was found) Expecting sub string: "short" (was found)

Hide Details

looking at: (unsigned short) $13 = 11001

Hide Details

Hide Details

Checking string: "(unsigned short) $13 = 11001 "

Hide Details

Expecting sub string: "11001" (was found)

Hide Details

runCmd: expression a_struct_ref.b output: (unsigned short) $14 = 22002

Hide Details

Hide Details

looking at: unsigned short

Hide Details

Checking string: "unsigned short"

Hide Details

Expecting sub string: "unsigned" (was found) Expecting sub string: "short" (was found)

Hide Details

looking at: (unsigned short) $14 = 22002

Hide Details

Hide Details

Checking string: "(unsigned short) $14 = 22002 "

Hide Details

Expecting sub string: "22002" (was found)

Hide Details

runCmd: expression a_union_zero.a output: (unsigned short) $15 = 11001

Hide Details

Hide Details

looking at: unsigned short

Hide Details

Checking string: "unsigned short"

Hide Details

Expecting sub string: "unsigned" (was found) Expecting sub string: "short" (was found)

Hide Details

looking at: (unsigned short) $15 = 11001

Hide Details

Hide Details

Checking string: "(unsigned short) $15 = 11001 "

Hide Details

Expecting sub string: "11001" (was found)

Hide Details

runCmd: expression a_union_zero_ptr->a output: (unsigned short) $16 = 11001

Hide Details

Hide Details

looking at: unsigned short

Hide Details

Checking string: "unsigned short"

Hide Details

Expecting sub string: "unsigned" (was found) Expecting sub string: "short" (was found)

Hide Details

looking at: (unsigned short) $16 = 11001

Hide Details

Hide Details

Checking string: "(unsigned short) $16 = 11001 "

Hide Details

Expecting sub string: "11001" (was found)

Hide Details

runCmd: expression a_union_zero_ref.a output: (unsigned short) $17 = 11001

Hide Details

Hide Details

looking at: unsigned short

Hide Details

Checking string: "unsigned short"

Hide Details

Expecting sub string: "unsigned" (was found) Expecting sub string: "short" (was found)

Hide Details

looking at: (unsigned short) $17 = 11001

Hide Details

Hide Details

Checking string: "(unsigned short) $17 = 11001 "

Hide Details

Expecting sub string: "11001" (was found)

Hide Details

runCmd: expression a_union_nonzero.u.a output: (unsigned short) $18 = 11001

Hide Details

Hide Details

looking at: unsigned short

Hide Details

Checking string: "unsigned short"

Hide Details

Expecting sub string: "unsigned" (was found) Expecting sub string: "short" (was found)

Hide Details

looking at: (unsigned short) $18 = 11001

Hide Details

Hide Details

Checking string: "(unsigned short) $18 = 11001 "

Hide Details

Expecting sub string: "11001" (was found)

Hide Details

runCmd: expression a_union_nonzero_ptr->u.a output: (unsigned short) $19 = 11001

Hide Details

Hide Details

looking at: unsigned short

Hide Details

Checking string: "unsigned short"

Hide Details

Expecting sub string: "unsigned" (was found) Expecting sub string: "short" (was found)

Hide Details

looking at: (unsigned short) $19 = 11001

Hide Details

Hide Details

Checking string: "(unsigned short) $19 = 11001 "

Hide Details

Expecting sub string: "11001" (was found)

Hide Details

runCmd: expression a_union_nonzero_ref.u.a output: (unsigned short) $20 = 11001

Hide Details

Hide Details

looking at: unsigned short

Hide Details

Checking string: "unsigned short"

Hide Details

Expecting sub string: "unsigned" (was found) Expecting sub string: "short" (was found)

Hide Details

looking at: (unsigned short) $20 = 11001

Hide Details

Hide Details

Checking string: "(unsigned short) $20 = 11001 "

Hide Details

Expecting sub string: "11001" (was found)

Hide Details

runCmd: expression a output: (unsigned short) $21 = 11001

Hide Details

Hide Details

looking at: unsigned short

Hide Details

Checking string: "unsigned short"

Hide Details

Expecting sub string: "unsigned" (was found) Expecting sub string: "short" (was found)

Hide Details

looking at: (unsigned short) $21 = 11001

Hide Details

Hide Details

Checking string: "(unsigned short) $21 = 11001 "

Hide Details

Expecting sub string: "11001" (was found)

Hide Details

runCmd: expression *a_ptr output: (unsigned short) $22 = 11001

Hide Details

Hide Details

looking at: unsigned short

Hide Details

Checking string: "unsigned short"

Hide Details

Expecting sub string: "unsigned" (was found) Expecting sub string: "short" (was found)

Hide Details

looking at: (unsigned short) $22 = 11001

Hide Details

Hide Details

Checking string: "(unsigned short) $22 = 11001 "

Hide Details

Expecting sub string: "11001" (was found)

Hide Details

runCmd: expression a_ref output: (unsigned short) $23 = 11001

Hide Details

Hide Details

looking at: unsigned short

Hide Details

Checking string: "unsigned short"

Hide Details

Expecting sub string: "unsigned" (was found) Expecting sub string: "short" (was found)

Hide Details

looking at: (unsigned short) $23 = 11001

Hide Details

Hide Details

Checking string: "(unsigned short) $23 = 11001 "

Hide Details

Expecting sub string: "11001" (was found)

Hide Details

runCmd: expression a_class_instance.m_a output: (unsigned short) $24 = 11001

Hide Details

Hide Details

looking at: unsigned short

Hide Details

Checking string: "unsigned short"

Hide Details

Expecting sub string: "unsigned" (was found) Expecting sub string: "short" (was found)

Hide Details

looking at: (unsigned short) $24 = 11001

Hide Details

Hide Details

Checking string: "(unsigned short) $24 = 11001 "

Hide Details

Expecting sub string: "11001" (was found)

Hide Details

runCmd: expression a_class_instance.m_b output: (unsigned short) $25 = 22002

Hide Details

Hide Details

looking at: unsigned short

Hide Details

Checking string: "unsigned short"

Hide Details

Expecting sub string: "unsigned" (was found) Expecting sub string: "short" (was found)

Hide Details

looking at: (unsigned short) $25 = 22002

Hide Details

Hide Details

Checking string: "(unsigned short) $25 = 22002 "

Hide Details

Expecting sub string: "22002" (was found)

Hide Details

runCmd: expression a_class_ptr->m_a output: (unsigned short) $26 = 11001

Hide Details

Hide Details

looking at: unsigned short

Hide Details

Checking string: "unsigned short"

Hide Details

Expecting sub string: "unsigned" (was found) Expecting sub string: "short" (was found)

Hide Details

looking at: (unsigned short) $26 = 11001

Hide Details

Hide Details

Checking string: "(unsigned short) $26 = 11001 "

Hide Details

Expecting sub string: "11001" (was found)

Hide Details

runCmd: expression a_class_ptr->m_b output: (unsigned short) $27 = 22002

Hide Details

Hide Details

looking at: unsigned short

Hide Details

Checking string: "unsigned short"

Hide Details

Expecting sub string: "unsigned" (was found) Expecting sub string: "short" (was found)

Hide Details

looking at: (unsigned short) $27 = 22002

Hide Details

Hide Details

Checking string: "(unsigned short) $27 = 22002 "

Hide Details

Expecting sub string: "22002" (was found)

Hide Details

runCmd: expression a_class_ref.m_a output: (unsigned short) $28 = 11001

Hide Details

Hide Details

looking at: unsigned short

Hide Details

Checking string: "unsigned short"

Hide Details

Expecting sub string: "unsigned" (was found) Expecting sub string: "short" (was found)

Hide Details

looking at: (unsigned short) $28 = 11001

Hide Details

Hide Details

Checking string: "(unsigned short) $28 = 11001 "

Hide Details

Expecting sub string: "11001" (was found)

Hide Details

runCmd: expression a_class_ref.m_b output: (unsigned short) $29 = 22002

Hide Details

Hide Details

looking at: unsigned short

Hide Details

Checking string: "unsigned short"

Hide Details

Expecting sub string: "unsigned" (was found) Expecting sub string: "short" (was found)

Hide Details

looking at: (unsigned short) $29 = 22002

Hide Details

Hide Details

Checking string: "(unsigned short) $29 = 22002 "

Hide Details

Expecting sub string: "22002" (was found)

Hide Details

runCmd: expression a_struct.a output: (unsigned short) $30 = 11001

Hide Details

Hide Details

looking at: unsigned short

Hide Details

Checking string: "unsigned short"

Hide Details

Expecting sub string: "unsigned" (was found) Expecting sub string: "short" (was found)

Hide Details

looking at: (unsigned short) $30 = 11001

Hide Details

Hide Details

Checking string: "(unsigned short) $30 = 11001 "

Hide Details

Expecting sub string: "11001" (was found)

Hide Details

runCmd: expression a_struct.b output: (unsigned short) $31 = 22002

Hide Details

Hide Details

looking at: unsigned short

Hide Details

Checking string: "unsigned short"

Hide Details

Expecting sub string: "unsigned" (was found) Expecting sub string: "short" (was found)

Hide Details

looking at: (unsigned short) $31 = 22002

Hide Details

Hide Details

Checking string: "(unsigned short) $31 = 22002 "

Hide Details

Expecting sub string: "22002" (was found)

Hide Details

runCmd: expression a_struct_ptr->a output: (unsigned short) $32 = 11001

Hide Details

Hide Details

looking at: unsigned short

Hide Details

Checking string: "unsigned short"

Hide Details

Expecting sub string: "unsigned" (was found) Expecting sub string: "short" (was found)

Hide Details

looking at: (unsigned short) $32 = 11001

Hide Details

Hide Details

Checking string: "(unsigned short) $32 = 11001 "

Hide Details

Expecting sub string: "11001" (was found)

Hide Details

runCmd: expression a_struct_ptr->b output: (unsigned short) $33 = 22002

Hide Details

Hide Details

looking at: unsigned short

Hide Details

Checking string: "unsigned short"

Hide Details

Expecting sub string: "unsigned" (was found) Expecting sub string: "short" (was found)

Hide Details

looking at: (unsigned short) $33 = 22002

Hide Details

Hide Details

Checking string: "(unsigned short) $33 = 22002 "

Hide Details

Expecting sub string: "22002" (was found)

Hide Details

runCmd: expression a_struct_ref.a output: (unsigned short) $34 = 11001

Hide Details

Hide Details

looking at: unsigned short

Hide Details

Checking string: "unsigned short"

Hide Details

Expecting sub string: "unsigned" (was found) Expecting sub string: "short" (was found)

Hide Details

looking at: (unsigned short) $34 = 11001

Hide Details

Hide Details

Checking string: "(unsigned short) $34 = 11001 "

Hide Details

Expecting sub string: "11001" (was found)

Hide Details

runCmd: expression a_struct_ref.b output: (unsigned short) $35 = 22002

Hide Details

Hide Details

looking at: unsigned short

Hide Details

Checking string: "unsigned short"

Hide Details

Expecting sub string: "unsigned" (was found) Expecting sub string: "short" (was found)

Hide Details

looking at: (unsigned short) $35 = 22002

Hide Details

Hide Details

Checking string: "(unsigned short) $35 = 22002 "

Hide Details

Expecting sub string: "22002" (was found)

Hide Details

runCmd: expression a_union_zero.a output: (unsigned short) $36 = 11001

Hide Details

Hide Details

looking at: unsigned short

Hide Details

Checking string: "unsigned short"

Hide Details

Expecting sub string: "unsigned" (was found) Expecting sub string: "short" (was found)

Hide Details

looking at: (unsigned short) $36 = 11001

Hide Details

Hide Details

Checking string: "(unsigned short) $36 = 11001 "

Hide Details

Expecting sub string: "11001" (was found)

Hide Details

runCmd: expression a_union_zero_ptr->a output: (unsigned short) $37 = 11001

Hide Details

Hide Details

looking at: unsigned short

Hide Details

Checking string: "unsigned short"

Hide Details

Expecting sub string: "unsigned" (was found) Expecting sub string: "short" (was found)

Hide Details

looking at: (unsigned short) $37 = 11001

Hide Details

Hide Details

Checking string: "(unsigned short) $37 = 11001 "

Hide Details

Expecting sub string: "11001" (was found)

Hide Details

runCmd: expression a_union_zero_ref.a output: (unsigned short) $38 = 11001

Hide Details

Hide Details

looking at: unsigned short

Hide Details

Checking string: "unsigned short"

Hide Details

Expecting sub string: "unsigned" (was found) Expecting sub string: "short" (was found)

Hide Details

looking at: (unsigned short) $38 = 11001

Hide Details

Hide Details

Checking string: "(unsigned short) $38 = 11001 "

Hide Details

Expecting sub string: "11001" (was found)

Hide Details

runCmd: expression a_union_nonzero.u.a output: (unsigned short) $39 = 11001

Hide Details

Hide Details

looking at: unsigned short

Hide Details

Checking string: "unsigned short"

Hide Details

Expecting sub string: "unsigned" (was found) Expecting sub string: "short" (was found)

Hide Details

looking at: (unsigned short) $39 = 11001

Hide Details

Hide Details

Checking string: "(unsigned short) $39 = 11001 "

Hide Details

Expecting sub string: "11001" (was found)

Hide Details

runCmd: expression a_union_nonzero_ptr->u.a output: (unsigned short) $40 = 11001

Hide Details

Hide Details

looking at: unsigned short

Hide Details

Checking string: "unsigned short"

Hide Details

Expecting sub string: "unsigned" (was found) Expecting sub string: "short" (was found)

Hide Details

looking at: (unsigned short) $40 = 11001

Hide Details

Hide Details

Checking string: "(unsigned short) $40 = 11001 "

Hide Details

Expecting sub string: "11001" (was found)

Hide Details

runCmd: expression a_union_nonzero_ref.u.a output: (unsigned short) $41 = 11001

Hide Details

Hide Details

looking at: unsigned short

Hide Details

Checking string: "unsigned short"

Hide Details

Expecting sub string: "unsigned" (was found) Expecting sub string: "short" (was found)

Hide Details

looking at: (unsigned short) $41 = 11001

Hide Details

Hide Details

Checking string: "(unsigned short) $41 = 11001 "

Hide Details

Expecting sub string: "11001" (was found)

Hide Details

<bound method SBProcess.Kill of <lldb.SBProcess; proxy of <Swig Object of type 'lldb::SBProcess *' at 0x10ee4c510> >>: success

Hide Details

Executing tearDown hook: self.addTearDownHook(lambda: self.runCmd( "settings set target.inline-breakpoint-strategy headers"))

Hide Details

Hide Details

runCmd: settings set target.inline-breakpoint-strategy headers output:

Hide Details

PASS: LLDB (/Users/buildslave/jenkins/workspace/lldb-cmake/lldb-build/bin/clang-x86_64) :: test_unsigned_short_type_from_block_dsym (TestShortTypeExpr.ShortExprTestCase) runCmd: settings clear -all output:

Hide Details

runCmd: settings set symbols.enable-external-lookup false output:

Hide Details

runCmd: settings set target.inherit-tcc true output:

Hide Details

runCmd: settings set target.auto-apply-fixits false output:

Hide Details

runCmd: settings set plugin.process.gdb-remote.packet-timeout 60 output:

Hide Details

runCmd: settings set symbols.clang-modules-cache-path "/Users/buildslave/jenkins/workspace/lldb-cmake/lldb-build/lldb-test-build.noindex/module-cache-lldb/lldb-api" output:

Hide Details

runCmd: settings set use-color false output:

Hide Details

runCmd: setting set target.prefer-dynamic-value no-dynamic-values output:

Hide Details

runCmd: file /Users/buildslave/jenkins/workspace/lldb-cmake/lldb-build/lldb-test-build.noindex/types/TestShortTypeExpr.test_unsigned_short_type_from_block_dwarf/test_unsigned_short_type_from_block_dwarf output: Current executable set to '/Users/buildslave/jenkins/workspace/lldb-cmake/lldb-build/lldb-test-build.noindex/types/TestShortTypeExpr.test_unsigned_short_type_from_block_dwarf/test_unsigned_short_type_from_block_dwarf' (x86_64).

Hide Details

Hide Details

runCmd: process launch -o "/Users/buildslave/jenkins/workspace/lldb-cmake/lldb-build/lldb-test-build.noindex/types/TestShortTypeExpr.test_unsigned_short_type_from_block_dwarf/test_unsigned_short_type_from_block_dwarf-golden-output.txt" output: Process 83831 exited with status = 0 (0x00000000)

Hide Details

Process 83831 launched: '/Users/buildslave/jenkins/workspace/lldb-cmake/lldb-build/lldb-test-build.noindex/types/TestShortTypeExpr.test_unsigned_short_type_from_block_dwarf/test_unsigned_short_type_from_block_dwarf' (x86_64)

Hide Details

Hide Details

runCmd: settings set target.inline-breakpoint-strategy always output:

Hide Details

Adding tearDown hook: self.addTearDownHook(lambda: self.runCmd( "settings set target.inline-breakpoint-strategy headers"))

Hide Details

Hide Details

runCmd: breakpoint set -f "basic_type.cpp" -l 215 output: Breakpoint 1: where = test_unsigned_short_type_from_block_dwarf`__main_block_invoke + 1016 at basic_type.cpp:215:18, address = 0x0000000100001678

Hide Details

Hide Details

Expecting pattern: ^Breakpoint (?P<bpno>[0-9]+): (?P<num_locations>[0-9]+) locations\.$ Not matched

Hide Details

Expecting pattern: ^Breakpoint (?P<bpno>[0-9]+): (?P<num_locations>no) locations \(pending\)\. Not matched

Hide Details

Expecting pattern: ^Breakpoint (?P<bpno>[0-9]+): where = (?P<module>.*)`(?P<symbol>[+\-]{0,1}[^+]+)( \+ (?P<offset>[0-9]+)){0,1}( \[inlined\] (?P<inline_symbol>.*)){0,1} at (?P<file>[^:]+):(?P<line_no>[0-9]+)(?P<column>(:[0-9]+)?), address = (?P<address>0x[0-9a-fA-F]+)$ Matched

Hide Details

runCmd: run output: Process 83862 stopped * thread #1, queue = 'com.apple.main-thread', stop reason = breakpoint 1.1 frame #0: 0x0000000100001678 test_unsigned_short_type_from_block_dwarf`__main_block_invoke(.block_descriptor=0x00007ffeefbff690) at basic_type.cpp:215:18 212 fprintf (out, "(a_union_nonzero_t*) a_union_nonzero_ptr = %p, a_union_nonzero_ptr->u.a = '" T_PRINTF_FORMAT "'\n", a_union_nonzero_ptr, a_union_nonzero_ptr->u.a); 213 fprintf (out, "(a_union_nonzero_t&) a_union_nonzero_ref = %p, a_union_nonzero_ref.u.a = '" T_PRINTF_FORMAT "'\n", &a_union_nonzero_ref, a_union_nonzero_ref.u.a); 214 -> 215 fprintf (out, "That's All Folks!\n"); // Break here to test block captured variables. ^ 216 }; 217 218 myBlock();

Hide Details

Process 83862 launched: '/Users/buildslave/jenkins/workspace/lldb-cmake/lldb-build/lldb-test-build.noindex/types/TestShortTypeExpr.test_unsigned_short_type_from_block_dwarf/test_unsigned_short_type_from_block_dwarf' (x86_64)

Hide Details

Hide Details

runCmd: process status output: Process 83862 stopped * thread #1, queue = 'com.apple.main-thread', stop reason = breakpoint 1.1 frame #0: 0x0000000100001678 test_unsigned_short_type_from_block_dwarf`__main_block_invoke(.block_descriptor=0x00007ffeefbff690) at basic_type.cpp:215:18 212 fprintf (out, "(a_union_nonzero_t*) a_union_nonzero_ptr = %p, a_union_nonzero_ptr->u.a = '" T_PRINTF_FORMAT "'\n", a_union_nonzero_ptr, a_union_nonzero_ptr->u.a); 213 fprintf (out, "(a_union_nonzero_t&) a_union_nonzero_ref = %p, a_union_nonzero_ref.u.a = '" T_PRINTF_FORMAT "'\n", &a_union_nonzero_ref, a_union_nonzero_ref.u.a); 214 -> 215 fprintf (out, "That's All Folks!\n"); // Break here to test block captured variables. ^ 216 }; 217 218 myBlock();

Hide Details

Hide Details

Ran command: "process status"

Hide Details

Got output: Process 83862 stopped * thread #1, queue = 'com.apple.main-thread', stop reason = breakpoint 1.1 frame #0: 0x0000000100001678 test_unsigned_short_type_from_block_dwarf`__main_block_invoke(.block_descriptor=0x00007ffeefbff690) at basic_type.cpp:215:18 212 fprintf (out, "(a_union_nonzero_t*) a_union_nonzero_ptr = %p, a_union_nonzero_ptr->u.a = '" T_PRINTF_FORMAT "'\n", a_union_nonzero_ptr, a_union_nonzero_ptr->u.a); 213 fprintf (out, "(a_union_nonzero_t&) a_union_nonzero_ref = %p, a_union_nonzero_ref.u.a = '" T_PRINTF_FORMAT "'\n", &a_union_nonzero_ref, a_union_nonzero_ref.u.a); 214 -> 215 fprintf (out, "That's All Folks!\n"); // Break here to test block captured variables. ^ 216 }; 217 218 myBlock();

Hide Details

Expecting sub string: "stop reason = breakpoint" (was found) Expecting sub string: " at basic_type.cpp:215" (was found)

Hide Details

runCmd: expression a output: (unsigned short) $0 = 11001

Hide Details

Hide Details

looking at: unsigned short

Hide Details

Checking string: "unsigned short"

Hide Details

Expecting sub string: "unsigned" (was found) Expecting sub string: "short" (was found)

Hide Details

looking at: (unsigned short) $0 = 11001

Hide Details

Hide Details

Checking string: "(unsigned short) $0 = 11001 "

Hide Details

Expecting sub string: "11001" (was found)

Hide Details

runCmd: expression *a_ptr output: (unsigned short) $1 = 11001

Hide Details

Hide Details

looking at: unsigned short

Hide Details

Checking string: "unsigned short"

Hide Details

Expecting sub string: "unsigned" (was found) Expecting sub string: "short" (was found)

Hide Details

looking at: (unsigned short) $1 = 11001

Hide Details

Hide Details

Checking string: "(unsigned short) $1 = 11001 "

Hide Details

Expecting sub string: "11001" (was found)

Hide Details

runCmd: expression a_ref output: (unsigned short) $2 = 11001

Hide Details

Hide Details

looking at: unsigned short

Hide Details

Checking string: "unsigned short"

Hide Details

Expecting sub string: "unsigned" (was found) Expecting sub string: "short" (was found)

Hide Details

looking at: (unsigned short) $2 = 11001

Hide Details

Hide Details

Checking string: "(unsigned short) $2 = 11001 "

Hide Details

Expecting sub string: "11001" (was found)

Hide Details

runCmd: expression a_class_instance.m_a output: (unsigned short) $3 = 11001

Hide Details

Hide Details

looking at: unsigned short

Hide Details

Checking string: "unsigned short"

Hide Details

Expecting sub string: "unsigned" (was found) Expecting sub string: "short" (was found)

Hide Details

looking at: (unsigned short) $3 = 11001

Hide Details

Hide Details

Checking string: "(unsigned short) $3 = 11001 "

Hide Details

Expecting sub string: "11001" (was found)

Hide Details

runCmd: expression a_class_instance.m_b output: (unsigned short) $4 = 22002

Hide Details

Hide Details

looking at: unsigned short

Hide Details

Checking string: "unsigned short"

Hide Details

Expecting sub string: "unsigned" (was found) Expecting sub string: "short" (was found)

Hide Details

looking at: (unsigned short) $4 = 22002

Hide Details

Hide Details

Checking string: "(unsigned short) $4 = 22002 "

Hide Details

Expecting sub string: "22002" (was found)

Hide Details

runCmd: expression a_class_ptr->m_a output: (unsigned short) $5 = 11001

Hide Details

Hide Details

looking at: unsigned short

Hide Details

Checking string: "unsigned short"

Hide Details

Expecting sub string: "unsigned" (was found) Expecting sub string: "short" (was found)

Hide Details

looking at: (unsigned short) $5 = 11001

Hide Details

Hide Details

Checking string: "(unsigned short) $5 = 11001 "

Hide Details

Expecting sub string: "11001" (was found)

Hide Details

runCmd: expression a_class_ptr->m_b output: (unsigned short) $6 = 22002

Hide Details

Hide Details

looking at: unsigned short

Hide Details

Checking string: "unsigned short"

Hide Details

Expecting sub string: "unsigned" (was found) Expecting sub string: "short" (was found)

Hide Details

looking at: (unsigned short) $6 = 22002

Hide Details

Hide Details

Checking string: "(unsigned short) $6 = 22002 "

Hide Details

Expecting sub string: "22002" (was found)

Hide Details

runCmd: expression a_class_ref.m_a output: (unsigned short) $7 = 11001

Hide Details

Hide Details

looking at: unsigned short

Hide Details

Checking string: "unsigned short"

Hide Details

Expecting sub string: "unsigned" (was found) Expecting sub string: "short" (was found)

Hide Details

looking at: (unsigned short) $7 = 11001

Hide Details

Hide Details

Checking string: "(unsigned short) $7 = 11001 "

Hide Details

Expecting sub string: "11001" (was found)

Hide Details

runCmd: expression a_class_ref.m_b output: (unsigned short) $8 = 22002

Hide Details

Hide Details

looking at: unsigned short

Hide Details

Checking string: "unsigned short"

Hide Details

Expecting sub string: "unsigned" (was found) Expecting sub string: "short" (was found)

Hide Details

looking at: (unsigned short) $8 = 22002

Hide Details

Hide Details

Checking string: "(unsigned short) $8 = 22002 "

Hide Details

Expecting sub string: "22002" (was found)

Hide Details

runCmd: expression a_struct.a output: (unsigned short) $9 = 11001

Hide Details

Hide Details

looking at: unsigned short

Hide Details

Checking string: "unsigned short"

Hide Details

Expecting sub string: "unsigned" (was found) Expecting sub string: "short" (was found)

Hide Details

looking at: (unsigned short) $9 = 11001

Hide Details

Hide Details

Checking string: "(unsigned short) $9 = 11001 "

Hide Details

Expecting sub string: "11001" (was found)

Hide Details

runCmd: expression a_struct.b output: (unsigned short) $10 = 22002

Hide Details

Hide Details

looking at: unsigned short

Hide Details

Checking string: "unsigned short"

Hide Details

Expecting sub string: "unsigned" (was found) Expecting sub string: "short" (was found)

Hide Details

looking at: (unsigned short) $10 = 22002

Hide Details

Hide Details

Checking string: "(unsigned short) $10 = 22002 "

Hide Details

Expecting sub string: "22002" (was found)

Hide Details

runCmd: expression a_struct_ptr->a output: (unsigned short) $11 = 11001

Hide Details

Hide Details

looking at: unsigned short

Hide Details

Checking string: "unsigned short"

Hide Details

Expecting sub string: "unsigned" (was found) Expecting sub string: "short" (was found)

Hide Details

looking at: (unsigned short) $11 = 11001

Hide Details

Hide Details

Checking string: "(unsigned short) $11 = 11001 "

Hide Details

Expecting sub string: "11001" (was found)

Hide Details

runCmd: expression a_struct_ptr->b output: (unsigned short) $12 = 22002

Hide Details

Hide Details

looking at: unsigned short

Hide Details

Checking string: "unsigned short"

Hide Details

Expecting sub string: "unsigned" (was found) Expecting sub string: "short" (was found)

Hide Details

looking at: (unsigned short) $12 = 22002

Hide Details

Hide Details

Checking string: "(unsigned short) $12 = 22002 "

Hide Details

Expecting sub string: "22002" (was found)

Hide Details

runCmd: expression a_struct_ref.a output: (unsigned short) $13 = 11001

Hide Details

Hide Details

looking at: unsigned short

Hide Details

Checking string: "unsigned short"

Hide Details

Expecting sub string: "unsigned" (was found) Expecting sub string: "short" (was found)

Hide Details

looking at: (unsigned short) $13 = 11001

Hide Details

Hide Details

Checking string: "(unsigned short) $13 = 11001 "

Hide Details

Expecting sub string: "11001" (was found)

Hide Details

runCmd: expression a_struct_ref.b output: (unsigned short) $14 = 22002

Hide Details

Hide Details

looking at: unsigned short

Hide Details

Checking string: "unsigned short"

Hide Details

Expecting sub string: "unsigned" (was found) Expecting sub string: "short" (was found)

Hide Details

looking at: (unsigned short) $14 = 22002

Hide Details

Hide Details

Checking string: "(unsigned short) $14 = 22002 "

Hide Details

Expecting sub string: "22002" (was found)

Hide Details

runCmd: expression a_union_zero.a output: (unsigned short) $15 = 11001

Hide Details

Hide Details

looking at: unsigned short

Hide Details

Checking string: "unsigned short"

Hide Details

Expecting sub string: "unsigned" (was found) Expecting sub string: "short" (was found)

Hide Details

looking at: (unsigned short) $15 = 11001

Hide Details

Hide Details

Checking string: "(unsigned short) $15 = 11001 "

Hide Details

Expecting sub string: "11001" (was found)

Hide Details

runCmd: expression a_union_zero_ptr->a output: (unsigned short) $16 = 11001

Hide Details

Hide Details

looking at: unsigned short

Hide Details

Checking string: "unsigned short"

Hide Details

Expecting sub string: "unsigned" (was found) Expecting sub string: "short" (was found)

Hide Details

looking at: (unsigned short) $16 = 11001

Hide Details

Hide Details

Checking string: "(unsigned short) $16 = 11001 "

Hide Details

Expecting sub string: "11001" (was found)

Hide Details

runCmd: expression a_union_zero_ref.a output: (unsigned short) $17 = 11001

Hide Details

Hide Details

looking at: unsigned short

Hide Details

Checking string: "unsigned short"

Hide Details

Expecting sub string: "unsigned" (was found) Expecting sub string: "short" (was found)

Hide Details

looking at: (unsigned short) $17 = 11001

Hide Details

Hide Details

Checking string: "(unsigned short) $17 = 11001 "

Hide Details

Expecting sub string: "11001" (was found)

Hide Details

runCmd: expression a_union_nonzero.u.a output: (unsigned short) $18 = 11001

Hide Details

Hide Details

looking at: unsigned short

Hide Details

Checking string: "unsigned short"

Hide Details

Expecting sub string: "unsigned" (was found) Expecting sub string: "short" (was found)

Hide Details

looking at: (unsigned short) $18 = 11001

Hide Details

Hide Details

Checking string: "(unsigned short) $18 = 11001 "

Hide Details

Expecting sub string: "11001" (was found)

Hide Details

runCmd: expression a_union_nonzero_ptr->u.a output: (unsigned short) $19 = 11001

Hide Details

Hide Details

looking at: unsigned short

Hide Details

Checking string: "unsigned short"

Hide Details

Expecting sub string: "unsigned" (was found) Expecting sub string: "short" (was found)

Hide Details

looking at: (unsigned short) $19 = 11001

Hide Details

Hide Details

Checking string: "(unsigned short) $19 = 11001 "

Hide Details

Expecting sub string: "11001" (was found)

Hide Details

runCmd: expression a_union_nonzero_ref.u.a output: (unsigned short) $20 = 11001

Hide Details

Hide Details

looking at: unsigned short

Hide Details

Checking string: "unsigned short"

Hide Details

Expecting sub string: "unsigned" (was found) Expecting sub string: "short" (was found)

Hide Details

looking at: (unsigned short) $20 = 11001

Hide Details

Hide Details

Checking string: "(unsigned short) $20 = 11001 "

Hide Details

Expecting sub string: "11001" (was found)

Hide Details

runCmd: expression a output: (unsigned short) $21 = 11001

Hide Details

Hide Details

looking at: unsigned short

Hide Details

Checking string: "unsigned short"

Hide Details

Expecting sub string: "unsigned" (was found) Expecting sub string: "short" (was found)

Hide Details

looking at: (unsigned short) $21 = 11001

Hide Details

Hide Details

Checking string: "(unsigned short) $21 = 11001 "

Hide Details

Expecting sub string: "11001" (was found)

Hide Details

runCmd: expression *a_ptr output: (unsigned short) $22 = 11001

Hide Details

Hide Details

looking at: unsigned short

Hide Details

Checking string: "unsigned short"

Hide Details

Expecting sub string: "unsigned" (was found) Expecting sub string: "short" (was found)

Hide Details

looking at: (unsigned short) $22 = 11001

Hide Details

Hide Details

Checking string: "(unsigned short) $22 = 11001 "

Hide Details

Expecting sub string: "11001" (was found)

Hide Details

runCmd: expression a_ref output: (unsigned short) $23 = 11001

Hide Details

Hide Details

looking at: unsigned short

Hide Details

Checking string: "unsigned short"

Hide Details

Expecting sub string: "unsigned" (was found) Expecting sub string: "short" (was found)

Hide Details

looking at: (unsigned short) $23 = 11001

Hide Details

Hide Details

Checking string: "(unsigned short) $23 = 11001 "

Hide Details

Expecting sub string: "11001" (was found)

Hide Details

runCmd: expression a_class_instance.m_a output: (unsigned short) $24 = 11001

Hide Details

Hide Details

looking at: unsigned short

Hide Details

Checking string: "unsigned short"

Hide Details

Expecting sub string: "unsigned" (was found) Expecting sub string: "short" (was found)

Hide Details

looking at: (unsigned short) $24 = 11001

Hide Details

Hide Details

Checking string: "(unsigned short) $24 = 11001 "

Hide Details

Expecting sub string: "11001" (was found)

Hide Details

runCmd: expression a_class_instance.m_b output: (unsigned short) $25 = 22002

Hide Details

Hide Details

looking at: unsigned short

Hide Details

Checking string: "unsigned short"

Hide Details

Expecting sub string: "unsigned" (was found) Expecting sub string: "short" (was found)

Hide Details

looking at: (unsigned short) $25 = 22002

Hide Details

Hide Details

Checking string: "(unsigned short) $25 = 22002 "

Hide Details

Expecting sub string: "22002" (was found)

Hide Details

runCmd: expression a_class_ptr->m_a output: (unsigned short) $26 = 11001

Hide Details

Hide Details

looking at: unsigned short

Hide Details

Checking string: "unsigned short"

Hide Details

Expecting sub string: "unsigned" (was found) Expecting sub string: "short" (was found)

Hide Details

looking at: (unsigned short) $26 = 11001

Hide Details

Hide Details

Checking string: "(unsigned short) $26 = 11001 "

Hide Details

Expecting sub string: "11001" (was found)

Hide Details

runCmd: expression a_class_ptr->m_b output: (unsigned short) $27 = 22002

Hide Details

Hide Details

looking at: unsigned short

Hide Details

Checking string: "unsigned short"

Hide Details

Expecting sub string: "unsigned" (was found) Expecting sub string: "short" (was found)

Hide Details

looking at: (unsigned short) $27 = 22002

Hide Details

Hide Details

Checking string: "(unsigned short) $27 = 22002 "

Hide Details

Expecting sub string: "22002" (was found)

Hide Details

runCmd: expression a_class_ref.m_a output: (unsigned short) $28 = 11001

Hide Details

Hide Details

looking at: unsigned short

Hide Details

Checking string: "unsigned short"

Hide Details

Expecting sub string: "unsigned" (was found) Expecting sub string: "short" (was found)

Hide Details

looking at: (unsigned short) $28 = 11001

Hide Details

Hide Details

Checking string: "(unsigned short) $28 = 11001 "

Hide Details

Expecting sub string: "11001" (was found)

Hide Details

runCmd: expression a_class_ref.m_b output: (unsigned short) $29 = 22002

Hide Details

Hide Details

looking at: unsigned short

Hide Details

Checking string: "unsigned short"

Hide Details

Expecting sub string: "unsigned" (was found) Expecting sub string: "short" (was found)

Hide Details

looking at: (unsigned short) $29 = 22002

Hide Details

Hide Details

Checking string: "(unsigned short) $29 = 22002 "

Hide Details

Expecting sub string: "22002" (was found)

Hide Details

runCmd: expression a_struct.a output: (unsigned short) $30 = 11001

Hide Details

Hide Details

looking at: unsigned short

Hide Details

Checking string: "unsigned short"

Hide Details

Expecting sub string: "unsigned" (was found) Expecting sub string: "short" (was found)

Hide Details

looking at: (unsigned short) $30 = 11001

Hide Details

Hide Details

Checking string: "(unsigned short) $30 = 11001 "

Hide Details

Expecting sub string: "11001" (was found)

Hide Details

runCmd: expression a_struct.b output: (unsigned short) $31 = 22002

Hide Details

Hide Details

looking at: unsigned short

Hide Details

Checking string: "unsigned short"

Hide Details

Expecting sub string: "unsigned" (was found) Expecting sub string: "short" (was found)

Hide Details

looking at: (unsigned short) $31 = 22002

Hide Details

Hide Details

Checking string: "(unsigned short) $31 = 22002 "

Hide Details

Expecting sub string: "22002" (was found)

Hide Details

runCmd: expression a_struct_ptr->a output: (unsigned short) $32 = 11001

Hide Details

Hide Details

looking at: unsigned short

Hide Details

Checking string: "unsigned short"

Hide Details

Expecting sub string: "unsigned" (was found) Expecting sub string: "short" (was found)

Hide Details

looking at: (unsigned short) $32 = 11001

Hide Details

Hide Details

Checking string: "(unsigned short) $32 = 11001 "

Hide Details

Expecting sub string: "11001" (was found)

Hide Details

runCmd: expression a_struct_ptr->b output: (unsigned short) $33 = 22002

Hide Details

Hide Details

looking at: unsigned short

Hide Details

Checking string: "unsigned short"

Hide Details

Expecting sub string: "unsigned" (was found) Expecting sub string: "short" (was found)

Hide Details

looking at: (unsigned short) $33 = 22002

Hide Details

Hide Details

Checking string: "(unsigned short) $33 = 22002 "

Hide Details

Expecting sub string: "22002" (was found)

Hide Details

runCmd: expression a_struct_ref.a output: (unsigned short) $34 = 11001

Hide Details

Hide Details

looking at: unsigned short

Hide Details

Checking string: "unsigned short"

Hide Details

Expecting sub string: "unsigned" (was found) Expecting sub string: "short" (was found)

Hide Details

looking at: (unsigned short) $34 = 11001

Hide Details

Hide Details

Checking string: "(unsigned short) $34 = 11001 "

Hide Details

Expecting sub string: "11001" (was found)

Hide Details

runCmd: expression a_struct_ref.b output: (unsigned short) $35 = 22002

Hide Details

Hide Details

looking at: unsigned short

Hide Details

Checking string: "unsigned short"

Hide Details

Expecting sub string: "unsigned" (was found) Expecting sub string: "short" (was found)

Hide Details

looking at: (unsigned short) $35 = 22002

Hide Details

Hide Details

Checking string: "(unsigned short) $35 = 22002 "

Hide Details

Expecting sub string: "22002" (was found)

Hide Details

runCmd: expression a_union_zero.a output: (unsigned short) $36 = 11001

Hide Details

Hide Details

looking at: unsigned short

Hide Details

Checking string: "unsigned short"

Hide Details

Expecting sub string: "unsigned" (was found) Expecting sub string: "short" (was found)

Hide Details

looking at: (unsigned short) $36 = 11001

Hide Details

Hide Details

Checking string: "(unsigned short) $36 = 11001 "

Hide Details

Expecting sub string: "11001" (was found)

Hide Details

runCmd: expression a_union_zero_ptr->a output: (unsigned short) $37 = 11001

Hide Details

Hide Details

looking at: unsigned short

Hide Details

Checking string: "unsigned short"

Hide Details

Expecting sub string: "unsigned" (was found) Expecting sub string: "short" (was found)

Hide Details

looking at: (unsigned short) $37 = 11001

Hide Details

Hide Details

Checking string: "(unsigned short) $37 = 11001 "

Hide Details

Expecting sub string: "11001" (was found)

Hide Details

runCmd: expression a_union_zero_ref.a output: (unsigned short) $38 = 11001

Hide Details

Hide Details

looking at: unsigned short

Hide Details

Checking string: "unsigned short"

Hide Details

Expecting sub string: "unsigned" (was found) Expecting sub string: "short" (was found)

Hide Details

looking at: (unsigned short) $38 = 11001

Hide Details

Hide Details

Checking string: "(unsigned short) $38 = 11001 "

Hide Details

Expecting sub string: "11001" (was found)

Hide Details

runCmd: expression a_union_nonzero.u.a output: (unsigned short) $39 = 11001

Hide Details

Hide Details

looking at: unsigned short

Hide Details

Checking string: "unsigned short"

Hide Details

Expecting sub string: "unsigned" (was found) Expecting sub string: "short" (was found)

Hide Details

looking at: (unsigned short) $39 = 11001

Hide Details

Hide Details

Checking string: "(unsigned short) $39 = 11001 "

Hide Details

Expecting sub string: "11001" (was found)

Hide Details

runCmd: expression a_union_nonzero_ptr->u.a output: (unsigned short) $40 = 11001

Hide Details

Hide Details

looking at: unsigned short

Hide Details

Checking string: "unsigned short"

Hide Details

Expecting sub string: "unsigned" (was found) Expecting sub string: "short" (was found)

Hide Details

looking at: (unsigned short) $40 = 11001

Hide Details

Hide Details

Checking string: "(unsigned short) $40 = 11001 "

Hide Details

Expecting sub string: "11001" (was found)

Hide Details

runCmd: expression a_union_nonzero_ref.u.a output: (unsigned short) $41 = 11001

Hide Details

Hide Details

looking at: unsigned short

Hide Details

Checking string: "unsigned short"

Hide Details

Expecting sub string: "unsigned" (was found) Expecting sub string: "short" (was found)

Hide Details

looking at: (unsigned short) $41 = 11001

Hide Details

Hide Details

Checking string: "(unsigned short) $41 = 11001 "

Hide Details

Expecting sub string: "11001" (was found)

Hide Details

<bound method SBProcess.Kill of <lldb.SBProcess; proxy of <Swig Object of type 'lldb::SBProcess *' at 0x10ecf0660> >>: success

Hide Details

Executing tearDown hook: self.addTearDownHook(lambda: self.runCmd( "settings set target.inline-breakpoint-strategy headers"))

Hide Details

Hide Details

runCmd: settings set target.inline-breakpoint-strategy headers output:

Hide Details

PASS: LLDB (/Users/buildslave/jenkins/workspace/lldb-cmake/lldb-build/bin/clang-x86_64) :: test_unsigned_short_type_from_block_dwarf (TestShortTypeExpr.ShortExprTestCase) UNSUPPORTED: LLDB (/Users/buildslave/jenkins/workspace/lldb-cmake/lldb-build/bin/clang-x86_64) :: test_unsigned_short_type_from_block_dwo (TestShortTypeExpr.ShortExprTestCase) (test case does not fall in any category of interest for this run) runCmd: settings clear -all output:

Hide Details

runCmd: settings set symbols.enable-external-lookup false output:

Hide Details

runCmd: settings set target.inherit-tcc true output:

Hide Details

runCmd: settings set target.auto-apply-fixits false output:

Hide Details

runCmd: settings set plugin.process.gdb-remote.packet-timeout 60 output:

Hide Details

runCmd: settings set symbols.clang-modules-cache-path "/Users/buildslave/jenkins/workspace/lldb-cmake/lldb-build/lldb-test-build.noindex/module-cache-lldb/lldb-api" output:

Hide Details

runCmd: settings set use-color false output:

Hide Details

runCmd: setting set target.prefer-dynamic-value no-dynamic-values output:

Hide Details

FAIL: LLDB (/Users/buildslave/jenkins/workspace/lldb-cmake/lldb-build/bin/clang-x86_64) :: test_unsigned_short_type_from_block_gmodules (TestShortTypeExpr.ShortExprTestCase) runCmd: settings clear -all output:

Hide Details

runCmd: settings set symbols.enable-external-lookup false output:

Hide Details

runCmd: settings set target.inherit-tcc true output:

Hide Details

runCmd: settings set target.auto-apply-fixits false output:

Hide Details

runCmd: settings set plugin.process.gdb-remote.packet-timeout 60 output:

Hide Details

runCmd: settings set symbols.clang-modules-cache-path "/Users/buildslave/jenkins/workspace/lldb-cmake/lldb-build/lldb-test-build.noindex/module-cache-lldb/lldb-api" output:

Hide Details

runCmd: settings set use-color false output:

Hide Details

runCmd: setting set target.prefer-dynamic-value no-dynamic-values output:

Hide Details

FAIL: LLDB (/Users/buildslave/jenkins/workspace/lldb-cmake/lldb-build/bin/clang-x86_64) :: test_unsigned_short_type_gmodules (TestShortTypeExpr.ShortExprTestCase) Restore dir to: /Users/buildslave/jenkins/workspace/lldb-cmake/lldb-build/tools/lldb/test ====================================================================== ERROR: test_short_type_from_block_gmodules (TestShortTypeExpr.ShortExprTestCase) Test that short-type variables are displayed correctly from a block. ---------------------------------------------------------------------- Error when building test subject.

Hide Details

Build Command: make VPATH=/Users/buildslave/jenkins/workspace/lldb-cmake/llvm-project/lldb/test/API/types -C /Users/buildslave/jenkins/workspace/lldb-cmake/lldb-build/lldb-test-build.noindex/types/TestShortTypeExpr.test_short_type_from_block_gmodules -I /Users/buildslave/jenkins/workspace/lldb-cmake/llvm-project/lldb/test/API/types -I /Users/buildslave/jenkins/workspace/lldb-cmake/llvm-project/lldb/packages/Python/lldbsuite/test/make -f /Users/buildslave/jenkins/workspace/lldb-cmake/llvm-project/lldb/test/API/types/Makefile MAKE_DSYM=NO MAKE_GMODULES=YES ARCH=x86_64 CC="/Users/buildslave/jenkins/workspace/lldb-cmake/lldb-build/bin/clang" DSYMUTIL="/Users/buildslave/jenkins/workspace/lldb-cmake/lldb-build/./bin/dsymutil" CLANG_MODULE_CACHE_DIR=/Users/buildslave/jenkins/workspace/lldb-cmake/lldb-build/lldb-test-build.noindex/module-cache-clang/lldb-api CXX_SOURCES='short.cpp' EXE='test_short_type_from_block_gmodules' CFLAGS_EXTRAS='-DTEST_BLOCK_CAPTURED_VARS'

Hide Details

Build Command Output: While building module 'std' imported from /Users/buildslave/jenkins/workspace/lldb-cmake/llvm-project/lldb/test/API/types/basic_type.cpp:26: In file included from <module-includes>:31: In file included from /Users/buildslave/jenkins/workspace/lldb-cmake/lldb-build/bin/../include/c++/v1/complex.h:28: In file included from /Users/buildslave/jenkins/workspace/lldb-cmake/lldb-build/bin/../include/c++/v1/ccomplex:20: In file included from /Users/buildslave/jenkins/workspace/lldb-cmake/lldb-build/bin/../include/c++/v1/complex:247: In file included from /Users/buildslave/jenkins/workspace/lldb-cmake/lldb-build/bin/../include/c++/v1/sstream:173: /Users/buildslave/jenkins/workspace/lldb-cmake/lldb-build/bin/../include/c++/v1/ostream:1038:45: error: no template named 'enable_if_t'; did you mean 'enable_if'? template <class _Stream, class _Tp, class = enable_if_t< ^ /Users/buildslave/jenkins/workspace/lldb-cmake/lldb-build/bin/../include/c++/v1/type_traits:538:63: note: 'enable_if' declared here template <bool, class _Tp = void> struct _LIBCPP_TEMPLATE_VIS enable_if {}; ^ While building module 'std' imported from /Users/buildslave/jenkins/workspace/lldb-cmake/llvm-project/lldb/test/API/types/basic_type.cpp:26: In file included from <module-includes>:31: In file included from /Users/buildslave/jenkins/workspace/lldb-cmake/lldb-build/bin/../include/c++/v1/complex.h:28: In file included from /Users/buildslave/jenkins/workspace/lldb-cmake/lldb-build/bin/../include/c++/v1/ccomplex:20: In file included from /Users/buildslave/jenkins/workspace/lldb-cmake/lldb-build/bin/../include/c++/v1/complex:247: In file included from /Users/buildslave/jenkins/workspace/lldb-cmake/lldb-build/bin/../include/c++/v1/sstream:174: /Users/buildslave/jenkins/workspace/lldb-cmake/lldb-build/bin/../include/c++/v1/istream:1389:45: error: no template named 'enable_if_t'; did you mean 'enable_if'? template <class _Stream, class _Tp, class = enable_if_t< ^ /Users/buildslave/jenkins/workspace/lldb-cmake/lldb-build/bin/../include/c++/v1/type_traits:538:63: note: 'enable_if' declared here template <bool, class _Tp = void> struct _LIBCPP_TEMPLATE_VIS enable_if {}; ^ In file included from /Users/buildslave/jenkins/workspace/lldb-cmake/llvm-project/lldb/test/API/types/short.cpp:9: /Users/buildslave/jenkins/workspace/lldb-cmake/llvm-project/lldb/test/API/types/basic_type.cpp:26:10: fatal error: could not build module 'std' #include <cstdint> ~~~~~~~~^ 3 errors generated. /Users/buildslave/jenkins/workspace/lldb-cmake/lldb-build/bin/clang -fmodules -gmodules -fmodules-cache-path=/Users/buildslave/jenkins/workspace/lldb-cmake/lldb-build/lldb-test-build.noindex/module-cache-clang/lldb-api -gmodules -fcxx-modules -std=c++11 -g -O0 -fno-builtin -isysroot "/Applications/Xcode.app/Contents/Developer/Platforms/MacOSX.platform/Developer/SDKs/MacOSX10.15.sdk" -arch x86_64 -I/Users/buildslave/jenkins/workspace/lldb-cmake/llvm-project/lldb/packages/Python/lldbsuite/test/make/../../../../../include -I/Users/buildslave/jenkins/workspace/lldb-cmake/llvm-project/lldb/test/API/types -I/Users/buildslave/jenkins/workspace/lldb-cmake/llvm-project/lldb/packages/Python/lldbsuite/test/make -include /Users/buildslave/jenkins/workspace/lldb-cmake/llvm-project/lldb/packages/Python/lldbsuite/test/make/test_common.h -fno-limit-debug-info -fmodules -gmodules -fmodules-cache-path=/Users/buildslave/jenkins/workspace/lldb-cmake/lldb-build/lldb-test-build.noindex/module-cache-clang/lldb-api -gmodules -fcxx-modules -DTEST_BLOCK_CAPTURED_VARS --driver-mode=g++ -c -o short.o /Users/buildslave/jenkins/workspace/lldb-cmake/llvm-project/lldb/test/API/types/short.cpp While building module 'std' imported from /Users/buildslave/jenkins/workspace/lldb-cmake/llvm-project/lldb/test/API/types/basic_type.cpp:26: In file included from <module-includes>:31: In file included from /Users/buildslave/jenkins/workspace/lldb-cmake/lldb-build/bin/../include/c++/v1/complex.h:28: In file included from /Users/buildslave/jenkins/workspace/lldb-cmake/lldb-build/bin/../include/c++/v1/ccomplex:20: In file included from /Users/buildslave/jenkins/workspace/lldb-cmake/lldb-build/bin/../include/c++/v1/complex:247: In file included from /Users/buildslave/jenkins/workspace/lldb-cmake/lldb-build/bin/../include/c++/v1/sstream:173: /Users/buildslave/jenkins/workspace/lldb-cmake/lldb-build/bin/../include/c++/v1/ostream:1038:45: error: no template named 'enable_if_t'; did you mean 'enable_if'? template <class _Stream, class _Tp, class = enable_if_t< ^ /Users/buildslave/jenkins/workspace/lldb-cmake/lldb-build/bin/../include/c++/v1/type_traits:538:63: note: 'enable_if' declared here template <bool, class _Tp = void> struct _LIBCPP_TEMPLATE_VIS enable_if {}; ^ While building module 'std' imported from /Users/buildslave/jenkins/workspace/lldb-cmake/llvm-project/lldb/test/API/types/basic_type.cpp:26: In file included from <module-includes>:31: In file included from /Users/buildslave/jenkins/workspace/lldb-cmake/lldb-build/bin/../include/c++/v1/complex.h:28: In file included from /Users/buildslave/jenkins/workspace/lldb-cmake/lldb-build/bin/../include/c++/v1/ccomplex:20: In file included from /Users/buildslave/jenkins/workspace/lldb-cmake/lldb-build/bin/../include/c++/v1/complex:247: In file included from /Users/buildslave/jenkins/workspace/lldb-cmake/lldb-build/bin/../include/c++/v1/sstream:174: /Users/buildslave/jenkins/workspace/lldb-cmake/lldb-build/bin/../include/c++/v1/istream:1389:45: error: no template named 'enable_if_t'; did you mean 'enable_if'? template <class _Stream, class _Tp, class = enable_if_t< ^ /Users/buildslave/jenkins/workspace/lldb-cmake/lldb-build/bin/../include/c++/v1/type_traits:538:63: note: 'enable_if' declared here template <bool, class _Tp = void> struct _LIBCPP_TEMPLATE_VIS enable_if {}; ^ In file included from /Users/buildslave/jenkins/workspace/lldb-cmake/llvm-project/lldb/test/API/types/short.cpp:9: /Users/buildslave/jenkins/workspace/lldb-cmake/llvm-project/lldb/test/API/types/basic_type.cpp:26:10: fatal error: could not build module 'std' #include <cstdint> ~~~~~~~~^ 3 errors generated. make: *** [short.o] Error 1

Hide Details

Test Directory: /Users/buildslave/jenkins/workspace/lldb-cmake/llvm-project/lldb/test/API/types ====================================================================== ERROR: test_short_type_gmodules (TestShortTypeExpr.ShortExprTestCase) Test that short-type variable expressions are evaluated correctly. ---------------------------------------------------------------------- Error when building test subject.

Hide Details

Build Command: make VPATH=/Users/buildslave/jenkins/workspace/lldb-cmake/llvm-project/lldb/test/API/types -C /Users/buildslave/jenkins/workspace/lldb-cmake/lldb-build/lldb-test-build.noindex/types/TestShortTypeExpr.test_short_type_gmodules -I /Users/buildslave/jenkins/workspace/lldb-cmake/llvm-project/lldb/test/API/types -I /Users/buildslave/jenkins/workspace/lldb-cmake/llvm-project/lldb/packages/Python/lldbsuite/test/make -f /Users/buildslave/jenkins/workspace/lldb-cmake/llvm-project/lldb/test/API/types/Makefile MAKE_DSYM=NO MAKE_GMODULES=YES ARCH=x86_64 CC="/Users/buildslave/jenkins/workspace/lldb-cmake/lldb-build/bin/clang" DSYMUTIL="/Users/buildslave/jenkins/workspace/lldb-cmake/lldb-build/./bin/dsymutil" CLANG_MODULE_CACHE_DIR=/Users/buildslave/jenkins/workspace/lldb-cmake/lldb-build/lldb-test-build.noindex/module-cache-clang/lldb-api CXX_SOURCES='short.cpp' EXE='test_short_type_gmodules'

Hide Details

Build Command Output: While building module 'std' imported from /Users/buildslave/jenkins/workspace/lldb-cmake/llvm-project/lldb/test/API/types/basic_type.cpp:26: In file included from <module-includes>:31: In file included from /Users/buildslave/jenkins/workspace/lldb-cmake/lldb-build/bin/../include/c++/v1/complex.h:28: In file included from /Users/buildslave/jenkins/workspace/lldb-cmake/lldb-build/bin/../include/c++/v1/ccomplex:20: In file included from /Users/buildslave/jenkins/workspace/lldb-cmake/lldb-build/bin/../include/c++/v1/complex:247: In file included from /Users/buildslave/jenkins/workspace/lldb-cmake/lldb-build/bin/../include/c++/v1/sstream:173: /Users/buildslave/jenkins/workspace/lldb-cmake/lldb-build/bin/../include/c++/v1/ostream:1038:45: error: no template named 'enable_if_t'; did you mean 'enable_if'? template <class _Stream, class _Tp, class = enable_if_t< ^ /Users/buildslave/jenkins/workspace/lldb-cmake/lldb-build/bin/../include/c++/v1/type_traits:538:63: note: 'enable_if' declared here template <bool, class _Tp = void> struct _LIBCPP_TEMPLATE_VIS enable_if {}; ^ While building module 'std' imported from /Users/buildslave/jenkins/workspace/lldb-cmake/llvm-project/lldb/test/API/types/basic_type.cpp:26: In file included from <module-includes>:31: In file included from /Users/buildslave/jenkins/workspace/lldb-cmake/lldb-build/bin/../include/c++/v1/complex.h:28: In file included from /Users/buildslave/jenkins/workspace/lldb-cmake/lldb-build/bin/../include/c++/v1/ccomplex:20: In file included from /Users/buildslave/jenkins/workspace/lldb-cmake/lldb-build/bin/../include/c++/v1/complex:247: In file included from /Users/buildslave/jenkins/workspace/lldb-cmake/lldb-build/bin/../include/c++/v1/sstream:174: /Users/buildslave/jenkins/workspace/lldb-cmake/lldb-build/bin/../include/c++/v1/istream:1389:45: error: no template named 'enable_if_t'; did you mean 'enable_if'? template <class _Stream, class _Tp, class = enable_if_t< ^ /Users/buildslave/jenkins/workspace/lldb-cmake/lldb-build/bin/../include/c++/v1/type_traits:538:63: note: 'enable_if' declared here template <bool, class _Tp = void> struct _LIBCPP_TEMPLATE_VIS enable_if {}; ^ In file included from /Users/buildslave/jenkins/workspace/lldb-cmake/llvm-project/lldb/test/API/types/short.cpp:9: /Users/buildslave/jenkins/workspace/lldb-cmake/llvm-project/lldb/test/API/types/basic_type.cpp:26:10: fatal error: could not build module 'std' #include <cstdint> ~~~~~~~~^ 3 errors generated. /Users/buildslave/jenkins/workspace/lldb-cmake/lldb-build/bin/clang -fmodules -gmodules -fmodules-cache-path=/Users/buildslave/jenkins/workspace/lldb-cmake/lldb-build/lldb-test-build.noindex/module-cache-clang/lldb-api -gmodules -fcxx-modules -std=c++11 -g -O0 -fno-builtin -isysroot "/Applications/Xcode.app/Contents/Developer/Platforms/MacOSX.platform/Developer/SDKs/MacOSX10.15.sdk" -arch x86_64 -I/Users/buildslave/jenkins/workspace/lldb-cmake/llvm-project/lldb/packages/Python/lldbsuite/test/make/../../../../../include -I/Users/buildslave/jenkins/workspace/lldb-cmake/llvm-project/lldb/test/API/types -I/Users/buildslave/jenkins/workspace/lldb-cmake/llvm-project/lldb/packages/Python/lldbsuite/test/make -include /Users/buildslave/jenkins/workspace/lldb-cmake/llvm-project/lldb/packages/Python/lldbsuite/test/make/test_common.h -fno-limit-debug-info -fmodules -gmodules -fmodules-cache-path=/Users/buildslave/jenkins/workspace/lldb-cmake/lldb-build/lldb-test-build.noindex/module-cache-clang/lldb-api -gmodules -fcxx-modules --driver-mode=g++ -c -o short.o /Users/buildslave/jenkins/workspace/lldb-cmake/llvm-project/lldb/test/API/types/short.cpp While building module 'std' imported from /Users/buildslave/jenkins/workspace/lldb-cmake/llvm-project/lldb/test/API/types/basic_type.cpp:26: In file included from <module-includes>:31: In file included from /Users/buildslave/jenkins/workspace/lldb-cmake/lldb-build/bin/../include/c++/v1/complex.h:28: In file included from /Users/buildslave/jenkins/workspace/lldb-cmake/lldb-build/bin/../include/c++/v1/ccomplex:20: In file included from /Users/buildslave/jenkins/workspace/lldb-cmake/lldb-build/bin/../include/c++/v1/complex:247: In file included from /Users/buildslave/jenkins/workspace/lldb-cmake/lldb-build/bin/../include/c++/v1/sstream:173: /Users/buildslave/jenkins/workspace/lldb-cmake/lldb-build/bin/../include/c++/v1/ostream:1038:45: error: no template named 'enable_if_t'; did you mean 'enable_if'? template <class _Stream, class _Tp, class = enable_if_t< ^ /Users/buildslave/jenkins/workspace/lldb-cmake/lldb-build/bin/../include/c++/v1/type_traits:538:63: note: 'enable_if' declared here template <bool, class _Tp = void> struct _LIBCPP_TEMPLATE_VIS enable_if {}; ^ While building module 'std' imported from /Users/buildslave/jenkins/workspace/lldb-cmake/llvm-project/lldb/test/API/types/basic_type.cpp:26: In file included from <module-includes>:31: In file included from /Users/buildslave/jenkins/workspace/lldb-cmake/lldb-build/bin/../include/c++/v1/complex.h:28: In file included from /Users/buildslave/jenkins/workspace/lldb-cmake/lldb-build/bin/../include/c++/v1/ccomplex:20: In file included from /Users/buildslave/jenkins/workspace/lldb-cmake/lldb-build/bin/../include/c++/v1/complex:247: In file included from /Users/buildslave/jenkins/workspace/lldb-cmake/lldb-build/bin/../include/c++/v1/sstream:174: /Users/buildslave/jenkins/workspace/lldb-cmake/lldb-build/bin/../include/c++/v1/istream:1389:45: error: no template named 'enable_if_t'; did you mean 'enable_if'? template <class _Stream, class _Tp, class = enable_if_t< ^ /Users/buildslave/jenkins/workspace/lldb-cmake/lldb-build/bin/../include/c++/v1/type_traits:538:63: note: 'enable_if' declared here template <bool, class _Tp = void> struct _LIBCPP_TEMPLATE_VIS enable_if {}; ^ In file included from /Users/buildslave/jenkins/workspace/lldb-cmake/llvm-project/lldb/test/API/types/short.cpp:9: /Users/buildslave/jenkins/workspace/lldb-cmake/llvm-project/lldb/test/API/types/basic_type.cpp:26:10: fatal error: could not build module 'std' #include <cstdint> ~~~~~~~~^ 3 errors generated. make: *** [short.o] Error 1

Hide Details

Test Directory: /Users/buildslave/jenkins/workspace/lldb-cmake/llvm-project/lldb/test/API/types ====================================================================== ERROR: test_unsigned_short_type_from_block_gmodules (TestShortTypeExpr.ShortExprTestCase) Test that 'unsigned short'-type variables are displayed correctly from a block. ---------------------------------------------------------------------- Error when building test subject.

Hide Details

Build Command: make VPATH=/Users/buildslave/jenkins/workspace/lldb-cmake/llvm-project/lldb/test/API/types -C /Users/buildslave/jenkins/workspace/lldb-cmake/lldb-build/lldb-test-build.noindex/types/TestShortTypeExpr.test_unsigned_short_type_from_block_gmodules -I /Users/buildslave/jenkins/workspace/lldb-cmake/llvm-project/lldb/test/API/types -I /Users/buildslave/jenkins/workspace/lldb-cmake/llvm-project/lldb/packages/Python/lldbsuite/test/make -f /Users/buildslave/jenkins/workspace/lldb-cmake/llvm-project/lldb/test/API/types/Makefile MAKE_DSYM=NO MAKE_GMODULES=YES ARCH=x86_64 CC="/Users/buildslave/jenkins/workspace/lldb-cmake/lldb-build/bin/clang" DSYMUTIL="/Users/buildslave/jenkins/workspace/lldb-cmake/lldb-build/./bin/dsymutil" CLANG_MODULE_CACHE_DIR=/Users/buildslave/jenkins/workspace/lldb-cmake/lldb-build/lldb-test-build.noindex/module-cache-clang/lldb-api CXX_SOURCES='unsigned_short.cpp' EXE='test_unsigned_short_type_from_block_gmodules' CFLAGS_EXTRAS='-DTEST_BLOCK_CAPTURED_VARS'

Hide Details

Build Command Output: While building module 'std' imported from /Users/buildslave/jenkins/workspace/lldb-cmake/llvm-project/lldb/test/API/types/basic_type.cpp:26: In file included from <module-includes>:31: In file included from /Users/buildslave/jenkins/workspace/lldb-cmake/lldb-build/bin/../include/c++/v1/complex.h:28: In file included from /Users/buildslave/jenkins/workspace/lldb-cmake/lldb-build/bin/../include/c++/v1/ccomplex:20: In file included from /Users/buildslave/jenkins/workspace/lldb-cmake/lldb-build/bin/../include/c++/v1/complex:247: In file included from /Users/buildslave/jenkins/workspace/lldb-cmake/lldb-build/bin/../include/c++/v1/sstream:173: /Users/buildslave/jenkins/workspace/lldb-cmake/lldb-build/bin/../include/c++/v1/ostream:1038:45: error: no template named 'enable_if_t'; did you mean 'enable_if'? template <class _Stream, class _Tp, class = enable_if_t< ^ /Users/buildslave/jenkins/workspace/lldb-cmake/lldb-build/bin/../include/c++/v1/type_traits:538:63: note: 'enable_if' declared here template <bool, class _Tp = void> struct _LIBCPP_TEMPLATE_VIS enable_if {}; ^ While building module 'std' imported from /Users/buildslave/jenkins/workspace/lldb-cmake/llvm-project/lldb/test/API/types/basic_type.cpp:26: In file included from <module-includes>:31: In file included from /Users/buildslave/jenkins/workspace/lldb-cmake/lldb-build/bin/../include/c++/v1/complex.h:28: In file included from /Users/buildslave/jenkins/workspace/lldb-cmake/lldb-build/bin/../include/c++/v1/ccomplex:20: In file included from /Users/buildslave/jenkins/workspace/lldb-cmake/lldb-build/bin/../include/c++/v1/complex:247: In file included from /Users/buildslave/jenkins/workspace/lldb-cmake/lldb-build/bin/../include/c++/v1/sstream:174: /Users/buildslave/jenkins/workspace/lldb-cmake/lldb-build/bin/../include/c++/v1/istream:1389:45: error: no template named 'enable_if_t'; did you mean 'enable_if'? template <class _Stream, class _Tp, class = enable_if_t< ^ /Users/buildslave/jenkins/workspace/lldb-cmake/lldb-build/bin/../include/c++/v1/type_traits:538:63: note: 'enable_if' declared here template <bool, class _Tp = void> struct _LIBCPP_TEMPLATE_VIS enable_if {}; ^ In file included from /Users/buildslave/jenkins/workspace/lldb-cmake/llvm-project/lldb/test/API/types/unsigned_short.cpp:9: /Users/buildslave/jenkins/workspace/lldb-cmake/llvm-project/lldb/test/API/types/basic_type.cpp:26:10: fatal error: could not build module 'std' #include <cstdint> ~~~~~~~~^ 3 errors generated. /Users/buildslave/jenkins/workspace/lldb-cmake/lldb-build/bin/clang -fmodules -gmodules -fmodules-cache-path=/Users/buildslave/jenkins/workspace/lldb-cmake/lldb-build/lldb-test-build.noindex/module-cache-clang/lldb-api -gmodules -fcxx-modules -std=c++11 -g -O0 -fno-builtin -isysroot "/Applications/Xcode.app/Contents/Developer/Platforms/MacOSX.platform/Developer/SDKs/MacOSX10.15.sdk" -arch x86_64 -I/Users/buildslave/jenkins/workspace/lldb-cmake/llvm-project/lldb/packages/Python/lldbsuite/test/make/../../../../../include -I/Users/buildslave/jenkins/workspace/lldb-cmake/llvm-project/lldb/test/API/types -I/Users/buildslave/jenkins/workspace/lldb-cmake/llvm-project/lldb/packages/Python/lldbsuite/test/make -include /Users/buildslave/jenkins/workspace/lldb-cmake/llvm-project/lldb/packages/Python/lldbsuite/test/make/test_common.h -fno-limit-debug-info -fmodules -gmodules -fmodules-cache-path=/Users/buildslave/jenkins/workspace/lldb-cmake/lldb-build/lldb-test-build.noindex/module-cache-clang/lldb-api -gmodules -fcxx-modules -DTEST_BLOCK_CAPTURED_VARS --driver-mode=g++ -c -o unsigned_short.o /Users/buildslave/jenkins/workspace/lldb-cmake/llvm-project/lldb/test/API/types/unsigned_short.cpp While building module 'std' imported from /Users/buildslave/jenkins/workspace/lldb-cmake/llvm-project/lldb/test/API/types/basic_type.cpp:26: In file included from <module-includes>:31: In file included from /Users/buildslave/jenkins/workspace/lldb-cmake/lldb-build/bin/../include/c++/v1/complex.h:28: In file included from /Users/buildslave/jenkins/workspace/lldb-cmake/lldb-build/bin/../include/c++/v1/ccomplex:20: In file included from /Users/buildslave/jenkins/workspace/lldb-cmake/lldb-build/bin/../include/c++/v1/complex:247: In file included from /Users/buildslave/jenkins/workspace/lldb-cmake/lldb-build/bin/../include/c++/v1/sstream:173: /Users/buildslave/jenkins/workspace/lldb-cmake/lldb-build/bin/../include/c++/v1/ostream:1038:45: error: no template named 'enable_if_t'; did you mean 'enable_if'? template <class _Stream, class _Tp, class = enable_if_t< ^ /Users/buildslave/jenkins/workspace/lldb-cmake/lldb-build/bin/../include/c++/v1/type_traits:538:63: note: 'enable_if' declared here template <bool, class _Tp = void> struct _LIBCPP_TEMPLATE_VIS enable_if {}; ^ While building module 'std' imported from /Users/buildslave/jenkins/workspace/lldb-cmake/llvm-project/lldb/test/API/types/basic_type.cpp:26: In file included from <module-includes>:31: In file included from /Users/buildslave/jenkins/workspace/lldb-cmake/lldb-build/bin/../include/c++/v1/complex.h:28: In file included from /Users/buildslave/jenkins/workspace/lldb-cmake/lldb-build/bin/../include/c++/v1/ccomplex:20: In file included from /Users/buildslave/jenkins/workspace/lldb-cmake/lldb-build/bin/../include/c++/v1/complex:247: In file included from /Users/buildslave/jenkins/workspace/lldb-cmake/lldb-build/bin/../include/c++/v1/sstream:174: /Users/buildslave/jenkins/workspace/lldb-cmake/lldb-build/bin/../include/c++/v1/istream:1389:45: error: no template named 'enable_if_t'; did you mean 'enable_if'? template <class _Stream, class _Tp, class = enable_if_t< ^ /Users/buildslave/jenkins/workspace/lldb-cmake/lldb-build/bin/../include/c++/v1/type_traits:538:63: note: 'enable_if' declared here template <bool, class _Tp = void> struct _LIBCPP_TEMPLATE_VIS enable_if {}; ^ In file included from /Users/buildslave/jenkins/workspace/lldb-cmake/llvm-project/lldb/test/API/types/unsigned_short.cpp:9: /Users/buildslave/jenkins/workspace/lldb-cmake/llvm-project/lldb/test/API/types/basic_type.cpp:26:10: fatal error: could not build module 'std' #include <cstdint> ~~~~~~~~^ 3 errors generated. make: *** [unsigned_short.o] Error 1

Hide Details

Test Directory: /Users/buildslave/jenkins/workspace/lldb-cmake/llvm-project/lldb/test/API/types ====================================================================== ERROR: test_unsigned_short_type_gmodules (TestShortTypeExpr.ShortExprTestCase) Test that 'unsigned_short'-type variable expressions are evaluated correctly. ---------------------------------------------------------------------- Error when building test subject.

Hide Details

Build Command: make VPATH=/Users/buildslave/jenkins/workspace/lldb-cmake/llvm-project/lldb/test/API/types -C /Users/buildslave/jenkins/workspace/lldb-cmake/lldb-build/lldb-test-build.noindex/types/TestShortTypeExpr.test_unsigned_short_type_gmodules -I /Users/buildslave/jenkins/workspace/lldb-cmake/llvm-project/lldb/test/API/types -I /Users/buildslave/jenkins/workspace/lldb-cmake/llvm-project/lldb/packages/Python/lldbsuite/test/make -f /Users/buildslave/jenkins/workspace/lldb-cmake/llvm-project/lldb/test/API/types/Makefile MAKE_DSYM=NO MAKE_GMODULES=YES ARCH=x86_64 CC="/Users/buildslave/jenkins/workspace/lldb-cmake/lldb-build/bin/clang" DSYMUTIL="/Users/buildslave/jenkins/workspace/lldb-cmake/lldb-build/./bin/dsymutil" CLANG_MODULE_CACHE_DIR=/Users/buildslave/jenkins/workspace/lldb-cmake/lldb-build/lldb-test-build.noindex/module-cache-clang/lldb-api CXX_SOURCES='unsigned_short.cpp' EXE='test_unsigned_short_type_gmodules'

Hide Details

Build Command Output: While building module 'std' imported from /Users/buildslave/jenkins/workspace/lldb-cmake/llvm-project/lldb/test/API/types/basic_type.cpp:26: In file included from <module-includes>:31: In file included from /Users/buildslave/jenkins/workspace/lldb-cmake/lldb-build/bin/../include/c++/v1/complex.h:28: In file included from /Users/buildslave/jenkins/workspace/lldb-cmake/lldb-build/bin/../include/c++/v1/ccomplex:20: In file included from /Users/buildslave/jenkins/workspace/lldb-cmake/lldb-build/bin/../include/c++/v1/complex:247: In file included from /Users/buildslave/jenkins/workspace/lldb-cmake/lldb-build/bin/../include/c++/v1/sstream:173: /Users/buildslave/jenkins/workspace/lldb-cmake/lldb-build/bin/../include/c++/v1/ostream:1038:45: error: no template named 'enable_if_t'; did you mean 'enable_if'? template <class _Stream, class _Tp, class = enable_if_t< ^ /Users/buildslave/jenkins/workspace/lldb-cmake/lldb-build/bin/../include/c++/v1/type_traits:538:63: note: 'enable_if' declared here template <bool, class _Tp = void> struct _LIBCPP_TEMPLATE_VIS enable_if {}; ^ While building module 'std' imported from /Users/buildslave/jenkins/workspace/lldb-cmake/llvm-project/lldb/test/API/types/basic_type.cpp:26: In file included from <module-includes>:31: In file included from /Users/buildslave/jenkins/workspace/lldb-cmake/lldb-build/bin/../include/c++/v1/complex.h:28: In file included from /Users/buildslave/jenkins/workspace/lldb-cmake/lldb-build/bin/../include/c++/v1/ccomplex:20: In file included from /Users/buildslave/jenkins/workspace/lldb-cmake/lldb-build/bin/../include/c++/v1/complex:247: In file included from /Users/buildslave/jenkins/workspace/lldb-cmake/lldb-build/bin/../include/c++/v1/sstream:174: /Users/buildslave/jenkins/workspace/lldb-cmake/lldb-build/bin/../include/c++/v1/istream:1389:45: error: no template named 'enable_if_t'; did you mean 'enable_if'? template <class _Stream, class _Tp, class = enable_if_t< ^ /Users/buildslave/jenkins/workspace/lldb-cmake/lldb-build/bin/../include/c++/v1/type_traits:538:63: note: 'enable_if' declared here template <bool, class _Tp = void> struct _LIBCPP_TEMPLATE_VIS enable_if {}; ^ In file included from /Users/buildslave/jenkins/workspace/lldb-cmake/llvm-project/lldb/test/API/types/unsigned_short.cpp:9: /Users/buildslave/jenkins/workspace/lldb-cmake/llvm-project/lldb/test/API/types/basic_type.cpp:26:10: fatal error: could not build module 'std' #include <cstdint> ~~~~~~~~^ 3 errors generated. /Users/buildslave/jenkins/workspace/lldb-cmake/lldb-build/bin/clang -fmodules -gmodules -fmodules-cache-path=/Users/buildslave/jenkins/workspace/lldb-cmake/lldb-build/lldb-test-build.noindex/module-cache-clang/lldb-api -gmodules -fcxx-modules -std=c++11 -g -O0 -fno-builtin -isysroot "/Applications/Xcode.app/Contents/Developer/Platforms/MacOSX.platform/Developer/SDKs/MacOSX10.15.sdk" -arch x86_64 -I/Users/buildslave/jenkins/workspace/lldb-cmake/llvm-project/lldb/packages/Python/lldbsuite/test/make/../../../../../include -I/Users/buildslave/jenkins/workspace/lldb-cmake/llvm-project/lldb/test/API/types -I/Users/buildslave/jenkins/workspace/lldb-cmake/llvm-project/lldb/packages/Python/lldbsuite/test/make -include /Users/buildslave/jenkins/workspace/lldb-cmake/llvm-project/lldb/packages/Python/lldbsuite/test/make/test_common.h -fno-limit-debug-info -fmodules -gmodules -fmodules-cache-path=/Users/buildslave/jenkins/workspace/lldb-cmake/lldb-build/lldb-test-build.noindex/module-cache-clang/lldb-api -gmodules -fcxx-modules --driver-mode=g++ -c -o unsigned_short.o /Users/buildslave/jenkins/workspace/lldb-cmake/llvm-project/lldb/test/API/types/unsigned_short.cpp While building module 'std' imported from /Users/buildslave/jenkins/workspace/lldb-cmake/llvm-project/lldb/test/API/types/basic_type.cpp:26: In file included from <module-includes>:31: In file included from /Users/buildslave/jenkins/workspace/lldb-cmake/lldb-build/bin/../include/c++/v1/complex.h:28: In file included from /Users/buildslave/jenkins/workspace/lldb-cmake/lldb-build/bin/../include/c++/v1/ccomplex:20: In file included from /Users/buildslave/jenkins/workspace/lldb-cmake/lldb-build/bin/../include/c++/v1/complex:247: In file included from /Users/buildslave/jenkins/workspace/lldb-cmake/lldb-build/bin/../include/c++/v1/sstream:173: /Users/buildslave/jenkins/workspace/lldb-cmake/lldb-build/bin/../include/c++/v1/ostream:1038:45: error: no template named 'enable_if_t'; did you mean 'enable_if'? template <class _Stream, class _Tp, class = enable_if_t< ^ /Users/buildslave/jenkins/workspace/lldb-cmake/lldb-build/bin/../include/c++/v1/type_traits:538:63: note: 'enable_if' declared here template <bool, class _Tp = void> struct _LIBCPP_TEMPLATE_VIS enable_if {}; ^ While building module 'std' imported from /Users/buildslave/jenkins/workspace/lldb-cmake/llvm-project/lldb/test/API/types/basic_type.cpp:26: In file included from <module-includes>:31: In file included from /Users/buildslave/jenkins/workspace/lldb-cmake/lldb-build/bin/../include/c++/v1/complex.h:28: In file included from /Users/buildslave/jenkins/workspace/lldb-cmake/lldb-build/bin/../include/c++/v1/ccomplex:20: In file included from /Users/buildslave/jenkins/workspace/lldb-cmake/lldb-build/bin/../include/c++/v1/complex:247: In file included from /Users/buildslave/jenkins/workspace/lldb-cmake/lldb-build/bin/../include/c++/v1/sstream:174: /Users/buildslave/jenkins/workspace/lldb-cmake/lldb-build/bin/../include/c++/v1/istream:1389:45: error: no template named 'enable_if_t'; did you mean 'enable_if'? template <class _Stream, class _Tp, class = enable_if_t< ^ /Users/buildslave/jenkins/workspace/lldb-cmake/lldb-build/bin/../include/c++/v1/type_traits:538:63: note: 'enable_if' declared here template <bool, class _Tp = void> struct _LIBCPP_TEMPLATE_VIS enable_if {}; ^ In file included from /Users/buildslave/jenkins/workspace/lldb-cmake/llvm-project/lldb/test/API/types/unsigned_short.cpp:9: /Users/buildslave/jenkins/workspace/lldb-cmake/llvm-project/lldb/test/API/types/basic_type.cpp:26:10: fatal error: could not build module 'std' #include <cstdint> ~~~~~~~~^ 3 errors generated. make: *** [unsigned_short.o] Error 1

Hide Details

Test Directory: /Users/buildslave/jenkins/workspace/lldb-cmake/llvm-project/lldb/test/API/types ---------------------------------------------------------------------- Ran 16 tests in 36.764s

Hide Details

RESULT: FAILED (8 passes, 0 failures, 4 errors, 4 skipped, 0 expected failures, 0 unexpected successes)

Hide Details

--

Hide Details

******************** PASS: lldb-unit :: Utility/./UtilityTests/UriParserTest.MinimalPort (2087 of 2150) PASS: lldb-unit :: Language/Highlighting/./HighlighterTests/HighlighterTest.ClangCursorPosEndOfLine (2088 of 2150) PASS: lldb-unit :: Utility/./UtilityTests/FileSpecTest.CopyByAppendingPathComponent (2089 of 2150) PASS: lldb-unit :: Utility/./UtilityTests/ProcessInstanceInfoMatch.Name (2090 of 2150) PASS: lldb-unit :: Utility/./UtilityTests/StringExtractorTest.GetHexU8_Underflow2 (2091 of 2150) PASS: lldb-api :: commands/expression/two-files/TestObjCTypeQueryFromOtherCompileUnit.py (2092 of 2150) PASS: lldb-unit :: Utility/./UtilityTests/RangeTest.Clear (2093 of 2150) PASS: lldb-api :: commands/expression/import-std-module/forward_decl_from_module/TestForwardDeclFromStdModule.py (2094 of 2150) PASS: lldb-api :: macosx/function-starts/TestFunctionStarts.py (2095 of 2150) PASS: lldb-api :: commands/breakpoint/command/list/TestBreakpointCommandList.py (2096 of 2150) PASS: lldb-api :: iohandler/resize/TestIOHandlerResizeNoEditline.py (2097 of 2150) PASS: lldb-unit :: Utility/./UtilityTests/StringListTest.SplitIntoLines (2098 of 2150) PASS: lldb-api :: lang/cpp/this_class_type_mixing/TestThisClassTypeMixing.py (2099 of 2150) PASS: lldb-api :: lang/objc/modules-app-update/TestClangModulesAppUpdate.py (2100 of 2150) UNSUPPORTED: lldb-shell :: SymbolFile/PDB/enums-layout.test (2101 of 2150) PASS: lldb-shell :: SymbolFile/Breakpad/symtab.test (2102 of 2150) PASS: lldb-unit :: Process/minidump/./LLDBMinidumpTests/MinidumpParserTest.GetThreadsAndGetThreadContext (2103 of 2150) PASS: lldb-api :: functionalities/paths/TestPaths.py (2104 of 2150) PASS: lldb-unit :: Language/Highlighting/./HighlighterTests/HighlighterTest.ClangBraces (2105 of 2150) PASS: lldb-unit :: Process/minidump/./LLDBMinidumpTests/MinidumpParserTest.GetLinuxProcStatus_no_stream (2106 of 2150) PASS: lldb-api :: iohandler/autosuggestion/TestAutosuggestion.py (2107 of 2150) PASS: lldb-unit :: SymbolFile/NativePDB/./SymbolFileNativePDBTests/PDBFPOProgramToDWARFExpressionTests.InvalidAssignmentMultiple (2108 of 2150) PASS: lldb-unit :: Utility/./UtilityTests/StringListTest.GetMaxStringLengthMixed (2109 of 2150) PASS: lldb-unit :: DataFormatter/./LLDBFormatterTests/TypeMatcherTests.GetMatchStringExactName (2110 of 2150) PASS: lldb-shell :: Breakpoint/single-file-split-dwarf.test (2111 of 2150) UNSUPPORTED: lldb-api :: commands/expression/call-restarts/TestCallThatRestarts.py (2112 of 2150) PASS: lldb-unit :: Process/gdb-remote/./ProcessGdbRemoteTests/GDBRemoteCommunicationClientTest.ReadRegister (2113 of 2150) PASS: lldb-shell :: Driver/LocalLLDBInit.test (2114 of 2150) PASS: lldb-api :: lang/objc/objc-class-method/TestObjCClassMethod.py (2115 of 2150) PASS: lldb-api :: functionalities/thread/concurrent_events/TestConcurrentSignalWatchBreak.py (2116 of 2150) UNSUPPORTED: lldb-api :: functionalities/data-formatter/data-formatter-stl/libstdcpp/smart_ptr/TestDataFormatterStdSmartPtr.py (2117 of 2150) PASS: lldb-unit :: Utility/./UtilityTests/DataExtractorTest.GetCStrUnterminated (2118 of 2150) PASS: lldb-shell :: Commands/command-script-import.test (2119 of 2150) PASS: lldb-unit :: Utility/./UtilityTests/ArgsTest.AppendArguments (2120 of 2150) PASS: lldb-unit :: UnwindAssembly/x86/./UnwindAssemblyx86Tests/Testx86AssemblyInspectionEngine.Test64bitFramelessBigStackFrame (2121 of 2150) PASS: lldb-unit :: Utility/./UtilityTests/StringExtractorTest.DecodeHexU8_Extra (2122 of 2150) PASS: lldb-api :: commands/breakpoint/set/func-regex/TestBreakpointRegexError.py (2123 of 2150) PASS: lldb-api :: macosx/indirect_symbol/TestIndirectSymbols.py (2124 of 2150) PASS: lldb-unit :: Utility/./UtilityTests/Flags.AnySet (2125 of 2150) PASS: lldb-unit :: Utility/./UtilityTests/ArgsTest.TestOverwriteArgs (2126 of 2150) PASS: lldb-api :: lang/objc/foundation/TestFoundationDisassembly.py (2127 of 2150) PASS: lldb-api :: functionalities/data-formatter/data-formatter-python-synth/TestDataFormatterPythonSynth.py (2128 of 2150) PASS: lldb-api :: lang/cpp/auto/TestCPPAuto.py (2129 of 2150) PASS: lldb-unit :: debugserver/./debugserverTests/JSON.Parse (2130 of 2150) FAIL: lldb-api :: functionalities/data-formatter/data-formatter-stl/libcxx/iterator/TestDataFormatterLibccIterator.py (2131 of 2150) ******************** TEST 'lldb-api :: functionalities/data-formatter/data-formatter-stl/libcxx/iterator/TestDataFormatterLibccIterator.py' FAILED ******************** Script: -- /usr/local/Frameworks/Python.framework/Versions/3.7/bin/python3.7 /Users/buildslave/jenkins/workspace/lldb-cmake/llvm-project/lldb/test/API/dotest.py -s /Users/buildslave/jenkins/workspace/lldb-cmake/lldb-build/lldb-test-traces -S nm -u CXXFLAGS -u CFLAGS --codesign-identity - --server /Users/buildslave/jenkins/workspace/lldb-cmake/lldb-build/./bin/debugserver --arch x86_64 --build-dir /Users/buildslave/jenkins/workspace/lldb-cmake/lldb-build/lldb-test-build.noindex -s=/Users/buildslave/jenkins/workspace/lldb-cmake/test/logs -t --env TERM=vt100 --env LLVM_LIBS_DIR=/Users/buildslave/jenkins/workspace/lldb-cmake/lldb-build/./lib --arch x86_64 --build-dir /Users/buildslave/jenkins/workspace/lldb-cmake/lldb-build/lldb-test-build.noindex --lldb-module-cache-dir /Users/buildslave/jenkins/workspace/lldb-cmake/lldb-build/lldb-test-build.noindex/module-cache-lldb/lldb-api --clang-module-cache-dir /Users/buildslave/jenkins/workspace/lldb-cmake/lldb-build/lldb-test-build.noindex/module-cache-clang/lldb-api --executable /Users/buildslave/jenkins/workspace/lldb-cmake/lldb-build/./bin/lldb --compiler /Users/buildslave/jenkins/workspace/lldb-cmake/lldb-build/./bin/clang --dsymutil /Users/buildslave/jenkins/workspace/lldb-cmake/lldb-build/./bin/dsymutil --filecheck /Users/buildslave/jenkins/workspace/lldb-cmake/lldb-build/./bin/FileCheck --yaml2obj /Users/buildslave/jenkins/workspace/lldb-cmake/lldb-build/./bin/yaml2obj --lldb-libs-dir /Users/buildslave/jenkins/workspace/lldb-cmake/lldb-build/./lib /Users/buildslave/jenkins/workspace/lldb-cmake/llvm-project/lldb/test/API/functionalities/data-formatter/data-formatter-stl/libcxx/iterator -p TestDataFormatterLibccIterator.py -- Exit Code: 1

Hide Details

Command Output (stdout): -- lldb version 12.0.99 clang revision fdc41e11f9687a50c97e2a59663bf2d541ff5489 llvm revision fdc41e11f9687a50c97e2a59663bf2d541ff5489 libstdcxx tests will not be run because: Don't know how to build with libstdcxx on macosx Skipping following debug info categories: ['dwo']

Hide Details

-- Command Output (stderr): --

Hide Details

Session logs for test failures/errors/unexpected successes will go into directory '/Users/buildslave/jenkins/workspace/lldb-cmake/test/logs' Change dir to: /Users/buildslave/jenkins/workspace/lldb-cmake/llvm-project/lldb/test/API/functionalities/data-formatter/data-formatter-stl/libcxx/iterator runCmd: settings clear -all output:

Hide Details

runCmd: settings set symbols.enable-external-lookup false output:

Hide Details

runCmd: settings set target.inherit-tcc true output:

Hide Details

runCmd: settings set target.auto-apply-fixits false output:

Hide Details

runCmd: settings set plugin.process.gdb-remote.packet-timeout 60 output:

Hide Details

runCmd: settings set symbols.clang-modules-cache-path "/Users/buildslave/jenkins/workspace/lldb-cmake/lldb-build/lldb-test-build.noindex/module-cache-lldb/lldb-api" output:

Hide Details

runCmd: settings set use-color false output:

Hide Details

runCmd: setting set target.prefer-dynamic-value no-dynamic-values output:

Hide Details

runCmd: file /Users/buildslave/jenkins/workspace/lldb-cmake/lldb-build/lldb-test-build.noindex/functionalities/data-formatter/data-formatter-stl/libcxx/iterator/TestDataFormatterLibccIterator.test_with_run_command_dsym/a.out output: Current executable set to '/Users/buildslave/jenkins/workspace/lldb-cmake/lldb-build/lldb-test-build.noindex/functionalities/data-formatter/data-formatter-stl/libcxx/iterator/TestDataFormatterLibccIterator.test_with_run_command_dsym/a.out' (x86_64).

Hide Details

Hide Details

runCmd: breakpoint set -f "main.cpp" -l 37 output: Breakpoint 1: where = a.out`main + 354 at main.cpp:37:2, address = 0x0000000100000b12

Hide Details

Hide Details

Expecting pattern: ^Breakpoint (?P<bpno>[0-9]+): (?P<num_locations>[0-9]+) locations\.$ Not matched

Hide Details

Expecting pattern: ^Breakpoint (?P<bpno>[0-9]+): (?P<num_locations>no) locations \(pending\)\. Not matched

Hide Details

Expecting pattern: ^Breakpoint (?P<bpno>[0-9]+): where = (?P<module>.*)`(?P<symbol>[+\-]{0,1}[^+]+)( \+ (?P<offset>[0-9]+)){0,1}( \[inlined\] (?P<inline_symbol>.*)){0,1} at (?P<file>[^:]+):(?P<line_no>[0-9]+)(?P<column>(:[0-9]+)?), address = (?P<address>0x[0-9a-fA-F]+)$ Matched

Hide Details

runCmd: run output: Process 85529 stopped * thread #1, queue = 'com.apple.main-thread', stop reason = breakpoint 1.1 frame #0: 0x0000000100000b12 a.out`main at main.cpp:37:2 34 ivter ivI = iv.begin(); 35 svter svI = sv.begin(); 36 -> 37 return 0; // Set break point at this line. ^ 38 }

Hide Details

Process 85529 launched: '/Users/buildslave/jenkins/workspace/lldb-cmake/lldb-build/lldb-test-build.noindex/functionalities/data-formatter/data-formatter-stl/libcxx/iterator/TestDataFormatterLibccIterator.test_with_run_command_dsym/a.out' (x86_64)

Hide Details

Hide Details

runCmd: thread list output: Process 85529 stopped * thread #1: tid = 0x23e016, 0x0000000100000b12 a.out`main at main.cpp:37:2, queue = 'com.apple.main-thread', stop reason = breakpoint 1.1

Hide Details

Hide Details

Ran command: "thread list"

Hide Details

Got output: Process 85529 stopped * thread #1: tid = 0x23e016, 0x0000000100000b12 a.out`main at main.cpp:37:2, queue = 'com.apple.main-thread', stop reason = breakpoint 1.1

Hide Details

Expecting sub string: "stopped" (was found) Expecting sub string: "stop reason = breakpoint" (was found)

Hide Details

Adding tearDown hook: def cleanup(): self.runCmd('type format clear', check=False) self.runCmd('type summary clear', check=False) self.runCmd('type filter clear', check=False) self.runCmd('type synth clear', check=False) self.runCmd( "settings set target.max-children-count 256", check=False)

Hide Details

Hide Details

runCmd: frame variable ivI output: (ivter) ivI = (item = 3)

Hide Details

Hide Details

Ran command: "frame variable ivI"

Hide Details

Got output: (ivter) ivI = (item = 3)

Hide Details

Expecting sub string: "item = 3" (was found)

Hide Details

runCmd: expr ivI output: (ivter) $0 = (item = 3)

Hide Details

Hide Details

Ran command: "expr ivI"

Hide Details

Got output: (ivter) $0 = (item = 3)

Hide Details

Expecting sub string: "item = 3" (was found)

Hide Details

runCmd: frame variable iimI output: (iimter) iimI = (first = 43981, second = 61681)

Hide Details

Hide Details

Ran command: "frame variable iimI"

Hide Details

Got output: (iimter) iimI = (first = 43981, second = 61681)

Hide Details

Expecting sub string: "first = 43981" (was found) Expecting sub string: "second = 61681" (was found)

Hide Details

runCmd: expr iimI output: (iimter) $1 = (first = 43981, second = 61681)

Hide Details

Hide Details

Ran command: "expr iimI"

Hide Details

Got output: (iimter) $1 = (first = 43981, second = 61681)

Hide Details

Expecting sub string: "first = 43981" (was found) Expecting sub string: "second = 61681" (was found)

Hide Details

runCmd: frame variable simI output: (simter) simI = (first = "world", second = 42)

Hide Details

Hide Details

Ran command: "frame variable simI"

Hide Details

Got output: (simter) simI = (first = "world", second = 42)

Hide Details

Expecting sub string: "first = "world"" (was found) Expecting sub string: "second = 42" (was found)

Hide Details

runCmd: expr simI output: (simter) $2 = (first = "world", second = 42)

Hide Details

Hide Details

Ran command: "expr simI"

Hide Details

Got output: (simter) $2 = (first = "world", second = 42)

Hide Details

Expecting sub string: "first = "world"" (was found) Expecting sub string: "second = 42" (was found)

Hide Details

runCmd: frame variable svI output: (svter) svI = (item = "hello")

Hide Details

Hide Details

Ran command: "frame variable svI"

Hide Details

Got output: (svter) svI = (item = "hello")

Hide Details

Expecting sub string: "item = "hello"" (was found)

Hide Details

runCmd: expr svI output: (svter) $3 = (item = "hello")

Hide Details

Hide Details

Ran command: "expr svI"

Hide Details

Got output: (svter) $3 = (item = "hello")

Hide Details

Expecting sub string: "item = "hello"" (was found)

Hide Details

<bound method SBProcess.Kill of <lldb.SBProcess; proxy of <Swig Object of type 'lldb::SBProcess *' at 0x115ad2b70> >>: success

Hide Details

Executing tearDown hook: def cleanup(): self.runCmd('type format clear', check=False) self.runCmd('type summary clear', check=False) self.runCmd('type filter clear', check=False) self.runCmd('type synth clear', check=False) self.runCmd( "settings set target.max-children-count 256", check=False)

Hide Details

Hide Details

runCmd: type format clear check of return status not required output:

Hide Details

runCmd: type summary clear check of return status not required output:

Hide Details

runCmd: type filter clear check of return status not required output:

Hide Details

runCmd: type synth clear check of return status not required output:

Hide Details

runCmd: settings set target.max-children-count 256 check of return status not required output:

Hide Details

PASS: LLDB (/Users/buildslave/jenkins/workspace/lldb-cmake/lldb-build/bin/clang-x86_64) :: test_with_run_command_dsym (TestDataFormatterLibccIterator.LibcxxIteratorDataFormatterTestCase) runCmd: settings clear -all output:

Hide Details

runCmd: settings set symbols.enable-external-lookup false output:

Hide Details

runCmd: settings set target.inherit-tcc true output:

Hide Details

runCmd: settings set target.auto-apply-fixits false output:

Hide Details

runCmd: settings set plugin.process.gdb-remote.packet-timeout 60 output:

Hide Details

runCmd: settings set symbols.clang-modules-cache-path "/Users/buildslave/jenkins/workspace/lldb-cmake/lldb-build/lldb-test-build.noindex/module-cache-lldb/lldb-api" output:

Hide Details

runCmd: settings set use-color false output:

Hide Details

runCmd: setting set target.prefer-dynamic-value no-dynamic-values output:

Hide Details

runCmd: file /Users/buildslave/jenkins/workspace/lldb-cmake/lldb-build/lldb-test-build.noindex/functionalities/data-formatter/data-formatter-stl/libcxx/iterator/TestDataFormatterLibccIterator.test_with_run_command_dwarf/a.out output: Current executable set to '/Users/buildslave/jenkins/workspace/lldb-cmake/lldb-build/lldb-test-build.noindex/functionalities/data-formatter/data-formatter-stl/libcxx/iterator/TestDataFormatterLibccIterator.test_with_run_command_dwarf/a.out' (x86_64).

Hide Details

Hide Details

runCmd: breakpoint set -f "main.cpp" -l 37 output: Breakpoint 1: where = a.out`main + 354 at main.cpp:37:2, address = 0x0000000100000b12

Hide Details

Hide Details

Expecting pattern: ^Breakpoint (?P<bpno>[0-9]+): (?P<num_locations>[0-9]+) locations\.$ Not matched

Hide Details

Expecting pattern: ^Breakpoint (?P<bpno>[0-9]+): (?P<num_locations>no) locations \(pending\)\. Not matched

Hide Details

Expecting pattern: ^Breakpoint (?P<bpno>[0-9]+): where = (?P<module>.*)`(?P<symbol>[+\-]{0,1}[^+]+)( \+ (?P<offset>[0-9]+)){0,1}( \[inlined\] (?P<inline_symbol>.*)){0,1} at (?P<file>[^:]+):(?P<line_no>[0-9]+)(?P<column>(:[0-9]+)?), address = (?P<address>0x[0-9a-fA-F]+)$ Matched

Hide Details

runCmd: run output: Process 85761 stopped * thread #1, queue = 'com.apple.main-thread', stop reason = breakpoint 1.1 frame #0: 0x0000000100000b12 a.out`main at main.cpp:37:2 34 ivter ivI = iv.begin(); 35 svter svI = sv.begin(); 36 -> 37 return 0; // Set break point at this line. ^ 38 }

Hide Details

Process 85761 launched: '/Users/buildslave/jenkins/workspace/lldb-cmake/lldb-build/lldb-test-build.noindex/functionalities/data-formatter/data-formatter-stl/libcxx/iterator/TestDataFormatterLibccIterator.test_with_run_command_dwarf/a.out' (x86_64)

Hide Details

Hide Details

runCmd: thread list output: Process 85761 stopped * thread #1: tid = 0x23e1e8, 0x0000000100000b12 a.out`main at main.cpp:37:2, queue = 'com.apple.main-thread', stop reason = breakpoint 1.1

Hide Details

Hide Details

Ran command: "thread list"

Hide Details

Got output: Process 85761 stopped * thread #1: tid = 0x23e1e8, 0x0000000100000b12 a.out`main at main.cpp:37:2, queue = 'com.apple.main-thread', stop reason = breakpoint 1.1

Hide Details

Expecting sub string: "stopped" (was found) Expecting sub string: "stop reason = breakpoint" (was found)

Hide Details

Adding tearDown hook: def cleanup(): self.runCmd('type format clear', check=False) self.runCmd('type summary clear', check=False) self.runCmd('type filter clear', check=False) self.runCmd('type synth clear', check=False) self.runCmd( "settings set target.max-children-count 256", check=False)

Hide Details

Hide Details

runCmd: frame variable ivI output: (ivter) ivI = (item = 3)

Hide Details

Hide Details

Ran command: "frame variable ivI"

Hide Details

Got output: (ivter) ivI = (item = 3)

Hide Details

Expecting sub string: "item = 3" (was found)

Hide Details

runCmd: expr ivI output: (ivter) $0 = (item = 3)

Hide Details

Hide Details

Ran command: "expr ivI"

Hide Details

Got output: (ivter) $0 = (item = 3)

Hide Details

Expecting sub string: "item = 3" (was found)

Hide Details

runCmd: frame variable iimI output: (iimter) iimI = (first = 43981, second = 61681)

Hide Details

Hide Details

Ran command: "frame variable iimI"

Hide Details

Got output: (iimter) iimI = (first = 43981, second = 61681)

Hide Details

Expecting sub string: "first = 43981" (was found) Expecting sub string: "second = 61681" (was found)

Hide Details

runCmd: expr iimI output: (iimter) $1 = (first = 43981, second = 61681)

Hide Details

Hide Details

Ran command: "expr iimI"

Hide Details

Got output: (iimter) $1 = (first = 43981, second = 61681)

Hide Details

Expecting sub string: "first = 43981" (was found) Expecting sub string: "second = 61681" (was found)

Hide Details

runCmd: frame variable simI output: (simter) simI = (first = "world", second = 42)

Hide Details

Hide Details

Ran command: "frame variable simI"

Hide Details

Got output: (simter) simI = (first = "world", second = 42)

Hide Details

Expecting sub string: "first = "world"" (was found) Expecting sub string: "second = 42" (was found)

Hide Details

runCmd: expr simI output: (simter) $2 = (first = "world", second = 42)

Hide Details

Hide Details

Ran command: "expr simI"

Hide Details

Got output: (simter) $2 = (first = "world", second = 42)

Hide Details

Expecting sub string: "first = "world"" (was found) Expecting sub string: "second = 42" (was found)

Hide Details

runCmd: frame variable svI output: (svter) svI = (item = "hello")

Hide Details

Hide Details

Ran command: "frame variable svI"

Hide Details

Got output: (svter) svI = (item = "hello")

Hide Details

Expecting sub string: "item = "hello"" (was found)

Hide Details

runCmd: expr svI output: (svter) $3 = (item = "hello")

Hide Details

Hide Details

Ran command: "expr svI"

Hide Details

Got output: (svter) $3 = (item = "hello")

Hide Details

Expecting sub string: "item = "hello"" (was found)

Hide Details

<bound method SBProcess.Kill of <lldb.SBProcess; proxy of <Swig Object of type 'lldb::SBProcess *' at 0x10df09c30> >>: success

Hide Details

Executing tearDown hook: def cleanup(): self.runCmd('type format clear', check=False) self.runCmd('type summary clear', check=False) self.runCmd('type filter clear', check=False) self.runCmd('type synth clear', check=False) self.runCmd( "settings set target.max-children-count 256", check=False)

Hide Details

Hide Details

runCmd: type format clear check of return status not required output:

Hide Details

runCmd: type summary clear check of return status not required output:

Hide Details

runCmd: type filter clear check of return status not required output:

Hide Details

runCmd: type synth clear check of return status not required output:

Hide Details

runCmd: settings set target.max-children-count 256 check of return status not required output:

Hide Details

PASS: LLDB (/Users/buildslave/jenkins/workspace/lldb-cmake/lldb-build/bin/clang-x86_64) :: test_with_run_command_dwarf (TestDataFormatterLibccIterator.LibcxxIteratorDataFormatterTestCase) UNSUPPORTED: LLDB (/Users/buildslave/jenkins/workspace/lldb-cmake/lldb-build/bin/clang-x86_64) :: test_with_run_command_dwo (TestDataFormatterLibccIterator.LibcxxIteratorDataFormatterTestCase) (test case does not fall in any category of interest for this run) runCmd: settings clear -all output:

Hide Details

runCmd: settings set symbols.enable-external-lookup false output:

Hide Details

runCmd: settings set target.inherit-tcc true output:

Hide Details

runCmd: settings set target.auto-apply-fixits false output:

Hide Details

runCmd: settings set plugin.process.gdb-remote.packet-timeout 60 output:

Hide Details

runCmd: settings set symbols.clang-modules-cache-path "/Users/buildslave/jenkins/workspace/lldb-cmake/lldb-build/lldb-test-build.noindex/module-cache-lldb/lldb-api" output:

Hide Details

runCmd: settings set use-color false output:

Hide Details

runCmd: setting set target.prefer-dynamic-value no-dynamic-values output:

Hide Details

FAIL: LLDB (/Users/buildslave/jenkins/workspace/lldb-cmake/lldb-build/bin/clang-x86_64) :: test_with_run_command_gmodules (TestDataFormatterLibccIterator.LibcxxIteratorDataFormatterTestCase) Restore dir to: /Users/buildslave/jenkins/workspace/lldb-cmake/lldb-build/tools/lldb/test ====================================================================== ERROR: test_with_run_command_gmodules (TestDataFormatterLibccIterator.LibcxxIteratorDataFormatterTestCase) Test that libc++ iterators format properly. ---------------------------------------------------------------------- Error when building test subject.

Hide Details

Build Command: make VPATH=/Users/buildslave/jenkins/workspace/lldb-cmake/llvm-project/lldb/test/API/functionalities/data-formatter/data-formatter-stl/libcxx/iterator -C /Users/buildslave/jenkins/workspace/lldb-cmake/lldb-build/lldb-test-build.noindex/functionalities/data-formatter/data-formatter-stl/libcxx/iterator/TestDataFormatterLibccIterator.test_with_run_command_gmodules -I /Users/buildslave/jenkins/workspace/lldb-cmake/llvm-project/lldb/test/API/functionalities/data-formatter/data-formatter-stl/libcxx/iterator -I /Users/buildslave/jenkins/workspace/lldb-cmake/llvm-project/lldb/packages/Python/lldbsuite/test/make -f /Users/buildslave/jenkins/workspace/lldb-cmake/llvm-project/lldb/test/API/functionalities/data-formatter/data-formatter-stl/libcxx/iterator/Makefile MAKE_DSYM=NO MAKE_GMODULES=YES ARCH=x86_64 CC="/Users/buildslave/jenkins/workspace/lldb-cmake/lldb-build/bin/clang" DSYMUTIL="/Users/buildslave/jenkins/workspace/lldb-cmake/lldb-build/./bin/dsymutil" CLANG_MODULE_CACHE_DIR=/Users/buildslave/jenkins/workspace/lldb-cmake/lldb-build/lldb-test-build.noindex/module-cache-clang/lldb-api

Hide Details

Build Command Output: While building module 'std' imported from /Users/buildslave/jenkins/workspace/lldb-cmake/llvm-project/lldb/test/API/functionalities/data-formatter/data-formatter-stl/libcxx/iterator/main.cpp:1: In file included from <module-includes>:31: In file included from /Users/buildslave/jenkins/workspace/lldb-cmake/lldb-build/bin/../include/c++/v1/complex.h:28: In file included from /Users/buildslave/jenkins/workspace/lldb-cmake/lldb-build/bin/../include/c++/v1/ccomplex:20: In file included from /Users/buildslave/jenkins/workspace/lldb-cmake/lldb-build/bin/../include/c++/v1/complex:247: In file included from /Users/buildslave/jenkins/workspace/lldb-cmake/lldb-build/bin/../include/c++/v1/sstream:173: /Users/buildslave/jenkins/workspace/lldb-cmake/lldb-build/bin/../include/c++/v1/ostream:1038:45: error: no template named 'enable_if_t'; did you mean 'enable_if'? template <class _Stream, class _Tp, class = enable_if_t< ^ /Users/buildslave/jenkins/workspace/lldb-cmake/lldb-build/bin/../include/c++/v1/type_traits:538:63: note: 'enable_if' declared here template <bool, class _Tp = void> struct _LIBCPP_TEMPLATE_VIS enable_if {}; ^ While building module 'std' imported from /Users/buildslave/jenkins/workspace/lldb-cmake/llvm-project/lldb/test/API/functionalities/data-formatter/data-formatter-stl/libcxx/iterator/main.cpp:1: In file included from <module-includes>:31: In file included from /Users/buildslave/jenkins/workspace/lldb-cmake/lldb-build/bin/../include/c++/v1/complex.h:28: In file included from /Users/buildslave/jenkins/workspace/lldb-cmake/lldb-build/bin/../include/c++/v1/ccomplex:20: In file included from /Users/buildslave/jenkins/workspace/lldb-cmake/lldb-build/bin/../include/c++/v1/complex:247: In file included from /Users/buildslave/jenkins/workspace/lldb-cmake/lldb-build/bin/../include/c++/v1/sstream:174: /Users/buildslave/jenkins/workspace/lldb-cmake/lldb-build/bin/../include/c++/v1/istream:1389:45: error: no template named 'enable_if_t'; did you mean 'enable_if'? template <class _Stream, class _Tp, class = enable_if_t< ^ /Users/buildslave/jenkins/workspace/lldb-cmake/lldb-build/bin/../include/c++/v1/type_traits:538:63: note: 'enable_if' declared here template <bool, class _Tp = void> struct _LIBCPP_TEMPLATE_VIS enable_if {}; ^ /Users/buildslave/jenkins/workspace/lldb-cmake/llvm-project/lldb/test/API/functionalities/data-formatter/data-formatter-stl/libcxx/iterator/main.cpp:1:10: fatal error: could not build module 'std' #include <string> ~~~~~~~~^ 3 errors generated. /Users/buildslave/jenkins/workspace/lldb-cmake/lldb-build/bin/clang -fmodules -gmodules -fmodules-cache-path=/Users/buildslave/jenkins/workspace/lldb-cmake/lldb-build/lldb-test-build.noindex/module-cache-clang/lldb-api -gmodules -fcxx-modules -std=c++11 -g -O0 -fno-builtin -isysroot "/Applications/Xcode.app/Contents/Developer/Platforms/MacOSX.platform/Developer/SDKs/MacOSX10.15.sdk" -arch x86_64 -I/Users/buildslave/jenkins/workspace/lldb-cmake/llvm-project/lldb/packages/Python/lldbsuite/test/make/../../../../../include -I/Users/buildslave/jenkins/workspace/lldb-cmake/llvm-project/lldb/test/API/functionalities/data-formatter/data-formatter-stl/libcxx/iterator -I/Users/buildslave/jenkins/workspace/lldb-cmake/llvm-project/lldb/packages/Python/lldbsuite/test/make -include /Users/buildslave/jenkins/workspace/lldb-cmake/llvm-project/lldb/packages/Python/lldbsuite/test/make/test_common.h -fno-limit-debug-info -fmodules -gmodules -fmodules-cache-path=/Users/buildslave/jenkins/workspace/lldb-cmake/lldb-build/lldb-test-build.noindex/module-cache-clang/lldb-api -gmodules -fcxx-modules -O0 -DLLDB_USING_LIBCPP -stdlib=libc++ --driver-mode=g++ -c -o main.o /Users/buildslave/jenkins/workspace/lldb-cmake/llvm-project/lldb/test/API/functionalities/data-formatter/data-formatter-stl/libcxx/iterator/main.cpp While building module 'std' imported from /Users/buildslave/jenkins/workspace/lldb-cmake/llvm-project/lldb/test/API/functionalities/data-formatter/data-formatter-stl/libcxx/iterator/main.cpp:1: In file included from <module-includes>:31: In file included from /Users/buildslave/jenkins/workspace/lldb-cmake/lldb-build/bin/../include/c++/v1/complex.h:28: In file included from /Users/buildslave/jenkins/workspace/lldb-cmake/lldb-build/bin/../include/c++/v1/ccomplex:20: In file included from /Users/buildslave/jenkins/workspace/lldb-cmake/lldb-build/bin/../include/c++/v1/complex:247: In file included from /Users/buildslave/jenkins/workspace/lldb-cmake/lldb-build/bin/../include/c++/v1/sstream:173: /Users/buildslave/jenkins/workspace/lldb-cmake/lldb-build/bin/../include/c++/v1/ostream:1038:45: error: no template named 'enable_if_t'; did you mean 'enable_if'? template <class _Stream, class _Tp, class = enable_if_t< ^ /Users/buildslave/jenkins/workspace/lldb-cmake/lldb-build/bin/../include/c++/v1/type_traits:538:63: note: 'enable_if' declared here template <bool, class _Tp = void> struct _LIBCPP_TEMPLATE_VIS enable_if {}; ^ While building module 'std' imported from /Users/buildslave/jenkins/workspace/lldb-cmake/llvm-project/lldb/test/API/functionalities/data-formatter/data-formatter-stl/libcxx/iterator/main.cpp:1: In file included from <module-includes>:31: In file included from /Users/buildslave/jenkins/workspace/lldb-cmake/lldb-build/bin/../include/c++/v1/complex.h:28: In file included from /Users/buildslave/jenkins/workspace/lldb-cmake/lldb-build/bin/../include/c++/v1/ccomplex:20: In file included from /Users/buildslave/jenkins/workspace/lldb-cmake/lldb-build/bin/../include/c++/v1/complex:247: In file included from /Users/buildslave/jenkins/workspace/lldb-cmake/lldb-build/bin/../include/c++/v1/sstream:174: /Users/buildslave/jenkins/workspace/lldb-cmake/lldb-build/bin/../include/c++/v1/istream:1389:45: error: no template named 'enable_if_t'; did you mean 'enable_if'? template <class _Stream, class _Tp, class = enable_if_t< ^ /Users/buildslave/jenkins/workspace/lldb-cmake/lldb-build/bin/../include/c++/v1/type_traits:538:63: note: 'enable_if' declared here template <bool, class _Tp = void> struct _LIBCPP_TEMPLATE_VIS enable_if {}; ^ /Users/buildslave/jenkins/workspace/lldb-cmake/llvm-project/lldb/test/API/functionalities/data-formatter/data-formatter-stl/libcxx/iterator/main.cpp:1:10: fatal error: could not build module 'std' #include <string> ~~~~~~~~^ 3 errors generated. make: *** [main.o] Error 1

Hide Details

Test Directory: /Users/buildslave/jenkins/workspace/lldb-cmake/llvm-project/lldb/test/API/functionalities/data-formatter/data-formatter-stl/libcxx/iterator ---------------------------------------------------------------------- Ran 4 tests in 11.501s

Hide Details

RESULT: FAILED (2 passes, 0 failures, 1 errors, 1 skipped, 0 expected failures, 0 unexpected successes)

Hide Details

--

Hide Details

******************** PASS: lldb-api :: functionalities/thread/concurrent_events/TestConcurrentDelayWatchBreak.py (2132 of 2150) PASS: lldb-api :: functionalities/thread/concurrent_events/TestConcurrentDelaySignalBreak.py (2133 of 2150) PASS: lldb-api :: functionalities/data-formatter/synthcapping/TestSyntheticCapping.py (2134 of 2150) PASS: lldb-unit :: Utility/./UtilityTests/UUIDTest.RelationalOperators (2135 of 2150) PASS: lldb-shell :: BuildScript/compiler-full-path.test (2136 of 2150) PASS: lldb-api :: functionalities/multidebugger_commands/TestMultipleDebuggersCommands.py (2137 of 2150) PASS: lldb-api :: lang/cpp/function_refs/TestFunctionRefs.py (2138 of 2150) PASS: lldb-unit :: Utility/./UtilityTests/VMRange.ContainsAddr (2139 of 2150) PASS: lldb-shell :: VSCode/TestOptions.test (2140 of 2150) PASS: lldb-unit :: Core/./LLDBCoreTests/ModuleSpecTest.InvalidInMemoryBufferValidFile (2141 of 2150) PASS: lldb-api :: functionalities/gdb_remote_client/TestIOSSimulator.py (2142 of 2150) PASS: lldb-shell :: SymbolFile/Breakpad/unwind-via-raSearch.test (2143 of 2150) PASS: lldb-api :: commands/process/attach/TestProcessAttach.py (2144 of 2150) PASS: lldb-shell :: SymbolFile/DWARF/DW_AT_data_bit_offset-DW_OP_stack_value.s (2145 of 2150) FAIL: lldb-api :: functionalities/data-formatter/stringprinter/TestStringPrinter.py (2146 of 2150) ******************** TEST 'lldb-api :: functionalities/data-formatter/stringprinter/TestStringPrinter.py' FAILED ******************** Script: -- /usr/local/Frameworks/Python.framework/Versions/3.7/bin/python3.7 /Users/buildslave/jenkins/workspace/lldb-cmake/llvm-project/lldb/test/API/dotest.py -s /Users/buildslave/jenkins/workspace/lldb-cmake/lldb-build/lldb-test-traces -S nm -u CXXFLAGS -u CFLAGS --codesign-identity - --server /Users/buildslave/jenkins/workspace/lldb-cmake/lldb-build/./bin/debugserver --arch x86_64 --build-dir /Users/buildslave/jenkins/workspace/lldb-cmake/lldb-build/lldb-test-build.noindex -s=/Users/buildslave/jenkins/workspace/lldb-cmake/test/logs -t --env TERM=vt100 --env LLVM_LIBS_DIR=/Users/buildslave/jenkins/workspace/lldb-cmake/lldb-build/./lib --arch x86_64 --build-dir /Users/buildslave/jenkins/workspace/lldb-cmake/lldb-build/lldb-test-build.noindex --lldb-module-cache-dir /Users/buildslave/jenkins/workspace/lldb-cmake/lldb-build/lldb-test-build.noindex/module-cache-lldb/lldb-api --clang-module-cache-dir /Users/buildslave/jenkins/workspace/lldb-cmake/lldb-build/lldb-test-build.noindex/module-cache-clang/lldb-api --executable /Users/buildslave/jenkins/workspace/lldb-cmake/lldb-build/./bin/lldb --compiler /Users/buildslave/jenkins/workspace/lldb-cmake/lldb-build/./bin/clang --dsymutil /Users/buildslave/jenkins/workspace/lldb-cmake/lldb-build/./bin/dsymutil --filecheck /Users/buildslave/jenkins/workspace/lldb-cmake/lldb-build/./bin/FileCheck --yaml2obj /Users/buildslave/jenkins/workspace/lldb-cmake/lldb-build/./bin/yaml2obj --lldb-libs-dir /Users/buildslave/jenkins/workspace/lldb-cmake/lldb-build/./lib /Users/buildslave/jenkins/workspace/lldb-cmake/llvm-project/lldb/test/API/functionalities/data-formatter/stringprinter -p TestStringPrinter.py -- Exit Code: 1

Hide Details

Command Output (stdout): -- lldb version 12.0.99 clang revision fdc41e11f9687a50c97e2a59663bf2d541ff5489 llvm revision fdc41e11f9687a50c97e2a59663bf2d541ff5489 libstdcxx tests will not be run because: Don't know how to build with libstdcxx on macosx Skipping following debug info categories: ['dwo']

Hide Details

-- Command Output (stderr): --

Hide Details

Session logs for test failures/errors/unexpected successes will go into directory '/Users/buildslave/jenkins/workspace/lldb-cmake/test/logs' Change dir to: /Users/buildslave/jenkins/workspace/lldb-cmake/llvm-project/lldb/test/API/functionalities/data-formatter/stringprinter runCmd: settings clear -all output:

Hide Details

runCmd: settings set symbols.enable-external-lookup false output:

Hide Details

runCmd: settings set target.inherit-tcc true output:

Hide Details

runCmd: settings set target.auto-apply-fixits false output:

Hide Details

runCmd: settings set plugin.process.gdb-remote.packet-timeout 60 output:

Hide Details

runCmd: settings set symbols.clang-modules-cache-path "/Users/buildslave/jenkins/workspace/lldb-cmake/lldb-build/lldb-test-build.noindex/module-cache-lldb/lldb-api" output:

Hide Details

runCmd: settings set use-color false output:

Hide Details

runCmd: setting set target.prefer-dynamic-value no-dynamic-values output:

Hide Details

Adding tearDown hook: <function <lambda> at 0x10ac2af28>

Hide Details

runCmd: frame variable output: (int) argc = 1 (const char **) argv = 0x00007ffeefbff8a8 (std::string) stdstring = "Hello\t\tWorld\nI am here\t\tto say hello\n" (const char *) constcharstar = 0x0000000100504080 "Hello\t\tWorld\nI am here\t\tto say hello\n" (std::string) longstring = "I am a very long string; in fact I am longer than any reasonable length that a string should be; quite long indeed; oh my, so many words; so many letters; this is kind of like writing a poem; except in real life all that is happening is just me producing a very very long set of words; there is text here, text there, text everywhere; it fills me with glee to see so much text; all around me it's just letters, and symbols, and other pleasant drawings that cause me a large amount of joy upon visually seeing them with my eyes; well, this is now a lot of letters, but it is still not enough for the purpose of the test I want to test, so maybe I should copy and paste this a few times, you know.. for science, or somethingI am a very long string; in fact I am longer than any reasonable length that a string should be; quite long indeed; oh my, so many words; so many letters; this is kind of like writing a poem; except in real life all that is happening is just me producing a very very long set of words; there is text he"... (const char *) longconstcharstar = 0x0000000101008200 "I am a very long string; in fact I am longer than any reasonable length that a string should be; quite long indeed; oh my, so many words; so many letters; this is kind of like writing a poem; except in real life all that is happening is just me producing a very very long set of words; there is text here, text there, text everywhere; it fills me with glee to see so much text; all around me it's just letters, and symbols, and other pleasant drawings that cause me a large amount of joy upon visually seeing them with my eyes; well, this is now a lot of letters, but it is still not enough for the purpose of the test I want to test, so maybe I should copy and paste this a few times, you know.. for science, or somethingI am a very long string; in fact I am longer than any reasonable length that a string should be; quite long indeed; oh my, so many words; so many letters; this is kind of like writing a poem; except in real life all that is happening is just me producing a very very long set of words; there is text he"...

Hide Details

Hide Details

runCmd: setting set escape-non-printables false output:

Hide Details

<bound method SBProcess.Kill of <lldb.SBProcess; proxy of <Swig Object of type 'lldb::SBProcess *' at 0x10a744570> >>: success

Hide Details

Executing tearDown hook: <function <lambda> at 0x10ac2af28>

Hide Details

runCmd: setting set escape-non-printables true output:

Hide Details

PASS: LLDB (/Users/buildslave/jenkins/workspace/lldb-cmake/lldb-build/bin/clang-x86_64) :: test_dsym (lldbsuite.test.lldbtest.TestStringPrinter) runCmd: settings clear -all output:

Hide Details

runCmd: settings set symbols.enable-external-lookup false output:

Hide Details

runCmd: settings set target.inherit-tcc true output:

Hide Details

runCmd: settings set target.auto-apply-fixits false output:

Hide Details

runCmd: settings set plugin.process.gdb-remote.packet-timeout 60 output:

Hide Details

runCmd: settings set symbols.clang-modules-cache-path "/Users/buildslave/jenkins/workspace/lldb-cmake/lldb-build/lldb-test-build.noindex/module-cache-lldb/lldb-api" output:

Hide Details

runCmd: settings set use-color false output:

Hide Details

runCmd: setting set target.prefer-dynamic-value no-dynamic-values output:

Hide Details

Adding tearDown hook: <function <lambda> at 0x10a685e18>

Hide Details

runCmd: frame variable output: (int) argc = 1 (const char **) argv = 0x00007ffeefbff880 (std::string) stdstring = "Hello\t\tWorld\nI am here\t\tto say hello\n" (const char *) constcharstar = 0x0000000100205280 "Hello\t\tWorld\nI am here\t\tto say hello\n" (std::string) longstring = "I am a very long string; in fact I am longer than any reasonable length that a string should be; quite long indeed; oh my, so many words; so many letters; this is kind of like writing a poem; except in real life all that is happening is just me producing a very very long set of words; there is text here, text there, text everywhere; it fills me with glee to see so much text; all around me it's just letters, and symbols, and other pleasant drawings that cause me a large amount of joy upon visually seeing them with my eyes; well, this is now a lot of letters, but it is still not enough for the purpose of the test I want to test, so maybe I should copy and paste this a few times, you know.. for science, or somethingI am a very long string; in fact I am longer than any reasonable length that a string should be; quite long indeed; oh my, so many words; so many letters; this is kind of like writing a poem; except in real life all that is happening is just me producing a very very long set of words; there is text he"... (const char *) longconstcharstar = 0x000000010080b000 "I am a very long string; in fact I am longer than any reasonable length that a string should be; quite long indeed; oh my, so many words; so many letters; this is kind of like writing a poem; except in real life all that is happening is just me producing a very very long set of words; there is text here, text there, text everywhere; it fills me with glee to see so much text; all around me it's just letters, and symbols, and other pleasant drawings that cause me a large amount of joy upon visually seeing them with my eyes; well, this is now a lot of letters, but it is still not enough for the purpose of the test I want to test, so maybe I should copy and paste this a few times, you know.. for science, or somethingI am a very long string; in fact I am longer than any reasonable length that a string should be; quite long indeed; oh my, so many words; so many letters; this is kind of like writing a poem; except in real life all that is happening is just me producing a very very long set of words; there is text he"...

Hide Details

Hide Details

runCmd: setting set escape-non-printables false output:

Hide Details

<bound method SBProcess.Kill of <lldb.SBProcess; proxy of <Swig Object of type 'lldb::SBProcess *' at 0x10a520c30> >>: success

Hide Details

Executing tearDown hook: <function <lambda> at 0x10a685e18>

Hide Details

runCmd: setting set escape-non-printables true output:

Hide Details

PASS: LLDB (/Users/buildslave/jenkins/workspace/lldb-cmake/lldb-build/bin/clang-x86_64) :: test_dwarf (lldbsuite.test.lldbtest.TestStringPrinter) UNSUPPORTED: LLDB (/Users/buildslave/jenkins/workspace/lldb-cmake/lldb-build/bin/clang-x86_64) :: test_dwo (lldbsuite.test.lldbtest.TestStringPrinter) (test case does not fall in any category of interest for this run) runCmd: settings clear -all output:

Hide Details

runCmd: settings set symbols.enable-external-lookup false output:

Hide Details

runCmd: settings set target.inherit-tcc true output:

Hide Details

runCmd: settings set target.auto-apply-fixits false output:

Hide Details

runCmd: settings set plugin.process.gdb-remote.packet-timeout 60 output:

Hide Details

runCmd: settings set symbols.clang-modules-cache-path "/Users/buildslave/jenkins/workspace/lldb-cmake/lldb-build/lldb-test-build.noindex/module-cache-lldb/lldb-api" output:

Hide Details

runCmd: settings set use-color false output:

Hide Details

runCmd: setting set target.prefer-dynamic-value no-dynamic-values output:

Hide Details

FAIL: LLDB (/Users/buildslave/jenkins/workspace/lldb-cmake/lldb-build/bin/clang-x86_64) :: test_gmodules (lldbsuite.test.lldbtest.TestStringPrinter) Restore dir to: /Users/buildslave/jenkins/workspace/lldb-cmake/lldb-build/tools/lldb/test ====================================================================== ERROR: test_gmodules (lldbsuite.test.lldbtest.TestStringPrinter) ---------------------------------------------------------------------- Error when building test subject.

Hide Details

Build Command: make VPATH=/Users/buildslave/jenkins/workspace/lldb-cmake/llvm-project/lldb/test/API/functionalities/data-formatter/stringprinter -C /Users/buildslave/jenkins/workspace/lldb-cmake/lldb-build/lldb-test-build.noindex/functionalities/data-formatter/stringprinter/TestStringPrinter.test_gmodules -I /Users/buildslave/jenkins/workspace/lldb-cmake/llvm-project/lldb/test/API/functionalities/data-formatter/stringprinter -I /Users/buildslave/jenkins/workspace/lldb-cmake/llvm-project/lldb/packages/Python/lldbsuite/test/make -f /Users/buildslave/jenkins/workspace/lldb-cmake/lldb-build/lldb-test-build.noindex/functionalities/data-formatter/stringprinter/TestStringPrinter.test_gmodules/Makefile MAKE_DSYM=NO MAKE_GMODULES=YES ARCH=x86_64 CC="/Users/buildslave/jenkins/workspace/lldb-cmake/lldb-build/bin/clang" DSYMUTIL="/Users/buildslave/jenkins/workspace/lldb-cmake/lldb-build/./bin/dsymutil" CLANG_MODULE_CACHE_DIR=/Users/buildslave/jenkins/workspace/lldb-cmake/lldb-build/lldb-test-build.noindex/module-cache-clang/lldb-api

Hide Details

Build Command Output: While building module 'std' imported from /Users/buildslave/jenkins/workspace/lldb-cmake/llvm-project/lldb/test/API/functionalities/data-formatter/stringprinter/main.cpp:1: In file included from <module-includes>:31: In file included from /Users/buildslave/jenkins/workspace/lldb-cmake/lldb-build/bin/../include/c++/v1/complex.h:28: In file included from /Users/buildslave/jenkins/workspace/lldb-cmake/lldb-build/bin/../include/c++/v1/ccomplex:20: In file included from /Users/buildslave/jenkins/workspace/lldb-cmake/lldb-build/bin/../include/c++/v1/complex:247: In file included from /Users/buildslave/jenkins/workspace/lldb-cmake/lldb-build/bin/../include/c++/v1/sstream:173: /Users/buildslave/jenkins/workspace/lldb-cmake/lldb-build/bin/../include/c++/v1/ostream:1038:45: error: no template named 'enable_if_t'; did you mean 'enable_if'? template <class _Stream, class _Tp, class = enable_if_t< ^ /Users/buildslave/jenkins/workspace/lldb-cmake/lldb-build/bin/../include/c++/v1/type_traits:538:63: note: 'enable_if' declared here template <bool, class _Tp = void> struct _LIBCPP_TEMPLATE_VIS enable_if {}; ^ While building module 'std' imported from /Users/buildslave/jenkins/workspace/lldb-cmake/llvm-project/lldb/test/API/functionalities/data-formatter/stringprinter/main.cpp:1: In file included from <module-includes>:31: In file included from /Users/buildslave/jenkins/workspace/lldb-cmake/lldb-build/bin/../include/c++/v1/complex.h:28: In file included from /Users/buildslave/jenkins/workspace/lldb-cmake/lldb-build/bin/../include/c++/v1/ccomplex:20: In file included from /Users/buildslave/jenkins/workspace/lldb-cmake/lldb-build/bin/../include/c++/v1/complex:247: In file included from /Users/buildslave/jenkins/workspace/lldb-cmake/lldb-build/bin/../include/c++/v1/sstream:174: /Users/buildslave/jenkins/workspace/lldb-cmake/lldb-build/bin/../include/c++/v1/istream:1389:45: error: no template named 'enable_if_t'; did you mean 'enable_if'? template <class _Stream, class _Tp, class = enable_if_t< ^ /Users/buildslave/jenkins/workspace/lldb-cmake/lldb-build/bin/../include/c++/v1/type_traits:538:63: note: 'enable_if' declared here template <bool, class _Tp = void> struct _LIBCPP_TEMPLATE_VIS enable_if {}; ^ /Users/buildslave/jenkins/workspace/lldb-cmake/llvm-project/lldb/test/API/functionalities/data-formatter/stringprinter/main.cpp:1:10: fatal error: could not build module 'std' #include <string> ~~~~~~~~^ 3 errors generated. /Users/buildslave/jenkins/workspace/lldb-cmake/lldb-build/bin/clang -std=c++11 -fmodules -gmodules -fmodules-cache-path=/Users/buildslave/jenkins/workspace/lldb-cmake/lldb-build/lldb-test-build.noindex/module-cache-clang/lldb-api -gmodules -fcxx-modules -std=c++11 -g -O0 -fno-builtin -isysroot "/Applications/Xcode.app/Contents/Developer/Platforms/MacOSX.platform/Developer/SDKs/MacOSX10.15.sdk" -arch x86_64 -I/Users/buildslave/jenkins/workspace/lldb-cmake/llvm-project/lldb/packages/Python/lldbsuite/test/make/../../../../../include -I/Users/buildslave/jenkins/workspace/lldb-cmake/lldb-build/lldb-test-build.noindex/functionalities/data-formatter/stringprinter/TestStringPrinter.test_gmodules -I/Users/buildslave/jenkins/workspace/lldb-cmake/llvm-project/lldb/packages/Python/lldbsuite/test/make -include /Users/buildslave/jenkins/workspace/lldb-cmake/llvm-project/lldb/packages/Python/lldbsuite/test/make/test_common.h -fno-limit-debug-info -fmodules -gmodules -fmodules-cache-path=/Users/buildslave/jenkins/workspace/lldb-cmake/lldb-build/lldb-test-build.noindex/module-cache-clang/lldb-api -gmodules -fcxx-modules --driver-mode=g++ -c -o main.o /Users/buildslave/jenkins/workspace/lldb-cmake/llvm-project/lldb/test/API/functionalities/data-formatter/stringprinter/main.cpp While building module 'std' imported from /Users/buildslave/jenkins/workspace/lldb-cmake/llvm-project/lldb/test/API/functionalities/data-formatter/stringprinter/main.cpp:1: In file included from <module-includes>:31: In file included from /Users/buildslave/jenkins/workspace/lldb-cmake/lldb-build/bin/../include/c++/v1/complex.h:28: In file included from /Users/buildslave/jenkins/workspace/lldb-cmake/lldb-build/bin/../include/c++/v1/ccomplex:20: In file included from /Users/buildslave/jenkins/workspace/lldb-cmake/lldb-build/bin/../include/c++/v1/complex:247: In file included from /Users/buildslave/jenkins/workspace/lldb-cmake/lldb-build/bin/../include/c++/v1/sstream:173: /Users/buildslave/jenkins/workspace/lldb-cmake/lldb-build/bin/../include/c++/v1/ostream:1038:45: error: no template named 'enable_if_t'; did you mean 'enable_if'? template <class _Stream, class _Tp, class = enable_if_t< ^ /Users/buildslave/jenkins/workspace/lldb-cmake/lldb-build/bin/../include/c++/v1/type_traits:538:63: note: 'enable_if' declared here template <bool, class _Tp = void> struct _LIBCPP_TEMPLATE_VIS enable_if {}; ^ While building module 'std' imported from /Users/buildslave/jenkins/workspace/lldb-cmake/llvm-project/lldb/test/API/functionalities/data-formatter/stringprinter/main.cpp:1: In file included from <module-includes>:31: In file included from /Users/buildslave/jenkins/workspace/lldb-cmake/lldb-build/bin/../include/c++/v1/complex.h:28: In file included from /Users/buildslave/jenkins/workspace/lldb-cmake/lldb-build/bin/../include/c++/v1/ccomplex:20: In file included from /Users/buildslave/jenkins/workspace/lldb-cmake/lldb-build/bin/../include/c++/v1/complex:247: In file included from /Users/buildslave/jenkins/workspace/lldb-cmake/lldb-build/bin/../include/c++/v1/sstream:174: /Users/buildslave/jenkins/workspace/lldb-cmake/lldb-build/bin/../include/c++/v1/istream:1389:45: error: no template named 'enable_if_t'; did you mean 'enable_if'? template <class _Stream, class _Tp, class = enable_if_t< ^ /Users/buildslave/jenkins/workspace/lldb-cmake/lldb-build/bin/../include/c++/v1/type_traits:538:63: note: 'enable_if' declared here template <bool, class _Tp = void> struct _LIBCPP_TEMPLATE_VIS enable_if {}; ^ /Users/buildslave/jenkins/workspace/lldb-cmake/llvm-project/lldb/test/API/functionalities/data-formatter/stringprinter/main.cpp:1:10: fatal error: could not build module 'std' #include <string> ~~~~~~~~^ 3 errors generated. make: *** [main.o] Error 1

Hide Details

Test Directory: /Users/buildslave/jenkins/workspace/lldb-cmake/llvm-project/lldb/test/API/functionalities/data-formatter/stringprinter ---------------------------------------------------------------------- Ran 4 tests in 8.785s

Hide Details

RESULT: FAILED (2 passes, 0 failures, 1 errors, 1 skipped, 0 expected failures, 0 unexpected successes)

Hide Details

--

Hide Details

******************** UNSUPPORTED: lldb-api :: commands/watchpoints/variable_out_of_scope/TestWatchedVarHitWhenInScope.py (2147 of 2150) PASS: lldb-api :: commands/expression/multiline-navigation/TestMultilineNavigation.py (2148 of 2150) PASS: lldb-api :: lang/objc/orderedset/TestOrderedSet.py (2149 of 2150) PASS: lldb-api :: tools/lldb-server/TestLldbGdbServer.py (2150 of 2150) Slowest Tests: -------------------------------------------------------------------------- 151.26s: lldb-api :: lang/cpp/namespace/TestNamespaceLookup.py 125.97s: lldb-api :: macosx/simulator/TestSimulatorPlatform.py 95.18s: lldb-api :: tools/lldb-server/TestLldbGdbServer.py 78.42s: lldb-api :: functionalities/postmortem/mach-core/TestMachCore.py 75.65s: lldb-api :: lang/cpp/namespace/TestNamespace.py 74.66s: lldb-api :: types/TestLongTypesExpr.py 72.70s: lldb-api :: types/TestLongTypes.py 67.88s: lldb-api :: lang/objc/exceptions/TestObjCExceptions.py 62.11s: lldb-api :: lang/objc/hidden-ivars/TestHiddenIvars.py 58.41s: lldb-api :: types/TestIntegerTypeExpr.py 58.07s: lldb-api :: lang/objc/real-definition/TestRealDefinition.py 57.66s: lldb-api :: lang/objc/objc-new-syntax/TestObjCNewSyntaxLiteral.py 52.18s: lldb-api :: lang/objc/foundation/TestFoundationDisassembly.py 51.58s: lldb-api :: lang/objc/foundation/TestObjCMethods.py 51.19s: lldb-api :: functionalities/load_unload/TestLoadUnload.py 46.65s: lldb-api :: types/TestCharTypeExpr.py 43.11s: lldb-api :: types/TestIntegerType.py 41.22s: lldb-api :: functionalities/postmortem/minidump/TestMiniDump.py 40.17s: lldb-api :: types/TestDoubleTypes.py 39.22s: lldb-api :: lang/cpp/class_types/TestClassTypes.py

Hide Details

Tests Times: -------------------------------------------------------------------------- [ Range ] :: [ Percentage ] :: [ Count ] -------------------------------------------------------------------------- [150s,160s) :: [ ] :: [ 1/2150] [140s,150s) :: [ ] :: [ 0/2150] [130s,140s) :: [ ] :: [ 1/2150] [120s,130s) :: [ ] :: [ 0/2150] [110s,120s) :: [ ] :: [ 0/2150] [100s,110s) :: [ ] :: [ 1/2150] [ 90s,100s) :: [ ] :: [ 0/2150] [ 80s, 90s) :: [ ] :: [ 2/2150] [ 70s, 80s) :: [ ] :: [ 3/2150] [ 60s, 70s) :: [ ] :: [ 4/2150] [ 50s, 60s) :: [ ] :: [ 3/2150] [ 40s, 50s) :: [ ] :: [ 5/2150] [ 30s, 40s) :: [ ] :: [ 18/2150] [ 20s, 30s) :: [ ] :: [ 26/2150] [ 10s, 20s) :: [** ] :: [ 152/2150] [ 0s, 10s) :: [*********************************** ] :: [1934/2150] -------------------------------------------------------------------------- ******************** Failed Tests (136): lldb-api :: functionalities/data-formatter/data-formatter-stl/libcxx/function/TestLibCxxFunction.py lldb-api :: functionalities/thread/backtrace_all/TestBacktraceAll.py lldb-api :: lang/objcxx/objcxx-ivar-vector/TestIvarVector.py lldb-api :: lang/cpp/global_operators/TestCppGlobalOperators.py lldb-api :: lang/cpp/dynamic-value/TestDynamicValue.py lldb-api :: tools/lldb-server/inferior-crash/TestGdbRemoteSegFault.py lldb-api :: commands/expression/import-std-module/deque-dbg-info-content/TestDbgInfoContentDequeFromStdModule.py lldb-api :: commands/expression/import-std-module/forward_list-dbg-info-content/TestDbgInfoContentForwardListFromStdModule.py lldb-api :: lang/cpp/class_types/TestClassTypesDisassembly.py lldb-api :: lang/cpp/class_types/TestClassTypes.py lldb-api :: types/TestCharTypeExpr.py lldb-api :: types/TestFloatTypesExpr.py lldb-api :: functionalities/data-formatter/data-formatter-smart-array/TestDataFormatterSmartArray.py lldb-shell :: Process/TestEnvironment.test lldb-api :: lang/cpp/char1632_t/TestChar1632T.py lldb-api :: functionalities/data-formatter/data-formatter-synth/TestDataFormatterSynth.py lldb-api :: functionalities/breakpoint/cpp_exception/TestCPPExceptionBreakpoint.py lldb-api :: commands/expression/import-std-module/list-dbg-info-content/TestDbgInfoContentListFromStdModule.py lldb-api :: commands/expression/import-std-module/stack/TestStackFromStdModule.py lldb-api :: functionalities/type_lookup/TestTypeLookup.py lldb-api :: lang/cpp/stl/TestSTL.py lldb-api :: lang/objcxx/class-name-clash/TestNameClash.py lldb-api :: functionalities/deleted-executable/TestDeletedExecutable.py lldb-api :: commands/expression/import-std-module/vector-dbg-info-content/TestDbgInfoContentVectorFromStdModule.py lldb-api :: functionalities/thread/exit_during_break/TestExitDuringBreak.py lldb-api :: commands/expression/import-std-module/shared_ptr-dbg-info-content/TestSharedPtrDbgInfoContentFromStdModule.py lldb-api :: types/TestDoubleTypesExpr.py lldb-api :: commands/expression/namespace_local_var_same_name_obj_c/TestNamespaceLocalVarSameNameObjC.py lldb-api :: commands/expression/static-initializers/TestStaticInitializers.py lldb-api :: types/TestIntegerType.py lldb-api :: functionalities/thread/exit_during_step/TestExitDuringStep.py lldb-api :: functionalities/data-formatter/data-formatter-stl/libcxx/vbool/TestDataFormatterLibcxxVBool.py lldb-api :: functionalities/data-formatter/compactvectors/TestCompactVectors.py lldb-api :: lang/cpp/unique-types/TestUniqueTypes.py lldb-api :: commands/expression/import-std-module/unique_ptr-dbg-info-content/TestUniquePtrDbgInfoContent.py lldb-api :: functionalities/data-formatter/data-formatter-stl/libcxx/unordered/TestDataFormatterUnordered.py lldb-api :: functionalities/type_completion/TestTypeCompletion.py lldb-api :: functionalities/data-formatter/data-formatter-categories/TestDataFormatterCategories.py lldb-api :: functionalities/data-formatter/data-formatter-stl/libcxx/map/TestDataFormatterLibccMap.py lldb-api :: functionalities/thread/step_out/TestThreadStepOut.py lldb-api :: lang/cpp/template/TestTemplateArgs.py lldb-api :: types/TestLongTypesExpr.py lldb-api :: commands/expression/import-std-module/unique_ptr/TestUniquePtrFromStdModule.py lldb-api :: commands/expression/issue_11588/Test11588.py lldb-api :: commands/expression/import-std-module/weak_ptr-dbg-info-content/TestDbgInfoContentWeakPtrFromStdModule.py lldb-api :: python_api/lldbutil/iter/TestRegistersIterator.py lldb-api :: functionalities/data-formatter/data-formatter-stl/libcxx/set/TestDataFormatterLibcxxSet.py lldb-api :: python_api/exprpath_synthetic/TestExprPathSynthetic.py lldb-api :: functionalities/breakpoint/inlined_breakpoints/TestInlinedBreakpoints.py lldb-api :: types/TestFloatTypes.py lldb-api :: lang/cpp/exceptions/TestCPPExceptionBreakpoints.py lldb-api :: lang/cpp/namespace/TestNamespace.py lldb-api :: types/TestLongTypes.py lldb-api :: commands/expression/call-function/TestCallUserDefinedFunction.py lldb-api :: functionalities/inline-stepping/TestInlineStepping.py lldb-api :: lang/cpp/namespace/TestNamespaceLookup.py lldb-api :: commands/expression/vector_of_enums/TestVectorOfEnums.py lldb-api :: commands/expression/import-std-module/list/TestListFromStdModule.py lldb-api :: functionalities/memory/find/TestMemoryFind.py lldb-api :: types/TestDoubleTypes.py lldb-api :: functionalities/data-formatter/data-formatter-advanced/TestDataFormatterAdv.py lldb-api :: commands/expression/import-std-module/weak_ptr/TestWeakPtrFromStdModule.py lldb-api :: lang/c/step_over_no_deadlock/TestStepOverDoesntBlock.py lldb-api :: functionalities/data-formatter/poarray/TestPrintObjectArray.py lldb-api :: lang/cpp/wchar_t/TestCxxWCharT.py lldb-api :: types/TestIntegerTypeExpr.py lldb-api :: types/TestShortType.py lldb-api :: commands/expression/import-std-module/forward_list/TestForwardListFromStdModule.py lldb-api :: commands/expression/import-std-module/shared_ptr/TestSharedPtrFromStdModule.py lldb-api :: lang/objc/objc++/TestObjCXX.py lldb-api :: functionalities/breakpoint/breakpoint_set_restart/TestBreakpointSetRestart.py lldb-api :: commands/command/script/TestCommandScript.py lldb-api :: functionalities/thread/create_after_attach/TestCreateAfterAttach.py lldb-api :: commands/expression/import-std-module/vector-of-vectors/TestVectorOfVectorsFromStdModule.py lldb-api :: python_api/watchpoint/watchlocation/TestSetWatchlocation.py lldb-api :: functionalities/data-formatter/ostypeformatting/TestFormattersOsType.py lldb-api :: functionalities/data-formatter/data-formatter-script/TestDataFormatterScript.py lldb-api :: functionalities/thread/state_after_expression/TestStateAfterExpression.py lldb-api :: functionalities/memory/read/TestMemoryRead.py lldb-api :: types/TestCharType.py lldb-api :: functionalities/data-formatter/data-formatter-stl/libcxx/string/TestDataFormatterLibcxxString.py lldb-api :: functionalities/data-formatter/data-formatter-stl/libcxx/multimap/TestDataFormatterLibccMultiMap.py lldb-api :: functionalities/data-formatter/data-formatter-stl/libcxx/vector/TestDataFormatterLibcxxVector.py lldb-api :: commands/expression/timeout/TestCallWithTimeout.py lldb-api :: functionalities/data-formatter/boolreference/TestFormattersBoolRefPtr.py lldb-api :: python_api/class_members/TestSBTypeClassMembers.py lldb-api :: commands/expression/call-function/TestCallStopAndContinue.py lldb-api :: lang/cpp/breakpoint_in_member_func_w_non_primitive_params/TestBreakpointInMemberFuncWNonPrimitiveParams.py lldb-api :: functionalities/data-formatter/data-formatter-stl/libcxx/initializerlist/TestInitializerList.py lldb-api :: commands/expression/import-std-module/vector-bool/TestVectorBoolFromStdModule.py lldb-api :: commands/expression/import-std-module/vector/TestVectorFromStdModule.py lldb-api :: python_api/watchpoint/watchlocation/TestTargetWatchAddress.py lldb-api :: lang/cpp/operators/TestCppOperators.py lldb-api :: lang/cpp/bitfields/TestCppBitfields.py lldb-api :: commands/expression/import-std-module/deque-basic/TestDequeFromStdModule.py lldb-api :: tools/lldb-server/inferior-crash/TestGdbRemoteAbort.py lldb-api :: commands/expression/import-std-module/conflicts/TestStdModuleWithConflicts.py lldb-api :: commands/expression/call-function/TestCallStdStringFunction.py lldb-api :: python_api/lldbutil/iter/TestLLDBIterator.py lldb-api :: python_api/sbvalue_const_addrof/TestSBValueConstAddrOf.py lldb-api :: functionalities/data-formatter/data-formatter-named-summaries/TestDataFormatterNamedSummaries.py lldb-api :: python_api/process/TestProcessAPI.py lldb-api :: lang/objc/exceptions/TestObjCExceptions.py lldb-api :: functionalities/memory-region/TestMemoryRegion.py lldb-api :: functionalities/breakpoint/hardware_breakpoints/hardware_breakpoint_on_multiple_threads/TestHWBreakMultiThread.py lldb-api :: lang/cpp/stl/TestStdCXXDisassembly.py lldb-api :: commands/expression/import-std-module/basic/TestImportStdModule.py lldb-api :: lang/objcxx/hide-runtime-values/TestObjCXXHideRuntimeValues.py lldb-api :: functionalities/data-formatter/data-formatter-stl/libcxx/queue/TestDataFormatterLibcxxQueue.py lldb-api :: commands/log/basic/TestLogging.py lldb-api :: functionalities/completion/TestCompletion.py lldb-api :: functionalities/data-formatter/data-formatter-stl/libcxx/multiset/TestDataFormatterLibcxxMultiSet.py lldb-api :: api/multithreaded/TestMultithreaded.py lldb-api :: functionalities/data-formatter/data-formatter-stl/libcxx/bitset/TestDataFormatterLibcxxBitset.py lldb-api :: lang/objcxx/cxx-bridged-po/TestObjCXXBridgedPO.py lldb-api :: commands/expression/formatters/TestFormatters.py lldb-api :: functionalities/data-formatter/data-formatter-skip-summary/TestDataFormatterSkipSummary.py lldb-api :: lang/cpp/extern_c/TestExternCSymbols.py lldb-api :: functionalities/data-formatter/data-formatter-stl/libcxx/tuple/TestDataFormatterLibcxxTuple.py lldb-api :: functionalities/thread/thread_exit/TestThreadExit.py lldb-api :: functionalities/data-formatter/data-formatter-stl/libcxx/forward_list/TestDataFormatterLibcxxForwardList.py lldb-api :: functionalities/breakpoint/breakpoint_ids/TestBreakpointIDs.py lldb-api :: functionalities/data-formatter/parray/TestPrintArray.py lldb-api :: commands/expression/import-std-module/pair/TestPairFromStdModule.py lldb-api :: functionalities/data-formatter/data-formatter-stl/libcxx/atomic/TestLibCxxAtomic.py lldb-api :: functionalities/breakpoint/cpp/TestCPPBreakpointLocations.py lldb-api :: commands/expression/import-std-module/queue/TestQueueFromStdModule.py lldb-api :: commands/expression/no-deadlock/TestExprDoesntBlock.py lldb-api :: commands/expression/expr-in-syscall/TestExpressionInSyscall.py lldb-api :: commands/frame/diagnose/inheritance/TestDiagnoseInheritance.py lldb-api :: commands/settings/TestSettings.py lldb-api :: functionalities/dynamic_value_child_count/TestDynamicValueChildCount.py lldb-api :: types/TestShortTypeExpr.py lldb-api :: functionalities/data-formatter/data-formatter-disabling/TestDataFormatterDisabling.py lldb-api :: functionalities/data-formatter/data-formatter-stl/libcxx/iterator/TestDataFormatterLibccIterator.py lldb-api :: functionalities/data-formatter/stringprinter/TestStringPrinter.py

Hide Details

Hide Details

Testing Time: 1792.70s Unsupported : 152 Passed : 1856 Expectedly Failed: 6 Failed : 136 FAILED: tools/lldb/test/CMakeFiles/check-lldb-lit cd /Users/buildslave/jenkins/workspace/lldb-cmake/lldb-build/tools/lldb/test && /usr/local/Frameworks/Python.framework/Versions/3.7/bin/python3.7 /Users/buildslave/jenkins/workspace/lldb-cmake/lldb-build/./bin/llvm-lit -v --time-tests --shuffle --xunit-xml-output=/Users/buildslave/jenkins/workspace/lldb-cmake/test/results.xml -v -j 4 /Users/buildslave/jenkins/workspace/lldb-cmake/lldb-build/tools/lldb/test ninja: build stopped: subcommand failed. Command failed: Command '['/usr/bin/env', 'TERM=vt100', '/usr/local/bin/ninja', '-v', 'check-lldb']' returned non-zero exit status 1 Command: ['/usr/bin/env', 'TERM=vt100', '/usr/local/bin/ninja', '-v', 'check-lldb'] [Pipeline] } [Pipeline] // timeout [Pipeline] } [Pipeline] // stage [Pipeline] stage [Pipeline] { (Declarative: Post Actions) [Pipeline] scanForIssues [Clang (LLVM based)] Sleeping for 5 seconds due to JENKINS-32191... [Clang (LLVM based)] Parsing console log (workspace: '/Users/buildslave/jenkins/workspace/lldb-cmake') [Clang (LLVM based)] Successfully parsed console log [Clang (LLVM based)] -> found 101 issues (skipped 1739 duplicates) [Clang (LLVM based)] Post processing issues on 'green-dragon-10' with source code encoding 'UTF-8' [Clang (LLVM based)] Creating SCM blamer to obtain author and commit information for affected files [Clang (LLVM based)] Creating SCM miner to obtain statistics for affected repository files [Clang (LLVM based)] Resolving file names for all issues in source directory '/Users/buildslave/jenkins/workspace/lldb-cmake' [Clang (LLVM based)] -> resolved paths in source directory (98 found, 0 not found) [Clang (LLVM based)] Resolving module names from module definitions (build.xml, pom.xml, or Manifest.mf files) [Clang (LLVM based)] -> resolved module names for 101 issues [Clang (LLVM based)] Resolving package names (or namespaces) by parsing the affected files [Clang (LLVM based)] -> resolved package names of 98 affected files [Clang (LLVM based)] No filter has been set, publishing all 101 issues [Clang (LLVM based)] Creating fingerprints for all affected code blocks to track issues over different builds [Clang (LLVM based)] -> created fingerprints for 101 issues (skipped 0 issues) [Clang (LLVM based)] Copying affected files to Jenkins' build folder '/Users/Shared/Jenkins/Home/jobs/lldb-cmake/builds/23937/files-with-issues' [Clang (LLVM based)] -> 77 copied, 22 not in workspace, 0 not-found, 0 with I/O error [Pipeline] junit Recording test results [Pipeline] } [Pipeline] // stage [Pipeline] } [Pipeline] // withEnv [Pipeline] } [Pipeline] // node [Pipeline] End of Pipeline ERROR: script returned exit code 1 Finished: FAILURE