FailedConsole Output

Skipping 15,760 KB.. Full Log
provider
unichar:  (hide value) (skip pointers) (hide member names) unichar summary provider
^std::vector<.+>(( )?&)?$: `size=${svar%#}` (show children) (hide value) (skip pointers)
^std::map<.+> >(( )?&)?$: `size=${svar%#}` (show children) (hide value) (skip pointers)
^std::(__cxx11::)?list<.+>(( )?&)?$: `size=${svar%#}` (show children) (hide value) (skip pointers)
^std::unique_ptr<.+>(( )?&)?$:  (show children) (hide value) (skip pointers) libstdc++ std::unique_ptr summary provider
^std::shared_ptr<.+>(( )?&)?$:  (show children) (hide value) (skip pointers) libstdc++ std::shared_ptr summary provider
^std::weak_ptr<.+>(( )?&)?$:  (show children) (hide value) (skip pointers) libstdc++ std::weak_ptr summary provider
^std::__[[:alnum:]]+::string$:  (hide value) std::string summary provider
^std::__[[:alnum:]]+::basic_string<char, std::__[[:alnum:]]+::char_traits<char>, std::__[[:alnum:]]+::allocator<char> >$:  (hide value) std::string summary provider
^std::__[[:alnum:]]+::basic_string<unsigned char, std::__[[:alnum:]]+::char_traits<unsigned char>, std::__[[:alnum:]]+::allocator<unsigned char> >$:  (hide value) std::string summary provider
^std::__[[:alnum:]]+::basic_string<char16_t, std::__[[:alnum:]]+::char_traits<char16_t>, std::__[[:alnum:]]+::allocator<char16_t> >$:  (hide value) std::u16string summary provider
^std::__[[:alnum:]]+::basic_string<char32_t, std::__[[:alnum:]]+::char_traits<char32_t>, std::__[[:alnum:]]+::allocator<char32_t> >$:  (hide value) std::u32string summary provider
^std::__[[:alnum:]]+::wstring$:  (hide value) std::wstring summary provider
^std::__[[:alnum:]]+::basic_string<wchar_t, std::__[[:alnum:]]+::char_traits<wchar_t>, std::__[[:alnum:]]+::allocator<wchar_t> >$:  (hide value) std::wstring summary provider
^std::__[[:alnum:]]+::function<.+>$:  (hide value) libc++ std::function summary provider
^std::__[[:alnum:]]+::bitset<.+>(( )?&)?$:  (show children) (hide value) libc++ std::bitset summary provider
^std::__[[:alnum:]]+::vector<.+>(( )?&)?$:  (show children) (hide value) libc++ std::vector summary provider
^std::__[[:alnum:]]+::forward_list<.+>(( )?&)?$:  (show children) (hide value) libc++ std::list summary provider
^std::__([A-Zabd-z0-9]|cx?[A-Za-wyz0-9]|cxx1?[A-Za-z02-9]|cxx11[[:alnum:]])[[:alnum:]]*::list<.+>(( )?&)?$:  (show children) (hide value) libc++ std::list summary provider
^std::__[[:alnum:]]+::map<.+>(( )?&)?$:  (show children) (hide value) libc++ std::map summary provider
^std::__[[:alnum:]]+::deque<.+>(( )?&)?$:  (show children) (hide value) libc++ std::deque summary provider
^std::__[[:alnum:]]+::queue<.+>(( )?&)?$:  (show children) (hide value) libc++ std::queue summary provider
^std::__[[:alnum:]]+::set<.+>(( )?&)?$:  (show children) (hide value) libc++ std::set summary provider
^std::__[[:alnum:]]+::multiset<.+>(( )?&)?$:  (show children) (hide value) libc++ std::multiset summary provider
^std::__[[:alnum:]]+::multimap<.+>(( )?&)?$:  (show children) (hide value) libc++ std::multimap summary provider
^(std::__[[:alnum:]]+::)unordered_(multi)?(map|set)<.+> >$:  (show children) (hide value) libc++ std::unordered containers summary provider
^std::__[[:alnum:]]+::tuple<.*>(( )?&)?$:  (show children) (hide value) libc++ std::tuple summary provider
^std::__[[:alnum:]]+::atomic<.+>$:  (show children) (hide value) libc++ std::atomic summary provider
^std::__[[:alnum:]]+::optional<.+>(( )?&)?$:  (show children) (hide value) libc++ std::optional summary provider
^std::__[[:alnum:]]+::variant<.+>(( )?&)?$:  (show children) (hide value) libc++ std::variant summary provider
^std::__[[:alnum:]]+::shared_ptr<.+>(( )?&)?$:  (show children) (hide value) (skip pointers) libc++ std::shared_ptr summary provider
^std::__[[:alnum:]]+::weak_ptr<.+>(( )?&)?$:  (show children) (hide value) (skip pointers) libc++ std::weak_ptr summary provider
^std::__[[:alnum:]]+::unique_ptr<.+>(( )?&)?$:  (show children) (hide value) (skip pointers) libc++ std::unique_ptr summary provider
char8_t \[[0-9]+\]:  (hide value) (skip pointers) char8_t [] summary provider
char16_t \[[0-9]+\]:  (hide value) (skip pointers) char16_t [] summary provider
char32_t \[[0-9]+\]:  (hide value) (skip pointers) char32_t [] summary provider
wchar_t \[[0-9]+\]:  (hide value) (skip pointers) wchar_t * summary provider
-----------------------
Category: objc (disabled)
-----------------------
CMTime:  (show children) CMTime summary provider
BOOL:  (not cascading) (hide value) (skip pointers) (skip references) 
BOOL &:  (not cascading) (hide value) (skip pointers) (skip references) 
BOOL *:  (not cascading) (hide value) (skip pointers) (skip references) 
SEL:  (not cascading) (hide value) (skip pointers) (skip references) SEL summary provider
objc_selector:  (not cascading) (hide value) (skip pointers) (skip references) SEL summary provider
objc_selector *:  (not cascading) (hide value) (skip pointers) (skip references) SEL summary provider
SEL *:  (not cascading) (hide value) (skip pointers) (skip references) SEL summary provider
Class:  (not cascading) (hide value) (skip pointers) (skip references) Class summary provider
__block_literal_generic: `${var.__FuncPtr%A}` (hide value)
CFGregorianUnits: `${var.years} years, ${var.months} months, ${var.days} days, ${var.hours} hours, ${var.minutes} minutes ${var.seconds} seconds` (hide value)
CFRange: `location=${var.location} length=${var.length}` (hide value)
NSRange: `location=${var.location}, length=${var.length}` (hide value)
NSRectArray: `(${var.origin}, ${var.size}), ...` (hide value)
NSPoint: `` (hide value) (one-line printout)
NSSize: `` (hide value) (one-line printout)
NSRect: `` (hide value) (one-line printout)
CGSize: `` (hide value) (one-line printout)
CGPoint: `` (hide value) (one-line printout)
CGRect: `` (hide value) (one-line printout)
RGBColor: `red=${var.red} green=${var.green} blue=${var.blue}` (hide value)
Rect: `(t=${var.top}, l=${var.left}, b=${var.bottom}, r=${var.right})` (hide value)
Point: `{(v=${var.v}, h=${var.h})}` (hide value)
DateTimeRect *: `${var.month}/${var.day}/${var.year}  ${var.hour} :${var.minute} :${var.second} dayOfWeek:${var.dayOfWeek}` (hide value)
LongDateRect: `${var.ld.month}/${var.ld.day}/${var.ld.year} ${var.ld.hour} :${var.ld.minute} :${var.ld.second} dayOfWeek:${var.ld.dayOfWeek}` (hide value)
HIPoint: `(x=${var.x}, y=${var.y})` (hide value)
HIRect: `origin=${var.origin} size=${var.size}` (hide value)
NSArray:  (show children) NSArray summary provider
NSMutableArray:  (show children) NSArray summary provider
__NSArrayI:  (show children) NSArray summary provider
__NSArray0:  (show children) NSArray summary provider
__NSSingleObjectArrayI:  (show children) NSArray summary provider
__NSArrayM:  (show children) NSArray summary provider
__NSCFArray:  (show children) NSArray summary provider
_NSCallStackArray:  (show children) NSArray summary provider
CFArrayRef:  (show children) NSArray summary provider
CFMutableArrayRef:  (show children) NSArray summary provider
NSDictionary:  (show children) NSDictionary summary provider
NSMutableDictionary:  (show children) NSDictionary summary provider
__NSCFDictionary:  (show children) NSDictionary summary provider
__NSDictionaryI:  (show children) NSDictionary summary provider
__NSSingleEntryDictionaryI:  (show children) NSDictionary summary provider
__NSDictionaryM:  (show children) NSDictionary summary provider
CFDictionaryRef:  (show children) NSDictionary summary provider
__CFDictionary:  (show children) NSDictionary summary provider
CFMutableDictionaryRef:  (show children) NSDictionary summary provider
NSSet:  (show children) NSSet summary
CFSetRef:  (show children) CFSetRef summary
CFMutableSetRef:  (show children) CFMutableSetRef summary
__NSCFSet:  (show children) __NSCFSet summary
__CFSet:  (show children) __CFSet summary
__NSSetI:  (show children) __NSSetI summary
__NSSetM:  (show children) __NSSetM summary
NSCountedSet:  (show children) NSCountedSet summary
NSMutableSet:  (show children) NSMutableSet summary
NSOrderedSet:  (show children) NSOrderedSet summary
__NSOrderedSetI:  (show children) __NSOrderedSetI summary
__NSOrderedSetM:  (show children) __NSOrderedSetM summary
NSError:  (show children) NSError summary provider
NSException:  (show children) NSException summary provider
CFBagRef:  CFBag summary provider
__CFBag:  CFBag summary provider
const struct __CFBag:  CFBag summary provider
CFMutableBagRef:  CFBag summary provider
CFBinaryHeapRef:  CFBinaryHeap summary provider
__CFBinaryHeap:  CFBinaryHeap summary provider
NSString:  NSString summary provider
CFStringRef:  NSString summary provider
__CFString:  NSString summary provider
CFMutableStringRef:  NSString summary provider
NSMutableString:  NSString summary provider
__NSCFConstantString:  NSString summary provider
__NSCFString:  NSString summary provider
NSCFConstantString:  NSString summary provider
NSCFString:  NSString summary provider
NSPathStore2:  NSString summary provider
NSTaggedPointerString:  NSString summary provider
NSAttributedString:  NSAttributedString summary provider
NSMutableAttributedString:  NSMutableAttributedString summary provider
NSConcreteMutableAttributedString:  NSMutableAttributedString summary provider
NSBundle:  NSBundle summary provider
NSData:  NSData summary provider
_NSInlineData:  NSData summary provider
NSConcreteData:  NSData summary provider
NSConcreteMutableData:  NSData summary provider
NSMutableData:  NSData summary provider
__NSCFData:  NSData summary provider
CFDataRef:  NSData summary provider
CFMutableDataRef:  NSData summary provider
NSMachPort:  NSMachPort summary provider
NSNotification:  NSNotification summary provider
NSConcreteNotification:  NSNotification summary provider
NSNumber:  NSNumber summary provider
CFNumberRef:  CFNumberRef summary provider
__NSCFBoolean:  NSNumber summary provider
__NSCFNumber:  NSNumber summary provider
NSCFBoolean:  NSNumber summary provider
NSCFNumber:  NSNumber summary provider
NSDecimalNumber:  NSDecimalNumber summary provider
NSURL:  NSURL summary provider
CFURLRef:  NSURL summary provider
NSDate:  NSDate summary provider
__NSDate:  NSDate summary provider
__NSTaggedDate:  NSDate summary provider
NSCalendarDate:  NSDate summary provider
NSTimeZone:  NSTimeZone summary provider
CFTimeZoneRef:  NSTimeZone summary provider
__NSTimeZone:  NSTimeZone summary provider
CFAbsoluteTime:  (hide value) CFAbsoluteTime summary provider
NSIndexSet:  NSIndexSet summary provider
NSMutableIndexSet:  NSIndexSet summary provider
CFGregorianDate: `@"${var.month%d}/${var.day%d}/${var.year%d} ${var.hour%d}:${var.minute%d}:${var.second}"`
CFBitVectorRef:  CFBitVector summary provider
CFMutableBitVectorRef:  CFBitVector summary provider
__CFBitVector:  CFBitVector summary provider
__CFMutableBitVector:  CFBitVector summary provider

Hide Details

Hide Details

Ran command: "type summary list"

Hide Details

Got output: ----------------------- Category: VectorTypes (disabled) ----------------------- builtin_type_vec128: `${var.uint128}` (one-line printout) (skip pointers) (hide member names) float [4]: `` (one-line printout) (skip pointers) (hide member names) int32_t [4]: `` (one-line printout) (skip pointers) (hide member names) int16_t [8]: `` (one-line printout) (skip pointers) (hide member names) vDouble: `` (one-line printout) (skip pointers) (hide member names) vFloat: `` (one-line printout) (skip pointers) (hide member names) vSInt8: `` (one-line printout) (skip pointers) (hide member names) vSInt16: `` (one-line printout) (skip pointers) (hide member names) vSInt32: `` (one-line printout) (skip pointers) (hide member names) vUInt8: `` (one-line printout) (skip pointers) (hide member names) vUInt16: `` (one-line printout) (skip pointers) (hide member names) vUInt32: `` (one-line printout) (skip pointers) (hide member names) vBool32: `` (one-line printout) (skip pointers) (hide member names) ----------------------- Category: cplusplus (disabled) ----------------------- std::string: `${var._M_dataplus._M_p}` (hide value) std::basic_string<char>: `${var._M_dataplus._M_p}` (hide value) std::basic_string<char,std::char_traits<char>,std::allocator<char> >: `${var._M_dataplus._M_p}` (hide value) std::basic_string<char, std::char_traits<char>, std::allocator<char> >: `${var._M_dataplus._M_p}` (hide value) std::__cxx11::string: (hide value) libstdc++ c++11 std::string summary provider std::__cxx11::basic_string<char, std::char_traits<char>, std::allocator<char> >: (hide value) libstdc++ c++11 std::string summary provider std::__cxx11::basic_string<unsigned char, std::char_traits<unsigned char>, std::allocator<unsigned char> >: (hide value) libstdc++ c++11 std::string summary provider std::wstring: `${var._M_dataplus._M_p%S}` (hide value) std::basic_string<wchar_t>: `${var._M_dataplus._M_p%S}` (hide value) std::basic_string<wchar_t,std::char_traits<wchar_t>,std::allocator<wchar_t> >: `${var._M_dataplus._M_p%S}` (hide value) std::basic_string<wchar_t, std::char_traits<wchar_t>, std::allocator<wchar_t> >: `${var._M_dataplus._M_p%S}` (hide value) std::__cxx11::wstring: (hide value) libstdc++ c++11 std::wstring summary provider std::__cxx11::basic_string<wchar_t, std::char_traits<wchar_t>, std::allocator<wchar_t> >: (hide value) libstdc++ c++11 std::wstring summary provider char8_t *: (skip pointers) char8_t * summary provider char16_t *: (skip pointers) char16_t * summary provider char32_t *: (skip pointers) char32_t * summary provider wchar_t *: (skip pointers) wchar_t * summary provider unichar *: (skip pointers) unichar * summary provider char8_t: (hide value) (skip pointers) (hide member names) char8_t summary provider char16_t: (hide value) (skip pointers) (hide member names) char16_t summary provider char32_t: (hide value) (skip pointers) (hide member names) char32_t summary provider wchar_t: (hide value) (skip pointers) (hide member names) wchar_t summary provider unichar: (hide value) (skip pointers) (hide member names) unichar summary provider ^std::vector<.+>(( )?&)?$: `size=${svar%#}` (show children) (hide value) (skip pointers) ^std::map<.+> >(( )?&)?$: `size=${svar%#}` (show children) (hide value) (skip pointers) ^std::(__cxx11::)?list<.+>(( )?&)?$: `size=${svar%#}` (show children) (hide value) (skip pointers) ^std::unique_ptr<.+>(( )?&)?$: (show children) (hide value) (skip pointers) libstdc++ std::unique_ptr summary provider ^std::shared_ptr<.+>(( )?&)?$: (show children) (hide value) (skip pointers) libstdc++ std::shared_ptr summary provider ^std::weak_ptr<.+>(( )?&)?$: (show children) (hide value) (skip pointers) libstdc++ std::weak_ptr summary provider ^std::__[[:alnum:]]+::string$: (hide value) std::string summary provider ^std::__[[:alnum:]]+::basic_string<char, std::__[[:alnum:]]+::char_traits<char>, std::__[[:alnum:]]+::allocator<char> >$: (hide value) std::string summary provider ^std::__[[:alnum:]]+::basic_string<unsigned char, std::__[[:alnum:]]+::char_traits<unsigned char>, std::__[[:alnum:]]+::allocator<unsigned char> >$: (hide value) std::string summary provider ^std::__[[:alnum:]]+::basic_string<char16_t, std::__[[:alnum:]]+::char_traits<char16_t>, std::__[[:alnum:]]+::allocator<char16_t> >$: (hide value) std::u16string summary provider ^std::__[[:alnum:]]+::basic_string<char32_t, std::__[[:alnum:]]+::char_traits<char32_t>, std::__[[:alnum:]]+::allocator<char32_t> >$: (hide value) std::u32string summary provider ^std::__[[:alnum:]]+::wstring$: (hide value) std::wstring summary provider ^std::__[[:alnum:]]+::basic_string<wchar_t, std::__[[:alnum:]]+::char_traits<wchar_t>, std::__[[:alnum:]]+::allocator<wchar_t> >$: (hide value) std::wstring summary provider ^std::__[[:alnum:]]+::function<.+>$: (hide value) libc++ std::function summary provider ^std::__[[:alnum:]]+::bitset<.+>(( )?&)?$: (show children) (hide value) libc++ std::bitset summary provider ^std::__[[:alnum:]]+::vector<.+>(( )?&)?$: (show children) (hide value) libc++ std::vector summary provider ^std::__[[:alnum:]]+::forward_list<.+>(( )?&)?$: (show children) (hide value) libc++ std::list summary provider ^std::__([A-Zabd-z0-9]|cx?[A-Za-wyz0-9]|cxx1?[A-Za-z02-9]|cxx11[[:alnum:]])[[:alnum:]]*::list<.+>(( )?&)?$: (show children) (hide value) libc++ std::list summary provider ^std::__[[:alnum:]]+::map<.+>(( )?&)?$: (show children) (hide value) libc++ std::map summary provider ^std::__[[:alnum:]]+::deque<.+>(( )?&)?$: (show children) (hide value) libc++ std::deque summary provider ^std::__[[:alnum:]]+::queue<.+>(( )?&)?$: (show children) (hide value) libc++ std::queue summary provider ^std::__[[:alnum:]]+::set<.+>(( )?&)?$: (show children) (hide value) libc++ std::set summary provider ^std::__[[:alnum:]]+::multiset<.+>(( )?&)?$: (show children) (hide value) libc++ std::multiset summary provider ^std::__[[:alnum:]]+::multimap<.+>(( )?&)?$: (show children) (hide value) libc++ std::multimap summary provider ^(std::__[[:alnum:]]+::)unordered_(multi)?(map|set)<.+> >$: (show children) (hide value) libc++ std::unordered containers summary provider ^std::__[[:alnum:]]+::tuple<.*>(( )?&)?$: (show children) (hide value) libc++ std::tuple summary provider ^std::__[[:alnum:]]+::atomic<.+>$: (show children) (hide value) libc++ std::atomic summary provider ^std::__[[:alnum:]]+::optional<.+>(( )?&)?$: (show children) (hide value) libc++ std::optional summary provider ^std::__[[:alnum:]]+::variant<.+>(( )?&)?$: (show children) (hide value) libc++ std::variant summary provider ^std::__[[:alnum:]]+::shared_ptr<.+>(( )?&)?$: (show children) (hide value) (skip pointers) libc++ std::shared_ptr summary provider ^std::__[[:alnum:]]+::weak_ptr<.+>(( )?&)?$: (show children) (hide value) (skip pointers) libc++ std::weak_ptr summary provider ^std::__[[:alnum:]]+::unique_ptr<.+>(( )?&)?$: (show children) (hide value) (skip pointers) libc++ std::unique_ptr summary provider char8_t \[[0-9]+\]: (hide value) (skip pointers) char8_t [] summary provider char16_t \[[0-9]+\]: (hide value) (skip pointers) char16_t [] summary provider char32_t \[[0-9]+\]: (hide value) (skip pointers) char32_t [] summary provider wchar_t \[[0-9]+\]: (hide value) (skip pointers) wchar_t * summary provider ----------------------- Category: default (disabled) ----------------------- ----------------------- Category: objc (disabled) ----------------------- CMTime: (show children) CMTime summary provider BOOL: (not cascading) (hide value) (skip pointers) (skip references) BOOL &: (not cascading) (hide value) (skip pointers) (skip references) BOOL *: (not cascading) (hide value) (skip pointers) (skip references) SEL: (not cascading) (hide value) (skip pointers) (skip references) SEL summary provider objc_selector: (not cascading) (hide value) (skip pointers) (skip references) SEL summary provider objc_selector *: (not cascading) (hide value) (skip pointers) (skip references) SEL summary provider SEL *: (not cascading) (hide value) (skip pointers) (skip references) SEL summary provider Class: (not cascading) (hide value) (skip pointers) (skip references) Class summary provider __block_literal_generic: `${var.__FuncPtr%A}` (hide value) CFGregorianUnits: `${var.years} years, ${var.months} months, ${var.days} days, ${var.hours} hours, ${var.minutes} minutes ${var.seconds} seconds` (hide value) CFRange: `location=${var.location} length=${var.length}` (hide value) NSRange: `location=${var.location}, length=${var.length}` (hide value) NSRectArray: `(${var.origin}, ${var.size}), ...` (hide value) NSPoint: `` (hide value) (one-line printout) NSSize: `` (hide value) (one-line printout) NSRect: `` (hide value) (one-line printout) CGSize: `` (hide value) (one-line printout) CGPoint: `` (hide value) (one-line printout) CGRect: `` (hide value) (one-line printout) RGBColor: `red=${var.red} green=${var.green} blue=${var.blue}` (hide value) Rect: `(t=${var.top}, l=${var.left}, b=${var.bottom}, r=${var.right})` (hide value) Point: `{(v=${var.v}, h=${var.h})}` (hide value) DateTimeRect *: `${var.month}/${var.day}/${var.year} ${var.hour} :${var.minute} :${var.second} dayOfWeek:${var.dayOfWeek}` (hide value) LongDateRect: `${var.ld.month}/${var.ld.day}/${var.ld.year} ${var.ld.hour} :${var.ld.minute} :${var.ld.second} dayOfWeek:${var.ld.dayOfWeek}` (hide value) HIPoint: `(x=${var.x}, y=${var.y})` (hide value) HIRect: `origin=${var.origin} size=${var.size}` (hide value) NSArray: (show children) NSArray summary provider NSMutableArray: (show children) NSArray summary provider __NSArrayI: (show children) NSArray summary provider __NSArray0: (show children) NSArray summary provider __NSSingleObjectArrayI: (show children) NSArray summary provider __NSArrayM: (show children) NSArray summary provider __NSCFArray: (show children) NSArray summary provider _NSCallStackArray: (show children) NSArray summary provider CFArrayRef: (show children) NSArray summary provider CFMutableArrayRef: (show children) NSArray summary provider NSDictionary: (show children) NSDictionary summary provider NSMutableDictionary: (show children) NSDictionary summary provider __NSCFDictionary: (show children) NSDictionary summary provider __NSDictionaryI: (show children) NSDictionary summary provider __NSSingleEntryDictionaryI: (show children) NSDictionary summary provider __NSDictionaryM: (show children) NSDictionary summary provider CFDictionaryRef: (show children) NSDictionary summary provider __CFDictionary: (show children) NSDictionary summary provider CFMutableDictionaryRef: (show children) NSDictionary summary provider NSSet: (show children) NSSet summary CFSetRef: (show children) CFSetRef summary CFMutableSetRef: (show children) CFMutableSetRef summary __NSCFSet: (show children) __NSCFSet summary __CFSet: (show children) __CFSet summary __NSSetI: (show children) __NSSetI summary __NSSetM: (show children) __NSSetM summary NSCountedSet: (show children) NSCountedSet summary NSMutableSet: (show children) NSMutableSet summary NSOrderedSet: (show children) NSOrderedSet summary __NSOrderedSetI: (show children) __NSOrderedSetI summary __NSOrderedSetM: (show children) __NSOrderedSetM summary NSError: (show children) NSError summary provider NSException: (show children) NSException summary provider CFBagRef: CFBag summary provider __CFBag: CFBag summary provider const struct __CFBag: CFBag summary provider CFMutableBagRef: CFBag summary provider CFBinaryHeapRef: CFBinaryHeap summary provider __CFBinaryHeap: CFBinaryHeap summary provider NSString: NSString summary provider CFStringRef: NSString summary provider __CFString: NSString summary provider CFMutableStringRef: NSString summary provider NSMutableString: NSString summary provider __NSCFConstantString: NSString summary provider __NSCFString: NSString summary provider NSCFConstantString: NSString summary provider NSCFString: NSString summary provider NSPathStore2: NSString summary provider NSTaggedPointerString: NSString summary provider NSAttributedString: NSAttributedString summary provider NSMutableAttributedString: NSMutableAttributedString summary provider NSConcreteMutableAttributedString: NSMutableAttributedString summary provider NSBundle: NSBundle summary provider NSData: NSData summary provider _NSInlineData: NSData summary provider NSConcreteData: NSData summary provider NSConcreteMutableData: NSData summary provider NSMutableData: NSData summary provider __NSCFData: NSData summary provider CFDataRef: NSData summary provider CFMutableDataRef: NSData summary provider NSMachPort: NSMachPort summary provider NSNotification: NSNotification summary provider NSConcreteNotification: NSNotification summary provider NSNumber: NSNumber summary provider CFNumberRef: CFNumberRef summary provider __NSCFBoolean: NSNumber summary provider __NSCFNumber: NSNumber summary provider NSCFBoolean: NSNumber summary provider NSCFNumber: NSNumber summary provider NSDecimalNumber: NSDecimalNumber summary provider NSURL: NSURL summary provider CFURLRef: NSURL summary provider NSDate: NSDate summary provider __NSDate: NSDate summary provider __NSTaggedDate: NSDate summary provider NSCalendarDate: NSDate summary provider NSTimeZone: NSTimeZone summary provider CFTimeZoneRef: NSTimeZone summary provider __NSTimeZone: NSTimeZone summary provider CFAbsoluteTime: (hide value) CFAbsoluteTime summary provider NSIndexSet: NSIndexSet summary provider NSMutableIndexSet: NSIndexSet summary provider CFGregorianDate: `@"${var.month%d}/${var.day%d}/${var.year%d} ${var.hour%d}:${var.minute%d}:${var.second}"` CFBitVectorRef: CFBitVector summary provider CFMutableBitVectorRef: CFBitVector summary provider __CFBitVector: CFBitVector summary provider __CFMutableBitVector: CFBitVector summary provider ----------------------- Category: system (disabled) ----------------------- char *: `${var%s}` (skip pointers) unsigned char *: `${var%s}` (skip pointers) OSType: `${var%O}` (not cascading) (skip pointers) (skip references) char \[[0-9]+\]: `${var%s}` (hide value) (skip pointers) ----------------------- Category: cplusplus (disabled) ----------------------- std::string: `${var._M_dataplus._M_p}` (hide value) std::basic_string<char>: `${var._M_dataplus._M_p}` (hide value) std::basic_string<char,std::char_traits<char>,std::allocator<char> >: `${var._M_dataplus._M_p}` (hide value) std::basic_string<char, std::char_traits<char>, std::allocator<char> >: `${var._M_dataplus._M_p}` (hide value) std::__cxx11::string: (hide value) libstdc++ c++11 std::string summary provider std::__cxx11::basic_string<char, std::char_traits<char>, std::allocator<char> >: (hide value) libstdc++ c++11 std::string summary provider std::__cxx11::basic_string<unsigned char, std::char_traits<unsigned char>, std::allocator<unsigned char> >: (hide value) libstdc++ c++11 std::string summary provider std::wstring: `${var._M_dataplus._M_p%S}` (hide value) std::basic_string<wchar_t>: `${var._M_dataplus._M_p%S}` (hide value) std::basic_string<wchar_t,std::char_traits<wchar_t>,std::allocator<wchar_t> >: `${var._M_dataplus._M_p%S}` (hide value) std::basic_string<wchar_t, std::char_traits<wchar_t>, std::allocator<wchar_t> >: `${var._M_dataplus._M_p%S}` (hide value) std::__cxx11::wstring: (hide value) libstdc++ c++11 std::wstring summary provider std::__cxx11::basic_string<wchar_t, std::char_traits<wchar_t>, std::allocator<wchar_t> >: (hide value) libstdc++ c++11 std::wstring summary provider char8_t *: (skip pointers) char8_t * summary provider char16_t *: (skip pointers) char16_t * summary provider char32_t *: (skip pointers) char32_t * summary provider wchar_t *: (skip pointers) wchar_t * summary provider unichar *: (skip pointers) unichar * summary provider char8_t: (hide value) (skip pointers) (hide member names) char8_t summary provider char16_t: (hide value) (skip pointers) (hide member names) char16_t summary provider char32_t: (hide value) (skip pointers) (hide member names) char32_t summary provider wchar_t: (hide value) (skip pointers) (hide member names) wchar_t summary provider unichar: (hide value) (skip pointers) (hide member names) unichar summary provider ^std::vector<.+>(( )?&)?$: `size=${svar%#}` (show children) (hide value) (skip pointers) ^std::map<.+> >(( )?&)?$: `size=${svar%#}` (show children) (hide value) (skip pointers) ^std::(__cxx11::)?list<.+>(( )?&)?$: `size=${svar%#}` (show children) (hide value) (skip pointers) ^std::unique_ptr<.+>(( )?&)?$: (show children) (hide value) (skip pointers) libstdc++ std::unique_ptr summary provider ^std::shared_ptr<.+>(( )?&)?$: (show children) (hide value) (skip pointers) libstdc++ std::shared_ptr summary provider ^std::weak_ptr<.+>(( )?&)?$: (show children) (hide value) (skip pointers) libstdc++ std::weak_ptr summary provider ^std::__[[:alnum:]]+::string$: (hide value) std::string summary provider ^std::__[[:alnum:]]+::basic_string<char, std::__[[:alnum:]]+::char_traits<char>, std::__[[:alnum:]]+::allocator<char> >$: (hide value) std::string summary provider ^std::__[[:alnum:]]+::basic_string<unsigned char, std::__[[:alnum:]]+::char_traits<unsigned char>, std::__[[:alnum:]]+::allocator<unsigned char> >$: (hide value) std::string summary provider ^std::__[[:alnum:]]+::basic_string<char16_t, std::__[[:alnum:]]+::char_traits<char16_t>, std::__[[:alnum:]]+::allocator<char16_t> >$: (hide value) std::u16string summary provider ^std::__[[:alnum:]]+::basic_string<char32_t, std::__[[:alnum:]]+::char_traits<char32_t>, std::__[[:alnum:]]+::allocator<char32_t> >$: (hide value) std::u32string summary provider ^std::__[[:alnum:]]+::wstring$: (hide value) std::wstring summary provider ^std::__[[:alnum:]]+::basic_string<wchar_t, std::__[[:alnum:]]+::char_traits<wchar_t>, std::__[[:alnum:]]+::allocator<wchar_t> >$: (hide value) std::wstring summary provider ^std::__[[:alnum:]]+::function<.+>$: (hide value) libc++ std::function summary provider ^std::__[[:alnum:]]+::bitset<.+>(( )?&)?$: (show children) (hide value) libc++ std::bitset summary provider ^std::__[[:alnum:]]+::vector<.+>(( )?&)?$: (show children) (hide value) libc++ std::vector summary provider ^std::__[[:alnum:]]+::forward_list<.+>(( )?&)?$: (show children) (hide value) libc++ std::list summary provider ^std::__([A-Zabd-z0-9]|cx?[A-Za-wyz0-9]|cxx1?[A-Za-z02-9]|cxx11[[:alnum:]])[[:alnum:]]*::list<.+>(( )?&)?$: (show children) (hide value) libc++ std::list summary provider ^std::__[[:alnum:]]+::map<.+>(( )?&)?$: (show children) (hide value) libc++ std::map summary provider ^std::__[[:alnum:]]+::deque<.+>(( )?&)?$: (show children) (hide value) libc++ std::deque summary provider ^std::__[[:alnum:]]+::queue<.+>(( )?&)?$: (show children) (hide value) libc++ std::queue summary provider ^std::__[[:alnum:]]+::set<.+>(( )?&)?$: (show children) (hide value) libc++ std::set summary provider ^std::__[[:alnum:]]+::multiset<.+>(( )?&)?$: (show children) (hide value) libc++ std::multiset summary provider ^std::__[[:alnum:]]+::multimap<.+>(( )?&)?$: (show children) (hide value) libc++ std::multimap summary provider ^(std::__[[:alnum:]]+::)unordered_(multi)?(map|set)<.+> >$: (show children) (hide value) libc++ std::unordered containers summary provider ^std::__[[:alnum:]]+::tuple<.*>(( )?&)?$: (show children) (hide value) libc++ std::tuple summary provider ^std::__[[:alnum:]]+::atomic<.+>$: (show children) (hide value) libc++ std::atomic summary provider ^std::__[[:alnum:]]+::optional<.+>(( )?&)?$: (show children) (hide value) libc++ std::optional summary provider ^std::__[[:alnum:]]+::variant<.+>(( )?&)?$: (show children) (hide value) libc++ std::variant summary provider ^std::__[[:alnum:]]+::shared_ptr<.+>(( )?&)?$: (show children) (hide value) (skip pointers) libc++ std::shared_ptr summary provider ^std::__[[:alnum:]]+::weak_ptr<.+>(( )?&)?$: (show children) (hide value) (skip pointers) libc++ std::weak_ptr summary provider ^std::__[[:alnum:]]+::unique_ptr<.+>(( )?&)?$: (show children) (hide value) (skip pointers) libc++ std::unique_ptr summary provider char8_t \[[0-9]+\]: (hide value) (skip pointers) char8_t [] summary provider char16_t \[[0-9]+\]: (hide value) (skip pointers) char16_t [] summary provider char32_t \[[0-9]+\]: (hide value) (skip pointers) char32_t [] summary provider wchar_t \[[0-9]+\]: (hide value) (skip pointers) wchar_t * summary provider ----------------------- Category: objc (disabled) ----------------------- CMTime: (show children) CMTime summary provider BOOL: (not cascading) (hide value) (skip pointers) (skip references) BOOL &: (not cascading) (hide value) (skip pointers) (skip references) BOOL *: (not cascading) (hide value) (skip pointers) (skip references) SEL: (not cascading) (hide value) (skip pointers) (skip references) SEL summary provider objc_selector: (not cascading) (hide value) (skip pointers) (skip references) SEL summary provider objc_selector *: (not cascading) (hide value) (skip pointers) (skip references) SEL summary provider SEL *: (not cascading) (hide value) (skip pointers) (skip references) SEL summary provider Class: (not cascading) (hide value) (skip pointers) (skip references) Class summary provider __block_literal_generic: `${var.__FuncPtr%A}` (hide value) CFGregorianUnits: `${var.years} years, ${var.months} months, ${var.days} days, ${var.hours} hours, ${var.minutes} minutes ${var.seconds} seconds` (hide value) CFRange: `location=${var.location} length=${var.length}` (hide value) NSRange: `location=${var.location}, length=${var.length}` (hide value) NSRectArray: `(${var.origin}, ${var.size}), ...` (hide value) NSPoint: `` (hide value) (one-line printout) NSSize: `` (hide value) (one-line printout) NSRect: `` (hide value) (one-line printout) CGSize: `` (hide value) (one-line printout) CGPoint: `` (hide value) (one-line printout) CGRect: `` (hide value) (one-line printout) RGBColor: `red=${var.red} green=${var.green} blue=${var.blue}` (hide value) Rect: `(t=${var.top}, l=${var.left}, b=${var.bottom}, r=${var.right})` (hide value) Point: `{(v=${var.v}, h=${var.h})}` (hide value) DateTimeRect *: `${var.month}/${var.day}/${var.year} ${var.hour} :${var.minute} :${var.second} dayOfWeek:${var.dayOfWeek}` (hide value) LongDateRect: `${var.ld.month}/${var.ld.day}/${var.ld.year} ${var.ld.hour} :${var.ld.minute} :${var.ld.second} dayOfWeek:${var.ld.dayOfWeek}` (hide value) HIPoint: `(x=${var.x}, y=${var.y})` (hide value) HIRect: `origin=${var.origin} size=${var.size}` (hide value) NSArray: (show children) NSArray summary provider NSMutableArray: (show children) NSArray summary provider __NSArrayI: (show children) NSArray summary provider __NSArray0: (show children) NSArray summary provider __NSSingleObjectArrayI: (show children) NSArray summary provider __NSArrayM: (show children) NSArray summary provider __NSCFArray: (show children) NSArray summary provider _NSCallStackArray: (show children) NSArray summary provider CFArrayRef: (show children) NSArray summary provider CFMutableArrayRef: (show children) NSArray summary provider NSDictionary: (show children) NSDictionary summary provider NSMutableDictionary: (show children) NSDictionary summary provider __NSCFDictionary: (show children) NSDictionary summary provider __NSDictionaryI: (show children) NSDictionary summary provider __NSSingleEntryDictionaryI: (show children) NSDictionary summary provider __NSDictionaryM: (show children) NSDictionary summary provider CFDictionaryRef: (show children) NSDictionary summary provider __CFDictionary: (show children) NSDictionary summary provider CFMutableDictionaryRef: (show children) NSDictionary summary provider NSSet: (show children) NSSet summary CFSetRef: (show children) CFSetRef summary CFMutableSetRef: (show children) CFMutableSetRef summary __NSCFSet: (show children) __NSCFSet summary __CFSet: (show children) __CFSet summary __NSSetI: (show children) __NSSetI summary __NSSetM: (show children) __NSSetM summary NSCountedSet: (show children) NSCountedSet summary NSMutableSet: (show children) NSMutableSet summary NSOrderedSet: (show children) NSOrderedSet summary __NSOrderedSetI: (show children) __NSOrderedSetI summary __NSOrderedSetM: (show children) __NSOrderedSetM summary NSError: (show children) NSError summary provider NSException: (show children) NSException summary provider CFBagRef: CFBag summary provider __CFBag: CFBag summary provider const struct __CFBag: CFBag summary provider CFMutableBagRef: CFBag summary provider CFBinaryHeapRef: CFBinaryHeap summary provider __CFBinaryHeap: CFBinaryHeap summary provider NSString: NSString summary provider CFStringRef: NSString summary provider __CFString: NSString summary provider CFMutableStringRef: NSString summary provider NSMutableString: NSString summary provider __NSCFConstantString: NSString summary provider __NSCFString: NSString summary provider NSCFConstantString: NSString summary provider NSCFString: NSString summary provider NSPathStore2: NSString summary provider NSTaggedPointerString: NSString summary provider NSAttributedString: NSAttributedString summary provider NSMutableAttributedString: NSMutableAttributedString summary provider NSConcreteMutableAttributedString: NSMutableAttributedString summary provider NSBundle: NSBundle summary provider NSData: NSData summary provider _NSInlineData: NSData summary provider NSConcreteData: NSData summary provider NSConcreteMutableData: NSData summary provider NSMutableData: NSData summary provider __NSCFData: NSData summary provider CFDataRef: NSData summary provider CFMutableDataRef: NSData summary provider NSMachPort: NSMachPort summary provider NSNotification: NSNotification summary provider NSConcreteNotification: NSNotification summary provider NSNumber: NSNumber summary provider CFNumberRef: CFNumberRef summary provider __NSCFBoolean: NSNumber summary provider __NSCFNumber: NSNumber summary provider NSCFBoolean: NSNumber summary provider NSCFNumber: NSNumber summary provider NSDecimalNumber: NSDecimalNumber summary provider NSURL: NSURL summary provider CFURLRef: NSURL summary provider NSDate: NSDate summary provider __NSDate: NSDate summary provider __NSTaggedDate: NSDate summary provider NSCalendarDate: NSDate summary provider NSTimeZone: NSTimeZone summary provider CFTimeZoneRef: NSTimeZone summary provider __NSTimeZone: NSTimeZone summary provider CFAbsoluteTime: (hide value) CFAbsoluteTime summary provider NSIndexSet: NSIndexSet summary provider NSMutableIndexSet: NSIndexSet summary provider CFGregorianDate: `@"${var.month%d}/${var.day%d}/${var.year%d} ${var.hour%d}:${var.minute%d}:${var.second}"` CFBitVectorRef: CFBitVector summary provider CFMutableBitVectorRef: CFBitVector summary provider __CFBitVector: CFBitVector summary provider __CFMutableBitVector: CFBitVector summary provider

Hide Details

Expecting sub string: "Category: system (disabled)" (was found)

Hide Details

runCmd: type category list output: Category: VectorTypes (disabled, applicable for language(s): objective-c++) Category: cplusplus (disabled) Category: default (disabled) Category: objc (disabled) Category: system (disabled, applicable for language(s): objective-c++) Category: cplusplus (disabled) Category: objc (disabled)

Hide Details

Hide Details

Ran command: "type category list"

Hide Details

Got output: Category: VectorTypes (disabled, applicable for language(s): objective-c++) Category: cplusplus (disabled) Category: default (disabled) Category: objc (disabled) Category: system (disabled, applicable for language(s): objective-c++) Category: cplusplus (disabled) Category: objc (disabled)

Hide Details

Expecting sub string: "system" (was found) Expecting sub string: "disabled" (was found)

Hide Details

runCmd: type category enable * output:

Hide Details

runCmd: type category list output: Category: default (enabled) Category: objc (enabled) Category: system (enabled, applicable for language(s): objective-c++) Category: VectorTypes (disabled, applicable for language(s): objective-c++) Category: cplusplus (enabled) Category: objc (enabled)

Hide Details

Hide Details

Ran command: "type category list"

Hide Details

Got output: Category: default (enabled) Category: objc (enabled) Category: system (enabled, applicable for language(s): objective-c++) Category: VectorTypes (disabled, applicable for language(s): objective-c++) Category: cplusplus (enabled) Category: objc (enabled)

Hide Details

Expecting sub string: "system" (was found) Expecting sub string: "enabled" (was found)

Hide Details

runCmd: frame variable numbers output: (std::vector<int, std::allocator<int> >) numbers = size=6 { [0] = 1 [1] = 12 [2] = 123 [3] = 1234 [4] = 12345 [5] = 123456 }

Hide Details

Hide Details

Ran command: "frame variable numbers"

Hide Details

Got output: (std::vector<int, std::allocator<int> >) numbers = size=6 { [0] = 1 [1] = 12 [2] = 123 [3] = 1234 [4] = 12345 [5] = 123456 }

Hide Details

Expecting sub string: "[0] = 1" (was found) Expecting sub string: "[3] = 1234" (was found)

Hide Details

runCmd: frame variable string1 output: (const char *) string1 = 0x0000000100002eb8 "hello world"

Hide Details

Hide Details

Ran command: "frame variable string1"

Hide Details

Got output: (const char *) string1 = 0x0000000100002eb8 "hello world"

Hide Details

Expecting sub string: "hello world" (was found)

Hide Details

runCmd: type category list output: Category: default (enabled) Category: objc (enabled) Category: system (enabled, applicable for language(s): objective-c++) Category: VectorTypes (disabled, applicable for language(s): objective-c++) Category: cplusplus (enabled) Category: objc (enabled)

Hide Details

Hide Details

Ran command: "type category list"

Hide Details

Got output: Category: default (enabled) Category: objc (enabled) Category: system (enabled, applicable for language(s): objective-c++) Category: VectorTypes (disabled, applicable for language(s): objective-c++) Category: cplusplus (enabled) Category: objc (enabled)

Hide Details

Expecting sub string: "system" (was found) Expecting sub string: "enabled" (was found)

Hide Details

runCmd: type category disable * output:

Hide Details

runCmd: type category list output: Category: VectorTypes (disabled, applicable for language(s): objective-c++) Category: cplusplus (disabled) Category: default (disabled) Category: objc (disabled) Category: system (disabled, applicable for language(s): objective-c++) Category: cplusplus (disabled) Category: objc (disabled)

Hide Details

Hide Details

Ran command: "type category list"

Hide Details

Got output: Category: VectorTypes (disabled, applicable for language(s): objective-c++) Category: cplusplus (disabled) Category: default (disabled) Category: objc (disabled) Category: system (disabled, applicable for language(s): objective-c++) Category: cplusplus (disabled) Category: objc (disabled)

Hide Details

Expecting sub string: "system" (was found) Expecting sub string: "disabled" (was found)

Hide Details

<bound method SBProcess.Kill of <lldb.SBProcess; proxy of <Swig Object of type 'lldb::SBProcess *' at 0x1087367b0> >>: success

Hide Details

Executing tearDown hook: def cleanup(): self.runCmd('type category enable *', check=False)

Hide Details

Hide Details

runCmd: type category enable * check of return status not required output:

Hide Details

PASS: LLDB (/Users/buildslave/jenkins/workspace/lldb-cmake/lldb-build/bin/clang-x86_64) :: test_with_run_command_dsym (TestDataFormatterDisabling.DataFormatterDisablingTestCase) runCmd: settings clear -all output:

Hide Details

runCmd: settings set symbols.enable-external-lookup false output:

Hide Details

runCmd: settings set target.inherit-tcc true output:

Hide Details

runCmd: settings set target.auto-apply-fixits false output:

Hide Details

runCmd: settings set plugin.process.gdb-remote.packet-timeout 60 output:

Hide Details

runCmd: settings set symbols.clang-modules-cache-path "/Users/buildslave/jenkins/workspace/lldb-cmake/lldb-build/lldb-test-build.noindex/module-cache-lldb/lldb-api" output:

Hide Details

runCmd: settings set use-color false output:

Hide Details

runCmd: setting set target.prefer-dynamic-value no-dynamic-values output:

Hide Details

runCmd: file /Users/buildslave/jenkins/workspace/lldb-cmake/lldb-build/lldb-test-build.noindex/functionalities/data-formatter/data-formatter-disabling/TestDataFormatterDisabling.test_with_run_command_dwarf/a.out output: Current executable set to '/Users/buildslave/jenkins/workspace/lldb-cmake/lldb-build/lldb-test-build.noindex/functionalities/data-formatter/data-formatter-disabling/TestDataFormatterDisabling.test_with_run_command_dwarf/a.out' (x86_64).

Hide Details

Hide Details

runCmd: breakpoint set -f "main.cpp" -l 15 output: Breakpoint 1: where = a.out`main + 192 at main.cpp:15:23, address = 0x00000001000015b0

Hide Details

Hide Details

Expecting pattern: ^Breakpoint (?P<bpno>[0-9]+): (?P<num_locations>[0-9]+) locations\.$ Not matched

Hide Details

Expecting pattern: ^Breakpoint (?P<bpno>[0-9]+): (?P<num_locations>no) locations \(pending\)\. Not matched

Hide Details

Expecting pattern: ^Breakpoint (?P<bpno>[0-9]+): where = (?P<module>.*)`(?P<symbol>[+\-]{0,1}[^+]+)( \+ (?P<offset>[0-9]+)){0,1}( \[inlined\] (?P<inline_symbol>.*)){0,1} at (?P<file>[^:]+):(?P<line_no>[0-9]+)(?P<column>(:[0-9]+)?), address = (?P<address>0x[0-9a-fA-F]+)$ Matched

Hide Details

runCmd: run output: Process 44075 stopped * thread #1, queue = 'com.apple.main-thread', stop reason = breakpoint 1.1 frame #0: 0x00000001000015b0 a.out`main at main.cpp:15:23 12 numbers.push_back(1234); 13 numbers.push_back(12345); 14 numbers.push_back(123456); -> 15 numbers.push_back(1234567); // Set break point at this line. ^ 16 17 return 0; 18 }

Hide Details

Process 44075 launched: '/Users/buildslave/jenkins/workspace/lldb-cmake/lldb-build/lldb-test-build.noindex/functionalities/data-formatter/data-formatter-disabling/TestDataFormatterDisabling.test_with_run_command_dwarf/a.out' (x86_64)

Hide Details

Hide Details

runCmd: thread list output: Process 44075 stopped * thread #1: tid = 0x2a4326, 0x00000001000015b0 a.out`main at main.cpp:15:23, queue = 'com.apple.main-thread', stop reason = breakpoint 1.1

Hide Details

Hide Details

Ran command: "thread list"

Hide Details

Got output: Process 44075 stopped * thread #1: tid = 0x2a4326, 0x00000001000015b0 a.out`main at main.cpp:15:23, queue = 'com.apple.main-thread', stop reason = breakpoint 1.1

Hide Details

Expecting sub string: "stopped" (was found) Expecting sub string: "stop reason = breakpoint" (was found)

Hide Details

Adding tearDown hook: def cleanup(): self.runCmd('type category enable *', check=False)

Hide Details

Hide Details

runCmd: type category list output: Category: default (enabled) Category: objc (enabled) Category: system (enabled, applicable for language(s): objective-c++) Category: VectorTypes (disabled, applicable for language(s): objective-c++) Category: cplusplus (enabled) Category: objc (enabled)

Hide Details

Hide Details

Ran command: "type category list"

Hide Details

Got output: Category: default (enabled) Category: objc (enabled) Category: system (enabled, applicable for language(s): objective-c++) Category: VectorTypes (disabled, applicable for language(s): objective-c++) Category: cplusplus (enabled) Category: objc (enabled)

Hide Details

Expecting sub string: "system" (was found) Expecting sub string: "enabled" (was found)

Hide Details

runCmd: frame variable numbers output: (std::vector<int, std::allocator<int> >) numbers = size=6 { [0] = 1 [1] = 12 [2] = 123 [3] = 1234 [4] = 12345 [5] = 123456 }

Hide Details

Hide Details

Ran command: "frame variable numbers"

Hide Details

Got output: (std::vector<int, std::allocator<int> >) numbers = size=6 { [0] = 1 [1] = 12 [2] = 123 [3] = 1234 [4] = 12345 [5] = 123456 }

Hide Details

Expecting sub string: "[0] = 1" (was found) Expecting sub string: "[3] = 1234" (was found)

Hide Details

runCmd: frame variable string1 output: (const char *) string1 = 0x0000000100002eb8 "hello world"

Hide Details

Hide Details

Ran command: "frame variable string1"

Hide Details

Got output: (const char *) string1 = 0x0000000100002eb8 "hello world"

Hide Details

Expecting sub string: "hello world" (was found)

Hide Details

runCmd: type category disable * output:

Hide Details

runCmd: frame variable numbers output: (std::vector<int, std::allocator<int> >) numbers = { std::__1::__vector_base<int, std::__1::allocator<int> > = { __begin_ = 0x00000001003040e0 __end_ = 0x00000001003040f8 __end_cap_ = { std::__1::__compressed_pair_elem<int *, 0, false> = { __value_ = 0x0000000100304100 } } } }

Hide Details

Hide Details

Ran command: "frame variable numbers"

Hide Details

Got output: (std::vector<int, std::allocator<int> >) numbers = { std::__1::__vector_base<int, std::__1::allocator<int> > = { __begin_ = 0x00000001003040e0 __end_ = 0x00000001003040f8 __end_cap_ = { std::__1::__compressed_pair_elem<int *, 0, false> = { __value_ = 0x0000000100304100 } } } }

Hide Details

Not expecting sub string: "[0] = 1" (was not found) Not expecting sub string: "[3] = 1234" (was not found)

Hide Details

runCmd: frame variable string1 output: (const char *) string1 = 0x0000000100002eb8

Hide Details

Hide Details

Ran command: "frame variable string1"

Hide Details

Got output: (const char *) string1 = 0x0000000100002eb8

Hide Details

Not expecting sub string: "hello world" (was not found)

Hide Details

runCmd: type summary list output: ----------------------- Category: VectorTypes (disabled) ----------------------- builtin_type_vec128: `${var.uint128}` (one-line printout) (skip pointers) (hide member names) float [4]: `` (one-line printout) (skip pointers) (hide member names) int32_t [4]: `` (one-line printout) (skip pointers) (hide member names) int16_t [8]: `` (one-line printout) (skip pointers) (hide member names) vDouble: `` (one-line printout) (skip pointers) (hide member names) vFloat: `` (one-line printout) (skip pointers) (hide member names) vSInt8: `` (one-line printout) (skip pointers) (hide member names) vSInt16: `` (one-line printout) (skip pointers) (hide member names) vSInt32: `` (one-line printout) (skip pointers) (hide member names) vUInt8: `` (one-line printout) (skip pointers) (hide member names) vUInt16: `` (one-line printout) (skip pointers) (hide member names) vUInt32: `` (one-line printout) (skip pointers) (hide member names) vBool32: `` (one-line printout) (skip pointers) (hide member names) ----------------------- Category: cplusplus (disabled) ----------------------- std::string: `${var._M_dataplus._M_p}` (hide value) std::basic_string<char>: `${var._M_dataplus._M_p}` (hide value) std::basic_string<char,std::char_traits<char>,std::allocator<char> >: `${var._M_dataplus._M_p}` (hide value) std::basic_string<char, std::char_traits<char>, std::allocator<char> >: `${var._M_dataplus._M_p}` (hide value) std::__cxx11::string: (hide value) libstdc++ c++11 std::string summary provider std::__cxx11::basic_string<char, std::char_traits<char>, std::allocator<char> >: (hide value) libstdc++ c++11 std::string summary provider std::__cxx11::basic_string<unsigned char, std::char_traits<unsigned char>, std::allocator<unsigned char> >: (hide value) libstdc++ c++11 std::string summary provider std::wstring: `${var._M_dataplus._M_p%S}` (hide value) std::basic_string<wchar_t>: `${var._M_dataplus._M_p%S}` (hide value) std::basic_string<wchar_t,std::char_traits<wchar_t>,std::allocator<wchar_t> >: `${var._M_dataplus._M_p%S}` (hide value) std::basic_string<wchar_t, std::char_traits<wchar_t>, std::allocator<wchar_t> >: `${var._M_dataplus._M_p%S}` (hide value) std::__cxx11::wstring: (hide value) libstdc++ c++11 std::wstring summary provider std::__cxx11::basic_string<wchar_t, std::char_traits<wchar_t>, std::allocator<wchar_t> >: (hide value) libstdc++ c++11 std::wstring summary provider char8_t *: (skip pointers) char8_t * summary provider char16_t *: (skip pointers) char16_t * summary provider char32_t *: (skip pointers) char32_t * summary provider wchar_t *: (skip pointers) wchar_t * summary provider unichar *: (skip pointers) unichar * summary provider char8_t: (hide value) (skip pointers) (hide member names) char8_t summary provider char16_t: (hide value) (skip pointers) (hide member names) char16_t summary provider char32_t: (hide value) (skip pointers) (hide member names) char32_t summary provider wchar_t: (hide value) (skip pointers) (hide member names) wchar_t summary provider unichar: (hide value) (skip pointers) (hide member names) unichar summary provider ^std::vector<.+>(( )?&)?$: `size=${svar%#}` (show children) (hide value) (skip pointers) ^std::map<.+> >(( )?&)?$: `size=${svar%#}` (show children) (hide value) (skip pointers) ^std::(__cxx11::)?list<.+>(( )?&)?$: `size=${svar%#}` (show children) (hide value) (skip pointers) ^std::unique_ptr<.+>(( )?&)?$: (show children) (hide value) (skip pointers) libstdc++ std::unique_ptr summary provider ^std::shared_ptr<.+>(( )?&)?$: (show children) (hide value) (skip pointers) libstdc++ std::shared_ptr summary provider ^std::weak_ptr<.+>(( )?&)?$: (show children) (hide value) (skip pointers) libstdc++ std::weak_ptr summary provider ^std::__[[:alnum:]]+::string$: (hide value) std::string summary provider ^std::__[[:alnum:]]+::basic_string<char, std::__[[:alnum:]]+::char_traits<char>, std::__[[:alnum:]]+::allocator<char> >$: (hide value) std::string summary provider ^std::__[[:alnum:]]+::basic_string<unsigned char, std::__[[:alnum:]]+::char_traits<unsigned char>, std::__[[:alnum:]]+::allocator<unsigned char> >$: (hide value) std::string summary provider ^std::__[[:alnum:]]+::basic_string<char16_t, std::__[[:alnum:]]+::char_traits<char16_t>, std::__[[:alnum:]]+::allocator<char16_t> >$: (hide value) std::u16string summary provider ^std::__[[:alnum:]]+::basic_string<char32_t, std::__[[:alnum:]]+::char_traits<char32_t>, std::__[[:alnum:]]+::allocator<char32_t> >$: (hide value) std::u32string summary provider ^std::__[[:alnum:]]+::wstring$: (hide value) std::wstring summary provider ^std::__[[:alnum:]]+::basic_string<wchar_t, std::__[[:alnum:]]+::char_traits<wchar_t>, std::__[[:alnum:]]+::allocator<wchar_t> >$: (hide value) std::wstring summary provider ^std::__[[:alnum:]]+::function<.+>$: (hide value) libc++ std::function summary provider ^std::__[[:alnum:]]+::bitset<.+>(( )?&)?$: (show children) (hide value) libc++ std::bitset summary provider ^std::__[[:alnum:]]+::vector<.+>(( )?&)?$: (show children) (hide value) libc++ std::vector summary provider ^std::__[[:alnum:]]+::forward_list<.+>(( )?&)?$: (show children) (hide value) libc++ std::list summary provider ^std::__([A-Zabd-z0-9]|cx?[A-Za-wyz0-9]|cxx1?[A-Za-z02-9]|cxx11[[:alnum:]])[[:alnum:]]*::list<.+>(( )?&)?$: (show children) (hide value) libc++ std::list summary provider ^std::__[[:alnum:]]+::map<.+>(( )?&)?$: (show children) (hide value) libc++ std::map summary provider ^std::__[[:alnum:]]+::deque<.+>(( )?&)?$: (show children) (hide value) libc++ std::deque summary provider ^std::__[[:alnum:]]+::queue<.+>(( )?&)?$: (show children) (hide value) libc++ std::queue summary provider ^std::__[[:alnum:]]+::set<.+>(( )?&)?$: (show children) (hide value) libc++ std::set summary provider ^std::__[[:alnum:]]+::multiset<.+>(( )?&)?$: (show children) (hide value) libc++ std::multiset summary provider ^std::__[[:alnum:]]+::multimap<.+>(( )?&)?$: (show children) (hide value) libc++ std::multimap summary provider ^(std::__[[:alnum:]]+::)unordered_(multi)?(map|set)<.+> >$: (show children) (hide value) libc++ std::unordered containers summary provider ^std::__[[:alnum:]]+::tuple<.*>(( )?&)?$: (show children) (hide value) libc++ std::tuple summary provider ^std::__[[:alnum:]]+::atomic<.+>$: (show children) (hide value) libc++ std::atomic summary provider ^std::__[[:alnum:]]+::optional<.+>(( )?&)?$: (show children) (hide value) libc++ std::optional summary provider ^std::__[[:alnum:]]+::variant<.+>(( )?&)?$: (show children) (hide value) libc++ std::variant summary provider ^std::__[[:alnum:]]+::shared_ptr<.+>(( )?&)?$: (show children) (hide value) (skip pointers) libc++ std::shared_ptr summary provider ^std::__[[:alnum:]]+::weak_ptr<.+>(( )?&)?$: (show children) (hide value) (skip pointers) libc++ std::weak_ptr summary provider ^std::__[[:alnum:]]+::unique_ptr<.+>(( )?&)?$: (show children) (hide value) (skip pointers) libc++ std::unique_ptr summary provider char8_t \[[0-9]+\]: (hide value) (skip pointers) char8_t [] summary provider char16_t \[[0-9]+\]: (hide value) (skip pointers) char16_t [] summary provider char32_t \[[0-9]+\]: (hide value) (skip pointers) char32_t [] summary provider wchar_t \[[0-9]+\]: (hide value) (skip pointers) wchar_t * summary provider ----------------------- Category: default (disabled) ----------------------- ----------------------- Category: objc (disabled) ----------------------- CMTime: (show children) CMTime summary provider BOOL: (not cascading) (hide value) (skip pointers) (skip references) BOOL &: (not cascading) (hide value) (skip pointers) (skip references) BOOL *: (not cascading) (hide value) (skip pointers) (skip references) SEL: (not cascading) (hide value) (skip pointers) (skip references) SEL summary provider objc_selector: (not cascading) (hide value) (skip pointers) (skip references) SEL summary provider objc_selector *: (not cascading) (hide value) (skip pointers) (skip references) SEL summary provider SEL *: (not cascading) (hide value) (skip pointers) (skip references) SEL summary provider Class: (not cascading) (hide value) (skip pointers) (skip references) Class summary provider __block_literal_generic: `${var.__FuncPtr%A}` (hide value) CFGregorianUnits: `${var.years} years, ${var.months} months, ${var.days} days, ${var.hours} hours, ${var.minutes} minutes ${var.seconds} seconds` (hide value) CFRange: `location=${var.location} length=${var.length}` (hide value) NSRange: `location=${var.location}, length=${var.length}` (hide value) NSRectArray: `(${var.origin}, ${var.size}), ...` (hide value) NSPoint: `` (hide value) (one-line printout) NSSize: `` (hide value) (one-line printout) NSRect: `` (hide value) (one-line printout) CGSize: `` (hide value) (one-line printout) CGPoint: `` (hide value) (one-line printout) CGRect: `` (hide value) (one-line printout) RGBColor: `red=${var.red} green=${var.green} blue=${var.blue}` (hide value) Rect: `(t=${var.top}, l=${var.left}, b=${var.bottom}, r=${var.right})` (hide value) Point: `{(v=${var.v}, h=${var.h})}` (hide value) DateTimeRect *: `${var.month}/${var.day}/${var.year} ${var.hour} :${var.minute} :${var.second} dayOfWeek:${var.dayOfWeek}` (hide value) LongDateRect: `${var.ld.month}/${var.ld.day}/${var.ld.year} ${var.ld.hour} :${var.ld.minute} :${var.ld.second} dayOfWeek:${var.ld.dayOfWeek}` (hide value) HIPoint: `(x=${var.x}, y=${var.y})` (hide value) HIRect: `origin=${var.origin} size=${var.size}` (hide value) NSArray: (show children) NSArray summary provider NSMutableArray: (show children) NSArray summary provider __NSArrayI: (show children) NSArray summary provider __NSArray0: (show children) NSArray summary provider __NSSingleObjectArrayI: (show children) NSArray summary provider __NSArrayM: (show children) NSArray summary provider __NSCFArray: (show children) NSArray summary provider _NSCallStackArray: (show children) NSArray summary provider CFArrayRef: (show children) NSArray summary provider CFMutableArrayRef: (show children) NSArray summary provider NSDictionary: (show children) NSDictionary summary provider NSMutableDictionary: (show children) NSDictionary summary provider __NSCFDictionary: (show children) NSDictionary summary provider __NSDictionaryI: (show children) NSDictionary summary provider __NSSingleEntryDictionaryI: (show children) NSDictionary summary provider __NSDictionaryM: (show children) NSDictionary summary provider CFDictionaryRef: (show children) NSDictionary summary provider __CFDictionary: (show children) NSDictionary summary provider CFMutableDictionaryRef: (show children) NSDictionary summary provider NSSet: (show children) NSSet summary CFSetRef: (show children) CFSetRef summary CFMutableSetRef: (show children) CFMutableSetRef summary __NSCFSet: (show children) __NSCFSet summary __CFSet: (show children) __CFSet summary __NSSetI: (show children) __NSSetI summary __NSSetM: (show children) __NSSetM summary NSCountedSet: (show children) NSCountedSet summary NSMutableSet: (show children) NSMutableSet summary NSOrderedSet: (show children) NSOrderedSet summary __NSOrderedSetI: (show children) __NSOrderedSetI summary __NSOrderedSetM: (show children) __NSOrderedSetM summary NSError: (show children) NSError summary provider NSException: (show children) NSException summary provider CFBagRef: CFBag summary provider __CFBag: CFBag summary provider const struct __CFBag: CFBag summary provider CFMutableBagRef: CFBag summary provider CFBinaryHeapRef: CFBinaryHeap summary provider __CFBinaryHeap: CFBinaryHeap summary provider NSString: NSString summary provider CFStringRef: NSString summary provider __CFString: NSString summary provider CFMutableStringRef: NSString summary provider NSMutableString: NSString summary provider __NSCFConstantString: NSString summary provider __NSCFString: NSString summary provider NSCFConstantString: NSString summary provider NSCFString: NSString summary provider NSPathStore2: NSString summary provider NSTaggedPointerString: NSString summary provider NSAttributedString: NSAttributedString summary provider NSMutableAttributedString: NSMutableAttributedString summary provider NSConcreteMutableAttributedString: NSMutableAttributedString summary provider NSBundle: NSBundle summary provider NSData: NSData summary provider _NSInlineData: NSData summary provider NSConcreteData: NSData summary provider NSConcreteMutableData: NSData summary provider NSMutableData: NSData summary provider __NSCFData: NSData summary provider CFDataRef: NSData summary provider CFMutableDataRef: NSData summary provider NSMachPort: NSMachPort summary provider NSNotification: NSNotification summary provider NSConcreteNotification: NSNotification summary provider NSNumber: NSNumber summary provider CFNumberRef: CFNumberRef summary provider __NSCFBoolean: NSNumber summary provider __NSCFNumber: NSNumber summary provider NSCFBoolean: NSNumber summary provider NSCFNumber: NSNumber summary provider NSDecimalNumber: NSDecimalNumber summary provider NSURL: NSURL summary provider CFURLRef: NSURL summary provider NSDate: NSDate summary provider __NSDate: NSDate summary provider __NSTaggedDate: NSDate summary provider NSCalendarDate: NSDate summary provider NSTimeZone: NSTimeZone summary provider CFTimeZoneRef: NSTimeZone summary provider __NSTimeZone: NSTimeZone summary provider CFAbsoluteTime: (hide value) CFAbsoluteTime summary provider NSIndexSet: NSIndexSet summary provider NSMutableIndexSet: NSIndexSet summary provider CFGregorianDate: `@"${var.month%d}/${var.day%d}/${var.year%d} ${var.hour%d}:${var.minute%d}:${var.second}"` CFBitVectorRef: CFBitVector summary provider CFMutableBitVectorRef: CFBitVector summary provider __CFBitVector: CFBitVector summary provider __CFMutableBitVector: CFBitVector summary provider ----------------------- Category: system (disabled) ----------------------- char *: `${var%s}` (skip pointers) unsigned char *: `${var%s}` (skip pointers) OSType: `${var%O}` (not cascading) (skip pointers) (skip references) char \[[0-9]+\]: `${var%s}` (hide value) (skip pointers) ----------------------- Category: cplusplus (disabled) ----------------------- std::string: `${var._M_dataplus._M_p}` (hide value) std::basic_string<char>: `${var._M_dataplus._M_p}` (hide value) std::basic_string<char,std::char_traits<char>,std::allocator<char> >: `${var._M_dataplus._M_p}` (hide value) std::basic_string<char, std::char_traits<char>, std::allocator<char> >: `${var._M_dataplus._M_p}` (hide value) std::__cxx11::string: (hide value) libstdc++ c++11 std::string summary provider std::__cxx11::basic_string<char, std::char_traits<char>, std::allocator<char> >: (hide value) libstdc++ c++11 std::string summary provider std::__cxx11::basic_string<unsigned char, std::char_traits<unsigned char>, std::allocator<unsigned char> >: (hide value) libstdc++ c++11 std::string summary provider std::wstring: `${var._M_dataplus._M_p%S}` (hide value) std::basic_string<wchar_t>: `${var._M_dataplus._M_p%S}` (hide value) std::basic_string<wchar_t,std::char_traits<wchar_t>,std::allocator<wchar_t> >: `${var._M_dataplus._M_p%S}` (hide value) std::basic_string<wchar_t, std::char_traits<wchar_t>, std::allocator<wchar_t> >: `${var._M_dataplus._M_p%S}` (hide value) std::__cxx11::wstring: (hide value) libstdc++ c++11 std::wstring summary provider std::__cxx11::basic_string<wchar_t, std::char_traits<wchar_t>, std::allocator<wchar_t> >: (hide value) libstdc++ c++11 std::wstring summary provider char8_t *: (skip pointers) char8_t * summary provider char16_t *: (skip pointers) char16_t * summary provider char32_t *: (skip pointers) char32_t * summary provider wchar_t *: (skip pointers) wchar_t * summary provider unichar *: (skip pointers) unichar * summary provider char8_t: (hide value) (skip pointers) (hide member names) char8_t summary provider char16_t: (hide value) (skip pointers) (hide member names) char16_t summary provider char32_t: (hide value) (skip pointers) (hide member names) char32_t summary provider wchar_t: (hide value) (skip pointers) (hide member names) wchar_t summary provider unichar: (hide value) (skip pointers) (hide member names) unichar summary provider ^std::vector<.+>(( )?&)?$: `size=${svar%#}` (show children) (hide value) (skip pointers) ^std::map<.+> >(( )?&)?$: `size=${svar%#}` (show children) (hide value) (skip pointers) ^std::(__cxx11::)?list<.+>(( )?&)?$: `size=${svar%#}` (show children) (hide value) (skip pointers) ^std::unique_ptr<.+>(( )?&)?$: (show children) (hide value) (skip pointers) libstdc++ std::unique_ptr summary provider ^std::shared_ptr<.+>(( )?&)?$: (show children) (hide value) (skip pointers) libstdc++ std::shared_ptr summary provider ^std::weak_ptr<.+>(( )?&)?$: (show children) (hide value) (skip pointers) libstdc++ std::weak_ptr summary provider ^std::__[[:alnum:]]+::string$: (hide value) std::string summary provider ^std::__[[:alnum:]]+::basic_string<char, std::__[[:alnum:]]+::char_traits<char>, std::__[[:alnum:]]+::allocator<char> >$: (hide value) std::string summary provider ^std::__[[:alnum:]]+::basic_string<unsigned char, std::__[[:alnum:]]+::char_traits<unsigned char>, std::__[[:alnum:]]+::allocator<unsigned char> >$: (hide value) std::string summary provider ^std::__[[:alnum:]]+::basic_string<char16_t, std::__[[:alnum:]]+::char_traits<char16_t>, std::__[[:alnum:]]+::allocator<char16_t> >$: (hide value) std::u16string summary provider ^std::__[[:alnum:]]+::basic_string<char32_t, std::__[[:alnum:]]+::char_traits<char32_t>, std::__[[:alnum:]]+::allocator<char32_t> >$: (hide value) std::u32string summary provider ^std::__[[:alnum:]]+::wstring$: (hide value) std::wstring summary provider ^std::__[[:alnum:]]+::basic_string<wchar_t, std::__[[:alnum:]]+::char_traits<wchar_t>, std::__[[:alnum:]]+::allocator<wchar_t> >$: (hide value) std::wstring summary provider ^std::__[[:alnum:]]+::function<.+>$: (hide value) libc++ std::function summary provider ^std::__[[:alnum:]]+::bitset<.+>(( )?&)?$: (show children) (hide value) libc++ std::bitset summary provider ^std::__[[:alnum:]]+::vector<.+>(( )?&)?$: (show children) (hide value) libc++ std::vector summary provider ^std::__[[:alnum:]]+::forward_list<.+>(( )?&)?$: (show children) (hide value) libc++ std::list summary provider ^std::__([A-Zabd-z0-9]|cx?[A-Za-wyz0-9]|cxx1?[A-Za-z02-9]|cxx11[[:alnum:]])[[:alnum:]]*::list<.+>(( )?&)?$: (show children) (hide value) libc++ std::list summary provider ^std::__[[:alnum:]]+::map<.+>(( )?&)?$: (show children) (hide value) libc++ std::map summary provider ^std::__[[:alnum:]]+::deque<.+>(( )?&)?$: (show children) (hide value) libc++ std::deque summary provider ^std::__[[:alnum:]]+::queue<.+>(( )?&)?$: (show children) (hide value) libc++ std::queue summary provider ^std::__[[:alnum:]]+::set<.+>(( )?&)?$: (show children) (hide value) libc++ std::set summary provider ^std::__[[:alnum:]]+::multiset<.+>(( )?&)?$: (show children) (hide value) libc++ std::multiset summary provider ^std::__[[:alnum:]]+::multimap<.+>(( )?&)?$: (show children) (hide value) libc++ std::multimap summary provider ^(std::__[[:alnum:]]+::)unordered_(multi)?(map|set)<.+> >$: (show children) (hide value) libc++ std::unordered containers summary provider ^std::__[[:alnum:]]+::tuple<.*>(( )?&)?$: (show children) (hide value) libc++ std::tuple summary provider ^std::__[[:alnum:]]+::atomic<.+>$: (show children) (hide value) libc++ std::atomic summary provider ^std::__[[:alnum:]]+::optional<.+>(( )?&)?$: (show children) (hide value) libc++ std::optional summary provider ^std::__[[:alnum:]]+::variant<.+>(( )?&)?$: (show children) (hide value) libc++ std::variant summary provider ^std::__[[:alnum:]]+::shared_ptr<.+>(( )?&)?$: (show children) (hide value) (skip pointers) libc++ std::shared_ptr summary provider ^std::__[[:alnum:]]+::weak_ptr<.+>(( )?&)?$: (show children) (hide value) (skip pointers) libc++ std::weak_ptr summary provider ^std::__[[:alnum:]]+::unique_ptr<.+>(( )?&)?$: (show children) (hide value) (skip pointers) libc++ std::unique_ptr summary provider char8_t \[[0-9]+\]: (hide value) (skip pointers) char8_t [] summary provider char16_t \[[0-9]+\]: (hide value) (skip pointers) char16_t [] summary provider char32_t \[[0-9]+\]: (hide value) (skip pointers) char32_t [] summary provider wchar_t \[[0-9]+\]: (hide value) (skip pointers) wchar_t * summary provider ----------------------- Category: objc (disabled) ----------------------- CMTime: (show children) CMTime summary provider BOOL: (not cascading) (hide value) (skip pointers) (skip references) BOOL &: (not cascading) (hide value) (skip pointers) (skip references) BOOL *: (not cascading) (hide value) (skip pointers) (skip references) SEL: (not cascading) (hide value) (skip pointers) (skip references) SEL summary provider objc_selector: (not cascading) (hide value) (skip pointers) (skip references) SEL summary provider objc_selector *: (not cascading) (hide value) (skip pointers) (skip references) SEL summary provider SEL *: (not cascading) (hide value) (skip pointers) (skip references) SEL summary provider Class: (not cascading) (hide value) (skip pointers) (skip references) Class summary provider __block_literal_generic: `${var.__FuncPtr%A}` (hide value) CFGregorianUnits: `${var.years} years, ${var.months} months, ${var.days} days, ${var.hours} hours, ${var.minutes} minutes ${var.seconds} seconds` (hide value) CFRange: `location=${var.location} length=${var.length}` (hide value) NSRange: `location=${var.location}, length=${var.length}` (hide value) NSRectArray: `(${var.origin}, ${var.size}), ...` (hide value) NSPoint: `` (hide value) (one-line printout) NSSize: `` (hide value) (one-line printout) NSRect: `` (hide value) (one-line printout) CGSize: `` (hide value) (one-line printout) CGPoint: `` (hide value) (one-line printout) CGRect: `` (hide value) (one-line printout) RGBColor: `red=${var.red} green=${var.green} blue=${var.blue}` (hide value) Rect: `(t=${var.top}, l=${var.left}, b=${var.bottom}, r=${var.right})` (hide value) Point: `{(v=${var.v}, h=${var.h})}` (hide value) DateTimeRect *: `${var.month}/${var.day}/${var.year} ${var.hour} :${var.minute} :${var.second} dayOfWeek:${var.dayOfWeek}` (hide value) LongDateRect: `${var.ld.month}/${var.ld.day}/${var.ld.year} ${var.ld.hour} :${var.ld.minute} :${var.ld.second} dayOfWeek:${var.ld.dayOfWeek}` (hide value) HIPoint: `(x=${var.x}, y=${var.y})` (hide value) HIRect: `origin=${var.origin} size=${var.size}` (hide value) NSArray: (show children) NSArray summary provider NSMutableArray: (show children) NSArray summary provider __NSArrayI: (show children) NSArray summary provider __NSArray0: (show children) NSArray summary provider __NSSingleObjectArrayI: (show children) NSArray summary provider __NSArrayM: (show children) NSArray summary provider __NSCFArray: (show children) NSArray summary provider _NSCallStackArray: (show children) NSArray summary provider CFArrayRef: (show children) NSArray summary provider CFMutableArrayRef: (show children) NSArray summary provider NSDictionary: (show children) NSDictionary summary provider NSMutableDictionary: (show children) NSDictionary summary provider __NSCFDictionary: (show children) NSDictionary summary provider __NSDictionaryI: (show children) NSDictionary summary provider __NSSingleEntryDictionaryI: (show children) NSDictionary summary provider __NSDictionaryM: (show children) NSDictionary summary provider CFDictionaryRef: (show children) NSDictionary summary provider __CFDictionary: (show children) NSDictionary summary provider CFMutableDictionaryRef: (show children) NSDictionary summary provider NSSet: (show children) NSSet summary CFSetRef: (show children) CFSetRef summary CFMutableSetRef: (show children) CFMutableSetRef summary __NSCFSet: (show children) __NSCFSet summary __CFSet: (show children) __CFSet summary __NSSetI: (show children) __NSSetI summary __NSSetM: (show children) __NSSetM summary NSCountedSet: (show children) NSCountedSet summary NSMutableSet: (show children) NSMutableSet summary NSOrderedSet: (show children) NSOrderedSet summary __NSOrderedSetI: (show children) __NSOrderedSetI summary __NSOrderedSetM: (show children) __NSOrderedSetM summary NSError: (show children) NSError summary provider NSException: (show children) NSException summary provider CFBagRef: CFBag summary provider __CFBag: CFBag summary provider const struct __CFBag: CFBag summary provider CFMutableBagRef: CFBag summary provider CFBinaryHeapRef: CFBinaryHeap summary provider __CFBinaryHeap: CFBinaryHeap summary provider NSString: NSString summary provider CFStringRef: NSString summary provider __CFString: NSString summary provider CFMutableStringRef: NSString summary provider NSMutableString: NSString summary provider __NSCFConstantString: NSString summary provider __NSCFString: NSString summary provider NSCFConstantString: NSString summary provider NSCFString: NSString summary provider NSPathStore2: NSString summary provider NSTaggedPointerString: NSString summary provider NSAttributedString: NSAttributedString summary provider NSMutableAttributedString: NSMutableAttributedString summary provider NSConcreteMutableAttributedString: NSMutableAttributedString summary provider NSBundle: NSBundle summary provider NSData: NSData summary provider _NSInlineData: NSData summary provider NSConcreteData: NSData summary provider NSConcreteMutableData: NSData summary provider NSMutableData: NSData summary provider __NSCFData: NSData summary provider CFDataRef: NSData summary provider CFMutableDataRef: NSData summary provider NSMachPort: NSMachPort summary provider NSNotification: NSNotification summary provider NSConcreteNotification: NSNotification summary provider NSNumber: NSNumber summary provider CFNumberRef: CFNumberRef summary provider __NSCFBoolean: NSNumber summary provider __NSCFNumber: NSNumber summary provider NSCFBoolean: NSNumber summary provider NSCFNumber: NSNumber summary provider NSDecimalNumber: NSDecimalNumber summary provider NSURL: NSURL summary provider CFURLRef: NSURL summary provider NSDate: NSDate summary provider __NSDate: NSDate summary provider __NSTaggedDate: NSDate summary provider NSCalendarDate: NSDate summary provider NSTimeZone: NSTimeZone summary provider CFTimeZoneRef: NSTimeZone summary provider __NSTimeZone: NSTimeZone summary provider CFAbsoluteTime: (hide value) CFAbsoluteTime summary provider NSIndexSet: NSIndexSet summary provider NSMutableIndexSet: NSIndexSet summary provider CFGregorianDate: `@"${var.month%d}/${var.day%d}/${var.year%d} ${var.hour%d}:${var.minute%d}:${var.second}"` CFBitVectorRef: CFBitVector summary provider CFMutableBitVectorRef: CFBitVector summary provider __CFBitVector: CFBitVector summary provider __CFMutableBitVector: CFBitVector summary provider

Hide Details

Hide Details

Ran command: "type summary list"

Hide Details

Got output: ----------------------- Category: VectorTypes (disabled) ----------------------- builtin_type_vec128: `${var.uint128}` (one-line printout) (skip pointers) (hide member names) float [4]: `` (one-line printout) (skip pointers) (hide member names) int32_t [4]: `` (one-line printout) (skip pointers) (hide member names) int16_t [8]: `` (one-line printout) (skip pointers) (hide member names) vDouble: `` (one-line printout) (skip pointers) (hide member names) vFloat: `` (one-line printout) (skip pointers) (hide member names) vSInt8: `` (one-line printout) (skip pointers) (hide member names) vSInt16: `` (one-line printout) (skip pointers) (hide member names) vSInt32: `` (one-line printout) (skip pointers) (hide member names) vUInt8: `` (one-line printout) (skip pointers) (hide member names) vUInt16: `` (one-line printout) (skip pointers) (hide member names) vUInt32: `` (one-line printout) (skip pointers) (hide member names) vBool32: `` (one-line printout) (skip pointers) (hide member names) ----------------------- Category: cplusplus (disabled) ----------------------- std::string: `${var._M_dataplus._M_p}` (hide value) std::basic_string<char>: `${var._M_dataplus._M_p}` (hide value) std::basic_string<char,std::char_traits<char>,std::allocator<char> >: `${var._M_dataplus._M_p}` (hide value) std::basic_string<char, std::char_traits<char>, std::allocator<char> >: `${var._M_dataplus._M_p}` (hide value) std::__cxx11::string: (hide value) libstdc++ c++11 std::string summary provider std::__cxx11::basic_string<char, std::char_traits<char>, std::allocator<char> >: (hide value) libstdc++ c++11 std::string summary provider std::__cxx11::basic_string<unsigned char, std::char_traits<unsigned char>, std::allocator<unsigned char> >: (hide value) libstdc++ c++11 std::string summary provider std::wstring: `${var._M_dataplus._M_p%S}` (hide value) std::basic_string<wchar_t>: `${var._M_dataplus._M_p%S}` (hide value) std::basic_string<wchar_t,std::char_traits<wchar_t>,std::allocator<wchar_t> >: `${var._M_dataplus._M_p%S}` (hide value) std::basic_string<wchar_t, std::char_traits<wchar_t>, std::allocator<wchar_t> >: `${var._M_dataplus._M_p%S}` (hide value) std::__cxx11::wstring: (hide value) libstdc++ c++11 std::wstring summary provider std::__cxx11::basic_string<wchar_t, std::char_traits<wchar_t>, std::allocator<wchar_t> >: (hide value) libstdc++ c++11 std::wstring summary provider char8_t *: (skip pointers) char8_t * summary provider char16_t *: (skip pointers) char16_t * summary provider char32_t *: (skip pointers) char32_t * summary provider wchar_t *: (skip pointers) wchar_t * summary provider unichar *: (skip pointers) unichar * summary provider char8_t: (hide value) (skip pointers) (hide member names) char8_t summary provider char16_t: (hide value) (skip pointers) (hide member names) char16_t summary provider char32_t: (hide value) (skip pointers) (hide member names) char32_t summary provider wchar_t: (hide value) (skip pointers) (hide member names) wchar_t summary provider unichar: (hide value) (skip pointers) (hide member names) unichar summary provider ^std::vector<.+>(( )?&)?$: `size=${svar%#}` (show children) (hide value) (skip pointers) ^std::map<.+> >(( )?&)?$: `size=${svar%#}` (show children) (hide value) (skip pointers) ^std::(__cxx11::)?list<.+>(( )?&)?$: `size=${svar%#}` (show children) (hide value) (skip pointers) ^std::unique_ptr<.+>(( )?&)?$: (show children) (hide value) (skip pointers) libstdc++ std::unique_ptr summary provider ^std::shared_ptr<.+>(( )?&)?$: (show children) (hide value) (skip pointers) libstdc++ std::shared_ptr summary provider ^std::weak_ptr<.+>(( )?&)?$: (show children) (hide value) (skip pointers) libstdc++ std::weak_ptr summary provider ^std::__[[:alnum:]]+::string$: (hide value) std::string summary provider ^std::__[[:alnum:]]+::basic_string<char, std::__[[:alnum:]]+::char_traits<char>, std::__[[:alnum:]]+::allocator<char> >$: (hide value) std::string summary provider ^std::__[[:alnum:]]+::basic_string<unsigned char, std::__[[:alnum:]]+::char_traits<unsigned char>, std::__[[:alnum:]]+::allocator<unsigned char> >$: (hide value) std::string summary provider ^std::__[[:alnum:]]+::basic_string<char16_t, std::__[[:alnum:]]+::char_traits<char16_t>, std::__[[:alnum:]]+::allocator<char16_t> >$: (hide value) std::u16string summary provider ^std::__[[:alnum:]]+::basic_string<char32_t, std::__[[:alnum:]]+::char_traits<char32_t>, std::__[[:alnum:]]+::allocator<char32_t> >$: (hide value) std::u32string summary provider ^std::__[[:alnum:]]+::wstring$: (hide value) std::wstring summary provider ^std::__[[:alnum:]]+::basic_string<wchar_t, std::__[[:alnum:]]+::char_traits<wchar_t>, std::__[[:alnum:]]+::allocator<wchar_t> >$: (hide value) std::wstring summary provider ^std::__[[:alnum:]]+::function<.+>$: (hide value) libc++ std::function summary provider ^std::__[[:alnum:]]+::bitset<.+>(( )?&)?$: (show children) (hide value) libc++ std::bitset summary provider ^std::__[[:alnum:]]+::vector<.+>(( )?&)?$: (show children) (hide value) libc++ std::vector summary provider ^std::__[[:alnum:]]+::forward_list<.+>(( )?&)?$: (show children) (hide value) libc++ std::list summary provider ^std::__([A-Zabd-z0-9]|cx?[A-Za-wyz0-9]|cxx1?[A-Za-z02-9]|cxx11[[:alnum:]])[[:alnum:]]*::list<.+>(( )?&)?$: (show children) (hide value) libc++ std::list summary provider ^std::__[[:alnum:]]+::map<.+>(( )?&)?$: (show children) (hide value) libc++ std::map summary provider ^std::__[[:alnum:]]+::deque<.+>(( )?&)?$: (show children) (hide value) libc++ std::deque summary provider ^std::__[[:alnum:]]+::queue<.+>(( )?&)?$: (show children) (hide value) libc++ std::queue summary provider ^std::__[[:alnum:]]+::set<.+>(( )?&)?$: (show children) (hide value) libc++ std::set summary provider ^std::__[[:alnum:]]+::multiset<.+>(( )?&)?$: (show children) (hide value) libc++ std::multiset summary provider ^std::__[[:alnum:]]+::multimap<.+>(( )?&)?$: (show children) (hide value) libc++ std::multimap summary provider ^(std::__[[:alnum:]]+::)unordered_(multi)?(map|set)<.+> >$: (show children) (hide value) libc++ std::unordered containers summary provider ^std::__[[:alnum:]]+::tuple<.*>(( )?&)?$: (show children) (hide value) libc++ std::tuple summary provider ^std::__[[:alnum:]]+::atomic<.+>$: (show children) (hide value) libc++ std::atomic summary provider ^std::__[[:alnum:]]+::optional<.+>(( )?&)?$: (show children) (hide value) libc++ std::optional summary provider ^std::__[[:alnum:]]+::variant<.+>(( )?&)?$: (show children) (hide value) libc++ std::variant summary provider ^std::__[[:alnum:]]+::shared_ptr<.+>(( )?&)?$: (show children) (hide value) (skip pointers) libc++ std::shared_ptr summary provider ^std::__[[:alnum:]]+::weak_ptr<.+>(( )?&)?$: (show children) (hide value) (skip pointers) libc++ std::weak_ptr summary provider ^std::__[[:alnum:]]+::unique_ptr<.+>(( )?&)?$: (show children) (hide value) (skip pointers) libc++ std::unique_ptr summary provider char8_t \[[0-9]+\]: (hide value) (skip pointers) char8_t [] summary provider char16_t \[[0-9]+\]: (hide value) (skip pointers) char16_t [] summary provider char32_t \[[0-9]+\]: (hide value) (skip pointers) char32_t [] summary provider wchar_t \[[0-9]+\]: (hide value) (skip pointers) wchar_t * summary provider ----------------------- Category: default (disabled) ----------------------- ----------------------- Category: objc (disabled) ----------------------- CMTime: (show children) CMTime summary provider BOOL: (not cascading) (hide value) (skip pointers) (skip references) BOOL &: (not cascading) (hide value) (skip pointers) (skip references) BOOL *: (not cascading) (hide value) (skip pointers) (skip references) SEL: (not cascading) (hide value) (skip pointers) (skip references) SEL summary provider objc_selector: (not cascading) (hide value) (skip pointers) (skip references) SEL summary provider objc_selector *: (not cascading) (hide value) (skip pointers) (skip references) SEL summary provider SEL *: (not cascading) (hide value) (skip pointers) (skip references) SEL summary provider Class: (not cascading) (hide value) (skip pointers) (skip references) Class summary provider __block_literal_generic: `${var.__FuncPtr%A}` (hide value) CFGregorianUnits: `${var.years} years, ${var.months} months, ${var.days} days, ${var.hours} hours, ${var.minutes} minutes ${var.seconds} seconds` (hide value) CFRange: `location=${var.location} length=${var.length}` (hide value) NSRange: `location=${var.location}, length=${var.length}` (hide value) NSRectArray: `(${var.origin}, ${var.size}), ...` (hide value) NSPoint: `` (hide value) (one-line printout) NSSize: `` (hide value) (one-line printout) NSRect: `` (hide value) (one-line printout) CGSize: `` (hide value) (one-line printout) CGPoint: `` (hide value) (one-line printout) CGRect: `` (hide value) (one-line printout) RGBColor: `red=${var.red} green=${var.green} blue=${var.blue}` (hide value) Rect: `(t=${var.top}, l=${var.left}, b=${var.bottom}, r=${var.right})` (hide value) Point: `{(v=${var.v}, h=${var.h})}` (hide value) DateTimeRect *: `${var.month}/${var.day}/${var.year} ${var.hour} :${var.minute} :${var.second} dayOfWeek:${var.dayOfWeek}` (hide value) LongDateRect: `${var.ld.month}/${var.ld.day}/${var.ld.year} ${var.ld.hour} :${var.ld.minute} :${var.ld.second} dayOfWeek:${var.ld.dayOfWeek}` (hide value) HIPoint: `(x=${var.x}, y=${var.y})` (hide value) HIRect: `origin=${var.origin} size=${var.size}` (hide value) NSArray: (show children) NSArray summary provider NSMutableArray: (show children) NSArray summary provider __NSArrayI: (show children) NSArray summary provider __NSArray0: (show children) NSArray summary provider __NSSingleObjectArrayI: (show children) NSArray summary provider __NSArrayM: (show children) NSArray summary provider __NSCFArray: (show children) NSArray summary provider _NSCallStackArray: (show children) NSArray summary provider CFArrayRef: (show children) NSArray summary provider CFMutableArrayRef: (show children) NSArray summary provider NSDictionary: (show children) NSDictionary summary provider NSMutableDictionary: (show children) NSDictionary summary provider __NSCFDictionary: (show children) NSDictionary summary provider __NSDictionaryI: (show children) NSDictionary summary provider __NSSingleEntryDictionaryI: (show children) NSDictionary summary provider __NSDictionaryM: (show children) NSDictionary summary provider CFDictionaryRef: (show children) NSDictionary summary provider __CFDictionary: (show children) NSDictionary summary provider CFMutableDictionaryRef: (show children) NSDictionary summary provider NSSet: (show children) NSSet summary CFSetRef: (show children) CFSetRef summary CFMutableSetRef: (show children) CFMutableSetRef summary __NSCFSet: (show children) __NSCFSet summary __CFSet: (show children) __CFSet summary __NSSetI: (show children) __NSSetI summary __NSSetM: (show children) __NSSetM summary NSCountedSet: (show children) NSCountedSet summary NSMutableSet: (show children) NSMutableSet summary NSOrderedSet: (show children) NSOrderedSet summary __NSOrderedSetI: (show children) __NSOrderedSetI summary __NSOrderedSetM: (show children) __NSOrderedSetM summary NSError: (show children) NSError summary provider NSException: (show children) NSException summary provider CFBagRef: CFBag summary provider __CFBag: CFBag summary provider const struct __CFBag: CFBag summary provider CFMutableBagRef: CFBag summary provider CFBinaryHeapRef: CFBinaryHeap summary provider __CFBinaryHeap: CFBinaryHeap summary provider NSString: NSString summary provider CFStringRef: NSString summary provider __CFString: NSString summary provider CFMutableStringRef: NSString summary provider NSMutableString: NSString summary provider __NSCFConstantString: NSString summary provider __NSCFString: NSString summary provider NSCFConstantString: NSString summary provider NSCFString: NSString summary provider NSPathStore2: NSString summary provider NSTaggedPointerString: NSString summary provider NSAttributedString: NSAttributedString summary provider NSMutableAttributedString: NSMutableAttributedString summary provider NSConcreteMutableAttributedString: NSMutableAttributedString summary provider NSBundle: NSBundle summary provider NSData: NSData summary provider _NSInlineData: NSData summary provider NSConcreteData: NSData summary provider NSConcreteMutableData: NSData summary provider NSMutableData: NSData summary provider __NSCFData: NSData summary provider CFDataRef: NSData summary provider CFMutableDataRef: NSData summary provider NSMachPort: NSMachPort summary provider NSNotification: NSNotification summary provider NSConcreteNotification: NSNotification summary provider NSNumber: NSNumber summary provider CFNumberRef: CFNumberRef summary provider __NSCFBoolean: NSNumber summary provider __NSCFNumber: NSNumber summary provider NSCFBoolean: NSNumber summary provider NSCFNumber: NSNumber summary provider NSDecimalNumber: NSDecimalNumber summary provider NSURL: NSURL summary provider CFURLRef: NSURL summary provider NSDate: NSDate summary provider __NSDate: NSDate summary provider __NSTaggedDate: NSDate summary provider NSCalendarDate: NSDate summary provider NSTimeZone: NSTimeZone summary provider CFTimeZoneRef: NSTimeZone summary provider __NSTimeZone: NSTimeZone summary provider CFAbsoluteTime: (hide value) CFAbsoluteTime summary provider NSIndexSet: NSIndexSet summary provider NSMutableIndexSet: NSIndexSet summary provider CFGregorianDate: `@"${var.month%d}/${var.day%d}/${var.year%d} ${var.hour%d}:${var.minute%d}:${var.second}"` CFBitVectorRef: CFBitVector summary provider CFMutableBitVectorRef: CFBitVector summary provider __CFBitVector: CFBitVector summary provider __CFMutableBitVector: CFBitVector summary provider ----------------------- Category: system (disabled) ----------------------- char *: `${var%s}` (skip pointers) unsigned char *: `${var%s}` (skip pointers) OSType: `${var%O}` (not cascading) (skip pointers) (skip references) char \[[0-9]+\]: `${var%s}` (hide value) (skip pointers) ----------------------- Category: cplusplus (disabled) ----------------------- std::string: `${var._M_dataplus._M_p}` (hide value) std::basic_string<char>: `${var._M_dataplus._M_p}` (hide value) std::basic_string<char,std::char_traits<char>,std::allocator<char> >: `${var._M_dataplus._M_p}` (hide value) std::basic_string<char, std::char_traits<char>, std::allocator<char> >: `${var._M_dataplus._M_p}` (hide value) std::__cxx11::string: (hide value) libstdc++ c++11 std::string summary provider std::__cxx11::basic_string<char, std::char_traits<char>, std::allocator<char> >: (hide value) libstdc++ c++11 std::string summary provider std::__cxx11::basic_string<unsigned char, std::char_traits<unsigned char>, std::allocator<unsigned char> >: (hide value) libstdc++ c++11 std::string summary provider std::wstring: `${var._M_dataplus._M_p%S}` (hide value) std::basic_string<wchar_t>: `${var._M_dataplus._M_p%S}` (hide value) std::basic_string<wchar_t,std::char_traits<wchar_t>,std::allocator<wchar_t> >: `${var._M_dataplus._M_p%S}` (hide value) std::basic_string<wchar_t, std::char_traits<wchar_t>, std::allocator<wchar_t> >: `${var._M_dataplus._M_p%S}` (hide value) std::__cxx11::wstring: (hide value) libstdc++ c++11 std::wstring summary provider std::__cxx11::basic_string<wchar_t, std::char_traits<wchar_t>, std::allocator<wchar_t> >: (hide value) libstdc++ c++11 std::wstring summary provider char8_t *: (skip pointers) char8_t * summary provider char16_t *: (skip pointers) char16_t * summary provider char32_t *: (skip pointers) char32_t * summary provider wchar_t *: (skip pointers) wchar_t * summary provider unichar *: (skip pointers) unichar * summary provider char8_t: (hide value) (skip pointers) (hide member names) char8_t summary provider char16_t: (hide value) (skip pointers) (hide member names) char16_t summary provider char32_t: (hide value) (skip pointers) (hide member names) char32_t summary provider wchar_t: (hide value) (skip pointers) (hide member names) wchar_t summary provider unichar: (hide value) (skip pointers) (hide member names) unichar summary provider ^std::vector<.+>(( )?&)?$: `size=${svar%#}` (show children) (hide value) (skip pointers) ^std::map<.+> >(( )?&)?$: `size=${svar%#}` (show children) (hide value) (skip pointers) ^std::(__cxx11::)?list<.+>(( )?&)?$: `size=${svar%#}` (show children) (hide value) (skip pointers) ^std::unique_ptr<.+>(( )?&)?$: (show children) (hide value) (skip pointers) libstdc++ std::unique_ptr summary provider ^std::shared_ptr<.+>(( )?&)?$: (show children) (hide value) (skip pointers) libstdc++ std::shared_ptr summary provider ^std::weak_ptr<.+>(( )?&)?$: (show children) (hide value) (skip pointers) libstdc++ std::weak_ptr summary provider ^std::__[[:alnum:]]+::string$: (hide value) std::string summary provider ^std::__[[:alnum:]]+::basic_string<char, std::__[[:alnum:]]+::char_traits<char>, std::__[[:alnum:]]+::allocator<char> >$: (hide value) std::string summary provider ^std::__[[:alnum:]]+::basic_string<unsigned char, std::__[[:alnum:]]+::char_traits<unsigned char>, std::__[[:alnum:]]+::allocator<unsigned char> >$: (hide value) std::string summary provider ^std::__[[:alnum:]]+::basic_string<char16_t, std::__[[:alnum:]]+::char_traits<char16_t>, std::__[[:alnum:]]+::allocator<char16_t> >$: (hide value) std::u16string summary provider ^std::__[[:alnum:]]+::basic_string<char32_t, std::__[[:alnum:]]+::char_traits<char32_t>, std::__[[:alnum:]]+::allocator<char32_t> >$: (hide value) std::u32string summary provider ^std::__[[:alnum:]]+::wstring$: (hide value) std::wstring summary provider ^std::__[[:alnum:]]+::basic_string<wchar_t, std::__[[:alnum:]]+::char_traits<wchar_t>, std::__[[:alnum:]]+::allocator<wchar_t> >$: (hide value) std::wstring summary provider ^std::__[[:alnum:]]+::function<.+>$: (hide value) libc++ std::function summary provider ^std::__[[:alnum:]]+::bitset<.+>(( )?&)?$: (show children) (hide value) libc++ std::bitset summary provider ^std::__[[:alnum:]]+::vector<.+>(( )?&)?$: (show children) (hide value) libc++ std::vector summary provider ^std::__[[:alnum:]]+::forward_list<.+>(( )?&)?$: (show children) (hide value) libc++ std::list summary provider ^std::__([A-Zabd-z0-9]|cx?[A-Za-wyz0-9]|cxx1?[A-Za-z02-9]|cxx11[[:alnum:]])[[:alnum:]]*::list<.+>(( )?&)?$: (show children) (hide value) libc++ std::list summary provider ^std::__[[:alnum:]]+::map<.+>(( )?&)?$: (show children) (hide value) libc++ std::map summary provider ^std::__[[:alnum:]]+::deque<.+>(( )?&)?$: (show children) (hide value) libc++ std::deque summary provider ^std::__[[:alnum:]]+::queue<.+>(( )?&)?$: (show children) (hide value) libc++ std::queue summary provider ^std::__[[:alnum:]]+::set<.+>(( )?&)?$: (show children) (hide value) libc++ std::set summary provider ^std::__[[:alnum:]]+::multiset<.+>(( )?&)?$: (show children) (hide value) libc++ std::multiset summary provider ^std::__[[:alnum:]]+::multimap<.+>(( )?&)?$: (show children) (hide value) libc++ std::multimap summary provider ^(std::__[[:alnum:]]+::)unordered_(multi)?(map|set)<.+> >$: (show children) (hide value) libc++ std::unordered containers summary provider ^std::__[[:alnum:]]+::tuple<.*>(( )?&)?$: (show children) (hide value) libc++ std::tuple summary provider ^std::__[[:alnum:]]+::atomic<.+>$: (show children) (hide value) libc++ std::atomic summary provider ^std::__[[:alnum:]]+::optional<.+>(( )?&)?$: (show children) (hide value) libc++ std::optional summary provider ^std::__[[:alnum:]]+::variant<.+>(( )?&)?$: (show children) (hide value) libc++ std::variant summary provider ^std::__[[:alnum:]]+::shared_ptr<.+>(( )?&)?$: (show children) (hide value) (skip pointers) libc++ std::shared_ptr summary provider ^std::__[[:alnum:]]+::weak_ptr<.+>(( )?&)?$: (show children) (hide value) (skip pointers) libc++ std::weak_ptr summary provider ^std::__[[:alnum:]]+::unique_ptr<.+>(( )?&)?$: (show children) (hide value) (skip pointers) libc++ std::unique_ptr summary provider char8_t \[[0-9]+\]: (hide value) (skip pointers) char8_t [] summary provider char16_t \[[0-9]+\]: (hide value) (skip pointers) char16_t [] summary provider char32_t \[[0-9]+\]: (hide value) (skip pointers) char32_t [] summary provider wchar_t \[[0-9]+\]: (hide value) (skip pointers) wchar_t * summary provider ----------------------- Category: objc (disabled) ----------------------- CMTime: (show children) CMTime summary provider BOOL: (not cascading) (hide value) (skip pointers) (skip references) BOOL &: (not cascading) (hide value) (skip pointers) (skip references) BOOL *: (not cascading) (hide value) (skip pointers) (skip references) SEL: (not cascading) (hide value) (skip pointers) (skip references) SEL summary provider objc_selector: (not cascading) (hide value) (skip pointers) (skip references) SEL summary provider objc_selector *: (not cascading) (hide value) (skip pointers) (skip references) SEL summary provider SEL *: (not cascading) (hide value) (skip pointers) (skip references) SEL summary provider Class: (not cascading) (hide value) (skip pointers) (skip references) Class summary provider __block_literal_generic: `${var.__FuncPtr%A}` (hide value) CFGregorianUnits: `${var.years} years, ${var.months} months, ${var.days} days, ${var.hours} hours, ${var.minutes} minutes ${var.seconds} seconds` (hide value) CFRange: `location=${var.location} length=${var.length}` (hide value) NSRange: `location=${var.location}, length=${var.length}` (hide value) NSRectArray: `(${var.origin}, ${var.size}), ...` (hide value) NSPoint: `` (hide value) (one-line printout) NSSize: `` (hide value) (one-line printout) NSRect: `` (hide value) (one-line printout) CGSize: `` (hide value) (one-line printout) CGPoint: `` (hide value) (one-line printout) CGRect: `` (hide value) (one-line printout) RGBColor: `red=${var.red} green=${var.green} blue=${var.blue}` (hide value) Rect: `(t=${var.top}, l=${var.left}, b=${var.bottom}, r=${var.right})` (hide value) Point: `{(v=${var.v}, h=${var.h})}` (hide value) DateTimeRect *: `${var.month}/${var.day}/${var.year} ${var.hour} :${var.minute} :${var.second} dayOfWeek:${var.dayOfWeek}` (hide value) LongDateRect: `${var.ld.month}/${var.ld.day}/${var.ld.year} ${var.ld.hour} :${var.ld.minute} :${var.ld.second} dayOfWeek:${var.ld.dayOfWeek}` (hide value) HIPoint: `(x=${var.x}, y=${var.y})` (hide value) HIRect: `origin=${var.origin} size=${var.size}` (hide value) NSArray: (show children) NSArray summary provider NSMutableArray: (show children) NSArray summary provider __NSArrayI: (show children) NSArray summary provider __NSArray0: (show children) NSArray summary provider __NSSingleObjectArrayI: (show children) NSArray summary provider __NSArrayM: (show children) NSArray summary provider __NSCFArray: (show children) NSArray summary provider _NSCallStackArray: (show children) NSArray summary provider CFArrayRef: (show children) NSArray summary provider CFMutableArrayRef: (show children) NSArray summary provider NSDictionary: (show children) NSDictionary summary provider NSMutableDictionary: (show children) NSDictionary summary provider __NSCFDictionary: (show children) NSDictionary summary provider __NSDictionaryI: (show children) NSDictionary summary provider __NSSingleEntryDictionaryI: (show children) NSDictionary summary provider __NSDictionaryM: (show children) NSDictionary summary provider CFDictionaryRef: (show children) NSDictionary summary provider __CFDictionary: (show children) NSDictionary summary provider CFMutableDictionaryRef: (show children) NSDictionary summary provider NSSet: (show children) NSSet summary CFSetRef: (show children) CFSetRef summary CFMutableSetRef: (show children) CFMutableSetRef summary __NSCFSet: (show children) __NSCFSet summary __CFSet: (show children) __CFSet summary __NSSetI: (show children) __NSSetI summary __NSSetM: (show children) __NSSetM summary NSCountedSet: (show children) NSCountedSet summary NSMutableSet: (show children) NSMutableSet summary NSOrderedSet: (show children) NSOrderedSet summary __NSOrderedSetI: (show children) __NSOrderedSetI summary __NSOrderedSetM: (show children) __NSOrderedSetM summary NSError: (show children) NSError summary provider NSException: (show children) NSException summary provider CFBagRef: CFBag summary provider __CFBag: CFBag summary provider const struct __CFBag: CFBag summary provider CFMutableBagRef: CFBag summary provider CFBinaryHeapRef: CFBinaryHeap summary provider __CFBinaryHeap: CFBinaryHeap summary provider NSString: NSString summary provider CFStringRef: NSString summary provider __CFString: NSString summary provider CFMutableStringRef: NSString summary provider NSMutableString: NSString summary provider __NSCFConstantString: NSString summary provider __NSCFString: NSString summary provider NSCFConstantString: NSString summary provider NSCFString: NSString summary provider NSPathStore2: NSString summary provider NSTaggedPointerString: NSString summary provider NSAttributedString: NSAttributedString summary provider NSMutableAttributedString: NSMutableAttributedString summary provider NSConcreteMutableAttributedString: NSMutableAttributedString summary provider NSBundle: NSBundle summary provider NSData: NSData summary provider _NSInlineData: NSData summary provider NSConcreteData: NSData summary provider NSConcreteMutableData: NSData summary provider NSMutableData: NSData summary provider __NSCFData: NSData summary provider CFDataRef: NSData summary provider CFMutableDataRef: NSData summary provider NSMachPort: NSMachPort summary provider NSNotification: NSNotification summary provider NSConcreteNotification: NSNotification summary provider NSNumber: NSNumber summary provider CFNumberRef: CFNumberRef summary provider __NSCFBoolean: NSNumber summary provider __NSCFNumber: NSNumber summary provider NSCFBoolean: NSNumber summary provider NSCFNumber: NSNumber summary provider NSDecimalNumber: NSDecimalNumber summary provider NSURL: NSURL summary provider CFURLRef: NSURL summary provider NSDate: NSDate summary provider __NSDate: NSDate summary provider __NSTaggedDate: NSDate summary provider NSCalendarDate: NSDate summary provider NSTimeZone: NSTimeZone summary provider CFTimeZoneRef: NSTimeZone summary provider __NSTimeZone: NSTimeZone summary provider CFAbsoluteTime: (hide value) CFAbsoluteTime summary provider NSIndexSet: NSIndexSet summary provider NSMutableIndexSet: NSIndexSet summary provider CFGregorianDate: `@"${var.month%d}/${var.day%d}/${var.year%d} ${var.hour%d}:${var.minute%d}:${var.second}"` CFBitVectorRef: CFBitVector summary provider CFMutableBitVectorRef: CFBitVector summary provider __CFBitVector: CFBitVector summary provider __CFMutableBitVector: CFBitVector summary provider

Hide Details

Expecting sub string: "Category: system (disabled)" (was found)

Hide Details

runCmd: type category list output: Category: VectorTypes (disabled, applicable for language(s): objective-c++) Category: cplusplus (disabled) Category: default (disabled) Category: objc (disabled) Category: system (disabled, applicable for language(s): objective-c++) Category: cplusplus (disabled) Category: objc (disabled)

Hide Details

Hide Details

Ran command: "type category list"

Hide Details

Got output: Category: VectorTypes (disabled, applicable for language(s): objective-c++) Category: cplusplus (disabled) Category: default (disabled) Category: objc (disabled) Category: system (disabled, applicable for language(s): objective-c++) Category: cplusplus (disabled) Category: objc (disabled)

Hide Details

Expecting sub string: "system" (was found) Expecting sub string: "disabled" (was found)

Hide Details

runCmd: type category enable * output:

Hide Details

runCmd: type category list output: Category: default (enabled) Category: objc (enabled) Category: system (enabled, applicable for language(s): objective-c++) Category: VectorTypes (disabled, applicable for language(s): objective-c++) Category: cplusplus (enabled) Category: objc (enabled)

Hide Details

Hide Details

Ran command: "type category list"

Hide Details

Got output: Category: default (enabled) Category: objc (enabled) Category: system (enabled, applicable for language(s): objective-c++) Category: VectorTypes (disabled, applicable for language(s): objective-c++) Category: cplusplus (enabled) Category: objc (enabled)

Hide Details

Expecting sub string: "system" (was found) Expecting sub string: "enabled" (was found)

Hide Details

runCmd: frame variable numbers output: (std::vector<int, std::allocator<int> >) numbers = size=6 { [0] = 1 [1] = 12 [2] = 123 [3] = 1234 [4] = 12345 [5] = 123456 }

Hide Details

Hide Details

Ran command: "frame variable numbers"

Hide Details

Got output: (std::vector<int, std::allocator<int> >) numbers = size=6 { [0] = 1 [1] = 12 [2] = 123 [3] = 1234 [4] = 12345 [5] = 123456 }

Hide Details

Expecting sub string: "[0] = 1" (was found) Expecting sub string: "[3] = 1234" (was found)

Hide Details

runCmd: frame variable string1 output: (const char *) string1 = 0x0000000100002eb8 "hello world"

Hide Details

Hide Details

Ran command: "frame variable string1"

Hide Details

Got output: (const char *) string1 = 0x0000000100002eb8 "hello world"

Hide Details

Expecting sub string: "hello world" (was found)

Hide Details

runCmd: type category list output: Category: default (enabled) Category: objc (enabled) Category: system (enabled, applicable for language(s): objective-c++) Category: VectorTypes (disabled, applicable for language(s): objective-c++) Category: cplusplus (enabled) Category: objc (enabled)

Hide Details

Hide Details

Ran command: "type category list"

Hide Details

Got output: Category: default (enabled) Category: objc (enabled) Category: system (enabled, applicable for language(s): objective-c++) Category: VectorTypes (disabled, applicable for language(s): objective-c++) Category: cplusplus (enabled) Category: objc (enabled)

Hide Details

Expecting sub string: "system" (was found) Expecting sub string: "enabled" (was found)

Hide Details

runCmd: type category disable * output:

Hide Details

runCmd: type category list output: Category: VectorTypes (disabled, applicable for language(s): objective-c++) Category: cplusplus (disabled) Category: default (disabled) Category: objc (disabled) Category: system (disabled, applicable for language(s): objective-c++) Category: cplusplus (disabled) Category: objc (disabled)

Hide Details

Hide Details

Ran command: "type category list"

Hide Details

Got output: Category: VectorTypes (disabled, applicable for language(s): objective-c++) Category: cplusplus (disabled) Category: default (disabled) Category: objc (disabled) Category: system (disabled, applicable for language(s): objective-c++) Category: cplusplus (disabled) Category: objc (disabled)

Hide Details

Expecting sub string: "system" (was found) Expecting sub string: "disabled" (was found)

Hide Details

<bound method SBProcess.Kill of <lldb.SBProcess; proxy of <Swig Object of type 'lldb::SBProcess *' at 0x1011ce120> >>: success

Hide Details

Executing tearDown hook: def cleanup(): self.runCmd('type category enable *', check=False)

Hide Details

Hide Details

runCmd: type category enable * check of return status not required output:

Hide Details

PASS: LLDB (/Users/buildslave/jenkins/workspace/lldb-cmake/lldb-build/bin/clang-x86_64) :: test_with_run_command_dwarf (TestDataFormatterDisabling.DataFormatterDisablingTestCase) UNSUPPORTED: LLDB (/Users/buildslave/jenkins/workspace/lldb-cmake/lldb-build/bin/clang-x86_64) :: test_with_run_command_dwo (TestDataFormatterDisabling.DataFormatterDisablingTestCase) (test case does not fall in any category of interest for this run) runCmd: settings clear -all output:

Hide Details

runCmd: settings set symbols.enable-external-lookup false output:

Hide Details

runCmd: settings set target.inherit-tcc true output:

Hide Details

runCmd: settings set target.auto-apply-fixits false output:

Hide Details

runCmd: settings set plugin.process.gdb-remote.packet-timeout 60 output:

Hide Details

runCmd: settings set symbols.clang-modules-cache-path "/Users/buildslave/jenkins/workspace/lldb-cmake/lldb-build/lldb-test-build.noindex/module-cache-lldb/lldb-api" output:

Hide Details

runCmd: settings set use-color false output:

Hide Details

runCmd: setting set target.prefer-dynamic-value no-dynamic-values output:

Hide Details

FAIL: LLDB (/Users/buildslave/jenkins/workspace/lldb-cmake/lldb-build/bin/clang-x86_64) :: test_with_run_command_gmodules (TestDataFormatterDisabling.DataFormatterDisablingTestCase) Restore dir to: /Users/buildslave/jenkins/workspace/lldb-cmake/lldb-build/tools/lldb/test ====================================================================== ERROR: test_with_run_command_gmodules (TestDataFormatterDisabling.DataFormatterDisablingTestCase) Check that we can properly disable all data formatter categories. ---------------------------------------------------------------------- Error when building test subject.

Hide Details

Build Command: make VPATH=/Users/buildslave/jenkins/workspace/lldb-cmake/llvm-project/lldb/test/API/functionalities/data-formatter/data-formatter-disabling -C /Users/buildslave/jenkins/workspace/lldb-cmake/lldb-build/lldb-test-build.noindex/functionalities/data-formatter/data-formatter-disabling/TestDataFormatterDisabling.test_with_run_command_gmodules -I /Users/buildslave/jenkins/workspace/lldb-cmake/llvm-project/lldb/test/API/functionalities/data-formatter/data-formatter-disabling -I /Users/buildslave/jenkins/workspace/lldb-cmake/llvm-project/lldb/packages/Python/lldbsuite/test/make -f /Users/buildslave/jenkins/workspace/lldb-cmake/llvm-project/lldb/test/API/functionalities/data-formatter/data-formatter-disabling/Makefile MAKE_DSYM=NO MAKE_GMODULES=YES ARCH=x86_64 CC="/Users/buildslave/jenkins/workspace/lldb-cmake/lldb-build/bin/clang" DSYMUTIL="/Users/buildslave/jenkins/workspace/lldb-cmake/lldb-build/./bin/dsymutil" CLANG_MODULE_CACHE_DIR=/Users/buildslave/jenkins/workspace/lldb-cmake/lldb-build/lldb-test-build.noindex/module-cache-clang/lldb-api

Hide Details

Build Command Output: While building module 'std' imported from /Users/buildslave/jenkins/workspace/lldb-cmake/llvm-project/lldb/test/API/functionalities/data-formatter/data-formatter-disabling/main.cpp:1: In file included from <module-includes>:31: In file included from /Users/buildslave/jenkins/workspace/lldb-cmake/lldb-build/bin/../include/c++/v1/complex.h:28: In file included from /Users/buildslave/jenkins/workspace/lldb-cmake/lldb-build/bin/../include/c++/v1/ccomplex:20: In file included from /Users/buildslave/jenkins/workspace/lldb-cmake/lldb-build/bin/../include/c++/v1/complex:247: In file included from /Users/buildslave/jenkins/workspace/lldb-cmake/lldb-build/bin/../include/c++/v1/sstream:173: /Users/buildslave/jenkins/workspace/lldb-cmake/lldb-build/bin/../include/c++/v1/ostream:1038:45: error: no template named 'enable_if_t'; did you mean 'enable_if'? template <class _Stream, class _Tp, class = enable_if_t< ^ /Users/buildslave/jenkins/workspace/lldb-cmake/lldb-build/bin/../include/c++/v1/type_traits:538:63: note: 'enable_if' declared here template <bool, class _Tp = void> struct _LIBCPP_TEMPLATE_VIS enable_if {}; ^ While building module 'std' imported from /Users/buildslave/jenkins/workspace/lldb-cmake/llvm-project/lldb/test/API/functionalities/data-formatter/data-formatter-disabling/main.cpp:1: In file included from <module-includes>:31: In file included from /Users/buildslave/jenkins/workspace/lldb-cmake/lldb-build/bin/../include/c++/v1/complex.h:28: In file included from /Users/buildslave/jenkins/workspace/lldb-cmake/lldb-build/bin/../include/c++/v1/ccomplex:20: In file included from /Users/buildslave/jenkins/workspace/lldb-cmake/lldb-build/bin/../include/c++/v1/complex:247: In file included from /Users/buildslave/jenkins/workspace/lldb-cmake/lldb-build/bin/../include/c++/v1/sstream:174: /Users/buildslave/jenkins/workspace/lldb-cmake/lldb-build/bin/../include/c++/v1/istream:1389:45: error: no template named 'enable_if_t'; did you mean 'enable_if'? template <class _Stream, class _Tp, class = enable_if_t< ^ /Users/buildslave/jenkins/workspace/lldb-cmake/lldb-build/bin/../include/c++/v1/type_traits:538:63: note: 'enable_if' declared here template <bool, class _Tp = void> struct _LIBCPP_TEMPLATE_VIS enable_if {}; ^ /Users/buildslave/jenkins/workspace/lldb-cmake/llvm-project/lldb/test/API/functionalities/data-formatter/data-formatter-disabling/main.cpp:1:10: fatal error: could not build module 'std' #include <vector> ~~~~~~~~^ 3 errors generated. /Users/buildslave/jenkins/workspace/lldb-cmake/lldb-build/bin/clang -fmodules -gmodules -fmodules-cache-path=/Users/buildslave/jenkins/workspace/lldb-cmake/lldb-build/lldb-test-build.noindex/module-cache-clang/lldb-api -gmodules -fcxx-modules -std=c++11 -g -O0 -fno-builtin -isysroot "/Applications/Xcode.app/Contents/Developer/Platforms/MacOSX.platform/Developer/SDKs/MacOSX10.15.sdk" -arch x86_64 -I/Users/buildslave/jenkins/workspace/lldb-cmake/llvm-project/lldb/packages/Python/lldbsuite/test/make/../../../../../include -I/Users/buildslave/jenkins/workspace/lldb-cmake/llvm-project/lldb/test/API/functionalities/data-formatter/data-formatter-disabling -I/Users/buildslave/jenkins/workspace/lldb-cmake/llvm-project/lldb/packages/Python/lldbsuite/test/make -include /Users/buildslave/jenkins/workspace/lldb-cmake/llvm-project/lldb/packages/Python/lldbsuite/test/make/test_common.h -fno-limit-debug-info -fmodules -gmodules -fmodules-cache-path=/Users/buildslave/jenkins/workspace/lldb-cmake/lldb-build/lldb-test-build.noindex/module-cache-clang/lldb-api -gmodules -fcxx-modules --driver-mode=g++ -c -o main.o /Users/buildslave/jenkins/workspace/lldb-cmake/llvm-project/lldb/test/API/functionalities/data-formatter/data-formatter-disabling/main.cpp While building module 'std' imported from /Users/buildslave/jenkins/workspace/lldb-cmake/llvm-project/lldb/test/API/functionalities/data-formatter/data-formatter-disabling/main.cpp:1: In file included from <module-includes>:31: In file included from /Users/buildslave/jenkins/workspace/lldb-cmake/lldb-build/bin/../include/c++/v1/complex.h:28: In file included from /Users/buildslave/jenkins/workspace/lldb-cmake/lldb-build/bin/../include/c++/v1/ccomplex:20: In file included from /Users/buildslave/jenkins/workspace/lldb-cmake/lldb-build/bin/../include/c++/v1/complex:247: In file included from /Users/buildslave/jenkins/workspace/lldb-cmake/lldb-build/bin/../include/c++/v1/sstream:173: /Users/buildslave/jenkins/workspace/lldb-cmake/lldb-build/bin/../include/c++/v1/ostream:1038:45: error: no template named 'enable_if_t'; did you mean 'enable_if'? template <class _Stream, class _Tp, class = enable_if_t< ^ /Users/buildslave/jenkins/workspace/lldb-cmake/lldb-build/bin/../include/c++/v1/type_traits:538:63: note: 'enable_if' declared here template <bool, class _Tp = void> struct _LIBCPP_TEMPLATE_VIS enable_if {}; ^ While building module 'std' imported from /Users/buildslave/jenkins/workspace/lldb-cmake/llvm-project/lldb/test/API/functionalities/data-formatter/data-formatter-disabling/main.cpp:1: In file included from <module-includes>:31: In file included from /Users/buildslave/jenkins/workspace/lldb-cmake/lldb-build/bin/../include/c++/v1/complex.h:28: In file included from /Users/buildslave/jenkins/workspace/lldb-cmake/lldb-build/bin/../include/c++/v1/ccomplex:20: In file included from /Users/buildslave/jenkins/workspace/lldb-cmake/lldb-build/bin/../include/c++/v1/complex:247: In file included from /Users/buildslave/jenkins/workspace/lldb-cmake/lldb-build/bin/../include/c++/v1/sstream:174: /Users/buildslave/jenkins/workspace/lldb-cmake/lldb-build/bin/../include/c++/v1/istream:1389:45: error: no template named 'enable_if_t'; did you mean 'enable_if'? template <class _Stream, class _Tp, class = enable_if_t< ^ /Users/buildslave/jenkins/workspace/lldb-cmake/lldb-build/bin/../include/c++/v1/type_traits:538:63: note: 'enable_if' declared here template <bool, class _Tp = void> struct _LIBCPP_TEMPLATE_VIS enable_if {}; ^ /Users/buildslave/jenkins/workspace/lldb-cmake/llvm-project/lldb/test/API/functionalities/data-formatter/data-formatter-disabling/main.cpp:1:10: fatal error: could not build module 'std' #include <vector> ~~~~~~~~^ 3 errors generated. make: *** [main.o] Error 1

Hide Details

Test Directory: /Users/buildslave/jenkins/workspace/lldb-cmake/llvm-project/lldb/test/API/functionalities/data-formatter/data-formatter-disabling ---------------------------------------------------------------------- Ran 4 tests in 9.171s

Hide Details

RESULT: FAILED (2 passes, 0 failures, 1 errors, 1 skipped, 0 expected failures, 0 unexpected successes)

Hide Details

--

Hide Details

******************** PASS: lldb-unit :: Language/CLanguages/./LanguageCLanguagesTests/CLanguages.LookupCLanguagesByLanguageType (2132 of 2150) PASS: lldb-api :: functionalities/gdb_remote_client/TestqOffsets.py (2133 of 2150) PASS: lldb-api :: functionalities/signal/handle-abrt/TestHandleAbort.py (2134 of 2150) PASS: lldb-unit :: Instruction/./EmulatorTests/TestAArch64Emulator.TestOverflow (2135 of 2150) PASS: lldb-unit :: ObjectFile/MachO/./ObjectFileMachOTests/ObjectFileMachOTest.ModuleFromSharedCacheInfo (2136 of 2150) PASS: lldb-api :: commands/expression/deleting-implicit-copy-constructor/TestDeletingImplicitCopyConstructor.py (2137 of 2150) PASS: lldb-unit :: Expression/./ExpressionTests/DiagnosticManagerTest.GetStringNoDiags (2138 of 2150) UNSUPPORTED: lldb-api :: functionalities/darwin_log/filter/regex/activity-chain/TestDarwinLogFilterRegexActivityChain.py (2139 of 2150) PASS: lldb-unit :: Utility/./UtilityTests/LogTest.Register (2140 of 2150) PASS: lldb-shell :: ObjectFile/wasm/unified-debug-sections.yaml (2141 of 2150) PASS: lldb-unit :: Utility/./UtilityTests/ArchSpecTest.TripleComponentsWereSpecified (2142 of 2150) PASS: lldb-shell :: ObjectFile/ELF/short-build-id.yaml (2143 of 2150) FAIL: lldb-api :: commands/expression/call-function/TestCallUserDefinedFunction.py (2144 of 2150) ******************** TEST 'lldb-api :: commands/expression/call-function/TestCallUserDefinedFunction.py' FAILED ******************** Script: -- /usr/local/Frameworks/Python.framework/Versions/3.7/bin/python3.7 /Users/buildslave/jenkins/workspace/lldb-cmake/llvm-project/lldb/test/API/dotest.py -s /Users/buildslave/jenkins/workspace/lldb-cmake/lldb-build/lldb-test-traces -S nm -u CXXFLAGS -u CFLAGS --codesign-identity - --server /Users/buildslave/jenkins/workspace/lldb-cmake/lldb-build/./bin/debugserver --arch x86_64 --build-dir /Users/buildslave/jenkins/workspace/lldb-cmake/lldb-build/lldb-test-build.noindex -s=/Users/buildslave/jenkins/workspace/lldb-cmake/test/logs -t --env TERM=vt100 --env LLVM_LIBS_DIR=/Users/buildslave/jenkins/workspace/lldb-cmake/lldb-build/./lib --arch x86_64 --build-dir /Users/buildslave/jenkins/workspace/lldb-cmake/lldb-build/lldb-test-build.noindex --lldb-module-cache-dir /Users/buildslave/jenkins/workspace/lldb-cmake/lldb-build/lldb-test-build.noindex/module-cache-lldb/lldb-api --clang-module-cache-dir /Users/buildslave/jenkins/workspace/lldb-cmake/lldb-build/lldb-test-build.noindex/module-cache-clang/lldb-api --executable /Users/buildslave/jenkins/workspace/lldb-cmake/lldb-build/./bin/lldb --compiler /Users/buildslave/jenkins/workspace/lldb-cmake/lldb-build/./bin/clang --dsymutil /Users/buildslave/jenkins/workspace/lldb-cmake/lldb-build/./bin/dsymutil --filecheck /Users/buildslave/jenkins/workspace/lldb-cmake/lldb-build/./bin/FileCheck --yaml2obj /Users/buildslave/jenkins/workspace/lldb-cmake/lldb-build/./bin/yaml2obj --lldb-libs-dir /Users/buildslave/jenkins/workspace/lldb-cmake/lldb-build/./lib /Users/buildslave/jenkins/workspace/lldb-cmake/llvm-project/lldb/test/API/commands/expression/call-function -p TestCallUserDefinedFunction.py -- Exit Code: 1

Hide Details

Command Output (stdout): -- lldb version 12.0.99 clang revision 71be8809d01f0199032242b9f11d6a7a471183fd llvm revision 71be8809d01f0199032242b9f11d6a7a471183fd libstdcxx tests will not be run because: Don't know how to build with libstdcxx on macosx Skipping following debug info categories: ['dwo']

Hide Details

-- Command Output (stderr): --

Hide Details

Session logs for test failures/errors/unexpected successes will go into directory '/Users/buildslave/jenkins/workspace/lldb-cmake/test/logs' Change dir to: /Users/buildslave/jenkins/workspace/lldb-cmake/llvm-project/lldb/test/API/commands/expression/call-function runCmd: settings clear -all output:

Hide Details

runCmd: settings set symbols.enable-external-lookup false output:

Hide Details

runCmd: settings set target.inherit-tcc true output:

Hide Details

runCmd: settings set target.auto-apply-fixits false output:

Hide Details

runCmd: settings set plugin.process.gdb-remote.packet-timeout 60 output:

Hide Details

runCmd: settings set symbols.clang-modules-cache-path "/Users/buildslave/jenkins/workspace/lldb-cmake/lldb-build/lldb-test-build.noindex/module-cache-lldb/lldb-api" output:

Hide Details

runCmd: settings set use-color false output:

Hide Details

runCmd: setting set target.prefer-dynamic-value no-dynamic-values output:

Hide Details

<bound method SBProcess.Kill of <lldb.SBProcess; proxy of <Swig Object of type 'lldb::SBProcess *' at 0x112a2bb10> >>: success

Hide Details

PASS: LLDB (/Users/buildslave/jenkins/workspace/lldb-cmake/lldb-build/bin/clang-x86_64) :: test_dsym (TestCallUserDefinedFunction.ExprCommandCallUserDefinedFunction) runCmd: settings clear -all output:

Hide Details

runCmd: settings set symbols.enable-external-lookup false output:

Hide Details

runCmd: settings set target.inherit-tcc true output:

Hide Details

runCmd: settings set target.auto-apply-fixits false output:

Hide Details

runCmd: settings set plugin.process.gdb-remote.packet-timeout 60 output:

Hide Details

runCmd: settings set symbols.clang-modules-cache-path "/Users/buildslave/jenkins/workspace/lldb-cmake/lldb-build/lldb-test-build.noindex/module-cache-lldb/lldb-api" output:

Hide Details

runCmd: settings set use-color false output:

Hide Details

runCmd: setting set target.prefer-dynamic-value no-dynamic-values output:

Hide Details

<bound method SBProcess.Kill of <lldb.SBProcess; proxy of <Swig Object of type 'lldb::SBProcess *' at 0x10af0a660> >>: success

Hide Details

PASS: LLDB (/Users/buildslave/jenkins/workspace/lldb-cmake/lldb-build/bin/clang-x86_64) :: test_dwarf (TestCallUserDefinedFunction.ExprCommandCallUserDefinedFunction) UNSUPPORTED: LLDB (/Users/buildslave/jenkins/workspace/lldb-cmake/lldb-build/bin/clang-x86_64) :: test_dwo (TestCallUserDefinedFunction.ExprCommandCallUserDefinedFunction) (test case does not fall in any category of interest for this run) runCmd: settings clear -all output:

Hide Details

runCmd: settings set symbols.enable-external-lookup false output:

Hide Details

runCmd: settings set target.inherit-tcc true output:

Hide Details

runCmd: settings set target.auto-apply-fixits false output:

Hide Details

runCmd: settings set plugin.process.gdb-remote.packet-timeout 60 output:

Hide Details

runCmd: settings set symbols.clang-modules-cache-path "/Users/buildslave/jenkins/workspace/lldb-cmake/lldb-build/lldb-test-build.noindex/module-cache-lldb/lldb-api" output:

Hide Details

runCmd: settings set use-color false output:

Hide Details

runCmd: setting set target.prefer-dynamic-value no-dynamic-values output:

Hide Details

FAIL: LLDB (/Users/buildslave/jenkins/workspace/lldb-cmake/lldb-build/bin/clang-x86_64) :: test_gmodules (TestCallUserDefinedFunction.ExprCommandCallUserDefinedFunction) Restore dir to: /Users/buildslave/jenkins/workspace/lldb-cmake/lldb-build/tools/lldb/test ====================================================================== ERROR: test_gmodules (TestCallUserDefinedFunction.ExprCommandCallUserDefinedFunction) Test return values of user defined function calls. ---------------------------------------------------------------------- Error when building test subject.

Hide Details

Build Command: make VPATH=/Users/buildslave/jenkins/workspace/lldb-cmake/llvm-project/lldb/test/API/commands/expression/call-function -C /Users/buildslave/jenkins/workspace/lldb-cmake/lldb-build/lldb-test-build.noindex/commands/expression/call-function/TestCallUserDefinedFunction.test_gmodules -I /Users/buildslave/jenkins/workspace/lldb-cmake/llvm-project/lldb/test/API/commands/expression/call-function -I /Users/buildslave/jenkins/workspace/lldb-cmake/llvm-project/lldb/packages/Python/lldbsuite/test/make -f /Users/buildslave/jenkins/workspace/lldb-cmake/llvm-project/lldb/test/API/commands/expression/call-function/Makefile MAKE_DSYM=NO MAKE_GMODULES=YES ARCH=x86_64 CC="/Users/buildslave/jenkins/workspace/lldb-cmake/lldb-build/bin/clang" DSYMUTIL="/Users/buildslave/jenkins/workspace/lldb-cmake/lldb-build/./bin/dsymutil" CLANG_MODULE_CACHE_DIR=/Users/buildslave/jenkins/workspace/lldb-cmake/lldb-build/lldb-test-build.noindex/module-cache-clang/lldb-api

Hide Details

Build Command Output: While building module 'std' imported from /Users/buildslave/jenkins/workspace/lldb-cmake/llvm-project/lldb/test/API/commands/expression/call-function/main.cpp:1: In file included from <module-includes>:31: In file included from /Users/buildslave/jenkins/workspace/lldb-cmake/lldb-build/bin/../include/c++/v1/complex.h:28: In file included from /Users/buildslave/jenkins/workspace/lldb-cmake/lldb-build/bin/../include/c++/v1/ccomplex:20: In file included from /Users/buildslave/jenkins/workspace/lldb-cmake/lldb-build/bin/../include/c++/v1/complex:247: In file included from /Users/buildslave/jenkins/workspace/lldb-cmake/lldb-build/bin/../include/c++/v1/sstream:173: /Users/buildslave/jenkins/workspace/lldb-cmake/lldb-build/bin/../include/c++/v1/ostream:1038:45: error: no template named 'enable_if_t'; did you mean 'enable_if'? template <class _Stream, class _Tp, class = enable_if_t< ^ /Users/buildslave/jenkins/workspace/lldb-cmake/lldb-build/bin/../include/c++/v1/type_traits:538:63: note: 'enable_if' declared here template <bool, class _Tp = void> struct _LIBCPP_TEMPLATE_VIS enable_if {}; ^ While building module 'std' imported from /Users/buildslave/jenkins/workspace/lldb-cmake/llvm-project/lldb/test/API/commands/expression/call-function/main.cpp:1: In file included from <module-includes>:31: In file included from /Users/buildslave/jenkins/workspace/lldb-cmake/lldb-build/bin/../include/c++/v1/complex.h:28: In file included from /Users/buildslave/jenkins/workspace/lldb-cmake/lldb-build/bin/../include/c++/v1/ccomplex:20: In file included from /Users/buildslave/jenkins/workspace/lldb-cmake/lldb-build/bin/../include/c++/v1/complex:247: In file included from /Users/buildslave/jenkins/workspace/lldb-cmake/lldb-build/bin/../include/c++/v1/sstream:174: /Users/buildslave/jenkins/workspace/lldb-cmake/lldb-build/bin/../include/c++/v1/istream:1389:45: error: no template named 'enable_if_t'; did you mean 'enable_if'? template <class _Stream, class _Tp, class = enable_if_t< ^ /Users/buildslave/jenkins/workspace/lldb-cmake/lldb-build/bin/../include/c++/v1/type_traits:538:63: note: 'enable_if' declared here template <bool, class _Tp = void> struct _LIBCPP_TEMPLATE_VIS enable_if {}; ^ /Users/buildslave/jenkins/workspace/lldb-cmake/llvm-project/lldb/test/API/commands/expression/call-function/main.cpp:1:10: fatal error: could not build module 'std' #include <cstring> ~~~~~~~~^ 3 errors generated. /Users/buildslave/jenkins/workspace/lldb-cmake/lldb-build/bin/clang -fmodules -gmodules -fmodules-cache-path=/Users/buildslave/jenkins/workspace/lldb-cmake/lldb-build/lldb-test-build.noindex/module-cache-clang/lldb-api -gmodules -fcxx-modules -std=c++11 -g -O0 -fno-builtin -isysroot "/Applications/Xcode.app/Contents/Developer/Platforms/MacOSX.platform/Developer/SDKs/MacOSX10.15.sdk" -arch x86_64 -I/Users/buildslave/jenkins/workspace/lldb-cmake/llvm-project/lldb/packages/Python/lldbsuite/test/make/../../../../../include -I/Users/buildslave/jenkins/workspace/lldb-cmake/llvm-project/lldb/test/API/commands/expression/call-function -I/Users/buildslave/jenkins/workspace/lldb-cmake/llvm-project/lldb/packages/Python/lldbsuite/test/make -include /Users/buildslave/jenkins/workspace/lldb-cmake/llvm-project/lldb/packages/Python/lldbsuite/test/make/test_common.h -fno-limit-debug-info -fmodules -gmodules -fmodules-cache-path=/Users/buildslave/jenkins/workspace/lldb-cmake/lldb-build/lldb-test-build.noindex/module-cache-clang/lldb-api -gmodules -fcxx-modules --driver-mode=g++ -c -o main.o /Users/buildslave/jenkins/workspace/lldb-cmake/llvm-project/lldb/test/API/commands/expression/call-function/main.cpp While building module 'std' imported from /Users/buildslave/jenkins/workspace/lldb-cmake/llvm-project/lldb/test/API/commands/expression/call-function/main.cpp:1: In file included from <module-includes>:31: In file included from /Users/buildslave/jenkins/workspace/lldb-cmake/lldb-build/bin/../include/c++/v1/complex.h:28: In file included from /Users/buildslave/jenkins/workspace/lldb-cmake/lldb-build/bin/../include/c++/v1/ccomplex:20: In file included from /Users/buildslave/jenkins/workspace/lldb-cmake/lldb-build/bin/../include/c++/v1/complex:247: In file included from /Users/buildslave/jenkins/workspace/lldb-cmake/lldb-build/bin/../include/c++/v1/sstream:173: /Users/buildslave/jenkins/workspace/lldb-cmake/lldb-build/bin/../include/c++/v1/ostream:1038:45: error: no template named 'enable_if_t'; did you mean 'enable_if'? template <class _Stream, class _Tp, class = enable_if_t< ^ /Users/buildslave/jenkins/workspace/lldb-cmake/lldb-build/bin/../include/c++/v1/type_traits:538:63: note: 'enable_if' declared here template <bool, class _Tp = void> struct _LIBCPP_TEMPLATE_VIS enable_if {}; ^ While building module 'std' imported from /Users/buildslave/jenkins/workspace/lldb-cmake/llvm-project/lldb/test/API/commands/expression/call-function/main.cpp:1: In file included from <module-includes>:31: In file included from /Users/buildslave/jenkins/workspace/lldb-cmake/lldb-build/bin/../include/c++/v1/complex.h:28: In file included from /Users/buildslave/jenkins/workspace/lldb-cmake/lldb-build/bin/../include/c++/v1/ccomplex:20: In file included from /Users/buildslave/jenkins/workspace/lldb-cmake/lldb-build/bin/../include/c++/v1/complex:247: In file included from /Users/buildslave/jenkins/workspace/lldb-cmake/lldb-build/bin/../include/c++/v1/sstream:174: /Users/buildslave/jenkins/workspace/lldb-cmake/lldb-build/bin/../include/c++/v1/istream:1389:45: error: no template named 'enable_if_t'; did you mean 'enable_if'? template <class _Stream, class _Tp, class = enable_if_t< ^ /Users/buildslave/jenkins/workspace/lldb-cmake/lldb-build/bin/../include/c++/v1/type_traits:538:63: note: 'enable_if' declared here template <bool, class _Tp = void> struct _LIBCPP_TEMPLATE_VIS enable_if {}; ^ /Users/buildslave/jenkins/workspace/lldb-cmake/llvm-project/lldb/test/API/commands/expression/call-function/main.cpp:1:10: fatal error: could not build module 'std' #include <cstring> ~~~~~~~~^ 3 errors generated. make: *** [main.o] Error 1

Hide Details

Test Directory: /Users/buildslave/jenkins/workspace/lldb-cmake/llvm-project/lldb/test/API/commands/expression/call-function ---------------------------------------------------------------------- Ran 4 tests in 11.245s

Hide Details

RESULT: FAILED (2 passes, 0 failures, 1 errors, 1 skipped, 0 expected failures, 0 unexpected successes)

Hide Details

--

Hide Details

******************** PASS: lldb-api :: functionalities/tail_call_frames/inlining_and_tail_calls/TestInliningAndTailCalls.py (2145 of 2150) FAIL: lldb-api :: commands/expression/import-std-module/pair/TestPairFromStdModule.py (2146 of 2150) ******************** TEST 'lldb-api :: commands/expression/import-std-module/pair/TestPairFromStdModule.py' FAILED ******************** Script: -- /usr/local/Frameworks/Python.framework/Versions/3.7/bin/python3.7 /Users/buildslave/jenkins/workspace/lldb-cmake/llvm-project/lldb/test/API/dotest.py -s /Users/buildslave/jenkins/workspace/lldb-cmake/lldb-build/lldb-test-traces -S nm -u CXXFLAGS -u CFLAGS --codesign-identity - --server /Users/buildslave/jenkins/workspace/lldb-cmake/lldb-build/./bin/debugserver --arch x86_64 --build-dir /Users/buildslave/jenkins/workspace/lldb-cmake/lldb-build/lldb-test-build.noindex -s=/Users/buildslave/jenkins/workspace/lldb-cmake/test/logs -t --env TERM=vt100 --env LLVM_LIBS_DIR=/Users/buildslave/jenkins/workspace/lldb-cmake/lldb-build/./lib --arch x86_64 --build-dir /Users/buildslave/jenkins/workspace/lldb-cmake/lldb-build/lldb-test-build.noindex --lldb-module-cache-dir /Users/buildslave/jenkins/workspace/lldb-cmake/lldb-build/lldb-test-build.noindex/module-cache-lldb/lldb-api --clang-module-cache-dir /Users/buildslave/jenkins/workspace/lldb-cmake/lldb-build/lldb-test-build.noindex/module-cache-clang/lldb-api --executable /Users/buildslave/jenkins/workspace/lldb-cmake/lldb-build/./bin/lldb --compiler /Users/buildslave/jenkins/workspace/lldb-cmake/lldb-build/./bin/clang --dsymutil /Users/buildslave/jenkins/workspace/lldb-cmake/lldb-build/./bin/dsymutil --filecheck /Users/buildslave/jenkins/workspace/lldb-cmake/lldb-build/./bin/FileCheck --yaml2obj /Users/buildslave/jenkins/workspace/lldb-cmake/lldb-build/./bin/yaml2obj --lldb-libs-dir /Users/buildslave/jenkins/workspace/lldb-cmake/lldb-build/./lib /Users/buildslave/jenkins/workspace/lldb-cmake/llvm-project/lldb/test/API/commands/expression/import-std-module/pair -p TestPairFromStdModule.py -- Exit Code: -6

Hide Details

Command Output (stdout): -- lldb version 12.0.99 clang revision 71be8809d01f0199032242b9f11d6a7a471183fd llvm revision 71be8809d01f0199032242b9f11d6a7a471183fd

Hide Details

-- Command Output (stderr): -- Assertion failed: (0 && "Invalid SLocOffset or bad function choice"), function getFileIDLoaded, file /Users/buildslave/jenkins/workspace/lldb-cmake/llvm-project/clang/lib/Basic/SourceManager.cpp, line 917.

Hide Details

--

Hide Details

******************** PASS: lldb-api :: functionalities/plugins/python_os_plugin/TestPythonOSPlugin.py (2147 of 2150) PASS: lldb-api :: driver/batch_mode/TestBatchMode.py (2148 of 2150) PASS: lldb-api :: functionalities/tsan/thread_numbers/TestTsanThreadNumbers.py (2149 of 2150) PASS: lldb-api :: functionalities/data-formatter/data-formatter-objc/TestDataFormatterObjCNSError.py (2150 of 2150) Slowest Tests: -------------------------------------------------------------------------- 342.43s: lldb-api :: macosx/simulator/TestSimulatorPlatform.py 199.32s: lldb-api :: lang/cpp/namespace/TestNamespaceLookup.py 131.11s: lldb-api :: python_api/formatters/TestFormattersSBAPI.py 128.74s: lldb-api :: commands/expression/anonymous-struct/TestCallUserAnonTypedef.py 122.25s: lldb-api :: lang/c/complex_int/TestComplexInt.py 108.34s: lldb-api :: functionalities/gdb_remote_client/TestThreadSelectionBug.py 107.97s: lldb-api :: lang/cpp/namespace/TestNamespace.py 98.33s: lldb-api :: tools/lldb-server/TestLldbGdbServer.py 86.46s: lldb-api :: types/TestLongTypesExpr.py 78.35s: lldb-api :: lang/objc/exceptions/TestObjCExceptions.py 72.13s: lldb-api :: functionalities/mtc/simple/TestMTCSimple.py 67.98s: lldb-api :: functionalities/gdb_remote_client/TestRegDefinitionInParts.py 65.07s: lldb-api :: functionalities/thread/step_out/TestThreadStepOut.py 63.57s: lldb-api :: types/TestLongTypes.py 63.14s: lldb-api :: types/TestCharType.py 55.33s: lldb-api :: lang/objc/hidden-ivars/TestHiddenIvars.py 54.20s: lldb-api :: types/TestIntegerTypeExpr.py 52.95s: lldb-shell :: Minidump/Windows/arm-fp-unwind.test 52.07s: lldb-api :: functionalities/load_unload/TestLoadUnload.py 51.46s: lldb-api :: lang/objc/foundation/TestObjCMethods.py

Hide Details

Tests Times: -------------------------------------------------------------------------- [ Range ] :: [ Percentage ] :: [ Count ] -------------------------------------------------------------------------- [340s,360s) :: [ ] :: [ 1/2150] [320s,340s) :: [ ] :: [ 0/2150] [300s,320s) :: [ ] :: [ 0/2150] [280s,300s) :: [ ] :: [ 0/2150] [260s,280s) :: [ ] :: [ 0/2150] [240s,260s) :: [ ] :: [ 0/2150] [220s,240s) :: [ ] :: [ 0/2150] [200s,220s) :: [ ] :: [ 1/2150] [180s,200s) :: [ ] :: [ 0/2150] [160s,180s) :: [ ] :: [ 0/2150] [140s,160s) :: [ ] :: [ 0/2150] [120s,140s) :: [ ] :: [ 3/2150] [100s,120s) :: [ ] :: [ 3/2150] [ 80s,100s) :: [ ] :: [ 2/2150] [ 60s, 80s) :: [ ] :: [ 5/2150] [ 40s, 60s) :: [ ] :: [ 14/2150] [ 20s, 40s) :: [ ] :: [ 41/2150] [ 0s, 20s) :: [************************************** ] :: [2080/2150] -------------------------------------------------------------------------- ******************** Failed Tests (137): lldb-api :: functionalities/gdb_remote_client/TestThreadSelectionBug.py lldb-api :: functionalities/thread/exit_during_break/TestExitDuringBreak.py lldb-api :: functionalities/type_completion/TestTypeCompletion.py lldb-api :: commands/expression/formatters/TestFormatters.py lldb-api :: functionalities/type_lookup/TestTypeLookup.py lldb-api :: lang/objc/exceptions/TestObjCExceptions.py lldb-api :: commands/frame/diagnose/inheritance/TestDiagnoseInheritance.py lldb-api :: commands/expression/namespace_local_var_same_name_obj_c/TestNamespaceLocalVarSameNameObjC.py lldb-api :: lang/objc/objc++/TestObjCXX.py lldb-api :: lang/cpp/wchar_t/TestCxxWCharT.py lldb-api :: functionalities/data-formatter/parray/TestPrintArray.py lldb-api :: functionalities/breakpoint/cpp_exception/TestCPPExceptionBreakpoint.py lldb-api :: types/TestIntegerTypeExpr.py lldb-api :: types/TestLongTypesExpr.py lldb-api :: functionalities/data-formatter/data-formatter-smart-array/TestDataFormatterSmartArray.py lldb-api :: commands/expression/import-std-module/shared_ptr/TestSharedPtrFromStdModule.py lldb-api :: functionalities/data-formatter/data-formatter-stl/libcxx/atomic/TestLibCxxAtomic.py lldb-api :: commands/expression/vector_of_enums/TestVectorOfEnums.py lldb-api :: commands/log/basic/TestLogging.py lldb-api :: functionalities/data-formatter/data-formatter-stl/libcxx/queue/TestDataFormatterLibcxxQueue.py lldb-api :: commands/expression/import-std-module/unique_ptr/TestUniquePtrFromStdModule.py lldb-api :: types/TestFloatTypes.py lldb-api :: types/TestDoubleTypesExpr.py lldb-api :: commands/expression/timeout/TestCallWithTimeout.py lldb-api :: functionalities/data-formatter/data-formatter-script/TestDataFormatterScript.py lldb-api :: functionalities/completion/TestCompletion.py lldb-api :: lang/cpp/class_types/TestClassTypesDisassembly.py lldb-api :: functionalities/thread/thread_exit/TestThreadExit.py lldb-api :: commands/expression/call-function/TestCallStdStringFunction.py lldb-api :: commands/expression/import-std-module/forward_list-dbg-info-content/TestDbgInfoContentForwardListFromStdModule.py lldb-api :: functionalities/data-formatter/data-formatter-stl/libcxx/multimap/TestDataFormatterLibccMultiMap.py lldb-api :: functionalities/data-formatter/data-formatter-categories/TestDataFormatterCategories.py lldb-api :: commands/expression/import-std-module/vector/TestVectorFromStdModule.py lldb-api :: functionalities/memory/find/TestMemoryFind.py lldb-api :: functionalities/breakpoint/cpp/TestCPPBreakpointLocations.py lldb-api :: lang/cpp/stl/TestStdCXXDisassembly.py lldb-api :: lang/cpp/operators/TestCppOperators.py lldb-api :: python_api/process/TestProcessAPI.py lldb-api :: python_api/lldbutil/iter/TestLLDBIterator.py lldb-api :: functionalities/data-formatter/boolreference/TestFormattersBoolRefPtr.py lldb-api :: lang/cpp/char1632_t/TestChar1632T.py lldb-api :: functionalities/deleted-executable/TestDeletedExecutable.py lldb-api :: python_api/sbvalue_const_addrof/TestSBValueConstAddrOf.py lldb-api :: functionalities/dynamic_value_child_count/TestDynamicValueChildCount.py lldb-api :: commands/expression/call-function/TestCallStopAndContinue.py lldb-api :: functionalities/data-formatter/data-formatter-stl/libcxx/tuple/TestDataFormatterLibcxxTuple.py lldb-api :: lang/cpp/stl/TestSTL.py lldb-api :: functionalities/breakpoint/inlined_breakpoints/TestInlinedBreakpoints.py lldb-api :: commands/expression/static-initializers/TestStaticInitializers.py lldb-api :: functionalities/thread/state_after_expression/TestStateAfterExpression.py lldb-api :: functionalities/data-formatter/data-formatter-stl/libcxx/multiset/TestDataFormatterLibcxxMultiSet.py lldb-api :: functionalities/data-formatter/data-formatter-stl/libcxx/iterator/TestDataFormatterLibccIterator.py lldb-api :: functionalities/data-formatter/data-formatter-advanced/TestDataFormatterAdv.py lldb-api :: lang/cpp/bitfields/TestCppBitfields.py lldb-api :: commands/expression/import-std-module/unique_ptr-dbg-info-content/TestUniquePtrDbgInfoContent.py lldb-api :: commands/expression/import-std-module/list/TestListFromStdModule.py lldb-api :: functionalities/data-formatter/data-formatter-stl/libcxx/map/TestDataFormatterLibccMap.py lldb-api :: functionalities/inline-stepping/TestInlineStepping.py lldb-api :: commands/expression/import-std-module/vector-dbg-info-content/TestDbgInfoContentVectorFromStdModule.py lldb-api :: commands/expression/import-std-module/vector-of-vectors/TestVectorOfVectorsFromStdModule.py lldb-api :: commands/expression/import-std-module/stack/TestStackFromStdModule.py lldb-api :: api/multithreaded/TestMultithreaded.py lldb-api :: functionalities/data-formatter/data-formatter-stl/libcxx/forward_list/TestDataFormatterLibcxxForwardList.py lldb-api :: commands/expression/no-deadlock/TestExprDoesntBlock.py lldb-api :: python_api/exprpath_synthetic/TestExprPathSynthetic.py lldb-api :: functionalities/data-formatter/data-formatter-stl/libcxx/initializerlist/TestInitializerList.py lldb-api :: functionalities/memory-region/TestMemoryRegion.py lldb-api :: types/TestDoubleTypes.py lldb-api :: lang/cpp/extern_c/TestExternCSymbols.py lldb-api :: python_api/watchpoint/watchlocation/TestSetWatchlocation.py lldb-api :: functionalities/data-formatter/data-formatter-stl/libcxx/string/TestDataFormatterLibcxxString.py lldb-api :: commands/command/script/TestCommandScript.py lldb-api :: functionalities/data-formatter/stringprinter/TestStringPrinter.py lldb-api :: types/TestFloatTypesExpr.py lldb-api :: functionalities/data-formatter/data-formatter-stl/libcxx/function/TestLibCxxFunction.py lldb-api :: functionalities/data-formatter/data-formatter-stl/libcxx/unordered/TestDataFormatterUnordered.py lldb-api :: commands/expression/import-std-module/deque-basic/TestDequeFromStdModule.py lldb-api :: tools/lldb-server/inferior-crash/TestGdbRemoteAbort.py lldb-api :: functionalities/data-formatter/data-formatter-stl/libcxx/set/TestDataFormatterLibcxxSet.py lldb-api :: lang/cpp/exceptions/TestCPPExceptionBreakpoints.py lldb-api :: functionalities/data-formatter/data-formatter-stl/libcxx/vector/TestDataFormatterLibcxxVector.py lldb-api :: commands/expression/import-std-module/conflicts/TestStdModuleWithConflicts.py lldb-api :: commands/expression/import-std-module/basic/TestImportStdModule.py lldb-api :: python_api/class_members/TestSBTypeClassMembers.py lldb-shell :: Process/TestEnvironment.test lldb-api :: tools/lldb-server/inferior-crash/TestGdbRemoteSegFault.py lldb-api :: functionalities/breakpoint/breakpoint_ids/TestBreakpointIDs.py lldb-api :: lang/cpp/namespace/TestNamespaceLookup.py lldb-api :: lang/cpp/namespace/TestNamespace.py lldb-api :: functionalities/thread/step_out/TestThreadStepOut.py lldb-api :: lang/c/step_over_no_deadlock/TestStepOverDoesntBlock.py lldb-api :: types/TestCharType.py lldb-api :: functionalities/data-formatter/poarray/TestPrintObjectArray.py lldb-api :: commands/expression/import-std-module/list-dbg-info-content/TestDbgInfoContentListFromStdModule.py lldb-api :: commands/expression/issue_11588/Test11588.py lldb-api :: functionalities/thread/exit_during_step/TestExitDuringStep.py lldb-api :: types/TestCharTypeExpr.py lldb-api :: lang/cpp/unique-types/TestUniqueTypes.py lldb-api :: lang/cpp/dynamic-value/TestDynamicValue.py lldb-api :: functionalities/data-formatter/compactvectors/TestCompactVectors.py lldb-api :: lang/objcxx/class-name-clash/TestNameClash.py lldb-api :: functionalities/breakpoint/breakpoint_set_restart/TestBreakpointSetRestart.py lldb-api :: functionalities/data-formatter/ostypeformatting/TestFormattersOsType.py lldb-api :: lang/cpp/breakpoint_in_member_func_w_non_primitive_params/TestBreakpointInMemberFuncWNonPrimitiveParams.py lldb-api :: commands/settings/TestSettings.py lldb-api :: types/TestShortTypeExpr.py lldb-api :: functionalities/thread/create_after_attach/TestCreateAfterAttach.py lldb-api :: commands/expression/import-std-module/shared_ptr-dbg-info-content/TestSharedPtrDbgInfoContentFromStdModule.py lldb-api :: lang/objcxx/objcxx-ivar-vector/TestIvarVector.py lldb-api :: functionalities/thread/backtrace_all/TestBacktraceAll.py lldb-api :: commands/expression/import-std-module/weak_ptr-dbg-info-content/TestDbgInfoContentWeakPtrFromStdModule.py lldb-api :: commands/expression/import-std-module/vector-bool/TestVectorBoolFromStdModule.py lldb-api :: functionalities/memory/read/TestMemoryRead.py lldb-api :: lang/cpp/class_types/TestClassTypes.py lldb-api :: functionalities/data-formatter/data-formatter-named-summaries/TestDataFormatterNamedSummaries.py lldb-api :: lang/cpp/template/TestTemplateArgs.py lldb-api :: python_api/watchpoint/watchlocation/TestTargetWatchAddress.py lldb-api :: commands/expression/expr-in-syscall/TestExpressionInSyscall.py lldb-api :: commands/expression/import-std-module/deque-dbg-info-content/TestDbgInfoContentDequeFromStdModule.py lldb-api :: types/TestLongTypes.py lldb-api :: lang/objcxx/cxx-bridged-po/TestObjCXXBridgedPO.py lldb-api :: functionalities/data-formatter/data-formatter-stl/libcxx/bitset/TestDataFormatterLibcxxBitset.py lldb-api :: functionalities/data-formatter/data-formatter-skip-summary/TestDataFormatterSkipSummary.py lldb-api :: commands/expression/import-std-module/weak_ptr/TestWeakPtrFromStdModule.py lldb-api :: types/TestShortType.py lldb-api :: functionalities/data-formatter/data-formatter-synth/TestDataFormatterSynth.py lldb-api :: lang/cpp/global_operators/TestCppGlobalOperators.py lldb-api :: python_api/lldbutil/iter/TestRegistersIterator.py lldb-api :: functionalities/breakpoint/hardware_breakpoints/hardware_breakpoint_on_multiple_threads/TestHWBreakMultiThread.py lldb-api :: commands/expression/import-std-module/forward_list/TestForwardListFromStdModule.py lldb-api :: functionalities/data-formatter/data-formatter-stl/libcxx/vbool/TestDataFormatterLibcxxVBool.py lldb-api :: types/TestIntegerType.py lldb-api :: lang/objcxx/hide-runtime-values/TestObjCXXHideRuntimeValues.py lldb-api :: functionalities/data-formatter/data-formatter-disabling/TestDataFormatterDisabling.py lldb-api :: commands/expression/call-function/TestCallUserDefinedFunction.py lldb-api :: commands/expression/import-std-module/queue/TestQueueFromStdModule.py lldb-api :: commands/expression/import-std-module/pair/TestPairFromStdModule.py

Hide Details

Hide Details

Testing Time: 2031.83s Unsupported : 152 Passed : 1855 Expectedly Failed: 6 Failed : 137 FAILED: tools/lldb/test/CMakeFiles/check-lldb-lit cd /Users/buildslave/jenkins/workspace/lldb-cmake/lldb-build/tools/lldb/test && /usr/local/Frameworks/Python.framework/Versions/3.7/bin/python3.7 /Users/buildslave/jenkins/workspace/lldb-cmake/lldb-build/./bin/llvm-lit -v --time-tests --shuffle --xunit-xml-output=/Users/buildslave/jenkins/workspace/lldb-cmake/test/results.xml -v -j 4 /Users/buildslave/jenkins/workspace/lldb-cmake/lldb-build/tools/lldb/test ninja: build stopped: subcommand failed. Command failed: Command '['/usr/bin/env', 'TERM=vt100', '/usr/local/bin/ninja', '-v', 'check-lldb']' returned non-zero exit status 1 Command: ['/usr/bin/env', 'TERM=vt100', '/usr/local/bin/ninja', '-v', 'check-lldb'] [Pipeline] } [Pipeline] // timeout [Pipeline] } [Pipeline] // stage [Pipeline] stage [Pipeline] { (Declarative: Post Actions) [Pipeline] scanForIssues [Clang (LLVM based)] Sleeping for 5 seconds due to JENKINS-32191... [Clang (LLVM based)] Parsing console log (workspace: '/Users/buildslave/jenkins/workspace/lldb-cmake') [Clang (LLVM based)] Successfully parsed console log [Clang (LLVM based)] -> found 101 issues (skipped 1737 duplicates) [Clang (LLVM based)] Post processing issues on 'green-dragon-10' with source code encoding 'UTF-8' [Clang (LLVM based)] Creating SCM blamer to obtain author and commit information for affected files [Clang (LLVM based)] Creating SCM miner to obtain statistics for affected repository files [Clang (LLVM based)] Resolving file names for all issues in source directory '/Users/buildslave/jenkins/workspace/lldb-cmake' [Clang (LLVM based)] -> resolved paths in source directory (98 found, 0 not found) [Clang (LLVM based)] Resolving module names from module definitions (build.xml, pom.xml, or Manifest.mf files) [Clang (LLVM based)] -> resolved module names for 101 issues [Clang (LLVM based)] Resolving package names (or namespaces) by parsing the affected files [Clang (LLVM based)] -> resolved package names of 98 affected files [Clang (LLVM based)] No filter has been set, publishing all 101 issues [Clang (LLVM based)] Creating fingerprints for all affected code blocks to track issues over different builds [Clang (LLVM based)] -> created fingerprints for 101 issues (skipped 0 issues) [Clang (LLVM based)] Copying affected files to Jenkins' build folder '/Users/Shared/Jenkins/Home/jobs/lldb-cmake/builds/23938/files-with-issues' [Clang (LLVM based)] -> 77 copied, 22 not in workspace, 0 not-found, 0 with I/O error [Pipeline] junit Recording test results [Pipeline] } [Pipeline] // stage [Pipeline] } [Pipeline] // withEnv [Pipeline] } [Pipeline] // node [Pipeline] End of Pipeline ERROR: script returned exit code 1 Finished: FAILURE