FailedConsole Output

Skipping 17,463 KB.. Full Log
 string:
"unsigned char"

Hide Details

Expecting sub string: "unsigned" (was found) Expecting sub string: "char" (was found)

Hide Details

looking at: (unsigned char) a_class_ref.m_a = '0'

Hide Details

Hide Details

Checking string: "(unsigned char) a_class_ref.m_a = '0' "

Hide Details

Expecting sub string: "a_class_ref.m_a = '0'" (was found)

Hide Details

runCmd: frame variable --show-types a_class_ref.m_b output: (unsigned char) a_class_ref.m_b = '9'

Hide Details

Hide Details

looking at: unsigned char

Hide Details

Checking string: "unsigned char"

Hide Details

Expecting sub string: "unsigned" (was found) Expecting sub string: "char" (was found)

Hide Details

looking at: (unsigned char) a_class_ref.m_b = '9'

Hide Details

Hide Details

Checking string: "(unsigned char) a_class_ref.m_b = '9' "

Hide Details

Expecting sub string: "a_class_ref.m_b = '9'" (was found)

Hide Details

runCmd: frame variable --show-types a_struct.a output: (unsigned char) a_struct.a = '0'

Hide Details

Hide Details

looking at: unsigned char

Hide Details

Checking string: "unsigned char"

Hide Details

Expecting sub string: "unsigned" (was found) Expecting sub string: "char" (was found)

Hide Details

looking at: (unsigned char) a_struct.a = '0'

Hide Details

Hide Details

Checking string: "(unsigned char) a_struct.a = '0' "

Hide Details

Expecting sub string: "a_struct.a = '0'" (was found)

Hide Details

runCmd: frame variable --show-types a_struct.b output: (unsigned char) a_struct.b = '9'

Hide Details

Hide Details

looking at: unsigned char

Hide Details

Checking string: "unsigned char"

Hide Details

Expecting sub string: "unsigned" (was found) Expecting sub string: "char" (was found)

Hide Details

looking at: (unsigned char) a_struct.b = '9'

Hide Details

Hide Details

Checking string: "(unsigned char) a_struct.b = '9' "

Hide Details

Expecting sub string: "a_struct.b = '9'" (was found)

Hide Details

runCmd: frame variable --show-types a_struct_ptr->a output: (unsigned char) a_struct_ptr->a = '0'

Hide Details

Hide Details

looking at: unsigned char

Hide Details

Checking string: "unsigned char"

Hide Details

Expecting sub string: "unsigned" (was found) Expecting sub string: "char" (was found)

Hide Details

looking at: (unsigned char) a_struct_ptr->a = '0'

Hide Details

Hide Details

Checking string: "(unsigned char) a_struct_ptr->a = '0' "

Hide Details

Expecting sub string: "a_struct_ptr->a = '0'" (was found)

Hide Details

runCmd: frame variable --show-types a_struct_ptr->b output: (unsigned char) a_struct_ptr->b = '9'

Hide Details

Hide Details

looking at: unsigned char

Hide Details

Checking string: "unsigned char"

Hide Details

Expecting sub string: "unsigned" (was found) Expecting sub string: "char" (was found)

Hide Details

looking at: (unsigned char) a_struct_ptr->b = '9'

Hide Details

Hide Details

Checking string: "(unsigned char) a_struct_ptr->b = '9' "

Hide Details

Expecting sub string: "a_struct_ptr->b = '9'" (was found)

Hide Details

runCmd: frame variable --show-types a_struct_ref.a output: (unsigned char) a_struct_ref.a = '0'

Hide Details

Hide Details

looking at: unsigned char

Hide Details

Checking string: "unsigned char"

Hide Details

Expecting sub string: "unsigned" (was found) Expecting sub string: "char" (was found)

Hide Details

looking at: (unsigned char) a_struct_ref.a = '0'

Hide Details

Hide Details

Checking string: "(unsigned char) a_struct_ref.a = '0' "

Hide Details

Expecting sub string: "a_struct_ref.a = '0'" (was found)

Hide Details

runCmd: frame variable --show-types a_struct_ref.b output: (unsigned char) a_struct_ref.b = '9'

Hide Details

Hide Details

looking at: unsigned char

Hide Details

Checking string: "unsigned char"

Hide Details

Expecting sub string: "unsigned" (was found) Expecting sub string: "char" (was found)

Hide Details

looking at: (unsigned char) a_struct_ref.b = '9'

Hide Details

Hide Details

Checking string: "(unsigned char) a_struct_ref.b = '9' "

Hide Details

Expecting sub string: "a_struct_ref.b = '9'" (was found)

Hide Details

runCmd: frame variable --show-types a_union_zero.a output: (unsigned char) a_union_zero.a = '0'

Hide Details

Hide Details

looking at: unsigned char

Hide Details

Checking string: "unsigned char"

Hide Details

Expecting sub string: "unsigned" (was found) Expecting sub string: "char" (was found)

Hide Details

looking at: (unsigned char) a_union_zero.a = '0'

Hide Details

Hide Details

Checking string: "(unsigned char) a_union_zero.a = '0' "

Hide Details

Expecting sub string: "a_union_zero.a = '0'" (was found)

Hide Details

runCmd: frame variable --show-types a_union_zero_ptr->a output: (unsigned char) a_union_zero_ptr->a = '0'

Hide Details

Hide Details

looking at: unsigned char

Hide Details

Checking string: "unsigned char"

Hide Details

Expecting sub string: "unsigned" (was found) Expecting sub string: "char" (was found)

Hide Details

looking at: (unsigned char) a_union_zero_ptr->a = '0'

Hide Details

Hide Details

Checking string: "(unsigned char) a_union_zero_ptr->a = '0' "

Hide Details

Expecting sub string: "a_union_zero_ptr->a = '0'" (was found)

Hide Details

runCmd: frame variable --show-types a_union_zero_ref.a output: (unsigned char) a_union_zero_ref.a = '0'

Hide Details

Hide Details

looking at: unsigned char

Hide Details

Checking string: "unsigned char"

Hide Details

Expecting sub string: "unsigned" (was found) Expecting sub string: "char" (was found)

Hide Details

looking at: (unsigned char) a_union_zero_ref.a = '0'

Hide Details

Hide Details

Checking string: "(unsigned char) a_union_zero_ref.a = '0' "

Hide Details

Expecting sub string: "a_union_zero_ref.a = '0'" (was found)

Hide Details

runCmd: frame variable --show-types a_union_nonzero.u.a output: (unsigned char) a_union_nonzero.u.a = '0'

Hide Details

Hide Details

looking at: unsigned char

Hide Details

Checking string: "unsigned char"

Hide Details

Expecting sub string: "unsigned" (was found) Expecting sub string: "char" (was found)

Hide Details

looking at: (unsigned char) a_union_nonzero.u.a = '0'

Hide Details

Hide Details

Checking string: "(unsigned char) a_union_nonzero.u.a = '0' "

Hide Details

Expecting sub string: "a_union_nonzero.u.a = '0'" (was found)

Hide Details

runCmd: frame variable --show-types a_union_nonzero_ptr->u.a output: (unsigned char) a_union_nonzero_ptr->u.a = '0'

Hide Details

Hide Details

looking at: unsigned char

Hide Details

Checking string: "unsigned char"

Hide Details

Expecting sub string: "unsigned" (was found) Expecting sub string: "char" (was found)

Hide Details

looking at: (unsigned char) a_union_nonzero_ptr->u.a = '0'

Hide Details

Hide Details

Checking string: "(unsigned char) a_union_nonzero_ptr->u.a = '0' "

Hide Details

Expecting sub string: "a_union_nonzero_ptr->u.a = '0'" (was found)

Hide Details

runCmd: frame variable --show-types a_union_nonzero_ref.u.a output: (unsigned char) a_union_nonzero_ref.u.a = '0'

Hide Details

Hide Details

looking at: unsigned char

Hide Details

Checking string: "unsigned char"

Hide Details

Expecting sub string: "unsigned" (was found) Expecting sub string: "char" (was found)

Hide Details

looking at: (unsigned char) a_union_nonzero_ref.u.a = '0'

Hide Details

Hide Details

Checking string: "(unsigned char) a_union_nonzero_ref.u.a = '0' "

Hide Details

Expecting sub string: "a_union_nonzero_ref.u.a = '0'" (was found)

Hide Details

runCmd: frame variable --show-types a_struct_array_bounded[0].a output: (unsigned char) a_struct_array_bounded[0].a = '0'

Hide Details

Hide Details

looking at: unsigned char

Hide Details

Checking string: "unsigned char"

Hide Details

Expecting sub string: "unsigned" (was found) Expecting sub string: "char" (was found)

Hide Details

looking at: (unsigned char) a_struct_array_bounded[0].a = '0'

Hide Details

Hide Details

Checking string: "(unsigned char) a_struct_array_bounded[0].a = '0' "

Hide Details

Expecting sub string: "a_struct_array_bounded[0].a = '0'" (was found)

Hide Details

runCmd: frame variable --show-types a_struct_array_bounded[0].b output: (unsigned char) a_struct_array_bounded[0].b = '9'

Hide Details

Hide Details

looking at: unsigned char

Hide Details

Checking string: "unsigned char"

Hide Details

Expecting sub string: "unsigned" (was found) Expecting sub string: "char" (was found)

Hide Details

looking at: (unsigned char) a_struct_array_bounded[0].b = '9'

Hide Details

Hide Details

Checking string: "(unsigned char) a_struct_array_bounded[0].b = '9' "

Hide Details

Expecting sub string: "a_struct_array_bounded[0].b = '9'" (was found)

Hide Details

runCmd: frame variable --show-types a_struct_array_bounded[1].a output: (unsigned char) a_struct_array_bounded[1].a = '@'

Hide Details

Hide Details

looking at: unsigned char

Hide Details

Checking string: "unsigned char"

Hide Details

Expecting sub string: "unsigned" (was found) Expecting sub string: "char" (was found)

Hide Details

looking at: (unsigned char) a_struct_array_bounded[1].a = '@'

Hide Details

Hide Details

Checking string: "(unsigned char) a_struct_array_bounded[1].a = '@' "

Hide Details

Expecting sub string: "a_struct_array_bounded[1].a = '@'" (was found)

Hide Details

runCmd: frame variable --show-types a_struct_array_bounded[1].b output: (unsigned char) a_struct_array_bounded[1].b = '$'

Hide Details

Hide Details

looking at: unsigned char

Hide Details

Checking string: "unsigned char"

Hide Details

Expecting sub string: "unsigned" (was found) Expecting sub string: "char" (was found)

Hide Details

looking at: (unsigned char) a_struct_array_bounded[1].b = '$'

Hide Details

Hide Details

Checking string: "(unsigned char) a_struct_array_bounded[1].b = '$' "

Hide Details

Expecting sub string: "a_struct_array_bounded[1].b = '$'" (was found)

Hide Details

runCmd: frame variable --show-types a_struct_array_unbounded[0].a output: (unsigned char) a_struct_array_unbounded[0].a = '0'

Hide Details

Hide Details

looking at: unsigned char

Hide Details

Checking string: "unsigned char"

Hide Details

Expecting sub string: "unsigned" (was found) Expecting sub string: "char" (was found)

Hide Details

looking at: (unsigned char) a_struct_array_unbounded[0].a = '0'

Hide Details

Hide Details

Checking string: "(unsigned char) a_struct_array_unbounded[0].a = '0' "

Hide Details

Expecting sub string: "a_struct_array_unbounded[0].a = '0'" (was found)

Hide Details

runCmd: frame variable --show-types a_struct_array_unbounded[0].b output: (unsigned char) a_struct_array_unbounded[0].b = '9'

Hide Details

Hide Details

looking at: unsigned char

Hide Details

Checking string: "unsigned char"

Hide Details

Expecting sub string: "unsigned" (was found) Expecting sub string: "char" (was found)

Hide Details

looking at: (unsigned char) a_struct_array_unbounded[0].b = '9'

Hide Details

Hide Details

Checking string: "(unsigned char) a_struct_array_unbounded[0].b = '9' "

Hide Details

Expecting sub string: "a_struct_array_unbounded[0].b = '9'" (was found)

Hide Details

runCmd: frame variable --show-types a_struct_array_unbounded[1].a output: (unsigned char) a_struct_array_unbounded[1].a = '@'

Hide Details

Hide Details

looking at: unsigned char

Hide Details

Checking string: "unsigned char"

Hide Details

Expecting sub string: "unsigned" (was found) Expecting sub string: "char" (was found)

Hide Details

looking at: (unsigned char) a_struct_array_unbounded[1].a = '@'

Hide Details

Hide Details

Checking string: "(unsigned char) a_struct_array_unbounded[1].a = '@' "

Hide Details

Expecting sub string: "a_struct_array_unbounded[1].a = '@'" (was found)

Hide Details

runCmd: frame variable --show-types a_struct_array_unbounded[1].b output: (unsigned char) a_struct_array_unbounded[1].b = '$'

Hide Details

Hide Details

looking at: unsigned char

Hide Details

Checking string: "unsigned char"

Hide Details

Expecting sub string: "unsigned" (was found) Expecting sub string: "char" (was found)

Hide Details

looking at: (unsigned char) a_struct_array_unbounded[1].b = '$'

Hide Details

Hide Details

Checking string: "(unsigned char) a_struct_array_unbounded[1].b = '$' "

Hide Details

Expecting sub string: "a_struct_array_unbounded[1].b = '$'" (was found)

Hide Details

runCmd: frame variable --show-types a_union_zero_array_bounded[0].a output: (unsigned char) a_union_zero_array_bounded[0].a = '0'

Hide Details

Hide Details

looking at: unsigned char

Hide Details

Checking string: "unsigned char"

Hide Details

Expecting sub string: "unsigned" (was found) Expecting sub string: "char" (was found)

Hide Details

looking at: (unsigned char) a_union_zero_array_bounded[0].a = '0'

Hide Details

Hide Details

Checking string: "(unsigned char) a_union_zero_array_bounded[0].a = '0' "

Hide Details

Expecting sub string: "a_union_zero_array_bounded[0].a = '0'" (was found)

Hide Details

runCmd: frame variable --show-types a_union_zero_array_bounded[1].a output: (unsigned char) a_union_zero_array_bounded[1].a = '9'

Hide Details

Hide Details

looking at: unsigned char

Hide Details

Checking string: "unsigned char"

Hide Details

Expecting sub string: "unsigned" (was found) Expecting sub string: "char" (was found)

Hide Details

looking at: (unsigned char) a_union_zero_array_bounded[1].a = '9'

Hide Details

Hide Details

Checking string: "(unsigned char) a_union_zero_array_bounded[1].a = '9' "

Hide Details

Expecting sub string: "a_union_zero_array_bounded[1].a = '9'" (was found)

Hide Details

runCmd: frame variable --show-types a_union_zero_array_unbounded[0].a output: (unsigned char) a_union_zero_array_unbounded[0].a = '0'

Hide Details

Hide Details

looking at: unsigned char

Hide Details

Checking string: "unsigned char"

Hide Details

Expecting sub string: "unsigned" (was found) Expecting sub string: "char" (was found)

Hide Details

looking at: (unsigned char) a_union_zero_array_unbounded[0].a = '0'

Hide Details

Hide Details

Checking string: "(unsigned char) a_union_zero_array_unbounded[0].a = '0' "

Hide Details

Expecting sub string: "a_union_zero_array_unbounded[0].a = '0'" (was found)

Hide Details

runCmd: frame variable --show-types a_union_zero_array_unbounded[1].a output: (unsigned char) a_union_zero_array_unbounded[1].a = '9'

Hide Details

Hide Details

looking at: unsigned char

Hide Details

Checking string: "unsigned char"

Hide Details

Expecting sub string: "unsigned" (was found) Expecting sub string: "char" (was found)

Hide Details

looking at: (unsigned char) a_union_zero_array_unbounded[1].a = '9'

Hide Details

Hide Details

Checking string: "(unsigned char) a_union_zero_array_unbounded[1].a = '9' "

Hide Details

Expecting sub string: "a_union_zero_array_unbounded[1].a = '9'" (was found)

Hide Details

<bound method SBProcess.Kill of <lldb.SBProcess; proxy of <Swig Object of type 'lldb::SBProcess *' at 0x104bdb690> >>: success

Hide Details

Executing tearDown hook: self.addTearDownHook(lambda: self.runCmd( "settings set target.inline-breakpoint-strategy headers"))

Hide Details

Hide Details

runCmd: settings set target.inline-breakpoint-strategy headers output:

Hide Details

PASS: LLDB (/Users/buildslave/jenkins/workspace/lldb-cmake/lldb-build/bin/clang-x86_64) :: test_unsigned_char_type_dwarf (TestCharType.CharTypeTestCase) UNSUPPORTED: LLDB (/Users/buildslave/jenkins/workspace/lldb-cmake/lldb-build/bin/clang-x86_64) :: test_unsigned_char_type_dwo (TestCharType.CharTypeTestCase) (test case does not fall in any category of interest for this run) runCmd: settings clear -all output:

Hide Details

runCmd: settings set symbols.enable-external-lookup false output:

Hide Details

runCmd: settings set target.inherit-tcc true output:

Hide Details

runCmd: settings set target.auto-apply-fixits false output:

Hide Details

runCmd: settings set plugin.process.gdb-remote.packet-timeout 60 output:

Hide Details

runCmd: settings set symbols.clang-modules-cache-path "/Users/buildslave/jenkins/workspace/lldb-cmake/lldb-build/lldb-test-build.noindex/module-cache-lldb/lldb-api" output:

Hide Details

runCmd: settings set use-color false output:

Hide Details

runCmd: setting set target.prefer-dynamic-value no-dynamic-values output:

Hide Details

runCmd: file /Users/buildslave/jenkins/workspace/lldb-cmake/lldb-build/lldb-test-build.noindex/types/TestCharType.test_unsigned_char_type_from_block_dsym/test_unsigned_char_type_from_block_dsym output: Current executable set to '/Users/buildslave/jenkins/workspace/lldb-cmake/lldb-build/lldb-test-build.noindex/types/TestCharType.test_unsigned_char_type_from_block_dsym/test_unsigned_char_type_from_block_dsym' (x86_64).

Hide Details

Hide Details

runCmd: process launch -o "/Users/buildslave/jenkins/workspace/lldb-cmake/lldb-build/lldb-test-build.noindex/types/TestCharType.test_unsigned_char_type_from_block_dsym/test_unsigned_char_type_from_block_dsym-golden-output.txt" output: Process 18876 exited with status = 0 (0x00000000)

Hide Details

Process 18876 launched: '/Users/buildslave/jenkins/workspace/lldb-cmake/lldb-build/lldb-test-build.noindex/types/TestCharType.test_unsigned_char_type_from_block_dsym/test_unsigned_char_type_from_block_dsym' (x86_64)

Hide Details

Hide Details

runCmd: settings set target.inline-breakpoint-strategy always output:

Hide Details

runCmd: settings set target.inherit-tcc true output:

Hide Details

Adding tearDown hook: self.addTearDownHook(lambda: self.runCmd( "settings set target.inline-breakpoint-strategy headers"))

Hide Details

Hide Details

runCmd: breakpoint set -f "basic_type.cpp" -l 215 output: Breakpoint 1: where = test_unsigned_char_type_from_block_dsym`__main_block_invoke + 1016 at basic_type.cpp:215:18, address = 0x0000000100001698

Hide Details

Hide Details

Expecting pattern: ^Breakpoint (?P<bpno>[0-9]+): (?P<num_locations>[0-9]+) locations\.$ Not matched

Hide Details

Expecting pattern: ^Breakpoint (?P<bpno>[0-9]+): (?P<num_locations>no) locations \(pending\)\. Not matched

Hide Details

Expecting pattern: ^Breakpoint (?P<bpno>[0-9]+): where = (?P<module>.*)`(?P<symbol>[+\-]{0,1}[^+]+)( \+ (?P<offset>[0-9]+)){0,1}( \[inlined\] (?P<inline_symbol>.*)){0,1} at (?P<file>[^:]+):(?P<line_no>[0-9]+)(?P<column>(:[0-9]+)?), address = (?P<address>0x[0-9a-fA-F]+)$ Matched

Hide Details

runCmd: run output: Process 18927 stopped * thread #1, queue = 'com.apple.main-thread', stop reason = breakpoint 1.1 frame #0: 0x0000000100001698 test_unsigned_char_type_from_block_dsym`__main_block_invoke(.block_descriptor=0x00007ffeefbff6b0) at basic_type.cpp:215:18 212 fprintf (out, "(a_union_nonzero_t*) a_union_nonzero_ptr = %p, a_union_nonzero_ptr->u.a = '" T_PRINTF_FORMAT "'\n", a_union_nonzero_ptr, a_union_nonzero_ptr->u.a); 213 fprintf (out, "(a_union_nonzero_t&) a_union_nonzero_ref = %p, a_union_nonzero_ref.u.a = '" T_PRINTF_FORMAT "'\n", &a_union_nonzero_ref, a_union_nonzero_ref.u.a); 214 -> 215 fprintf (out, "That's All Folks!\n"); // Break here to test block captured variables. ^ 216 }; 217 218 myBlock();

Hide Details

Process 18927 launched: '/Users/buildslave/jenkins/workspace/lldb-cmake/lldb-build/lldb-test-build.noindex/types/TestCharType.test_unsigned_char_type_from_block_dsym/test_unsigned_char_type_from_block_dsym' (x86_64)

Hide Details

Hide Details

runCmd: process status output: Process 18927 stopped * thread #1, queue = 'com.apple.main-thread', stop reason = breakpoint 1.1 frame #0: 0x0000000100001698 test_unsigned_char_type_from_block_dsym`__main_block_invoke(.block_descriptor=0x00007ffeefbff6b0) at basic_type.cpp:215:18 212 fprintf (out, "(a_union_nonzero_t*) a_union_nonzero_ptr = %p, a_union_nonzero_ptr->u.a = '" T_PRINTF_FORMAT "'\n", a_union_nonzero_ptr, a_union_nonzero_ptr->u.a); 213 fprintf (out, "(a_union_nonzero_t&) a_union_nonzero_ref = %p, a_union_nonzero_ref.u.a = '" T_PRINTF_FORMAT "'\n", &a_union_nonzero_ref, a_union_nonzero_ref.u.a); 214 -> 215 fprintf (out, "That's All Folks!\n"); // Break here to test block captured variables. ^ 216 }; 217 218 myBlock();

Hide Details

Hide Details

Ran command: "process status"

Hide Details

Got output: Process 18927 stopped * thread #1, queue = 'com.apple.main-thread', stop reason = breakpoint 1.1 frame #0: 0x0000000100001698 test_unsigned_char_type_from_block_dsym`__main_block_invoke(.block_descriptor=0x00007ffeefbff6b0) at basic_type.cpp:215:18 212 fprintf (out, "(a_union_nonzero_t*) a_union_nonzero_ptr = %p, a_union_nonzero_ptr->u.a = '" T_PRINTF_FORMAT "'\n", a_union_nonzero_ptr, a_union_nonzero_ptr->u.a); 213 fprintf (out, "(a_union_nonzero_t&) a_union_nonzero_ref = %p, a_union_nonzero_ref.u.a = '" T_PRINTF_FORMAT "'\n", &a_union_nonzero_ref, a_union_nonzero_ref.u.a); 214 -> 215 fprintf (out, "That's All Folks!\n"); // Break here to test block captured variables. ^ 216 }; 217 218 myBlock();

Hide Details

Expecting sub string: "stop reason = breakpoint" (was found) Expecting sub string: " at basic_type.cpp:215" (was found)

Hide Details

runCmd: frame variable --show-types a output: (unsigned char) a = '0'

Hide Details

Hide Details

looking at: unsigned char

Hide Details

Checking string: "unsigned char"

Hide Details

Expecting sub string: "unsigned" (was found) Expecting sub string: "char" (was found)

Hide Details

looking at: (unsigned char) a = '0'

Hide Details

Hide Details

Checking string: "(unsigned char) a = '0' "

Hide Details

Expecting sub string: "a = '0'" (was found)

Hide Details

runCmd: frame variable --show-types *a_ptr output: (unsigned char) *a_ptr = '0'

Hide Details

Hide Details

looking at: unsigned char

Hide Details

Checking string: "unsigned char"

Hide Details

Expecting sub string: "unsigned" (was found) Expecting sub string: "char" (was found)

Hide Details

looking at: (unsigned char) *a_ptr = '0'

Hide Details

Hide Details

Checking string: "(unsigned char) *a_ptr = '0' "

Hide Details

Expecting sub string: "*a_ptr = '0'" (was found)

Hide Details

runCmd: frame variable --show-types a_ref output: (unsigned char &) a_ref = 0x00007ffeefbff7f7: { (unsigned char) &a_ref = '0' }

Hide Details

Hide Details

looking at: unsigned char &

Hide Details

Checking string: "unsigned char &"

Hide Details

Expecting sub string: "unsigned" (was found) Expecting sub string: "char" (was found)

Hide Details

looking at: (unsigned char &) a_ref = 0x00007ffeefbff7f7: { (unsigned char) &a_ref = '0' }

Hide Details

Hide Details

Checking string: "(unsigned char &) a_ref = 0x00007ffeefbff7f7: { (unsigned char) &a_ref = '0' } "

Hide Details

Expecting sub string: "a_ref = '0'" (was found)

Hide Details

runCmd: frame variable --show-types a_class_instance.m_a output: (unsigned char) a_class_instance.m_a = '0'

Hide Details

Hide Details

looking at: unsigned char

Hide Details

Checking string: "unsigned char"

Hide Details

Expecting sub string: "unsigned" (was found) Expecting sub string: "char" (was found)

Hide Details

looking at: (unsigned char) a_class_instance.m_a = '0'

Hide Details

Hide Details

Checking string: "(unsigned char) a_class_instance.m_a = '0' "

Hide Details

Expecting sub string: "a_class_instance.m_a = '0'" (was found)

Hide Details

runCmd: frame variable --show-types a_class_instance.m_b output: (unsigned char) a_class_instance.m_b = '9'

Hide Details

Hide Details

looking at: unsigned char

Hide Details

Checking string: "unsigned char"

Hide Details

Expecting sub string: "unsigned" (was found) Expecting sub string: "char" (was found)

Hide Details

looking at: (unsigned char) a_class_instance.m_b = '9'

Hide Details

Hide Details

Checking string: "(unsigned char) a_class_instance.m_b = '9' "

Hide Details

Expecting sub string: "a_class_instance.m_b = '9'" (was found)

Hide Details

runCmd: frame variable --show-types a_class_ptr->m_a output: (unsigned char) a_class_ptr->m_a = '0'

Hide Details

Hide Details

looking at: unsigned char

Hide Details

Checking string: "unsigned char"

Hide Details

Expecting sub string: "unsigned" (was found) Expecting sub string: "char" (was found)

Hide Details

looking at: (unsigned char) a_class_ptr->m_a = '0'

Hide Details

Hide Details

Checking string: "(unsigned char) a_class_ptr->m_a = '0' "

Hide Details

Expecting sub string: "a_class_ptr->m_a = '0'" (was found)

Hide Details

runCmd: frame variable --show-types a_class_ptr->m_b output: (unsigned char) a_class_ptr->m_b = '9'

Hide Details

Hide Details

looking at: unsigned char

Hide Details

Checking string: "unsigned char"

Hide Details

Expecting sub string: "unsigned" (was found) Expecting sub string: "char" (was found)

Hide Details

looking at: (unsigned char) a_class_ptr->m_b = '9'

Hide Details

Hide Details

Checking string: "(unsigned char) a_class_ptr->m_b = '9' "

Hide Details

Expecting sub string: "a_class_ptr->m_b = '9'" (was found)

Hide Details

runCmd: frame variable --show-types a_class_ref.m_a output: (unsigned char) a_class_ref.m_a = '0'

Hide Details

Hide Details

looking at: unsigned char

Hide Details

Checking string: "unsigned char"

Hide Details

Expecting sub string: "unsigned" (was found) Expecting sub string: "char" (was found)

Hide Details

looking at: (unsigned char) a_class_ref.m_a = '0'

Hide Details

Hide Details

Checking string: "(unsigned char) a_class_ref.m_a = '0' "

Hide Details

Expecting sub string: "a_class_ref.m_a = '0'" (was found)

Hide Details

runCmd: frame variable --show-types a_class_ref.m_b output: (unsigned char) a_class_ref.m_b = '9'

Hide Details

Hide Details

looking at: unsigned char

Hide Details

Checking string: "unsigned char"

Hide Details

Expecting sub string: "unsigned" (was found) Expecting sub string: "char" (was found)

Hide Details

looking at: (unsigned char) a_class_ref.m_b = '9'

Hide Details

Hide Details

Checking string: "(unsigned char) a_class_ref.m_b = '9' "

Hide Details

Expecting sub string: "a_class_ref.m_b = '9'" (was found)

Hide Details

runCmd: frame variable --show-types a_struct.a output: (unsigned char) a_struct.a = '0'

Hide Details

Hide Details

looking at: unsigned char

Hide Details

Checking string: "unsigned char"

Hide Details

Expecting sub string: "unsigned" (was found) Expecting sub string: "char" (was found)

Hide Details

looking at: (unsigned char) a_struct.a = '0'

Hide Details

Hide Details

Checking string: "(unsigned char) a_struct.a = '0' "

Hide Details

Expecting sub string: "a_struct.a = '0'" (was found)

Hide Details

runCmd: frame variable --show-types a_struct.b output: (unsigned char) a_struct.b = '9'

Hide Details

Hide Details

looking at: unsigned char

Hide Details

Checking string: "unsigned char"

Hide Details

Expecting sub string: "unsigned" (was found) Expecting sub string: "char" (was found)

Hide Details

looking at: (unsigned char) a_struct.b = '9'

Hide Details

Hide Details

Checking string: "(unsigned char) a_struct.b = '9' "

Hide Details

Expecting sub string: "a_struct.b = '9'" (was found)

Hide Details

runCmd: frame variable --show-types a_struct_ptr->a output: (unsigned char) a_struct_ptr->a = '0'

Hide Details

Hide Details

looking at: unsigned char

Hide Details

Checking string: "unsigned char"

Hide Details

Expecting sub string: "unsigned" (was found) Expecting sub string: "char" (was found)

Hide Details

looking at: (unsigned char) a_struct_ptr->a = '0'

Hide Details

Hide Details

Checking string: "(unsigned char) a_struct_ptr->a = '0' "

Hide Details

Expecting sub string: "a_struct_ptr->a = '0'" (was found)

Hide Details

runCmd: frame variable --show-types a_struct_ptr->b output: (unsigned char) a_struct_ptr->b = '9'

Hide Details

Hide Details

looking at: unsigned char

Hide Details

Checking string: "unsigned char"

Hide Details

Expecting sub string: "unsigned" (was found) Expecting sub string: "char" (was found)

Hide Details

looking at: (unsigned char) a_struct_ptr->b = '9'

Hide Details

Hide Details

Checking string: "(unsigned char) a_struct_ptr->b = '9' "

Hide Details

Expecting sub string: "a_struct_ptr->b = '9'" (was found)

Hide Details

runCmd: frame variable --show-types a_struct_ref.a output: (unsigned char) a_struct_ref.a = '0'

Hide Details

Hide Details

looking at: unsigned char

Hide Details

Checking string: "unsigned char"

Hide Details

Expecting sub string: "unsigned" (was found) Expecting sub string: "char" (was found)

Hide Details

looking at: (unsigned char) a_struct_ref.a = '0'

Hide Details

Hide Details

Checking string: "(unsigned char) a_struct_ref.a = '0' "

Hide Details

Expecting sub string: "a_struct_ref.a = '0'" (was found)

Hide Details

runCmd: frame variable --show-types a_struct_ref.b output: (unsigned char) a_struct_ref.b = '9'

Hide Details

Hide Details

looking at: unsigned char

Hide Details

Checking string: "unsigned char"

Hide Details

Expecting sub string: "unsigned" (was found) Expecting sub string: "char" (was found)

Hide Details

looking at: (unsigned char) a_struct_ref.b = '9'

Hide Details

Hide Details

Checking string: "(unsigned char) a_struct_ref.b = '9' "

Hide Details

Expecting sub string: "a_struct_ref.b = '9'" (was found)

Hide Details

runCmd: frame variable --show-types a_union_zero.a output: (unsigned char) a_union_zero.a = '0'

Hide Details

Hide Details

looking at: unsigned char

Hide Details

Checking string: "unsigned char"

Hide Details

Expecting sub string: "unsigned" (was found) Expecting sub string: "char" (was found)

Hide Details

looking at: (unsigned char) a_union_zero.a = '0'

Hide Details

Hide Details

Checking string: "(unsigned char) a_union_zero.a = '0' "

Hide Details

Expecting sub string: "a_union_zero.a = '0'" (was found)

Hide Details

runCmd: frame variable --show-types a_union_zero_ptr->a output: (unsigned char) a_union_zero_ptr->a = '0'

Hide Details

Hide Details

looking at: unsigned char

Hide Details

Checking string: "unsigned char"

Hide Details

Expecting sub string: "unsigned" (was found) Expecting sub string: "char" (was found)

Hide Details

looking at: (unsigned char) a_union_zero_ptr->a = '0'

Hide Details

Hide Details

Checking string: "(unsigned char) a_union_zero_ptr->a = '0' "

Hide Details

Expecting sub string: "a_union_zero_ptr->a = '0'" (was found)

Hide Details

runCmd: frame variable --show-types a_union_zero_ref.a output: (unsigned char) a_union_zero_ref.a = '0'

Hide Details

Hide Details

looking at: unsigned char

Hide Details

Checking string: "unsigned char"

Hide Details

Expecting sub string: "unsigned" (was found) Expecting sub string: "char" (was found)

Hide Details

looking at: (unsigned char) a_union_zero_ref.a = '0'

Hide Details

Hide Details

Checking string: "(unsigned char) a_union_zero_ref.a = '0' "

Hide Details

Expecting sub string: "a_union_zero_ref.a = '0'" (was found)

Hide Details

runCmd: frame variable --show-types a_union_nonzero.u.a output: (unsigned char) a_union_nonzero.u.a = '0'

Hide Details

Hide Details

looking at: unsigned char

Hide Details

Checking string: "unsigned char"

Hide Details

Expecting sub string: "unsigned" (was found) Expecting sub string: "char" (was found)

Hide Details

looking at: (unsigned char) a_union_nonzero.u.a = '0'

Hide Details

Hide Details

Checking string: "(unsigned char) a_union_nonzero.u.a = '0' "

Hide Details

Expecting sub string: "a_union_nonzero.u.a = '0'" (was found)

Hide Details

runCmd: frame variable --show-types a_union_nonzero_ptr->u.a output: (unsigned char) a_union_nonzero_ptr->u.a = '0'

Hide Details

Hide Details

looking at: unsigned char

Hide Details

Checking string: "unsigned char"

Hide Details

Expecting sub string: "unsigned" (was found) Expecting sub string: "char" (was found)

Hide Details

looking at: (unsigned char) a_union_nonzero_ptr->u.a = '0'

Hide Details

Hide Details

Checking string: "(unsigned char) a_union_nonzero_ptr->u.a = '0' "

Hide Details

Expecting sub string: "a_union_nonzero_ptr->u.a = '0'" (was found)

Hide Details

runCmd: frame variable --show-types a_union_nonzero_ref.u.a output: (unsigned char) a_union_nonzero_ref.u.a = '0'

Hide Details

Hide Details

looking at: unsigned char

Hide Details

Checking string: "unsigned char"

Hide Details

Expecting sub string: "unsigned" (was found) Expecting sub string: "char" (was found)

Hide Details

looking at: (unsigned char) a_union_nonzero_ref.u.a = '0'

Hide Details

Hide Details

Checking string: "(unsigned char) a_union_nonzero_ref.u.a = '0' "

Hide Details

Expecting sub string: "a_union_nonzero_ref.u.a = '0'" (was found)

Hide Details

runCmd: frame variable --show-types a output: (unsigned char) a = '0'

Hide Details

Hide Details

looking at: unsigned char

Hide Details

Checking string: "unsigned char"

Hide Details

Expecting sub string: "unsigned" (was found) Expecting sub string: "char" (was found)

Hide Details

looking at: (unsigned char) a = '0'

Hide Details

Hide Details

Checking string: "(unsigned char) a = '0' "

Hide Details

Expecting sub string: "a = '0'" (was found)

Hide Details

runCmd: frame variable --show-types *a_ptr output: (unsigned char) *a_ptr = '0'

Hide Details

Hide Details

looking at: unsigned char

Hide Details

Checking string: "unsigned char"

Hide Details

Expecting sub string: "unsigned" (was found) Expecting sub string: "char" (was found)

Hide Details

looking at: (unsigned char) *a_ptr = '0'

Hide Details

Hide Details

Checking string: "(unsigned char) *a_ptr = '0' "

Hide Details

Expecting sub string: "*a_ptr = '0'" (was found)

Hide Details

runCmd: frame variable --show-types a_ref output: (unsigned char &) a_ref = 0x00007ffeefbff7f7: { (unsigned char) &a_ref = '0' }

Hide Details

Hide Details

looking at: unsigned char &

Hide Details

Checking string: "unsigned char &"

Hide Details

Expecting sub string: "unsigned" (was found) Expecting sub string: "char" (was found)

Hide Details

looking at: (unsigned char &) a_ref = 0x00007ffeefbff7f7: { (unsigned char) &a_ref = '0' }

Hide Details

Hide Details

Checking string: "(unsigned char &) a_ref = 0x00007ffeefbff7f7: { (unsigned char) &a_ref = '0' } "

Hide Details

Expecting sub string: "a_ref = '0'" (was found)

Hide Details

runCmd: frame variable --show-types a_class_instance.m_a output: (unsigned char) a_class_instance.m_a = '0'

Hide Details

Hide Details

looking at: unsigned char

Hide Details

Checking string: "unsigned char"

Hide Details

Expecting sub string: "unsigned" (was found) Expecting sub string: "char" (was found)

Hide Details

looking at: (unsigned char) a_class_instance.m_a = '0'

Hide Details

Hide Details

Checking string: "(unsigned char) a_class_instance.m_a = '0' "

Hide Details

Expecting sub string: "a_class_instance.m_a = '0'" (was found)

Hide Details

runCmd: frame variable --show-types a_class_instance.m_b output: (unsigned char) a_class_instance.m_b = '9'

Hide Details

Hide Details

looking at: unsigned char

Hide Details

Checking string: "unsigned char"

Hide Details

Expecting sub string: "unsigned" (was found) Expecting sub string: "char" (was found)

Hide Details

looking at: (unsigned char) a_class_instance.m_b = '9'

Hide Details

Hide Details

Checking string: "(unsigned char) a_class_instance.m_b = '9' "

Hide Details

Expecting sub string: "a_class_instance.m_b = '9'" (was found)

Hide Details

runCmd: frame variable --show-types a_class_ptr->m_a output: (unsigned char) a_class_ptr->m_a = '0'

Hide Details

Hide Details

looking at: unsigned char

Hide Details

Checking string: "unsigned char"

Hide Details

Expecting sub string: "unsigned" (was found) Expecting sub string: "char" (was found)

Hide Details

looking at: (unsigned char) a_class_ptr->m_a = '0'

Hide Details

Hide Details

Checking string: "(unsigned char) a_class_ptr->m_a = '0' "

Hide Details

Expecting sub string: "a_class_ptr->m_a = '0'" (was found)

Hide Details

runCmd: frame variable --show-types a_class_ptr->m_b output: (unsigned char) a_class_ptr->m_b = '9'

Hide Details

Hide Details

looking at: unsigned char

Hide Details

Checking string: "unsigned char"

Hide Details

Expecting sub string: "unsigned" (was found) Expecting sub string: "char" (was found)

Hide Details

looking at: (unsigned char) a_class_ptr->m_b = '9'

Hide Details

Hide Details

Checking string: "(unsigned char) a_class_ptr->m_b = '9' "

Hide Details

Expecting sub string: "a_class_ptr->m_b = '9'" (was found)

Hide Details

runCmd: frame variable --show-types a_class_ref.m_a output: (unsigned char) a_class_ref.m_a = '0'

Hide Details

Hide Details

looking at: unsigned char

Hide Details

Checking string: "unsigned char"

Hide Details

Expecting sub string: "unsigned" (was found) Expecting sub string: "char" (was found)

Hide Details

looking at: (unsigned char) a_class_ref.m_a = '0'

Hide Details

Hide Details

Checking string: "(unsigned char) a_class_ref.m_a = '0' "

Hide Details

Expecting sub string: "a_class_ref.m_a = '0'" (was found)

Hide Details

runCmd: frame variable --show-types a_class_ref.m_b output: (unsigned char) a_class_ref.m_b = '9'

Hide Details

Hide Details

looking at: unsigned char

Hide Details

Checking string: "unsigned char"

Hide Details

Expecting sub string: "unsigned" (was found) Expecting sub string: "char" (was found)

Hide Details

looking at: (unsigned char) a_class_ref.m_b = '9'

Hide Details

Hide Details

Checking string: "(unsigned char) a_class_ref.m_b = '9' "

Hide Details

Expecting sub string: "a_class_ref.m_b = '9'" (was found)

Hide Details

runCmd: frame variable --show-types a_struct.a output: (unsigned char) a_struct.a = '0'

Hide Details

Hide Details

looking at: unsigned char

Hide Details

Checking string: "unsigned char"

Hide Details

Expecting sub string: "unsigned" (was found) Expecting sub string: "char" (was found)

Hide Details

looking at: (unsigned char) a_struct.a = '0'

Hide Details

Hide Details

Checking string: "(unsigned char) a_struct.a = '0' "

Hide Details

Expecting sub string: "a_struct.a = '0'" (was found)

Hide Details

runCmd: frame variable --show-types a_struct.b output: (unsigned char) a_struct.b = '9'

Hide Details

Hide Details

looking at: unsigned char

Hide Details

Checking string: "unsigned char"

Hide Details

Expecting sub string: "unsigned" (was found) Expecting sub string: "char" (was found)

Hide Details

looking at: (unsigned char) a_struct.b = '9'

Hide Details

Hide Details

Checking string: "(unsigned char) a_struct.b = '9' "

Hide Details

Expecting sub string: "a_struct.b = '9'" (was found)

Hide Details

runCmd: frame variable --show-types a_struct_ptr->a output: (unsigned char) a_struct_ptr->a = '0'

Hide Details

Hide Details

looking at: unsigned char

Hide Details

Checking string: "unsigned char"

Hide Details

Expecting sub string: "unsigned" (was found) Expecting sub string: "char" (was found)

Hide Details

looking at: (unsigned char) a_struct_ptr->a = '0'

Hide Details

Hide Details

Checking string: "(unsigned char) a_struct_ptr->a = '0' "

Hide Details

Expecting sub string: "a_struct_ptr->a = '0'" (was found)

Hide Details

runCmd: frame variable --show-types a_struct_ptr->b output: (unsigned char) a_struct_ptr->b = '9'

Hide Details

Hide Details

looking at: unsigned char

Hide Details

Checking string: "unsigned char"

Hide Details

Expecting sub string: "unsigned" (was found) Expecting sub string: "char" (was found)

Hide Details

looking at: (unsigned char) a_struct_ptr->b = '9'

Hide Details

Hide Details

Checking string: "(unsigned char) a_struct_ptr->b = '9' "

Hide Details

Expecting sub string: "a_struct_ptr->b = '9'" (was found)

Hide Details

runCmd: frame variable --show-types a_struct_ref.a output: (unsigned char) a_struct_ref.a = '0'

Hide Details

Hide Details

looking at: unsigned char

Hide Details

Checking string: "unsigned char"

Hide Details

Expecting sub string: "unsigned" (was found) Expecting sub string: "char" (was found)

Hide Details

looking at: (unsigned char) a_struct_ref.a = '0'

Hide Details

Hide Details

Checking string: "(unsigned char) a_struct_ref.a = '0' "

Hide Details

Expecting sub string: "a_struct_ref.a = '0'" (was found)

Hide Details

runCmd: frame variable --show-types a_struct_ref.b output: (unsigned char) a_struct_ref.b = '9'

Hide Details

Hide Details

looking at: unsigned char

Hide Details

Checking string: "unsigned char"

Hide Details

Expecting sub string: "unsigned" (was found) Expecting sub string: "char" (was found)

Hide Details

looking at: (unsigned char) a_struct_ref.b = '9'

Hide Details

Hide Details

Checking string: "(unsigned char) a_struct_ref.b = '9' "

Hide Details

Expecting sub string: "a_struct_ref.b = '9'" (was found)

Hide Details

runCmd: frame variable --show-types a_union_zero.a output: (unsigned char) a_union_zero.a = '0'

Hide Details

Hide Details

looking at: unsigned char

Hide Details

Checking string: "unsigned char"

Hide Details

Expecting sub string: "unsigned" (was found) Expecting sub string: "char" (was found)

Hide Details

looking at: (unsigned char) a_union_zero.a = '0'

Hide Details

Hide Details

Checking string: "(unsigned char) a_union_zero.a = '0' "

Hide Details

Expecting sub string: "a_union_zero.a = '0'" (was found)

Hide Details

runCmd: frame variable --show-types a_union_zero_ptr->a output: (unsigned char) a_union_zero_ptr->a = '0'

Hide Details

Hide Details

looking at: unsigned char

Hide Details

Checking string: "unsigned char"

Hide Details

Expecting sub string: "unsigned" (was found) Expecting sub string: "char" (was found)

Hide Details

looking at: (unsigned char) a_union_zero_ptr->a = '0'

Hide Details

Hide Details

Checking string: "(unsigned char) a_union_zero_ptr->a = '0' "

Hide Details

Expecting sub string: "a_union_zero_ptr->a = '0'" (was found)

Hide Details

runCmd: frame variable --show-types a_union_zero_ref.a output: (unsigned char) a_union_zero_ref.a = '0'

Hide Details

Hide Details

looking at: unsigned char

Hide Details

Checking string: "unsigned char"

Hide Details

Expecting sub string: "unsigned" (was found) Expecting sub string: "char" (was found)

Hide Details

looking at: (unsigned char) a_union_zero_ref.a = '0'

Hide Details

Hide Details

Checking string: "(unsigned char) a_union_zero_ref.a = '0' "

Hide Details

Expecting sub string: "a_union_zero_ref.a = '0'" (was found)

Hide Details

runCmd: frame variable --show-types a_union_nonzero.u.a output: (unsigned char) a_union_nonzero.u.a = '0'

Hide Details

Hide Details

looking at: unsigned char

Hide Details

Checking string: "unsigned char"

Hide Details

Expecting sub string: "unsigned" (was found) Expecting sub string: "char" (was found)

Hide Details

looking at: (unsigned char) a_union_nonzero.u.a = '0'

Hide Details

Hide Details

Checking string: "(unsigned char) a_union_nonzero.u.a = '0' "

Hide Details

Expecting sub string: "a_union_nonzero.u.a = '0'" (was found)

Hide Details

runCmd: frame variable --show-types a_union_nonzero_ptr->u.a output: (unsigned char) a_union_nonzero_ptr->u.a = '0'

Hide Details

Hide Details

looking at: unsigned char

Hide Details

Checking string: "unsigned char"

Hide Details

Expecting sub string: "unsigned" (was found) Expecting sub string: "char" (was found)

Hide Details

looking at: (unsigned char) a_union_nonzero_ptr->u.a = '0'

Hide Details

Hide Details

Checking string: "(unsigned char) a_union_nonzero_ptr->u.a = '0' "

Hide Details

Expecting sub string: "a_union_nonzero_ptr->u.a = '0'" (was found)

Hide Details

runCmd: frame variable --show-types a_union_nonzero_ref.u.a output: (unsigned char) a_union_nonzero_ref.u.a = '0'

Hide Details

Hide Details

looking at: unsigned char

Hide Details

Checking string: "unsigned char"

Hide Details

Expecting sub string: "unsigned" (was found) Expecting sub string: "char" (was found)

Hide Details

looking at: (unsigned char) a_union_nonzero_ref.u.a = '0'

Hide Details

Hide Details

Checking string: "(unsigned char) a_union_nonzero_ref.u.a = '0' "

Hide Details

Expecting sub string: "a_union_nonzero_ref.u.a = '0'" (was found)

Hide Details

<bound method SBProcess.Kill of <lldb.SBProcess; proxy of <Swig Object of type 'lldb::SBProcess *' at 0x10c148300> >>: success

Hide Details

Executing tearDown hook: self.addTearDownHook(lambda: self.runCmd( "settings set target.inline-breakpoint-strategy headers"))

Hide Details

Hide Details

runCmd: settings set target.inline-breakpoint-strategy headers output:

Hide Details

PASS: LLDB (/Users/buildslave/jenkins/workspace/lldb-cmake/lldb-build/bin/clang-x86_64) :: test_unsigned_char_type_from_block_dsym (TestCharType.CharTypeTestCase) runCmd: settings clear -all output:

Hide Details

runCmd: settings set symbols.enable-external-lookup false output:

Hide Details

runCmd: settings set target.inherit-tcc true output:

Hide Details

runCmd: settings set target.auto-apply-fixits false output:

Hide Details

runCmd: settings set plugin.process.gdb-remote.packet-timeout 60 output:

Hide Details

runCmd: settings set symbols.clang-modules-cache-path "/Users/buildslave/jenkins/workspace/lldb-cmake/lldb-build/lldb-test-build.noindex/module-cache-lldb/lldb-api" output:

Hide Details

runCmd: settings set use-color false output:

Hide Details

runCmd: setting set target.prefer-dynamic-value no-dynamic-values output:

Hide Details

runCmd: file /Users/buildslave/jenkins/workspace/lldb-cmake/lldb-build/lldb-test-build.noindex/types/TestCharType.test_unsigned_char_type_from_block_dwarf/test_unsigned_char_type_from_block_dwarf output: Current executable set to '/Users/buildslave/jenkins/workspace/lldb-cmake/lldb-build/lldb-test-build.noindex/types/TestCharType.test_unsigned_char_type_from_block_dwarf/test_unsigned_char_type_from_block_dwarf' (x86_64).

Hide Details

Hide Details

runCmd: process launch -o "/Users/buildslave/jenkins/workspace/lldb-cmake/lldb-build/lldb-test-build.noindex/types/TestCharType.test_unsigned_char_type_from_block_dwarf/test_unsigned_char_type_from_block_dwarf-golden-output.txt" output: Process 19002 exited with status = 0 (0x00000000)

Hide Details

Process 19002 launched: '/Users/buildslave/jenkins/workspace/lldb-cmake/lldb-build/lldb-test-build.noindex/types/TestCharType.test_unsigned_char_type_from_block_dwarf/test_unsigned_char_type_from_block_dwarf' (x86_64)

Hide Details

Hide Details

runCmd: settings set target.inline-breakpoint-strategy always output:

Hide Details

runCmd: settings set target.inherit-tcc true output:

Hide Details

Adding tearDown hook: self.addTearDownHook(lambda: self.runCmd( "settings set target.inline-breakpoint-strategy headers"))

Hide Details

Hide Details

runCmd: breakpoint set -f "basic_type.cpp" -l 215 output: Breakpoint 1: where = test_unsigned_char_type_from_block_dwarf`__main_block_invoke + 1016 at basic_type.cpp:215:18, address = 0x0000000100001698

Hide Details

Hide Details

Expecting pattern: ^Breakpoint (?P<bpno>[0-9]+): (?P<num_locations>[0-9]+) locations\.$ Not matched

Hide Details

Expecting pattern: ^Breakpoint (?P<bpno>[0-9]+): (?P<num_locations>no) locations \(pending\)\. Not matched

Hide Details

Expecting pattern: ^Breakpoint (?P<bpno>[0-9]+): where = (?P<module>.*)`(?P<symbol>[+\-]{0,1}[^+]+)( \+ (?P<offset>[0-9]+)){0,1}( \[inlined\] (?P<inline_symbol>.*)){0,1} at (?P<file>[^:]+):(?P<line_no>[0-9]+)(?P<column>(:[0-9]+)?), address = (?P<address>0x[0-9a-fA-F]+)$ Matched

Hide Details

runCmd: run output: Process 19030 stopped * thread #1, queue = 'com.apple.main-thread', stop reason = breakpoint 1.1 frame #0: 0x0000000100001698 test_unsigned_char_type_from_block_dwarf`__main_block_invoke(.block_descriptor=0x00007ffeefbff6a0) at basic_type.cpp:215:18 212 fprintf (out, "(a_union_nonzero_t*) a_union_nonzero_ptr = %p, a_union_nonzero_ptr->u.a = '" T_PRINTF_FORMAT "'\n", a_union_nonzero_ptr, a_union_nonzero_ptr->u.a); 213 fprintf (out, "(a_union_nonzero_t&) a_union_nonzero_ref = %p, a_union_nonzero_ref.u.a = '" T_PRINTF_FORMAT "'\n", &a_union_nonzero_ref, a_union_nonzero_ref.u.a); 214 -> 215 fprintf (out, "That's All Folks!\n"); // Break here to test block captured variables. ^ 216 }; 217 218 myBlock();

Hide Details

Process 19030 launched: '/Users/buildslave/jenkins/workspace/lldb-cmake/lldb-build/lldb-test-build.noindex/types/TestCharType.test_unsigned_char_type_from_block_dwarf/test_unsigned_char_type_from_block_dwarf' (x86_64)

Hide Details

Hide Details

runCmd: process status output: Process 19030 stopped * thread #1, queue = 'com.apple.main-thread', stop reason = breakpoint 1.1 frame #0: 0x0000000100001698 test_unsigned_char_type_from_block_dwarf`__main_block_invoke(.block_descriptor=0x00007ffeefbff6a0) at basic_type.cpp:215:18 212 fprintf (out, "(a_union_nonzero_t*) a_union_nonzero_ptr = %p, a_union_nonzero_ptr->u.a = '" T_PRINTF_FORMAT "'\n", a_union_nonzero_ptr, a_union_nonzero_ptr->u.a); 213 fprintf (out, "(a_union_nonzero_t&) a_union_nonzero_ref = %p, a_union_nonzero_ref.u.a = '" T_PRINTF_FORMAT "'\n", &a_union_nonzero_ref, a_union_nonzero_ref.u.a); 214 -> 215 fprintf (out, "That's All Folks!\n"); // Break here to test block captured variables. ^ 216 }; 217 218 myBlock();

Hide Details

Hide Details

Ran command: "process status"

Hide Details

Got output: Process 19030 stopped * thread #1, queue = 'com.apple.main-thread', stop reason = breakpoint 1.1 frame #0: 0x0000000100001698 test_unsigned_char_type_from_block_dwarf`__main_block_invoke(.block_descriptor=0x00007ffeefbff6a0) at basic_type.cpp:215:18 212 fprintf (out, "(a_union_nonzero_t*) a_union_nonzero_ptr = %p, a_union_nonzero_ptr->u.a = '" T_PRINTF_FORMAT "'\n", a_union_nonzero_ptr, a_union_nonzero_ptr->u.a); 213 fprintf (out, "(a_union_nonzero_t&) a_union_nonzero_ref = %p, a_union_nonzero_ref.u.a = '" T_PRINTF_FORMAT "'\n", &a_union_nonzero_ref, a_union_nonzero_ref.u.a); 214 -> 215 fprintf (out, "That's All Folks!\n"); // Break here to test block captured variables. ^ 216 }; 217 218 myBlock();

Hide Details

Expecting sub string: "stop reason = breakpoint" (was found) Expecting sub string: " at basic_type.cpp:215" (was found)

Hide Details

runCmd: frame variable --show-types a output: (unsigned char) a = '0'

Hide Details

Hide Details

looking at: unsigned char

Hide Details

Checking string: "unsigned char"

Hide Details

Expecting sub string: "unsigned" (was found) Expecting sub string: "char" (was found)

Hide Details

looking at: (unsigned char) a = '0'

Hide Details

Hide Details

Checking string: "(unsigned char) a = '0' "

Hide Details

Expecting sub string: "a = '0'" (was found)

Hide Details

runCmd: frame variable --show-types *a_ptr output: (unsigned char) *a_ptr = '0'

Hide Details

Hide Details

looking at: unsigned char

Hide Details

Checking string: "unsigned char"

Hide Details

Expecting sub string: "unsigned" (was found) Expecting sub string: "char" (was found)

Hide Details

looking at: (unsigned char) *a_ptr = '0'

Hide Details

Hide Details

Checking string: "(unsigned char) *a_ptr = '0' "

Hide Details

Expecting sub string: "*a_ptr = '0'" (was found)

Hide Details

runCmd: frame variable --show-types a_ref output: (unsigned char &) a_ref = 0x00007ffeefbff7e7: { (unsigned char) &a_ref = '0' }

Hide Details

Hide Details

looking at: unsigned char &

Hide Details

Checking string: "unsigned char &"

Hide Details

Expecting sub string: "unsigned" (was found) Expecting sub string: "char" (was found)

Hide Details

looking at: (unsigned char &) a_ref = 0x00007ffeefbff7e7: { (unsigned char) &a_ref = '0' }

Hide Details

Hide Details

Checking string: "(unsigned char &) a_ref = 0x00007ffeefbff7e7: { (unsigned char) &a_ref = '0' } "

Hide Details

Expecting sub string: "a_ref = '0'" (was found)

Hide Details

runCmd: frame variable --show-types a_class_instance.m_a output: (unsigned char) a_class_instance.m_a = '0'

Hide Details

Hide Details

looking at: unsigned char

Hide Details

Checking string: "unsigned char"

Hide Details

Expecting sub string: "unsigned" (was found) Expecting sub string: "char" (was found)

Hide Details

looking at: (unsigned char) a_class_instance.m_a = '0'

Hide Details

Hide Details

Checking string: "(unsigned char) a_class_instance.m_a = '0' "

Hide Details

Expecting sub string: "a_class_instance.m_a = '0'" (was found)

Hide Details

runCmd: frame variable --show-types a_class_instance.m_b output: (unsigned char) a_class_instance.m_b = '9'

Hide Details

Hide Details

looking at: unsigned char

Hide Details

Checking string: "unsigned char"

Hide Details

Expecting sub string: "unsigned" (was found) Expecting sub string: "char" (was found)

Hide Details

looking at: (unsigned char) a_class_instance.m_b = '9'

Hide Details

Hide Details

Checking string: "(unsigned char) a_class_instance.m_b = '9' "

Hide Details

Expecting sub string: "a_class_instance.m_b = '9'" (was found)

Hide Details

runCmd: frame variable --show-types a_class_ptr->m_a output: (unsigned char) a_class_ptr->m_a = '0'

Hide Details

Hide Details

looking at: unsigned char

Hide Details

Checking string: "unsigned char"

Hide Details

Expecting sub string: "unsigned" (was found) Expecting sub string: "char" (was found)

Hide Details

looking at: (unsigned char) a_class_ptr->m_a = '0'

Hide Details

Hide Details

Checking string: "(unsigned char) a_class_ptr->m_a = '0' "

Hide Details

Expecting sub string: "a_class_ptr->m_a = '0'" (was found)

Hide Details

runCmd: frame variable --show-types a_class_ptr->m_b output: (unsigned char) a_class_ptr->m_b = '9'

Hide Details

Hide Details

looking at: unsigned char

Hide Details

Checking string: "unsigned char"

Hide Details

Expecting sub string: "unsigned" (was found) Expecting sub string: "char" (was found)

Hide Details

looking at: (unsigned char) a_class_ptr->m_b = '9'

Hide Details

Hide Details

Checking string: "(unsigned char) a_class_ptr->m_b = '9' "

Hide Details

Expecting sub string: "a_class_ptr->m_b = '9'" (was found)

Hide Details

runCmd: frame variable --show-types a_class_ref.m_a output: (unsigned char) a_class_ref.m_a = '0'

Hide Details

Hide Details

looking at: unsigned char

Hide Details

Checking string: "unsigned char"

Hide Details

Expecting sub string: "unsigned" (was found) Expecting sub string: "char" (was found)

Hide Details

looking at: (unsigned char) a_class_ref.m_a = '0'

Hide Details

Hide Details

Checking string: "(unsigned char) a_class_ref.m_a = '0' "

Hide Details

Expecting sub string: "a_class_ref.m_a = '0'" (was found)

Hide Details

runCmd: frame variable --show-types a_class_ref.m_b output: (unsigned char) a_class_ref.m_b = '9'

Hide Details

Hide Details

looking at: unsigned char

Hide Details

Checking string: "unsigned char"

Hide Details

Expecting sub string: "unsigned" (was found) Expecting sub string: "char" (was found)

Hide Details

looking at: (unsigned char) a_class_ref.m_b = '9'

Hide Details

Hide Details

Checking string: "(unsigned char) a_class_ref.m_b = '9' "

Hide Details

Expecting sub string: "a_class_ref.m_b = '9'" (was found)

Hide Details

runCmd: frame variable --show-types a_struct.a output: (unsigned char) a_struct.a = '0'

Hide Details

Hide Details

looking at: unsigned char

Hide Details

Checking string: "unsigned char"

Hide Details

Expecting sub string: "unsigned" (was found) Expecting sub string: "char" (was found)

Hide Details

looking at: (unsigned char) a_struct.a = '0'

Hide Details

Hide Details

Checking string: "(unsigned char) a_struct.a = '0' "

Hide Details

Expecting sub string: "a_struct.a = '0'" (was found)

Hide Details

runCmd: frame variable --show-types a_struct.b output: (unsigned char) a_struct.b = '9'

Hide Details

Hide Details

looking at: unsigned char

Hide Details

Checking string: "unsigned char"

Hide Details

Expecting sub string: "unsigned" (was found) Expecting sub string: "char" (was found)

Hide Details

looking at: (unsigned char) a_struct.b = '9'

Hide Details

Hide Details

Checking string: "(unsigned char) a_struct.b = '9' "

Hide Details

Expecting sub string: "a_struct.b = '9'" (was found)

Hide Details

runCmd: frame variable --show-types a_struct_ptr->a output: (unsigned char) a_struct_ptr->a = '0'

Hide Details

Hide Details

looking at: unsigned char

Hide Details

Checking string: "unsigned char"

Hide Details

Expecting sub string: "unsigned" (was found) Expecting sub string: "char" (was found)

Hide Details

looking at: (unsigned char) a_struct_ptr->a = '0'

Hide Details

Hide Details

Checking string: "(unsigned char) a_struct_ptr->a = '0' "

Hide Details

Expecting sub string: "a_struct_ptr->a = '0'" (was found)

Hide Details

runCmd: frame variable --show-types a_struct_ptr->b output: (unsigned char) a_struct_ptr->b = '9'

Hide Details

Hide Details

looking at: unsigned char

Hide Details

Checking string: "unsigned char"

Hide Details

Expecting sub string: "unsigned" (was found) Expecting sub string: "char" (was found)

Hide Details

looking at: (unsigned char) a_struct_ptr->b = '9'

Hide Details

Hide Details

Checking string: "(unsigned char) a_struct_ptr->b = '9' "

Hide Details

Expecting sub string: "a_struct_ptr->b = '9'" (was found)

Hide Details

runCmd: frame variable --show-types a_struct_ref.a output: (unsigned char) a_struct_ref.a = '0'

Hide Details

Hide Details

looking at: unsigned char

Hide Details

Checking string: "unsigned char"

Hide Details

Expecting sub string: "unsigned" (was found) Expecting sub string: "char" (was found)

Hide Details

looking at: (unsigned char) a_struct_ref.a = '0'

Hide Details

Hide Details

Checking string: "(unsigned char) a_struct_ref.a = '0' "

Hide Details

Expecting sub string: "a_struct_ref.a = '0'" (was found)

Hide Details

runCmd: frame variable --show-types a_struct_ref.b output: (unsigned char) a_struct_ref.b = '9'

Hide Details

Hide Details

looking at: unsigned char

Hide Details

Checking string: "unsigned char"

Hide Details

Expecting sub string: "unsigned" (was found) Expecting sub string: "char" (was found)

Hide Details

looking at: (unsigned char) a_struct_ref.b = '9'

Hide Details

Hide Details

Checking string: "(unsigned char) a_struct_ref.b = '9' "

Hide Details

Expecting sub string: "a_struct_ref.b = '9'" (was found)

Hide Details

runCmd: frame variable --show-types a_union_zero.a output: (unsigned char) a_union_zero.a = '0'

Hide Details

Hide Details

looking at: unsigned char

Hide Details

Checking string: "unsigned char"

Hide Details

Expecting sub string: "unsigned" (was found) Expecting sub string: "char" (was found)

Hide Details

looking at: (unsigned char) a_union_zero.a = '0'

Hide Details

Hide Details

Checking string: "(unsigned char) a_union_zero.a = '0' "

Hide Details

Expecting sub string: "a_union_zero.a = '0'" (was found)

Hide Details

runCmd: frame variable --show-types a_union_zero_ptr->a output: (unsigned char) a_union_zero_ptr->a = '0'

Hide Details

Hide Details

looking at: unsigned char

Hide Details

Checking string: "unsigned char"

Hide Details

Expecting sub string: "unsigned" (was found) Expecting sub string: "char" (was found)

Hide Details

looking at: (unsigned char) a_union_zero_ptr->a = '0'

Hide Details

Hide Details

Checking string: "(unsigned char) a_union_zero_ptr->a = '0' "

Hide Details

Expecting sub string: "a_union_zero_ptr->a = '0'" (was found)

Hide Details

runCmd: frame variable --show-types a_union_zero_ref.a output: (unsigned char) a_union_zero_ref.a = '0'

Hide Details

Hide Details

looking at: unsigned char

Hide Details

Checking string: "unsigned char"

Hide Details

Expecting sub string: "unsigned" (was found) Expecting sub string: "char" (was found)

Hide Details

looking at: (unsigned char) a_union_zero_ref.a = '0'

Hide Details

Hide Details

Checking string: "(unsigned char) a_union_zero_ref.a = '0' "

Hide Details

Expecting sub string: "a_union_zero_ref.a = '0'" (was found)

Hide Details

runCmd: frame variable --show-types a_union_nonzero.u.a output: (unsigned char) a_union_nonzero.u.a = '0'

Hide Details

Hide Details

looking at: unsigned char

Hide Details

Checking string: "unsigned char"

Hide Details

Expecting sub string: "unsigned" (was found) Expecting sub string: "char" (was found)

Hide Details

looking at: (unsigned char) a_union_nonzero.u.a = '0'

Hide Details

Hide Details

Checking string: "(unsigned char) a_union_nonzero.u.a = '0' "

Hide Details

Expecting sub string: "a_union_nonzero.u.a = '0'" (was found)

Hide Details

runCmd: frame variable --show-types a_union_nonzero_ptr->u.a output: (unsigned char) a_union_nonzero_ptr->u.a = '0'

Hide Details

Hide Details

looking at: unsigned char

Hide Details

Checking string: "unsigned char"

Hide Details

Expecting sub string: "unsigned" (was found) Expecting sub string: "char" (was found)

Hide Details

looking at: (unsigned char) a_union_nonzero_ptr->u.a = '0'

Hide Details

Hide Details

Checking string: "(unsigned char) a_union_nonzero_ptr->u.a = '0' "

Hide Details

Expecting sub string: "a_union_nonzero_ptr->u.a = '0'" (was found)

Hide Details

runCmd: frame variable --show-types a_union_nonzero_ref.u.a output: (unsigned char) a_union_nonzero_ref.u.a = '0'

Hide Details

Hide Details

looking at: unsigned char

Hide Details

Checking string: "unsigned char"

Hide Details

Expecting sub string: "unsigned" (was found) Expecting sub string: "char" (was found)

Hide Details

looking at: (unsigned char) a_union_nonzero_ref.u.a = '0'

Hide Details

Hide Details

Checking string: "(unsigned char) a_union_nonzero_ref.u.a = '0' "

Hide Details

Expecting sub string: "a_union_nonzero_ref.u.a = '0'" (was found)

Hide Details

runCmd: frame variable --show-types a output: (unsigned char) a = '0'

Hide Details

Hide Details

looking at: unsigned char

Hide Details

Checking string: "unsigned char"

Hide Details

Expecting sub string: "unsigned" (was found) Expecting sub string: "char" (was found)

Hide Details

looking at: (unsigned char) a = '0'

Hide Details

Hide Details

Checking string: "(unsigned char) a = '0' "

Hide Details

Expecting sub string: "a = '0'" (was found)

Hide Details

runCmd: frame variable --show-types *a_ptr output: (unsigned char) *a_ptr = '0'

Hide Details

Hide Details

looking at: unsigned char

Hide Details

Checking string: "unsigned char"

Hide Details

Expecting sub string: "unsigned" (was found) Expecting sub string: "char" (was found)

Hide Details

looking at: (unsigned char) *a_ptr = '0'

Hide Details

Hide Details

Checking string: "(unsigned char) *a_ptr = '0' "

Hide Details

Expecting sub string: "*a_ptr = '0'" (was found)

Hide Details

runCmd: frame variable --show-types a_ref output: (unsigned char &) a_ref = 0x00007ffeefbff7e7: { (unsigned char) &a_ref = '0' }

Hide Details

Hide Details

looking at: unsigned char &

Hide Details

Checking string: "unsigned char &"

Hide Details

Expecting sub string: "unsigned" (was found) Expecting sub string: "char" (was found)

Hide Details

looking at: (unsigned char &) a_ref = 0x00007ffeefbff7e7: { (unsigned char) &a_ref = '0' }

Hide Details

Hide Details

Checking string: "(unsigned char &) a_ref = 0x00007ffeefbff7e7: { (unsigned char) &a_ref = '0' } "

Hide Details

Expecting sub string: "a_ref = '0'" (was found)

Hide Details

runCmd: frame variable --show-types a_class_instance.m_a output: (unsigned char) a_class_instance.m_a = '0'

Hide Details

Hide Details

looking at: unsigned char

Hide Details

Checking string: "unsigned char"

Hide Details

Expecting sub string: "unsigned" (was found) Expecting sub string: "char" (was found)

Hide Details

looking at: (unsigned char) a_class_instance.m_a = '0'

Hide Details

Hide Details

Checking string: "(unsigned char) a_class_instance.m_a = '0' "

Hide Details

Expecting sub string: "a_class_instance.m_a = '0'" (was found)

Hide Details

runCmd: frame variable --show-types a_class_instance.m_b output: (unsigned char) a_class_instance.m_b = '9'

Hide Details

Hide Details

looking at: unsigned char

Hide Details

Checking string: "unsigned char"

Hide Details

Expecting sub string: "unsigned" (was found) Expecting sub string: "char" (was found)

Hide Details

looking at: (unsigned char) a_class_instance.m_b = '9'

Hide Details

Hide Details

Checking string: "(unsigned char) a_class_instance.m_b = '9' "

Hide Details

Expecting sub string: "a_class_instance.m_b = '9'" (was found)

Hide Details

runCmd: frame variable --show-types a_class_ptr->m_a output: (unsigned char) a_class_ptr->m_a = '0'

Hide Details

Hide Details

looking at: unsigned char

Hide Details

Checking string: "unsigned char"

Hide Details

Expecting sub string: "unsigned" (was found) Expecting sub string: "char" (was found)

Hide Details

looking at: (unsigned char) a_class_ptr->m_a = '0'

Hide Details

Hide Details

Checking string: "(unsigned char) a_class_ptr->m_a = '0' "

Hide Details

Expecting sub string: "a_class_ptr->m_a = '0'" (was found)

Hide Details

runCmd: frame variable --show-types a_class_ptr->m_b output: (unsigned char) a_class_ptr->m_b = '9'

Hide Details

Hide Details

looking at: unsigned char

Hide Details

Checking string: "unsigned char"

Hide Details

Expecting sub string: "unsigned" (was found) Expecting sub string: "char" (was found)

Hide Details

looking at: (unsigned char) a_class_ptr->m_b = '9'

Hide Details

Hide Details

Checking string: "(unsigned char) a_class_ptr->m_b = '9' "

Hide Details

Expecting sub string: "a_class_ptr->m_b = '9'" (was found)

Hide Details

runCmd: frame variable --show-types a_class_ref.m_a output: (unsigned char) a_class_ref.m_a = '0'

Hide Details

Hide Details

looking at: unsigned char

Hide Details

Checking string: "unsigned char"

Hide Details

Expecting sub string: "unsigned" (was found) Expecting sub string: "char" (was found)

Hide Details

looking at: (unsigned char) a_class_ref.m_a = '0'

Hide Details

Hide Details

Checking string: "(unsigned char) a_class_ref.m_a = '0' "

Hide Details

Expecting sub string: "a_class_ref.m_a = '0'" (was found)

Hide Details

runCmd: frame variable --show-types a_class_ref.m_b output: (unsigned char) a_class_ref.m_b = '9'

Hide Details

Hide Details

looking at: unsigned char

Hide Details

Checking string: "unsigned char"

Hide Details

Expecting sub string: "unsigned" (was found) Expecting sub string: "char" (was found)

Hide Details

looking at: (unsigned char) a_class_ref.m_b = '9'

Hide Details

Hide Details

Checking string: "(unsigned char) a_class_ref.m_b = '9' "

Hide Details

Expecting sub string: "a_class_ref.m_b = '9'" (was found)

Hide Details

runCmd: frame variable --show-types a_struct.a output: (unsigned char) a_struct.a = '0'

Hide Details

Hide Details

looking at: unsigned char

Hide Details

Checking string: "unsigned char"

Hide Details

Expecting sub string: "unsigned" (was found) Expecting sub string: "char" (was found)

Hide Details

looking at: (unsigned char) a_struct.a = '0'

Hide Details

Hide Details

Checking string: "(unsigned char) a_struct.a = '0' "

Hide Details

Expecting sub string: "a_struct.a = '0'" (was found)

Hide Details

runCmd: frame variable --show-types a_struct.b output: (unsigned char) a_struct.b = '9'

Hide Details

Hide Details

looking at: unsigned char

Hide Details

Checking string: "unsigned char"

Hide Details

Expecting sub string: "unsigned" (was found) Expecting sub string: "char" (was found)

Hide Details

looking at: (unsigned char) a_struct.b = '9'

Hide Details

Hide Details

Checking string: "(unsigned char) a_struct.b = '9' "

Hide Details

Expecting sub string: "a_struct.b = '9'" (was found)

Hide Details

runCmd: frame variable --show-types a_struct_ptr->a output: (unsigned char) a_struct_ptr->a = '0'

Hide Details

Hide Details

looking at: unsigned char

Hide Details

Checking string: "unsigned char"

Hide Details

Expecting sub string: "unsigned" (was found) Expecting sub string: "char" (was found)

Hide Details

looking at: (unsigned char) a_struct_ptr->a = '0'

Hide Details

Hide Details

Checking string: "(unsigned char) a_struct_ptr->a = '0' "

Hide Details

Expecting sub string: "a_struct_ptr->a = '0'" (was found)

Hide Details

runCmd: frame variable --show-types a_struct_ptr->b output: (unsigned char) a_struct_ptr->b = '9'

Hide Details

Hide Details

looking at: unsigned char

Hide Details

Checking string: "unsigned char"

Hide Details

Expecting sub string: "unsigned" (was found) Expecting sub string: "char" (was found)

Hide Details

looking at: (unsigned char) a_struct_ptr->b = '9'

Hide Details

Hide Details

Checking string: "(unsigned char) a_struct_ptr->b = '9' "

Hide Details

Expecting sub string: "a_struct_ptr->b = '9'" (was found)

Hide Details

runCmd: frame variable --show-types a_struct_ref.a output: (unsigned char) a_struct_ref.a = '0'

Hide Details

Hide Details

looking at: unsigned char

Hide Details

Checking string: "unsigned char"

Hide Details

Expecting sub string: "unsigned" (was found) Expecting sub string: "char" (was found)

Hide Details

looking at: (unsigned char) a_struct_ref.a = '0'

Hide Details

Hide Details

Checking string: "(unsigned char) a_struct_ref.a = '0' "

Hide Details

Expecting sub string: "a_struct_ref.a = '0'" (was found)

Hide Details

runCmd: frame variable --show-types a_struct_ref.b output: (unsigned char) a_struct_ref.b = '9'

Hide Details

Hide Details

looking at: unsigned char

Hide Details

Checking string: "unsigned char"

Hide Details

Expecting sub string: "unsigned" (was found) Expecting sub string: "char" (was found)

Hide Details

looking at: (unsigned char) a_struct_ref.b = '9'

Hide Details

Hide Details

Checking string: "(unsigned char) a_struct_ref.b = '9' "

Hide Details

Expecting sub string: "a_struct_ref.b = '9'" (was found)

Hide Details

runCmd: frame variable --show-types a_union_zero.a output: (unsigned char) a_union_zero.a = '0'

Hide Details

Hide Details

looking at: unsigned char

Hide Details

Checking string: "unsigned char"

Hide Details

Expecting sub string: "unsigned" (was found) Expecting sub string: "char" (was found)

Hide Details

looking at: (unsigned char) a_union_zero.a = '0'

Hide Details

Hide Details

Checking string: "(unsigned char) a_union_zero.a = '0' "

Hide Details

Expecting sub string: "a_union_zero.a = '0'" (was found)

Hide Details

runCmd: frame variable --show-types a_union_zero_ptr->a output: (unsigned char) a_union_zero_ptr->a = '0'

Hide Details

Hide Details

looking at: unsigned char

Hide Details

Checking string: "unsigned char"

Hide Details

Expecting sub string: "unsigned" (was found) Expecting sub string: "char" (was found)

Hide Details

looking at: (unsigned char) a_union_zero_ptr->a = '0'

Hide Details

Hide Details

Checking string: "(unsigned char) a_union_zero_ptr->a = '0' "

Hide Details

Expecting sub string: "a_union_zero_ptr->a = '0'" (was found)

Hide Details

runCmd: frame variable --show-types a_union_zero_ref.a output: (unsigned char) a_union_zero_ref.a = '0'

Hide Details

Hide Details

looking at: unsigned char

Hide Details

Checking string: "unsigned char"

Hide Details

Expecting sub string: "unsigned" (was found) Expecting sub string: "char" (was found)

Hide Details

looking at: (unsigned char) a_union_zero_ref.a = '0'

Hide Details

Hide Details

Checking string: "(unsigned char) a_union_zero_ref.a = '0' "

Hide Details

Expecting sub string: "a_union_zero_ref.a = '0'" (was found)

Hide Details

runCmd: frame variable --show-types a_union_nonzero.u.a output: (unsigned char) a_union_nonzero.u.a = '0'

Hide Details

Hide Details

looking at: unsigned char

Hide Details

Checking string: "unsigned char"

Hide Details

Expecting sub string: "unsigned" (was found) Expecting sub string: "char" (was found)

Hide Details

looking at: (unsigned char) a_union_nonzero.u.a = '0'

Hide Details

Hide Details

Checking string: "(unsigned char) a_union_nonzero.u.a = '0' "

Hide Details

Expecting sub string: "a_union_nonzero.u.a = '0'" (was found)

Hide Details

runCmd: frame variable --show-types a_union_nonzero_ptr->u.a output: (unsigned char) a_union_nonzero_ptr->u.a = '0'

Hide Details

Hide Details

looking at: unsigned char

Hide Details

Checking string: "unsigned char"

Hide Details

Expecting sub string: "unsigned" (was found) Expecting sub string: "char" (was found)

Hide Details

looking at: (unsigned char) a_union_nonzero_ptr->u.a = '0'

Hide Details

Hide Details

Checking string: "(unsigned char) a_union_nonzero_ptr->u.a = '0' "

Hide Details

Expecting sub string: "a_union_nonzero_ptr->u.a = '0'" (was found)

Hide Details

runCmd: frame variable --show-types a_union_nonzero_ref.u.a output: (unsigned char) a_union_nonzero_ref.u.a = '0'

Hide Details

Hide Details

looking at: unsigned char

Hide Details

Checking string: "unsigned char"

Hide Details

Expecting sub string: "unsigned" (was found) Expecting sub string: "char" (was found)

Hide Details

looking at: (unsigned char) a_union_nonzero_ref.u.a = '0'

Hide Details

Hide Details

Checking string: "(unsigned char) a_union_nonzero_ref.u.a = '0' "

Hide Details

Expecting sub string: "a_union_nonzero_ref.u.a = '0'" (was found)

Hide Details

<bound method SBProcess.Kill of <lldb.SBProcess; proxy of <Swig Object of type 'lldb::SBProcess *' at 0x104bdb660> >>: success

Hide Details

Executing tearDown hook: self.addTearDownHook(lambda: self.runCmd( "settings set target.inline-breakpoint-strategy headers"))

Hide Details

Hide Details

runCmd: settings set target.inline-breakpoint-strategy headers output:

Hide Details

PASS: LLDB (/Users/buildslave/jenkins/workspace/lldb-cmake/lldb-build/bin/clang-x86_64) :: test_unsigned_char_type_from_block_dwarf (TestCharType.CharTypeTestCase) UNSUPPORTED: LLDB (/Users/buildslave/jenkins/workspace/lldb-cmake/lldb-build/bin/clang-x86_64) :: test_unsigned_char_type_from_block_dwo (TestCharType.CharTypeTestCase) (test case does not fall in any category of interest for this run) runCmd: settings clear -all output:

Hide Details

runCmd: settings set symbols.enable-external-lookup false output:

Hide Details

runCmd: settings set target.inherit-tcc true output:

Hide Details

runCmd: settings set target.auto-apply-fixits false output:

Hide Details

runCmd: settings set plugin.process.gdb-remote.packet-timeout 60 output:

Hide Details

runCmd: settings set symbols.clang-modules-cache-path "/Users/buildslave/jenkins/workspace/lldb-cmake/lldb-build/lldb-test-build.noindex/module-cache-lldb/lldb-api" output:

Hide Details

runCmd: settings set use-color false output:

Hide Details

runCmd: setting set target.prefer-dynamic-value no-dynamic-values output:

Hide Details

FAIL: LLDB (/Users/buildslave/jenkins/workspace/lldb-cmake/lldb-build/bin/clang-x86_64) :: test_unsigned_char_type_from_block_gmodules (TestCharType.CharTypeTestCase) runCmd: settings clear -all output:

Hide Details

runCmd: settings set symbols.enable-external-lookup false output:

Hide Details

runCmd: settings set target.inherit-tcc true output:

Hide Details

runCmd: settings set target.auto-apply-fixits false output:

Hide Details

runCmd: settings set plugin.process.gdb-remote.packet-timeout 60 output:

Hide Details

runCmd: settings set symbols.clang-modules-cache-path "/Users/buildslave/jenkins/workspace/lldb-cmake/lldb-build/lldb-test-build.noindex/module-cache-lldb/lldb-api" output:

Hide Details

runCmd: settings set use-color false output:

Hide Details

runCmd: setting set target.prefer-dynamic-value no-dynamic-values output:

Hide Details

FAIL: LLDB (/Users/buildslave/jenkins/workspace/lldb-cmake/lldb-build/bin/clang-x86_64) :: test_unsigned_char_type_gmodules (TestCharType.CharTypeTestCase) Restore dir to: /Users/buildslave/jenkins/workspace/lldb-cmake/lldb-build/tools/lldb/test ====================================================================== ERROR: test_char_type_from_block_gmodules (TestCharType.CharTypeTestCase) Test that char-type variables are displayed correctly from a block. ---------------------------------------------------------------------- Error when building test subject.

Hide Details

Build Command: make VPATH=/Users/buildslave/jenkins/workspace/lldb-cmake/llvm-project/lldb/test/API/types -C /Users/buildslave/jenkins/workspace/lldb-cmake/lldb-build/lldb-test-build.noindex/types/TestCharType.test_char_type_from_block_gmodules -I /Users/buildslave/jenkins/workspace/lldb-cmake/llvm-project/lldb/test/API/types -I /Users/buildslave/jenkins/workspace/lldb-cmake/llvm-project/lldb/packages/Python/lldbsuite/test/make -f /Users/buildslave/jenkins/workspace/lldb-cmake/llvm-project/lldb/test/API/types/Makefile MAKE_DSYM=NO MAKE_GMODULES=YES ARCH=x86_64 CC="/Users/buildslave/jenkins/workspace/lldb-cmake/lldb-build/bin/clang" DSYMUTIL="/Users/buildslave/jenkins/workspace/lldb-cmake/lldb-build/./bin/dsymutil" CLANG_MODULE_CACHE_DIR=/Users/buildslave/jenkins/workspace/lldb-cmake/lldb-build/lldb-test-build.noindex/module-cache-clang/lldb-api CXX_SOURCES='char.cpp' EXE='test_char_type_from_block_gmodules' CFLAGS_EXTRAS='-DTEST_BLOCK_CAPTURED_VARS'

Hide Details

Build Command Output: While building module 'std' imported from /Users/buildslave/jenkins/workspace/lldb-cmake/llvm-project/lldb/test/API/types/basic_type.cpp:26: In file included from <module-includes>:31: In file included from /Users/buildslave/jenkins/workspace/lldb-cmake/lldb-build/bin/../include/c++/v1/complex.h:28: In file included from /Users/buildslave/jenkins/workspace/lldb-cmake/lldb-build/bin/../include/c++/v1/ccomplex:20: In file included from /Users/buildslave/jenkins/workspace/lldb-cmake/lldb-build/bin/../include/c++/v1/complex:247: In file included from /Users/buildslave/jenkins/workspace/lldb-cmake/lldb-build/bin/../include/c++/v1/sstream:173: /Users/buildslave/jenkins/workspace/lldb-cmake/lldb-build/bin/../include/c++/v1/ostream:1038:45: error: no template named 'enable_if_t'; did you mean 'enable_if'? template <class _Stream, class _Tp, class = enable_if_t< ^ /Users/buildslave/jenkins/workspace/lldb-cmake/lldb-build/bin/../include/c++/v1/type_traits:538:63: note: 'enable_if' declared here template <bool, class _Tp = void> struct _LIBCPP_TEMPLATE_VIS enable_if {}; ^ While building module 'std' imported from /Users/buildslave/jenkins/workspace/lldb-cmake/llvm-project/lldb/test/API/types/basic_type.cpp:26: In file included from <module-includes>:31: In file included from /Users/buildslave/jenkins/workspace/lldb-cmake/lldb-build/bin/../include/c++/v1/complex.h:28: In file included from /Users/buildslave/jenkins/workspace/lldb-cmake/lldb-build/bin/../include/c++/v1/ccomplex:20: In file included from /Users/buildslave/jenkins/workspace/lldb-cmake/lldb-build/bin/../include/c++/v1/complex:247: In file included from /Users/buildslave/jenkins/workspace/lldb-cmake/lldb-build/bin/../include/c++/v1/sstream:174: /Users/buildslave/jenkins/workspace/lldb-cmake/lldb-build/bin/../include/c++/v1/istream:1389:45: error: no template named 'enable_if_t'; did you mean 'enable_if'? template <class _Stream, class _Tp, class = enable_if_t< ^ /Users/buildslave/jenkins/workspace/lldb-cmake/lldb-build/bin/../include/c++/v1/type_traits:538:63: note: 'enable_if' declared here template <bool, class _Tp = void> struct _LIBCPP_TEMPLATE_VIS enable_if {}; ^ In file included from /Users/buildslave/jenkins/workspace/lldb-cmake/llvm-project/lldb/test/API/types/char.cpp:9: /Users/buildslave/jenkins/workspace/lldb-cmake/llvm-project/lldb/test/API/types/basic_type.cpp:26:10: fatal error: could not build module 'std' #include <cstdint> ~~~~~~~~^ 3 errors generated. /Users/buildslave/jenkins/workspace/lldb-cmake/lldb-build/bin/clang -fmodules -gmodules -fmodules-cache-path=/Users/buildslave/jenkins/workspace/lldb-cmake/lldb-build/lldb-test-build.noindex/module-cache-clang/lldb-api -gmodules -fcxx-modules -std=c++11 -g -O0 -fno-builtin -isysroot "/Applications/Xcode.app/Contents/Developer/Platforms/MacOSX.platform/Developer/SDKs/MacOSX10.15.sdk" -arch x86_64 -I/Users/buildslave/jenkins/workspace/lldb-cmake/llvm-project/lldb/packages/Python/lldbsuite/test/make/../../../../../include -I/Users/buildslave/jenkins/workspace/lldb-cmake/llvm-project/lldb/test/API/types -I/Users/buildslave/jenkins/workspace/lldb-cmake/llvm-project/lldb/packages/Python/lldbsuite/test/make -include /Users/buildslave/jenkins/workspace/lldb-cmake/llvm-project/lldb/packages/Python/lldbsuite/test/make/test_common.h -fno-limit-debug-info -fmodules -gmodules -fmodules-cache-path=/Users/buildslave/jenkins/workspace/lldb-cmake/lldb-build/lldb-test-build.noindex/module-cache-clang/lldb-api -gmodules -fcxx-modules -DTEST_BLOCK_CAPTURED_VARS --driver-mode=g++ -c -o char.o /Users/buildslave/jenkins/workspace/lldb-cmake/llvm-project/lldb/test/API/types/char.cpp While building module 'std' imported from /Users/buildslave/jenkins/workspace/lldb-cmake/llvm-project/lldb/test/API/types/basic_type.cpp:26: In file included from <module-includes>:31: In file included from /Users/buildslave/jenkins/workspace/lldb-cmake/lldb-build/bin/../include/c++/v1/complex.h:28: In file included from /Users/buildslave/jenkins/workspace/lldb-cmake/lldb-build/bin/../include/c++/v1/ccomplex:20: In file included from /Users/buildslave/jenkins/workspace/lldb-cmake/lldb-build/bin/../include/c++/v1/complex:247: In file included from /Users/buildslave/jenkins/workspace/lldb-cmake/lldb-build/bin/../include/c++/v1/sstream:173: /Users/buildslave/jenkins/workspace/lldb-cmake/lldb-build/bin/../include/c++/v1/ostream:1038:45: error: no template named 'enable_if_t'; did you mean 'enable_if'? template <class _Stream, class _Tp, class = enable_if_t< ^ /Users/buildslave/jenkins/workspace/lldb-cmake/lldb-build/bin/../include/c++/v1/type_traits:538:63: note: 'enable_if' declared here template <bool, class _Tp = void> struct _LIBCPP_TEMPLATE_VIS enable_if {}; ^ While building module 'std' imported from /Users/buildslave/jenkins/workspace/lldb-cmake/llvm-project/lldb/test/API/types/basic_type.cpp:26: In file included from <module-includes>:31: In file included from /Users/buildslave/jenkins/workspace/lldb-cmake/lldb-build/bin/../include/c++/v1/complex.h:28: In file included from /Users/buildslave/jenkins/workspace/lldb-cmake/lldb-build/bin/../include/c++/v1/ccomplex:20: In file included from /Users/buildslave/jenkins/workspace/lldb-cmake/lldb-build/bin/../include/c++/v1/complex:247: In file included from /Users/buildslave/jenkins/workspace/lldb-cmake/lldb-build/bin/../include/c++/v1/sstream:174: /Users/buildslave/jenkins/workspace/lldb-cmake/lldb-build/bin/../include/c++/v1/istream:1389:45: error: no template named 'enable_if_t'; did you mean 'enable_if'? template <class _Stream, class _Tp, class = enable_if_t< ^ /Users/buildslave/jenkins/workspace/lldb-cmake/lldb-build/bin/../include/c++/v1/type_traits:538:63: note: 'enable_if' declared here template <bool, class _Tp = void> struct _LIBCPP_TEMPLATE_VIS enable_if {}; ^ In file included from /Users/buildslave/jenkins/workspace/lldb-cmake/llvm-project/lldb/test/API/types/char.cpp:9: /Users/buildslave/jenkins/workspace/lldb-cmake/llvm-project/lldb/test/API/types/basic_type.cpp:26:10: fatal error: could not build module 'std' #include <cstdint> ~~~~~~~~^ 3 errors generated. make: *** [char.o] Error 1

Hide Details

Test Directory: /Users/buildslave/jenkins/workspace/lldb-cmake/llvm-project/lldb/test/API/types ====================================================================== ERROR: test_char_type_gmodules (TestCharType.CharTypeTestCase) Test that char-type variables are displayed correctly. ---------------------------------------------------------------------- Error when building test subject.

Hide Details

Build Command: make VPATH=/Users/buildslave/jenkins/workspace/lldb-cmake/llvm-project/lldb/test/API/types -C /Users/buildslave/jenkins/workspace/lldb-cmake/lldb-build/lldb-test-build.noindex/types/TestCharType.test_char_type_gmodules -I /Users/buildslave/jenkins/workspace/lldb-cmake/llvm-project/lldb/test/API/types -I /Users/buildslave/jenkins/workspace/lldb-cmake/llvm-project/lldb/packages/Python/lldbsuite/test/make -f /Users/buildslave/jenkins/workspace/lldb-cmake/llvm-project/lldb/test/API/types/Makefile MAKE_DSYM=NO MAKE_GMODULES=YES ARCH=x86_64 CC="/Users/buildslave/jenkins/workspace/lldb-cmake/lldb-build/bin/clang" DSYMUTIL="/Users/buildslave/jenkins/workspace/lldb-cmake/lldb-build/./bin/dsymutil" CLANG_MODULE_CACHE_DIR=/Users/buildslave/jenkins/workspace/lldb-cmake/lldb-build/lldb-test-build.noindex/module-cache-clang/lldb-api CXX_SOURCES='char.cpp' EXE='test_char_type_gmodules'

Hide Details

Build Command Output: While building module 'std' imported from /Users/buildslave/jenkins/workspace/lldb-cmake/llvm-project/lldb/test/API/types/basic_type.cpp:26: In file included from <module-includes>:31: In file included from /Users/buildslave/jenkins/workspace/lldb-cmake/lldb-build/bin/../include/c++/v1/complex.h:28: In file included from /Users/buildslave/jenkins/workspace/lldb-cmake/lldb-build/bin/../include/c++/v1/ccomplex:20: In file included from /Users/buildslave/jenkins/workspace/lldb-cmake/lldb-build/bin/../include/c++/v1/complex:247: In file included from /Users/buildslave/jenkins/workspace/lldb-cmake/lldb-build/bin/../include/c++/v1/sstream:173: /Users/buildslave/jenkins/workspace/lldb-cmake/lldb-build/bin/../include/c++/v1/ostream:1038:45: error: no template named 'enable_if_t'; did you mean 'enable_if'? template <class _Stream, class _Tp, class = enable_if_t< ^ /Users/buildslave/jenkins/workspace/lldb-cmake/lldb-build/bin/../include/c++/v1/type_traits:538:63: note: 'enable_if' declared here template <bool, class _Tp = void> struct _LIBCPP_TEMPLATE_VIS enable_if {}; ^ While building module 'std' imported from /Users/buildslave/jenkins/workspace/lldb-cmake/llvm-project/lldb/test/API/types/basic_type.cpp:26: In file included from <module-includes>:31: In file included from /Users/buildslave/jenkins/workspace/lldb-cmake/lldb-build/bin/../include/c++/v1/complex.h:28: In file included from /Users/buildslave/jenkins/workspace/lldb-cmake/lldb-build/bin/../include/c++/v1/ccomplex:20: In file included from /Users/buildslave/jenkins/workspace/lldb-cmake/lldb-build/bin/../include/c++/v1/complex:247: In file included from /Users/buildslave/jenkins/workspace/lldb-cmake/lldb-build/bin/../include/c++/v1/sstream:174: /Users/buildslave/jenkins/workspace/lldb-cmake/lldb-build/bin/../include/c++/v1/istream:1389:45: error: no template named 'enable_if_t'; did you mean 'enable_if'? template <class _Stream, class _Tp, class = enable_if_t< ^ /Users/buildslave/jenkins/workspace/lldb-cmake/lldb-build/bin/../include/c++/v1/type_traits:538:63: note: 'enable_if' declared here template <bool, class _Tp = void> struct _LIBCPP_TEMPLATE_VIS enable_if {}; ^ In file included from /Users/buildslave/jenkins/workspace/lldb-cmake/llvm-project/lldb/test/API/types/char.cpp:9: /Users/buildslave/jenkins/workspace/lldb-cmake/llvm-project/lldb/test/API/types/basic_type.cpp:26:10: fatal error: could not build module 'std' #include <cstdint> ~~~~~~~~^ 3 errors generated. /Users/buildslave/jenkins/workspace/lldb-cmake/lldb-build/bin/clang -fmodules -gmodules -fmodules-cache-path=/Users/buildslave/jenkins/workspace/lldb-cmake/lldb-build/lldb-test-build.noindex/module-cache-clang/lldb-api -gmodules -fcxx-modules -std=c++11 -g -O0 -fno-builtin -isysroot "/Applications/Xcode.app/Contents/Developer/Platforms/MacOSX.platform/Developer/SDKs/MacOSX10.15.sdk" -arch x86_64 -I/Users/buildslave/jenkins/workspace/lldb-cmake/llvm-project/lldb/packages/Python/lldbsuite/test/make/../../../../../include -I/Users/buildslave/jenkins/workspace/lldb-cmake/llvm-project/lldb/test/API/types -I/Users/buildslave/jenkins/workspace/lldb-cmake/llvm-project/lldb/packages/Python/lldbsuite/test/make -include /Users/buildslave/jenkins/workspace/lldb-cmake/llvm-project/lldb/packages/Python/lldbsuite/test/make/test_common.h -fno-limit-debug-info -fmodules -gmodules -fmodules-cache-path=/Users/buildslave/jenkins/workspace/lldb-cmake/lldb-build/lldb-test-build.noindex/module-cache-clang/lldb-api -gmodules -fcxx-modules --driver-mode=g++ -c -o char.o /Users/buildslave/jenkins/workspace/lldb-cmake/llvm-project/lldb/test/API/types/char.cpp While building module 'std' imported from /Users/buildslave/jenkins/workspace/lldb-cmake/llvm-project/lldb/test/API/types/basic_type.cpp:26: In file included from <module-includes>:31: In file included from /Users/buildslave/jenkins/workspace/lldb-cmake/lldb-build/bin/../include/c++/v1/complex.h:28: In file included from /Users/buildslave/jenkins/workspace/lldb-cmake/lldb-build/bin/../include/c++/v1/ccomplex:20: In file included from /Users/buildslave/jenkins/workspace/lldb-cmake/lldb-build/bin/../include/c++/v1/complex:247: In file included from /Users/buildslave/jenkins/workspace/lldb-cmake/lldb-build/bin/../include/c++/v1/sstream:173: /Users/buildslave/jenkins/workspace/lldb-cmake/lldb-build/bin/../include/c++/v1/ostream:1038:45: error: no template named 'enable_if_t'; did you mean 'enable_if'? template <class _Stream, class _Tp, class = enable_if_t< ^ /Users/buildslave/jenkins/workspace/lldb-cmake/lldb-build/bin/../include/c++/v1/type_traits:538:63: note: 'enable_if' declared here template <bool, class _Tp = void> struct _LIBCPP_TEMPLATE_VIS enable_if {}; ^ While building module 'std' imported from /Users/buildslave/jenkins/workspace/lldb-cmake/llvm-project/lldb/test/API/types/basic_type.cpp:26: In file included from <module-includes>:31: In file included from /Users/buildslave/jenkins/workspace/lldb-cmake/lldb-build/bin/../include/c++/v1/complex.h:28: In file included from /Users/buildslave/jenkins/workspace/lldb-cmake/lldb-build/bin/../include/c++/v1/ccomplex:20: In file included from /Users/buildslave/jenkins/workspace/lldb-cmake/lldb-build/bin/../include/c++/v1/complex:247: In file included from /Users/buildslave/jenkins/workspace/lldb-cmake/lldb-build/bin/../include/c++/v1/sstream:174: /Users/buildslave/jenkins/workspace/lldb-cmake/lldb-build/bin/../include/c++/v1/istream:1389:45: error: no template named 'enable_if_t'; did you mean 'enable_if'? template <class _Stream, class _Tp, class = enable_if_t< ^ /Users/buildslave/jenkins/workspace/lldb-cmake/lldb-build/bin/../include/c++/v1/type_traits:538:63: note: 'enable_if' declared here template <bool, class _Tp = void> struct _LIBCPP_TEMPLATE_VIS enable_if {}; ^ In file included from /Users/buildslave/jenkins/workspace/lldb-cmake/llvm-project/lldb/test/API/types/char.cpp:9: /Users/buildslave/jenkins/workspace/lldb-cmake/llvm-project/lldb/test/API/types/basic_type.cpp:26:10: fatal error: could not build module 'std' #include <cstdint> ~~~~~~~~^ 3 errors generated. make: *** [char.o] Error 1

Hide Details

Test Directory: /Users/buildslave/jenkins/workspace/lldb-cmake/llvm-project/lldb/test/API/types ====================================================================== ERROR: test_unsigned_char_type_from_block_gmodules (TestCharType.CharTypeTestCase) Test that 'unsigned char'-type variables are displayed correctly from a block. ---------------------------------------------------------------------- Error when building test subject.

Hide Details

Build Command: make VPATH=/Users/buildslave/jenkins/workspace/lldb-cmake/llvm-project/lldb/test/API/types -C /Users/buildslave/jenkins/workspace/lldb-cmake/lldb-build/lldb-test-build.noindex/types/TestCharType.test_unsigned_char_type_from_block_gmodules -I /Users/buildslave/jenkins/workspace/lldb-cmake/llvm-project/lldb/test/API/types -I /Users/buildslave/jenkins/workspace/lldb-cmake/llvm-project/lldb/packages/Python/lldbsuite/test/make -f /Users/buildslave/jenkins/workspace/lldb-cmake/llvm-project/lldb/test/API/types/Makefile MAKE_DSYM=NO MAKE_GMODULES=YES ARCH=x86_64 CC="/Users/buildslave/jenkins/workspace/lldb-cmake/lldb-build/bin/clang" DSYMUTIL="/Users/buildslave/jenkins/workspace/lldb-cmake/lldb-build/./bin/dsymutil" CLANG_MODULE_CACHE_DIR=/Users/buildslave/jenkins/workspace/lldb-cmake/lldb-build/lldb-test-build.noindex/module-cache-clang/lldb-api CXX_SOURCES='unsigned_char.cpp' EXE='test_unsigned_char_type_from_block_gmodules' CFLAGS_EXTRAS='-DTEST_BLOCK_CAPTURED_VARS'

Hide Details

Build Command Output: While building module 'std' imported from /Users/buildslave/jenkins/workspace/lldb-cmake/llvm-project/lldb/test/API/types/basic_type.cpp:26: In file included from <module-includes>:31: In file included from /Users/buildslave/jenkins/workspace/lldb-cmake/lldb-build/bin/../include/c++/v1/complex.h:28: In file included from /Users/buildslave/jenkins/workspace/lldb-cmake/lldb-build/bin/../include/c++/v1/ccomplex:20: In file included from /Users/buildslave/jenkins/workspace/lldb-cmake/lldb-build/bin/../include/c++/v1/complex:247: In file included from /Users/buildslave/jenkins/workspace/lldb-cmake/lldb-build/bin/../include/c++/v1/sstream:173: /Users/buildslave/jenkins/workspace/lldb-cmake/lldb-build/bin/../include/c++/v1/ostream:1038:45: error: no template named 'enable_if_t'; did you mean 'enable_if'? template <class _Stream, class _Tp, class = enable_if_t< ^ /Users/buildslave/jenkins/workspace/lldb-cmake/lldb-build/bin/../include/c++/v1/type_traits:538:63: note: 'enable_if' declared here template <bool, class _Tp = void> struct _LIBCPP_TEMPLATE_VIS enable_if {}; ^ While building module 'std' imported from /Users/buildslave/jenkins/workspace/lldb-cmake/llvm-project/lldb/test/API/types/basic_type.cpp:26: In file included from <module-includes>:31: In file included from /Users/buildslave/jenkins/workspace/lldb-cmake/lldb-build/bin/../include/c++/v1/complex.h:28: In file included from /Users/buildslave/jenkins/workspace/lldb-cmake/lldb-build/bin/../include/c++/v1/ccomplex:20: In file included from /Users/buildslave/jenkins/workspace/lldb-cmake/lldb-build/bin/../include/c++/v1/complex:247: In file included from /Users/buildslave/jenkins/workspace/lldb-cmake/lldb-build/bin/../include/c++/v1/sstream:174: /Users/buildslave/jenkins/workspace/lldb-cmake/lldb-build/bin/../include/c++/v1/istream:1389:45: error: no template named 'enable_if_t'; did you mean 'enable_if'? template <class _Stream, class _Tp, class = enable_if_t< ^ /Users/buildslave/jenkins/workspace/lldb-cmake/lldb-build/bin/../include/c++/v1/type_traits:538:63: note: 'enable_if' declared here template <bool, class _Tp = void> struct _LIBCPP_TEMPLATE_VIS enable_if {}; ^ In file included from /Users/buildslave/jenkins/workspace/lldb-cmake/llvm-project/lldb/test/API/types/unsigned_char.cpp:9: /Users/buildslave/jenkins/workspace/lldb-cmake/llvm-project/lldb/test/API/types/basic_type.cpp:26:10: fatal error: could not build module 'std' #include <cstdint> ~~~~~~~~^ 3 errors generated. /Users/buildslave/jenkins/workspace/lldb-cmake/lldb-build/bin/clang -fmodules -gmodules -fmodules-cache-path=/Users/buildslave/jenkins/workspace/lldb-cmake/lldb-build/lldb-test-build.noindex/module-cache-clang/lldb-api -gmodules -fcxx-modules -std=c++11 -g -O0 -fno-builtin -isysroot "/Applications/Xcode.app/Contents/Developer/Platforms/MacOSX.platform/Developer/SDKs/MacOSX10.15.sdk" -arch x86_64 -I/Users/buildslave/jenkins/workspace/lldb-cmake/llvm-project/lldb/packages/Python/lldbsuite/test/make/../../../../../include -I/Users/buildslave/jenkins/workspace/lldb-cmake/llvm-project/lldb/test/API/types -I/Users/buildslave/jenkins/workspace/lldb-cmake/llvm-project/lldb/packages/Python/lldbsuite/test/make -include /Users/buildslave/jenkins/workspace/lldb-cmake/llvm-project/lldb/packages/Python/lldbsuite/test/make/test_common.h -fno-limit-debug-info -fmodules -gmodules -fmodules-cache-path=/Users/buildslave/jenkins/workspace/lldb-cmake/lldb-build/lldb-test-build.noindex/module-cache-clang/lldb-api -gmodules -fcxx-modules -DTEST_BLOCK_CAPTURED_VARS --driver-mode=g++ -c -o unsigned_char.o /Users/buildslave/jenkins/workspace/lldb-cmake/llvm-project/lldb/test/API/types/unsigned_char.cpp While building module 'std' imported from /Users/buildslave/jenkins/workspace/lldb-cmake/llvm-project/lldb/test/API/types/basic_type.cpp:26: In file included from <module-includes>:31: In file included from /Users/buildslave/jenkins/workspace/lldb-cmake/lldb-build/bin/../include/c++/v1/complex.h:28: In file included from /Users/buildslave/jenkins/workspace/lldb-cmake/lldb-build/bin/../include/c++/v1/ccomplex:20: In file included from /Users/buildslave/jenkins/workspace/lldb-cmake/lldb-build/bin/../include/c++/v1/complex:247: In file included from /Users/buildslave/jenkins/workspace/lldb-cmake/lldb-build/bin/../include/c++/v1/sstream:173: /Users/buildslave/jenkins/workspace/lldb-cmake/lldb-build/bin/../include/c++/v1/ostream:1038:45: error: no template named 'enable_if_t'; did you mean 'enable_if'? template <class _Stream, class _Tp, class = enable_if_t< ^ /Users/buildslave/jenkins/workspace/lldb-cmake/lldb-build/bin/../include/c++/v1/type_traits:538:63: note: 'enable_if' declared here template <bool, class _Tp = void> struct _LIBCPP_TEMPLATE_VIS enable_if {}; ^ While building module 'std' imported from /Users/buildslave/jenkins/workspace/lldb-cmake/llvm-project/lldb/test/API/types/basic_type.cpp:26: In file included from <module-includes>:31: In file included from /Users/buildslave/jenkins/workspace/lldb-cmake/lldb-build/bin/../include/c++/v1/complex.h:28: In file included from /Users/buildslave/jenkins/workspace/lldb-cmake/lldb-build/bin/../include/c++/v1/ccomplex:20: In file included from /Users/buildslave/jenkins/workspace/lldb-cmake/lldb-build/bin/../include/c++/v1/complex:247: In file included from /Users/buildslave/jenkins/workspace/lldb-cmake/lldb-build/bin/../include/c++/v1/sstream:174: /Users/buildslave/jenkins/workspace/lldb-cmake/lldb-build/bin/../include/c++/v1/istream:1389:45: error: no template named 'enable_if_t'; did you mean 'enable_if'? template <class _Stream, class _Tp, class = enable_if_t< ^ /Users/buildslave/jenkins/workspace/lldb-cmake/lldb-build/bin/../include/c++/v1/type_traits:538:63: note: 'enable_if' declared here template <bool, class _Tp = void> struct _LIBCPP_TEMPLATE_VIS enable_if {}; ^ In file included from /Users/buildslave/jenkins/workspace/lldb-cmake/llvm-project/lldb/test/API/types/unsigned_char.cpp:9: /Users/buildslave/jenkins/workspace/lldb-cmake/llvm-project/lldb/test/API/types/basic_type.cpp:26:10: fatal error: could not build module 'std' #include <cstdint> ~~~~~~~~^ 3 errors generated. make: *** [unsigned_char.o] Error 1

Hide Details

Test Directory: /Users/buildslave/jenkins/workspace/lldb-cmake/llvm-project/lldb/test/API/types ====================================================================== ERROR: test_unsigned_char_type_gmodules (TestCharType.CharTypeTestCase) Test that 'unsigned_char'-type variables are displayed correctly. ---------------------------------------------------------------------- Error when building test subject.

Hide Details

Build Command: make VPATH=/Users/buildslave/jenkins/workspace/lldb-cmake/llvm-project/lldb/test/API/types -C /Users/buildslave/jenkins/workspace/lldb-cmake/lldb-build/lldb-test-build.noindex/types/TestCharType.test_unsigned_char_type_gmodules -I /Users/buildslave/jenkins/workspace/lldb-cmake/llvm-project/lldb/test/API/types -I /Users/buildslave/jenkins/workspace/lldb-cmake/llvm-project/lldb/packages/Python/lldbsuite/test/make -f /Users/buildslave/jenkins/workspace/lldb-cmake/llvm-project/lldb/test/API/types/Makefile MAKE_DSYM=NO MAKE_GMODULES=YES ARCH=x86_64 CC="/Users/buildslave/jenkins/workspace/lldb-cmake/lldb-build/bin/clang" DSYMUTIL="/Users/buildslave/jenkins/workspace/lldb-cmake/lldb-build/./bin/dsymutil" CLANG_MODULE_CACHE_DIR=/Users/buildslave/jenkins/workspace/lldb-cmake/lldb-build/lldb-test-build.noindex/module-cache-clang/lldb-api CXX_SOURCES='unsigned_char.cpp' EXE='test_unsigned_char_type_gmodules'

Hide Details

Build Command Output: While building module 'std' imported from /Users/buildslave/jenkins/workspace/lldb-cmake/llvm-project/lldb/test/API/types/basic_type.cpp:26: In file included from <module-includes>:31: In file included from /Users/buildslave/jenkins/workspace/lldb-cmake/lldb-build/bin/../include/c++/v1/complex.h:28: In file included from /Users/buildslave/jenkins/workspace/lldb-cmake/lldb-build/bin/../include/c++/v1/ccomplex:20: In file included from /Users/buildslave/jenkins/workspace/lldb-cmake/lldb-build/bin/../include/c++/v1/complex:247: In file included from /Users/buildslave/jenkins/workspace/lldb-cmake/lldb-build/bin/../include/c++/v1/sstream:173: /Users/buildslave/jenkins/workspace/lldb-cmake/lldb-build/bin/../include/c++/v1/ostream:1038:45: error: no template named 'enable_if_t'; did you mean 'enable_if'? template <class _Stream, class _Tp, class = enable_if_t< ^ /Users/buildslave/jenkins/workspace/lldb-cmake/lldb-build/bin/../include/c++/v1/type_traits:538:63: note: 'enable_if' declared here template <bool, class _Tp = void> struct _LIBCPP_TEMPLATE_VIS enable_if {}; ^ While building module 'std' imported from /Users/buildslave/jenkins/workspace/lldb-cmake/llvm-project/lldb/test/API/types/basic_type.cpp:26: In file included from <module-includes>:31: In file included from /Users/buildslave/jenkins/workspace/lldb-cmake/lldb-build/bin/../include/c++/v1/complex.h:28: In file included from /Users/buildslave/jenkins/workspace/lldb-cmake/lldb-build/bin/../include/c++/v1/ccomplex:20: In file included from /Users/buildslave/jenkins/workspace/lldb-cmake/lldb-build/bin/../include/c++/v1/complex:247: In file included from /Users/buildslave/jenkins/workspace/lldb-cmake/lldb-build/bin/../include/c++/v1/sstream:174: /Users/buildslave/jenkins/workspace/lldb-cmake/lldb-build/bin/../include/c++/v1/istream:1389:45: error: no template named 'enable_if_t'; did you mean 'enable_if'? template <class _Stream, class _Tp, class = enable_if_t< ^ /Users/buildslave/jenkins/workspace/lldb-cmake/lldb-build/bin/../include/c++/v1/type_traits:538:63: note: 'enable_if' declared here template <bool, class _Tp = void> struct _LIBCPP_TEMPLATE_VIS enable_if {}; ^ In file included from /Users/buildslave/jenkins/workspace/lldb-cmake/llvm-project/lldb/test/API/types/unsigned_char.cpp:9: /Users/buildslave/jenkins/workspace/lldb-cmake/llvm-project/lldb/test/API/types/basic_type.cpp:26:10: fatal error: could not build module 'std' #include <cstdint> ~~~~~~~~^ 3 errors generated. /Users/buildslave/jenkins/workspace/lldb-cmake/lldb-build/bin/clang -fmodules -gmodules -fmodules-cache-path=/Users/buildslave/jenkins/workspace/lldb-cmake/lldb-build/lldb-test-build.noindex/module-cache-clang/lldb-api -gmodules -fcxx-modules -std=c++11 -g -O0 -fno-builtin -isysroot "/Applications/Xcode.app/Contents/Developer/Platforms/MacOSX.platform/Developer/SDKs/MacOSX10.15.sdk" -arch x86_64 -I/Users/buildslave/jenkins/workspace/lldb-cmake/llvm-project/lldb/packages/Python/lldbsuite/test/make/../../../../../include -I/Users/buildslave/jenkins/workspace/lldb-cmake/llvm-project/lldb/test/API/types -I/Users/buildslave/jenkins/workspace/lldb-cmake/llvm-project/lldb/packages/Python/lldbsuite/test/make -include /Users/buildslave/jenkins/workspace/lldb-cmake/llvm-project/lldb/packages/Python/lldbsuite/test/make/test_common.h -fno-limit-debug-info -fmodules -gmodules -fmodules-cache-path=/Users/buildslave/jenkins/workspace/lldb-cmake/lldb-build/lldb-test-build.noindex/module-cache-clang/lldb-api -gmodules -fcxx-modules --driver-mode=g++ -c -o unsigned_char.o /Users/buildslave/jenkins/workspace/lldb-cmake/llvm-project/lldb/test/API/types/unsigned_char.cpp While building module 'std' imported from /Users/buildslave/jenkins/workspace/lldb-cmake/llvm-project/lldb/test/API/types/basic_type.cpp:26: In file included from <module-includes>:31: In file included from /Users/buildslave/jenkins/workspace/lldb-cmake/lldb-build/bin/../include/c++/v1/complex.h:28: In file included from /Users/buildslave/jenkins/workspace/lldb-cmake/lldb-build/bin/../include/c++/v1/ccomplex:20: In file included from /Users/buildslave/jenkins/workspace/lldb-cmake/lldb-build/bin/../include/c++/v1/complex:247: In file included from /Users/buildslave/jenkins/workspace/lldb-cmake/lldb-build/bin/../include/c++/v1/sstream:173: /Users/buildslave/jenkins/workspace/lldb-cmake/lldb-build/bin/../include/c++/v1/ostream:1038:45: error: no template named 'enable_if_t'; did you mean 'enable_if'? template <class _Stream, class _Tp, class = enable_if_t< ^ /Users/buildslave/jenkins/workspace/lldb-cmake/lldb-build/bin/../include/c++/v1/type_traits:538:63: note: 'enable_if' declared here template <bool, class _Tp = void> struct _LIBCPP_TEMPLATE_VIS enable_if {}; ^ While building module 'std' imported from /Users/buildslave/jenkins/workspace/lldb-cmake/llvm-project/lldb/test/API/types/basic_type.cpp:26: In file included from <module-includes>:31: In file included from /Users/buildslave/jenkins/workspace/lldb-cmake/lldb-build/bin/../include/c++/v1/complex.h:28: In file included from /Users/buildslave/jenkins/workspace/lldb-cmake/lldb-build/bin/../include/c++/v1/ccomplex:20: In file included from /Users/buildslave/jenkins/workspace/lldb-cmake/lldb-build/bin/../include/c++/v1/complex:247: In file included from /Users/buildslave/jenkins/workspace/lldb-cmake/lldb-build/bin/../include/c++/v1/sstream:174: /Users/buildslave/jenkins/workspace/lldb-cmake/lldb-build/bin/../include/c++/v1/istream:1389:45: error: no template named 'enable_if_t'; did you mean 'enable_if'? template <class _Stream, class _Tp, class = enable_if_t< ^ /Users/buildslave/jenkins/workspace/lldb-cmake/lldb-build/bin/../include/c++/v1/type_traits:538:63: note: 'enable_if' declared here template <bool, class _Tp = void> struct _LIBCPP_TEMPLATE_VIS enable_if {}; ^ In file included from /Users/buildslave/jenkins/workspace/lldb-cmake/llvm-project/lldb/test/API/types/unsigned_char.cpp:9: /Users/buildslave/jenkins/workspace/lldb-cmake/llvm-project/lldb/test/API/types/basic_type.cpp:26:10: fatal error: could not build module 'std' #include <cstdint> ~~~~~~~~^ 3 errors generated. make: *** [unsigned_char.o] Error 1

Hide Details

Test Directory: /Users/buildslave/jenkins/workspace/lldb-cmake/llvm-project/lldb/test/API/types ---------------------------------------------------------------------- Ran 16 tests in 35.020s

Hide Details

RESULT: FAILED (8 passes, 0 failures, 4 errors, 4 skipped, 0 expected failures, 0 unexpected successes)

Hide Details

--

Hide Details

******************** PASS: lldb-unit :: SymbolFile/DWARF/./SymbolFileDWARFTests/SymbolFileDWARFTests.TestAbbrevValidAttrNullForm (2140 of 2150) PASS: lldb-api :: lang/objc/objc-stepping/TestObjCStepping.py (2141 of 2150) PASS: lldb-api :: functionalities/thread/concurrent_events/TestConcurrentTwoBreakpointsOneDelaySignal.py (2142 of 2150) PASS: lldb-shell :: SymbolFile/DWARF/DW_AT_declaration-with-children.s (2143 of 2150) PASS: lldb-unit :: Process/gdb-remote/./ProcessGdbRemoteTests/GDBRemoteCommunicationClientTest.GetMemoryRegionInfo (2144 of 2150) PASS: lldb-api :: functionalities/gdb_remote_client/TestArmRegisterDefinition.py (2145 of 2150) PASS: lldb-unit :: Utility/./UtilityTests/VMRange.SetEndAddress (2146 of 2150) PASS: lldb-unit :: Utility/./UtilityTests/AnsiTerminal.AtEnd (2147 of 2150) FAIL: lldb-api :: functionalities/data-formatter/data-formatter-script/TestDataFormatterScript.py (2148 of 2150) ******************** TEST 'lldb-api :: functionalities/data-formatter/data-formatter-script/TestDataFormatterScript.py' FAILED ******************** Script: -- /usr/local/Frameworks/Python.framework/Versions/3.7/bin/python3.7 /Users/buildslave/jenkins/workspace/lldb-cmake/llvm-project/lldb/test/API/dotest.py -s /Users/buildslave/jenkins/workspace/lldb-cmake/lldb-build/lldb-test-traces -S nm -u CXXFLAGS -u CFLAGS --codesign-identity - --server /Users/buildslave/jenkins/workspace/lldb-cmake/lldb-build/./bin/debugserver --arch x86_64 --build-dir /Users/buildslave/jenkins/workspace/lldb-cmake/lldb-build/lldb-test-build.noindex -s=/Users/buildslave/jenkins/workspace/lldb-cmake/test/logs -t --env TERM=vt100 --env LLVM_LIBS_DIR=/Users/buildslave/jenkins/workspace/lldb-cmake/lldb-build/./lib --arch x86_64 --build-dir /Users/buildslave/jenkins/workspace/lldb-cmake/lldb-build/lldb-test-build.noindex --lldb-module-cache-dir /Users/buildslave/jenkins/workspace/lldb-cmake/lldb-build/lldb-test-build.noindex/module-cache-lldb/lldb-api --clang-module-cache-dir /Users/buildslave/jenkins/workspace/lldb-cmake/lldb-build/lldb-test-build.noindex/module-cache-clang/lldb-api --executable /Users/buildslave/jenkins/workspace/lldb-cmake/lldb-build/./bin/lldb --compiler /Users/buildslave/jenkins/workspace/lldb-cmake/lldb-build/./bin/clang --dsymutil /Users/buildslave/jenkins/workspace/lldb-cmake/lldb-build/./bin/dsymutil --filecheck /Users/buildslave/jenkins/workspace/lldb-cmake/lldb-build/./bin/FileCheck --yaml2obj /Users/buildslave/jenkins/workspace/lldb-cmake/lldb-build/./bin/yaml2obj --lldb-libs-dir /Users/buildslave/jenkins/workspace/lldb-cmake/lldb-build/./lib /Users/buildslave/jenkins/workspace/lldb-cmake/llvm-project/lldb/test/API/functionalities/data-formatter/data-formatter-script -p TestDataFormatterScript.py -- Exit Code: 1

Hide Details

Command Output (stdout): -- lldb version 12.0.99 clang revision b90132399aa994ac6405d0d6437735043bff9314 llvm revision b90132399aa994ac6405d0d6437735043bff9314 libstdcxx tests will not be run because: Don't know how to build with libstdcxx on macosx Skipping following debug info categories: ['dwo']

Hide Details

-- Command Output (stderr): --

Hide Details

Session logs for test failures/errors/unexpected successes will go into directory '/Users/buildslave/jenkins/workspace/lldb-cmake/test/logs' Change dir to: /Users/buildslave/jenkins/workspace/lldb-cmake/llvm-project/lldb/test/API/functionalities/data-formatter/data-formatter-script runCmd: settings clear -all output:

Hide Details

runCmd: settings set symbols.enable-external-lookup false output:

Hide Details

runCmd: settings set target.inherit-tcc true output:

Hide Details

runCmd: settings set target.auto-apply-fixits false output:

Hide Details

runCmd: settings set plugin.process.gdb-remote.packet-timeout 60 output:

Hide Details

runCmd: settings set symbols.clang-modules-cache-path "/Users/buildslave/jenkins/workspace/lldb-cmake/lldb-build/lldb-test-build.noindex/module-cache-lldb/lldb-api" output:

Hide Details

runCmd: settings set use-color false output:

Hide Details

runCmd: setting set target.prefer-dynamic-value no-dynamic-values output:

Hide Details

runCmd: file /Users/buildslave/jenkins/workspace/lldb-cmake/lldb-build/lldb-test-build.noindex/functionalities/data-formatter/data-formatter-script/TestDataFormatterScript.test_with_run_command_dsym/a.out output: Current executable set to '/Users/buildslave/jenkins/workspace/lldb-cmake/lldb-build/lldb-test-build.noindex/functionalities/data-formatter/data-formatter-script/TestDataFormatterScript.test_with_run_command_dsym/a.out' (x86_64).

Hide Details

Hide Details

runCmd: breakpoint set -f "main.cpp" -l 37 output: Breakpoint 1: where = a.out`main + 198 at main.cpp:37:17, address = 0x0000000100000d86

Hide Details

Hide Details

Expecting pattern: ^Breakpoint (?P<bpno>[0-9]+): (?P<num_locations>[0-9]+) locations\.$ Not matched

Hide Details

Expecting pattern: ^Breakpoint (?P<bpno>[0-9]+): (?P<num_locations>no) locations \(pending\)\. Not matched

Hide Details

Expecting pattern: ^Breakpoint (?P<bpno>[0-9]+): where = (?P<module>.*)`(?P<symbol>[+\-]{0,1}[^+]+)( \+ (?P<offset>[0-9]+)){0,1}( \[inlined\] (?P<inline_symbol>.*)){0,1} at (?P<file>[^:]+):(?P<line_no>[0-9]+)(?P<column>(:[0-9]+)?), address = (?P<address>0x[0-9a-fA-F]+)$ Matched

Hide Details

runCmd: run output: Process 19368 stopped * thread #1, queue = 'com.apple.main-thread', stop reason = breakpoint 1.1 frame #0: 0x0000000100000d86 a.out`main(argc=1, argv=0x00007ffeefbff848) at main.cpp:37:17 34 35 i_am_cool array[5]; 36 -> 37 i_am_cooler three(10,4,1985,1/1/2011,'B','E'); // Set break point at this line. ^ 38 39 two.integer = 1; 40

Hide Details

Process 19368 launched: '/Users/buildslave/jenkins/workspace/lldb-cmake/lldb-build/lldb-test-build.noindex/functionalities/data-formatter/data-formatter-script/TestDataFormatterScript.test_with_run_command_dsym/a.out' (x86_64)

Hide Details

Hide Details

runCmd: thread list output: Process 19368 stopped * thread #1: tid = 0x3d3972, 0x0000000100000d86 a.out`main(argc=1, argv=0x00007ffeefbff848) at main.cpp:37:17, queue = 'com.apple.main-thread', stop reason = breakpoint 1.1

Hide Details

Hide Details

Ran command: "thread list"

Hide Details

Got output: Process 19368 stopped * thread #1: tid = 0x3d3972, 0x0000000100000d86 a.out`main(argc=1, argv=0x00007ffeefbff848) at main.cpp:37:17, queue = 'com.apple.main-thread', stop reason = breakpoint 1.1

Hide Details

Expecting sub string: "stopped" (was found) Expecting sub string: "stop reason = breakpoint" (was found)

Hide Details

Adding tearDown hook: def cleanup(): self.runCmd('type format clear', check=False) self.runCmd('type summary clear', check=False)

Hide Details

Hide Details

runCmd: type summary add i_am_cool --python-script "a = valobj.GetChildMemberWithName('integer'); a_val = a.GetValue(); str = 'Hello from Python, ' + a_val + ' time'; return str + ('!' if a_val == '1' else 's!');" output:

Hide Details

runCmd: type summary list i_am_cool output: ----------------------- Category: default ----------------------- i_am_cool: a = valobj.GetChildMemberWithName('integer'); a_val = a.GetValue(); str = 'Hello from Python, ' + a_val + ' time'; return str + ('!' if a_val == '1' else 's!'); ----------------------- Category: VectorTypes ----------------------- ----------------------- Category: system ----------------------- ----------------------- Category: cplusplus ----------------------- ----------------------- Category: objc -----------------------

Hide Details

Hide Details

Ran command: "type summary list i_am_cool"

Hide Details

Got output: ----------------------- Category: default ----------------------- i_am_cool: a = valobj.GetChildMemberWithName('integer'); a_val = a.GetValue(); str = 'Hello from Python, ' + a_val + ' time'; return str + ('!' if a_val == '1' else 's!'); ----------------------- Category: VectorTypes ----------------------- ----------------------- Category: system ----------------------- ----------------------- Category: cplusplus ----------------------- ----------------------- Category: objc -----------------------

Hide Details

Expecting sub string: "a = valobj.GetChildMemberWithName('integer'); a_val = a.GetValue(); str = 'Hello from Python, ' + a_val + ' time'; return str + ('!' if a_val == '1' else 's!');" (was found)

Hide Details

runCmd: frame variable one output: (i_am_cool) one = Hello from Python, 1 time!

Hide Details

Hide Details

Ran command: "frame variable one"

Hide Details

Got output: (i_am_cool) one = Hello from Python, 1 time!

Hide Details

Expecting sub string: "Hello from Python" (was found) Expecting sub string: "1 time!" (was found)

Hide Details

runCmd: frame variable two output: (i_am_cool) two = Hello from Python, 4 times!

Hide Details

Hide Details

Ran command: "frame variable two"

Hide Details

Got output: (i_am_cool) two = Hello from Python, 4 times!

Hide Details

Expecting sub string: "Hello from Python" (was found) Expecting sub string: "4 times!" (was found)

Hide Details

runCmd: n output: Process 19368 stopped * thread #1, queue = 'com.apple.main-thread', stop reason = step over frame #0: 0x0000000100000daa a.out`main(argc=1, argv=0x00007ffeefbff848) at main.cpp:39:17 36 37 i_am_cooler three(10,4,1985,1/1/2011,'B','E'); // Set break point at this line. 38 -> 39 two.integer = 1; ^ 40 41 int dummy = 1; 42

Hide Details

Hide Details

Hide Details

runCmd: frame variable three output: (i_am_cooler) three = (first_cool = Hello from Python, 10 times!, second_cool = Hello from Python, 4 times!, floating = 992.5)

Hide Details

Hide Details

Ran command: "frame variable three"

Hide Details

Got output: (i_am_cooler) three = (first_cool = Hello from Python, 10 times!, second_cool = Hello from Python, 4 times!, floating = 992.5)

Hide Details

Expecting sub string: "Hello from Python, 10 times!" (was found) Expecting sub string: "Hello from Python, 4 times!" (was found)

Hide Details

runCmd: n output: Process 19368 stopped * thread #1, queue = 'com.apple.main-thread', stop reason = step over frame #0: 0x0000000100000db1 a.out`main(argc=1, argv=0x00007ffeefbff848) at main.cpp:41:9 38 39 two.integer = 1; 40 -> 41 int dummy = 1; ^ 42 43 return 0; 44 }

Hide Details

Hide Details

Hide Details

runCmd: frame variable two output: (i_am_cool) two = Hello from Python, 1 time!

Hide Details

Hide Details

Ran command: "frame variable two"

Hide Details

Got output: (i_am_cool) two = Hello from Python, 1 time!

Hide Details

Expecting sub string: "Hello from Python" (was found) Expecting sub string: "1 time!" (was found)

Hide Details

runCmd: type summary add i_am_cool --python-script "a = valobj.GetChildMemberWithName('integer'); a_val = a.GetValue(); str = 'int says ' + a_val; return str;" output:

Hide Details

runCmd: frame variable two output: (i_am_cool) two = int says 1

Hide Details

Hide Details

Ran command: "frame variable two"

Hide Details

Got output: (i_am_cool) two = int says 1

Hide Details

Expecting sub string: "int says 1" (was found)

Hide Details

runCmd: frame variable twoptr output: (i_am_cool *) twoptr = 0x00007ffeefbff7a0 int says 1

Hide Details

Hide Details

Ran command: "frame variable twoptr"

Hide Details

Got output: (i_am_cool *) twoptr = 0x00007ffeefbff7a0 int says 1

Hide Details

Expecting sub string: "int says 1" (was found)

Hide Details

runCmd: type summary add --summary-string "int says ${var.integer}, and float says ${var.floating}" i_am_cool output:

Hide Details

runCmd: frame variable two output: (i_am_cool) two = int says 1, and float says 2.71000004

Hide Details

Hide Details

Ran command: "frame variable two"

Hide Details

Got output: (i_am_cool) two = int says 1, and float says 2.71000004

Hide Details

Expecting sub string: "int says 1" (was found) Expecting sub string: "and float says 2.71" (was found)

Hide Details

runCmd: frame variable twoptr output: (i_am_cool *) twoptr = 0x00007ffeefbff7a0 int says 1, and float says 2.71000004

Hide Details

Hide Details

Ran command: "frame variable twoptr"

Hide Details

Got output: (i_am_cool *) twoptr = 0x00007ffeefbff7a0 int says 1, and float says 2.71000004

Hide Details

Expecting sub string: "int says 1" (was found) Expecting sub string: "and float says 2.71" (was found)

Hide Details

runCmd: type summary add i_am_cool -p --python-script "a = valobj.GetChildMemberWithName('integer'); a_val = a.GetValue(); str = 'int says ' + a_val; return str;" output:

Hide Details

runCmd: frame variable twoptr output: (i_am_cool *) twoptr = 0x00007ffeefbff7a0

Hide Details

Hide Details

Ran command: "frame variable twoptr"

Hide Details

Got output: (i_am_cool *) twoptr = 0x00007ffeefbff7a0

Hide Details

Not expecting sub string: "and float says 2.71" (was not found)

Hide Details

runCmd: type summary add --name test_summary --python-script "return 'Python summary'" output:

Hide Details

runCmd: frame variable one --summary test_summary output: (i_am_cool) one = Python summary

Hide Details

Hide Details

Ran command: "frame variable one --summary test_summary"

Hide Details

Got output: (i_am_cool) one = Python summary

Hide Details

Expecting sub string: "Python summary" (was found)

Hide Details

runCmd: frame variable two output: (i_am_cool) two = int says 1

Hide Details

Hide Details

Ran command: "frame variable two"

Hide Details

Got output: (i_am_cool) two = int says 1

Hide Details

Not expecting sub string: "Python summary" (was not found)

Hide Details

runCmd: frame variable one output: (i_am_cool) one = int says 1

Hide Details

Hide Details

Ran command: "frame variable one"

Hide Details

Got output: (i_am_cool) one = int says 1

Hide Details

Not expecting sub string: "Python summary" (was not found)

Hide Details

runCmd: type summary add i_am_cool --summary-string "Text summary" output:

Hide Details

runCmd: frame variable one output: (i_am_cool) one = Text summary

Hide Details

Hide Details

Ran command: "frame variable one"

Hide Details

Got output: (i_am_cool) one = Text summary

Hide Details

Not expecting sub string: "Python summary" (was not found)

Hide Details

runCmd: frame variable two output: (i_am_cool) two = Text summary

Hide Details

Hide Details

Ran command: "frame variable two"

Hide Details

Got output: (i_am_cool) two = Text summary

Hide Details

Expecting sub string: "Text summary" (was found)

Hide Details

runCmd: n output: Process 19368 stopped * thread #1, queue = 'com.apple.main-thread', stop reason = step over frame #0: 0x0000000100000dd4 a.out`main(argc=1, argv=0x00007ffeefbff848) at main.cpp:43:5 40 41 int dummy = 1; 42 -> 43 return 0; ^ 44 }

Hide Details

Hide Details

Hide Details

runCmd: frame variable one output: (i_am_cool) one = Text summary

Hide Details

Hide Details

Ran command: "frame variable one"

Hide Details

Got output: (i_am_cool) one = Text summary

Hide Details

Expecting sub string: "Text summary" (was found)

Hide Details

runCmd: frame variable two output: (i_am_cool) two = Text summary

Hide Details

Hide Details

Ran command: "frame variable two"

Hide Details

Got output: (i_am_cool) two = Text summary

Hide Details

Expecting sub string: "Text summary" (was found)

Hide Details

runCmd: type summary add i_am_cool -p --summary-string "Text summary" output:

Hide Details

runCmd: type summary add -x cool --python-script "return 'Python summary'" output:

Hide Details

runCmd: frame variable one output: (i_am_cool) one = Text summary

Hide Details

Hide Details

Ran command: "frame variable one"

Hide Details

Got output: (i_am_cool) one = Text summary

Hide Details

Expecting sub string: "Text summary" (was found)

Hide Details

runCmd: frame variable two output: (i_am_cool) two = Text summary

Hide Details

Hide Details

Ran command: "frame variable two"

Hide Details

Got output: (i_am_cool) two = Text summary

Hide Details

Expecting sub string: "Text summary" (was found)

Hide Details

runCmd: frame variable twoptr output: (i_am_cool *) twoptr = 0x00007ffeefbff7a0 Python summary

Hide Details

Hide Details

Ran command: "frame variable twoptr"

Hide Details

Got output: (i_am_cool *) twoptr = 0x00007ffeefbff7a0 Python summary

Hide Details

Expecting sub string: "Python summary" (was found)

Hide Details

runCmd: frame variable array output: (i_am_cool [5]) array = Python summary

Hide Details

Hide Details

Ran command: "frame variable array"

Hide Details

Got output: (i_am_cool [5]) array = Python summary

Hide Details

Expecting sub string: "Python summary" (was found)

Hide Details

runCmd: type summary add i_am_cool --summary-string "Text summary" output:

Hide Details

runCmd: frame variable one output: (i_am_cool) one = Text summary

Hide Details

Hide Details

Ran command: "frame variable one"

Hide Details

Got output: (i_am_cool) one = Text summary

Hide Details

Expecting sub string: "Text summary" (was found)

Hide Details

runCmd: frame variable two output: (i_am_cool) two = Text summary

Hide Details

Hide Details

Ran command: "frame variable two"

Hide Details

Got output: (i_am_cool) two = Text summary

Hide Details

Expecting sub string: "Text summary" (was found)

Hide Details

runCmd: frame variable twoptr output: (i_am_cool *) twoptr = 0x00007ffeefbff7a0 Text summary

Hide Details

Hide Details

Ran command: "frame variable twoptr"

Hide Details

Got output: (i_am_cool *) twoptr = 0x00007ffeefbff7a0 Text summary

Hide Details

Expecting sub string: "Text summary" (was found)

Hide Details

runCmd: frame variable array output: (i_am_cool [5]) array = Python summary

Hide Details

Hide Details

Ran command: "frame variable array"

Hide Details

Got output: (i_am_cool [5]) array = Python summary

Hide Details

Expecting sub string: "Python summary" (was found)

Hide Details

<bound method SBProcess.Kill of <lldb.SBProcess; proxy of <Swig Object of type 'lldb::SBProcess *' at 0x105b51060> >>: success

Hide Details

Executing tearDown hook: def cleanup(): self.runCmd('type format clear', check=False) self.runCmd('type summary clear', check=False)

Hide Details

Hide Details

runCmd: type format clear check of return status not required output:

Hide Details

runCmd: type summary clear check of return status not required output:

Hide Details

PASS: LLDB (/Users/buildslave/jenkins/workspace/lldb-cmake/lldb-build/bin/clang-x86_64) :: test_with_run_command_dsym (TestDataFormatterScript.ScriptDataFormatterTestCase) runCmd: settings clear -all output:

Hide Details

runCmd: settings set symbols.enable-external-lookup false output:

Hide Details

runCmd: settings set target.inherit-tcc true output:

Hide Details

runCmd: settings set target.auto-apply-fixits false output:

Hide Details

runCmd: settings set plugin.process.gdb-remote.packet-timeout 60 output:

Hide Details

runCmd: settings set symbols.clang-modules-cache-path "/Users/buildslave/jenkins/workspace/lldb-cmake/lldb-build/lldb-test-build.noindex/module-cache-lldb/lldb-api" output:

Hide Details

runCmd: settings set use-color false output:

Hide Details

runCmd: setting set target.prefer-dynamic-value no-dynamic-values output:

Hide Details

runCmd: file /Users/buildslave/jenkins/workspace/lldb-cmake/lldb-build/lldb-test-build.noindex/functionalities/data-formatter/data-formatter-script/TestDataFormatterScript.test_with_run_command_dwarf/a.out output: Current executable set to '/Users/buildslave/jenkins/workspace/lldb-cmake/lldb-build/lldb-test-build.noindex/functionalities/data-formatter/data-formatter-script/TestDataFormatterScript.test_with_run_command_dwarf/a.out' (x86_64).

Hide Details

Hide Details

runCmd: breakpoint set -f "main.cpp" -l 37 output: Breakpoint 1: where = a.out`main + 198 at main.cpp:37:17, address = 0x0000000100000d86

Hide Details

Hide Details

Expecting pattern: ^Breakpoint (?P<bpno>[0-9]+): (?P<num_locations>[0-9]+) locations\.$ Not matched

Hide Details

Expecting pattern: ^Breakpoint (?P<bpno>[0-9]+): (?P<num_locations>no) locations \(pending\)\. Not matched

Hide Details

Expecting pattern: ^Breakpoint (?P<bpno>[0-9]+): where = (?P<module>.*)`(?P<symbol>[+\-]{0,1}[^+]+)( \+ (?P<offset>[0-9]+)){0,1}( \[inlined\] (?P<inline_symbol>.*)){0,1} at (?P<file>[^:]+):(?P<line_no>[0-9]+)(?P<column>(:[0-9]+)?), address = (?P<address>0x[0-9a-fA-F]+)$ Matched

Hide Details

runCmd: run output: Process 19485 stopped * thread #1, queue = 'com.apple.main-thread', stop reason = breakpoint 1.1 frame #0: 0x0000000100000d86 a.out`main(argc=1, argv=0x00007ffeefbff840) at main.cpp:37:17 34 35 i_am_cool array[5]; 36 -> 37 i_am_cooler three(10,4,1985,1/1/2011,'B','E'); // Set break point at this line. ^ 38 39 two.integer = 1; 40

Hide Details

Process 19485 launched: '/Users/buildslave/jenkins/workspace/lldb-cmake/lldb-build/lldb-test-build.noindex/functionalities/data-formatter/data-formatter-script/TestDataFormatterScript.test_with_run_command_dwarf/a.out' (x86_64)

Hide Details

Hide Details

runCmd: thread list output: Process 19485 stopped * thread #1: tid = 0x3d3a6d, 0x0000000100000d86 a.out`main(argc=1, argv=0x00007ffeefbff840) at main.cpp:37:17, queue = 'com.apple.main-thread', stop reason = breakpoint 1.1

Hide Details

Hide Details

Ran command: "thread list"

Hide Details

Got output: Process 19485 stopped * thread #1: tid = 0x3d3a6d, 0x0000000100000d86 a.out`main(argc=1, argv=0x00007ffeefbff840) at main.cpp:37:17, queue = 'com.apple.main-thread', stop reason = breakpoint 1.1

Hide Details

Expecting sub string: "stopped" (was found) Expecting sub string: "stop reason = breakpoint" (was found)

Hide Details

Adding tearDown hook: def cleanup(): self.runCmd('type format clear', check=False) self.runCmd('type summary clear', check=False)

Hide Details

Hide Details

runCmd: type summary add i_am_cool --python-script "a = valobj.GetChildMemberWithName('integer'); a_val = a.GetValue(); str = 'Hello from Python, ' + a_val + ' time'; return str + ('!' if a_val == '1' else 's!');" output:

Hide Details

runCmd: type summary list i_am_cool output: ----------------------- Category: default ----------------------- i_am_cool: a = valobj.GetChildMemberWithName('integer'); a_val = a.GetValue(); str = 'Hello from Python, ' + a_val + ' time'; return str + ('!' if a_val == '1' else 's!'); ----------------------- Category: VectorTypes ----------------------- ----------------------- Category: system ----------------------- ----------------------- Category: cplusplus ----------------------- ----------------------- Category: objc -----------------------

Hide Details

Hide Details

Ran command: "type summary list i_am_cool"

Hide Details

Got output: ----------------------- Category: default ----------------------- i_am_cool: a = valobj.GetChildMemberWithName('integer'); a_val = a.GetValue(); str = 'Hello from Python, ' + a_val + ' time'; return str + ('!' if a_val == '1' else 's!'); ----------------------- Category: VectorTypes ----------------------- ----------------------- Category: system ----------------------- ----------------------- Category: cplusplus ----------------------- ----------------------- Category: objc -----------------------

Hide Details

Expecting sub string: "a = valobj.GetChildMemberWithName('integer'); a_val = a.GetValue(); str = 'Hello from Python, ' + a_val + ' time'; return str + ('!' if a_val == '1' else 's!');" (was found)

Hide Details

runCmd: frame variable one output: (i_am_cool) one = Hello from Python, 1 time!

Hide Details

Hide Details

Ran command: "frame variable one"

Hide Details

Got output: (i_am_cool) one = Hello from Python, 1 time!

Hide Details

Expecting sub string: "Hello from Python" (was found) Expecting sub string: "1 time!" (was found)

Hide Details

runCmd: frame variable two output: (i_am_cool) two = Hello from Python, 4 times!

Hide Details

Hide Details

Ran command: "frame variable two"

Hide Details

Got output: (i_am_cool) two = Hello from Python, 4 times!

Hide Details

Expecting sub string: "Hello from Python" (was found) Expecting sub string: "4 times!" (was found)

Hide Details

runCmd: n output: Process 19485 stopped * thread #1, queue = 'com.apple.main-thread', stop reason = step over frame #0: 0x0000000100000daa a.out`main(argc=1, argv=0x00007ffeefbff840) at main.cpp:39:17 36 37 i_am_cooler three(10,4,1985,1/1/2011,'B','E'); // Set break point at this line. 38 -> 39 two.integer = 1; ^ 40 41 int dummy = 1; 42

Hide Details

Hide Details

Hide Details

runCmd: frame variable three output: (i_am_cooler) three = (first_cool = Hello from Python, 10 times!, second_cool = Hello from Python, 4 times!, floating = 992.5)

Hide Details

Hide Details

Ran command: "frame variable three"

Hide Details

Got output: (i_am_cooler) three = (first_cool = Hello from Python, 10 times!, second_cool = Hello from Python, 4 times!, floating = 992.5)

Hide Details

Expecting sub string: "Hello from Python, 10 times!" (was found) Expecting sub string: "Hello from Python, 4 times!" (was found)

Hide Details

runCmd: n output: Process 19485 stopped * thread #1, queue = 'com.apple.main-thread', stop reason = step over frame #0: 0x0000000100000db1 a.out`main(argc=1, argv=0x00007ffeefbff840) at main.cpp:41:9 38 39 two.integer = 1; 40 -> 41 int dummy = 1; ^ 42 43 return 0; 44 }

Hide Details

Hide Details

Hide Details

runCmd: frame variable two output: (i_am_cool) two = Hello from Python, 1 time!

Hide Details

Hide Details

Ran command: "frame variable two"

Hide Details

Got output: (i_am_cool) two = Hello from Python, 1 time!

Hide Details

Expecting sub string: "Hello from Python" (was found) Expecting sub string: "1 time!" (was found)

Hide Details

runCmd: type summary add i_am_cool --python-script "a = valobj.GetChildMemberWithName('integer'); a_val = a.GetValue(); str = 'int says ' + a_val; return str;" output:

Hide Details

runCmd: frame variable two output: (i_am_cool) two = int says 1

Hide Details

Hide Details

Ran command: "frame variable two"

Hide Details

Got output: (i_am_cool) two = int says 1

Hide Details

Expecting sub string: "int says 1" (was found)

Hide Details

runCmd: frame variable twoptr output: (i_am_cool *) twoptr = 0x00007ffeefbff7a0 int says 1

Hide Details

Hide Details

Ran command: "frame variable twoptr"

Hide Details

Got output: (i_am_cool *) twoptr = 0x00007ffeefbff7a0 int says 1

Hide Details

Expecting sub string: "int says 1" (was found)

Hide Details

runCmd: type summary add --summary-string "int says ${var.integer}, and float says ${var.floating}" i_am_cool output:

Hide Details

runCmd: frame variable two output: (i_am_cool) two = int says 1, and float says 2.71000004

Hide Details

Hide Details

Ran command: "frame variable two"

Hide Details

Got output: (i_am_cool) two = int says 1, and float says 2.71000004

Hide Details

Expecting sub string: "int says 1" (was found) Expecting sub string: "and float says 2.71" (was found)

Hide Details

runCmd: frame variable twoptr output: (i_am_cool *) twoptr = 0x00007ffeefbff7a0 int says 1, and float says 2.71000004

Hide Details

Hide Details

Ran command: "frame variable twoptr"

Hide Details

Got output: (i_am_cool *) twoptr = 0x00007ffeefbff7a0 int says 1, and float says 2.71000004

Hide Details

Expecting sub string: "int says 1" (was found) Expecting sub string: "and float says 2.71" (was found)

Hide Details

runCmd: type summary add i_am_cool -p --python-script "a = valobj.GetChildMemberWithName('integer'); a_val = a.GetValue(); str = 'int says ' + a_val; return str;" output:

Hide Details

runCmd: frame variable twoptr output: (i_am_cool *) twoptr = 0x00007ffeefbff7a0

Hide Details

Hide Details

Ran command: "frame variable twoptr"

Hide Details

Got output: (i_am_cool *) twoptr = 0x00007ffeefbff7a0

Hide Details

Not expecting sub string: "and float says 2.71" (was not found)

Hide Details

runCmd: type summary add --name test_summary --python-script "return 'Python summary'" output:

Hide Details

runCmd: frame variable one --summary test_summary output: (i_am_cool) one = Python summary

Hide Details

Hide Details

Ran command: "frame variable one --summary test_summary"

Hide Details

Got output: (i_am_cool) one = Python summary

Hide Details

Expecting sub string: "Python summary" (was found)

Hide Details

runCmd: frame variable two output: (i_am_cool) two = int says 1

Hide Details

Hide Details

Ran command: "frame variable two"

Hide Details

Got output: (i_am_cool) two = int says 1

Hide Details

Not expecting sub string: "Python summary" (was not found)

Hide Details

runCmd: frame variable one output: (i_am_cool) one = int says 1

Hide Details

Hide Details

Ran command: "frame variable one"

Hide Details

Got output: (i_am_cool) one = int says 1

Hide Details

Not expecting sub string: "Python summary" (was not found)

Hide Details

runCmd: type summary add i_am_cool --summary-string "Text summary" output:

Hide Details

runCmd: frame variable one output: (i_am_cool) one = Text summary

Hide Details

Hide Details

Ran command: "frame variable one"

Hide Details

Got output: (i_am_cool) one = Text summary

Hide Details

Not expecting sub string: "Python summary" (was not found)

Hide Details

runCmd: frame variable two output: (i_am_cool) two = Text summary

Hide Details

Hide Details

Ran command: "frame variable two"

Hide Details

Got output: (i_am_cool) two = Text summary

Hide Details

Expecting sub string: "Text summary" (was found)

Hide Details

runCmd: n output: Process 19485 stopped * thread #1, queue = 'com.apple.main-thread', stop reason = step over frame #0: 0x0000000100000dd4 a.out`main(argc=1, argv=0x00007ffeefbff840) at main.cpp:43:5 40 41 int dummy = 1; 42 -> 43 return 0; ^ 44 }

Hide Details

Hide Details

Hide Details

runCmd: frame variable one output: (i_am_cool) one = Text summary

Hide Details

Hide Details

Ran command: "frame variable one"

Hide Details

Got output: (i_am_cool) one = Text summary

Hide Details

Expecting sub string: "Text summary" (was found)

Hide Details

runCmd: frame variable two output: (i_am_cool) two = Text summary

Hide Details

Hide Details

Ran command: "frame variable two"

Hide Details

Got output: (i_am_cool) two = Text summary

Hide Details

Expecting sub string: "Text summary" (was found)

Hide Details

runCmd: type summary add i_am_cool -p --summary-string "Text summary" output:

Hide Details

runCmd: type summary add -x cool --python-script "return 'Python summary'" output:

Hide Details

runCmd: frame variable one output: (i_am_cool) one = Text summary

Hide Details

Hide Details

Ran command: "frame variable one"

Hide Details

Got output: (i_am_cool) one = Text summary

Hide Details

Expecting sub string: "Text summary" (was found)

Hide Details

runCmd: frame variable two output: (i_am_cool) two = Text summary

Hide Details

Hide Details

Ran command: "frame variable two"

Hide Details

Got output: (i_am_cool) two = Text summary

Hide Details

Expecting sub string: "Text summary" (was found)

Hide Details

runCmd: frame variable twoptr output: (i_am_cool *) twoptr = 0x00007ffeefbff7a0 Python summary

Hide Details

Hide Details

Ran command: "frame variable twoptr"

Hide Details

Got output: (i_am_cool *) twoptr = 0x00007ffeefbff7a0 Python summary

Hide Details

Expecting sub string: "Python summary" (was found)

Hide Details

runCmd: frame variable array output: (i_am_cool [5]) array = Python summary

Hide Details

Hide Details

Ran command: "frame variable array"

Hide Details

Got output: (i_am_cool [5]) array = Python summary

Hide Details

Expecting sub string: "Python summary" (was found)

Hide Details

runCmd: type summary add i_am_cool --summary-string "Text summary" output:

Hide Details

runCmd: frame variable one output: (i_am_cool) one = Text summary

Hide Details

Hide Details

Ran command: "frame variable one"

Hide Details

Got output: (i_am_cool) one = Text summary

Hide Details

Expecting sub string: "Text summary" (was found)

Hide Details

runCmd: frame variable two output: (i_am_cool) two = Text summary

Hide Details

Hide Details

Ran command: "frame variable two"

Hide Details

Got output: (i_am_cool) two = Text summary

Hide Details

Expecting sub string: "Text summary" (was found)

Hide Details

runCmd: frame variable twoptr output: (i_am_cool *) twoptr = 0x00007ffeefbff7a0 Text summary

Hide Details

Hide Details

Ran command: "frame variable twoptr"

Hide Details

Got output: (i_am_cool *) twoptr = 0x00007ffeefbff7a0 Text summary

Hide Details

Expecting sub string: "Text summary" (was found)

Hide Details

runCmd: frame variable array output: (i_am_cool [5]) array = Python summary

Hide Details

Hide Details

Ran command: "frame variable array"

Hide Details

Got output: (i_am_cool [5]) array = Python summary

Hide Details

Expecting sub string: "Python summary" (was found)

Hide Details

<bound method SBProcess.Kill of <lldb.SBProcess; proxy of <Swig Object of type 'lldb::SBProcess *' at 0x105b44120> >>: success

Hide Details

Executing tearDown hook: def cleanup(): self.runCmd('type format clear', check=False) self.runCmd('type summary clear', check=False)

Hide Details

Hide Details

runCmd: type format clear check of return status not required output:

Hide Details

runCmd: type summary clear check of return status not required output:

Hide Details

PASS: LLDB (/Users/buildslave/jenkins/workspace/lldb-cmake/lldb-build/bin/clang-x86_64) :: test_with_run_command_dwarf (TestDataFormatterScript.ScriptDataFormatterTestCase) UNSUPPORTED: LLDB (/Users/buildslave/jenkins/workspace/lldb-cmake/lldb-build/bin/clang-x86_64) :: test_with_run_command_dwo (TestDataFormatterScript.ScriptDataFormatterTestCase) (test case does not fall in any category of interest for this run) runCmd: settings clear -all output:

Hide Details

runCmd: settings set symbols.enable-external-lookup false output:

Hide Details

runCmd: settings set target.inherit-tcc true output:

Hide Details

runCmd: settings set target.auto-apply-fixits false output:

Hide Details

runCmd: settings set plugin.process.gdb-remote.packet-timeout 60 output:

Hide Details

runCmd: settings set symbols.clang-modules-cache-path "/Users/buildslave/jenkins/workspace/lldb-cmake/lldb-build/lldb-test-build.noindex/module-cache-lldb/lldb-api" output:

Hide Details

runCmd: settings set use-color false output:

Hide Details

runCmd: setting set target.prefer-dynamic-value no-dynamic-values output:

Hide Details

FAIL: LLDB (/Users/buildslave/jenkins/workspace/lldb-cmake/lldb-build/bin/clang-x86_64) :: test_with_run_command_gmodules (TestDataFormatterScript.ScriptDataFormatterTestCase) Restore dir to: /Users/buildslave/jenkins/workspace/lldb-cmake/lldb-build/tools/lldb/test ====================================================================== ERROR: test_with_run_command_gmodules (TestDataFormatterScript.ScriptDataFormatterTestCase) Test data formatter commands. ---------------------------------------------------------------------- Error when building test subject.

Hide Details

Build Command: make VPATH=/Users/buildslave/jenkins/workspace/lldb-cmake/llvm-project/lldb/test/API/functionalities/data-formatter/data-formatter-script -C /Users/buildslave/jenkins/workspace/lldb-cmake/lldb-build/lldb-test-build.noindex/functionalities/data-formatter/data-formatter-script/TestDataFormatterScript.test_with_run_command_gmodules -I /Users/buildslave/jenkins/workspace/lldb-cmake/llvm-project/lldb/test/API/functionalities/data-formatter/data-formatter-script -I /Users/buildslave/jenkins/workspace/lldb-cmake/llvm-project/lldb/packages/Python/lldbsuite/test/make -f /Users/buildslave/jenkins/workspace/lldb-cmake/llvm-project/lldb/test/API/functionalities/data-formatter/data-formatter-script/Makefile MAKE_DSYM=NO MAKE_GMODULES=YES ARCH=x86_64 CC="/Users/buildslave/jenkins/workspace/lldb-cmake/lldb-build/bin/clang" DSYMUTIL="/Users/buildslave/jenkins/workspace/lldb-cmake/lldb-build/./bin/dsymutil" CLANG_MODULE_CACHE_DIR=/Users/buildslave/jenkins/workspace/lldb-cmake/lldb-build/lldb-test-build.noindex/module-cache-clang/lldb-api

Hide Details

Build Command Output: While building module 'std' imported from /Users/buildslave/jenkins/workspace/lldb-cmake/lldb-build/bin/../include/c++/v1/stdint.h:123: In file included from <module-includes>:31: In file included from /Users/buildslave/jenkins/workspace/lldb-cmake/lldb-build/bin/../include/c++/v1/complex.h:28: In file included from /Users/buildslave/jenkins/workspace/lldb-cmake/lldb-build/bin/../include/c++/v1/ccomplex:20: In file included from /Users/buildslave/jenkins/workspace/lldb-cmake/lldb-build/bin/../include/c++/v1/complex:247: In file included from /Users/buildslave/jenkins/workspace/lldb-cmake/lldb-build/bin/../include/c++/v1/sstream:173: /Users/buildslave/jenkins/workspace/lldb-cmake/lldb-build/bin/../include/c++/v1/ostream:1038:45: error: no template named 'enable_if_t'; did you mean 'enable_if'? template <class _Stream, class _Tp, class = enable_if_t< ^ /Users/buildslave/jenkins/workspace/lldb-cmake/lldb-build/bin/../include/c++/v1/type_traits:538:63: note: 'enable_if' declared here template <bool, class _Tp = void> struct _LIBCPP_TEMPLATE_VIS enable_if {}; ^ While building module 'std' imported from /Users/buildslave/jenkins/workspace/lldb-cmake/lldb-build/bin/../include/c++/v1/stdint.h:123: In file included from <module-includes>:31: In file included from /Users/buildslave/jenkins/workspace/lldb-cmake/lldb-build/bin/../include/c++/v1/complex.h:28: In file included from /Users/buildslave/jenkins/workspace/lldb-cmake/lldb-build/bin/../include/c++/v1/ccomplex:20: In file included from /Users/buildslave/jenkins/workspace/lldb-cmake/lldb-build/bin/../include/c++/v1/complex:247: In file included from /Users/buildslave/jenkins/workspace/lldb-cmake/lldb-build/bin/../include/c++/v1/sstream:174: /Users/buildslave/jenkins/workspace/lldb-cmake/lldb-build/bin/../include/c++/v1/istream:1389:45: error: no template named 'enable_if_t'; did you mean 'enable_if'? template <class _Stream, class _Tp, class = enable_if_t< ^ /Users/buildslave/jenkins/workspace/lldb-cmake/lldb-build/bin/../include/c++/v1/type_traits:538:63: note: 'enable_if' declared here template <bool, class _Tp = void> struct _LIBCPP_TEMPLATE_VIS enable_if {}; ^ In file included from /Users/buildslave/jenkins/workspace/lldb-cmake/llvm-project/lldb/test/API/functionalities/data-formatter/data-formatter-script/main.cpp:3: /Users/buildslave/jenkins/workspace/lldb-cmake/lldb-build/bin/../include/c++/v1/stdint.h:123:15: fatal error: could not build module 'std' #include_next <stdint.h> ~~~~~~~~~~~~~^ 3 errors generated. /Users/buildslave/jenkins/workspace/lldb-cmake/lldb-build/bin/clang -fmodules -gmodules -fmodules-cache-path=/Users/buildslave/jenkins/workspace/lldb-cmake/lldb-build/lldb-test-build.noindex/module-cache-clang/lldb-api -gmodules -fcxx-modules -std=c++11 -g -O0 -fno-builtin -isysroot "/Applications/Xcode.app/Contents/Developer/Platforms/MacOSX.platform/Developer/SDKs/MacOSX10.15.sdk" -arch x86_64 -I/Users/buildslave/jenkins/workspace/lldb-cmake/llvm-project/lldb/packages/Python/lldbsuite/test/make/../../../../../include -I/Users/buildslave/jenkins/workspace/lldb-cmake/llvm-project/lldb/test/API/functionalities/data-formatter/data-formatter-script -I/Users/buildslave/jenkins/workspace/lldb-cmake/llvm-project/lldb/packages/Python/lldbsuite/test/make -include /Users/buildslave/jenkins/workspace/lldb-cmake/llvm-project/lldb/packages/Python/lldbsuite/test/make/test_common.h -fno-limit-debug-info -fmodules -gmodules -fmodules-cache-path=/Users/buildslave/jenkins/workspace/lldb-cmake/lldb-build/lldb-test-build.noindex/module-cache-clang/lldb-api -gmodules -fcxx-modules --driver-mode=g++ -c -o main.o /Users/buildslave/jenkins/workspace/lldb-cmake/llvm-project/lldb/test/API/functionalities/data-formatter/data-formatter-script/main.cpp While building module 'std' imported from /Users/buildslave/jenkins/workspace/lldb-cmake/lldb-build/bin/../include/c++/v1/stdint.h:123: In file included from <module-includes>:31: In file included from /Users/buildslave/jenkins/workspace/lldb-cmake/lldb-build/bin/../include/c++/v1/complex.h:28: In file included from /Users/buildslave/jenkins/workspace/lldb-cmake/lldb-build/bin/../include/c++/v1/ccomplex:20: In file included from /Users/buildslave/jenkins/workspace/lldb-cmake/lldb-build/bin/../include/c++/v1/complex:247: In file included from /Users/buildslave/jenkins/workspace/lldb-cmake/lldb-build/bin/../include/c++/v1/sstream:173: /Users/buildslave/jenkins/workspace/lldb-cmake/lldb-build/bin/../include/c++/v1/ostream:1038:45: error: no template named 'enable_if_t'; did you mean 'enable_if'? template <class _Stream, class _Tp, class = enable_if_t< ^ /Users/buildslave/jenkins/workspace/lldb-cmake/lldb-build/bin/../include/c++/v1/type_traits:538:63: note: 'enable_if' declared here template <bool, class _Tp = void> struct _LIBCPP_TEMPLATE_VIS enable_if {}; ^ While building module 'std' imported from /Users/buildslave/jenkins/workspace/lldb-cmake/lldb-build/bin/../include/c++/v1/stdint.h:123: In file included from <module-includes>:31: In file included from /Users/buildslave/jenkins/workspace/lldb-cmake/lldb-build/bin/../include/c++/v1/complex.h:28: In file included from /Users/buildslave/jenkins/workspace/lldb-cmake/lldb-build/bin/../include/c++/v1/ccomplex:20: In file included from /Users/buildslave/jenkins/workspace/lldb-cmake/lldb-build/bin/../include/c++/v1/complex:247: In file included from /Users/buildslave/jenkins/workspace/lldb-cmake/lldb-build/bin/../include/c++/v1/sstream:174: /Users/buildslave/jenkins/workspace/lldb-cmake/lldb-build/bin/../include/c++/v1/istream:1389:45: error: no template named 'enable_if_t'; did you mean 'enable_if'? template <class _Stream, class _Tp, class = enable_if_t< ^ /Users/buildslave/jenkins/workspace/lldb-cmake/lldb-build/bin/../include/c++/v1/type_traits:538:63: note: 'enable_if' declared here template <bool, class _Tp = void> struct _LIBCPP_TEMPLATE_VIS enable_if {}; ^ In file included from /Users/buildslave/jenkins/workspace/lldb-cmake/llvm-project/lldb/test/API/functionalities/data-formatter/data-formatter-script/main.cpp:3: /Users/buildslave/jenkins/workspace/lldb-cmake/lldb-build/bin/../include/c++/v1/stdint.h:123:15: fatal error: could not build module 'std' #include_next <stdint.h> ~~~~~~~~~~~~~^ 3 errors generated. make: *** [main.o] Error 1

Hide Details

Test Directory: /Users/buildslave/jenkins/workspace/lldb-cmake/llvm-project/lldb/test/API/functionalities/data-formatter/data-formatter-script ---------------------------------------------------------------------- Ran 4 tests in 11.222s

Hide Details

RESULT: FAILED (2 passes, 0 failures, 1 errors, 1 skipped, 0 expected failures, 0 unexpected successes)

Hide Details

--

Hide Details

******************** PASS: lldb-api :: iohandler/autosuggestion/TestAutosuggestion.py (2149 of 2150) PASS: lldb-shell :: Reproducer/TestReuseDirectory.test (2150 of 2150) Slowest Tests: -------------------------------------------------------------------------- 181.10s: lldb-api :: lang/cpp/namespace/TestNamespaceLookup.py 143.31s: lldb-api :: macosx/simulator/TestSimulatorPlatform.py 126.09s: lldb-api :: lang/objc/hidden-ivars/TestHiddenIvars.py 118.24s: lldb-api :: functionalities/postmortem/mach-core/TestMachCore.py 104.99s: lldb-api :: functionalities/gdb_remote_client/TestGDBRemoteLoad.py 104.49s: lldb-api :: functionalities/gdb_remote_client/TestGDBRemoteClient.py 100.54s: lldb-api :: tools/lldb-server/TestLldbGdbServer.py 87.46s: lldb-api :: types/TestLongTypes.py 76.30s: lldb-api :: lang/objc/forward-decl/TestForwardDecl.py 76.09s: lldb-api :: lang/objc/foundation/TestObjCMethodsString.py 74.34s: lldb-api :: types/TestLongTypesExpr.py 73.91s: lldb-api :: commands/target/basic/TestTargetCommand.py 73.41s: lldb-api :: lang/cpp/namespace/TestNamespace.py 66.28s: lldb-api :: lang/objc/exceptions/TestObjCExceptions.py 64.59s: lldb-api :: lang/objc/foundation/TestFoundationDisassembly.py 57.79s: lldb-api :: lang/objc/foundation/TestObjCMethodsNSError.py 53.33s: lldb-shell :: SymbolFile/NativePDB/locate-pdb.cpp 52.75s: lldb-api :: lang/objcxx/hide-runtime-values/TestObjCXXHideRuntimeValues.py 51.11s: lldb-api :: functionalities/thread/create_during_step/TestCreateDuringStep.py 48.88s: lldb-api :: python_api/process/TestProcessAPI.py

Hide Details

Tests Times: -------------------------------------------------------------------------- [ Range ] :: [ Percentage ] :: [ Count ] -------------------------------------------------------------------------- [180s,190s) :: [ ] :: [ 1/2150] [170s,180s) :: [ ] :: [ 0/2150] [160s,170s) :: [ ] :: [ 0/2150] [150s,160s) :: [ ] :: [ 1/2150] [140s,150s) :: [ ] :: [ 0/2150] [130s,140s) :: [ ] :: [ 1/2150] [120s,130s) :: [ ] :: [ 1/2150] [110s,120s) :: [ ] :: [ 1/2150] [100s,110s) :: [ ] :: [ 2/2150] [ 90s,100s) :: [ ] :: [ 1/2150] [ 80s, 90s) :: [ ] :: [ 1/2150] [ 70s, 80s) :: [ ] :: [ 4/2150] [ 60s, 70s) :: [ ] :: [ 3/2150] [ 50s, 60s) :: [ ] :: [ 9/2150] [ 40s, 50s) :: [ ] :: [ 15/2150] [ 30s, 40s) :: [ ] :: [ 30/2150] [ 20s, 30s) :: [ ] :: [ 41/2150] [ 10s, 20s) :: [*** ] :: [ 168/2150] [ 0s, 10s) :: [********************************** ] :: [1871/2150] -------------------------------------------------------------------------- ******************** Failed Tests (138): lldb-api :: python_api/exprpath_synthetic/TestExprPathSynthetic.py lldb-api :: commands/expression/import-std-module/vector-dbg-info-content/TestDbgInfoContentVectorFromStdModule.py lldb-api :: lang/cpp/wchar_t/TestCxxWCharT.py lldb-api :: lang/objc/exceptions/TestObjCExceptions.py lldb-api :: commands/expression/issue_11588/Test11588.py lldb-api :: python_api/watchpoint/watchlocation/TestSetWatchlocation.py lldb-api :: functionalities/data-formatter/data-formatter-stl/libcxx/forward_list/TestDataFormatterLibcxxForwardList.py lldb-api :: types/TestIntegerTypeExpr.py lldb-api :: functionalities/type_lookup/TestTypeLookup.py lldb-api :: types/TestFloatTypes.py lldb-api :: functionalities/thread/exit_during_break/TestExitDuringBreak.py lldb-api :: functionalities/breakpoint/cpp_exception/TestCPPExceptionBreakpoint.py lldb-api :: lang/cpp/namespace/TestNamespaceLookup.py lldb-api :: functionalities/data-formatter/data-formatter-stl/libcxx/map/TestDataFormatterLibccMap.py lldb-api :: functionalities/data-formatter/data-formatter-stl/libcxx/iterator/TestDataFormatterLibccIterator.py lldb-api :: python_api/class_members/TestSBTypeClassMembers.py lldb-api :: functionalities/data-formatter/data-formatter-stl/libcxx/vector/TestDataFormatterLibcxxVector.py lldb-api :: commands/command/script/TestCommandScript.py lldb-api :: lang/cpp/global_operators/TestCppGlobalOperators.py lldb-api :: functionalities/thread/exit_during_step/TestExitDuringStep.py lldb-api :: functionalities/data-formatter/data-formatter-stl/libcxx/atomic/TestLibCxxAtomic.py lldb-api :: functionalities/data-formatter/compactvectors/TestCompactVectors.py lldb-api :: lang/objc/objc++/TestObjCXX.py lldb-api :: lang/objcxx/objcxx-ivar-vector/TestIvarVector.py lldb-api :: commands/expression/import-std-module/shared_ptr-dbg-info-content/TestSharedPtrDbgInfoContentFromStdModule.py lldb-api :: commands/expression/import-std-module/weak_ptr/TestWeakPtrFromStdModule.py lldb-api :: lang/cpp/breakpoint_in_member_func_w_non_primitive_params/TestBreakpointInMemberFuncWNonPrimitiveParams.py lldb-api :: functionalities/completion/TestCompletion.py lldb-api :: commands/expression/formatters/TestFormatters.py lldb-api :: functionalities/data-formatter/data-formatter-stl/libcxx/bitset/TestDataFormatterLibcxxBitset.py lldb-api :: commands/settings/TestSettings.py lldb-api :: functionalities/data-formatter/data-formatter-skip-summary/TestDataFormatterSkipSummary.py lldb-api :: commands/expression/import-std-module/basic/TestImportStdModule.py lldb-api :: types/TestCharTypeExpr.py lldb-api :: python_api/lldbutil/iter/TestLLDBIterator.py lldb-api :: functionalities/data-formatter/data-formatter-synth/TestDataFormatterSynth.py lldb-api :: functionalities/data-formatter/data-formatter-stl/libcxx/function/TestLibCxxFunction.py lldb-api :: commands/expression/import-std-module/forward_list/TestForwardListFromStdModule.py lldb-api :: commands/expression/import-std-module/deque-dbg-info-content/TestDbgInfoContentDequeFromStdModule.py lldb-api :: commands/expression/import-std-module/queue/TestQueueFromStdModule.py lldb-api :: functionalities/breakpoint/hardware_breakpoints/hardware_breakpoint_on_multiple_threads/TestHWBreakMultiThread.py lldb-api :: commands/expression/namespace_local_var_same_name_obj_c/TestNamespaceLocalVarSameNameObjC.py lldb-shell :: Process/TestEnvironment.test lldb-api :: functionalities/deleted-executable/TestDeletedExecutable.py lldb-api :: functionalities/gdb_remote_client/TestGDBRemoteClient.py lldb-api :: lang/cpp/template/TestTemplateArgs.py lldb-api :: commands/expression/import-std-module/unique_ptr-dbg-info-content/TestUniquePtrDbgInfoContent.py lldb-api :: functionalities/gdb_remote_client/TestGDBRemoteLoad.py lldb-api :: python_api/lldbutil/iter/TestRegistersIterator.py lldb-api :: functionalities/data-formatter/stringprinter/TestStringPrinter.py lldb-api :: commands/expression/call-function/TestCallStopAndContinue.py lldb-api :: commands/expression/timeout/TestCallWithTimeout.py lldb-api :: functionalities/data-formatter/data-formatter-advanced/TestDataFormatterAdv.py lldb-api :: tools/lldb-server/inferior-crash/TestGdbRemoteSegFault.py lldb-api :: lang/cpp/extern_c/TestExternCSymbols.py lldb-api :: functionalities/thread/step_out/TestThreadStepOut.py lldb-api :: commands/expression/import-std-module/vector-of-vectors/TestVectorOfVectorsFromStdModule.py lldb-api :: tools/lldb-server/inferior-crash/TestGdbRemoteAbort.py lldb-api :: types/TestShortTypeExpr.py lldb-api :: commands/expression/vector_of_enums/TestVectorOfEnums.py lldb-api :: functionalities/data-formatter/data-formatter-named-summaries/TestDataFormatterNamedSummaries.py lldb-api :: lang/objcxx/hide-runtime-values/TestObjCXXHideRuntimeValues.py lldb-api :: types/TestDoubleTypesExpr.py lldb-api :: commands/expression/call-function/TestCallUserDefinedFunction.py lldb-api :: lang/cpp/char1632_t/TestChar1632T.py lldb-api :: functionalities/thread/backtrace_all/TestBacktraceAll.py lldb-api :: lang/cpp/stl/TestSTL.py lldb-api :: functionalities/data-formatter/poarray/TestPrintObjectArray.py lldb-api :: types/TestShortType.py lldb-api :: functionalities/memory/find/TestMemoryFind.py lldb-api :: commands/expression/import-std-module/forward_list-dbg-info-content/TestDbgInfoContentForwardListFromStdModule.py lldb-api :: commands/expression/import-std-module/weak_ptr-dbg-info-content/TestDbgInfoContentWeakPtrFromStdModule.py lldb-api :: commands/expression/call-function/TestCallStdStringFunction.py lldb-api :: lang/objcxx/class-name-clash/TestNameClash.py lldb-api :: lang/objcxx/cxx-bridged-po/TestObjCXXBridgedPO.py lldb-api :: commands/expression/import-std-module/list/TestListFromStdModule.py lldb-api :: functionalities/dynamic_value_child_count/TestDynamicValueChildCount.py lldb-api :: functionalities/thread/create_after_attach/TestCreateAfterAttach.py lldb-api :: lang/cpp/dynamic-value/TestDynamicValue.py lldb-api :: commands/expression/import-std-module/stack/TestStackFromStdModule.py lldb-api :: commands/expression/import-std-module/vector-bool/TestVectorBoolFromStdModule.py lldb-api :: commands/expression/import-std-module/pair/TestPairFromStdModule.py lldb-api :: functionalities/inline-stepping/TestInlineStepping.py lldb-api :: functionalities/breakpoint/breakpoint_set_restart/TestBreakpointSetRestart.py lldb-api :: functionalities/thread/thread_exit/TestThreadExit.py lldb-api :: functionalities/data-formatter/data-formatter-categories/TestDataFormatterCategories.py lldb-api :: functionalities/data-formatter/data-formatter-stl/libcxx/string/TestDataFormatterLibcxxString.py lldb-api :: functionalities/data-formatter/data-formatter-smart-array/TestDataFormatterSmartArray.py lldb-api :: lang/cpp/class_types/TestClassTypesDisassembly.py lldb-api :: functionalities/data-formatter/data-formatter-stl/libcxx/set/TestDataFormatterLibcxxSet.py lldb-api :: commands/expression/import-std-module/vector/TestVectorFromStdModule.py lldb-api :: commands/expression/import-std-module/shared_ptr/TestSharedPtrFromStdModule.py lldb-api :: types/TestIntegerType.py lldb-api :: functionalities/memory/read/TestMemoryRead.py lldb-api :: python_api/sbvalue_const_addrof/TestSBValueConstAddrOf.py lldb-api :: functionalities/data-formatter/data-formatter-disabling/TestDataFormatterDisabling.py lldb-api :: commands/expression/import-std-module/list-dbg-info-content/TestDbgInfoContentListFromStdModule.py lldb-api :: commands/expression/no-deadlock/TestExprDoesntBlock.py lldb-api :: commands/expression/import-std-module/deque-basic/TestDequeFromStdModule.py lldb-api :: python_api/process/TestProcessAPI.py lldb-api :: lang/cpp/class_types/TestClassTypes.py lldb-api :: functionalities/data-formatter/data-formatter-stl/libcxx/initializerlist/TestInitializerList.py lldb-api :: types/TestLongTypesExpr.py lldb-api :: types/TestLongTypes.py lldb-api :: lang/c/step_over_no_deadlock/TestStepOverDoesntBlock.py lldb-api :: commands/expression/import-std-module/conflicts/TestStdModuleWithConflicts.py lldb-api :: functionalities/data-formatter/data-formatter-stl/libcxx/tuple/TestDataFormatterLibcxxTuple.py lldb-api :: lang/cpp/bitfields/TestCppBitfields.py lldb-api :: commands/expression/expr-in-syscall/TestExpressionInSyscall.py lldb-api :: types/TestDoubleTypes.py lldb-api :: commands/frame/diagnose/inheritance/TestDiagnoseInheritance.py lldb-api :: functionalities/type_completion/TestTypeCompletion.py lldb-api :: functionalities/data-formatter/data-formatter-stl/libcxx/multimap/TestDataFormatterLibccMultiMap.py lldb-api :: lang/cpp/operators/TestCppOperators.py lldb-api :: functionalities/data-formatter/data-formatter-stl/libcxx/queue/TestDataFormatterLibcxxQueue.py lldb-api :: functionalities/data-formatter/boolreference/TestFormattersBoolRefPtr.py lldb-api :: api/multithreaded/TestMultithreaded.py lldb-api :: functionalities/data-formatter/data-formatter-stl/libcxx/vbool/TestDataFormatterLibcxxVBool.py lldb-api :: commands/expression/static-initializers/TestStaticInitializers.py lldb-api :: functionalities/data-formatter/parray/TestPrintArray.py lldb-api :: lang/cpp/namespace/TestNamespace.py lldb-api :: functionalities/data-formatter/data-formatter-stl/libcxx/multiset/TestDataFormatterLibcxxMultiSet.py lldb-api :: functionalities/thread/state_after_expression/TestStateAfterExpression.py lldb-api :: commands/log/basic/TestLogging.py lldb-api :: lang/cpp/unique-types/TestUniqueTypes.py lldb-api :: functionalities/breakpoint/cpp/TestCPPBreakpointLocations.py lldb-api :: commands/expression/import-std-module/unique_ptr/TestUniquePtrFromStdModule.py lldb-api :: types/TestFloatTypesExpr.py lldb-api :: functionalities/memory-region/TestMemoryRegion.py lldb-api :: python_api/watchpoint/watchlocation/TestTargetWatchAddress.py lldb-api :: functionalities/data-formatter/data-formatter-stl/libcxx/unordered/TestDataFormatterUnordered.py lldb-api :: functionalities/breakpoint/breakpoint_ids/TestBreakpointIDs.py lldb-api :: types/TestCharType.py lldb-api :: lang/cpp/exceptions/TestCPPExceptionBreakpoints.py lldb-api :: functionalities/breakpoint/inlined_breakpoints/TestInlinedBreakpoints.py lldb-api :: functionalities/data-formatter/ostypeformatting/TestFormattersOsType.py lldb-api :: lang/cpp/stl/TestStdCXXDisassembly.py lldb-api :: functionalities/data-formatter/data-formatter-script/TestDataFormatterScript.py

Hide Details

Hide Details

Testing Time: 2317.68s Unsupported : 152 Passed : 1854 Expectedly Failed: 6 Failed : 138 FAILED: tools/lldb/test/CMakeFiles/check-lldb-lit cd /Users/buildslave/jenkins/workspace/lldb-cmake/lldb-build/tools/lldb/test && /usr/local/Frameworks/Python.framework/Versions/3.7/bin/python3.7 /Users/buildslave/jenkins/workspace/lldb-cmake/lldb-build/./bin/llvm-lit -v --time-tests --shuffle --xunit-xml-output=/Users/buildslave/jenkins/workspace/lldb-cmake/test/results.xml -v -j 4 /Users/buildslave/jenkins/workspace/lldb-cmake/lldb-build/tools/lldb/test ninja: build stopped: subcommand failed. Command failed: Command '['/usr/bin/env', 'TERM=vt100', '/usr/local/bin/ninja', '-v', 'check-lldb']' returned non-zero exit status 1 Command: ['/usr/bin/env', 'TERM=vt100', '/usr/local/bin/ninja', '-v', 'check-lldb'] [Pipeline] } [Pipeline] // timeout [Pipeline] } [Pipeline] // stage [Pipeline] stage [Pipeline] { (Declarative: Post Actions) [Pipeline] scanForIssues [Clang (LLVM based)] Sleeping for 5 seconds due to JENKINS-32191... [Clang (LLVM based)] Parsing console log (workspace: '/Users/buildslave/jenkins/workspace/lldb-cmake') [Clang (LLVM based)] Successfully parsed console log [Clang (LLVM based)] -> found 101 issues (skipped 1741 duplicates) [Clang (LLVM based)] Post processing issues on 'green-dragon-10' with source code encoding 'UTF-8' [Clang (LLVM based)] Creating SCM blamer to obtain author and commit information for affected files [Clang (LLVM based)] Creating SCM miner to obtain statistics for affected repository files [Clang (LLVM based)] Resolving file names for all issues in source directory '/Users/buildslave/jenkins/workspace/lldb-cmake' [Clang (LLVM based)] -> resolved paths in source directory (98 found, 0 not found) [Clang (LLVM based)] Resolving module names from module definitions (build.xml, pom.xml, or Manifest.mf files) [Clang (LLVM based)] -> resolved module names for 101 issues [Clang (LLVM based)] Resolving package names (or namespaces) by parsing the affected files [Clang (LLVM based)] -> resolved package names of 98 affected files [Clang (LLVM based)] No filter has been set, publishing all 101 issues [Clang (LLVM based)] Creating fingerprints for all affected code blocks to track issues over different builds [Clang (LLVM based)] -> created fingerprints for 101 issues (skipped 0 issues) [Clang (LLVM based)] Copying affected files to Jenkins' build folder '/Users/Shared/Jenkins/Home/jobs/lldb-cmake/builds/23941/files-with-issues' [Clang (LLVM based)] -> 77 copied, 22 not in workspace, 0 not-found, 0 with I/O error [Pipeline] junit Recording test results [Pipeline] } [Pipeline] // stage [Pipeline] } [Pipeline] // withEnv [Pipeline] } [Pipeline] // node [Pipeline] End of Pipeline ERROR: script returned exit code 1 Finished: FAILURE