FailedConsole Output

Skipping 9,125 KB.. Full Log
ts/XcodeSDKTest.GetSDKTypeForTriple (687 of 2150)
PASS: lldb-api :: linux/builtin_trap/TestBuiltinTrap.py (688 of 2150)
PASS: lldb-unit :: Utility/./UtilityTests/StringExtractorTest.GetHexU8_Underflow2_NoEof (689 of 2150)
PASS: lldb-unit :: Process/minidump/./LLDBMinidumpTests/MinidumpParserTest.GetFilteredModuleList (690 of 2150)
PASS: lldb-unit :: Utility/./UtilityTests/OptionsWithRawTest.WhitespaceInput (691 of 2150)
PASS: lldb-api :: functionalities/data-formatter/data-formatter-stl/libcxx/multiset/TestDataFormatterLibcxxMultiSet.py (692 of 2150)
PASS: lldb-api :: functionalities/thread/concurrent_events/TestConcurrentDelaySignalWatch.py (693 of 2150)
UNSUPPORTED: lldb-shell :: ObjectFile/ELF/minidebuginfo-no-lzma.yaml (694 of 2150)
PASS: lldb-unit :: Signals/./SignalsTests/UnixSignalsTest.Iteration (695 of 2150)
PASS: lldb-api :: tools/lldb-server/commandline/TestStubReverseConnect.py (696 of 2150)
PASS: lldb-api :: lang/objc/objc-stepping/TestObjCStepping.py (697 of 2150)
PASS: lldb-api :: commands/expression/import-std-module/no-std-module/TestMissingStdModule.py (698 of 2150)
PASS: lldb-api :: python_api/frame/inlines/TestInlinedFrame.py (699 of 2150)
PASS: lldb-unit :: Utility/./UtilityTests/ScalarTest.Getters (700 of 2150)
PASS: lldb-unit :: UnwindAssembly/x86/./UnwindAssemblyx86Tests/Testx86AssemblyInspectionEngine.TestSpillRegToStackViaMOVi386 (701 of 2150)
PASS: lldb-unit :: Utility/./UtilityTests/RangeTest.EqualInvalid (702 of 2150)
PASS: lldb-api :: functionalities/gdb_remote_client/TestJLink6Armv7RegisterDefinition.py (703 of 2150)
PASS: lldb-shell :: ObjectFile/ELF/compressed-sections.yaml (704 of 2150)
PASS: lldb-shell :: SymbolFile/Breakpad/line-table-edgecases.test (705 of 2150)
PASS: lldb-unit :: Target/./TargetTests/ModuleCacheTest.GetAndPutStrangeHostname (706 of 2150)
PASS: lldb-unit :: Utility/./UtilityTests/RecordReplayTest.InstrumentedFooSameThis (707 of 2150)
PASS: lldb-shell :: SymbolFile/DWARF/DW_AT_declaration-with-children.s (708 of 2150)
PASS: lldb-api :: lang/cpp/breakpoint_in_member_func_w_non_primitive_params/TestBreakpointInMemberFuncWNonPrimitiveParams.py (709 of 2150)
PASS: lldb-shell :: Reproducer/TestReuseDirectory.test (710 of 2150)
PASS: lldb-unit :: Utility/./UtilityTests/UUIDTest.StringConverion (711 of 2150)
PASS: lldb-api :: lang/cpp/signed_types/TestSignedTypes.py (712 of 2150)
PASS: lldb-api :: commands/platform/basic/TestPlatformCommand.py (713 of 2150)
PASS: lldb-api :: functionalities/tail_call_frames/disambiguate_paths_to_common_sink/TestDisambiguatePathsToCommonSink.py (714 of 2150)
PASS: lldb-unit :: Utility/./UtilityTests/RangeTest.Clear (715 of 2150)
PASS: lldb-unit :: UnwindAssembly/x86/./UnwindAssemblyx86Tests/Testx86AssemblyInspectionEngine.TestPopR15 (716 of 2150)
PASS: lldb-unit :: Utility/./UtilityTests/StreamTest.PutHex16ByteOrderLittle (717 of 2150)
UNSUPPORTED: lldb-api :: benchmarks/frame_variable/TestFrameVariableResponse.py (718 of 2150)
UNSUPPORTED: lldb-api :: functionalities/thread/thread_specific_break_plus_condition/TestThreadSpecificBpPlusCondition.py (719 of 2150)
PASS: lldb-api :: macosx/safe-to-func-call/TestSafeFuncCalls.py (720 of 2150)
PASS: lldb-api :: functionalities/thread/exit_during_break/TestExitDuringBreak.py (721 of 2150)
PASS: lldb-unit :: Process/./ProcessEventDataTests/ProcessEventDataTest.ShouldStop (722 of 2150)
PASS: lldb-unit :: Core/./LLDBCoreTests/UniqueCStringMap.NoDefaultConstructor (723 of 2150)
PASS: lldb-unit :: Utility/./UtilityTests/LogChannelEnabledTest.LogThread (724 of 2150)
PASS: lldb-api :: commands/expression/import-std-module/shared_ptr/TestSharedPtrFromStdModule.py (725 of 2150)
PASS: lldb-unit :: Utility/./UtilityTests/DataExtractorTest.GetCStrAtNullOffset (726 of 2150)
PASS: lldb-unit :: ScriptInterpreter/Python/./ScriptInterpreterPythonTests/PythonDataObjectsTest.TestObjectAttributes (727 of 2150)
PASS: lldb-unit :: UnwindAssembly/x86/./UnwindAssemblyx86Tests/Testx86AssemblyInspectionEngine.TestPushESI (728 of 2150)
PASS: lldb-api :: lang/cpp/frame-var-anon-unions/TestFrameVariableAnonymousUnions.py (729 of 2150)
PASS: lldb-unit :: Utility/./UtilityTests/StreamTest.PutHex64ByteOrderLittle (730 of 2150)
PASS: lldb-api :: functionalities/data-formatter/stringprinter/TestStringPrinter.py (731 of 2150)
PASS: lldb-unit :: Process/minidump/./LLDBMinidumpTests/MinidumpParserTest.MinidumpDuplicateModuleSeparateCode (732 of 2150)
UNSUPPORTED: lldb-shell :: SymbolFile/NativePDB/local-variables.cpp (733 of 2150)
PASS: lldb-unit :: Utility/./UtilityTests/StringListTest.RemoveBlankLines (734 of 2150)
PASS: lldb-api :: python_api/sbvalue_persist/TestSBValuePersist.py (735 of 2150)
PASS: lldb-api :: lang/cpp/lambdas/TestLambdas.py (736 of 2150)
PASS: lldb-api :: tools/lldb-server/inferior-crash/TestGdbRemoteAbort.py (737 of 2150)
PASS: lldb-unit :: Host/./HostTests/FileActionTest.Open (738 of 2150)
PASS: lldb-shell :: SymbolFile/DWARF/find-basic-function.cpp (739 of 2150)
UNSUPPORTED: lldb-shell :: SymbolFile/PDB/variables-locations.test (740 of 2150)
PASS: lldb-api :: lang/cpp/class-template-parameter-pack/TestClassTemplateParameterPack.py (741 of 2150)
PASS: lldb-api :: tools/lldb-vscode/attach/TestVSCode_attach.py (742 of 2150)
PASS: lldb-api :: functionalities/breakpoint/breakpoint_by_line_and_column/TestBreakpointByLineAndColumn.py (743 of 2150)
PASS: lldb-api :: lang/c/tls_globals/TestTlsGlobals.py (744 of 2150)
PASS: lldb-shell :: Commands/command-regex-unalias.test (745 of 2150)
PASS: lldb-unit :: Process/minidump/./LLDBMinidumpTests/MinidumpParserTest.FindMemoryRangeWithFullMemoryMinidump (746 of 2150)
PASS: lldb-unit :: Utility/./UtilityTests/RangeTest.Equal (747 of 2150)
PASS: lldb-api :: lang/objc/modules-incomplete/TestIncompleteModules.py (748 of 2150)
PASS: lldb-unit :: Utility/./UtilityTests/StringListTest.ShiftMove (749 of 2150)
UNSUPPORTED: lldb-shell :: Unwind/unwind-plan-dwarf-dump.test (750 of 2150)
PASS: lldb-api :: functionalities/data-formatter/data-formatter-caching/TestDataFormatterCaching.py (751 of 2150)
PASS: lldb-api :: functionalities/backticks/TestBackticksWithoutATarget.py (752 of 2150)
PASS: lldb-shell :: Breakpoint/dummy-target.test (753 of 2150)
PASS: lldb-api :: lang/objc/modules-cache/TestClangModulesCache.py (754 of 2150)
PASS: lldb-unit :: Utility/./UtilityTests/StringExtractorTest.GetHexU8_InvalidHex (755 of 2150)
PASS: lldb-api :: functionalities/data-formatter/summary-string-onfail/Test-rdar-9974002.py (756 of 2150)
PASS: lldb-unit :: Utility/./UtilityTests/StringListTest.GetSize (757 of 2150)
PASS: lldb-unit :: Utility/./UtilityTests/StringExtractorTest.DecodeHexU8_Extra (758 of 2150)
PASS: lldb-unit :: ObjectFile/Breakpad/./ObjectFileBreakpadTests/ModuleRecord.parse (759 of 2150)
PASS: lldb-unit :: Utility/./UtilityTests/RangeTest.ClearWithStarAddress (760 of 2150)
PASS: lldb-unit :: Expression/./ExpressionTests/DiagnosticManagerTest.GetStringBasic (761 of 2150)
PASS: lldb-api :: lang/objc/modules-app-update/TestClangModulesAppUpdate.py (762 of 2150)
UNSUPPORTED: lldb-shell :: ScriptInterpreter/Lua/independent_state.test (763 of 2150)
PASS: lldb-api :: functionalities/data-formatter/data-formatter-stl/libcxx/list/loop/TestDataFormatterLibcxxListLoop.py (764 of 2150)
PASS: lldb-unit :: Utility/./UtilityTests/BroadcasterTest.EventTypeHasListeners (765 of 2150)
PASS: lldb-unit :: UnwindAssembly/x86/./UnwindAssemblyx86Tests/Testx86AssemblyInspectionEngine.TestStackRealignMSVC_i386 (766 of 2150)
PASS: lldb-unit :: Utility/./UtilityTests/StringListTest.GetMaxStringLengthMixed (767 of 2150)
PASS: lldb-shell :: SymbolFile/Breakpad/symtab.test (768 of 2150)
PASS: lldb-api :: types/TestFloatTypes.py (769 of 2150)
PASS: lldb-api :: functionalities/data-formatter/type_summary_list_arg/TestTypeSummaryListArg.py (770 of 2150)
PASS: lldb-api :: tools/lldb-server/TestGdbRemoteKill.py (771 of 2150)
PASS: lldb-unit :: Utility/./UtilityTests/UserIDResolver.GetUserName (772 of 2150)
PASS: lldb-api :: commands/expression/xvalue/TestXValuePrinting.py (773 of 2150)
PASS: lldb-unit :: Utility/./UtilityTests/LogChannelTest.Disable (774 of 2150)
UNSUPPORTED: lldb-api :: tools/lldb-server/registers-target-xml-reading/TestGdbRemoteTargetXmlPacket.py (775 of 2150)
PASS: lldb-shell :: Reproducer/Functionalities/TestImageList.test (776 of 2150)
PASS: lldb-unit :: Language/Highlighting/./HighlighterTests/HighlighterTest.ClangPreserveNewLine (777 of 2150)
PASS: lldb-shell :: Driver/TestHelp.test (778 of 2150)
PASS: lldb-api :: functionalities/archives/TestBSDArchives.py (779 of 2150)
PASS: lldb-api :: python_api/sblaunchinfo/TestSBLaunchInfo.py (780 of 2150)
PASS: lldb-api :: commands/expression/import-std-module/forward_list/TestForwardListFromStdModule.py (781 of 2150)
PASS: lldb-api :: api/multiple-debuggers/TestMultipleDebuggers.py (782 of 2150)
PASS: lldb-api :: functionalities/data-formatter/data-formatter-objc/TestDataFormatterObjCCF.py (783 of 2150)
PASS: lldb-api :: commands/expression/import-std-module/queue/TestQueueFromStdModule.py (784 of 2150)
PASS: lldb-api :: functionalities/data-formatter/data-formatter-objc/TestDataFormatterObjCNSBundle.py (785 of 2150)
PASS: lldb-unit :: Utility/./UtilityTests/DataExtractorTest.GetBitfield (786 of 2150)
PASS: lldb-unit :: Utility/./UtilityTests/ArgsTest.BareSingleQuote (787 of 2150)
UNSUPPORTED: lldb-api :: functionalities/thread/state/TestThreadStates.py (788 of 2150)
PASS: lldb-unit :: Utility/./UtilityTests/StringExtractorTest.GetHexBytesAvail_OddPair (789 of 2150)
PASS: lldb-unit :: Utility/./UtilityTests/UriParserTest.MinimalPort (790 of 2150)
PASS: lldb-unit :: Utility/./UtilityTests/ProcessInstanceInfo.Yaml (791 of 2150)
PASS: lldb-shell :: SymbolFile/Breakpad/unwind-via-raSearch.test (792 of 2150)
PASS: lldb-unit :: SymbolFile/NativePDB/./SymbolFileNativePDBTests/PDBFPOProgramToDWARFExpressionTests.InvalidAssignmentSingle (793 of 2150)
PASS: lldb-api :: terminal/TestEditline.py (794 of 2150)
PASS: lldb-unit :: ScriptInterpreter/Python/./ScriptInterpreterPythonTests/PythonDataObjectsTest.TestPythonListValueEquality (795 of 2150)
PASS: lldb-api :: functionalities/gdb_remote_client/TestStopPCs.py (796 of 2150)
PASS: lldb-unit :: Utility/./UtilityTests/StringListTest.SplitIntoLinesSingleTrailingCR (797 of 2150)
PASS: lldb-unit :: Utility/./UtilityTests/BinaryStreamTest.PutULEB128MaxValue (798 of 2150)
PASS: lldb-unit :: Symbol/./SymbolTests/TestTypeSystemClang.TestGetBasicTypeFromEnum (799 of 2150)
PASS: lldb-api :: lang/objc/objc-static-method/TestObjCStaticMethod.py (800 of 2150)
PASS: lldb-unit :: ScriptInterpreter/Python/./ScriptInterpreterPythonTests/PythonDataObjectsTest.TestPythonStringToStr (801 of 2150)
PASS: lldb-api :: functionalities/jitloader_gdb/TestJITLoaderGDB.py (802 of 2150)
PASS: lldb-unit :: Language/Highlighting/./HighlighterTests/HighlighterTest.ClangTrailingBackslashMissingNewLine (803 of 2150)
PASS: lldb-api :: commands/expression/import-std-module/deque-basic/TestDequeFromStdModule.py (804 of 2150)
PASS: lldb-api :: lang/c/enum_types/TestEnumTypes.py (805 of 2150)
UNSUPPORTED: lldb-api :: functionalities/data-formatter/data-formatter-stl/libstdcpp/tuple/TestDataFormatterStdTuple.py (806 of 2150)
PASS: lldb-shell :: Minidump/Windows/find-module.test (807 of 2150)
PASS: lldb-api :: commands/expression/fixits/TestFixIts.py (808 of 2150)
PASS: lldb-shell :: Settings/TestDisableColor.test (809 of 2150)
PASS: lldb-unit :: DataFormatter/./LLDBFormatterTests/StringPrinterTests.SwiftUTF8 (810 of 2150)
PASS: lldb-api :: lang/cpp/type_lookup/TestCppTypeLookup.py (811 of 2150)
PASS: lldb-api :: python_api/function_symbol/TestSymbolAPI.py (812 of 2150)
PASS: lldb-unit :: Process/gdb-remote/./ProcessGdbRemoteTests/GDBRemoteCommunicationClientTest.SendSignalsToIgnore (813 of 2150)
PASS: lldb-shell :: SymbolFile/Breakpad/unwind-via-stack-win-no-memory-info.yaml (814 of 2150)
PASS: lldb-unit :: Utility/./UtilityTests/StringExtractorTest.GetHexBytes_OddPair2 (815 of 2150)
PASS: lldb-api :: commands/expression/import-std-module/empty-module/TestEmptyStdModule.py (816 of 2150)
PASS: lldb-unit :: Symbol/./SymbolTests/TestTypeSystemClang.TestGetEnumIntegerTypeInvalid (817 of 2150)
PASS: lldb-api :: functionalities/gdb_remote_client/TestGDBRemoteClient.py (818 of 2150)
PASS: lldb-unit :: Target/./TargetTests/RemoteAwarePlatformTest.TestResolveExecutabelOnClientByPlatform (819 of 2150)
PASS: lldb-api :: python_api/frame/get-variables/TestGetVariables.py (820 of 2150)
PASS: lldb-shell :: Register/x86-64-gp-read.test (821 of 2150)
PASS: lldb-api :: commands/add-dsym/uuid/TestAddDsymCommand.py (822 of 2150)
PASS: lldb-unit :: Utility/./UtilityTests/RangeTest.SizeTypes (823 of 2150)
PASS: lldb-unit :: Process/minidump/./LLDBMinidumpTests/MinidumpParserTest.GetLinuxProcStatus_no_stream (824 of 2150)
PASS: lldb-api :: commands/expression/ir-interpreter/TestIRInterpreter.py (825 of 2150)
PASS: lldb-unit :: Process/gdb-remote/./ProcessGdbRemoteTests/GDBRemoteClientBaseTest.SendContinueDelegateStructuredDataReceipt (826 of 2150)
PASS: lldb-unit :: Utility/./UtilityTests/ArchSpecTest.MergeFromMachOUnknown (827 of 2150)
PASS: lldb-api :: functionalities/data-formatter/frameformat_smallstruct/TestFrameFormatSmallStruct.py (828 of 2150)
PASS: lldb-api :: lang/cpp/virtual-overload/TestVirtualOverload.py (829 of 2150)
PASS: lldb-unit :: Utility/./UtilityTests/StringListTest.JoinEmpty (830 of 2150)
PASS: lldb-unit :: Utility/./UtilityTests/ArgsTest.TestInsertArg (831 of 2150)
PASS: lldb-unit :: Utility/./UtilityTests/UriParserTest.BracketedHostname (832 of 2150)
PASS: lldb-api :: commands/thread/select/TestThreadSelect.py (833 of 2150)
UNSUPPORTED: lldb-api :: commands/register/register/aarch64_sve_registers/rw_access_static_config/TestSVERegisters.py (834 of 2150)
PASS: lldb-shell :: ObjectFile/MachO/subsections.yaml (835 of 2150)
PASS: lldb-unit :: ScriptInterpreter/Python/./ScriptInterpreterPythonTests/PythonDataObjectsTest.TestPythonTupleValues (836 of 2150)
PASS: lldb-shell :: SymbolFile/NativePDB/ast-functions.cpp (837 of 2150)
PASS: lldb-api :: functionalities/thread/concurrent_events/TestConcurrentWatchpointWithDelayWatchpointThreads.py (838 of 2150)
UNSUPPORTED: lldb-shell :: ScriptInterpreter/Lua/convenience_variables.test (839 of 2150)
PASS: lldb-unit :: Utility/./UtilityTests/UriParserTest.SchemeHostSeparator3 (840 of 2150)
PASS: lldb-unit :: SymbolFile/NativePDB/./SymbolFileNativePDBTests/PDBFPOProgramToDWARFExpressionTests.UnresolvedRegisterReference (841 of 2150)
PASS: lldb-api :: lang/cpp/namespace_definitions/TestNamespaceDefinitions.py (842 of 2150)
UNSUPPORTED: lldb-shell :: Register/aarch64-gp-read.test (843 of 2150)
PASS: lldb-unit :: Symbol/./SymbolTests/TestClangASTImporter.CopyTypeTagDecl (844 of 2150)
PASS: lldb-unit :: Utility/./UtilityTests/CompletionRequest.Constructor (845 of 2150)
PASS: lldb-api :: functionalities/source-map/TestTargetSourceMap.py (846 of 2150)
PASS: lldb-unit :: Core/./LLDBCoreTests/ModuleSpecTest.InvalidInMemoryBuffer (847 of 2150)
PASS: lldb-api :: functionalities/memory/find/TestMemoryFind.py (848 of 2150)
PASS: lldb-unit :: UnwindAssembly/x86/./UnwindAssemblyx86Tests/Testx86AssemblyInspectionEngine.TestPopRBX (849 of 2150)
PASS: lldb-api :: commands/watchpoints/watchpoint_set_command/TestWatchLocationWithWatchSet.py (850 of 2150)
PASS: lldb-shell :: SymbolFile/DWARF/dwp.s (851 of 2150)
PASS: lldb-shell :: Quit/TestQuitExitCodeHex0.test (852 of 2150)
PASS: lldb-api :: source-manager/TestSourceManager.py (853 of 2150)
PASS: lldb-api :: functionalities/data-formatter/data-formatter-objc/TestDataFormatterObjCPlain.py (854 of 2150)
PASS: lldb-api :: commands/statistics/basic/TestStats.py (855 of 2150)
PASS: lldb-api :: functionalities/data-formatter/builtin-formats/TestBuiltinFormats.py (856 of 2150)
PASS: lldb-unit :: SymbolFile/DWARF/./SymbolFileDWARFTests/SymbolFileDWARFTests.TestAbilitiesForDWARF (857 of 2150)
PASS: lldb-shell :: ObjectFile/ELF/PT_LOAD-overlap-PT_INTERP.yaml (858 of 2150)
PASS: lldb-api :: functionalities/postmortem/wow64_minidump/TestWow64MiniDump.py (859 of 2150)
PASS: lldb-unit :: Expression/./ExpressionTests/DWARFExpression.DW_OP_convert (860 of 2150)
PASS: lldb-unit :: Platform/./LLDBPlatformTests/PlatformDarwinTest.FindComponentInPath (861 of 2150)
PASS: lldb-api :: commands/expression/call-function/TestCallStdStringFunction.py (862 of 2150)
UNSUPPORTED: lldb-api :: arm/breakpoint-thumb-codesection/TestBreakpointThumbCodesection.py (863 of 2150)
PASS: lldb-unit :: Utility/./UtilityTests/RangeDataVector.FindEntryIndexesThatContain_Overlap (864 of 2150)
UNSUPPORTED: lldb-api :: lang/objc/rdar-12408181/TestRdar12408181.py (865 of 2150)
PASS: lldb-shell :: Commands/command-backtrace.test (866 of 2150)
PASS: lldb-unit :: ScriptInterpreter/Python/./ScriptInterpreterPythonTests/PythonDataObjectsTest.TestGlobalNameResolutionWithDot (867 of 2150)
PASS: lldb-unit :: UnwindAssembly/x86/./UnwindAssemblyx86Tests/Testx86AssemblyInspectionEngine.TestReturnDetect (868 of 2150)
PASS: lldb-api :: commands/expression/context-object/TestContextObject.py (869 of 2150)
PASS: lldb-unit :: Symbol/./SymbolTests/TestTypeSystemClang.TestGetTypeClassNested (870 of 2150)
PASS: lldb-unit :: Signals/./SignalsTests/UnixSignalsTest.GetFilteredSignals (871 of 2150)
PASS: lldb-unit :: Expression/./ExpressionTests/DWARFExpression.DW_OP_pick (872 of 2150)
PASS: lldb-unit :: Host/./HostTests/FileSystemTest.OpenErrno (873 of 2150)
PASS: lldb-unit :: Process/gdb-remote/./ProcessGdbRemoteTests/GDBRemoteClientBaseTest.SendContinueAndWait (874 of 2150)
PASS: lldb-api :: lang/objc/foundation/TestObjCMethods2.py (875 of 2150)
PASS: lldb-shell :: SymbolFile/NativePDB/globals-bss.cpp (876 of 2150)
PASS: lldb-unit :: DataFormatter/./LLDBFormatterTests/TypeMatcherTests.CreatedBySameMatchStringExactNamePrefixes (877 of 2150)
PASS: lldb-api :: commands/watchpoints/watchpoint_commands/TestWatchpointCommands.py (878 of 2150)
PASS: lldb-unit :: Symbol/./SymbolTests/TestTypeSystemClang.TestRemoveFastQualifiers (879 of 2150)
PASS: lldb-api :: functionalities/pre_run_dylibs/TestPreRunDylibs.py (880 of 2150)
PASS: lldb-api :: commands/watchpoints/watchpoint_disable/TestWatchpointDisable.py (881 of 2150)
PASS: lldb-unit :: Utility/./UtilityTests/FileSpecTest.OperatorBool (882 of 2150)
PASS: lldb-api :: tools/lldb-vscode/stackTrace/TestVSCode_stackTrace.py (883 of 2150)
PASS: lldb-unit :: Core/./LLDBCoreTests/SourceFileCache.FindSourceFileFound (884 of 2150)
PASS: lldb-unit :: SymbolFile/NativePDB/./SymbolFileNativePDBTests/PDBFPOProgramToDWARFExpressionTests.MissingTargetRegister (885 of 2150)
PASS: lldb-api :: functionalities/gdb_remote_client/TestGDBRemoteLoad.py (886 of 2150)
UNSUPPORTED: lldb-shell :: ScriptInterpreter/Lua/persistent_state.test (887 of 2150)
UNSUPPORTED: lldb-shell :: Expr/TestIRMemoryMapWindows.test (888 of 2150)
PASS: lldb-unit :: Utility/./UtilityTests/FileSpecTest.FileAndDirectoryComponents (889 of 2150)
PASS: lldb-api :: commands/command/delete/TestCommandDelete.py (890 of 2150)
PASS: lldb-shell :: ObjectFile/ELF/base-address.yaml (891 of 2150)
PASS: lldb-unit :: Symbol/./SymbolTests/TestTypeSystemClang.TestBuiltinTypeForEncodingAndBitSize (892 of 2150)
PASS: lldb-shell :: SymbolFile/NativePDB/disassembly.cpp (893 of 2150)
PASS: lldb-api :: functionalities/data-formatter/user-format-vs-summary/TestUserFormatVsSummary.py (894 of 2150)
PASS: lldb-unit :: Utility/./UtilityTests/BinaryStreamTest.PutSLEB128OneByte (895 of 2150)
PASS: lldb-api :: functionalities/thread/backtrace_limit/TestBacktraceLimit.py (896 of 2150)
PASS: lldb-shell :: Reproducer/TestProcessList.test (897 of 2150)
PASS: lldb-shell :: ObjectFile/ELF/basic-info.yaml (898 of 2150)
UNSUPPORTED: lldb-api :: functionalities/breakpoint/breakpoint_in_delayslot/TestAvoidBreakpointInDelaySlot.py (899 of 2150)
PASS: lldb-unit :: ScriptInterpreter/Python/./ScriptInterpreterPythonTests/PythonDataObjectsTest.TestPythonTupleInitializerList2 (900 of 2150)
PASS: lldb-api :: lang/objc/single-entry-dictionary/TestObjCSingleEntryDictionary.py (901 of 2150)
PASS: lldb-unit :: Host/./HostTests/SocketTest.TCPGetConnectURI (902 of 2150)
PASS: lldb-shell :: ObjectFile/wasm/stripped-debug-sections.yaml (903 of 2150)
PASS: lldb-unit :: ObjectFile/MachO/./ObjectFileMachOTests/ObjectFileMachOTest.ModuleFromSharedCacheInfo (904 of 2150)
PASS: lldb-unit :: Utility/./UtilityTests/StreamTest.AddressRange (905 of 2150)
UNSUPPORTED: lldb-shell :: SymbolFile/PDB/variables.test (906 of 2150)
PASS: lldb-unit :: Utility/./UtilityTests/AnsiTerminal.WhiteSpace (907 of 2150)
PASS: lldb-shell :: ObjectFile/ELF/PT_TLS-overlap-PT_LOAD.yaml (908 of 2150)
PASS: lldb-unit :: Host/./HostTests/SocketAddressTest.Set (909 of 2150)
PASS: lldb-api :: functionalities/thread/concurrent_events/TestConcurrentBreakpointsDelayedBreakpointOneWatchpoint.py (910 of 2150)
PASS: lldb-api :: macosx/find-dsym/bundle-with-dot-in-filename/TestBundleWithDotInFilename.py (911 of 2150)
PASS: lldb-api :: macosx/load-kext/TestLoadKext.py (912 of 2150)
PASS: lldb-unit :: SymbolFile/DWARF/./SymbolFileDWARFTests/DWARFASTParserClangTests.EnsureAllDIEsInDeclContextHaveBeenParsedParsesOnlyMatchingEntries (913 of 2150)
PASS: lldb-unit :: Utility/./UtilityTests/StatusTest.ErrorConversion (914 of 2150)
PASS: lldb-unit :: Utility/./UtilityTests/ScalarTest.GetValue (915 of 2150)
UNSUPPORTED: lldb-api :: tools/lldb-vscode/disconnect/TestVSCode_disconnect.py (916 of 2150)
PASS: lldb-unit :: Utility/./UtilityTests/PassiveReplayTest.InstrumentedBar (917 of 2150)
PASS: lldb-unit :: Process/minidump/./LLDBMinidumpTests/RegisterContextMinidump.CheckRegisterContextMinidump_ARM (918 of 2150)
PASS: lldb-api :: lang/cpp/stl/TestStdCXXDisassembly.py (919 of 2150)
PASS: lldb-api :: lang/objc/conflicting-definition/TestConflictingDefinition.py (920 of 2150)
UNSUPPORTED: lldb-shell :: Breakpoint/case-insensitive.test (921 of 2150)
PASS: lldb-api :: functionalities/target_var/no_vars/TestTargetVarNoVars.py (922 of 2150)
PASS: lldb-api :: functionalities/gdb_remote_client/TestQemuAArch64TargetXml.py (923 of 2150)
PASS: lldb-unit :: Utility/./UtilityTests/StringListTest.Assignment (924 of 2150)
PASS: lldb-shell :: SymbolFile/Breakpad/stack-cfi-arm.yaml (925 of 2150)
PASS: lldb-api :: commands/gui/breakpoints/TestGuiBreakpoints.py (926 of 2150)
PASS: lldb-shell :: Quit/TestQuitExitCodeHexA.test (927 of 2150)
PASS: lldb-unit :: ScriptInterpreter/Python/./ScriptInterpreterPythonTests/PythonDataObjectsTest.TestPythonInteger (928 of 2150)
PASS: lldb-unit :: Utility/./UtilityTests/RangeTest.DefaultConstructor (929 of 2150)
PASS: lldb-unit :: Utility/./UtilityTests/UriParserTest.BracketedHostnameWithPortIPv4 (930 of 2150)
PASS: lldb-api :: functionalities/gdb_remote_client/TestRestartBug.py (931 of 2150)
PASS: lldb-unit :: Host/./HostTests/SocketTest.UDPConnect (932 of 2150)
PASS: lldb-unit :: Utility/./UtilityTests/SerializationRountripTest.SerializeDeserializeCStringArrayNullptrElem (933 of 2150)
PASS: lldb-unit :: Process/gdb-remote/./ProcessGdbRemoteTests/GDBRemoteCommunicationServerTest.SendErrorResponse_ErrorNumber (934 of 2150)
PASS: lldb-api :: lang/objc/foundation/TestObjCMethodsNSArray.py (935 of 2150)
PASS: lldb-unit :: Process/gdb-remote/./ProcessGdbRemoteTests/GDBRemoteCommunicationServerTest.SendErrorResponse_UnimplementedError (936 of 2150)
PASS: lldb-shell :: Minidump/no-process-id.yaml (937 of 2150)
PASS: lldb-unit :: SymbolFile/NativePDB/./SymbolFileNativePDBTests/PDBFPOProgramToDWARFExpressionTests.UnresolvedRegisterAssignmentReference (938 of 2150)
PASS: lldb-shell :: ObjectFile/ELF/avr-basic-info.yaml (939 of 2150)
PASS: lldb-unit :: Utility/./UtilityTests/StreamTest.PutCString (940 of 2150)
PASS: lldb-unit :: Utility/./UtilityTests/StatusTest.ErrorConstructor (941 of 2150)
PASS: lldb-unit :: Utility/./UtilityTests/StreamTest.PutHex16ByteOrderBig (942 of 2150)
PASS: lldb-unit :: Utility/./UtilityTests/SerializationRountripTest.SerializeDeserializeObjectPointer (943 of 2150)
UNSUPPORTED: lldb-shell :: Register/arm-fp-read.test (944 of 2150)
PASS: lldb-unit :: Utility/./UtilityTests/DataExtractorTest.UncommonAddressSize (945 of 2150)
PASS: lldb-shell :: Settings/TestFrameFormatNoColor.test (946 of 2150)
PASS: lldb-unit :: Utility/./UtilityTests/Flags.Clear (947 of 2150)
PASS: lldb-unit :: Utility/./UtilityTests/XcodeSDKTest.SDKSupportsModules (948 of 2150)
PASS: lldb-unit :: UnwindAssembly/x86/./UnwindAssemblyx86Tests/Testx86AssemblyInspectionEngine.TestSpillRegToStackViaMOVx86_64 (949 of 2150)
PASS: lldb-api :: lang/c/vla/TestVLA.py (950 of 2150)
PASS: lldb-unit :: Utility/./UtilityTests/StreamTeeTest.Constructor1Stream (951 of 2150)
PASS: lldb-unit :: Utility/./UtilityTests/StringListTest.InsertStringAtIndexMove (952 of 2150)
PASS: lldb-api :: functionalities/signal/TestSendSignal.py (953 of 2150)
UNSUPPORTED: lldb-api :: benchmarks/stepping/TestSteppingSpeed.py (954 of 2150)
PASS: lldb-api :: commands/expression/radar_8638051/Test8638051.py (955 of 2150)
PASS: lldb-api :: python_api/frame/TestFrames.py (956 of 2150)
PASS: lldb-unit :: Process/gdb-remote/./ProcessGdbRemoteTests/GDBRemoteClientBaseTest.InterruptNoResponse (957 of 2150)
PASS: lldb-shell :: SymbolFile/DWARF/find-method-local-struct.cpp (958 of 2150)
PASS: lldb-unit :: Utility/./UtilityTests/StreamTest.PutHex64ByteOrderBig (959 of 2150)
PASS: lldb-unit :: UnwindAssembly/x86/./UnwindAssemblyx86Tests/Testx86AssemblyInspectionEngine.TestLEAVE (960 of 2150)
UNSUPPORTED: lldb-shell :: Register/aarch64-fp-read.test (961 of 2150)
PASS: lldb-unit :: Utility/./UtilityTests/RangeDataVector.FindEntryThatContains_Overlap (962 of 2150)
PASS: lldb-api :: functionalities/set-data/TestSetData.py (963 of 2150)
PASS: lldb-unit :: DataFormatter/./LLDBFormatterTests/StringPrinterTests.CxxASCII (964 of 2150)
PASS: lldb-api :: commands/frame/diagnose/complicated-expression/TestComplicatedExpression.py (965 of 2150)
PASS: lldb-unit :: UnwindAssembly/x86/./UnwindAssemblyx86Tests/Testx86AssemblyInspectionEngine.TestSubESP (966 of 2150)
PASS: lldb-unit :: Utility/./UtilityTests/ArchSpecTest.YAML (967 of 2150)
PASS: lldb-api :: commands/expression/import-std-module/conflicts/TestStdModuleWithConflicts.py (968 of 2150)
PASS: lldb-api :: functionalities/thread/concurrent_events/TestConcurrentTwoWatchpointsOneBreakpoint.py (969 of 2150)
PASS: lldb-unit :: Utility/./UtilityTests/ArgsTest.GetArgumentArrayRef (970 of 2150)
PASS: lldb-unit :: Utility/./UtilityTests/AnsiTerminal.Twice (971 of 2150)
PASS: lldb-api :: functionalities/data-formatter/setvaluefromcstring/TestSetValueFromCString.py (972 of 2150)
PASS: lldb-api :: lang/c/stepping/TestStepAndBreakpoints.py (973 of 2150)
PASS: lldb-unit :: Signals/./SignalsTests/UnixSignalsTest.VersionChange (974 of 2150)
PASS: lldb-unit :: Utility/./UtilityTests/XcodeSDKTest.GetCanonicalNameAndConstruct (975 of 2150)
UNSUPPORTED: lldb-api :: functionalities/darwin_log/source/debug/TestDarwinLogSourceDebug.py (976 of 2150)
PASS: lldb-unit :: Utility/./UtilityTests/DataExtractorTest.GetFloatUnaligned (977 of 2150)
PASS: lldb-api :: functionalities/data-formatter/data-formatter-stl/libcxx/unique_ptr/TestDataFormatterLibcxxUniquePtr.py (978 of 2150)
PASS: lldb-unit :: SymbolFile/DWARF/./SymbolFileDWARFTests/SymbolFileDWARFTests.ParseAranges (979 of 2150)
PASS: lldb-api :: commands/expression/import-std-module/unique_ptr-dbg-info-content/TestUniquePtrDbgInfoContent.py (980 of 2150)
PASS: lldb-api :: functionalities/unwind/noreturn/TestNoreturnUnwind.py (981 of 2150)
PASS: lldb-unit :: Utility/./UtilityTests/ArgsTest.TestSingleArgWithQuotedSpace (982 of 2150)
PASS: lldb-api :: commands/expression/static-initializers/TestStaticInitializers.py (983 of 2150)
PASS: lldb-shell :: Driver/TestPositionalArgs.test (984 of 2150)
PASS: lldb-unit :: Utility/./UtilityTests/ArgsTest.TestSingleQuotedArgWithSpace (985 of 2150)
PASS: lldb-api :: functionalities/ubsan/user-expression/TestUbsanUserExpression.py (986 of 2150)
PASS: lldb-api :: commands/expression/result_numbering/TestResultNumbering.py (987 of 2150)
PASS: lldb-unit :: Expression/./ExpressionTests/DiagnosticManagerTest.GetStringMultiline (988 of 2150)
PASS: lldb-api :: functionalities/thread/crash_during_step/TestCrashDuringStep.py (989 of 2150)
PASS: lldb-api :: functionalities/data-formatter/data-formatter-objc/TestDataFormatterObjCNSDate.py (990 of 2150)
PASS: lldb-unit :: Utility/./UtilityTests/OptionsWithRawTest.ArgsButNoDelimiter (991 of 2150)
PASS: lldb-shell :: Reproducer/Functionalities/TestStepping.test (992 of 2150)
PASS: lldb-unit :: Utility/./UtilityTests/CompletionRequest.DuplicateFiltering (993 of 2150)
PASS: lldb-api :: commands/command/script/TestCommandScript.py (994 of 2150)
PASS: lldb-api :: commands/watchpoints/hello_watchpoint/TestMyFirstWatchpoint.py (995 of 2150)
PASS: lldb-api :: lang/cpp/bitfields/TestCppBitfields.py (996 of 2150)
PASS: lldb-unit :: SymbolFile/DWARF/./SymbolFileDWARFTests/SymbolFileDWARFTests.TestAbbrevOutOfOrder (997 of 2150)
PASS: lldb-unit :: Language/Highlighting/./HighlighterTests/HighlighterTest.ClangCursorPosInOtherToken (998 of 2150)
PASS: lldb-api :: python_api/function_symbol/TestDisasmAPI.py (999 of 2150)
PASS: lldb-unit :: Utility/./UtilityTests/StateTest.Formatv (1000 of 2150)
PASS: lldb-api :: functionalities/data-formatter/data-formatter-synth/TestDataFormatterSynth.py (1001 of 2150)
PASS: lldb-unit :: Utility/./UtilityTests/FileSpecTest.GetPath (1002 of 2150)
PASS: lldb-api :: terminal/TestSTTYBeforeAndAfter.py (1003 of 2150)
PASS: lldb-api :: functionalities/breakpoint/move_nearest/TestMoveNearest.py (1004 of 2150)
PASS: lldb-unit :: Utility/./UtilityTests/ListenerTest.GetEventImmediate (1005 of 2150)
PASS: lldb-unit :: Utility/./UtilityTests/FileSpecTest.CopyByAppendingPathComponent (1006 of 2150)
PASS: lldb-shell :: Commands/command-disassemble.s (1007 of 2150)
PASS: lldb-unit :: Expression/./ExpressionTests/DWARFExpression.DW_OP_unknown (1008 of 2150)
PASS: lldb-unit :: Utility/./UtilityTests/Flags.AnySet (1009 of 2150)
PASS: lldb-unit :: Utility/./UtilityTests/BinaryStreamTest.PutULEB128NineBytes (1010 of 2150)
UNSUPPORTED: lldb-shell :: Register/x86-zmm-read.test (1011 of 2150)
PASS: lldb-api :: tools/lldb-vscode/module/TestVSCode_module.py (1012 of 2150)
PASS: lldb-unit :: Utility/./UtilityTests/ScalarTest.ComparisonFloat (1013 of 2150)
PASS: lldb-shell :: BuildScript/compiler-full-path.test (1014 of 2150)
PASS: lldb-unit :: Host/./HostTests/FileSystemTest.Resolve (1015 of 2150)
PASS: lldb-api :: commands/expression/regression-access-function-template-in-record/TestRegressionAccessFunctionTemplateInRecord.py (1016 of 2150)
UNSUPPORTED: lldb-shell :: ScriptInterpreter/Lua/lua-python.test (1017 of 2150)
PASS: lldb-shell :: SymbolFile/NativePDB/locate-pdb.cpp (1018 of 2150)
PASS: lldb-unit :: Utility/./UtilityTests/StreamTeeTest.Write (1019 of 2150)
PASS: lldb-api :: commands/frame/diagnose/bad-reference/TestBadReference.py (1020 of 2150)
PASS: lldb-unit :: Utility/./UtilityTests/StringListTest.ForRangeEmpty (1021 of 2150)
UNSUPPORTED: lldb-api :: commands/register/register/intel_xtended_registers/mpx_offset_intersection/TestMPXOffsetIntersection.py (1022 of 2150)
PASS: lldb-unit :: Core/./LLDBCoreTests/RichManglingContextTest.FromCxxMethodName (1023 of 2150)
PASS: lldb-unit :: Utility/./UtilityTests/StringExtractorTest.GetU64LittleEndian (1024 of 2150)
PASS: lldb-unit :: Utility/./UtilityTests/StreamTeeTest.GetStreamAtIndexOutOfBounds (1025 of 2150)
PASS: lldb-api :: functionalities/breakpoint/dummy_target_breakpoints/TestBreakpointsWithNoTargets.py (1026 of 2150)
PASS: lldb-unit :: Utility/./UtilityTests/RangeTest.ContainsRange (1027 of 2150)
PASS: lldb-api :: functionalities/breakpoint/breakpoint_conditions/TestBreakpointConditions.py (1028 of 2150)
PASS: lldb-api :: iohandler/autosuggestion/TestAutosuggestion.py (1029 of 2150)
PASS: lldb-unit :: Language/Highlighting/./HighlighterTests/HighlighterTest.ClangCursorPosAfterOtherToken (1030 of 2150)
PASS: lldb-api :: functionalities/thread/concurrent_events/TestConcurrentSignalWatch.py (1031 of 2150)
XFAIL: lldb-shell :: Register/x86-mm-xmm-read.test (1032 of 2150)
PASS: lldb-api :: functionalities/lazy-loading/TestLazyLoading.py (1033 of 2150)
UNSUPPORTED: lldb-api :: functionalities/signal/handle-segv/TestHandleSegv.py (1034 of 2150)
PASS: lldb-unit :: Utility/./UtilityTests/StringLexerTest.NextIf (1035 of 2150)
PASS: lldb-shell :: SymbolFile/DWARF/DW_AT_data_bit_offset-DW_OP_stack_value.s (1036 of 2150)
PASS: lldb-api :: lang/cpp/gmodules-templates/TestGModules.py (1037 of 2150)
PASS: lldb-unit :: ScriptInterpreter/Python/./ScriptInterpreterPythonTests/PythonDataObjectsTest.TestPythonString (1038 of 2150)
PASS: lldb-unit :: ObjectFile/Breakpad/./ObjectFileBreakpadTests/LineRecord.parse (1039 of 2150)
PASS: lldb-unit :: UnwindAssembly/x86/./UnwindAssemblyx86Tests/Testx86AssemblyInspectionEngine.TestPopRBP (1040 of 2150)
PASS: lldb-api :: functionalities/abbreviation/TestCommonShortSpellings.py (1041 of 2150)
PASS: lldb-unit :: Utility/./UtilityTests/OptionsWithRawTest.ArgsButNoLeadingDash (1042 of 2150)
PASS: lldb-shell :: Unwind/trap_frame_sym_ctx.test (1043 of 2150)
PASS: lldb-unit :: UnwindAssembly/x86/./UnwindAssemblyx86Tests/Testx86AssemblyInspectionEngine.TestPush0 (1044 of 2150)
PASS: lldb-shell :: SymbolFile/DWARF/dwp-debug-types.s (1045 of 2150)
PASS: lldb-api :: commands/watchpoints/multiple_threads/TestWatchpointMultipleThreads.py (1046 of 2150)
PASS: lldb-unit :: Language/Highlighting/./HighlighterTests/HighlighterTest.ClangScalarLiterals (1047 of 2150)
PASS: lldb-unit :: Expression/./ExpressionTests/DiagnosticManagerTest.AddDiagnostic (1048 of 2150)
PASS: lldb-api :: functionalities/data-formatter/varscript_formatting/TestDataFormatterVarScriptFormatting.py (1049 of 2150)
PASS: lldb-shell :: Driver/TestRepl.test (1050 of 2150)
PASS: lldb-api :: functionalities/data-formatter/data-formatter-objc/TestDataFormatterObjCKVO.py (1051 of 2150)
PASS: lldb-unit :: Utility/./UtilityTests/StreamTest.PutSLEB128 (1052 of 2150)
PASS: lldb-shell :: SymbolFile/DWARF/dir-separator-no-comp-dir.s (1053 of 2150)
PASS: lldb-shell :: SymbolFile/DWARF/find-variable-dwo.cpp (1054 of 2150)
PASS: lldb-unit :: Utility/./UtilityTests/StringExtractorTest.GetHexBytesAvail_FullString (1055 of 2150)
PASS: lldb-api :: lang/cpp/extern_c/TestExternCSymbols.py (1056 of 2150)
PASS: lldb-unit :: Process/gdb-remote/./ProcessGdbRemoteTests/GDBRemoteCommunicationClientTest.SendStopTracePacket (1057 of 2150)
PASS: lldb-unit :: UnwindAssembly/x86/./UnwindAssemblyx86Tests/Testx86AssemblyInspectionEngine.TestCALLNextInsn (1058 of 2150)
PASS: lldb-api :: commands/frame/diagnose/dereference-function-return/TestDiagnoseDereferenceFunctionReturn.py (1059 of 2150)
PASS: lldb-unit :: Expression/./ExpressionTests/DiagnosticManagerTest.AppendMessageAttachToLastDiag (1060 of 2150)
PASS: lldb-unit :: Utility/./UtilityTests/ArgsTest.Yaml (1061 of 2150)
PASS: lldb-api :: functionalities/thread/step_out/TestThreadStepOut.py (1062 of 2150)
PASS: lldb-unit :: Utility/./UtilityTests/BinaryStreamTest.PutULEB128FiveBytes (1063 of 2150)
PASS: lldb-api :: functionalities/postmortem/minidump-new/TestMiniDumpUUID.py (1064 of 2150)
PASS: lldb-unit :: Utility/./UtilityTests/StringListTest.JoinThree (1065 of 2150)
PASS: lldb-unit :: Utility/./UtilityTests/ScalarTest.Comparison (1066 of 2150)
PASS: lldb-api :: commands/breakpoint/command/list/TestBreakpointCommandList.py (1067 of 2150)
PASS: lldb-api :: functionalities/data-formatter/ptr_ref_typedef/TestPtrRef2Typedef.py (1068 of 2150)
PASS: lldb-api :: lang/cpp/wchar_t/TestCxxWCharT.py (1069 of 2150)
PASS: lldb-unit :: Process/minidump/./LLDBMinidumpTests/MinidumpParserTest.GetMemoryRegionInfoFromMemoryList (1070 of 2150)
PASS: lldb-unit :: Utility/./UtilityTests/OptionsWithRawTest.MultiWordSuffix (1071 of 2150)
PASS: lldb-api :: functionalities/postmortem/elf-core/TestLinuxCore.py (1072 of 2150)
PASS: lldb-api :: lang/c/offsetof/TestOffsetof.py (1073 of 2150)
PASS: lldb-shell :: ObjectFile/Breakpad/discontiguous-sections.test (1074 of 2150)
PASS: lldb-shell :: SymbolFile/DWARF/debug-names-compressed.cpp (1075 of 2150)
UNSUPPORTED: lldb-api :: functionalities/process_save_core/TestProcessSaveCore.py (1076 of 2150)
PASS: lldb-unit :: Process/minidump/./LLDBMinidumpTests/MinidumpParserTest.GetMiscInfo_no_stream (1077 of 2150)
PASS: lldb-shell :: Settings/TestStopCommandSourceOnError.test (1078 of 2150)
PASS: lldb-shell :: ObjectFile/Breakpad/sections.test (1079 of 2150)
PASS: lldb-api :: python_api/module_section/TestModuleAndSection.py (1080 of 2150)
PASS: lldb-unit :: Symbol/./SymbolTests/TestTypeSystemClang.TestUnifyAccessSpecifiers (1081 of 2150)
PASS: lldb-api :: macosx/version_zero/TestGetVersionZeroVersion.py (1082 of 2150)
PASS: lldb-unit :: Utility/./UtilityTests/StreamTeeTest.SetStreamAtIndexOutOfBounds (1083 of 2150)
PASS: lldb-unit :: Utility/./UtilityTests/FileSpecTest.FormatFileSpec (1084 of 2150)
PASS: lldb-unit :: UnwindAssembly/x86/./UnwindAssemblyx86Tests/Testx86AssemblyInspectionEngine.Testi386IgnoredRegisters (1085 of 2150)
PASS: lldb-api :: commands/gui/invalid-args/TestInvalidArgsGui.py (1086 of 2150)
XFAIL: lldb-shell :: SymbolFile/DWARF/find-type-in-function.cpp (1087 of 2150)
PASS: lldb-shell :: SymbolFile/DWARF/DW_AT_location-DW_AT_const_value.s (1088 of 2150)
PASS: lldb-api :: functionalities/data-formatter/data-formatter-stl/libcxx/unordered/TestDataFormatterUnordered.py (1089 of 2150)
PASS: lldb-unit :: SymbolFile/NativePDB/./SymbolFileNativePDBTests/PDBFPOProgramToDWARFExpressionTests.SingleAssignmentRegisterRef (1090 of 2150)
PASS: lldb-shell :: SymbolFile/DWARF/debug_loc.s (1091 of 2150)
PASS: lldb-unit :: Utility/./UtilityTests/ArchSpecTest.MergeFrom (1092 of 2150)
PASS: lldb-api :: commands/platform/basic/TestPlatformPython.py (1093 of 2150)
PASS: lldb-unit :: Utility/./UtilityTests/StringListTest.LongestCommonPrefixDuplicateElement (1094 of 2150)
PASS: lldb-unit :: Platform/./LLDBPlatformTests/PlatformAppleSimulatorTest.TestHostPlatformToSim (1095 of 2150)
PASS: lldb-unit :: Utility/./UtilityTests/UriParserTest.PortOverflow (1096 of 2150)
PASS: lldb-unit :: Utility/./UtilityTests/StringExtractorTest.GetHexBytesAvail_Partial (1097 of 2150)
PASS: lldb-unit :: Utility/./UtilityTests/VASprintfTest.NoBufferResize (1098 of 2150)
PASS: lldb-shell :: ObjectFile/ELF/PT_LOAD-empty.yaml (1099 of 2150)
PASS: lldb-unit :: Utility/./UtilityTests/AnsiTerminal.Empty (1100 of 2150)
PASS: lldb-unit :: Expression/./ExpressionTests/DiagnosticManagerTest.FixedExpression (1101 of 2150)
PASS: lldb-unit :: Signals/./SignalsTests/UnixSignalsTest.GetInfo (1102 of 2150)
PASS: lldb-api :: commands/target/stop-hook/enable/TestTargetStopHookEnable.py (1103 of 2150)
PASS: lldb-api :: functionalities/tsan/thread_leak/TestTsanThreadLeak.py (1104 of 2150)
PASS: lldb-shell :: Reproducer/TestFileRepro.test (1105 of 2150)
PASS: lldb-unit :: Utility/./UtilityTests/ArgsTest.TestQuotedUnknownEscape (1106 of 2150)
PASS: lldb-api :: sample_test/TestSampleInlineTest.py (1107 of 2150)
PASS: lldb-unit :: Process/minidump/./LLDBMinidumpTests/MinidumpParserTest.MinidumpDuplicateModuleMappedSecond (1108 of 2150)
PASS: lldb-api :: lang/cpp/operators/TestCppOperators.py (1109 of 2150)
PASS: lldb-api :: lang/objc/ptr_refs/TestPtrRefsObjC.py (1110 of 2150)
PASS: lldb-unit :: Utility/./UtilityTests/FileSpecTest.EqualDotsPosixRoot (1111 of 2150)
PASS: lldb-unit :: Utility/./UtilityTests/ConstStringTest.MangledCounterpart (1112 of 2150)
PASS: lldb-unit :: Utility/./UtilityTests/StringListTest.GetMaxStringLengthEmpty (1113 of 2150)
PASS: lldb-unit :: Interpreter/./InterpreterTests/CompletionTest.FileCompletionAbsolute (1114 of 2150)
PASS: lldb-api :: functionalities/tsan/basic/TestTsanBasic.py (1115 of 2150)
PASS: lldb-unit :: Utility/./UtilityTests/StringListTest.JoinSingle (1116 of 2150)
PASS: lldb-api :: functionalities/thread/concurrent_events/TestConcurrentManyCrash.py (1117 of 2150)
PASS: lldb-unit :: ObjectFile/Breakpad/./ObjectFileBreakpadTests/StackWinRecord.parse (1118 of 2150)
PASS: lldb-shell :: SymbolFile/DWARF/find-method.cpp (1119 of 2150)
PASS: lldb-shell :: ObjectFile/MachO/lc_version_min.yaml (1120 of 2150)
PASS: lldb-unit :: Core/./LLDBCoreTests/SourceFileCache.FindSourceFileNotFound (1121 of 2150)
PASS: lldb-unit :: Core/./LLDBCoreTests/MangledTest.ResultForValidName (1122 of 2150)
UNSUPPORTED: lldb-api :: tools/lldb-server/platform-process-connect/TestPlatformProcessConnect.py (1123 of 2150)
PASS: lldb-shell :: ScriptInterpreter/Python/eof.test (1124 of 2150)
PASS: lldb-shell :: SymbolFile/DWARF/debug_line-tombstone.s (1125 of 2150)
UNSUPPORTED: lldb-api :: commands/expression/call-restarts/TestCallThatRestarts.py (1126 of 2150)
PASS: lldb-unit :: Utility/./UtilityTests/ListenerTest.GetEventWait (1127 of 2150)
PASS: lldb-api :: functionalities/breakpoint/serialize/TestBreakpointSerialization.py (1128 of 2150)
PASS: lldb-shell :: Settings/TestFrameFormatMangling.test (1129 of 2150)
PASS: lldb-api :: lang/cpp/accelerator-table/TestCPPAccelerator.py (1130 of 2150)
PASS: lldb-unit :: Language/CPlusPlus/./LanguageCPlusPlusTests/CPlusPlusLanguage.CPlusPlusNameParser (1131 of 2150)
PASS: lldb-unit :: Host/./HostTests/MainLoopTest.Signal (1132 of 2150)
PASS: lldb-unit :: Utility/./UtilityTests/StreamTest.AddressNoSuffix (1133 of 2150)
PASS: lldb-unit :: SymbolFile/NativePDB/./SymbolFileNativePDBTests/PDBFPOProgramToDWARFExpressionTests.InvalidAssignmentMultiple (1134 of 2150)
PASS: lldb-unit :: Utility/./UtilityTests/StringListTest.AppendListCStringArray (1135 of 2150)
PASS: lldb-api :: commands/expression/char/TestExprsChar.py (1136 of 2150)
PASS: lldb-unit :: ObjectFile/ELF/./ObjectFileELFTests/ObjectFileELFTest.GetSymtab_NoSymEntryPointArmAddressClass (1137 of 2150)
PASS: lldb-unit :: Host/./HostTests/SocketAddressTest.GetAddressInfo (1138 of 2150)
PASS: lldb-unit :: Language/Highlighting/./HighlighterTests/HighlighterTest.ClangCursorOutOfBounds (1139 of 2150)
PASS: lldb-api :: functionalities/unwind/sigtramp/TestSigtrampUnwind.py (1140 of 2150)
PASS: lldb-unit :: Utility/./UtilityTests/RecordReplayTest.InstrumentedBarRef (1141 of 2150)
PASS: lldb-api :: commands/target/stop-hooks/TestStopHooks.py (1142 of 2150)
XFAIL: lldb-shell :: Register/x86-mm-xmm-write.test (1143 of 2150)
PASS: lldb-api :: tools/lldb-server/TestGdbRemoteAttach.py (1144 of 2150)
PASS: lldb-api :: lang/cpp/diamond/TestDiamond.py (1145 of 2150)
PASS: lldb-api :: commands/expression/import-std-module/sysroot/TestStdModuleSysroot.py (1146 of 2150)
PASS: lldb-shell :: SymbolFile/DWARF/clang-ast-from-dwarf-unamed-and-anon-structs.cpp (1147 of 2150)
PASS: lldb-shell :: ObjectFile/ELF/gnu-debuglink.yaml (1148 of 2150)
PASS: lldb-api :: types/TestIntegerType.py (1149 of 2150)
UNSUPPORTED: lldb-api :: tools/lldb-server/signal-filtering/TestGdbRemote_QPassSignals.py (1150 of 2150)
PASS: lldb-api :: commands/process/launch/TestProcessLaunch.py (1151 of 2150)
PASS: lldb-unit :: Utility/./UtilityTests/AnsiTerminal.KnownPrefix (1152 of 2150)
PASS: lldb-api :: commands/expression/persistent_types/TestPersistentTypes.py (1153 of 2150)
UNSUPPORTED: lldb-shell :: SymbolFile/PDB/udt-layout.test (1154 of 2150)
UNSUPPORTED: lldb-shell :: SymbolFile/NativePDB/typedefs.cpp (1155 of 2150)
PASS: lldb-api :: commands/watchpoints/step_over_watchpoint/TestStepOverWatchpoint.py (1156 of 2150)
PASS: lldb-unit :: Interpreter/./InterpreterTests/CompletionTest.DirCompletionAbsolute (1157 of 2150)
PASS: lldb-api :: commands/expression/po_verbosity/TestPoVerbosity.py (1158 of 2150)
PASS: lldb-unit :: Utility/./UtilityTests/NameMatchesTest.EndsWith (1159 of 2150)
PASS: lldb-api :: functionalities/gdb_remote_client/TestProcessConnect.py (1160 of 2150)
PASS: lldb-shell :: Breakpoint/debug_rnglist_rlestartend.test (1161 of 2150)
PASS: lldb-unit :: Utility/./UtilityTests/RangeTest.DoesIntersect (1162 of 2150)
PASS: lldb-unit :: Utility/./UtilityTests/BinaryStreamTest.PutSLEB128FourBytes (1163 of 2150)
PASS: lldb-unit :: Utility/./UtilityTests/StringExtractorTest.GetHexBytes_Partial (1164 of 2150)
PASS: lldb-api :: commands/expression/pr35310/TestExprsBug35310.py (1165 of 2150)
PASS: lldb-unit :: Utility/./UtilityTests/StringExtractorTest.GetHexBytesAvail_OddPair2 (1166 of 2150)
PASS: lldb-shell :: Quit/TestQuitExitCodeNonInt.test (1167 of 2150)
PASS: lldb-api :: commands/settings/TestSettings.py (1168 of 2150)
PASS: lldb-shell :: Settings/TestDisassemblyFormat.test (1169 of 2150)
PASS: lldb-api :: commands/frame/diagnose/local-variable/TestLocalVariable.py (1170 of 2150)
PASS: lldb-shell :: SymbolFile/DWARF/debug_loc_and_loclists.s (1171 of 2150)
PASS: lldb-api :: functionalities/thread/concurrent_events/TestConcurrentTwoBreakpointsOneSignal.py (1172 of 2150)
PASS: lldb-unit :: Expression/./ExpressionTests/CppModuleConfigurationTest.MissingUsrInclude (1173 of 2150)
PASS: lldb-unit :: Utility/./UtilityTests/RangeDataVector.CustomSort (1174 of 2150)
UNSUPPORTED: lldb-api :: functionalities/data-formatter/data-formatter-stl/libstdcpp/iterator/TestDataFormatterStdIterator.py (1175 of 2150)
PASS: lldb-api :: commands/expression/anonymous-struct/TestCallUserAnonTypedef.py (1176 of 2150)
PASS: lldb-unit :: Platform/Android/./AdbClientTests/AdbClientTest.CreateByDeviceId_ByEnvVar (1177 of 2150)
PASS: lldb-unit :: Utility/./UtilityTests/StringListTest.CopyList (1178 of 2150)
PASS: lldb-shell :: SymbolFile/NativePDB/tag-types.cpp (1179 of 2150)
UNSUPPORTED: lldb-api :: benchmarks/startup/TestStartupDelays.py (1180 of 2150)
PASS: lldb-unit :: ScriptInterpreter/Python/./ScriptInterpreterPythonTests/PythonDataObjectsTest.TestCallable (1181 of 2150)
PASS: lldb-shell :: Commands/command-regex-delete.test (1182 of 2150)
PASS: lldb-unit :: Utility/./UtilityTests/StringListTest.ForRange (1183 of 2150)
PASS: lldb-api :: python_api/symbol-context/TestSymbolContext.py (1184 of 2150)
PASS: lldb-unit :: Expression/./ExpressionTests/ClangExpressionDeclMapTest.TestUnknownIdentifierLookup (1185 of 2150)
PASS: lldb-unit :: UnwindAssembly/x86/./UnwindAssemblyx86Tests/Testx86AssemblyInspectionEngine.Test32bitFramelessBigStackFrame (1186 of 2150)
PASS: lldb-api :: lang/cpp/global_operators/TestCppGlobalOperators.py (1187 of 2150)
PASS: lldb-unit :: Host/./HostTests/SocketTest.TCPGetAddress (1188 of 2150)
PASS: lldb-shell :: Breakpoint/debug_rnglistx_rlex.test (1189 of 2150)
PASS: lldb-unit :: Utility/./UtilityTests/RangeTest.DoesAdjoinOrIntersect (1190 of 2150)
PASS: lldb-unit :: Symbol/./SymbolTests/LineEntryTest.GetSameLineContiguousAddressRangeNoInlines (1191 of 2150)
PASS: lldb-api :: functionalities/object-file/TestImageListMultiArchitecture.py (1192 of 2150)
PASS: lldb-api :: tools/lldb-vscode/breakpoint/TestVSCode_setFunctionBreakpoints.py (1193 of 2150)
PASS: lldb-api :: functionalities/data-formatter/data-formatter-stl/libcxx/multimap/TestDataFormatterLibccMultiMap.py (1194 of 2150)
PASS: lldb-api :: functionalities/thread/concurrent_events/TestConcurrentTwoWatchpointsOneDelayBreakpoint.py (1195 of 2150)
PASS: lldb-api :: lang/objc/blocks/TestObjCIvarsInBlocks.py (1196 of 2150)
PASS: lldb-shell :: ObjectFile/ELF/section-types.yaml (1197 of 2150)
PASS: lldb-unit :: Utility/./UtilityTests/StringListTest.CopyListSingle (1198 of 2150)
PASS: lldb-api :: commands/expression/calculator_mode/TestCalculatorMode.py (1199 of 2150)
UNSUPPORTED: lldb-api :: tools/lldb-server/TestGdbRemoteCompletion.py (1200 of 2150)
PASS: lldb-api :: functionalities/data-formatter/nsarraysynth/TestNSArraySynthetic.py (1201 of 2150)
PASS: lldb-shell :: SymbolFile/NativePDB/function-types-calling-conv.cpp (1202 of 2150)
PASS: lldb-shell :: ObjectFile/wasm/unified-debug-sections.yaml (1203 of 2150)
PASS: lldb-unit :: Utility/./UtilityTests/StreamTest.PutRawBytesToBigEndian (1204 of 2150)
PASS: lldb-shell :: Reproducer/Functionalities/TestExpressionEvaluation.test (1205 of 2150)
PASS: lldb-unit :: Utility/./UtilityTests/ScalarTest.Division (1206 of 2150)
UNSUPPORTED: lldb-api :: functionalities/darwin_log/filter/regex/activity/TestDarwinLogFilterRegexActivity.py (1207 of 2150)
PASS: lldb-api :: functionalities/thread/exit_during_step/TestExitDuringStep.py (1208 of 2150)
PASS: lldb-unit :: Utility/./UtilityTests/UUIDTest.Validity (1209 of 2150)
PASS: lldb-unit :: Language/Highlighting/./HighlighterTests/HighlighterTest.ClangCursorPosEndOfLine (1210 of 2150)
PASS: lldb-api :: tools/lldb-vscode/coreFile/TestVSCode_coreFile.py (1211 of 2150)
PASS: lldb-api :: functionalities/thread/concurrent_events/TestConcurrentCrashWithWatchpoint.py (1212 of 2150)
PASS: lldb-api :: functionalities/value_md5_crash/TestValueMD5Crash.py (1213 of 2150)
PASS: lldb-unit :: Core/./LLDBCoreTests/ModuleSpecTest.TestCOFFFile (1214 of 2150)
PASS: lldb-unit :: Symbol/./SymbolTests/DWARFCallFrameInfoTest.Basic_dwarf4 (1215 of 2150)
PASS: lldb-unit :: Utility/./UtilityTests/CompletionRequest.TryCompleteCurrentArgMode (1216 of 2150)
PASS: lldb-api :: functionalities/stats_api/TestStatisticsAPI.py (1217 of 2150)
UNSUPPORTED: lldb-api :: commands/watchpoints/variable_out_of_scope/TestWatchedVarHitWhenInScope.py (1218 of 2150)
PASS: lldb-unit :: Utility/./UtilityTests/StreamTest.PutMaxHex64ByteOrderLittle (1219 of 2150)
PASS: lldb-unit :: ScriptInterpreter/Python/./ScriptInterpreterPythonTests/PythonDataObjectsTest.TestPythonIntegerToStr (1220 of 2150)
UNSUPPORTED: lldb-api :: functionalities/thread/multi_break/TestMultipleBreakpoints.py (1221 of 2150)
PASS: lldb-shell :: Heap/heap-cstr.test (1222 of 2150)
PASS: lldb-shell :: SymbolFile/DWARF/gnu-style-compression.cpp (1223 of 2150)
PASS: lldb-api :: lang/cpp/virtual-functions/TestCppVirtualFunctions.py (1224 of 2150)
PASS: lldb-unit :: Utility/./UtilityTests/UriParserTest.MinimalPortPath (1225 of 2150)
PASS: lldb-shell :: SymbolFile/DWARF/anon_class_w_and_wo_export_symbols.ll (1226 of 2150)
PASS: lldb-unit :: Utility/./UtilityTests/RangeTest.SlideZero (1227 of 2150)
PASS: lldb-unit :: SymbolFile/DWARF/./SymbolFileDWARFTests/SymbolFileDWARFTests.TestAbbrevNullAttrValidForm (1228 of 2150)
PASS: lldb-unit :: Editline/./EditlineTests/EditlineTestFixture.EditlineReceivesSingleLineText (1229 of 2150)
PASS: lldb-api :: functionalities/breakpoint/objc/TestObjCBreakpoints.py (1230 of 2150)
PASS: lldb-api :: functionalities/gdb_remote_client/TestRegDefinitionInParts.py (1231 of 2150)
PASS: lldb-api :: types/TestCharTypeExpr.py (1232 of 2150)
PASS: lldb-unit :: ScriptInterpreter/Python/./ScriptInterpreterPythonTests/PythonDataObjectsTest.TestTypeNameResolutionNoDot (1233 of 2150)
PASS: lldb-api :: commands/expression/call-function/TestCallUserDefinedFunction.py (1234 of 2150)
PASS: lldb-unit :: Utility/./UtilityTests/StreamTeeTest.DefaultConstructor (1235 of 2150)
PASS: lldb-unit :: Symbol/./SymbolTests/TestTypeSystemClang.AddMethodToObjCObjectType (1236 of 2150)
PASS: lldb-api :: lang/objcxx/cxx-bridged-po/TestObjCXXBridgedPO.py (1237 of 2150)
PASS: lldb-unit :: Utility/./UtilityTests/UriParserTest.TypicalPortPathIPv4 (1238 of 2150)
PASS: lldb-unit :: Utility/./UtilityTests/DataExtractorTest.GetFloat (1239 of 2150)
PASS: lldb-api :: functionalities/tail_call_frames/disambiguate_call_site/TestDisambiguateCallSite.py (1240 of 2150)
PASS: lldb-api :: commands/watchpoints/watchpoint_commands/condition/TestWatchpointConditionCmd.py (1241 of 2150)
PASS: lldb-unit :: Utility/./UtilityTests/ReproducerTest.SetReplay (1242 of 2150)
PASS: lldb-shell :: SymbolFile/NativePDB/global-classes.cpp (1243 of 2150)
PASS: lldb-unit :: DataFormatter/./LLDBFormatterTests/TypeMatcherTests.RegexMatchPart (1244 of 2150)
PASS: lldb-shell :: SymbolFile/NativePDB/globals-fundamental.cpp (1245 of 2150)
PASS: lldb-api :: python_api/signals/TestSignalsAPI.py (1246 of 2150)
PASS: lldb-shell :: ObjectFile/ELF/many-sections.s (1247 of 2150)
PASS: lldb-unit :: Utility/./UtilityTests/CompletionRequest.FakeLastArg (1248 of 2150)
PASS: lldb-unit :: Utility/./UtilityTests/ArchSpecTest.TestParseMachCPUDashSubtypeTripleSimple (1249 of 2150)
PASS: lldb-shell :: SymbolFile/DWARF/DW_AT_low_pc-addrx.s (1250 of 2150)
PASS: lldb-unit :: ScriptInterpreter/Python/./ScriptInterpreterPythonTests/PythonDataObjectsTest.TestPythonCallableInvoke (1251 of 2150)
PASS: lldb-unit :: Utility/./UtilityTests/UriParserTest.SchemeHostSeparator4 (1252 of 2150)
PASS: lldb-api :: tools/lldb-server/TestGdbRemote_vCont.py (1253 of 2150)
PASS: lldb-shell :: Reproducer/TestCaptureEnvOverride.test (1254 of 2150)
PASS: lldb-unit :: Utility/./UtilityTests/ArgsTest.EscapeLLDBCommandArgument (1255 of 2150)
PASS: lldb-unit :: Core/./LLDBCoreTests/RichManglingContextTest.IPDRealloc (1256 of 2150)
PASS: lldb-unit :: Utility/./UtilityTests/ArgsTest.ReplaceArgumentAtIndexFarOutOfRange (1257 of 2150)
PASS: lldb-api :: functionalities/breakpoint/breakpoint_command/TestBreakpointCommand.py (1258 of 2150)
PASS: lldb-api :: commands/expression/formatters/TestFormatters.py (1259 of 2150)
PASS: lldb-api :: functionalities/breakpoint/breakpoint_hit_count/TestBreakpointHitCount.py (1260 of 2150)
PASS: lldb-unit :: Process/minidump/./LLDBMinidumpTests/RegisterContextMinidump.ConvertMinidumpContext_x86_32 (1261 of 2150)
PASS: lldb-api :: lang/objc/foundation/TestObjCMethodsString.py (1262 of 2150)
PASS: lldb-unit :: Interpreter/./InterpreterTests/OptionArgParserTest.toScriptLanguage (1263 of 2150)
PASS: lldb-unit :: Utility/./UtilityTests/StringExtractorTest.InitEmpty (1264 of 2150)
PASS: lldb-api :: functionalities/tsan/global_location/TestTsanGlobalLocation.py (1265 of 2150)
PASS: lldb-unit :: DataFormatter/./LLDBFormatterTests/FormatManagerTests.CompatibleLangs (1266 of 2150)
PASS: lldb-api :: functionalities/unwind/noreturn/module-end/TestNoReturnModuleEnd.py (1267 of 2150)
PASS: lldb-api :: lang/objc/modules/TestObjCModules.py (1268 of 2150)
PASS: lldb-shell :: SymbolFile/DWARF/module-ownership.mm (1269 of 2150)
PASS: lldb-unit :: Utility/./UtilityTests/BinaryStreamTest.PutSLEB128NineBytes (1270 of 2150)
PASS: lldb-unit :: UnwindAssembly/x86/./UnwindAssemblyx86Tests/Testx86AssemblyInspectionEngine.TestSpArithx86_64Augmented (1271 of 2150)
PASS: lldb-shell :: SymbolFile/DWARF/array-sizes.s (1272 of 2150)
PASS: lldb-unit :: Utility/./UtilityTests/EventTest.DumpEventDataBytes (1273 of 2150)
PASS: lldb-shell :: SymbolFile/DWARF/dir-separator-posix.s (1274 of 2150)
PASS: lldb-api :: functionalities/memory-region/TestMemoryRegion.py (1275 of 2150)
PASS: lldb-api :: lang/cpp/template/TestTemplateArgs.py (1276 of 2150)
PASS: lldb-unit :: Host/./HostTests/FileSystemTest.Exists (1277 of 2150)
UNSUPPORTED: lldb-shell :: SymbolFile/PDB/function-level-linking.test (1278 of 2150)
PASS: lldb-unit :: Process/gdb-remote/./ProcessGdbRemoteTests/GDBRemoteCommunicationClientTest.GetModulesInfo (1279 of 2150)
PASS: lldb-unit :: Utility/./UtilityTests/StringExtractorTest.GetNameColonValueSuccess (1280 of 2150)
PASS: lldb-api :: commands/expression/inline-namespace/TestInlineNamespace.py (1281 of 2150)
PASS: lldb-unit :: UnwindAssembly/x86/./UnwindAssemblyx86Tests/Testx86AssemblyInspectionEngine.TestStackRealign8BitDisp_i386 (1282 of 2150)
PASS: lldb-unit :: UnwindAssembly/PPC64/./PPC64InstEmulationTests/TestPPC64InstEmulation.TestSimpleFunction (1283 of 2150)
PASS: lldb-unit :: Utility/./UtilityTests/ArgsTest.TestAppendArg (1284 of 2150)
UNSUPPORTED: lldb-shell :: Register/x86-64-zmm-write.test (1285 of 2150)
PASS: lldb-api :: functionalities/thread/concurrent_events/TestConcurrentManyBreakpoints.py (1286 of 2150)
PASS: lldb-unit :: Utility/./UtilityTests/NameMatchesTest.Ignore (1287 of 2150)
PASS: lldb-unit :: Utility/./UtilityTests/StringExtractorTest.GetU32BigEndian (1288 of 2150)
PASS: lldb-unit :: Utility/./UtilityTests/BinaryStreamTest.PutSLEB128EightBytes (1289 of 2150)
PASS: lldb-unit :: Utility/./UtilityTests/Predicate.WaitForValueNotEqualTo (1290 of 2150)
PASS: lldb-unit :: Utility/./UtilityTests/VMRange.Ordering (1291 of 2150)
PASS: lldb-shell :: SymbolFile/DWARF/find-basic-namespace.cpp (1292 of 2150)
PASS: lldb-unit :: Utility/./UtilityTests/StringListTest.Join (1293 of 2150)
PASS: lldb-unit :: Utility/./UtilityTests/OptionsWithRawTest.LeadingSpaceArgs (1294 of 2150)
PASS: lldb-api :: lang/cpp/bool/TestCPPBool.py (1295 of 2150)
PASS: lldb-api :: commands/session/history/TestSessionHistory.py (1296 of 2150)
PASS: lldb-unit :: Utility/./UtilityTests/ConstStringTest.UpdateMangledCounterpart (1297 of 2150)
UNSUPPORTED: lldb-shell :: SymbolFile/DWARF/split-dwarf-expression-eval-bug.cpp (1298 of 2150)
PASS: lldb-unit :: Utility/./UtilityTests/RegisterValueTest.GetSet8 (1299 of 2150)
PASS: lldb-unit :: Utility/./UtilityTests/StringExtractorTest.GetNameColonValueNoColon (1300 of 2150)
PASS: lldb-api :: commands/expression/test/TestExprs.py (1301 of 2150)
PASS: lldb-api :: functionalities/thread/concurrent_events/TestConcurrentDelaySignalBreak.py (1302 of 2150)
PASS: lldb-api :: functionalities/data-formatter/compactvectors/TestCompactVectors.py (1303 of 2150)
PASS: lldb-api :: functionalities/breakpoint/breakpoint_callback_command_source/TestBreakpointCallbackCommandSource.py (1304 of 2150)
PASS: lldb-api :: tools/lldb-vscode/console/TestVSCode_console.py (1305 of 2150)
PASS: lldb-unit :: Utility/./UtilityTests/ScalarTest.ExtractBitfield (1306 of 2150)
PASS: lldb-api :: lang/c/register_variables/TestRegisterVariables.py (1307 of 2150)
PASS: lldb-api :: lang/cpp/unicode-literals/TestUnicodeLiterals.py (1308 of 2150)
PASS: lldb-api :: commands/command/nested_alias/TestNestedAlias.py (1309 of 2150)
PASS: lldb-unit :: Utility/./UtilityTests/OptionsWithRawTest.EmptySuffix (1310 of 2150)
PASS: lldb-unit :: Utility/./UtilityTests/DataExtractorTest.GetMaxU64_unchecked (1311 of 2150)
PASS: lldb-api :: functionalities/breakpoint/breakpoint_ids/TestBreakpointIDs.py (1312 of 2150)
PASS: lldb-api :: python_api/get-value-32bit-int/TestGetValue32BitInt.py (1313 of 2150)
PASS: lldb-api :: lang/objc/objc++/TestObjCXX.py (1314 of 2150)
PASS: lldb-unit :: Utility/./UtilityTests/DataExtractorTest.GetDoubleUnaligned (1315 of 2150)
PASS: lldb-api :: functionalities/breakpoint/scripted_bkpt/TestScriptedResolver.py (1316 of 2150)
PASS: lldb-api :: commands/target/stop-hook/disable/TestTargetStopHookDisable.py (1317 of 2150)
PASS: lldb-api :: tools/lldb-vscode/variables/TestVSCode_variables.py (1318 of 2150)
PASS: lldb-unit :: Utility/./UtilityTests/StreamTest.AddressRangeInvalidRange (1319 of 2150)
PASS: lldb-api :: commands/expression/import-std-module/forward_list-dbg-info-content/TestDbgInfoContentForwardListFromStdModule.py (1320 of 2150)
PASS: lldb-shell :: VSCode/TestOptions.test (1321 of 2150)
PASS: lldb-api :: commands/help/TestHelp.py (1322 of 2150)
PASS: lldb-api :: python_api/exprpath_synthetic/TestExprPathSynthetic.py (1323 of 2150)
PASS: lldb-shell :: ObjectFile/ELF/aarch64-relocations.yaml (1324 of 2150)
PASS: lldb-api :: commands/expression/cast_int_to_anonymous_enum/TestCastIntToAnonymousEnum.py (1325 of 2150)
PASS: lldb-shell :: Settings/TestEchoCommands.test (1326 of 2150)
PASS: lldb-api :: python_api/value_var_update/TestValueVarUpdate.py (1327 of 2150)
PASS: lldb-api :: functionalities/ptr_refs/TestPtrRefs.py (1328 of 2150)
PASS: lldb-unit :: Expression/./ExpressionTests/CppModuleConfigurationTest.UnrelatedLibrary (1329 of 2150)
PASS: lldb-unit :: Expression/./ExpressionTests/ClangHostTest.ComputeClangResourceDirectory (1330 of 2150)
PASS: lldb-unit :: Language/CPlusPlus/./LanguageCPlusPlusTests/CPlusPlusLanguage.FindAlternateFunctionManglings (1331 of 2150)
PASS: lldb-api :: functionalities/completion/TestCompletion.py (1332 of 2150)
PASS: lldb-unit :: Instruction/./EmulatorTests/TestAArch64Emulator.TestOverflow (1333 of 2150)
PASS: lldb-unit :: Utility/./UtilityTests/XcodeSDKTest.SDKSupportsSwift (1334 of 2150)
PASS: lldb-shell :: Unwind/eh-frame-dwarf-unwind.test (1335 of 2150)
PASS: lldb-unit :: Utility/./UtilityTests/TimeoutTest.Format (1336 of 2150)
PASS: lldb-api :: lang/objcxx/class-name-clash/TestNameClash.py (1337 of 2150)
PASS: lldb-api :: functionalities/thread/num_threads/TestNumThreads.py (1338 of 2150)
PASS: lldb-unit :: SymbolFile/NativePDB/./SymbolFileNativePDBTests/PDBFPOProgramToDWARFExpressionTests.UnresolvedDependentCyclicRegisterAssignmentReference (1339 of 2150)
PASS: lldb-api :: functionalities/tsan/multiple/TestTsanMultiple.py (1340 of 2150)
PASS: lldb-shell :: ObjectFile/ELF/section-types-edgecases.yaml (1341 of 2150)
PASS: lldb-api :: functionalities/data-formatter/cstring-utf8-summary/TestCstringUnicode.py (1342 of 2150)
PASS: lldb-unit :: Utility/./UtilityTests/UriParserTest.TypicalPortPathIPv6 (1343 of 2150)
PASS: lldb-api :: commands/settings/quoting/TestQuoting.py (1344 of 2150)
PASS: lldb-api :: functionalities/data-formatter/data-formatter-enum-format/TestDataFormatterEnumFormat.py (1345 of 2150)
PASS: lldb-unit :: Utility/./UtilityTests/VASprintfTest.EncodingError (1346 of 2150)
PASS: lldb-api :: iohandler/completion/TestIOHandlerCompletion.py (1347 of 2150)
UNSUPPORTED: lldb-api :: functionalities/longjmp/TestLongjmp.py (1348 of 2150)
PASS: lldb-shell :: Reproducer/TestCrash.test (1349 of 2150)
PASS: lldb-unit :: UnwindAssembly/x86/./UnwindAssemblyx86Tests/Testx86AssemblyInspectionEngine.Test64bitFramelessSmallStackFrame (1350 of 2150)
PASS: lldb-api :: lang/objc/direct-dispatch-step/TestObjCDirectDispatchStepping.py (1351 of 2150)
UNSUPPORTED: lldb-api :: tools/lldb-vscode/completions/TestVSCode_completions.py (1352 of 2150)
PASS: lldb-unit :: UnwindAssembly/x86/./UnwindAssemblyx86Tests/Testx86AssemblyInspectionEngine.TestPushEBP (1353 of 2150)
PASS: lldb-unit :: Interpreter/./InterpreterTests/OptionValueFileColonLine.setFromString (1354 of 2150)
PASS: lldb-api :: python_api/value/TestValueAPI.py (1355 of 2150)
PASS: lldb-unit :: Utility/./UtilityTests/StringExtractorTest.DecodeHexU8_Underflow (1356 of 2150)
UNSUPPORTED: lldb-shell :: Process/Windows/exception_access_violation.cpp (1357 of 2150)
PASS: lldb-unit :: Utility/./UtilityTests/RangeTest.NotEqualInvalid (1358 of 2150)
PASS: lldb-unit :: Utility/./UtilityTests/FileSpecTest.RemoveLastPathComponent (1359 of 2150)
PASS: lldb-unit :: DataFormatter/./LLDBFormatterTests/TypeMatcherTests.GetMatchStringExactName (1360 of 2150)
PASS: lldb-shell :: ScriptInterpreter/None/import_module.test (1361 of 2150)
PASS: lldb-api :: functionalities/breakpoint/debugbreak/TestDebugBreak.py (1362 of 2150)
PASS: lldb-api :: lang/cpp/symbols/TestSymbols.py (1363 of 2150)
PASS: lldb-unit :: Utility/./UtilityTests/StreamTeeTest.SetStreamAtIndexOverwrite (1364 of 2150)
PASS: lldb-shell :: Minidump/Windows/arm-fp-unwind.test (1365 of 2150)
PASS: lldb-shell :: SymbolFile/DWARF/debug-line-basic.s (1366 of 2150)
UNSUPPORTED: lldb-api :: benchmarks/libcxxmap/TestBenchmarkLibcxxMap.py (1367 of 2150)
PASS: lldb-unit :: Utility/./UtilityTests/RangeTest.ContainsAddrInvalid (1368 of 2150)
PASS: lldb-unit :: Utility/./UtilityTests/StreamTest.PutBytesAsRawHex8ToBigEndian (1369 of 2150)
PASS: lldb-shell :: Quit/TestQuitExitCode30.test (1370 of 2150)
PASS: lldb-unit :: Utility/./UtilityTests/SubsystemRAIITest.SubsystemWithErrorFailure (1371 of 2150)
PASS: lldb-shell :: Process/UnsupportedLanguage.test (1372 of 2150)
PASS: lldb-unit :: Utility/./UtilityTests/StringListTest.LongestCommonPrefixSingleElement (1373 of 2150)
PASS: lldb-api :: lang/cpp/inlines/TestInlines.py (1374 of 2150)
PASS: lldb-unit :: ScriptInterpreter/Python/./ScriptInterpreterPythonTests/PythonDataObjectsTest.TestPythonFile (1375 of 2150)
PASS: lldb-api :: functionalities/breakpoint/address_breakpoints/TestAddressBreakpoints.py (1376 of 2150)
PASS: lldb-api :: commands/log/invalid-args/TestInvalidArgsLog.py (1377 of 2150)
PASS: lldb-api :: functionalities/thread/concurrent_events/TestConcurrentCrashWithWatchpointBreakpointSignal.py (1378 of 2150)
PASS: lldb-unit :: Utility/./UtilityTests/StringListTest.DefaultConstructor (1379 of 2150)
PASS: lldb-shell :: Register/x86-64-read.test (1380 of 2150)
PASS: lldb-unit :: Expression/./ExpressionTests/CppModuleConfigurationTest.Xcode (1381 of 2150)
PASS: lldb-api :: functionalities/tail_call_frames/unambiguous_sequence/TestUnambiguousTailCalls.py (1382 of 2150)
PASS: lldb-api :: tools/lldb-server/TestGdbRemote_qThreadStopInfo.py (1383 of 2150)
PASS: lldb-unit :: Host/./HostTests/FileSystemTest.FileAndDirectoryComponents (1384 of 2150)
PASS: lldb-unit :: Process/gdb-remote/./ProcessGdbRemoteTests/GDBRemoteCommunicationTest.ReadPacket_checksum (1385 of 2150)
PASS: lldb-api :: functionalities/data-formatter/data-formatter-objc/TestDataFormatterObjNSException.py (1386 of 2150)
PASS: lldb-api :: python_api/findvalue_duplist/TestSBFrameFindValue.py (1387 of 2150)
PASS: lldb-api :: commands/version/TestVersion.py (1388 of 2150)
PASS: lldb-api :: functionalities/type_lookup/TestTypeLookup.py (1389 of 2150)
PASS: lldb-unit :: Utility/./UtilityTests/TimerTest.CategoryTimes2 (1390 of 2150)
PASS: lldb-unit :: Utility/./UtilityTests/UUIDTest.SetFromStringRef (1391 of 2150)
PASS: lldb-api :: types/TestShortType.py (1392 of 2150)
PASS: lldb-api :: commands/expression/import-std-module/unique_ptr/TestUniquePtrFromStdModule.py (1393 of 2150)
PASS: lldb-api :: functionalities/thread/concurrent_events/TestConcurrentDelayedCrashWithBreakpointSignal.py (1394 of 2150)
PASS: lldb-api :: functionalities/thread/concurrent_events/TestConcurrentTwoBreakpointsOneWatchpoint.py (1395 of 2150)
PASS: lldb-unit :: Core/./LLDBCoreTests/RichManglingContextTest.Basic (1396 of 2150)
UNSUPPORTED: lldb-shell :: SymbolFile/DWARF/DW_TAG_GNU_call_site-DW_AT_low_pc.s (1397 of 2150)
PASS: lldb-api :: functionalities/tsan/cpp_global_location/TestTsanCPPGlobalLocation.py (1398 of 2150)
PASS: lldb-api :: tools/lldb-server/TestGdbRemoteSingleStep.py (1399 of 2150)
PASS: lldb-api :: lang/c/blocks/TestBlocks.py (1400 of 2150)
PASS: lldb-unit :: Utility/./UtilityTests/StatusTest.ErrorCodeConstructor (1401 of 2150)
XFAIL: lldb-shell :: Register/x86-64-ymm-write.test (1402 of 2150)
PASS: lldb-unit :: Utility/./UtilityTests/StreamTest.PutULEB128 (1403 of 2150)
PASS: lldb-unit :: Utility/./UtilityTests/ConstStringTest.FromMidOfBufferStringRef (1404 of 2150)
PASS: lldb-shell :: SymbolFile/DWARF/dwarf5_locations.s (1405 of 2150)
PASS: lldb-api :: functionalities/data-formatter/data-formatter-stl/libcxx/vector/TestDataFormatterLibcxxVector.py (1406 of 2150)
PASS: lldb-shell :: Host/TestCustomShell.test (1407 of 2150)
PASS: lldb-unit :: Symbol/./SymbolTests/SymbolsTest.LocateExecutableSymbolFileForUnknownExecutableAndMissingSymbolFile (1408 of 2150)
PASS: lldb-unit :: Utility/./UtilityTests/RangeTest.LessThanInvalid (1409 of 2150)
PASS: lldb-unit :: Language/Highlighting/./HighlighterTests/HighlighterTest.FallbackHighlighter (1410 of 2150)
PASS: lldb-api :: functionalities/postmortem/netbsd-core/TestNetBSDCore.py (1411 of 2150)
PASS: lldb-unit :: Utility/./UtilityTests/Flags.IsClear (1412 of 2150)
PASS: lldb-unit :: UnwindAssembly/x86/./UnwindAssemblyx86Tests/Testx86AssemblyInspectionEngine.TestPopEBX (1413 of 2150)
PASS: lldb-api :: commands/process/launch-with-shellexpand/TestLaunchWithShellExpand.py (1414 of 2150)
PASS: lldb-shell :: Commands/CommandScriptImmediateOutput/CommandScriptImmediateOutputConsole.test (1415 of 2150)
PASS: lldb-api :: functionalities/step-avoids-no-debug/TestStepNoDebug.py (1416 of 2150)
PASS: lldb-shell :: ObjectFile/PECOFF/basic-info-arm64.yaml (1417 of 2150)
PASS: lldb-api :: commands/platform/process/list/TestProcessList.py (1418 of 2150)
PASS: lldb-unit :: Utility/./UtilityTests/UriParserTest.MinimalPath (1419 of 2150)
PASS: lldb-api :: commands/target/stop-hook/delete/TestTargetStopHookDelete.py (1420 of 2150)
PASS: lldb-shell :: Driver/TestNoUseColor.test (1421 of 2150)
PASS: lldb-shell :: ObjectFile/Breakpad/sections-trailing-func.test (1422 of 2150)
PASS: lldb-api :: commands/source/info/TestSourceInfo.py (1423 of 2150)
PASS: lldb-unit :: Utility/./UtilityTests/StringListTest.LongestCommonPrefixNoPrefix (1424 of 2150)
PASS: lldb-api :: functionalities/thread/jump/TestThreadJump.py (1425 of 2150)
PASS: lldb-api :: commands/process/attach/TestProcessAttach.py (1426 of 2150)
PASS: lldb-unit :: ObjectFile/Breakpad/./ObjectFileBreakpadTests/Record.classify (1427 of 2150)
PASS: lldb-unit :: Process/gdb-remote/./ProcessGdbRemoteTests/GDBRemoteClientBaseTest.SendContinueAndAsyncPacket (1428 of 2150)
PASS: lldb-unit :: Host/./HostTests/Host.GetEnvironment (1429 of 2150)
PASS: lldb-shell :: Breakpoint/debug_rnglist_offset_pair.test (1430 of 2150)
PASS: lldb-api :: functionalities/thread/concurrent_events/TestConcurrentCrashWithBreak.py (1431 of 2150)
PASS: lldb-shell :: SymbolFile/NativePDB/break-by-function.cpp (1432 of 2150)
PASS: lldb-unit :: Utility/./UtilityTests/ArgsTest.ReplaceArgumentAtIndexOutOfRange (1433 of 2150)
PASS: lldb-api :: python_api/symbol-context/two-files/TestSymbolContextTwoFiles.py (1434 of 2150)
PASS: lldb-api :: commands/expression/call-function/TestCallStopAndContinue.py (1435 of 2150)
PASS: lldb-api :: functionalities/thread/concurrent_events/TestConcurrentWatchBreakDelay.py (1436 of 2150)
PASS: lldb-unit :: Target/./TargetTests/StackFrameRecognizerTest.NullModuleRegex (1437 of 2150)
PASS: lldb-unit :: Language/Highlighting/./HighlighterTests/HighlighterTest.ClangTrailingBackslashBeforeNewline (1438 of 2150)
PASS: lldb-shell :: SymbolFile/DWARF/debug_aranges-empty-section.s (1439 of 2150)
PASS: lldb-api :: lang/cpp/this/TestCPPThis.py (1440 of 2150)
PASS: lldb-unit :: Symbol/./SymbolTests/TestTypeSystemClang.TestGetBasicTypeFromName (1441 of 2150)
PASS: lldb-api :: lang/cpp/class_static/TestStaticVariables.py (1442 of 2150)
PASS: lldb-unit :: Utility/./UtilityTests/StringExtractorTest.GetHexU8_InvalidHex_NoEof (1443 of 2150)
PASS: lldb-unit :: Utility/./UtilityTests/BinaryStreamTest.PutSLEB128TwoBytes (1444 of 2150)
PASS: lldb-unit :: Utility/./UtilityTests/StreamTest.AddressEmptyPrefix (1445 of 2150)
PASS: lldb-api :: functionalities/data-formatter/data-formatter-stl/libcxx/vbool/TestDataFormatterLibcxxVBool.py (1446 of 2150)
PASS: lldb-unit :: Utility/./UtilityTests/DataExtractorTest.GetSLEB128_bit63 (1447 of 2150)
PASS: lldb-api :: python_api/objc_type/TestObjCType.py (1448 of 2150)
PASS: lldb-api :: commands/expression/namespace_local_var_same_name_obj_c/TestNamespaceLocalVarSameNameObjC.py (1449 of 2150)
PASS: lldb-unit :: Expression/./ExpressionTests/ClangExpressionDeclMapTest.TestPersistentDeclLookup (1450 of 2150)
PASS: lldb-api :: lang/objc/unicode-string/TestUnicodeString.py (1451 of 2150)
PASS: lldb-unit :: Utility/./UtilityTests/ArgsTest.TestSingleArg (1452 of 2150)
PASS: lldb-api :: commands/expression/import-std-module/vector-bool/TestVectorBoolFromStdModule.py (1453 of 2150)
PASS: lldb-unit :: Core/./LLDBCoreTests/MangledTest.EmptyForInvalidName (1454 of 2150)
PASS: lldb-unit :: Utility/./UtilityTests/StringListTest.InsertStringAtIndexStart (1455 of 2150)
PASS: lldb-api :: functionalities/data-formatter/language_category_updates/TestDataFormatterLanguageCategoryUpdates.py (1456 of 2150)
PASS: lldb-api :: commands/expression/import-std-module/stack/TestStackFromStdModule.py (1457 of 2150)
PASS: lldb-api :: commands/expression/weak_symbols/TestWeakSymbols.py (1458 of 2150)
PASS: lldb-unit :: Expression/./ExpressionTests/CppModuleConfigurationTest.Sysroot (1459 of 2150)
PASS: lldb-api :: macosx/duplicate-archive-members/TestDuplicateMembers.py (1460 of 2150)
PASS: lldb-api :: functionalities/data-formatter/ostypeformatting/TestFormattersOsType.py (1461 of 2150)
UNSUPPORTED: lldb-shell :: ScriptInterpreter/Lua/watchpoint_callback.test (1462 of 2150)
PASS: lldb-shell :: Minidump/memory-region.yaml (1463 of 2150)
PASS: lldb-unit :: SymbolFile/NativePDB/./SymbolFileNativePDBTests/PDBFPOProgramToDWARFExpressionTests.InvalidOpBinary (1464 of 2150)
PASS: lldb-api :: functionalities/gdb_remote_client/TestNestedRegDefinitions.py (1465 of 2150)
PASS: lldb-unit :: Utility/./UtilityTests/StringLexerTest.NextIfList (1466 of 2150)
PASS: lldb-unit :: Process/minidump/./LLDBMinidumpTests/MinidumpParserTest.MinidumpModuleOrder (1467 of 2150)
PASS: lldb-api :: functionalities/data-formatter/data-formatter-objc/TestDataFormatterObjCNSData.py (1468 of 2150)
PASS: lldb-unit :: Language/Highlighting/./HighlighterTests/HighlighterTest.ClangTrailingBackslashWithWhitespace (1469 of 2150)
PASS: lldb-api :: lang/objc/foundation/TestFoundationDisassembly.py (1470 of 2150)
PASS: lldb-unit :: Utility/./UtilityTests/ArgsTest.ReplaceArgumentAtIndexEqual (1471 of 2150)
PASS: lldb-api :: commands/expression/two-files/TestObjCTypeQueryFromOtherCompileUnit.py (1472 of 2150)
UNSUPPORTED: lldb-api :: commands/expression/completion-crash-invalid-iterator/TestInvalidIteratorCompletionCrash.py (1473 of 2150)
PASS: lldb-api :: commands/expression/unwind_expression/TestUnwindExpression.py (1474 of 2150)
PASS: lldb-api :: commands/log/basic/TestLogging.py (1475 of 2150)
PASS: lldb-api :: functionalities/breakpoint/hardware_breakpoints/require_hw_breakpoints/TestRequireHWBreakpoints.py (1476 of 2150)
PASS: lldb-api :: functionalities/data-formatter/data-formatter-stl/libstdcpp/unique_ptr/invalid/TestDataFormatterInvalidStdUniquePtr.py (1477 of 2150)
PASS: lldb-api :: functionalities/data-formatter/data-formatter-categories/TestDataFormatterCategories.py (1478 of 2150)
PASS: lldb-unit :: Utility/./UtilityTests/AnsiTerminal.AtStart (1479 of 2150)
PASS: lldb-unit :: Utility/./UtilityTests/DataExtractorTest.GetCStrUnterminated (1480 of 2150)
PASS: lldb-unit :: Host/./HostTests/File.GetStreamFromDescriptor (1481 of 2150)
UNSUPPORTED: lldb-api :: tools/lldb-server/libraries-svr4/TestGdbRemoteLibrariesSvr4Support.py (1482 of 2150)
PASS: lldb-unit :: Utility/./UtilityTests/PassiveReplayTest.InstrumentedFoo (1483 of 2150)
PASS: lldb-shell :: SymbolFile/NativePDB/ast-methods.cpp (1484 of 2150)
UNSUPPORTED: lldb-api :: functionalities/darwin_log/filter/exact_match/activity-chain/TestDarwinLogFilterMatchActivityChain.py (1485 of 2150)
XFAIL: lldb-shell :: Register/x86-64-write.test (1486 of 2150)
PASS: lldb-api :: lang/c/shared_lib_stripped_symbols/TestSharedLibStrippedSymbols.py (1487 of 2150)
PASS: lldb-shell :: SymbolFile/DWARF/clang-ast-from-dwarf-objc-property.m (1488 of 2150)
PASS: lldb-api :: functionalities/breakpoint/breakpoint_names/TestBreakpointNames.py (1489 of 2150)
PASS: lldb-unit :: Utility/./UtilityTests/StringExtractorTest.GetHexU8_Exact_NoEof (1490 of 2150)
PASS: lldb-unit :: Utility/./UtilityTests/ScalarTest.Scalar_512 (1491 of 2150)
PASS: lldb-unit :: Host/./HostTests/SocketTest.DecodeHostAndPort (1492 of 2150)
PASS: lldb-unit :: Core/./LLDBCoreTests/CommunicationTest.SynchronizeWhileClosing (1493 of 2150)
PASS: lldb-unit :: Utility/./UtilityTests/StreamTest.PutCharNull (1494 of 2150)
PASS: lldb-api :: functionalities/thread/concurrent_events/TestConcurrentSignalDelayBreak.py (1495 of 2150)
PASS: lldb-unit :: Expression/./ExpressionTests/CppModuleConfigurationTest.AmbiguousCLib (1496 of 2150)
PASS: lldb-unit :: Utility/./UtilityTests/FileSpecTest.EqualSeparator (1497 of 2150)
PASS: lldb-unit :: Utility/./UtilityTests/NameMatchesTest.StartsWith (1498 of 2150)
PASS: lldb-api :: macosx/indirect_symbol/TestIndirectSymbols.py (1499 of 2150)
PASS: lldb-unit :: Symbol/./SymbolTests/TestClangASTImporter.DeportDeclTagDecl (1500 of 2150)
PASS: lldb-unit :: Symbol/./SymbolTests/TestTypeSystemClang.TestNotDeletingUserCopyCstrDueToMoveCStr (1501 of 2150)
PASS: lldb-unit :: Utility/./UtilityTests/RangeTest.ContainsRangeStartingFromZero (1502 of 2150)
PASS: lldb-shell :: Breakpoint/implicit_const_form_support.test (1503 of 2150)
PASS: lldb-api :: functionalities/gdb_remote_client/TestGDBRemoteDiskFileCompletion.py (1504 of 2150)
PASS: lldb-api :: lang/cpp/namespace_conflicts/TestNamespaceConflicts.py (1505 of 2150)
PASS: lldb-unit :: Host/./HostTests/FileSystemTest.GetByteSize (1506 of 2150)
PASS: lldb-api :: functionalities/breakpoint/breakpoint_ignore_count/TestBreakpointIgnoreCount.py (1507 of 2150)
PASS: lldb-shell :: SymbolFile/DWARF/find-basic-type.cpp (1508 of 2150)
PASS: lldb-unit :: Utility/./UtilityTests/OptionsWithRawTest.WhitespaceSuffix (1509 of 2150)
PASS: lldb-unit :: Utility/./UtilityTests/StreamTeeTest.CopyConstructor (1510 of 2150)
PASS: lldb-api :: commands/watchpoints/watchpoint_commands/command/TestWatchpointCommandLLDB.py (1511 of 2150)
PASS: lldb-unit :: ScriptInterpreter/Python/./ScriptInterpreterPythonTests/PythonDataObjectsTest.TestInstanceNameResolutionNoDot (1512 of 2150)
PASS: lldb-api :: python_api/class_members/TestSBTypeClassMembers.py (1513 of 2150)
PASS: lldb-unit :: ScriptInterpreter/Python/./ScriptInterpreterPythonTests/PythonDataObjectsTest.TestPythonDictionaryManipulation (1514 of 2150)
PASS: lldb-unit :: Utility/./UtilityTests/StringExtractorTest.GetNameColonValueNoSemicolon (1515 of 2150)
PASS: lldb-api :: lang/objc/objc-new-syntax/TestObjCNewSyntaxDictionary.py (1516 of 2150)
PASS: lldb-api :: lang/cpp/this_class_type_mixing/TestThisClassTypeMixing.py (1517 of 2150)
PASS: lldb-api :: functionalities/data-formatter/data-formatter-globals/TestDataFormatterGlobals.py (1518 of 2150)
PASS: lldb-unit :: Utility/./UtilityTests/ProcessInfoTest.Constructor (1519 of 2150)
UNSUPPORTED: lldb-api :: lang/cpp/function-template-parameter-pack/TestFunctionTemplateParameterPack.py (1520 of 2150)
PASS: lldb-shell :: SymbolFile/Breakpad/unwind-via-stack-win.test (1521 of 2150)
PASS: lldb-shell :: ObjectFile/ELF/PT_LOAD-overlap.yaml (1522 of 2150)
PASS: lldb-api :: lang/cpp/alignas_base_class/TestAlignAsBaseClass.py (1523 of 2150)
PASS: lldb-shell :: Reproducer/TestDSYM.test (1524 of 2150)
PASS: lldb-unit :: Interpreter/./InterpreterTests/CompletionTest.DirCompletionUsername (1525 of 2150)
PASS: lldb-api :: lang/objc/rdar-11355592/TestRdar11355592.py (1526 of 2150)
PASS: lldb-unit :: ScriptInterpreter/Python/./ScriptInterpreterPythonTests/PythonDataObjectsTest.TestPythonIntegerToStructuredInteger (1527 of 2150)
PASS: lldb-unit :: Language/CPlusPlus/./LanguageCPlusPlusTests/CPlusPlusLanguage.MethodNameParsing (1528 of 2150)
PASS: lldb-shell :: Breakpoint/jitbp_elf.test (1529 of 2150)
PASS: lldb-unit :: UnwindAssembly/x86/./UnwindAssemblyx86Tests/Testx86AssemblyInspectionEngine.TestPushEDI (1530 of 2150)
UNSUPPORTED: lldb-api :: functionalities/darwin_log/filter/regex/category/TestDarwinLogFilterRegexCategory.py (1531 of 2150)
PASS: lldb-unit :: Utility/./UtilityTests/StringExtractorTest.GetHexU8_Underflow (1532 of 2150)
PASS: lldb-unit :: Utility/./UtilityTests/ReproducerTest.SetCapture (1533 of 2150)
PASS: lldb-unit :: Host/./HostTests/NativeProcessProtocolTest.SetBreakpointFailWrite (1534 of 2150)
PASS: lldb-api :: lang/cpp/static_methods/TestCPPStaticMethods.py (1535 of 2150)
PASS: lldb-api :: lang/cpp/operator-overload/TestOperatorOverload.py (1536 of 2150)
PASS: lldb-unit :: ScriptInterpreter/Python/./ScriptInterpreterPythonTests/PythonDataObjectsTest.TestPythonCallableCheck (1537 of 2150)
PASS: lldb-unit :: Host/./HostTests/NativeProcessProtocolTest.ReadMemoryWithoutTrap (1538 of 2150)
PASS: lldb-unit :: debugserver/./debugserverTests/RNBSocket.LoopBackConnectIPv4 (1539 of 2150)
PASS: lldb-api :: lang/cpp/offsetof/TestOffsetofCpp.py (1540 of 2150)
PASS: lldb-api :: commands/expression/function_template_specialization_temp_args/TestFunctionTemplateSpecializationTempArgs.py (1541 of 2150)
PASS: lldb-unit :: Expression/./ExpressionTests/CppModuleConfigurationTest.IgnoreLibStdCpp (1542 of 2150)
PASS: lldb-unit :: Utility/./UtilityTests/SerializationRountripTest.SerializeDeserializeObjectReference (1543 of 2150)
PASS: lldb-api :: functionalities/target_var/TestTargetVar.py (1544 of 2150)
PASS: lldb-unit :: Process/minidump/./LLDBMinidumpTests/MinidumpParserTest.GetThreadsAndGetThreadContext (1545 of 2150)
PASS: lldb-api :: functionalities/data-formatter/data-formatter-objc/nsstring/TestDataFormatterNSString.py (1546 of 2150)
PASS: lldb-api :: functionalities/thread/concurrent_events/TestConcurrentManyWatchpoints.py (1547 of 2150)
PASS: lldb-unit :: Process/minidump/./LLDBMinidumpTests/MinidumpParserTest.GetMiscInfoWindows (1548 of 2150)
PASS: lldb-api :: functionalities/tail_call_frames/disambiguate_tail_call_seq/TestDisambiguateTailCallSeq.py (1549 of 2150)
PASS: lldb-api :: lang/cpp/llvm-style/TestLLVMStyle.py (1550 of 2150)
PASS: lldb-unit :: ScriptInterpreter/Python/./ScriptInterpreterPythonTests/PythonDataObjectsTest.TestExceptions (1551 of 2150)
PASS: lldb-unit :: Utility/./UtilityTests/XcodeSDKTest.MergeTest (1552 of 2150)
PASS: lldb-shell :: SymbolFile/DWARF/static_scope.s (1553 of 2150)
PASS: lldb-shell :: ObjectFile/ELF/PT_LOAD-overlap-section.yaml (1554 of 2150)
PASS: lldb-unit :: Utility/./UtilityTests/StringLexerTest.AdvanceIf (1555 of 2150)
UNSUPPORTED: lldb-api :: functionalities/thread/break_after_join/TestBreakAfterJoin.py (1556 of 2150)
PASS: lldb-unit :: Expression/./ExpressionTests/DiagnosticManagerTest.PutStringMultiple (1557 of 2150)
PASS: lldb-unit :: Expression/./ExpressionTests/CppModuleConfigurationTest.AmbiguousLibCpp (1558 of 2150)
PASS: lldb-unit :: Utility/./UtilityTests/StringExtractorTest.GetU32LittleEndian (1559 of 2150)
PASS: lldb-shell :: ObjectFile/MachO/lc_build_version.yaml (1560 of 2150)
PASS: lldb-unit :: Utility/./UtilityTests/StringListTest.SetSize (1561 of 2150)
PASS: lldb-unit :: Process/minidump/./LLDBMinidumpTests/MinidumpParserTest.GetMemoryRegionInfoLinuxMaps (1562 of 2150)
UNSUPPORTED: lldb-api :: functionalities/darwin_log/filter/exact_match/activity/TestDarwinLogFilterMatchActivity.py (1563 of 2150)
UNSUPPORTED: lldb-api :: commands/expression/macros/TestMacros.py (1564 of 2150)
PASS: lldb-api :: commands/expression/import-std-module/vector-of-vectors/TestVectorOfVectorsFromStdModule.py (1565 of 2150)
PASS: lldb-api :: types/TestDoubleTypes.py (1566 of 2150)
PASS: lldb-api :: functionalities/data-formatter/data-formatter-named-summaries/TestDataFormatterNamedSummaries.py (1567 of 2150)
PASS: lldb-shell :: SymbolFile/dissassemble-entry-point.s (1568 of 2150)
PASS: lldb-api :: functionalities/signal/handle-abrt/TestHandleAbort.py (1569 of 2150)
PASS: lldb-api :: commands/expression/diagnostics/TestExprDiagnostics.py (1570 of 2150)
PASS: lldb-unit :: Utility/./UtilityTests/BinaryStreamTest.PutSLEB128Zero (1571 of 2150)
PASS: lldb-unit :: Utility/./UtilityTests/ScalarTest.APIntConstructor (1572 of 2150)
PASS: lldb-api :: functionalities/data-formatter/data-formatter-cpp/TestDataFormatterCpp.py (1573 of 2150)
PASS: lldb-api :: lang/cpp/constructors/TestCppConstructors.py (1574 of 2150)
PASS: lldb-unit :: Utility/./UtilityTests/DataExtractorTest.GetCStr (1575 of 2150)
PASS: lldb-unit :: Utility/./UtilityTests/UriParserTest.BracketedHostnameWithPortIPv6 (1576 of 2150)
PASS: lldb-api :: commands/expression/top-level/TestTopLevelExprs.py (1577 of 2150)
PASS: lldb-unit :: Utility/./UtilityTests/UriParserTest.BadPort (1578 of 2150)
PASS: lldb-api :: functionalities/thread/thread_exit/TestThreadExit.py (1579 of 2150)
PASS: lldb-unit :: Utility/./UtilityTests/RecordReplayTest.InstrumentedBar (1580 of 2150)
PASS: lldb-api :: commands/watchpoints/watchpoint_size/TestWatchpointSizes.py (1581 of 2150)
PASS: lldb-shell :: Reproducer/TestHomeDir.test (1582 of 2150)
PASS: lldb-api :: lang/cpp/template-specialization-type/TestTemplateSpecializationType.py (1583 of 2150)
PASS: lldb-api :: commands/watchpoints/watchpoint_events/TestWatchpointEvents.py (1584 of 2150)
PASS: lldb-shell :: SymbolFile/DWARF/dwarf5-atomic.s (1585 of 2150)
PASS: lldb-api :: functionalities/data-formatter/data-formatter-disabling/TestDataFormatterDisabling.py (1586 of 2150)
PASS: lldb-unit :: Utility/./UtilityTests/ProcessInstanceInfo.DumpTable (1587 of 2150)
PASS: lldb-unit :: Utility/./UtilityTests/AnsiTerminal.Basic (1588 of 2150)
UNSUPPORTED: lldb-shell :: Register/x86-zmm-write.test (1589 of 2150)
PASS: lldb-unit :: UnwindAssembly/x86/./UnwindAssemblyx86Tests/Testx86AssemblyInspectionEngine.TestPushEDX (1590 of 2150)
PASS: lldb-unit :: Utility/./UtilityTests/SerializationRountripTest.SerializeDeserializePodPointers (1591 of 2150)
PASS: lldb-shell :: BuildScript/script-args.test (1592 of 2150)
PASS: lldb-shell :: SymbolFile/NativePDB/nested-types.cpp (1593 of 2150)
PASS: lldb-unit :: UnwindAssembly/ARM64/./Arm64InstEmulationTests/TestArm64InstEmulation.TestFramelessThreeEpilogueFunction (1594 of 2150)
PASS: lldb-api :: functionalities/postmortem/minidump-new/TestMiniDumpNew.py (1595 of 2150)
PASS: lldb-unit :: Utility/./UtilityTests/StreamTest.AddressRangeEmptyRange (1596 of 2150)
PASS: lldb-unit :: Language/Highlighting/./HighlighterTests/HighlighterTest.ClangCommas (1597 of 2150)
PASS: lldb-unit :: Utility/./UtilityTests/OptionsWithRawTest.EmptyArgsOnlySuffix (1598 of 2150)
PASS: lldb-unit :: Expression/./ExpressionTests/DiagnosticManagerTest.HasFixits (1599 of 2150)
PASS: lldb-api :: functionalities/postmortem/mach-core/TestMachCore.py (1600 of 2150)
PASS: lldb-api :: lang/c/local_variables/TestLocalVariables.py (1601 of 2150)
PASS: lldb-unit :: Process/./ProcessEventDataTests/ProcessEventDataTest.DoOnRemoval (1602 of 2150)
PASS: lldb-unit :: Utility/./UtilityTests/SerializationRountripTest.SerializeDeserializeCStringArray (1603 of 2150)
PASS: lldb-unit :: Utility/./UtilityTests/ScalarTest.GetBytes (1604 of 2150)
PASS: lldb-api :: iohandler/resize/TestIOHandlerResize.py (1605 of 2150)
PASS: lldb-unit :: Utility/./UtilityTests/ProcessInstanceInfo.Dump (1606 of 2150)
PASS: lldb-unit :: Utility/./UtilityTests/StreamTest.PutPtr (1607 of 2150)
PASS: lldb-api :: commands/expression/context-object-objc/TestContextObjectObjc.py (1608 of 2150)
PASS: lldb-api :: functionalities/data-formatter/parray/TestPrintArray.py (1609 of 2150)
PASS: lldb-unit :: Utility/./UtilityTests/OptionsWithRawTest.EmptySuffixSingleWhitespace (1610 of 2150)
PASS: lldb-unit :: Utility/./UtilityTests/ConstStringTest.NullAndEmptyStates (1611 of 2150)
PASS: lldb-unit :: Utility/./UtilityTests/StringListTest.ShiftCString (1612 of 2150)
PASS: lldb-unit :: Utility/./UtilityTests/StringListTest.SplitIntoLines (1613 of 2150)
PASS: lldb-unit :: ScriptInterpreter/Python/./ScriptInterpreterPythonTests/PythonDataObjectsTest.TestPythonByteArray (1614 of 2150)
PASS: lldb-api :: functionalities/breakpoint/consecutive_breakpoints/TestConsecutiveBreakpoints.py (1615 of 2150)
PASS: lldb-api :: lang/c/find_struct_type/TestFindStructTypes.py (1616 of 2150)
PASS: lldb-unit :: ObjectFile/ELF/./ObjectFileELFTests/ObjectFileELFTest.SectionsResolveConsistently (1617 of 2150)
PASS: lldb-api :: lang/c/inlines/TestRedefinitionsInInlines.py (1618 of 2150)
PASS: lldb-api :: functionalities/data-formatter/data-formatter-objc/TestDataFormatterObjCNSContainer.py (1619 of 2150)
PASS: lldb-unit :: Process/minidump/./LLDBMinidumpTests/MinidumpParserTest.GetExceptionStream (1620 of 2150)
PASS: lldb-shell :: ObjectFile/wasm/basic.yaml (1621 of 2150)
PASS: lldb-api :: functionalities/data-formatter/dump_dynamic/TestDumpDynamic.py (1622 of 2150)
UNSUPPORTED: lldb-api :: linux/mix-dwo-and-regular-objects/TestMixedDwarfBinary.py (1623 of 2150)
PASS: lldb-api :: python_api/default-constructor/TestDefaultConstructorForAPIObjects.py (1624 of 2150)
PASS: lldb-api :: functionalities/inferior-crashing/recursive-inferior/TestRecursiveInferior.py (1625 of 2150)
PASS: lldb-unit :: Symbol/./SymbolTests/TestTypeSystemClang.TestFunctionTemplateConstruction (1626 of 2150)
PASS: lldb-unit :: UnwindAssembly/PPC64/./PPC64InstEmulationTests/TestPPC64InstEmulation.TestMediumFunction (1627 of 2150)
PASS: lldb-api :: python_api/type/TestTypeList.py (1628 of 2150)
PASS: lldb-unit :: Utility/./UtilityTests/TimerTest.CategoryTimesNested (1629 of 2150)
PASS: lldb-shell :: ObjectFile/PECOFF/section-types.yaml (1630 of 2150)
PASS: lldb-unit :: API/./APITests/SBCommandInterpreterTest.MultiWordCommand (1631 of 2150)
PASS: lldb-api :: python_api/thread/TestThreadAPI.py (1632 of 2150)
PASS: lldb-api :: functionalities/thread/step_until/TestStepUntil.py (1633 of 2150)
UNSUPPORTED: lldb-shell :: SymbolFile/PDB/ast-restore.test (1634 of 2150)
PASS: lldb-unit :: Utility/./UtilityTests/DataExtractorTest.PeekData (1635 of 2150)
PASS: lldb-unit :: Utility/./UtilityTests/StringExtractorTest.GetHexBytes_OddPair (1636 of 2150)
PASS: lldb-shell :: SymbolFile/DWARF/debug-types-address-ranges.s (1637 of 2150)
PASS: lldb-unit :: UnwindAssembly/x86/./UnwindAssemblyx86Tests/Testx86AssemblyInspectionEngine.TestPushRBPWithREX (1638 of 2150)
UNSUPPORTED: lldb-api :: benchmarks/expression/TestExpressionCmd.py (1639 of 2150)
PASS: lldb-api :: lang/cpp/gmodules/TestWithModuleDebugging.py (1640 of 2150)
PASS: lldb-unit :: UnwindAssembly/x86/./UnwindAssemblyx86Tests/Testx86AssemblyInspectionEngine.TestPushRBX (1641 of 2150)
PASS: lldb-unit :: Utility/./UtilityTests/Flags.AllSet (1642 of 2150)
UNSUPPORTED: lldb-api :: commands/register/register/intel_xtended_registers/mpx_bound_violation/TestBoundViolation.py (1643 of 2150)
PASS: lldb-api :: sanity/TestSettingSkipping.py (1644 of 2150)
PASS: lldb-shell :: ObjectFile/PECOFF/disassemble-thumb.yaml (1645 of 2150)
PASS: lldb-shell :: SymbolFile/DWARF/debug-types-signature-loop.s (1646 of 2150)
PASS: lldb-shell :: Commands/command-source.test (1647 of 2150)
PASS: lldb-unit :: Utility/./UtilityTests/VMRange.CollectionContains (1648 of 2150)
PASS: lldb-unit :: Language/Highlighting/./HighlighterTests/HighlighterTest.ClangSquareBrackets (1649 of 2150)
PASS: lldb-unit :: Utility/./UtilityTests/StatusTest.Formatv (1650 of 2150)
PASS: lldb-shell :: ObjectFile/PECOFF/dep-modules.yaml (1651 of 2150)
PASS: lldb-unit :: Utility/./UtilityTests/DataExtractorTest.GetMaxU64 (1652 of 2150)
PASS: lldb-unit :: Utility/./UtilityTests/RecordReplayTest.InstrumentedFoo (1653 of 2150)
PASS: lldb-api :: functionalities/data-formatter/synthupdate/TestSyntheticFilterRecompute.py (1654 of 2150)
PASS: lldb-api :: commands/target/basic/TestTargetCommand.py (1655 of 2150)
UNSUPPORTED: lldb-shell :: Register/x86-64-ymm16-read.test (1656 of 2150)
PASS: lldb-api :: functionalities/memory/read/TestMemoryRead.py (1657 of 2150)
PASS: lldb-unit :: Utility/./UtilityTests/StringExtractorTest.GetHexBytesAvail_Underflow (1658 of 2150)
PASS: lldb-unit :: Target/./TargetTests/PathMappingListTest.RemapRoot (1659 of 2150)
PASS: lldb-shell :: Settings/TestLineMarkerColor.test (1660 of 2150)
UNSUPPORTED: lldb-shell :: SymbolFile/PDB/expressions.test (1661 of 2150)
PASS: lldb-unit :: SymbolFile/NativePDB/./SymbolFileNativePDBTests/PDBFPOProgramToDWARFExpressionTests.UnresolvedCyclicRegisterAssignmentReference (1662 of 2150)
PASS: lldb-api :: commands/expression/argument_passing_restrictions/TestArgumentPassingRestrictions.py (1663 of 2150)
PASS: lldb-unit :: Language/Highlighting/./HighlighterTests/HighlighterTest.HighlighterSelectionType (1664 of 2150)
PASS: lldb-unit :: Core/./LLDBCoreTests/RichManglingContextTest.SwitchProvider (1665 of 2150)
PASS: lldb-shell :: SymbolFile/DWARF/dwarf5-index-is-used.cpp (1666 of 2150)
PASS: lldb-api :: lang/c/global_variables/TestGlobalVariables.py (1667 of 2150)
PASS: lldb-unit :: Symbol/./SymbolTests/Type.GetTypeScopeAndBasename (1668 of 2150)
PASS: lldb-api :: lang/cpp/function_refs/TestFunctionRefs.py (1669 of 2150)
PASS: lldb-unit :: Expression/./ExpressionTests/DiagnosticManagerTest.GetStringSeverityLabels (1670 of 2150)
PASS: lldb-shell :: SymbolFile/DWARF/DW_TAG_variable-DW_AT_const_value.s (1671 of 2150)
UNSUPPORTED: lldb-api :: android/platform/TestDefaultCacheLineSize.py (1672 of 2150)
PASS: lldb-api :: python_api/watchpoint/TestWatchpointIgnoreCount.py (1673 of 2150)
PASS: lldb-api :: lang/objc/foundation/TestObjCMethodsNSError.py (1674 of 2150)
PASS: lldb-api :: functionalities/data-formatter/data-formatter-stl/libcxx/map/TestDataFormatterLibccMap.py (1675 of 2150)
PASS: lldb-api :: functionalities/rerun/TestRerun.py (1676 of 2150)
PASS: lldb-unit :: Utility/./UtilityTests/SerializationRountripTest.SerializeDeserializeCString (1677 of 2150)
PASS: lldb-unit :: Utility/./UtilityTests/SerializationRountripTest.SerializeDeserializeCStringNull (1678 of 2150)
PASS: lldb-unit :: Utility/./UtilityTests/CompletionRequest.DuplicateFilteringWithComments (1679 of 2150)
PASS: lldb-api :: lang/mixed/TestMixedLanguages.py (1680 of 2150)
PASS: lldb-unit :: Utility/./UtilityTests/ArgsTest.TestMultipleArgs (1681 of 2150)
UNSUPPORTED: lldb-api :: lang/cpp/printf/TestPrintf.py (1682 of 2150)
PASS: lldb-api :: functionalities/thread/concurrent_events/TestConcurrentSignalBreak.py (1683 of 2150)
PASS: lldb-unit :: Utility/./UtilityTests/PassiveReplayTest.InstrumentedFooInvalid (1684 of 2150)
PASS: lldb-api :: lang/cpp/class_types/TestClassTypes.py (1685 of 2150)
PASS: lldb-shell :: SymbolFile/Breakpad/unwind-via-stack-cfi.test (1686 of 2150)
PASS: lldb-unit :: Utility/./UtilityTests/StringLexerTest.PutBack (1687 of 2150)
PASS: lldb-shell :: Driver/TestSingleQuote.test (1688 of 2150)
PASS: lldb-unit :: ObjectFile/Breakpad/./ObjectFileBreakpadTests/FuncRecord.parse (1689 of 2150)
PASS: lldb-api :: functionalities/tail_call_frames/cross_dso/TestCrossDSOTailCalls.py (1690 of 2150)
PASS: lldb-unit :: Expression/./ExpressionTests/DiagnosticManagerTest.GetStringNoDiags (1691 of 2150)
PASS: lldb-shell :: SymbolFile/DWARF/dwo-type-in-main-file.s (1692 of 2150)
PASS: lldb-api :: tools/lldb-server/TestGdbRemoteProcessInfo.py (1693 of 2150)
PASS: lldb-unit :: Target/./TargetTests/PathMappingListTest.AbsoluteTests (1694 of 2150)
PASS: lldb-unit :: Language/Highlighting/./HighlighterTests/HighlighterTest.DefaultHighlighterWithCursor (1695 of 2150)
PASS: lldb-api :: functionalities/data-formatter/data-formatter-ptr-to-array/TestPtrToArrayFormatting.py (1696 of 2150)
PASS: lldb-api :: commands/expression/class_template_specialization_empty_pack/TestClassTemplateSpecializationParametersHandling.py (1697 of 2150)
PASS: lldb-unit :: Utility/./UtilityTests/GeneratorTest.Create (1698 of 2150)
PASS: lldb-api :: commands/apropos/basic/TestApropos.py (1699 of 2150)
PASS: lldb-unit :: Utility/./UtilityTests/ArgsTest.TestQuotedTrailingBackslash (1700 of 2150)
PASS: lldb-api :: python_api/lldbutil/process/TestPrintStackTraces.py (1701 of 2150)
PASS: lldb-unit :: Utility/./UtilityTests/CompletionRequest.TryCompleteCurrentArgBad (1702 of 2150)
UNSUPPORTED: lldb-shell :: SymbolFile/PDB/vbases.test (1703 of 2150)
PASS: lldb-shell :: ObjectFile/PECOFF/invalid-export-table.yaml (1704 of 2150)
PASS: lldb-api :: functionalities/step_scripted/TestStepScripted.py (1705 of 2150)
UNSUPPORTED: lldb-api :: commands/target/auto-install-main-executable/TestAutoInstallMainExecutable.py (1706 of 2150)
PASS: lldb-unit :: Language/CPlusPlus/./LanguageCPlusPlusTests/CPlusPlusLanguage.ExtractContextAndIdentifier (1707 of 2150)
PASS: lldb-api :: functionalities/thread/concurrent_events/TestConcurrentNWatchNBreak.py (1708 of 2150)
PASS: lldb-unit :: Utility/./UtilityTests/RangeTest.ContainsEndInclusiveInvalid (1709 of 2150)
PASS: lldb-unit :: Core/./LLDBCoreTests/MangledTest.ResultForBlockInvocation (1710 of 2150)
PASS: lldb-api :: python_api/watchpoint/TestSetWatchpoint.py (1711 of 2150)
PASS: lldb-unit :: Utility/./UtilityTests/StringListTest.CopyListEmpty (1712 of 2150)
PASS: lldb-unit :: ScriptInterpreter/Python/./ScriptInterpreterPythonTests/PythonDataObjectsTest.TestModuleNameResolutionNoDot (1713 of 2150)
PASS: lldb-shell :: Quit/TestQuitExitCodeTooManyArgs.test (1714 of 2150)
UNSUPPORTED: lldb-api :: benchmarks/libcxxlist/TestBenchmarkLibcxxList.py (1715 of 2150)
PASS: lldb-unit :: Target/./TargetTests/ExecutionContextTest.GetByteOrderTarget (1716 of 2150)
PASS: lldb-api :: functionalities/tail_call_frames/sbapi_support/TestTailCallFrameSBAPI.py (1717 of 2150)
PASS: lldb-unit :: ScriptInterpreter/Python/./ScriptInterpreterPythonTests/PythonDataObjectsTest.TestBorrowedReferences (1718 of 2150)
PASS: lldb-api :: functionalities/data-formatter/data-formatter-objc/nsindexpath/TestDataFormatterNSIndexPath.py (1719 of 2150)
PASS: lldb-api :: lang/objc/global_ptrs/TestGlobalObjects.py (1720 of 2150)
PASS: lldb-unit :: Utility/./UtilityTests/DataExtractorTest.GetCStrAtEnd (1721 of 2150)
PASS: lldb-api :: lang/objc/objc-optimized/TestObjcOptimized.py (1722 of 2150)
PASS: lldb-unit :: Process/gdb-remote/./ProcessGdbRemoteTests/GDBRemoteCommunicationClientTest.GetMemoryRegionInfo (1723 of 2150)
PASS: lldb-api :: lang/objc/ivar-IMP/TestObjCiVarIMP.py (1724 of 2150)
FAIL: lldb-api :: functionalities/gdb_remote_client/TestThreadSelectionBug.py (1725 of 2150)
******************** TEST 'lldb-api :: functionalities/gdb_remote_client/TestThreadSelectionBug.py' FAILED ********************
Script:
--
/usr/local/Frameworks/Python.framework/Versions/3.7/bin/python3.7 /Users/buildslave/jenkins/workspace/lldb-cmake/llvm-project/lldb/test/API/dotest.py -s /Users/buildslave/jenkins/workspace/lldb-cmake/lldb-build/lldb-test-traces -S nm -u CXXFLAGS -u CFLAGS --codesign-identity - --server /Users/buildslave/jenkins/workspace/lldb-cmake/lldb-build/./bin/debugserver --arch x86_64 --build-dir /Users/buildslave/jenkins/workspace/lldb-cmake/lldb-build/lldb-test-build.noindex -s=/Users/buildslave/jenkins/workspace/lldb-cmake/test/logs -t --env TERM=vt100 --env LLVM_LIBS_DIR=/Users/buildslave/jenkins/workspace/lldb-cmake/lldb-build/./lib --arch x86_64 --build-dir /Users/buildslave/jenkins/workspace/lldb-cmake/lldb-build/lldb-test-build.noindex --lldb-module-cache-dir /Users/buildslave/jenkins/workspace/lldb-cmake/lldb-build/lldb-test-build.noindex/module-cache-lldb/lldb-api --clang-module-cache-dir /Users/buildslave/jenkins/workspace/lldb-cmake/lldb-build/lldb-test-build.noindex/module-cache-clang/lldb-api --executable /Users/buildslave/jenkins/workspace/lldb-cmake/lldb-build/./bin/lldb --compiler /Users/buildslave/jenkins/workspace/lldb-cmake/lldb-build/./bin/clang --dsymutil /Users/buildslave/jenkins/workspace/lldb-cmake/lldb-build/./bin/dsymutil --filecheck /Users/buildslave/jenkins/workspace/lldb-cmake/lldb-build/./bin/FileCheck --yaml2obj /Users/buildslave/jenkins/workspace/lldb-cmake/lldb-build/./bin/yaml2obj --lldb-libs-dir /Users/buildslave/jenkins/workspace/lldb-cmake/lldb-build/./lib /Users/buildslave/jenkins/workspace/lldb-cmake/llvm-project/lldb/test/API/functionalities/gdb_remote_client -p TestThreadSelectionBug.py
--
Exit Code: 1

Hide Details

Command Output (stdout): -- lldb version 12.0.99 clang revision bd8b50cd7f5dd5237ec9187ef2fcea3adc15b61a llvm revision bd8b50cd7f5dd5237ec9187ef2fcea3adc15b61a libstdcxx tests will not be run because: Don't know how to build with libstdcxx on macosx Skipping following debug info categories: ['dwo']

Hide Details

-- Command Output (stderr): --

Hide Details

Session logs for test failures/errors/unexpected successes will go into directory '/Users/buildslave/jenkins/workspace/lldb-cmake/test/logs' Change dir to: /Users/buildslave/jenkins/workspace/lldb-cmake/llvm-project/lldb/test/API/functionalities/gdb_remote_client runCmd: settings clear -all output:

Hide Details

runCmd: settings set symbols.enable-external-lookup false output:

Hide Details

runCmd: settings set target.inherit-tcc true output:

Hide Details

runCmd: settings set target.auto-apply-fixits false output:

Hide Details

runCmd: settings set plugin.process.gdb-remote.packet-timeout 60 output:

Hide Details

runCmd: settings set symbols.clang-modules-cache-path "/Users/buildslave/jenkins/workspace/lldb-cmake/lldb-build/lldb-test-build.noindex/module-cache-lldb/lldb-api" output:

Hide Details

runCmd: settings set use-color false output:

Hide Details

runCmd: setting set target.prefer-dynamic-value no-dynamic-values output:

Hide Details

FAIL: LLDB (/Users/buildslave/jenkins/workspace/lldb-cmake/lldb-build/bin/clang-x86_64) :: test (TestThreadSelectionBug.TestThreadSelectionBug) <bound method SBProcess.Kill of <lldb.SBProcess; proxy of <Swig Object of type 'lldb::SBProcess *' at 0x113fdc5a0> >>: success

Hide Details

Restore dir to: /Users/buildslave/jenkins/workspace/lldb-cmake/lldb-build/tools/lldb/test ====================================================================== FAIL: test (TestThreadSelectionBug.TestThreadSelectionBug) ---------------------------------------------------------------------- Traceback (most recent call last): File "/Users/buildslave/jenkins/workspace/lldb-cmake/llvm-project/lldb/test/API/functionalities/gdb_remote_client/TestThreadSelectionBug.py", line 16, in test process = self.connect(target) File "/Users/buildslave/jenkins/workspace/lldb-cmake/llvm-project/lldb/test/API/functionalities/gdb_remote_client/gdbclientutils.py", line 524, in connect self.assertTrue(error.Success(), error.description) AssertionError: False is not True : failed to get reply to handshake packet Config=x86_64-/Users/buildslave/jenkins/workspace/lldb-cmake/lldb-build/bin/clang ---------------------------------------------------------------------- Ran 1 test in 98.184s

Hide Details

RESULT: FAILED (0 passes, 1 failures, 0 errors, 0 skipped, 0 expected failures, 0 unexpected successes)

Hide Details

--

Hide Details

******************** PASS: lldb-api :: commands/expression/completion/TestExprCompletion.py (1726 of 2150) PASS: lldb-unit :: Expression/./ExpressionTests/DiagnosticManagerTest.PutStringSeverities (1727 of 2150) PASS: lldb-api :: functionalities/data-formatter/data-formatter-stl/libcxx/tuple/TestDataFormatterLibcxxTuple.py (1728 of 2150) PASS: lldb-unit :: ScriptInterpreter/Python/./ScriptInterpreterPythonTests/PythonDataObjectsTest.TestPythonStringToStructuredString (1729 of 2150) PASS: lldb-api :: types/TestLongTypesExpr.py (1730 of 2150) PASS: lldb-unit :: UnwindAssembly/x86/./UnwindAssemblyx86Tests/Testx86AssemblyInspectionEngine.Test32bitFramelessSmallStackFrame (1731 of 2150) PASS: lldb-api :: functionalities/dlopen_other_executable/TestDlopenOtherExecutable.py (1732 of 2150) PASS: lldb-unit :: UnwindAssembly/x86/./UnwindAssemblyx86Tests/Testx86AssemblyInspectionEngine.TestPushR15 (1733 of 2150) PASS: lldb-unit :: Expression/./ExpressionTests/CppModuleConfigurationTest.LibCppV2 (1734 of 2150) PASS: lldb-api :: lang/cpp/nsimport/TestCppNsImport.py (1735 of 2150) PASS: lldb-api :: api/command-return-object/TestSBCommandReturnObject.py (1736 of 2150) PASS: lldb-shell :: Commands/command-script-import.test (1737 of 2150) PASS: lldb-unit :: UnwindAssembly/x86/./UnwindAssemblyx86Tests/Testx86AssemblyInspectionEngine.TestSubRSP (1738 of 2150) PASS: lldb-api :: api/multithreaded/TestMultithreaded.py (1739 of 2150) PASS: lldb-api :: sample_test/TestSampleTest.py (1740 of 2150) PASS: lldb-api :: functionalities/gdb_remote_client/TestWriteMemory.py (1741 of 2150) PASS: lldb-api :: functionalities/data-formatter/hexcaps/TestDataFormatterHexCaps.py (1742 of 2150) PASS: lldb-api :: arm/emulation/TestEmulations.py (1743 of 2150) PASS: lldb-api :: functionalities/plugins/command_plugin/TestPluginCommands.py (1744 of 2150) PASS: lldb-api :: lang/cpp/exceptions/TestCPPExceptionBreakpoints.py (1745 of 2150) PASS: lldb-unit :: Host/./HostTests/NativeProcessProtocolTest.SetBreakpoint (1746 of 2150) PASS: lldb-shell :: ScriptInterpreter/Python/sb_address_exception.test (1747 of 2150) PASS: lldb-unit :: UnwindAssembly/x86/./UnwindAssemblyx86Tests/Testx86AssemblyInspectionEngine.TestPopRBPWithREX (1748 of 2150) PASS: lldb-unit :: Language/Highlighting/./HighlighterTests/HighlighterTest.ClangEmptyInput (1749 of 2150) PASS: lldb-shell :: Reproducer/TestDriverOptions.test (1750 of 2150) PASS: lldb-api :: functionalities/thread/create_after_attach/TestCreateAfterAttach.py (1751 of 2150) PASS: lldb-api :: functionalities/thread/concurrent_events/TestConcurrentWatchBreak.py (1752 of 2150) UNSUPPORTED: lldb-shell :: ScriptInterpreter/Lua/breakpoint_callback.test (1753 of 2150) PASS: lldb-unit :: Utility/./UtilityTests/StreamTest.ChangingByteOrder (1754 of 2150) PASS: lldb-api :: commands/target/dump-symtab-demangle/TestDumpSymtabDemangle.py (1755 of 2150) PASS: lldb-api :: functionalities/thread/concurrent_events/TestConcurrentTwoBreakpointsOneDelaySignal.py (1756 of 2150) UNSUPPORTED: lldb-shell :: ObjectFile/ELF/minidebuginfo-set-and-hit-breakpoint.test (1757 of 2150) PASS: lldb-api :: commands/expression/import_builtin_fileid/TestImportBuiltinFileID.py (1758 of 2150) PASS: lldb-unit :: Utility/./UtilityTests/GeneratorTest.GetOrCreate (1759 of 2150) PASS: lldb-api :: functionalities/gdb_remote_client/TestArmRegisterDefinition.py (1760 of 2150) PASS: lldb-api :: lang/objc/foundation/TestConstStrings.py (1761 of 2150) PASS: lldb-api :: functionalities/data-formatter/typedef_array/TestTypedefArray.py (1762 of 2150) PASS: lldb-unit :: Utility/./UtilityTests/StreamTest.PutHex8 (1763 of 2150) PASS: lldb-api :: lang/cpp/dynamic-value/TestCppValueCast.py (1764 of 2150) PASS: lldb-unit :: ObjectFile/Breakpad/./ObjectFileBreakpadTests/InfoRecord.parse (1765 of 2150) PASS: lldb-api :: functionalities/tail_call_frames/thread_step_out_message/TestArtificialFrameStepOutMessage.py (1766 of 2150) UNSUPPORTED: lldb-shell :: Register/x86-64-ymm16-write.test (1767 of 2150) PASS: lldb-unit :: SymbolFile/NativePDB/./SymbolFileNativePDBTests/PDBFPOProgramToDWARFExpressionTests.DependencyChain (1768 of 2150) PASS: lldb-shell :: Settings/TestSettingsWrite.test (1769 of 2150) PASS: lldb-unit :: debugserver/./debugserverTests/RNBSocket.LoopBackListenIPv4 (1770 of 2150) PASS: lldb-unit :: Utility/./UtilityTests/Flags.GetBitSize (1771 of 2150) PASS: lldb-unit :: ObjectFile/Breakpad/./ObjectFileBreakpadTests/PublicRecord.parse (1772 of 2150) PASS: lldb-api :: commands/expression/import-std-module/shared_ptr-dbg-info-content/TestSharedPtrDbgInfoContentFromStdModule.py (1773 of 2150) PASS: lldb-api :: functionalities/mtc/simple/TestMTCSimple.py (1774 of 2150) PASS: lldb-api :: lang/cpp/unique-types/TestUniqueTypes.py (1775 of 2150) PASS: lldb-unit :: Utility/./UtilityTests/BinaryStreamTest.PutSLEB128ThreeBytes (1776 of 2150) PASS: lldb-unit :: Utility/./UtilityTests/Flags.Test (1777 of 2150) PASS: lldb-unit :: Utility/./UtilityTests/BroadcasterTest.BroadcastEvent (1778 of 2150) PASS: lldb-unit :: Utility/./UtilityTests/StructuredDataTest.StringDump (1779 of 2150) PASS: lldb-unit :: Utility/./UtilityTests/StreamTeeTest.Constructor2Streams (1780 of 2150) PASS: lldb-unit :: SymbolFile/NativePDB/./SymbolFileNativePDBTests/PDBFPOProgramToDWARFExpressionTests.MultipleDependentAssignments (1781 of 2150) PASS: lldb-api :: functionalities/multiword-commands/TestMultiWordCommands.py (1782 of 2150) PASS: lldb-api :: functionalities/data-formatter/refpointer-recursion/TestDataFormatterRefPtrRecursion.py (1783 of 2150) PASS: lldb-api :: lang/cpp/stl/TestSTL.py (1784 of 2150) PASS: lldb-api :: commands/gui/basic/TestGuiBasic.py (1785 of 2150) UNSUPPORTED: lldb-api :: tools/lldb-server/TestGdbRemoteAuxvSupport.py (1786 of 2150) PASS: lldb-unit :: Utility/./UtilityTests/StringListTest.ShiftStdString (1787 of 2150) PASS: lldb-api :: lang/objc/modules-auto-import/TestModulesAutoImport.py (1788 of 2150) PASS: lldb-api :: commands/command/script/import/rdar-12586188/TestRdar12586188.py (1789 of 2150) PASS: lldb-unit :: Utility/./UtilityTests/ConstStringTest.format_provider (1790 of 2150) PASS: lldb-shell :: SymbolFile/DWARF/find-function-regex.cpp (1791 of 2150) PASS: lldb-unit :: Symbol/./SymbolTests/SymbolsTest.TerminateLocateExecutableSymbolFileForUnknownExecutableAndUnknownSymbolFile (1792 of 2150) PASS: lldb-unit :: Utility/./UtilityTests/UriParserTest.Empty (1793 of 2150) PASS: lldb-api :: functionalities/gdb_remote_client/TestqOffsets.py (1794 of 2150) PASS: lldb-api :: functionalities/data-formatter/boolreference/TestFormattersBoolRefPtr.py (1795 of 2150) PASS: lldb-api :: functionalities/gdb_remote_client/TestNoGPacketSupported.py (1796 of 2150) PASS: lldb-api :: commands/command/invalid-args/TestInvalidArgsCommand.py (1797 of 2150) PASS: lldb-api :: tools/lldb-server/TestGdbRemoteThreadsInStopReply.py (1798 of 2150) UNSUPPORTED: lldb-shell :: ScriptInterpreter/Lua/io.test (1799 of 2150) PASS: lldb-unit :: Symbol/./SymbolTests/TestTypeSystemClang.TemplateArguments (1800 of 2150) PASS: lldb-unit :: ScriptInterpreter/Python/./ScriptInterpreterPythonTests/PythonDataObjectsTest.TestRun (1801 of 2150) PASS: lldb-shell :: SymbolFile/symbol-binding.test (1802 of 2150) PASS: lldb-shell :: ObjectFile/MachO/lc_build_version_notools.yaml (1803 of 2150) PASS: lldb-unit :: DataFormatter/./LLDBFormatterTests/TypeMatcherTests.CreatedBySameMatchString (1804 of 2150) PASS: lldb-unit :: Process/minidump/./LLDBMinidumpTests/MinidumpParserTest.GetThreadContext_x86_32 (1805 of 2150) PASS: lldb-unit :: Utility/./UtilityTests/AnsiTerminal.Incomplete (1806 of 2150) PASS: lldb-api :: commands/expression/radar_9673664/TestExprHelpExamples.py (1807 of 2150) PASS: lldb-shell :: Commands/command-thread-select.test (1808 of 2150) PASS: lldb-unit :: Utility/./UtilityTests/StringExtractorTest.GetHexU8_Underflow_NoEof (1809 of 2150) PASS: lldb-unit :: Utility/./UtilityTests/StreamTeeTest.Flush (1810 of 2150) PASS: lldb-api :: python_api/interpreter/TestCommandInterpreterAPI.py (1811 of 2150) PASS: lldb-api :: commands/target/create-no-such-arch/TestNoSuchArch.py (1812 of 2150) PASS: lldb-api :: functionalities/breakpoint/comp_dir_symlink/TestCompDirSymLink.py (1813 of 2150) PASS: lldb-api :: lang/objc/objc-builtin-types/TestObjCBuiltinTypes.py (1814 of 2150) PASS: lldb-shell :: Minidump/Windows/broken-unwind.test (1815 of 2150) PASS: lldb-api :: types/TestFloatTypesExpr.py (1816 of 2150) PASS: lldb-api :: macosx/dyld-trie-symbols/TestDyldTrieSymbols.py (1817 of 2150) PASS: lldb-unit :: Utility/./UtilityTests/StreamTest.ShiftOperatorChars (1818 of 2150) PASS: lldb-api :: functionalities/paths/TestPaths.py (1819 of 2150) PASS: lldb-unit :: Language/Highlighting/./HighlighterTests/HighlighterTest.ClangOperators (1820 of 2150) PASS: lldb-unit :: Symbol/./SymbolTests/TestTypeSystemClang.TestGetTypeClassDeclType (1821 of 2150) PASS: lldb-api :: functionalities/thread/exit_during_expression/TestExitDuringExpression.py (1822 of 2150) PASS: lldb-api :: python_api/lldbutil/iter/TestLLDBIterator.py (1823 of 2150) PASS: lldb-shell :: SymbolFile/DWARF/debug-types-dwarf5.s (1824 of 2150) UNSUPPORTED: lldb-api :: benchmarks/turnaround/TestCompileRunToBreakpointTurnaround.py (1825 of 2150) UNSUPPORTED: lldb-shell :: Register/x86-64-xmm16-read.test (1826 of 2150) PASS: lldb-shell :: Process/TestAbortExitCode.test (1827 of 2150) PASS: lldb-shell :: ObjectFile/ELF/minidebuginfo-corrupt-xz.yaml (1828 of 2150) PASS: lldb-unit :: ScriptInterpreter/Python/./ScriptInterpreterPythonTests/PythonDataObjectsTest.TestPythonBytes (1829 of 2150) PASS: lldb-api :: functionalities/data-formatter/data-formatter-stl/libcxx/forward_list/TestDataFormatterLibcxxForwardList.py (1830 of 2150) PASS: lldb-unit :: Process/gdb-remote/./ProcessGdbRemoteTests/GDBRemoteCommunicationClientTest.WriteRegisterNoSuffix (1831 of 2150) PASS: lldb-api :: commands/expression/import-std-module/vector-dbg-info-content/TestDbgInfoContentVectorFromStdModule.py (1832 of 2150) PASS: lldb-unit :: Thread/./ThreadTests/ThreadTest.SetStopInfo (1833 of 2150) PASS: lldb-api :: macosx/nslog/TestDarwinNSLogOutput.py (1834 of 2150) PASS: lldb-api :: lang/objcxx/hide-runtime-values/TestObjCXXHideRuntimeValues.py (1835 of 2150) PASS: lldb-unit :: UnwindAssembly/x86/./UnwindAssemblyx86Tests/Testx86AssemblyInspectionEngine.Test32BitOnlyInstruction (1836 of 2150) PASS: lldb-unit :: UnwindAssembly/ARM64/./Arm64InstEmulationTests/TestArm64InstEmulation.TestRegisterSavedTwice (1837 of 2150) PASS: lldb-api :: api/log/TestAPILog.py (1838 of 2150) PASS: lldb-shell :: SymbolFile/DWARF/limit-debug-info.s (1839 of 2150) PASS: lldb-api :: commands/expression/import-std-module/forward_decl_from_module/TestForwardDeclFromStdModule.py (1840 of 2150) PASS: lldb-shell :: SymbolFile/DWARF/find-inline-method.s (1841 of 2150) PASS: lldb-api :: tools/lldb-server/register-reading/TestGdbRemoteGPacket.py (1842 of 2150) PASS: lldb-unit :: Platform/Android/./AdbClientTests/AdbClientTest.CreateByDeviceId (1843 of 2150) PASS: lldb-shell :: Minidump/fb-dump.test (1844 of 2150) PASS: lldb-unit :: Host/./HostTests/Host.WaitStatusFormat (1845 of 2150) UNSUPPORTED: lldb-api :: linux/sepdebugsymlink/TestTargetSymbolsSepDebugSymlink.py (1846 of 2150) PASS: lldb-api :: commands/target/select/TestTargetSelect.py (1847 of 2150) PASS: lldb-unit :: UnwindAssembly/x86/./UnwindAssemblyx86Tests/Testx86AssemblyInspectionEngine.TestPushECX (1848 of 2150) PASS: lldb-unit :: Symbol/./SymbolTests/TestClangASTImporter.CopyDeclTagDecl (1849 of 2150) PASS: lldb-unit :: Utility/./UtilityTests/StreamTest.PutChar (1850 of 2150) PASS: lldb-api :: commands/expression/completion-crash-incomplete-record/TestCompletionCrashIncompleteRecord.py (1851 of 2150) PASS: lldb-api :: commands/expression/namespace_local_var_same_name_cpp_and_c/TestNamespaceLocalVarSameNameCppAndC.py (1852 of 2150) PASS: lldb-api :: macosx/lc-note/kern-ver-str/TestKernVerStrLCNOTE.py (1853 of 2150) PASS: lldb-unit :: Utility/./UtilityTests/RegularExpression.Invalid (1854 of 2150) PASS: lldb-api :: functionalities/data-formatter/data-formatter-proper-plurals/TestFormattersOneIsSingular.py (1855 of 2150) PASS: lldb-api :: commands/expression/radar_9531204/TestPrintfAfterUp.py (1856 of 2150) PASS: lldb-api :: api/check_public_api_headers/TestPublicAPIHeaders.py (1857 of 2150) PASS: lldb-api :: python_api/sbenvironment/TestSBEnvironment.py (1858 of 2150) PASS: lldb-unit :: Utility/./UtilityTests/VMRange.ContainsRange (1859 of 2150) PASS: lldb-unit :: Core/./LLDBCoreTests/ModuleSpecTest.TestMachOFile (1860 of 2150) PASS: lldb-unit :: Utility/./UtilityTests/Flags.AllClear (1861 of 2150) PASS: lldb-api :: commands/expression/call-function/TestCallBuiltinFunction.py (1862 of 2150) PASS: lldb-unit :: Utility/./UtilityTests/ScalarTest.Promotion (1863 of 2150) PASS: lldb-unit :: Process/gdb-remote/./ProcessGdbRemoteTests/GDBRemoteClientBaseTest.SendContinueAndLateInterrupt (1864 of 2150) PASS: lldb-api :: python_api/value/empty_class/TestValueAPIEmptyClass.py (1865 of 2150) PASS: lldb-api :: functionalities/inferior-crashing/TestInferiorCrashingStep.py (1866 of 2150) PASS: lldb-api :: lang/objc/objc-struct-argument/TestObjCStructArgument.py (1867 of 2150) PASS: lldb-unit :: Utility/./UtilityTests/AnsiTerminal.AtEnd (1868 of 2150) PASS: lldb-api :: lang/cpp/class_types/TestClassTypesDisassembly.py (1869 of 2150) PASS: lldb-unit :: Host/./HostTests/SocketTest.DomainGetConnectURI (1870 of 2150) PASS: lldb-api :: commands/frame/diagnose/dereference-argument/TestDiagnoseDereferenceArgument.py (1871 of 2150) PASS: lldb-unit :: Language/Highlighting/./HighlighterTests/HighlighterTest.ClangIdentifiers (1872 of 2150) PASS: lldb-unit :: Utility/./UtilityTests/RangeTest.SetRangeBase (1873 of 2150) PASS: lldb-unit :: Utility/./UtilityTests/StreamTest.AddressSuffix (1874 of 2150) PASS: lldb-api :: lang/objc/objc_direct-methods/TestObjCDirectMethods.py (1875 of 2150) PASS: lldb-unit :: Interpreter/./InterpreterTests/OptionArgParserTest.toBoolean (1876 of 2150) PASS: lldb-unit :: Utility/./UtilityTests/RangeTest.LessThan (1877 of 2150) UNSUPPORTED: lldb-shell :: SymbolFile/PDB/calling-conventions.test (1878 of 2150) PASS: lldb-api :: macosx/queues/TestQueues.py (1879 of 2150) PASS: lldb-api :: commands/expression/ignore-artificial-constructors/TestIgnoreArtificialConstructors.py (1880 of 2150) PASS: lldb-api :: tools/lldb-server/inferior-crash/TestGdbRemoteSegFault.py (1881 of 2150) PASS: lldb-shell :: Commands/command-breakpoint-col.test (1882 of 2150) PASS: lldb-shell :: ObjectFile/PECOFF/uuid.yaml (1883 of 2150) PASS: lldb-shell :: SymbolFile/DWARF/DW_AT_const_value.s (1884 of 2150) PASS: lldb-unit :: Language/Highlighting/./HighlighterTests/HighlighterTest.Colons (1885 of 2150) PASS: lldb-unit :: Utility/./UtilityTests/CompletionRequest.ShiftArguments (1886 of 2150) PASS: lldb-api :: tools/lldb-server/commandline/TestStubSetSID.py (1887 of 2150) PASS: lldb-api :: functionalities/gdb_remote_client/TestIOSSimulator.py (1888 of 2150) PASS: lldb-shell :: Minidump/breakpad-symbols.test (1889 of 2150) PASS: lldb-api :: functionalities/inferior-assert/TestInferiorAssert.py (1890 of 2150) PASS: lldb-unit :: Utility/./UtilityTests/ArchSpecTest.Compatibility (1891 of 2150) PASS: lldb-api :: macosx/function-starts/TestFunctionStarts.py (1892 of 2150) PASS: lldb-unit :: Host/./HostTests/SocketTest.DomainListenConnectAccept (1893 of 2150) PASS: lldb-api :: functionalities/data-formatter/nsdictionarysynth/TestNSDictionarySynthetic.py (1894 of 2150) PASS: lldb-shell :: Process/Optimization.test (1895 of 2150) PASS: lldb-api :: python_api/disassemble-raw-data/TestDisassemble_VST1_64.py (1896 of 2150) PASS: lldb-unit :: Utility/./UtilityTests/StreamTeeTest.Assignment (1897 of 2150) PASS: lldb-unit :: Utility/./UtilityTests/UriParserTest.BracketedHostnamePort (1898 of 2150) PASS: lldb-api :: functionalities/data-formatter/data-formatter-synthval/TestDataFormatterSynthVal.py (1899 of 2150) UNSUPPORTED: lldb-api :: functionalities/darwin_log/filter/regex/subsystem/TestDarwinLogFilterRegexSubsystem.py (1900 of 2150) PASS: lldb-api :: python_api/lldbutil/iter/TestRegistersIterator.py (1901 of 2150) PASS: lldb-api :: commands/expression/persist_objc_pointeetype/TestPersistObjCPointeeType.py (1902 of 2150) UNSUPPORTED: lldb-shell :: ScriptInterpreter/Lua/bindings.test (1903 of 2150) UNSUPPORTED: lldb-api :: commands/trace/TestTraceLoad.py (1904 of 2150) PASS: lldb-api :: functionalities/thread/concurrent_events/TestConcurrentCrashWithSignal.py (1905 of 2150) PASS: lldb-unit :: Symbol/./SymbolTests/TestTypeSystemClang.TestDeletingImplicitCopyCstrDueToMoveCStr (1906 of 2150) PASS: lldb-unit :: Target/./TargetTests/ModuleCacheTest.GetAndPutUuidExists (1907 of 2150) PASS: lldb-unit :: Utility/./UtilityTests/UriParserTest.BracketedHostnameWithColon (1908 of 2150) PASS: lldb-api :: lang/c/strings/TestCStrings.py (1909 of 2150) PASS: lldb-api :: commands/target/modules/search-paths/insert/TestTargetModulesSearchpathsInsert.py (1910 of 2150) PASS: lldb-unit :: Host/./HostTests/NativeProcessProtocolTest.SetBreakpointFailRead (1911 of 2150) PASS: lldb-unit :: ScriptInterpreter/Python/./ScriptInterpreterPythonTests/PythonDataObjectsTest.TestPythonDictionaryToStructuredDictionary (1912 of 2150) PASS: lldb-api :: python_api/value/change_values/TestChangeValueAPI.py (1913 of 2150) PASS: lldb-unit :: Utility/./UtilityTests/CompletionRequest.TestCompletionOwnership (1914 of 2150) PASS: lldb-unit :: ObjectFile/ELF/./ObjectFileELFTests/ObjectFileELFTest.GetModuleSpecifications_EarlySectionHeaders (1915 of 2150) PASS: lldb-shell :: Settings/TestSettingsSet.test (1916 of 2150) PASS: lldb-shell :: SymbolFile/NativePDB/ast-types.cpp (1917 of 2150) PASS: lldb-unit :: Utility/./UtilityTests/StringListTest.GetMaxStringLengthDecreasingSize (1918 of 2150) PASS: lldb-unit :: Expression/./ExpressionTests/CppModuleConfigurationTest.UnknownLibCppFile (1919 of 2150) PASS: lldb-api :: lang/c/local_types/TestUseClosestType.py (1920 of 2150) PASS: lldb-unit :: Utility/./UtilityTests/StringExtractorTest.GetNameColonValueContainsColon (1921 of 2150) PASS: lldb-api :: commands/platform/file/close/TestPlatformFileClose.py (1922 of 2150) PASS: lldb-shell :: ObjectFile/ELF/PT_LOAD-overlap-PT_TLS.yaml (1923 of 2150) PASS: lldb-api :: commands/process/attach/attach_denied/TestAttachDenied.py (1924 of 2150) PASS: lldb-api :: lang/cpp/subst_template_type_param/TestSubstTemplateTypeParam.py (1925 of 2150) PASS: lldb-shell :: Reproducer/Modules/TestModuleCXX.test (1926 of 2150) PASS: lldb-shell :: ExecControl/StopHook/stop-hook.test (1927 of 2150) PASS: lldb-api :: commands/watchpoints/watchpoint_count/TestWatchpointCount.py (1928 of 2150) PASS: lldb-api :: functionalities/data-formatter/data-formatter-skip-summary/TestDataFormatterSkipSummary.py (1929 of 2150) PASS: lldb-unit :: Utility/./UtilityTests/PassiveReplayTest.InstrumentedBarRef (1930 of 2150) PASS: lldb-api :: commands/expression/persistent_ptr_update/TestPersistentPtrUpdate.py (1931 of 2150) PASS: lldb-api :: functionalities/thread/concurrent_events/TestConcurrentSignalNWatchNBreak.py (1932 of 2150) PASS: lldb-api :: macosx/universal/TestUniversal.py (1933 of 2150) UNSUPPORTED: lldb-shell :: Register/x86-gp-write.test (1934 of 2150) PASS: lldb-unit :: SymbolFile/DWARF/./SymbolFileDWARFTests/SymbolFileDWARFTests.TestAbbrevValidAttrNullForm (1935 of 2150) PASS: lldb-api :: lang/cpp/namespace/TestNamespace.py (1936 of 2150) PASS: lldb-unit :: Process/minidump/./LLDBMinidumpTests/MinidumpParserTest.InvalidMinidump (1937 of 2150) PASS: lldb-api :: functionalities/plugins/python_os_plugin/stepping_plugin_threads/TestOSPluginStepping.py (1938 of 2150) PASS: lldb-shell :: SymbolFile/DWARF/DW_AT_loclists_base.s (1939 of 2150) PASS: lldb-api :: functionalities/tsan/thread_numbers/TestTsanThreadNumbers.py (1940 of 2150) PASS: lldb-shell :: Reproducer/TestMultipleTargets.test (1941 of 2150) PASS: lldb-unit :: Utility/./UtilityTests/StringExtractorTest.GetHexBytes (1942 of 2150) PASS: lldb-unit :: Utility/./UtilityTests/UUIDTest.RelationalOperators (1943 of 2150) PASS: lldb-unit :: Utility/./UtilityTests/ArgsTest.TestArgv (1944 of 2150) PASS: lldb-unit :: Expression/./ExpressionTests/DiagnosticManagerTest.GetStringMultipleDiags (1945 of 2150) PASS: lldb-shell :: SymbolFile/DWARF/childless-compile-unit.s (1946 of 2150) PASS: lldb-unit :: Utility/./UtilityTests/ArgsTest.ReplaceArgumentAtIndexShort (1947 of 2150) UNSUPPORTED: lldb-shell :: ScriptInterpreter/Lua/command_script_import.test (1948 of 2150) PASS: lldb-unit :: Language/Highlighting/./HighlighterTests/HighlighterTest.Keywords (1949 of 2150) PASS: lldb-api :: commands/expression/persistent_types/TestNestedPersistentTypes.py (1950 of 2150) UNSUPPORTED: lldb-api :: linux/add-symbols/TestTargetSymbolsAddCommand.py (1951 of 2150) PASS: lldb-unit :: Host/./HostTests/NativeProcessProtocolTest.ReadCStringFromMemory (1952 of 2150) PASS: lldb-unit :: Utility/./UtilityTests/FileSpecTest.PrependPathComponent (1953 of 2150) PASS: lldb-shell :: SymbolFile/DWARF/DW_OP_piece-smaller-than-struct.s (1954 of 2150) PASS: lldb-api :: functionalities/postmortem/elf-core/gcore/TestGCore.py (1955 of 2150) PASS: lldb-shell :: Breakpoint/case-sensitive.test (1956 of 2150) PASS: lldb-unit :: Utility/./UtilityTests/BinaryStreamTest.PutSLEB128MaxValue (1957 of 2150) UNSUPPORTED: lldb-shell :: SymbolFile/PDB/function-nested-block.test (1958 of 2150) PASS: lldb-unit :: Utility/./UtilityTests/StreamTest.PutBytesAsRawHex8ToLittleEndian (1959 of 2150) PASS: lldb-shell :: ObjectFile/PECOFF/export-dllfunc.yaml (1960 of 2150) PASS: lldb-unit :: Utility/./UtilityTests/EnvironmentTest.EnvpConversion (1961 of 2150) PASS: lldb-api :: lang/cpp/char1632_t/TestChar1632T.py (1962 of 2150) PASS: lldb-api :: functionalities/breakpoint/step_over_breakpoint/TestStepOverBreakpoint.py (1963 of 2150) PASS: lldb-unit :: UnwindAssembly/x86/./UnwindAssemblyx86Tests/Testx86AssemblyInspectionEngine.TestStackRealign32BitDisp_x86_64 (1964 of 2150) PASS: lldb-api :: functionalities/gdb_remote_client/TestRecognizeBreakpoint.py (1965 of 2150) PASS: lldb-shell :: SymbolFile/NativePDB/break-by-line.cpp (1966 of 2150) PASS: lldb-unit :: Host/./HostTests/HostInfoTest.GetHostname (1967 of 2150) PASS: lldb-unit :: Utility/./UtilityTests/StreamTest.ShiftOperatorPtr (1968 of 2150) PASS: lldb-api :: lang/objc/exceptions/TestObjCExceptions.py (1969 of 2150) PASS: lldb-shell :: SymbolFile/DWARF/compilercontext.ll (1970 of 2150) PASS: lldb-api :: macosx/save_crashlog/TestSaveCrashlog.py (1971 of 2150) PASS: lldb-api :: functionalities/breakpoint/cpp_exception/TestCPPExceptionBreakpoint.py (1972 of 2150) PASS: lldb-unit :: Symbol/./SymbolTests/Type.CompilerContextPattern (1973 of 2150) PASS: lldb-api :: functionalities/data-formatter/data-formatter-python-synth/TestDataFormatterPythonSynth.py (1974 of 2150) PASS: lldb-unit :: ScriptInterpreter/Python/./ScriptInterpreterPythonTests/PythonDataObjectsTest.TestPythonTupleToStructuredList (1975 of 2150) PASS: lldb-unit :: Utility/./UtilityTests/StreamTest.Indent (1976 of 2150) PASS: lldb-shell :: SymbolFile/DWARF/dwp-separate-debug-file.cpp (1977 of 2150) PASS: lldb-api :: commands/command/script/import/TestImport.py (1978 of 2150) PASS: lldb-api :: lang/cpp/covariant-return-types/TestCovariantReturnTypes.py (1979 of 2150) PASS: lldb-shell :: SymbolFile/DWARF/DW_TAG_basic_type_DW_ATE_UTF_nonC.ll (1980 of 2150) PASS: lldb-unit :: Utility/./UtilityTests/ProcessInstanceInfo.DumpTable_invalidUID (1981 of 2150) PASS: lldb-api :: functionalities/data-formatter/data-formatter-stl/libcxx/variant/TestDataFormatterLibcxxVariant.py (1982 of 2150) PASS: lldb-unit :: Utility/./UtilityTests/FileSpecTest.Equal (1983 of 2150) PASS: lldb-api :: lang/cpp/member-and-local-vars-with-same-name/TestMembersAndLocalsWithSameName.py (1984 of 2150) PASS: lldb-unit :: UnwindAssembly/x86/./UnwindAssemblyx86Tests/Testx86AssemblyInspectionEngine.TestPopEDI (1985 of 2150) PASS: lldb-unit :: Symbol/./SymbolTests/TestTypeSystemClang.TestDisplayName (1986 of 2150) PASS: lldb-unit :: Symbol/./SymbolTests/TestClangASTImporter.ImportInvalidType (1987 of 2150) PASS: lldb-api :: tools/lldb-vscode/breakpoint/TestVSCode_setBreakpoints.py (1988 of 2150) UNSUPPORTED: lldb-api :: functionalities/thread/create_during_step/TestCreateDuringStep.py (1989 of 2150) PASS: lldb-api :: commands/platform/file/read/TestPlatformFileRead.py (1990 of 2150) PASS: lldb-unit :: UnwindAssembly/x86/./UnwindAssemblyx86Tests/Testx86AssemblyInspectionEngine.TestPushR12 (1991 of 2150) PASS: lldb-unit :: Utility/./UtilityTests/BinaryStreamTest.PutULEB128ThreeBytes (1992 of 2150) PASS: lldb-unit :: Utility/./UtilityTests/RangeTest.Constructor (1993 of 2150) PASS: lldb-unit :: UnwindAssembly/ARM64/./Arm64InstEmulationTests/TestArm64InstEmulation.TestRegisterDoubleSpills (1994 of 2150) PASS: lldb-unit :: Language/CLanguages/./LanguageCLanguagesTests/CLanguages.LookupCLanguagesByLanguageType (1995 of 2150) PASS: lldb-shell :: Driver/TestUseColor.test (1996 of 2150) PASS: lldb-unit :: Utility/./UtilityTests/DataExtractorTest.GetMaxS64 (1997 of 2150) PASS: lldb-unit :: Host/./HostTests/FileSystemTest.EnumerateDirectory (1998 of 2150) PASS: lldb-shell :: SymbolFile/DWARF/debug-types-line-tables.s (1999 of 2150) PASS: lldb-unit :: Process/minidump/./LLDBMinidumpTests/MinidumpParserTest.GetMemoryRegionInfoFromMemory64List (2000 of 2150) PASS: lldb-unit :: Utility/./UtilityTests/RecordReplayTest.InstrumentedBarPtr (2001 of 2150) PASS: lldb-api :: lang/objcxx/objcxx-ivar-vector/TestIvarVector.py (2002 of 2150) PASS: lldb-api :: functionalities/data-formatter/data-formatter-objc/cmtime/TestDataFormatterCMTime.py (2003 of 2150) PASS: lldb-shell :: Breakpoint/debug_rnglist_basic.test (2004 of 2150) PASS: lldb-unit :: Utility/./UtilityTests/LogChannelTest.List (2005 of 2150) PASS: lldb-unit :: Utility/./UtilityTests/StreamTest.PutNHex8 (2006 of 2150) PASS: lldb-api :: python_api/watchpoint/watchlocation/TestTargetWatchAddress.py (2007 of 2150) PASS: lldb-unit :: Utility/./UtilityTests/RangeTest.NotEqual (2008 of 2150) PASS: lldb-shell :: Reproducer/TestDebugSymbols.test (2009 of 2150) PASS: lldb-api :: functionalities/thread/concurrent_events/TestConcurrentTwoWatchpointThreads.py (2010 of 2150) PASS: lldb-shell :: Minidump/disassemble-no-module.yaml (2011 of 2150) PASS: lldb-unit :: Process/gdb-remote/./ProcessGdbRemoteTests/GDBRemoteClientBaseTest.SendContinueDelegateInterface (2012 of 2150) PASS: lldb-api :: lang/c/struct_types/TestStructTypes.py (2013 of 2150) PASS: lldb-api :: functionalities/breakpoint/breakpoint_options/TestBreakpointOptions.py (2014 of 2150) PASS: lldb-unit :: debugserver/./debugserverTests/JSON.Parse (2015 of 2150) PASS: lldb-unit :: debugserver/./debugserverTests/RNBSocket.AnyListen (2016 of 2150) PASS: lldb-unit :: Utility/./UtilityTests/ConstStringTest.CompareConstString (2017 of 2150) PASS: lldb-unit :: SymbolFile/DWARF/./SymbolFileDWARFTests/SymbolFileDWARFTests.ParseArangesNonzeroSegmentSize (2018 of 2150) PASS: lldb-api :: commands/expression/import-std-module/vector/TestVectorFromStdModule.py (2019 of 2150) PASS: lldb-api :: tools/lldb-server/TestAppleSimulatorOSType.py (2020 of 2150) PASS: lldb-unit :: Host/./HostTests/NativeProcessProtocolTest.ReadCStringFromMemory_MaxSize (2021 of 2150) PASS: lldb-api :: lang/c/step-target/TestStepTarget.py (2022 of 2150) PASS: lldb-unit :: Symbol/./SymbolTests/TestClangASTImporter.MetadataPropagation (2023 of 2150) PASS: lldb-api :: functionalities/multidebugger_commands/TestMultipleDebuggersCommands.py (2024 of 2150) PASS: lldb-shell :: SymbolFile/DWARF/debug_rnglists.s (2025 of 2150) PASS: lldb-unit :: ScriptInterpreter/Python/./ScriptInterpreterPythonTests/PythonDataObjectsTest.TestPythonListToStructuredList (2026 of 2150) PASS: lldb-shell :: Reproducer/TestDiscard.test (2027 of 2150) PASS: lldb-api :: iohandler/resize/TestIOHandlerResizeNoEditline.py (2028 of 2150) PASS: lldb-api :: lang/cpp/breakpoint-commands/TestCPPBreakpointCommands.py (2029 of 2150) PASS: lldb-unit :: Utility/./UtilityTests/RegularExpression.CopyAssignment (2030 of 2150) PASS: lldb-api :: lang/c/unicode/TestUnicodeSymbols.py (2031 of 2150) PASS: lldb-unit :: Utility/./UtilityTests/RangeTest.Slide (2032 of 2150) PASS: lldb-unit :: Process/gdb-remote/./ProcessGdbRemoteTests/GDBRemoteClientBaseTest.SendContinueAndInterrupt2PacketBug (2033 of 2150) PASS: lldb-unit :: Utility/./UtilityTests/StringExtractorTest.GetHexU8_Underflow2 (2034 of 2150) PASS: lldb-shell :: ObjectFile/Breakpad/breakpad-identification.test (2035 of 2150) UNSUPPORTED: lldb-api :: linux/thread/create_during_instruction_step/TestCreateDuringInstructionStep.py (2036 of 2150) PASS: lldb-unit :: Utility/./UtilityTests/BinaryStreamTest.PutSLEB128SevenBytes (2037 of 2150) PASS: lldb-unit :: Utility/./UtilityTests/StreamTeeTest.GetStreamAtIndexOutOfBoundsEmpty (2038 of 2150) PASS: lldb-unit :: Utility/./UtilityTests/StringListTest.AppendList (2039 of 2150) PASS: lldb-api :: commands/expression/import-std-module/deque-dbg-info-content/TestDbgInfoContentDequeFromStdModule.py (2040 of 2150) PASS: lldb-api :: iohandler/unicode/TestUnicode.py (2041 of 2150) PASS: lldb-unit :: Symbol/./SymbolTests/LineEntryTest.GetSameLineContiguousAddressRangeNestedInline (2042 of 2150) PASS: lldb-api :: lang/cpp/auto/TestCPPAuto.py (2043 of 2150) PASS: lldb-unit :: Utility/./UtilityTests/StringLexerTest.HasAtLeast (2044 of 2150) PASS: lldb-shell :: Reproducer/TestPythonImport.test (2045 of 2150) PASS: lldb-api :: lang/objc/bitfield_ivars/TestBitfieldIvars.py (2046 of 2150) PASS: lldb-shell :: ObjectFile/ELF/section-addresses.yaml (2047 of 2150) PASS: lldb-api :: python_api/disassemble-raw-data/TestDisassembleRawData.py (2048 of 2150) PASS: lldb-shell :: SymbolFile/DWARF/dir-separator-no-comp-dir-relative-name.s (2049 of 2150) PASS: lldb-unit :: Target/./TargetTests/ExecutionContextTest.GetByteOrder (2050 of 2150) PASS: lldb-unit :: Process/gdb-remote/./ProcessGdbRemoteTests/GDBRemoteCommunicationClientTest.SaveRestoreRegistersNoSuffix (2051 of 2150) PASS: lldb-unit :: Expression/./ExpressionTests/CppModuleConfigurationTest.Linux (2052 of 2150) PASS: lldb-api :: commands/expression/call-throws/TestCallThatThrows.py (2053 of 2150) UNSUPPORTED: lldb-api :: functionalities/darwin_log/filter/exact_match/subsystem/TestDarwinLogFilterMatchSubsystem.py (2054 of 2150) PASS: lldb-unit :: ObjectFile/ELF/./ObjectFileELFTests/ObjectFileELFTest.GetSymtab_NoSymEntryPointArmThumbAddressClass (2055 of 2150) PASS: lldb-unit :: ScriptInterpreter/Python/./ScriptInterpreterPythonTests/PythonDataObjectsTest.TestGlobalNameResolutionNoDot (2056 of 2150) PASS: lldb-api :: tools/lldb-vscode/breakpoint-events/TestVSCode_breakpointEvents.py (2057 of 2150) UNSUPPORTED: lldb-api :: functionalities/darwin_log/source/info/TestDarwinLogSourceInfo.py (2058 of 2150) PASS: lldb-api :: commands/disassemble/basic/TestDisassembleBreakpoint.py (2059 of 2150) PASS: lldb-unit :: Symbol/./SymbolTests/PostfixExpression.ToDWARF (2060 of 2150) PASS: lldb-api :: lang/objc/rdar-10967107/TestRdar10967107.py (2061 of 2150) PASS: lldb-shell :: SymbolFile/DWARF/debug_loclists-dwo.s (2062 of 2150) PASS: lldb-unit :: Utility/./UtilityTests/FileSpecTest.EqualDotsWindows (2063 of 2150) PASS: lldb-api :: functionalities/breakpoint/inlined_breakpoints/TestInlinedBreakpoints.py (2064 of 2150) PASS: lldb-api :: functionalities/breakpoint/breakpoint_command/TestBreakpointCommandsFromPython.py (2065 of 2150) PASS: lldb-shell :: SymbolFile/DWARF/debug-types-dwo-cross-reference.cpp (2066 of 2150) PASS: lldb-shell :: SymbolFile/DWARF/find-variable-file.cpp (2067 of 2150) PASS: lldb-api :: functionalities/data-formatter/data-formatter-stl/libcxx/optional/TestDataFormatterLibcxxOptional.py (2068 of 2150) PASS: lldb-unit :: ScriptInterpreter/Python/./ScriptInterpreterPythonTests/PythonDataObjectsTest.TestPythonListManipulation (2069 of 2150) PASS: lldb-unit :: ScriptInterpreter/Python/./ScriptInterpreterPythonTests/PythonDataObjectsTest.TestOwnedReferences (2070 of 2150) PASS: lldb-unit :: Target/./TargetTests/MemoryRegionInfoTest.Formatv (2071 of 2150) PASS: lldb-api :: lang/objc/modules-update/TestClangModulesUpdate.py (2072 of 2150) PASS: lldb-api :: functionalities/breakpoint/breakpoint_set_restart/TestBreakpointSetRestart.py (2073 of 2150) PASS: lldb-shell :: ScriptInterpreter/Python/scripted_breakpoint.test (2074 of 2150) PASS: lldb-unit :: Utility/./UtilityTests/ArchSpecTest.TestParseMachCPUDashSubtypeTripleExtra (2075 of 2150) PASS: lldb-unit :: Utility/./UtilityTests/ArgsTest.ReplaceArgumentAtIndexLonger (2076 of 2150) PASS: lldb-unit :: Utility/./UtilityTests/GeneratorTest.Get (2077 of 2150) UNSUPPORTED: lldb-shell :: Register/x86-ymm-write.test (2078 of 2150) PASS: lldb-unit :: Utility/./UtilityTests/OptionsWithRawTest.SingleWhitespaceInput (2079 of 2150) PASS: lldb-shell :: SymbolFile/DWARF/dwarf5-debug_line.s (2080 of 2150) PASS: lldb-unit :: Symbol/./SymbolTests/TestTypeSystemClang.TestGetTypeClassTypeOfExpr (2081 of 2150) PASS: lldb-api :: commands/frame/language/TestGuessLanguage.py (2082 of 2150) PASS: lldb-api :: functionalities/data-formatter/data-formatter-stl/libcxx/initializerlist/TestInitializerList.py (2083 of 2150) PASS: lldb-api :: tools/lldb-server/TestLldbGdbServer.py (2084 of 2150) PASS: lldb-unit :: Utility/./UtilityTests/StreamTest.AddressPrefix (2085 of 2150) PASS: lldb-unit :: Utility/./UtilityTests/StringListTest.JoinNonSpace (2086 of 2150) PASS: lldb-shell :: Quit/TestQuitExitCodeImplicit0.test (2087 of 2150) PASS: lldb-shell :: Minidump/Windows/Sigsegv/sigsegv.test (2088 of 2150) PASS: lldb-shell :: SymbolFile/NativePDB/function-types-classes.cpp (2089 of 2150) PASS: lldb-unit :: Utility/./UtilityTests/StringExtractorTest.DecodeHexU8_InvalidHex2 (2090 of 2150) PASS: lldb-shell :: SymbolFile/DWARF/apple-index-is-used.cpp (2091 of 2150) PASS: lldb-unit :: Process/minidump/./LLDBMinidumpTests/MinidumpParserTest.GetMemory (2092 of 2150) PASS: lldb-api :: functionalities/abbreviation/TestAbbreviations.py (2093 of 2150) PASS: lldb-unit :: Utility/./UtilityTests/StringListTest.InsertStringAtIndexOutOfBounds (2094 of 2150) UNSUPPORTED: lldb-api :: tools/lldb-server/TestGdbRemote_vContThreads.py (2095 of 2150) PASS: lldb-unit :: ScriptInterpreter/Python/./ScriptInterpreterPythonTests/PythonDataObjectsTest.TestDictionaryResolutionWithDot (2096 of 2150) XFAIL: lldb-shell :: Unwind/prefer-debug-over-eh-frame.test (2097 of 2150) PASS: lldb-api :: lang/cpp/std-function-step-into-callable/TestStdFunctionStepIntoCallable.py (2098 of 2150) PASS: lldb-api :: macosx/profile_vrs_detach/TestDetachVrsProfile.py (2099 of 2150) PASS: lldb-api :: commands/expression/issue_11588/Test11588.py (2100 of 2150) PASS: lldb-shell :: ObjectFile/PECOFF/symbol.yaml (2101 of 2150) PASS: lldb-unit :: Expression/./ExpressionTests/ClangHostTest.MacOSX (2102 of 2150) PASS: lldb-api :: commands/expression/no-deadlock/TestExprDoesntBlock.py (2103 of 2150) PASS: lldb-unit :: Utility/./UtilityTests/FileSpecTest.GuessPathStyle (2104 of 2150) PASS: lldb-api :: functionalities/tail_call_frames/ambiguous_tail_call_seq2/TestAmbiguousTailCallSeq2.py (2105 of 2150) PASS: lldb-api :: commands/apropos/with-process/TestAproposWithProcess.py (2106 of 2150) PASS: lldb-api :: lang/cpp/dynamic-value-same-basename/TestDynamicValueSameBase.py (2107 of 2150) PASS: lldb-unit :: Target/./TargetTests/ExecutionContextTest.GetByteOrderProcess (2108 of 2150) PASS: lldb-unit :: Utility/./UtilityTests/EnvironmentTest.EnvpConstruction (2109 of 2150) PASS: lldb-unit :: Utility/./UtilityTests/VMRange.Comparison (2110 of 2150) UNSUPPORTED: lldb-api :: commands/register/register/intel_xtended_registers/TestMPXRegisters.py (2111 of 2150) PASS: lldb-unit :: Utility/./UtilityTests/Flags.Reset (2112 of 2150) PASS: lldb-api :: lang/objc/objc-ivar-offsets/TestObjCIvarOffsets.py (2113 of 2150) PASS: lldb-api :: lang/objc/modules-compile-error/TestModulesCompileError.py (2114 of 2150) PASS: lldb-api :: commands/disassemble/basic/TestFrameDisassemble.py (2115 of 2150) PASS: lldb-unit :: ScriptInterpreter/Python/./ScriptInterpreterPythonTests/PythonDataObjectsTest.TestPythonTupleSize (2116 of 2150) PASS: lldb-api :: lang/cpp/call-function/TestCallCPPFunction.py (2117 of 2150) PASS: lldb-api :: functionalities/unwind/zeroth_frame/TestZerothFrame.py (2118 of 2150) PASS: lldb-unit :: Utility/./UtilityTests/NameMatchesTest.Contains (2119 of 2150) PASS: lldb-api :: lang/cpp/global_variables/TestCPPGlobalVariables.py (2120 of 2150) PASS: lldb-api :: tools/lldb-vscode/launch/TestVSCode_launch.py (2121 of 2150) UNSUPPORTED: lldb-api :: functionalities/data-formatter/data-formatter-stl/libstdcpp/unique_ptr/TestDataFormatterStdUniquePtr.py (2122 of 2150) PASS: lldb-unit :: Utility/./UtilityTests/StructuredDataTest.ParseJSONFromFile (2123 of 2150) PASS: lldb-api :: lang/c/anonymous/TestAnonymous.py (2124 of 2150) PASS: lldb-api :: functionalities/data-formatter/data-formatter-synthtype/TestDataFormatterSynthType.py (2125 of 2150) PASS: lldb-shell :: Driver/TestTarget.test (2126 of 2150) UNSUPPORTED: lldb-shell :: Unwind/eh-frame-augment-noop.test (2127 of 2150) PASS: lldb-unit :: Utility/./UtilityTests/ArgsTest.TestOverwriteArgs (2128 of 2150) PASS: lldb-api :: functionalities/memory/cache/TestMemoryCache.py (2129 of 2150) PASS: lldb-shell :: ScriptInterpreter/Python/python.test (2130 of 2150) PASS: lldb-api :: functionalities/thread/concurrent_events/TestConcurrentTwoWatchpointsOneSignal.py (2131 of 2150) PASS: lldb-shell :: Expr/TestIRMemoryMap.test (2132 of 2150) PASS: lldb-unit :: Expression/./ExpressionTests/CppModuleConfigurationTest.MissingLibCpp (2133 of 2150) PASS: lldb-unit :: Symbol/./SymbolTests/DWARFCallFrameInfoTest.Basic_dwarf3 (2134 of 2150) PASS: lldb-api :: commands/quit/TestQuit.py (2135 of 2150) PASS: lldb-api :: functionalities/data-formatter/data-formatter-stl/libcxx/bitset/TestDataFormatterLibcxxBitset.py (2136 of 2150) PASS: lldb-unit :: SymbolFile/DWARF/./SymbolFileDWARFTests/SymbolFileDWARFTests.TestAbbrevOrder1Start1 (2137 of 2150) PASS: lldb-api :: commands/expression/scoped_enums/TestScopedEnumType.py (2138 of 2150) PASS: lldb-unit :: Symbol/./SymbolTests/DWARFCallFrameInfoTest.Basic_eh (2139 of 2150) PASS: lldb-unit :: Process/gdb-remote/./ProcessGdbRemoteTests/GDBRemoteCommunicationClientTest.GetMemoryRegionInfoInvalidResponse (2140 of 2150) PASS: lldb-unit :: Utility/./UtilityTests/RangeTest.ContainsEndInclusive (2141 of 2150) PASS: lldb-api :: commands/settings/use_source_cache/TestUseSourceCache.py (2142 of 2150) PASS: lldb-unit :: Utility/./UtilityTests/Predicate.WaitForValueEqualTo (2143 of 2150) UNSUPPORTED: lldb-api :: functionalities/data-formatter/data-formatter-stl/libstdcpp/vbool/TestDataFormatterStdVBool.py (2144 of 2150) PASS: lldb-unit :: Process/minidump/./LLDBMinidumpTests/MinidumpParserTest.GetPid (2145 of 2150) PASS: lldb-unit :: Utility/./UtilityTests/StreamTest.PutCStringWithStringRef (2146 of 2150) PASS: lldb-unit :: Utility/./UtilityTests/TimerTest.CategoryTimesStats (2147 of 2150) PASS: lldb-api :: commands/command/script_alias/TestCommandScriptAlias.py (2148 of 2150) PASS: lldb-api :: types/TestShortTypeExpr.py (2149 of 2150) PASS: lldb-api :: lang/objc/print-obj/TestPrintObj.py (2150 of 2150) Slowest Tests: -------------------------------------------------------------------------- 169.23s: lldb-api :: macosx/simulator/TestSimulatorPlatform.py 132.03s: lldb-api :: functionalities/postmortem/mach-core/TestMachCore.py 105.08s: lldb-api :: functionalities/gdb_remote_client/TestThreadSelectionBug.py 101.78s: lldb-api :: tools/lldb-server/TestLldbGdbServer.py 89.04s: lldb-api :: lang/objc/foundation/TestObjCMethodsNSError.py 78.95s: lldb-api :: commands/target/basic/TestTargetCommand.py 71.32s: lldb-api :: commands/expression/import_builtin_fileid/TestImportBuiltinFileID.py 60.58s: lldb-api :: lang/objc/exceptions/TestObjCExceptions.py 58.12s: lldb-api :: commands/expression/context-object-objc/TestContextObjectObjc.py 55.99s: lldb-api :: lang/objc/hidden-ivars/TestHiddenIvars.py 55.97s: lldb-api :: lang/objc/foundation/TestFoundationDisassembly.py 55.81s: lldb-api :: lang/objc/foundation/TestObjCMethods.py 54.18s: lldb-api :: functionalities/postmortem/minidump-new/TestMiniDumpNew.py 52.52s: lldb-api :: api/multithreaded/TestMultithreaded.py 51.72s: lldb-api :: lang/objc/objc-new-syntax/TestObjCNewSyntaxLiteral.py 51.52s: lldb-api :: lang/objc/foundation/TestConstStrings.py 47.96s: lldb-shell :: SymbolFile/NativePDB/nested-types.cpp 47.38s: lldb-api :: types/TestLongTypesExpr.py 46.64s: lldb-shell :: ObjectFile/PECOFF/disassemble-thumb.yaml 46.55s: lldb-api :: functionalities/gdb_remote_client/TestArmRegisterDefinition.py

Hide Details

Tests Times: -------------------------------------------------------------------------- [ Range ] :: [ Percentage ] :: [ Count ] -------------------------------------------------------------------------- [160s,170s) :: [ ] :: [ 1/2150] [150s,160s) :: [ ] :: [ 0/2150] [140s,150s) :: [ ] :: [ 0/2150] [130s,140s) :: [ ] :: [ 1/2150] [120s,130s) :: [ ] :: [ 0/2150] [110s,120s) :: [ ] :: [ 0/2150] [100s,110s) :: [ ] :: [ 2/2150] [ 90s,100s) :: [ ] :: [ 0/2150] [ 80s, 90s) :: [ ] :: [ 1/2150] [ 70s, 80s) :: [ ] :: [ 2/2150] [ 60s, 70s) :: [ ] :: [ 1/2150] [ 50s, 60s) :: [ ] :: [ 8/2150] [ 40s, 50s) :: [ ] :: [ 9/2150] [ 30s, 40s) :: [ ] :: [ 10/2150] [ 20s, 30s) :: [ ] :: [ 23/2150] [ 10s, 20s) :: [** ] :: [ 146/2150] [ 0s, 10s) :: [************************************ ] :: [1946/2150] -------------------------------------------------------------------------- ******************** Failed Tests (1): lldb-api :: functionalities/gdb_remote_client/TestThreadSelectionBug.py

Hide Details

Hide Details

Testing Time: 1835.16s Unsupported : 153 Passed : 1990 Expectedly Failed: 6 Failed : 1 FAILED: tools/lldb/test/CMakeFiles/check-lldb-lit cd /Users/buildslave/jenkins/workspace/lldb-cmake/lldb-build/tools/lldb/test && /usr/local/Frameworks/Python.framework/Versions/3.7/bin/python3.7 /Users/buildslave/jenkins/workspace/lldb-cmake/lldb-build/./bin/llvm-lit -v --time-tests --shuffle --xunit-xml-output=/Users/buildslave/jenkins/workspace/lldb-cmake/test/results.xml -v -j 4 /Users/buildslave/jenkins/workspace/lldb-cmake/lldb-build/tools/lldb/test ninja: build stopped: subcommand failed. Command failed: Command '['/usr/bin/env', 'TERM=vt100', '/usr/local/bin/ninja', '-v', 'check-lldb']' returned non-zero exit status 1 Command: ['/usr/bin/env', 'TERM=vt100', '/usr/local/bin/ninja', '-v', 'check-lldb'] [Pipeline] } [Pipeline] // timeout [Pipeline] } [Pipeline] // stage [Pipeline] stage [Pipeline] { (Declarative: Post Actions) [Pipeline] scanForIssues [Clang (LLVM based)] Sleeping for 5 seconds due to JENKINS-32191... [Clang (LLVM based)] Parsing console log (workspace: '/Users/buildslave/jenkins/workspace/lldb-cmake') [Clang (LLVM based)] Successfully parsed console log [Clang (LLVM based)] -> found 8 issues (skipped 12 duplicates) [Clang (LLVM based)] Post processing issues on 'green-dragon-10' with source code encoding 'UTF-8' [Clang (LLVM based)] Creating SCM blamer to obtain author and commit information for affected files [Clang (LLVM based)] Creating SCM miner to obtain statistics for affected repository files [Clang (LLVM based)] Resolving file names for all issues in source directory '/Users/buildslave/jenkins/workspace/lldb-cmake' [Clang (LLVM based)] -> resolved paths in source directory (6 found, 0 not found) [Clang (LLVM based)] Resolving module names from module definitions (build.xml, pom.xml, or Manifest.mf files) [Clang (LLVM based)] -> resolved module names for 8 issues [Clang (LLVM based)] Resolving package names (or namespaces) by parsing the affected files [Clang (LLVM based)] -> resolved package names of 6 affected files [Clang (LLVM based)] No filter has been set, publishing all 8 issues [Clang (LLVM based)] Creating fingerprints for all affected code blocks to track issues over different builds [Clang (LLVM based)] -> created fingerprints for 8 issues (skipped 0 issues) [Clang (LLVM based)] Copying affected files to Jenkins' build folder '/Users/Shared/Jenkins/Home/jobs/lldb-cmake/builds/23944/files-with-issues' [Clang (LLVM based)] -> 4 copied, 2 not in workspace, 0 not-found, 0 with I/O error [Pipeline] junit Recording test results [Pipeline] emailext Warning: mcinally@cray.com is not a recognized user, but sending mail anyway Warning: sam.parker@arm.com is not a recognized user, but sending mail anyway Warning: zinenko@google.com is not a recognized user, but sending mail anyway Warning: limo@google.com is not a recognized user, but sending mail anyway Warning: usx@google.com is not a recognized user, but sending mail anyway Warning: jperier@nvidia.com is not a recognized user, but sending mail anyway Warning: aaron@aaronballman.com is not a recognized user, but sending mail anyway Warning: clementval@gmail.com is not a recognized user, but sending mail anyway Warning: paul@windfall.com is not a recognized user, but sending mail anyway Warning: Yaxun.Liu@amd.com is not a recognized user, but sending mail anyway Warning: SourabhSingh.Tomar@amd.com is not a recognized user, but sending mail anyway Warning: paulsson@linux.vnet.ibm.com is not a recognized user, but sending mail anyway Warning: flo@fhahn.com is not a recognized user, but sending mail anyway Warning: saghir@ca.ibm.com is not a recognized user, but sending mail anyway Warning: jotrem@microsoft.com is not a recognized user, but sending mail anyway Warning: Matthew.Arsenault@amd.com is not a recognized user, but sending mail anyway Warning: mcinally@cray.com is not a recognized user, but sending mail anyway Warning: sam.parker@arm.com is not a recognized user, but sending mail anyway Warning: zinenko@google.com is not a recognized user, but sending mail anyway Warning: limo@google.com is not a recognized user, but sending mail anyway Warning: usx@google.com is not a recognized user, but sending mail anyway Warning: jperier@nvidia.com is not a recognized user, but sending mail anyway Warning: aaron@aaronballman.com is not a recognized user, but sending mail anyway Warning: clementval@gmail.com is not a recognized user, but sending mail anyway Warning: paul@windfall.com is not a recognized user, but sending mail anyway Warning: Yaxun.Liu@amd.com is not a recognized user, but sending mail anyway Warning: SourabhSingh.Tomar@amd.com is not a recognized user, but sending mail anyway Warning: paulsson@linux.vnet.ibm.com is not a recognized user, but sending mail anyway Warning: flo@fhahn.com is not a recognized user, but sending mail anyway Warning: saghir@ca.ibm.com is not a recognized user, but sending mail anyway Warning: jotrem@microsoft.com is not a recognized user, but sending mail anyway Warning: Matthew.Arsenault@amd.com is not a recognized user, but sending mail anyway

Hide Details

Begin Pre-Send Script... Sending email to: Florian Hahn <florian_hahn@apple.com> Florian Hahn <florian_hahn@apple.com> Azhar Mohammed <azhar@apple.com>
[Pipeline] } [Pipeline] // stage [Pipeline] } [Pipeline] // withEnv [Pipeline] } [Pipeline] // node [Pipeline] End of Pipeline ERROR: script returned exit code 1 Finished: FAILURE