Started 7 days 16 hr ago
Took 1 hr 28 min

Failed Build clang-d362683-g518a27e5591-t13421-b13421.tar.gz (Aug 6, 2020 9:26:52 AM)

Issues

Found 3 issues:
Ninja target: pr17377.c.o
[9537/11531] /Users/buildslave/jenkins/workspace/test-suite-verify-machineinstrs-aarch64-O0-g/test-suite-build/tools/timeit --summary SingleSource/Regression/C/gcc-c-torture/execute/CMakeFiles/GCC-C-execute-loop-10.dir/loop-10.c.o.time /Users/buildslave/jenkins/workspace/test-suite-verify-machineinstrs-aarch64-O0-g/compiler/bin/clang -DNDEBUG  -B /Applications/Xcode.app/Contents/Developer/Toolchains/XcodeDefault.xctoolchain/usr/bin    -Wno-unused-command-line-argument -mllvm -verify-machineinstrs -O0 -g -arch arm64 -isysroot /Applications/Xcode.app/Contents/Developer/Platforms/iPhoneOS.platform/Developer/SDKs/iPhoneOS13.5.sdk   -w -Werror=date-time -w -MD -MT SingleSource/Regression/C/gcc-c-torture/execute/CMakeFiles/GCC-C-execute-loop-10.dir/loop-10.c.o -MF SingleSource/Regression/C/gcc-c-torture/execute/CMakeFiles/GCC-C-execute-loop-10.dir/loop-10.c.o.d -o SingleSource/Regression/C/gcc-c-torture/execute/CMakeFiles/GCC-C-execute-loop-10.dir/loop-10.c.o   -c /Users/buildslave/jenkins/workspace/test-suite-verify-machineinstrs-aarch64-O0-g/test-suite/SingleSource/Regression/C/gcc-c-torture/execute/loop-10.c
[9538/11531] : && /Users/buildslave/jenkins/workspace/test-suite-verify-machineinstrs-aarch64-O0-g/test-suite-build/tools/timeit --summary SingleSource/Regression/C/gcc-c-torture/execute/GCC-C-execute-loop-12.link.time /Users/buildslave/jenkins/workspace/test-suite-verify-machineinstrs-aarch64-O0-g/compiler/bin/clang -B /Applications/Xcode.app/Contents/Developer/Toolchains/XcodeDefault.xctoolchain/usr/bin    -Wno-unused-command-line-argument -mllvm -verify-machineinstrs -O0 -g -arch arm64 -isysroot /Applications/Xcode.app/Contents/Developer/Platforms/iPhoneOS.platform/Developer/SDKs/iPhoneOS13.5.sdk -Wl,-search_paths_first -Wl,-headerpad_max_install_names -B /Applications/Xcode.app/Contents/Developer/Toolchains/XcodeDefault.xctoolchain/usr/bin SingleSource/Regression/C/gcc-c-torture/execute/CMakeFiles/GCC-C-execute-loop-12.dir/loop-12.c.o  -o SingleSource/Regression/C/gcc-c-torture/execute/GCC-C-execute-loop-12   && :
[9539/11531] : && /Users/buildslave/jenkins/workspace/test-suite-verify-machineinstrs-aarch64-O0-g/test-suite-build/tools/timeit --summary SingleSource/Regression/C/gcc-c-torture/execute/GCC-C-execute-loop-11.link.time /Users/buildslave/jenkins/workspace/test-suite-verify-machineinstrs-aarch64-O0-g/compiler/bin/clang -B /Applications/Xcode.app/Contents/Developer/Toolchains/XcodeDefault.xctoolchain/usr/bin    -Wno-unused-command-line-argument -mllvm -verify-machineinstrs -O0 -g -arch arm64 -isysroot /Applications/Xcode.app/Contents/Developer/Platforms/iPhoneOS.platform/Developer/SDKs/iPhoneOS13.5.sdk -Wl,-search_paths_first -Wl,-headerpad_max_install_names -B /Applications/Xcode.app/Contents/Developer/Toolchains/XcodeDefault.xctoolchain/usr/bin SingleSource/Regression/C/gcc-c-torture/execute/CMakeFiles/GCC-C-execute-loop-11.dir/loop-11.c.o  -o SingleSource/Regression/C/gcc-c-torture/execute/GCC-C-execute-loop-11   && :
[9540/11531] /Users/buildslave/jenkins/workspace/test-suite-verify-machineinstrs-aarch64-O0-g/test-suite-build/tools/timeit --summary SingleSource/Regression/C/gcc-c-torture/execute/CMakeFiles/GCC-C-execute-loop-1.dir/loop-1.c.o.time /Users/buildslave/jenkins/workspace/test-suite-verify-machineinstrs-aarch64-O0-g/compiler/bin/clang -DNDEBUG  -B /Applications/Xcode.app/Contents/Developer/Toolchains/XcodeDefault.xctoolchain/usr/bin    -Wno-unused-command-line-argument -mllvm -verify-machineinstrs -O0 -g -arch arm64 -isysroot /Applications/Xcode.app/Contents/Developer/Platforms/iPhoneOS.platform/Developer/SDKs/iPhoneOS13.5.sdk   -w -Werror=date-time -w -MD -MT SingleSource/Regression/C/gcc-c-torture/execute/CMakeFiles/GCC-C-execute-loop-1.dir/loop-1.c.o -MF SingleSource/Regression/C/gcc-c-torture/execute/CMakeFiles/GCC-C-execute-loop-1.dir/loop-1.c.o.d -o SingleSource/Regression/C/gcc-c-torture/execute/CMakeFiles/GCC-C-execute-loop-1.dir/loop-1.c.o   -c /Users/buildslave/jenkins/workspace/test-suite-verify-machineinstrs-aarch64-O0-g/test-suite/SingleSource/Regression/C/gcc-c-torture/execute/loop-1.c
[9541/11531] /Users/buildslave/jenkins/workspace/test-suite-verify-machineinstrs-aarch64-O0-g/test-suite-build/tools/timeit --summary SingleSource/Regression/C/gcc-c-torture/execute/CMakeFiles/GCC-C-execute-pr17377.dir/pr17377.c.o.time /Users/buildslave/jenkins/workspace/test-suite-verify-machineinstrs-aarch64-O0-g/compiler/bin/clang -DNDEBUG  -B /Applications/Xcode.app/Contents/Developer/Toolchains/XcodeDefault.xctoolchain/usr/bin    -Wno-unused-command-line-argument -mllvm -verify-machineinstrs -O0 -g -arch arm64 -isysroot /Applications/Xcode.app/Contents/Developer/Platforms/iPhoneOS.platform/Developer/SDKs/iPhoneOS13.5.sdk   -w -Werror=date-time -w -MD -MT SingleSource/Regression/C/gcc-c-torture/execute/CMakeFiles/GCC-C-execute-pr17377.dir/pr17377.c.o -MF SingleSource/Regression/C/gcc-c-torture/execute/CMakeFiles/GCC-C-execute-pr17377.dir/pr17377.c.o.d -o SingleSource/Regression/C/gcc-c-torture/execute/CMakeFiles/GCC-C-execute-pr17377.dir/pr17377.c.o   -c /Users/buildslave/jenkins/workspace/test-suite-verify-machineinstrs-aarch64-O0-g/test-suite/SingleSource/Regression/C/gcc-c-torture/execute/pr17377.c
FAILED: SingleSource/Regression/C/gcc-c-torture/execute/CMakeFiles/GCC-C-execute-pr17377.dir/pr17377.c.o 
/Users/buildslave/jenkins/workspace/test-suite-verify-machineinstrs-aarch64-O0-g/test-suite-build/tools/timeit --summary SingleSource/Regression/C/gcc-c-torture/execute/CMakeFiles/GCC-C-execute-pr17377.dir/pr17377.c.o.time /Users/buildslave/jenkins/workspace/test-suite-verify-machineinstrs-aarch64-O0-g/compiler/bin/clang -DNDEBUG  -B /Applications/Xcode.app/Contents/Developer/Toolchains/XcodeDefault.xctoolchain/usr/bin    -Wno-unused-command-line-argument -mllvm -verify-machineinstrs -O0 -g -arch arm64 -isysroot /Applications/Xcode.app/Contents/Developer/Platforms/iPhoneOS.platform/Developer/SDKs/iPhoneOS13.5.sdk   -w -Werror=date-time -w -MD -MT SingleSource/Regression/C/gcc-c-torture/execute/CMakeFiles/GCC-C-execute-pr17377.dir/pr17377.c.o -MF SingleSource/Regression/C/gcc-c-torture/execute/CMakeFiles/GCC-C-execute-pr17377.dir/pr17377.c.o.d -o SingleSource/Regression/C/gcc-c-torture/execute/CMakeFiles/GCC-C-execute-pr17377.dir/pr17377.c.o   -c /Users/buildslave/jenkins/workspace/test-suite-verify-machineinstrs-aarch64-O0-g/test-suite/SingleSource/Regression/C/gcc-c-torture/execute/pr17377.c
Fatal Error: error in backend: Found 1 machine code errors.
# End machine code for function f.

*** Bad machine code: Virtual register defs don't dominate all uses. ***
- function:    f
- v. register: %18
fatal error: error in backend: Found 1 machine code errors.
PLEASE submit a bug report to https://bugs.llvm.org/ and include the crash backtrace, preprocessed source, and associated run script.
Stack dump:
Error: clang frontend command failed with exit code 70 (use -v to see invocation)
24 clang         0x0000000108021b1d clang::driver::Compilation::ExecuteCommand(clang::driver::Command const&, clang::driver::Command const*&) const + 221
25 clang         0x0000000108021f3d clang::driver::Compilation::ExecuteJobs(clang::driver::JobList const&, llvm::SmallVectorImpl<std::__1::pair<int, clang::driver::Command const*> >&) const + 125
26 clang         0x000000010803652c clang::driver::Driver::ExecuteCompilation(clang::driver::Compilation&, llvm::SmallVectorImpl<std::__1::pair<int, clang::driver::Command const*> >&) + 204
27 clang         0x0000000105b84365 main + 10389
28 libdyld.dylib 0x00007fff6eb25cc9 start + 1
clang-12: error: clang frontend command failed with exit code 70 (use -v to see invocation)
clang version 12.0.0 (https://github.com/llvm/llvm-project.git 518a27e5591c211ceeef3091edc59012e6ace2b2)
Target: aarch64-apple-darwin19.5.0

Build Log

Changes
  1. AMDGPU/GlobalISel: Implement LLT version of allowsMisalignedMemoryAccesses (details)
  2. AMDGPU/GlobalISel: Stop using G_EXTRACT in argument lowering (details)
  3. AMDGPU/GlobalISel: Fix trying to widen <3 x s1> boolean ops (details)
  4. AMDGPU/GlobalISel: Implement expansion for rsq.clamp (details)
  5. [XCOFF][AIX] Put each jump table in an independent section if -ffunction-sections is specified (details)
  6. AMDGPU: Fix code duplication between the selectors (details)
  7. AMDGPU/GlobalISel: Move frame index selection to patterns (details)
  8. [PatternMatch] allow intrinsic form of min/max with existing matchers (details)
  9. AMDGPU/GlobalISel: Try to promote to use packed saturating add/sub (details)
  10. AMDGPU/GlobalISel: Handle llvm.amdgcn.ds.{fadd|fmin|fmax} (details)
  11. [ELF] Allow sections after a non-SHF_ALLOC section to be covered by PT_LOAD (details)
  12. PDBExtras.h - remove unnecessary raw_ostream forward declaration. NFCI. (details)
  13. [InstCombine] Add tests for mul(sub(x,y),negpow2) -> mul(sub(y,x),pow2) fold (details)
  14. [lldb][NFC] Document and encapsulate OriginMap in ASTContextMetadata (details)
  15. [OpenMP] Fix ref count dec for implicit map of partial data (details)

Started by upstream project relay-test-suite-verify-machineinstrs build number 8563
originally caused by:

This run spent:

  • 1 hr 13 min waiting;
  • 1 hr 28 min build duration;
  • 1 hr 29 min total from scheduled to completion.
Revision: 74e099cb9569f67ddb4341839eea408abc67e04e
  • refs/remotes/origin/master
Revision: 518a27e5591c211ceeef3091edc59012e6ace2b2
  • detached
Revision: 554f0722ae0daaab3abb7fd2205a9f00ce787cf0
  • refs/remotes/origin/master
Revision: f1a62a9c12d0b2f789823e46627bf070da6daaae
  • refs/remotes/origin/master

Identified problems

Compile Error

This build failed because of a compile error. Below is a list of all errors in the build log:
Indication 1

Ninja target failed

Below is a link to the first failed ninja target.
Indication 2