AbortedConsole Output

Skipping 15,538 KB.. Full Log
_api/lldbutil/iter/Makefile MAKE_DSYM=NO  ARCH=x86_64 CC="/Users/buildslave/jenkins/workspace/lldb-cmake-sanitized/lldb-build/bin/clang" DSYMUTIL="/Users/buildslave/jenkins/workspace/lldb-cmake-sanitized/lldb-build/./bin/dsymutil"  CLANG_MODULE_CACHE_DIR=/Users/buildslave/jenkins/workspace/lldb-cmake-sanitized/lldb-build/lldb-test-build.noindex/module-cache-clang/lldb-api 

Hide Details

Build Command Output: /Users/buildslave/jenkins/workspace/lldb-cmake-sanitized/lldb-build/bin/clang -std=c++11 -g -O0 -fno-builtin -isysroot "/Applications/Xcode.app/Contents/Developer/Platforms/MacOSX.platform/Developer/SDKs/MacOSX10.15.sdk" -arch x86_64 -I/Users/buildslave/jenkins/workspace/lldb-cmake-sanitized/llvm-project/lldb/packages/Python/lldbsuite/test/make/../../../../../include -I/Users/buildslave/jenkins/workspace/lldb-cmake-sanitized/llvm-project/lldb/test/API/python_api/lldbutil/iter -I/Users/buildslave/jenkins/workspace/lldb-cmake-sanitized/llvm-project/lldb/packages/Python/lldbsuite/test/make -include /Users/buildslave/jenkins/workspace/lldb-cmake-sanitized/llvm-project/lldb/packages/Python/lldbsuite/test/make/test_common.h -fno-limit-debug-info -D__STDC_LIMIT_MACROS --driver-mode=g++ -c -o main.o /Users/buildslave/jenkins/workspace/lldb-cmake-sanitized/llvm-project/lldb/test/API/python_api/lldbutil/iter/main.cpp In file included from /Users/buildslave/jenkins/workspace/lldb-cmake-sanitized/llvm-project/lldb/test/API/python_api/lldbutil/iter/main.cpp:9: In file included from /Users/buildslave/jenkins/workspace/lldb-cmake-sanitized/lldb-build/bin/../include/c++/v1/random:1645: In file included from /Users/buildslave/jenkins/workspace/lldb-cmake-sanitized/lldb-build/bin/../include/c++/v1/istream:163: /Users/buildslave/jenkins/workspace/lldb-cmake-sanitized/lldb-build/bin/../include/c++/v1/ostream:1038:45: error: no template named 'enable_if_t'; did you mean 'enable_if'? template <class _Stream, class _Tp, class = enable_if_t< ^ /Users/buildslave/jenkins/workspace/lldb-cmake-sanitized/lldb-build/bin/../include/c++/v1/type_traits:538:63: note: 'enable_if' declared here template <bool, class _Tp = void> struct _LIBCPP_TEMPLATE_VIS enable_if {}; ^ In file included from /Users/buildslave/jenkins/workspace/lldb-cmake-sanitized/llvm-project/lldb/test/API/python_api/lldbutil/iter/main.cpp:9: In file included from /Users/buildslave/jenkins/workspace/lldb-cmake-sanitized/lldb-build/bin/../include/c++/v1/random:1645: /Users/buildslave/jenkins/workspace/lldb-cmake-sanitized/lldb-build/bin/../include/c++/v1/istream:1389:45: error: no template named 'enable_if_t'; did you mean 'enable_if'? template <class _Stream, class _Tp, class = enable_if_t< ^ /Users/buildslave/jenkins/workspace/lldb-cmake-sanitized/lldb-build/bin/../include/c++/v1/type_traits:538:63: note: 'enable_if' declared here template <bool, class _Tp = void> struct _LIBCPP_TEMPLATE_VIS enable_if {}; ^ 2 errors generated. make: *** [main.o] Error 1

Hide Details

Test Directory: /Users/buildslave/jenkins/workspace/lldb-cmake-sanitized/llvm-project/lldb/test/API/python_api/lldbutil/iter ====================================================================== ERROR: test_lldb_iter_module_gmodules (TestLLDBIterator.LLDBIteratorTestCase) Test module_iter works correctly for SBTarget -> SBModule. ---------------------------------------------------------------------- Error when building test subject.

Hide Details

Build Command: make VPATH=/Users/buildslave/jenkins/workspace/lldb-cmake-sanitized/llvm-project/lldb/test/API/python_api/lldbutil/iter -C /Users/buildslave/jenkins/workspace/lldb-cmake-sanitized/lldb-build/lldb-test-build.noindex/python_api/lldbutil/iter/TestLLDBIterator.test_lldb_iter_module_gmodules -I /Users/buildslave/jenkins/workspace/lldb-cmake-sanitized/llvm-project/lldb/test/API/python_api/lldbutil/iter -I /Users/buildslave/jenkins/workspace/lldb-cmake-sanitized/llvm-project/lldb/packages/Python/lldbsuite/test/make -f /Users/buildslave/jenkins/workspace/lldb-cmake-sanitized/llvm-project/lldb/test/API/python_api/lldbutil/iter/Makefile MAKE_DSYM=NO MAKE_GMODULES=YES ARCH=x86_64 CC="/Users/buildslave/jenkins/workspace/lldb-cmake-sanitized/lldb-build/bin/clang" DSYMUTIL="/Users/buildslave/jenkins/workspace/lldb-cmake-sanitized/lldb-build/./bin/dsymutil" CLANG_MODULE_CACHE_DIR=/Users/buildslave/jenkins/workspace/lldb-cmake-sanitized/lldb-build/lldb-test-build.noindex/module-cache-clang/lldb-api

Hide Details

Build Command Output: While building module 'std' imported from /Users/buildslave/jenkins/workspace/lldb-cmake-sanitized/lldb-build/bin/../include/c++/v1/stdint.h:123: In file included from <module-includes>:31: In file included from /Users/buildslave/jenkins/workspace/lldb-cmake-sanitized/lldb-build/bin/../include/c++/v1/complex.h:28: In file included from /Users/buildslave/jenkins/workspace/lldb-cmake-sanitized/lldb-build/bin/../include/c++/v1/ccomplex:20: In file included from /Users/buildslave/jenkins/workspace/lldb-cmake-sanitized/lldb-build/bin/../include/c++/v1/complex:247: In file included from /Users/buildslave/jenkins/workspace/lldb-cmake-sanitized/lldb-build/bin/../include/c++/v1/sstream:173: /Users/buildslave/jenkins/workspace/lldb-cmake-sanitized/lldb-build/bin/../include/c++/v1/ostream:1038:45: error: no template named 'enable_if_t'; did you mean 'enable_if'? template <class _Stream, class _Tp, class = enable_if_t< ^ /Users/buildslave/jenkins/workspace/lldb-cmake-sanitized/lldb-build/bin/../include/c++/v1/type_traits:538:63: note: 'enable_if' declared here template <bool, class _Tp = void> struct _LIBCPP_TEMPLATE_VIS enable_if {}; ^ While building module 'std' imported from /Users/buildslave/jenkins/workspace/lldb-cmake-sanitized/lldb-build/bin/../include/c++/v1/stdint.h:123: In file included from <module-includes>:31: In file included from /Users/buildslave/jenkins/workspace/lldb-cmake-sanitized/lldb-build/bin/../include/c++/v1/complex.h:28: In file included from /Users/buildslave/jenkins/workspace/lldb-cmake-sanitized/lldb-build/bin/../include/c++/v1/ccomplex:20: In file included from /Users/buildslave/jenkins/workspace/lldb-cmake-sanitized/lldb-build/bin/../include/c++/v1/complex:247: In file included from /Users/buildslave/jenkins/workspace/lldb-cmake-sanitized/lldb-build/bin/../include/c++/v1/sstream:174: /Users/buildslave/jenkins/workspace/lldb-cmake-sanitized/lldb-build/bin/../include/c++/v1/istream:1389:45: error: no template named 'enable_if_t'; did you mean 'enable_if'? template <class _Stream, class _Tp, class = enable_if_t< ^ /Users/buildslave/jenkins/workspace/lldb-cmake-sanitized/lldb-build/bin/../include/c++/v1/type_traits:538:63: note: 'enable_if' declared here template <bool, class _Tp = void> struct _LIBCPP_TEMPLATE_VIS enable_if {}; ^ In file included from /Users/buildslave/jenkins/workspace/lldb-cmake-sanitized/llvm-project/lldb/test/API/python_api/lldbutil/iter/main.cpp:3: /Users/buildslave/jenkins/workspace/lldb-cmake-sanitized/lldb-build/bin/../include/c++/v1/stdint.h:123:15: fatal error: could not build module 'std' #include_next <stdint.h> ~~~~~~~~~~~~~^ 3 errors generated. /Users/buildslave/jenkins/workspace/lldb-cmake-sanitized/lldb-build/bin/clang -fmodules -gmodules -fmodules-cache-path=/Users/buildslave/jenkins/workspace/lldb-cmake-sanitized/lldb-build/lldb-test-build.noindex/module-cache-clang/lldb-api -gmodules -fcxx-modules -std=c++11 -g -O0 -fno-builtin -isysroot "/Applications/Xcode.app/Contents/Developer/Platforms/MacOSX.platform/Developer/SDKs/MacOSX10.15.sdk" -arch x86_64 -I/Users/buildslave/jenkins/workspace/lldb-cmake-sanitized/llvm-project/lldb/packages/Python/lldbsuite/test/make/../../../../../include -I/Users/buildslave/jenkins/workspace/lldb-cmake-sanitized/llvm-project/lldb/test/API/python_api/lldbutil/iter -I/Users/buildslave/jenkins/workspace/lldb-cmake-sanitized/llvm-project/lldb/packages/Python/lldbsuite/test/make -include /Users/buildslave/jenkins/workspace/lldb-cmake-sanitized/llvm-project/lldb/packages/Python/lldbsuite/test/make/test_common.h -fno-limit-debug-info -fmodules -gmodules -fmodules-cache-path=/Users/buildslave/jenkins/workspace/lldb-cmake-sanitized/lldb-build/lldb-test-build.noindex/module-cache-clang/lldb-api -gmodules -fcxx-modules -D__STDC_LIMIT_MACROS --driver-mode=g++ -c -o main.o /Users/buildslave/jenkins/workspace/lldb-cmake-sanitized/llvm-project/lldb/test/API/python_api/lldbutil/iter/main.cpp While building module 'std' imported from /Users/buildslave/jenkins/workspace/lldb-cmake-sanitized/lldb-build/bin/../include/c++/v1/stdint.h:123: In file included from <module-includes>:31: In file included from /Users/buildslave/jenkins/workspace/lldb-cmake-sanitized/lldb-build/bin/../include/c++/v1/complex.h:28: In file included from /Users/buildslave/jenkins/workspace/lldb-cmake-sanitized/lldb-build/bin/../include/c++/v1/ccomplex:20: In file included from /Users/buildslave/jenkins/workspace/lldb-cmake-sanitized/lldb-build/bin/../include/c++/v1/complex:247: In file included from /Users/buildslave/jenkins/workspace/lldb-cmake-sanitized/lldb-build/bin/../include/c++/v1/sstream:173: /Users/buildslave/jenkins/workspace/lldb-cmake-sanitized/lldb-build/bin/../include/c++/v1/ostream:1038:45: error: no template named 'enable_if_t'; did you mean 'enable_if'? template <class _Stream, class _Tp, class = enable_if_t< ^ /Users/buildslave/jenkins/workspace/lldb-cmake-sanitized/lldb-build/bin/../include/c++/v1/type_traits:538:63: note: 'enable_if' declared here template <bool, class _Tp = void> struct _LIBCPP_TEMPLATE_VIS enable_if {}; ^ While building module 'std' imported from /Users/buildslave/jenkins/workspace/lldb-cmake-sanitized/lldb-build/bin/../include/c++/v1/stdint.h:123: In file included from <module-includes>:31: In file included from /Users/buildslave/jenkins/workspace/lldb-cmake-sanitized/lldb-build/bin/../include/c++/v1/complex.h:28: In file included from /Users/buildslave/jenkins/workspace/lldb-cmake-sanitized/lldb-build/bin/../include/c++/v1/ccomplex:20: In file included from /Users/buildslave/jenkins/workspace/lldb-cmake-sanitized/lldb-build/bin/../include/c++/v1/complex:247: In file included from /Users/buildslave/jenkins/workspace/lldb-cmake-sanitized/lldb-build/bin/../include/c++/v1/sstream:174: /Users/buildslave/jenkins/workspace/lldb-cmake-sanitized/lldb-build/bin/../include/c++/v1/istream:1389:45: error: no template named 'enable_if_t'; did you mean 'enable_if'? template <class _Stream, class _Tp, class = enable_if_t< ^ /Users/buildslave/jenkins/workspace/lldb-cmake-sanitized/lldb-build/bin/../include/c++/v1/type_traits:538:63: note: 'enable_if' declared here template <bool, class _Tp = void> struct _LIBCPP_TEMPLATE_VIS enable_if {}; ^ In file included from /Users/buildslave/jenkins/workspace/lldb-cmake-sanitized/llvm-project/lldb/test/API/python_api/lldbutil/iter/main.cpp:3: /Users/buildslave/jenkins/workspace/lldb-cmake-sanitized/lldb-build/bin/../include/c++/v1/stdint.h:123:15: fatal error: could not build module 'std' #include_next <stdint.h> ~~~~~~~~~~~~~^ 3 errors generated. make: *** [main.o] Error 1

Hide Details

Test Directory: /Users/buildslave/jenkins/workspace/lldb-cmake-sanitized/llvm-project/lldb/test/API/python_api/lldbutil/iter ---------------------------------------------------------------------- Ran 12 tests in 133.499s

Hide Details

RESULT: FAILED (0 passes, 0 failures, 9 errors, 3 skipped, 0 expected failures, 0 unexpected successes)

Hide Details

--

Hide Details

******************** PASS: lldb-unit :: Utility/./UtilityTests/ArgsTest.TestArgv (2055 of 2139) PASS: lldb-unit :: Host/./HostTests/FileSystemTest.FileAndDirectoryComponents (2056 of 2139) PASS: lldb-shell :: SymbolFile/NativePDB/bitfields.cpp (2057 of 2139) UNSUPPORTED: lldb-shell :: Minidump/Windows/arm-fp-unwind.test (2058 of 2139) PASS: lldb-api :: lang/objc/ivar-IMP/TestObjCiVarIMP.py (2059 of 2139) PASS: lldb-unit :: SymbolFile/NativePDB/./SymbolFileNativePDBTests/PDBFPOProgramToDWARFExpressionTests.MultipleDependentAssignments (2060 of 2139) PASS: lldb-unit :: ScriptInterpreter/Python/./ScriptInterpreterPythonTests/PythonDataObjectsTest.TestGlobalNameResolutionWithDot (2061 of 2139) PASS: lldb-shell :: SymbolFile/NativePDB/ast-types.cpp (2062 of 2139) PASS: lldb-shell :: ObjectFile/ELF/PT_LOAD-empty.yaml (2063 of 2139) PASS: lldb-unit :: Utility/./UtilityTests/BinaryStreamTest.PutULEB128FourBytes (2064 of 2139) PASS: lldb-unit :: Host/./HostTests/NativeProcessProtocolTest.SetBreakpoint (2065 of 2139) UNSUPPORTED: lldb-api :: tools/intel-features/intel-pt/test/TestIntelPTSimpleBinary.py (2066 of 2139) PASS: lldb-unit :: Utility/./UtilityTests/StringListTest.AppendList (2067 of 2139) PASS: lldb-unit :: Utility/./UtilityTests/StringListTest.JoinSingle (2068 of 2139) PASS: lldb-shell :: SymbolFile/DWARF/find-basic-variable.cpp (2069 of 2139) FAIL: lldb-api :: functionalities/deleted-executable/TestDeletedExecutable.py (2070 of 2139) ******************** TEST 'lldb-api :: functionalities/deleted-executable/TestDeletedExecutable.py' FAILED ******************** Script: -- /Users/buildslave/jenkins/workspace/lldb-cmake-sanitized/lldb-build/lldb-test-build.noindex/copied-python /Users/buildslave/jenkins/workspace/lldb-cmake-sanitized/llvm-project/lldb/test/API/dotest.py -s /Users/buildslave/jenkins/workspace/lldb-cmake-sanitized/lldb-build/lldb-test-traces -S nm -u CXXFLAGS -u CFLAGS --codesign-identity lldb_codesign --server /Users/buildslave/jenkins/workspace/lldb-cmake-sanitized/lldb-build/./bin/debugserver --arch x86_64 --build-dir /Users/buildslave/jenkins/workspace/lldb-cmake-sanitized/lldb-build/lldb-test-build.noindex -s=/Users/buildslave/jenkins/workspace/lldb-cmake-sanitized/test/logs -t --env TERM=vt100 --env LLVM_LIBS_DIR=/Users/buildslave/jenkins/workspace/lldb-cmake-sanitized/lldb-build/./lib --inferior-env ASAN_OPTIONS=detect_stack_use_after_return=1 --inferior-env DYLD_INSERT_LIBRARIES=/Users/buildslave/jenkins/workspace/lldb-cmake-sanitized/host-compiler/lib/clang/12.0.0/lib/darwin/libclang_rt.asan_osx_dynamic.dylib --arch x86_64 --build-dir /Users/buildslave/jenkins/workspace/lldb-cmake-sanitized/lldb-build/lldb-test-build.noindex --lldb-module-cache-dir /Users/buildslave/jenkins/workspace/lldb-cmake-sanitized/lldb-build/lldb-test-build.noindex/module-cache-lldb/lldb-api --clang-module-cache-dir /Users/buildslave/jenkins/workspace/lldb-cmake-sanitized/lldb-build/lldb-test-build.noindex/module-cache-clang/lldb-api --executable /Users/buildslave/jenkins/workspace/lldb-cmake-sanitized/lldb-build/./bin/lldb --compiler /Users/buildslave/jenkins/workspace/lldb-cmake-sanitized/lldb-build/./bin/clang --dsymutil /Users/buildslave/jenkins/workspace/lldb-cmake-sanitized/lldb-build/./bin/dsymutil --filecheck /Users/buildslave/jenkins/workspace/lldb-cmake-sanitized/lldb-build/./bin/FileCheck --yaml2obj /Users/buildslave/jenkins/workspace/lldb-cmake-sanitized/lldb-build/./bin/yaml2obj --lldb-libs-dir /Users/buildslave/jenkins/workspace/lldb-cmake-sanitized/lldb-build/./lib /Users/buildslave/jenkins/workspace/lldb-cmake-sanitized/llvm-project/lldb/test/API/functionalities/deleted-executable -p TestDeletedExecutable.py -- Exit Code: 1

Hide Details

Command Output (stdout): -- lldb version 12.0.99 clang revision d6ac649ccda289ecc2d2c0cb51892d57e8ec328c llvm revision d6ac649ccda289ecc2d2c0cb51892d57e8ec328c libstdcxx tests will not be run because: Don't know how to build with libstdcxx on macosx Skipping following debug info categories: ['dwo']

Hide Details

-- Command Output (stderr): --

Hide Details

Session logs for test failures/errors/unexpected successes will go into directory '/Users/buildslave/jenkins/workspace/lldb-cmake-sanitized/test/logs' Change dir to: /Users/buildslave/jenkins/workspace/lldb-cmake-sanitized/llvm-project/lldb/test/API/functionalities/deleted-executable runCmd: settings clear -all output:

Hide Details

runCmd: settings set symbols.enable-external-lookup false output:

Hide Details

runCmd: settings set target.inherit-tcc true output:

Hide Details

runCmd: settings set target.auto-apply-fixits false output:

Hide Details

runCmd: settings set plugin.process.gdb-remote.packet-timeout 60 output:

Hide Details

runCmd: settings set symbols.clang-modules-cache-path "/Users/buildslave/jenkins/workspace/lldb-cmake-sanitized/lldb-build/lldb-test-build.noindex/module-cache-lldb/lldb-api" output:

Hide Details

runCmd: settings set use-color false output:

Hide Details

runCmd: setting set target.prefer-dynamic-value no-dynamic-values output:

Hide Details

runCmd: settings set target.env-vars ASAN_OPTIONS=detect_stack_use_after_return=1 DYLD_INSERT_LIBRARIES=/Users/buildslave/jenkins/workspace/lldb-cmake-sanitized/host-compiler/lib/clang/12.0.0/lib/darwin/libclang_rt.asan_osx_dynamic.dylib output:

Hide Details

FAIL: LLDB (/Users/buildslave/jenkins/workspace/lldb-cmake-sanitized/lldb-build/bin/clang-x86_64) :: test (TestDeletedExecutable.TestDeletedExecutable) Restore dir to: /Users/buildslave/jenkins/workspace/lldb-cmake-sanitized/lldb-build/tools/lldb/test ====================================================================== ERROR: test (TestDeletedExecutable.TestDeletedExecutable) ---------------------------------------------------------------------- Error when building test subject.

Hide Details

Build Command: make VPATH=/Users/buildslave/jenkins/workspace/lldb-cmake-sanitized/llvm-project/lldb/test/API/functionalities/deleted-executable -C /Users/buildslave/jenkins/workspace/lldb-cmake-sanitized/lldb-build/lldb-test-build.noindex/functionalities/deleted-executable/TestDeletedExecutable.test -I /Users/buildslave/jenkins/workspace/lldb-cmake-sanitized/llvm-project/lldb/test/API/functionalities/deleted-executable -I /Users/buildslave/jenkins/workspace/lldb-cmake-sanitized/llvm-project/lldb/packages/Python/lldbsuite/test/make -f /Users/buildslave/jenkins/workspace/lldb-cmake-sanitized/llvm-project/lldb/test/API/functionalities/deleted-executable/Makefile all ARCH=x86_64 CC="/Users/buildslave/jenkins/workspace/lldb-cmake-sanitized/lldb-build/bin/clang" DSYMUTIL="/Users/buildslave/jenkins/workspace/lldb-cmake-sanitized/lldb-build/./bin/dsymutil" CLANG_MODULE_CACHE_DIR=/Users/buildslave/jenkins/workspace/lldb-cmake-sanitized/lldb-build/lldb-test-build.noindex/module-cache-clang/lldb-api

Hide Details

Build Command Output: /Users/buildslave/jenkins/workspace/lldb-cmake-sanitized/lldb-build/bin/clang -std=c++11 -g -O0 -fno-builtin -isysroot "/Applications/Xcode.app/Contents/Developer/Platforms/MacOSX.platform/Developer/SDKs/MacOSX10.15.sdk" -arch x86_64 -I/Users/buildslave/jenkins/workspace/lldb-cmake-sanitized/llvm-project/lldb/packages/Python/lldbsuite/test/make/../../../../../include -I/Users/buildslave/jenkins/workspace/lldb-cmake-sanitized/llvm-project/lldb/test/API/functionalities/deleted-executable -I/Users/buildslave/jenkins/workspace/lldb-cmake-sanitized/llvm-project/lldb/packages/Python/lldbsuite/test/make -include /Users/buildslave/jenkins/workspace/lldb-cmake-sanitized/llvm-project/lldb/packages/Python/lldbsuite/test/make/test_common.h -fno-limit-debug-info --driver-mode=g++ -c -o main.o /Users/buildslave/jenkins/workspace/lldb-cmake-sanitized/llvm-project/lldb/test/API/functionalities/deleted-executable/main.cpp In file included from /Users/buildslave/jenkins/workspace/lldb-cmake-sanitized/llvm-project/lldb/test/API/functionalities/deleted-executable/main.cpp:2: In file included from /Users/buildslave/jenkins/workspace/lldb-cmake-sanitized/lldb-build/bin/../include/c++/v1/fstream:183: /Users/buildslave/jenkins/workspace/lldb-cmake-sanitized/lldb-build/bin/../include/c++/v1/ostream:1038:45: error: no template named 'enable_if_t'; did you mean 'enable_if'? template <class _Stream, class _Tp, class = enable_if_t< ^ /Users/buildslave/jenkins/workspace/lldb-cmake-sanitized/lldb-build/bin/../include/c++/v1/type_traits:538:63: note: 'enable_if' declared here template <bool, class _Tp = void> struct _LIBCPP_TEMPLATE_VIS enable_if {}; ^ In file included from /Users/buildslave/jenkins/workspace/lldb-cmake-sanitized/llvm-project/lldb/test/API/functionalities/deleted-executable/main.cpp:2: In file included from /Users/buildslave/jenkins/workspace/lldb-cmake-sanitized/lldb-build/bin/../include/c++/v1/fstream:184: /Users/buildslave/jenkins/workspace/lldb-cmake-sanitized/lldb-build/bin/../include/c++/v1/istream:1389:45: error: no template named 'enable_if_t'; did you mean 'enable_if'? template <class _Stream, class _Tp, class = enable_if_t< ^ /Users/buildslave/jenkins/workspace/lldb-cmake-sanitized/lldb-build/bin/../include/c++/v1/type_traits:538:63: note: 'enable_if' declared here template <bool, class _Tp = void> struct _LIBCPP_TEMPLATE_VIS enable_if {}; ^ 2 errors generated. make: *** [main.o] Error 1

Hide Details

Test Directory: /Users/buildslave/jenkins/workspace/lldb-cmake-sanitized/llvm-project/lldb/test/API/functionalities/deleted-executable ---------------------------------------------------------------------- Ran 1 test in 8.883s

Hide Details

RESULT: FAILED (0 passes, 0 failures, 1 errors, 0 skipped, 0 expected failures, 0 unexpected successes)

Hide Details

--

Hide Details

******************** PASS: lldb-shell :: SymbolFile/DWARF/DW_TAG_variable-invalid_location.s (2071 of 2139) PASS: lldb-unit :: Core/./LLDBCoreTests/UniqueCStringMap.NoDefaultConstructor (2072 of 2139) PASS: lldb-unit :: Language/Highlighting/./HighlighterTests/HighlighterTest.ClangCommas (2073 of 2139) UNSUPPORTED: lldb-shell :: ScriptInterpreter/Lua/persistent_state.test (2074 of 2139) UNSUPPORTED: lldb-api :: commands/gui/basic/TestGuiBasic.py (2075 of 2139) PASS: lldb-api :: functionalities/unwind/sigtramp/TestSigtrampUnwind.py (2076 of 2139) PASS: lldb-api :: lang/objc/modules-cache/TestClangModulesCache.py (2077 of 2139) PASS: lldb-unit :: Utility/./UtilityTests/BinaryStreamTest.PutSLEB128FourBytes (2078 of 2139) FAIL: lldb-api :: commands/expression/call-function/TestCallStopAndContinue.py (2079 of 2139) ******************** TEST 'lldb-api :: commands/expression/call-function/TestCallStopAndContinue.py' FAILED ******************** Script: -- /Users/buildslave/jenkins/workspace/lldb-cmake-sanitized/lldb-build/lldb-test-build.noindex/copied-python /Users/buildslave/jenkins/workspace/lldb-cmake-sanitized/llvm-project/lldb/test/API/dotest.py -s /Users/buildslave/jenkins/workspace/lldb-cmake-sanitized/lldb-build/lldb-test-traces -S nm -u CXXFLAGS -u CFLAGS --codesign-identity lldb_codesign --server /Users/buildslave/jenkins/workspace/lldb-cmake-sanitized/lldb-build/./bin/debugserver --arch x86_64 --build-dir /Users/buildslave/jenkins/workspace/lldb-cmake-sanitized/lldb-build/lldb-test-build.noindex -s=/Users/buildslave/jenkins/workspace/lldb-cmake-sanitized/test/logs -t --env TERM=vt100 --env LLVM_LIBS_DIR=/Users/buildslave/jenkins/workspace/lldb-cmake-sanitized/lldb-build/./lib --inferior-env ASAN_OPTIONS=detect_stack_use_after_return=1 --inferior-env DYLD_INSERT_LIBRARIES=/Users/buildslave/jenkins/workspace/lldb-cmake-sanitized/host-compiler/lib/clang/12.0.0/lib/darwin/libclang_rt.asan_osx_dynamic.dylib --arch x86_64 --build-dir /Users/buildslave/jenkins/workspace/lldb-cmake-sanitized/lldb-build/lldb-test-build.noindex --lldb-module-cache-dir /Users/buildslave/jenkins/workspace/lldb-cmake-sanitized/lldb-build/lldb-test-build.noindex/module-cache-lldb/lldb-api --clang-module-cache-dir /Users/buildslave/jenkins/workspace/lldb-cmake-sanitized/lldb-build/lldb-test-build.noindex/module-cache-clang/lldb-api --executable /Users/buildslave/jenkins/workspace/lldb-cmake-sanitized/lldb-build/./bin/lldb --compiler /Users/buildslave/jenkins/workspace/lldb-cmake-sanitized/lldb-build/./bin/clang --dsymutil /Users/buildslave/jenkins/workspace/lldb-cmake-sanitized/lldb-build/./bin/dsymutil --filecheck /Users/buildslave/jenkins/workspace/lldb-cmake-sanitized/lldb-build/./bin/FileCheck --yaml2obj /Users/buildslave/jenkins/workspace/lldb-cmake-sanitized/lldb-build/./bin/yaml2obj --lldb-libs-dir /Users/buildslave/jenkins/workspace/lldb-cmake-sanitized/lldb-build/./lib /Users/buildslave/jenkins/workspace/lldb-cmake-sanitized/llvm-project/lldb/test/API/commands/expression/call-function -p TestCallStopAndContinue.py -- Exit Code: 1

Hide Details

Command Output (stdout): -- lldb version 12.0.99 clang revision d6ac649ccda289ecc2d2c0cb51892d57e8ec328c llvm revision d6ac649ccda289ecc2d2c0cb51892d57e8ec328c libstdcxx tests will not be run because: Don't know how to build with libstdcxx on macosx Skipping following debug info categories: ['dwo']

Hide Details

-- Command Output (stderr): --

Hide Details

Session logs for test failures/errors/unexpected successes will go into directory '/Users/buildslave/jenkins/workspace/lldb-cmake-sanitized/test/logs' Change dir to: /Users/buildslave/jenkins/workspace/lldb-cmake-sanitized/llvm-project/lldb/test/API/commands/expression/call-function runCmd: settings clear -all output:

Hide Details

runCmd: settings set symbols.enable-external-lookup false output:

Hide Details

runCmd: settings set target.inherit-tcc true output:

Hide Details

runCmd: settings set target.auto-apply-fixits false output:

Hide Details

runCmd: settings set plugin.process.gdb-remote.packet-timeout 60 output:

Hide Details

runCmd: settings set symbols.clang-modules-cache-path "/Users/buildslave/jenkins/workspace/lldb-cmake-sanitized/lldb-build/lldb-test-build.noindex/module-cache-lldb/lldb-api" output:

Hide Details

runCmd: settings set use-color false output:

Hide Details

runCmd: setting set target.prefer-dynamic-value no-dynamic-values output:

Hide Details

runCmd: settings set target.env-vars ASAN_OPTIONS=detect_stack_use_after_return=1 DYLD_INSERT_LIBRARIES=/Users/buildslave/jenkins/workspace/lldb-cmake-sanitized/host-compiler/lib/clang/12.0.0/lib/darwin/libclang_rt.asan_osx_dynamic.dylib output:

Hide Details

runCmd: settings set target.env-vars ASAN_OPTIONS=detect_stack_use_after_return=1 DYLD_INSERT_LIBRARIES=/Users/buildslave/jenkins/workspace/lldb-cmake-sanitized/host-compiler/lib/clang/12.0.0/lib/darwin/libclang_rt.asan_osx_dynamic.dylib output:

Hide Details

runCmd: breakpoint set -f "main.cpp" -l 10 output: Breakpoint 2: where = a.out`returnsFive() + 4 at main.cpp:10:8, address = 0x0000000100000a94

Hide Details

Hide Details

Expecting pattern: ^Breakpoint (?P<bpno>[0-9]+): (?P<num_locations>[0-9]+) locations\.$ Not matched

Hide Details

Expecting pattern: ^Breakpoint (?P<bpno>[0-9]+): (?P<num_locations>no) locations \(pending\)\. Not matched

Hide Details

Expecting pattern: ^Breakpoint (?P<bpno>[0-9]+): where = (?P<module>.*)`(?P<symbol>[+\-]{0,1}[^+]+)( \+ (?P<offset>[0-9]+)){0,1}( \[inlined\] (?P<inline_symbol>.*)){0,1} at (?P<file>[^:]+):(?P<line_no>[0-9]+)(?P<column>(:[0-9]+)?), address = (?P<address>0x[0-9a-fA-F]+)$ Matched

Hide Details

runCmd: expr -i false -- returnsFive() check of return status not required runCmd failed! error: Execution was interrupted, reason: breakpoint 2.1. The process has been left at the point where it was interrupted, use "thread return -x" to return to the state before expression evaluation.

Hide Details

Hide Details

Ran command: "expr -i false -- returnsFive()"

Hide Details

Got output: error: Execution was interrupted, reason: breakpoint 2.1. The process has been left at the point where it was interrupted, use "thread return -x" to return to the state before expression evaluation.

Hide Details

Expecting sub string: "Execution was interrupted, reason: breakpoint" (was found)

Hide Details

runCmd: continue output: Process 19130 resuming Process 19130 stopped * thread #1, queue = 'com.apple.main-thread', stop reason = User Expression thread plan Completed expression: (Five) $0 = (number = 5, name = "five")

Hide Details

frame #0: 0x0000000100000b9d a.out`main(argc=1, argv=0x00007ffeefbff7f0) at main.cpp:33:21 30 int main(int argc, char const *argv[]) { 31 std::string str = "Hello world"; 32 Five main_five = returnsFive(); -> 33 return strlen(str.c_str()); // break here ^ 34 }

Hide Details

Hide Details

Hide Details

runCmd: thread list output: Process 19130 stopped * thread #1: tid = 0x44d585, 0x0000000100000b9d a.out`main(argc=1, argv=0x00007ffeefbff7f0) at main.cpp:33:21, queue = 'com.apple.main-thread', stop reason = User Expression thread plan Completed expression: (Five) $0 = (number = 5, name = "five")

Hide Details

Hide Details

Hide Details

Ran command: "thread list"

Hide Details

Got output: Process 19130 stopped * thread #1: tid = 0x44d585, 0x0000000100000b9d a.out`main(argc=1, argv=0x00007ffeefbff7f0) at main.cpp:33:21, queue = 'com.apple.main-thread', stop reason = User Expression thread plan Completed expression: (Five) $0 = (number = 5, name = "five")

Hide Details

Hide Details

Expecting sub string: "stop reason = User Expression thread plan" (was found) Expecting sub string: "Completed expression: (Five) $0 = (number = 5, name = "five")" (was found)

Hide Details

<bound method SBProcess.Kill of <lldb.SBProcess; proxy of <Swig Object of type 'lldb::SBProcess *' at 0x1273a5390> >>: success

Hide Details

PASS: LLDB (/Users/buildslave/jenkins/workspace/lldb-cmake-sanitized/lldb-build/bin/clang-x86_64) :: test_dsym (TestCallStopAndContinue.ExprCommandCallStopContinueTestCase) runCmd: settings clear -all output:

Hide Details

runCmd: settings set symbols.enable-external-lookup false output:

Hide Details

runCmd: settings set target.inherit-tcc true output:

Hide Details

runCmd: settings set target.auto-apply-fixits false output:

Hide Details

runCmd: settings set plugin.process.gdb-remote.packet-timeout 60 output:

Hide Details

runCmd: settings set symbols.clang-modules-cache-path "/Users/buildslave/jenkins/workspace/lldb-cmake-sanitized/lldb-build/lldb-test-build.noindex/module-cache-lldb/lldb-api" output:

Hide Details

runCmd: settings set use-color false output:

Hide Details

runCmd: setting set target.prefer-dynamic-value no-dynamic-values output:

Hide Details

runCmd: settings set target.env-vars ASAN_OPTIONS=detect_stack_use_after_return=1 DYLD_INSERT_LIBRARIES=/Users/buildslave/jenkins/workspace/lldb-cmake-sanitized/host-compiler/lib/clang/12.0.0/lib/darwin/libclang_rt.asan_osx_dynamic.dylib output:

Hide Details

runCmd: settings set target.env-vars ASAN_OPTIONS=detect_stack_use_after_return=1 DYLD_INSERT_LIBRARIES=/Users/buildslave/jenkins/workspace/lldb-cmake-sanitized/host-compiler/lib/clang/12.0.0/lib/darwin/libclang_rt.asan_osx_dynamic.dylib output:

Hide Details

runCmd: breakpoint set -f "main.cpp" -l 10 output: Breakpoint 2: where = a.out`returnsFive() + 4 at main.cpp:10:8, address = 0x0000000100000a94

Hide Details

Hide Details

Expecting pattern: ^Breakpoint (?P<bpno>[0-9]+): (?P<num_locations>[0-9]+) locations\.$ Not matched

Hide Details

Expecting pattern: ^Breakpoint (?P<bpno>[0-9]+): (?P<num_locations>no) locations \(pending\)\. Not matched

Hide Details

Expecting pattern: ^Breakpoint (?P<bpno>[0-9]+): where = (?P<module>.*)`(?P<symbol>[+\-]{0,1}[^+]+)( \+ (?P<offset>[0-9]+)){0,1}( \[inlined\] (?P<inline_symbol>.*)){0,1} at (?P<file>[^:]+):(?P<line_no>[0-9]+)(?P<column>(:[0-9]+)?), address = (?P<address>0x[0-9a-fA-F]+)$ Matched

Hide Details

runCmd: expr -i false -- returnsFive() check of return status not required runCmd failed! error: Execution was interrupted, reason: breakpoint 2.1. The process has been left at the point where it was interrupted, use "thread return -x" to return to the state before expression evaluation.

Hide Details

Hide Details

Ran command: "expr -i false -- returnsFive()"

Hide Details

Got output: error: Execution was interrupted, reason: breakpoint 2.1. The process has been left at the point where it was interrupted, use "thread return -x" to return to the state before expression evaluation.

Hide Details

Expecting sub string: "Execution was interrupted, reason: breakpoint" (was found)

Hide Details

runCmd: continue output: Process 19267 resuming Process 19267 stopped * thread #1, queue = 'com.apple.main-thread', stop reason = User Expression thread plan Completed expression: (Five) $0 = (number = 5, name = "five")

Hide Details

frame #0: 0x0000000100000b9d a.out`main(argc=1, argv=0x00007ffeefbff7f0) at main.cpp:33:21 30 int main(int argc, char const *argv[]) { 31 std::string str = "Hello world"; 32 Five main_five = returnsFive(); -> 33 return strlen(str.c_str()); // break here ^ 34 }

Hide Details

Hide Details

Hide Details

runCmd: thread list output: Process 19267 stopped * thread #1: tid = 0x44da2c, 0x0000000100000b9d a.out`main(argc=1, argv=0x00007ffeefbff7f0) at main.cpp:33:21, queue = 'com.apple.main-thread', stop reason = User Expression thread plan Completed expression: (Five) $0 = (number = 5, name = "five")

Hide Details

Hide Details

Hide Details

Ran command: "thread list"

Hide Details

Got output: Process 19267 stopped * thread #1: tid = 0x44da2c, 0x0000000100000b9d a.out`main(argc=1, argv=0x00007ffeefbff7f0) at main.cpp:33:21, queue = 'com.apple.main-thread', stop reason = User Expression thread plan Completed expression: (Five) $0 = (number = 5, name = "five")

Hide Details

Hide Details

Expecting sub string: "stop reason = User Expression thread plan" (was found) Expecting sub string: "Completed expression: (Five) $0 = (number = 5, name = "five")" (was found)

Hide Details

<bound method SBProcess.Kill of <lldb.SBProcess; proxy of <Swig Object of type 'lldb::SBProcess *' at 0x110f8f450> >>: success

Hide Details

PASS: LLDB (/Users/buildslave/jenkins/workspace/lldb-cmake-sanitized/lldb-build/bin/clang-x86_64) :: test_dwarf (TestCallStopAndContinue.ExprCommandCallStopContinueTestCase) UNSUPPORTED: LLDB (/Users/buildslave/jenkins/workspace/lldb-cmake-sanitized/lldb-build/bin/clang-x86_64) :: test_dwo (TestCallStopAndContinue.ExprCommandCallStopContinueTestCase) (test case does not fall in any category of interest for this run) runCmd: settings clear -all output:

Hide Details

runCmd: settings set symbols.enable-external-lookup false output:

Hide Details

runCmd: settings set target.inherit-tcc true output:

Hide Details

runCmd: settings set target.auto-apply-fixits false output:

Hide Details

runCmd: settings set plugin.process.gdb-remote.packet-timeout 60 output:

Hide Details

runCmd: settings set symbols.clang-modules-cache-path "/Users/buildslave/jenkins/workspace/lldb-cmake-sanitized/lldb-build/lldb-test-build.noindex/module-cache-lldb/lldb-api" output:

Hide Details

runCmd: settings set use-color false output:

Hide Details

runCmd: setting set target.prefer-dynamic-value no-dynamic-values output:

Hide Details

runCmd: settings set target.env-vars ASAN_OPTIONS=detect_stack_use_after_return=1 DYLD_INSERT_LIBRARIES=/Users/buildslave/jenkins/workspace/lldb-cmake-sanitized/host-compiler/lib/clang/12.0.0/lib/darwin/libclang_rt.asan_osx_dynamic.dylib output:

Hide Details

FAIL: LLDB (/Users/buildslave/jenkins/workspace/lldb-cmake-sanitized/lldb-build/bin/clang-x86_64) :: test_gmodules (TestCallStopAndContinue.ExprCommandCallStopContinueTestCase) Restore dir to: /Users/buildslave/jenkins/workspace/lldb-cmake-sanitized/lldb-build/tools/lldb/test ====================================================================== ERROR: test_gmodules (TestCallStopAndContinue.ExprCommandCallStopContinueTestCase) Test gathering result from interrupted function call. ---------------------------------------------------------------------- Error when building test subject.

Hide Details

Build Command: make VPATH=/Users/buildslave/jenkins/workspace/lldb-cmake-sanitized/llvm-project/lldb/test/API/commands/expression/call-function -C /Users/buildslave/jenkins/workspace/lldb-cmake-sanitized/lldb-build/lldb-test-build.noindex/commands/expression/call-function/TestCallStopAndContinue.test_gmodules -I /Users/buildslave/jenkins/workspace/lldb-cmake-sanitized/llvm-project/lldb/test/API/commands/expression/call-function -I /Users/buildslave/jenkins/workspace/lldb-cmake-sanitized/llvm-project/lldb/packages/Python/lldbsuite/test/make -f /Users/buildslave/jenkins/workspace/lldb-cmake-sanitized/llvm-project/lldb/test/API/commands/expression/call-function/Makefile MAKE_DSYM=NO MAKE_GMODULES=YES ARCH=x86_64 CC="/Users/buildslave/jenkins/workspace/lldb-cmake-sanitized/lldb-build/bin/clang" DSYMUTIL="/Users/buildslave/jenkins/workspace/lldb-cmake-sanitized/lldb-build/./bin/dsymutil" CLANG_MODULE_CACHE_DIR=/Users/buildslave/jenkins/workspace/lldb-cmake-sanitized/lldb-build/lldb-test-build.noindex/module-cache-clang/lldb-api

Hide Details

Build Command Output: While building module 'std' imported from /Users/buildslave/jenkins/workspace/lldb-cmake-sanitized/llvm-project/lldb/test/API/commands/expression/call-function/main.cpp:1: In file included from <module-includes>:31: In file included from /Users/buildslave/jenkins/workspace/lldb-cmake-sanitized/lldb-build/bin/../include/c++/v1/complex.h:28: In file included from /Users/buildslave/jenkins/workspace/lldb-cmake-sanitized/lldb-build/bin/../include/c++/v1/ccomplex:20: In file included from /Users/buildslave/jenkins/workspace/lldb-cmake-sanitized/lldb-build/bin/../include/c++/v1/complex:247: In file included from /Users/buildslave/jenkins/workspace/lldb-cmake-sanitized/lldb-build/bin/../include/c++/v1/sstream:173: /Users/buildslave/jenkins/workspace/lldb-cmake-sanitized/lldb-build/bin/../include/c++/v1/ostream:1038:45: error: no template named 'enable_if_t'; did you mean 'enable_if'? template <class _Stream, class _Tp, class = enable_if_t< ^ /Users/buildslave/jenkins/workspace/lldb-cmake-sanitized/lldb-build/bin/../include/c++/v1/type_traits:538:63: note: 'enable_if' declared here template <bool, class _Tp = void> struct _LIBCPP_TEMPLATE_VIS enable_if {}; ^ While building module 'std' imported from /Users/buildslave/jenkins/workspace/lldb-cmake-sanitized/llvm-project/lldb/test/API/commands/expression/call-function/main.cpp:1: In file included from <module-includes>:31: In file included from /Users/buildslave/jenkins/workspace/lldb-cmake-sanitized/lldb-build/bin/../include/c++/v1/complex.h:28: In file included from /Users/buildslave/jenkins/workspace/lldb-cmake-sanitized/lldb-build/bin/../include/c++/v1/ccomplex:20: In file included from /Users/buildslave/jenkins/workspace/lldb-cmake-sanitized/lldb-build/bin/../include/c++/v1/complex:247: In file included from /Users/buildslave/jenkins/workspace/lldb-cmake-sanitized/lldb-build/bin/../include/c++/v1/sstream:174: /Users/buildslave/jenkins/workspace/lldb-cmake-sanitized/lldb-build/bin/../include/c++/v1/istream:1389:45: error: no template named 'enable_if_t'; did you mean 'enable_if'? template <class _Stream, class _Tp, class = enable_if_t< ^ /Users/buildslave/jenkins/workspace/lldb-cmake-sanitized/lldb-build/bin/../include/c++/v1/type_traits:538:63: note: 'enable_if' declared here template <bool, class _Tp = void> struct _LIBCPP_TEMPLATE_VIS enable_if {}; ^ /Users/buildslave/jenkins/workspace/lldb-cmake-sanitized/llvm-project/lldb/test/API/commands/expression/call-function/main.cpp:1:10: fatal error: could not build module 'std' #include <cstring> ~~~~~~~~^ 3 errors generated. /Users/buildslave/jenkins/workspace/lldb-cmake-sanitized/lldb-build/bin/clang -fmodules -gmodules -fmodules-cache-path=/Users/buildslave/jenkins/workspace/lldb-cmake-sanitized/lldb-build/lldb-test-build.noindex/module-cache-clang/lldb-api -gmodules -fcxx-modules -std=c++11 -g -O0 -fno-builtin -isysroot "/Applications/Xcode.app/Contents/Developer/Platforms/MacOSX.platform/Developer/SDKs/MacOSX10.15.sdk" -arch x86_64 -I/Users/buildslave/jenkins/workspace/lldb-cmake-sanitized/llvm-project/lldb/packages/Python/lldbsuite/test/make/../../../../../include -I/Users/buildslave/jenkins/workspace/lldb-cmake-sanitized/llvm-project/lldb/test/API/commands/expression/call-function -I/Users/buildslave/jenkins/workspace/lldb-cmake-sanitized/llvm-project/lldb/packages/Python/lldbsuite/test/make -include /Users/buildslave/jenkins/workspace/lldb-cmake-sanitized/llvm-project/lldb/packages/Python/lldbsuite/test/make/test_common.h -fno-limit-debug-info -fmodules -gmodules -fmodules-cache-path=/Users/buildslave/jenkins/workspace/lldb-cmake-sanitized/lldb-build/lldb-test-build.noindex/module-cache-clang/lldb-api -gmodules -fcxx-modules --driver-mode=g++ -c -o main.o /Users/buildslave/jenkins/workspace/lldb-cmake-sanitized/llvm-project/lldb/test/API/commands/expression/call-function/main.cpp While building module 'std' imported from /Users/buildslave/jenkins/workspace/lldb-cmake-sanitized/llvm-project/lldb/test/API/commands/expression/call-function/main.cpp:1: In file included from <module-includes>:31: In file included from /Users/buildslave/jenkins/workspace/lldb-cmake-sanitized/lldb-build/bin/../include/c++/v1/complex.h:28: In file included from /Users/buildslave/jenkins/workspace/lldb-cmake-sanitized/lldb-build/bin/../include/c++/v1/ccomplex:20: In file included from /Users/buildslave/jenkins/workspace/lldb-cmake-sanitized/lldb-build/bin/../include/c++/v1/complex:247: In file included from /Users/buildslave/jenkins/workspace/lldb-cmake-sanitized/lldb-build/bin/../include/c++/v1/sstream:173: /Users/buildslave/jenkins/workspace/lldb-cmake-sanitized/lldb-build/bin/../include/c++/v1/ostream:1038:45: error: no template named 'enable_if_t'; did you mean 'enable_if'? template <class _Stream, class _Tp, class = enable_if_t< ^ /Users/buildslave/jenkins/workspace/lldb-cmake-sanitized/lldb-build/bin/../include/c++/v1/type_traits:538:63: note: 'enable_if' declared here template <bool, class _Tp = void> struct _LIBCPP_TEMPLATE_VIS enable_if {}; ^ While building module 'std' imported from /Users/buildslave/jenkins/workspace/lldb-cmake-sanitized/llvm-project/lldb/test/API/commands/expression/call-function/main.cpp:1: In file included from <module-includes>:31: In file included from /Users/buildslave/jenkins/workspace/lldb-cmake-sanitized/lldb-build/bin/../include/c++/v1/complex.h:28: In file included from /Users/buildslave/jenkins/workspace/lldb-cmake-sanitized/lldb-build/bin/../include/c++/v1/ccomplex:20: In file included from /Users/buildslave/jenkins/workspace/lldb-cmake-sanitized/lldb-build/bin/../include/c++/v1/complex:247: In file included from /Users/buildslave/jenkins/workspace/lldb-cmake-sanitized/lldb-build/bin/../include/c++/v1/sstream:174: /Users/buildslave/jenkins/workspace/lldb-cmake-sanitized/lldb-build/bin/../include/c++/v1/istream:1389:45: error: no template named 'enable_if_t'; did you mean 'enable_if'? template <class _Stream, class _Tp, class = enable_if_t< ^ /Users/buildslave/jenkins/workspace/lldb-cmake-sanitized/lldb-build/bin/../include/c++/v1/type_traits:538:63: note: 'enable_if' declared here template <bool, class _Tp = void> struct _LIBCPP_TEMPLATE_VIS enable_if {}; ^ /Users/buildslave/jenkins/workspace/lldb-cmake-sanitized/llvm-project/lldb/test/API/commands/expression/call-function/main.cpp:1:10: fatal error: could not build module 'std' #include <cstring> ~~~~~~~~^ 3 errors generated. make: *** [main.o] Error 1

Hide Details

Test Directory: /Users/buildslave/jenkins/workspace/lldb-cmake-sanitized/llvm-project/lldb/test/API/commands/expression/call-function ---------------------------------------------------------------------- Ran 4 tests in 42.709s

Hide Details

RESULT: FAILED (2 passes, 0 failures, 1 errors, 1 skipped, 0 expected failures, 0 unexpected successes)

Hide Details

--

Hide Details

******************** PASS: lldb-unit :: UnwindAssembly/x86/./UnwindAssemblyx86Tests/Testx86AssemblyInspectionEngine.TestPopR14 (2080 of 2139) UNSUPPORTED: lldb-api :: functionalities/darwin_log/filter/regex/activity-chain/TestDarwinLogFilterRegexActivityChain.py (2081 of 2139) PASS: lldb-api :: lang/c/unicode/TestUnicodeSymbols.py (2082 of 2139) PASS: lldb-unit :: Process/minidump/./LLDBMinidumpTests/MinidumpParserTest.GetLinuxProcStatus (2083 of 2139) PASS: lldb-unit :: debugserver/./debugserverTests/RNBSocket.LoopBackListenIPv4 (2084 of 2139) PASS: lldb-api :: commands/expression/rdar42038760/TestScalarURem.py (2085 of 2139) PASS: lldb-api :: functionalities/pointer_num_children/TestPointerNumChildren.py (2086 of 2139) UNSUPPORTED: lldb-shell :: SymbolFile/DWARF/split-dwarf-expression-eval-bug.cpp (2087 of 2139) PASS: lldb-unit :: ScriptInterpreter/Python/./ScriptInterpreterPythonTests/PythonDataObjectsTest.TestPythonListManipulation (2088 of 2139) PASS: lldb-unit :: Utility/./UtilityTests/RangeTest.Clear (2089 of 2139) UNSUPPORTED: lldb-api :: functionalities/breakpoint/hardware_breakpoints/write_memory_with_hw_breakpoint/TestWriteMemoryWithHWBreakpoint.py (2090 of 2139) PASS: lldb-api :: lang/c/struct_types/TestStructTypes.py (2091 of 2139) PASS: lldb-api :: commands/command/delete/TestCommandDelete.py (2092 of 2139) PASS: lldb-api :: tools/lldb-server/TestLldbGdbServer.py (2093 of 2139) PASS: lldb-api :: arm/emulation/TestEmulations.py (2094 of 2139) PASS: lldb-unit :: Utility/./UtilityTests/UriParserTest.Empty (2095 of 2139) PASS: lldb-unit :: Utility/./UtilityTests/NameMatchesTest.Ignore (2096 of 2139) PASS: lldb-unit :: Target/./TargetTests/ModuleCacheTest.GetAndPutUuidExists (2097 of 2139) PASS: lldb-api :: python_api/signals/TestSignalsAPI.py (2098 of 2139) PASS: lldb-unit :: UnwindAssembly/x86/./UnwindAssemblyx86Tests/Testx86AssemblyInspectionEngine.TestPopR13 (2099 of 2139) PASS: lldb-unit :: Utility/./UtilityTests/CompletionRequest.TryCompleteCurrentArgBad (2100 of 2139) PASS: lldb-shell :: SymbolFile/DWARF/limit-debug-info.s (2101 of 2139) PASS: lldb-unit :: ScriptInterpreter/Python/./ScriptInterpreterPythonTests/PythonDataObjectsTest.TestPythonTupleSize (2102 of 2139) PASS: lldb-unit :: Utility/./UtilityTests/FileSpecTest.EqualDotsPosix (2103 of 2139) PASS: lldb-shell :: SymbolFile/DWARF/dwarf5_locations.s (2104 of 2139) FAIL: lldb-api :: lang/cpp/char1632_t/TestChar1632T.py (2105 of 2139) ******************** TEST 'lldb-api :: lang/cpp/char1632_t/TestChar1632T.py' FAILED ******************** Script: -- /Users/buildslave/jenkins/workspace/lldb-cmake-sanitized/lldb-build/lldb-test-build.noindex/copied-python /Users/buildslave/jenkins/workspace/lldb-cmake-sanitized/llvm-project/lldb/test/API/dotest.py -s /Users/buildslave/jenkins/workspace/lldb-cmake-sanitized/lldb-build/lldb-test-traces -S nm -u CXXFLAGS -u CFLAGS --codesign-identity lldb_codesign --server /Users/buildslave/jenkins/workspace/lldb-cmake-sanitized/lldb-build/./bin/debugserver --arch x86_64 --build-dir /Users/buildslave/jenkins/workspace/lldb-cmake-sanitized/lldb-build/lldb-test-build.noindex -s=/Users/buildslave/jenkins/workspace/lldb-cmake-sanitized/test/logs -t --env TERM=vt100 --env LLVM_LIBS_DIR=/Users/buildslave/jenkins/workspace/lldb-cmake-sanitized/lldb-build/./lib --inferior-env ASAN_OPTIONS=detect_stack_use_after_return=1 --inferior-env DYLD_INSERT_LIBRARIES=/Users/buildslave/jenkins/workspace/lldb-cmake-sanitized/host-compiler/lib/clang/12.0.0/lib/darwin/libclang_rt.asan_osx_dynamic.dylib --arch x86_64 --build-dir /Users/buildslave/jenkins/workspace/lldb-cmake-sanitized/lldb-build/lldb-test-build.noindex --lldb-module-cache-dir /Users/buildslave/jenkins/workspace/lldb-cmake-sanitized/lldb-build/lldb-test-build.noindex/module-cache-lldb/lldb-api --clang-module-cache-dir /Users/buildslave/jenkins/workspace/lldb-cmake-sanitized/lldb-build/lldb-test-build.noindex/module-cache-clang/lldb-api --executable /Users/buildslave/jenkins/workspace/lldb-cmake-sanitized/lldb-build/./bin/lldb --compiler /Users/buildslave/jenkins/workspace/lldb-cmake-sanitized/lldb-build/./bin/clang --dsymutil /Users/buildslave/jenkins/workspace/lldb-cmake-sanitized/lldb-build/./bin/dsymutil --filecheck /Users/buildslave/jenkins/workspace/lldb-cmake-sanitized/lldb-build/./bin/FileCheck --yaml2obj /Users/buildslave/jenkins/workspace/lldb-cmake-sanitized/lldb-build/./bin/yaml2obj --lldb-libs-dir /Users/buildslave/jenkins/workspace/lldb-cmake-sanitized/lldb-build/./lib /Users/buildslave/jenkins/workspace/lldb-cmake-sanitized/llvm-project/lldb/test/API/lang/cpp/char1632_t -p TestChar1632T.py -- Exit Code: 1

Hide Details

Command Output (stdout): -- lldb version 12.0.99 clang revision d6ac649ccda289ecc2d2c0cb51892d57e8ec328c llvm revision d6ac649ccda289ecc2d2c0cb51892d57e8ec328c libstdcxx tests will not be run because: Don't know how to build with libstdcxx on macosx Skipping following debug info categories: ['dwo']

Hide Details

-- Command Output (stderr): --

Hide Details

Session logs for test failures/errors/unexpected successes will go into directory '/Users/buildslave/jenkins/workspace/lldb-cmake-sanitized/test/logs' Change dir to: /Users/buildslave/jenkins/workspace/lldb-cmake-sanitized/llvm-project/lldb/test/API/lang/cpp/char1632_t runCmd: settings clear -all output:

Hide Details

runCmd: settings set symbols.enable-external-lookup false output:

Hide Details

runCmd: settings set target.inherit-tcc true output:

Hide Details

runCmd: settings set target.auto-apply-fixits false output:

Hide Details

runCmd: settings set plugin.process.gdb-remote.packet-timeout 60 output:

Hide Details

runCmd: settings set symbols.clang-modules-cache-path "/Users/buildslave/jenkins/workspace/lldb-cmake-sanitized/lldb-build/lldb-test-build.noindex/module-cache-lldb/lldb-api" output:

Hide Details

runCmd: settings set use-color false output:

Hide Details

runCmd: setting set target.prefer-dynamic-value no-dynamic-values output:

Hide Details

runCmd: settings set target.env-vars ASAN_OPTIONS=detect_stack_use_after_return=1 DYLD_INSERT_LIBRARIES=/Users/buildslave/jenkins/workspace/lldb-cmake-sanitized/host-compiler/lib/clang/12.0.0/lib/darwin/libclang_rt.asan_osx_dynamic.dylib output:

Hide Details

runCmd: breakpoint set -f "main.cpp" -l 28 output: Breakpoint 1: where = a.out`main + 161 at main.cpp:28:9, address = 0x0000000100000a81

Hide Details

Hide Details

Expecting pattern: ^Breakpoint (?P<bpno>[0-9]+): (?P<num_locations>[0-9]+) locations\.$ Not matched

Hide Details

Expecting pattern: ^Breakpoint (?P<bpno>[0-9]+): (?P<num_locations>no) locations \(pending\)\. Not matched

Hide Details

Expecting pattern: ^Breakpoint (?P<bpno>[0-9]+): where = (?P<module>.*)`(?P<symbol>[+\-]{0,1}[^+]+)( \+ (?P<offset>[0-9]+)){0,1}( \[inlined\] (?P<inline_symbol>.*)){0,1} at (?P<file>[^:]+):(?P<line_no>[0-9]+)(?P<column>(:[0-9]+)?), address = (?P<address>0x[0-9a-fA-F]+)$ Matched

Hide Details

runCmd: breakpoint set -f "main.cpp" -l 33 output: Breakpoint 2: where = a.out`main + 238 at main.cpp:33:9, address = 0x0000000100000ace

Hide Details

Hide Details

Expecting pattern: ^Breakpoint (?P<bpno>[0-9]+): (?P<num_locations>[0-9]+) locations\.$ Not matched

Hide Details

Expecting pattern: ^Breakpoint (?P<bpno>[0-9]+): (?P<num_locations>no) locations \(pending\)\. Not matched

Hide Details

Expecting pattern: ^Breakpoint (?P<bpno>[0-9]+): where = (?P<module>.*)`(?P<symbol>[+\-]{0,1}[^+]+)( \+ (?P<offset>[0-9]+)){0,1}( \[inlined\] (?P<inline_symbol>.*)){0,1} at (?P<file>[^:]+):(?P<line_no>[0-9]+)(?P<column>(:[0-9]+)?), address = (?P<address>0x[0-9a-fA-F]+)$ Matched

Hide Details

runCmd: frame variable output: (int) argc = 1 (const char **) argv = 0x00007ffeefbff848 (char16_t [64]) as16 = u"ﺸﺵۻ" (char32_t [64]) as32 = U"ЕЙРГЖО" (char16_t) cs16_zero = U+0000 u'\0' (char32_t) cs32_zero = U+0x00000000 U'\0' (const char16_t *) cs16 = 0x0000000100000e80 u"hello world ྒྙྐ" (const char32_t *) cs32 = 0x0000000100000ec0 U"hello world ྒྙྐ" (char16_t *) s16 = 0x0000000100000ea0 u"ﺸﺵۻ" (char32_t *) s32 = 0x0000000100000f00 U"ЕЙРГЖО"

Hide Details

Hide Details

runCmd: frame variable cs16 cs32 output: (const char16_t *) cs16 = 0x0000000100000e80 u"hello world ྒྙྐ" (const char32_t *) cs32 = 0x0000000100000ec0 U"hello world ྒྙྐ"

Hide Details

Hide Details

Ran command: "frame variable cs16 cs32"

Hide Details

Got output: (const char16_t *) cs16 = 0x0000000100000e80 u"hello world ྒྙྐ" (const char32_t *) cs32 = 0x0000000100000ec0 U"hello world ྒྙྐ"

Hide Details

Expecting sub string: "(const char16_t *) cs16 = " (was found) Expecting sub string: "u"hello world ྒྙྐ"" (was found) Expecting sub string: "(const char32_t *) cs32 = " (was found) Expecting sub string: "U"hello world ྒྙྐ"" (was found)

Hide Details

runCmd: frame variable s16 s32 output: (char16_t *) s16 = 0x0000000100000ea0 u"ﺸﺵۻ" (char32_t *) s32 = 0x0000000100000f00 U"ЕЙРГЖО"

Hide Details

Hide Details

Ran command: "frame variable s16 s32"

Hide Details

Got output: (char16_t *) s16 = 0x0000000100000ea0 u"ﺸﺵۻ" (char32_t *) s32 = 0x0000000100000f00 U"ЕЙРГЖО"

Hide Details

Expecting sub string: "(char16_t *) s16 = " (was found) Expecting sub string: "u"ﺸﺵۻ"" (was found) Expecting sub string: "(char32_t *) s32 = " (was found) Expecting sub string: "U"ЕЙРГЖО"" (was found)

Hide Details

runCmd: frame variable as16 as32 output: (char16_t [64]) as16 = u"ﺸﺵۻ" (char32_t [64]) as32 = U"ЕЙРГЖО"

Hide Details

Hide Details

Ran command: "frame variable as16 as32"

Hide Details

Got output: (char16_t [64]) as16 = u"ﺸﺵۻ" (char32_t [64]) as32 = U"ЕЙРГЖО"

Hide Details

Expecting sub string: "u"ﺸﺵۻ"" (was found) Expecting sub string: "U"ЕЙРГЖО"" (was found) Expecting regex pattern: "\(char16_t \[[0-9]+\]\) as16 = " (was found, matched "(char16_t [64]) as16 = ") Expecting regex pattern: "\(char32_t \[[0-9]+\]\) as32 = " (was found, matched "(char32_t [64]) as32 = ")

Hide Details

runCmd: next output: Process 20533 stopped * thread #1, queue = 'com.apple.main-thread', stop reason = step over frame #0: 0x0000000100000a8c a.out`main(argc=1, argv=0x00007ffeefbff848) at main.cpp:29:9 26 copy_char_seq(as16, s16); 27 copy_char_seq(as32, s32); 28 s32 = nullptr; // breakpoint1 -> 29 s32 = (char32_t *)U"෴"; ^ 30 s16 = (char16_t *)u"色ハ匂ヘト散リヌルヲ"; 31 copy_char_seq(as16, s16); 32 copy_char_seq(as32, s32);

Hide Details

Hide Details

Hide Details

runCmd: frame variable s32 output: (char32_t *) s32 = 0x0000000000000000

Hide Details

Hide Details

Ran command: "frame variable s32"

Hide Details

Got output: (char32_t *) s32 = 0x0000000000000000

Hide Details

Expecting sub string: "(char32_t *) s32 = 0x00000000" (was found)

Hide Details

runCmd: continue output: Process 20533 resuming Process 20533 stopped * thread #1, queue = 'com.apple.main-thread', stop reason = breakpoint 2.1 frame #0: 0x0000000100000ace a.out`main(argc=1, argv=0x00007ffeefbff848) at main.cpp:33:9 30 s16 = (char16_t *)u"色ハ匂ヘト散リヌルヲ"; 31 copy_char_seq(as16, s16); 32 copy_char_seq(as32, s32); -> 33 s32 = nullptr; // breakpoint2 ^ 34 return 0; 35 }

Hide Details

Hide Details

Hide Details

runCmd: frame variable s16 s32 output: (char16_t *) s16 = 0x0000000100000ea8 u"色ハ匂ヘト散リヌルヲ" (char32_t *) s32 = 0x0000000100000f1c U"෴"

Hide Details

Hide Details

Ran command: "frame variable s16 s32"

Hide Details

Got output: (char16_t *) s16 = 0x0000000100000ea8 u"色ハ匂ヘト散リヌルヲ" (char32_t *) s32 = 0x0000000100000f1c U"෴"

Hide Details

Expecting sub string: "(char16_t *) s16 = 0x" (was found) Expecting sub string: ""色ハ匂ヘト散リヌルヲ"" (was found) Expecting sub string: "(char32_t *) s32 = " (was found) Expecting sub string: ""෴"" (was found)

Hide Details

runCmd: frame variable as16 as32 output: (char16_t [64]) as16 = u"色ハ匂ヘト散リヌルヲ" (char32_t [64]) as32 = U"෴"

Hide Details

Hide Details

Ran command: "frame variable as16 as32"

Hide Details

Got output: (char16_t [64]) as16 = u"色ハ匂ヘト散リヌルヲ" (char32_t [64]) as32 = U"෴"

Hide Details

Expecting sub string: ""色ハ匂ヘト散リヌルヲ"" (was found) Expecting sub string: ""෴"" (was found) Expecting regex pattern: "\(char16_t \[[0-9]+\]\) as16 = " (was found, matched "(char16_t [64]) as16 = ") Expecting regex pattern: "\(char32_t \[[0-9]+\]\) as32 = " (was found, matched "(char32_t [64]) as32 = ")

Hide Details

<bound method SBProcess.Kill of <lldb.SBProcess; proxy of <Swig Object of type 'lldb::SBProcess *' at 0x109e4f060> >>: success

Hide Details

PASS: LLDB (/Users/buildslave/jenkins/workspace/lldb-cmake-sanitized/lldb-build/bin/clang-x86_64) :: test_dsym (TestChar1632T.Char1632TestCase) runCmd: settings clear -all output:

Hide Details

runCmd: settings set symbols.enable-external-lookup false output:

Hide Details

runCmd: settings set target.inherit-tcc true output:

Hide Details

runCmd: settings set target.auto-apply-fixits false output:

Hide Details

runCmd: settings set plugin.process.gdb-remote.packet-timeout 60 output:

Hide Details

runCmd: settings set symbols.clang-modules-cache-path "/Users/buildslave/jenkins/workspace/lldb-cmake-sanitized/lldb-build/lldb-test-build.noindex/module-cache-lldb/lldb-api" output:

Hide Details

runCmd: settings set use-color false output:

Hide Details

runCmd: setting set target.prefer-dynamic-value no-dynamic-values output:

Hide Details

runCmd: settings set target.env-vars ASAN_OPTIONS=detect_stack_use_after_return=1 DYLD_INSERT_LIBRARIES=/Users/buildslave/jenkins/workspace/lldb-cmake-sanitized/host-compiler/lib/clang/12.0.0/lib/darwin/libclang_rt.asan_osx_dynamic.dylib output:

Hide Details

runCmd: breakpoint set -f "main.cpp" -l 28 output: Breakpoint 1: where = a.out`main + 161 at main.cpp:28:9, address = 0x0000000100000a81

Hide Details

Hide Details

Expecting pattern: ^Breakpoint (?P<bpno>[0-9]+): (?P<num_locations>[0-9]+) locations\.$ Not matched

Hide Details

Expecting pattern: ^Breakpoint (?P<bpno>[0-9]+): (?P<num_locations>no) locations \(pending\)\. Not matched

Hide Details

Expecting pattern: ^Breakpoint (?P<bpno>[0-9]+): where = (?P<module>.*)`(?P<symbol>[+\-]{0,1}[^+]+)( \+ (?P<offset>[0-9]+)){0,1}( \[inlined\] (?P<inline_symbol>.*)){0,1} at (?P<file>[^:]+):(?P<line_no>[0-9]+)(?P<column>(:[0-9]+)?), address = (?P<address>0x[0-9a-fA-F]+)$ Matched

Hide Details

runCmd: breakpoint set -f "main.cpp" -l 33 output: Breakpoint 2: where = a.out`main + 238 at main.cpp:33:9, address = 0x0000000100000ace

Hide Details

Hide Details

Expecting pattern: ^Breakpoint (?P<bpno>[0-9]+): (?P<num_locations>[0-9]+) locations\.$ Not matched

Hide Details

Expecting pattern: ^Breakpoint (?P<bpno>[0-9]+): (?P<num_locations>no) locations \(pending\)\. Not matched

Hide Details

Expecting pattern: ^Breakpoint (?P<bpno>[0-9]+): where = (?P<module>.*)`(?P<symbol>[+\-]{0,1}[^+]+)( \+ (?P<offset>[0-9]+)){0,1}( \[inlined\] (?P<inline_symbol>.*)){0,1} at (?P<file>[^:]+):(?P<line_no>[0-9]+)(?P<column>(:[0-9]+)?), address = (?P<address>0x[0-9a-fA-F]+)$ Matched

Hide Details

runCmd: frame variable output: (int) argc = 1 (const char **) argv = 0x00007ffeefbff820 (char16_t [64]) as16 = u"ﺸﺵۻ" (char32_t [64]) as32 = U"ЕЙРГЖО" (char16_t) cs16_zero = U+0000 u'\0' (char32_t) cs32_zero = U+0x00000000 U'\0' (const char16_t *) cs16 = 0x0000000100000e80 u"hello world ྒྙྐ" (const char32_t *) cs32 = 0x0000000100000ec0 U"hello world ྒྙྐ" (char16_t *) s16 = 0x0000000100000ea0 u"ﺸﺵۻ" (char32_t *) s32 = 0x0000000100000f00 U"ЕЙРГЖО"

Hide Details

Hide Details

runCmd: frame variable cs16 cs32 output: (const char16_t *) cs16 = 0x0000000100000e80 u"hello world ྒྙྐ" (const char32_t *) cs32 = 0x0000000100000ec0 U"hello world ྒྙྐ"

Hide Details

Hide Details

Ran command: "frame variable cs16 cs32"

Hide Details

Got output: (const char16_t *) cs16 = 0x0000000100000e80 u"hello world ྒྙྐ" (const char32_t *) cs32 = 0x0000000100000ec0 U"hello world ྒྙྐ"

Hide Details

Expecting sub string: "(const char16_t *) cs16 = " (was found) Expecting sub string: "u"hello world ྒྙྐ"" (was found) Expecting sub string: "(const char32_t *) cs32 = " (was found) Expecting sub string: "U"hello world ྒྙྐ"" (was found)

Hide Details

runCmd: frame variable s16 s32 output: (char16_t *) s16 = 0x0000000100000ea0 u"ﺸﺵۻ" (char32_t *) s32 = 0x0000000100000f00 U"ЕЙРГЖО"

Hide Details

Hide Details

Ran command: "frame variable s16 s32"

Hide Details

Got output: (char16_t *) s16 = 0x0000000100000ea0 u"ﺸﺵۻ" (char32_t *) s32 = 0x0000000100000f00 U"ЕЙРГЖО"

Hide Details

Expecting sub string: "(char16_t *) s16 = " (was found) Expecting sub string: "u"ﺸﺵۻ"" (was found) Expecting sub string: "(char32_t *) s32 = " (was found) Expecting sub string: "U"ЕЙРГЖО"" (was found)

Hide Details

runCmd: frame variable as16 as32 output: (char16_t [64]) as16 = u"ﺸﺵۻ" (char32_t [64]) as32 = U"ЕЙРГЖО"

Hide Details

Hide Details

Ran command: "frame variable as16 as32"

Hide Details

Got output: (char16_t [64]) as16 = u"ﺸﺵۻ" (char32_t [64]) as32 = U"ЕЙРГЖО"

Hide Details

Expecting sub string: "u"ﺸﺵۻ"" (was found) Expecting sub string: "U"ЕЙРГЖО"" (was found) Expecting regex pattern: "\(char16_t \[[0-9]+\]\) as16 = " (was found, matched "(char16_t [64]) as16 = ") Expecting regex pattern: "\(char32_t \[[0-9]+\]\) as32 = " (was found, matched "(char32_t [64]) as32 = ")

Hide Details

runCmd: next output: Process 20736 stopped * thread #1, queue = 'com.apple.main-thread', stop reason = step over frame #0: 0x0000000100000a8c a.out`main(argc=1, argv=0x00007ffeefbff820) at main.cpp:29:9 26 copy_char_seq(as16, s16); 27 copy_char_seq(as32, s32); 28 s32 = nullptr; // breakpoint1 -> 29 s32 = (char32_t *)U"෴"; ^ 30 s16 = (char16_t *)u"色ハ匂ヘト散リヌルヲ"; 31 copy_char_seq(as16, s16); 32 copy_char_seq(as32, s32);

Hide Details

Hide Details

Hide Details

runCmd: frame variable s32 output: (char32_t *) s32 = 0x0000000000000000

Hide Details

Hide Details

Ran command: "frame variable s32"

Hide Details

Got output: (char32_t *) s32 = 0x0000000000000000

Hide Details

Expecting sub string: "(char32_t *) s32 = 0x00000000" (was found)

Hide Details

runCmd: continue output: Process 20736 resuming Process 20736 stopped * thread #1, queue = 'com.apple.main-thread', stop reason = breakpoint 2.1 frame #0: 0x0000000100000ace a.out`main(argc=1, argv=0x00007ffeefbff820) at main.cpp:33:9 30 s16 = (char16_t *)u"色ハ匂ヘト散リヌルヲ"; 31 copy_char_seq(as16, s16); 32 copy_char_seq(as32, s32); -> 33 s32 = nullptr; // breakpoint2 ^ 34 return 0; 35 }

Hide Details

Hide Details

Hide Details

runCmd: frame variable s16 s32 output: (char16_t *) s16 = 0x0000000100000ea8 u"色ハ匂ヘト散リヌルヲ" (char32_t *) s32 = 0x0000000100000f1c U"෴"

Hide Details

Hide Details

Ran command: "frame variable s16 s32"

Hide Details

Got output: (char16_t *) s16 = 0x0000000100000ea8 u"色ハ匂ヘト散リヌルヲ" (char32_t *) s32 = 0x0000000100000f1c U"෴"

Hide Details

Expecting sub string: "(char16_t *) s16 = 0x" (was found) Expecting sub string: ""色ハ匂ヘト散リヌルヲ"" (was found) Expecting sub string: "(char32_t *) s32 = " (was found) Expecting sub string: ""෴"" (was found)

Hide Details

runCmd: frame variable as16 as32 output: (char16_t [64]) as16 = u"色ハ匂ヘト散リヌルヲ" (char32_t [64]) as32 = U"෴"

Hide Details

Hide Details

Ran command: "frame variable as16 as32"

Hide Details

Got output: (char16_t [64]) as16 = u"色ハ匂ヘト散リヌルヲ" (char32_t [64]) as32 = U"෴"

Hide Details

Expecting sub string: ""色ハ匂ヘト散リヌルヲ"" (was found) Expecting sub string: ""෴"" (was found) Expecting regex pattern: "\(char16_t \[[0-9]+\]\) as16 = " (was found, matched "(char16_t [64]) as16 = ") Expecting regex pattern: "\(char32_t \[[0-9]+\]\) as32 = " (was found, matched "(char32_t [64]) as32 = ")

Hide Details

<bound method SBProcess.Kill of <lldb.SBProcess; proxy of <Swig Object of type 'lldb::SBProcess *' at 0x1096c0960> >>: success

Hide Details

PASS: LLDB (/Users/buildslave/jenkins/workspace/lldb-cmake-sanitized/lldb-build/bin/clang-x86_64) :: test_dwarf (TestChar1632T.Char1632TestCase) UNSUPPORTED: LLDB (/Users/buildslave/jenkins/workspace/lldb-cmake-sanitized/lldb-build/bin/clang-x86_64) :: test_dwo (TestChar1632T.Char1632TestCase) (test case does not fall in any category of interest for this run) runCmd: settings clear -all output:

Hide Details

runCmd: settings set symbols.enable-external-lookup false output:

Hide Details

runCmd: settings set target.inherit-tcc true output:

Hide Details

runCmd: settings set target.auto-apply-fixits false output:

Hide Details

runCmd: settings set plugin.process.gdb-remote.packet-timeout 60 output:

Hide Details

runCmd: settings set symbols.clang-modules-cache-path "/Users/buildslave/jenkins/workspace/lldb-cmake-sanitized/lldb-build/lldb-test-build.noindex/module-cache-lldb/lldb-api" output:

Hide Details

runCmd: settings set use-color false output:

Hide Details

runCmd: setting set target.prefer-dynamic-value no-dynamic-values output:

Hide Details

runCmd: settings set target.env-vars ASAN_OPTIONS=detect_stack_use_after_return=1 DYLD_INSERT_LIBRARIES=/Users/buildslave/jenkins/workspace/lldb-cmake-sanitized/host-compiler/lib/clang/12.0.0/lib/darwin/libclang_rt.asan_osx_dynamic.dylib output:

Hide Details

FAIL: LLDB (/Users/buildslave/jenkins/workspace/lldb-cmake-sanitized/lldb-build/bin/clang-x86_64) :: test_gmodules (TestChar1632T.Char1632TestCase) Restore dir to: /Users/buildslave/jenkins/workspace/lldb-cmake-sanitized/lldb-build/tools/lldb/test ====================================================================== ERROR: test_gmodules (TestChar1632T.Char1632TestCase) Test that the C++11 support for char16_t and char32_t works correctly. ---------------------------------------------------------------------- Error when building test subject.

Hide Details

Build Command: make VPATH=/Users/buildslave/jenkins/workspace/lldb-cmake-sanitized/llvm-project/lldb/test/API/lang/cpp/char1632_t -C /Users/buildslave/jenkins/workspace/lldb-cmake-sanitized/lldb-build/lldb-test-build.noindex/lang/cpp/char1632_t/TestChar1632T.test_gmodules -I /Users/buildslave/jenkins/workspace/lldb-cmake-sanitized/llvm-project/lldb/test/API/lang/cpp/char1632_t -I /Users/buildslave/jenkins/workspace/lldb-cmake-sanitized/llvm-project/lldb/packages/Python/lldbsuite/test/make -f /Users/buildslave/jenkins/workspace/lldb-cmake-sanitized/llvm-project/lldb/test/API/lang/cpp/char1632_t/Makefile MAKE_DSYM=NO MAKE_GMODULES=YES ARCH=x86_64 CC="/Users/buildslave/jenkins/workspace/lldb-cmake-sanitized/lldb-build/bin/clang" DSYMUTIL="/Users/buildslave/jenkins/workspace/lldb-cmake-sanitized/lldb-build/./bin/dsymutil" CLANG_MODULE_CACHE_DIR=/Users/buildslave/jenkins/workspace/lldb-cmake-sanitized/lldb-build/lldb-test-build.noindex/module-cache-clang/lldb-api

Hide Details

Build Command Output: While building module 'std' imported from /Users/buildslave/jenkins/workspace/lldb-cmake-sanitized/llvm-project/lldb/test/API/lang/cpp/char1632_t/main.cpp:2: In file included from <module-includes>:31: In file included from /Users/buildslave/jenkins/workspace/lldb-cmake-sanitized/lldb-build/bin/../include/c++/v1/complex.h:28: In file included from /Users/buildslave/jenkins/workspace/lldb-cmake-sanitized/lldb-build/bin/../include/c++/v1/ccomplex:20: In file included from /Users/buildslave/jenkins/workspace/lldb-cmake-sanitized/lldb-build/bin/../include/c++/v1/complex:247: In file included from /Users/buildslave/jenkins/workspace/lldb-cmake-sanitized/lldb-build/bin/../include/c++/v1/sstream:173: /Users/buildslave/jenkins/workspace/lldb-cmake-sanitized/lldb-build/bin/../include/c++/v1/ostream:1038:45: error: no template named 'enable_if_t'; did you mean 'enable_if'? template <class _Stream, class _Tp, class = enable_if_t< ^ /Users/buildslave/jenkins/workspace/lldb-cmake-sanitized/lldb-build/bin/../include/c++/v1/type_traits:538:63: note: 'enable_if' declared here template <bool, class _Tp = void> struct _LIBCPP_TEMPLATE_VIS enable_if {}; ^ While building module 'std' imported from /Users/buildslave/jenkins/workspace/lldb-cmake-sanitized/llvm-project/lldb/test/API/lang/cpp/char1632_t/main.cpp:2: In file included from <module-includes>:31: In file included from /Users/buildslave/jenkins/workspace/lldb-cmake-sanitized/lldb-build/bin/../include/c++/v1/complex.h:28: In file included from /Users/buildslave/jenkins/workspace/lldb-cmake-sanitized/lldb-build/bin/../include/c++/v1/ccomplex:20: In file included from /Users/buildslave/jenkins/workspace/lldb-cmake-sanitized/lldb-build/bin/../include/c++/v1/complex:247: In file included from /Users/buildslave/jenkins/workspace/lldb-cmake-sanitized/lldb-build/bin/../include/c++/v1/sstream:174: /Users/buildslave/jenkins/workspace/lldb-cmake-sanitized/lldb-build/bin/../include/c++/v1/istream:1389:45: error: no template named 'enable_if_t'; did you mean 'enable_if'? template <class _Stream, class _Tp, class = enable_if_t< ^ /Users/buildslave/jenkins/workspace/lldb-cmake-sanitized/lldb-build/bin/../include/c++/v1/type_traits:538:63: note: 'enable_if' declared here template <bool, class _Tp = void> struct _LIBCPP_TEMPLATE_VIS enable_if {}; ^ /Users/buildslave/jenkins/workspace/lldb-cmake-sanitized/llvm-project/lldb/test/API/lang/cpp/char1632_t/main.cpp:2:10: fatal error: could not build module 'std' #include <string> ~~~~~~~~^ 3 errors generated. /Users/buildslave/jenkins/workspace/lldb-cmake-sanitized/lldb-build/bin/clang -fmodules -gmodules -fmodules-cache-path=/Users/buildslave/jenkins/workspace/lldb-cmake-sanitized/lldb-build/lldb-test-build.noindex/module-cache-clang/lldb-api -gmodules -fcxx-modules -std=c++11 -g -O0 -std=c++11 -isysroot "/Applications/Xcode.app/Contents/Developer/Platforms/MacOSX.platform/Developer/SDKs/MacOSX10.15.sdk" -arch x86_64 -I/Users/buildslave/jenkins/workspace/lldb-cmake-sanitized/llvm-project/lldb/packages/Python/lldbsuite/test/make/../../../../../include -I/Users/buildslave/jenkins/workspace/lldb-cmake-sanitized/llvm-project/lldb/test/API/lang/cpp/char1632_t -I/Users/buildslave/jenkins/workspace/lldb-cmake-sanitized/llvm-project/lldb/packages/Python/lldbsuite/test/make -include /Users/buildslave/jenkins/workspace/lldb-cmake-sanitized/llvm-project/lldb/packages/Python/lldbsuite/test/make/test_common.h -fno-limit-debug-info -fmodules -gmodules -fmodules-cache-path=/Users/buildslave/jenkins/workspace/lldb-cmake-sanitized/lldb-build/lldb-test-build.noindex/module-cache-clang/lldb-api -gmodules -fcxx-modules --driver-mode=g++ -c -o main.o /Users/buildslave/jenkins/workspace/lldb-cmake-sanitized/llvm-project/lldb/test/API/lang/cpp/char1632_t/main.cpp While building module 'std' imported from /Users/buildslave/jenkins/workspace/lldb-cmake-sanitized/llvm-project/lldb/test/API/lang/cpp/char1632_t/main.cpp:2: In file included from <module-includes>:31: In file included from /Users/buildslave/jenkins/workspace/lldb-cmake-sanitized/lldb-build/bin/../include/c++/v1/complex.h:28: In file included from /Users/buildslave/jenkins/workspace/lldb-cmake-sanitized/lldb-build/bin/../include/c++/v1/ccomplex:20: In file included from /Users/buildslave/jenkins/workspace/lldb-cmake-sanitized/lldb-build/bin/../include/c++/v1/complex:247: In file included from /Users/buildslave/jenkins/workspace/lldb-cmake-sanitized/lldb-build/bin/../include/c++/v1/sstream:173: /Users/buildslave/jenkins/workspace/lldb-cmake-sanitized/lldb-build/bin/../include/c++/v1/ostream:1038:45: error: no template named 'enable_if_t'; did you mean 'enable_if'? template <class _Stream, class _Tp, class = enable_if_t< ^ /Users/buildslave/jenkins/workspace/lldb-cmake-sanitized/lldb-build/bin/../include/c++/v1/type_traits:538:63: note: 'enable_if' declared here template <bool, class _Tp = void> struct _LIBCPP_TEMPLATE_VIS enable_if {}; ^ While building module 'std' imported from /Users/buildslave/jenkins/workspace/lldb-cmake-sanitized/llvm-project/lldb/test/API/lang/cpp/char1632_t/main.cpp:2: In file included from <module-includes>:31: In file included from /Users/buildslave/jenkins/workspace/lldb-cmake-sanitized/lldb-build/bin/../include/c++/v1/complex.h:28: In file included from /Users/buildslave/jenkins/workspace/lldb-cmake-sanitized/lldb-build/bin/../include/c++/v1/ccomplex:20: In file included from /Users/buildslave/jenkins/workspace/lldb-cmake-sanitized/lldb-build/bin/../include/c++/v1/complex:247: In file included from /Users/buildslave/jenkins/workspace/lldb-cmake-sanitized/lldb-build/bin/../include/c++/v1/sstream:174: /Users/buildslave/jenkins/workspace/lldb-cmake-sanitized/lldb-build/bin/../include/c++/v1/istream:1389:45: error: no template named 'enable_if_t'; did you mean 'enable_if'? template <class _Stream, class _Tp, class = enable_if_t< ^ /Users/buildslave/jenkins/workspace/lldb-cmake-sanitized/lldb-build/bin/../include/c++/v1/type_traits:538:63: note: 'enable_if' declared here template <bool, class _Tp = void> struct _LIBCPP_TEMPLATE_VIS enable_if {}; ^ /Users/buildslave/jenkins/workspace/lldb-cmake-sanitized/llvm-project/lldb/test/API/lang/cpp/char1632_t/main.cpp:2:10: fatal error: could not build module 'std' #include <string> ~~~~~~~~^ 3 errors generated. make: *** [main.o] Error 1

Hide Details

Test Directory: /Users/buildslave/jenkins/workspace/lldb-cmake-sanitized/llvm-project/lldb/test/API/lang/cpp/char1632_t ---------------------------------------------------------------------- Ran 4 tests in 42.706s

Hide Details

RESULT: FAILED (2 passes, 0 failures, 1 errors, 1 skipped, 0 expected failures, 0 unexpected successes)

Hide Details

--

Hide Details

******************** PASS: lldb-unit :: Utility/./UtilityTests/StringExtractorTest.GetHexBytesAvail_FullString (2106 of 2139) PASS: lldb-api :: commands/expression/radar_9531204/TestPrintfAfterUp.py (2107 of 2139) PASS: lldb-unit :: Utility/./UtilityTests/StringExtractorTest.InitEmpty (2108 of 2139) PASS: lldb-api :: functionalities/return-value/TestReturnValue.py (2109 of 2139) PASS: lldb-unit :: Utility/./UtilityTests/StreamTest.PutULEB128 (2110 of 2139) PASS: lldb-api :: commands/expression/call-throws/TestCallThatThrows.py (2111 of 2139) UNSUPPORTED: lldb-api :: functionalities/tsan/thread_numbers/TestTsanThreadNumbers.py (2112 of 2139) PASS: lldb-unit :: Utility/./UtilityTests/SerializationRountripTest.SerializeDeserializePodReferences (2113 of 2139) PASS: lldb-api :: functionalities/data-formatter/data-formatter-objc/nsstring/TestDataFormatterNSString.py (2114 of 2139) PASS: lldb-api :: functionalities/thread/concurrent_events/TestConcurrentTwoWatchpointThreads.py (2115 of 2139) PASS: lldb-shell :: SymbolFile/DWARF/deterministic-build.cpp (2116 of 2139) PASS: lldb-unit :: UnwindAssembly/x86/./UnwindAssemblyx86Tests/Testx86AssemblyInspectionEngine.TestSimple32bitFrameFunction (2117 of 2139) PASS: lldb-api :: lang/cpp/covariant-return-types/TestCovariantReturnTypes.py (2118 of 2139) UNSUPPORTED: lldb-shell :: ScriptInterpreter/Lua/convenience_variables.test (2119 of 2139) PASS: lldb-api :: tools/lldb-vscode/variables/TestVSCode_variables.py (2120 of 2139) UNSUPPORTED: lldb-shell :: SymbolFile/PDB/pointers.test (2121 of 2139) PASS: lldb-api :: lang/cpp/auto/TestCPPAuto.py (2122 of 2139) PASS: lldb-api :: lang/objc/orderedset/TestOrderedSet.py (2123 of 2139) PASS: lldb-api :: functionalities/value_md5_crash/TestValueMD5Crash.py (2124 of 2139) PASS: lldb-api :: commands/disassemble/basic/TestDisassembleBreakpoint.py (2125 of 2139) FAIL: lldb-api :: commands/expression/import-std-module/shared_ptr-dbg-info-content/TestSharedPtrDbgInfoContentFromStdModule.py (2126 of 2139) ******************** TEST 'lldb-api :: commands/expression/import-std-module/shared_ptr-dbg-info-content/TestSharedPtrDbgInfoContentFromStdModule.py' FAILED ******************** Script: -- /Users/buildslave/jenkins/workspace/lldb-cmake-sanitized/lldb-build/lldb-test-build.noindex/copied-python /Users/buildslave/jenkins/workspace/lldb-cmake-sanitized/llvm-project/lldb/test/API/dotest.py -s /Users/buildslave/jenkins/workspace/lldb-cmake-sanitized/lldb-build/lldb-test-traces -S nm -u CXXFLAGS -u CFLAGS --codesign-identity lldb_codesign --server /Users/buildslave/jenkins/workspace/lldb-cmake-sanitized/lldb-build/./bin/debugserver --arch x86_64 --build-dir /Users/buildslave/jenkins/workspace/lldb-cmake-sanitized/lldb-build/lldb-test-build.noindex -s=/Users/buildslave/jenkins/workspace/lldb-cmake-sanitized/test/logs -t --env TERM=vt100 --env LLVM_LIBS_DIR=/Users/buildslave/jenkins/workspace/lldb-cmake-sanitized/lldb-build/./lib --inferior-env ASAN_OPTIONS=detect_stack_use_after_return=1 --inferior-env DYLD_INSERT_LIBRARIES=/Users/buildslave/jenkins/workspace/lldb-cmake-sanitized/host-compiler/lib/clang/12.0.0/lib/darwin/libclang_rt.asan_osx_dynamic.dylib --arch x86_64 --build-dir /Users/buildslave/jenkins/workspace/lldb-cmake-sanitized/lldb-build/lldb-test-build.noindex --lldb-module-cache-dir /Users/buildslave/jenkins/workspace/lldb-cmake-sanitized/lldb-build/lldb-test-build.noindex/module-cache-lldb/lldb-api --clang-module-cache-dir /Users/buildslave/jenkins/workspace/lldb-cmake-sanitized/lldb-build/lldb-test-build.noindex/module-cache-clang/lldb-api --executable /Users/buildslave/jenkins/workspace/lldb-cmake-sanitized/lldb-build/./bin/lldb --compiler /Users/buildslave/jenkins/workspace/lldb-cmake-sanitized/lldb-build/./bin/clang --dsymutil /Users/buildslave/jenkins/workspace/lldb-cmake-sanitized/lldb-build/./bin/dsymutil --filecheck /Users/buildslave/jenkins/workspace/lldb-cmake-sanitized/lldb-build/./bin/FileCheck --yaml2obj /Users/buildslave/jenkins/workspace/lldb-cmake-sanitized/lldb-build/./bin/yaml2obj --lldb-libs-dir /Users/buildslave/jenkins/workspace/lldb-cmake-sanitized/lldb-build/./lib /Users/buildslave/jenkins/workspace/lldb-cmake-sanitized/llvm-project/lldb/test/API/commands/expression/import-std-module/shared_ptr-dbg-info-content -p TestSharedPtrDbgInfoContentFromStdModule.py -- Exit Code: -6

Hide Details

Command Output (stdout): -- lldb version 12.0.99 clang revision d6ac649ccda289ecc2d2c0cb51892d57e8ec328c llvm revision d6ac649ccda289ecc2d2c0cb51892d57e8ec328c

Hide Details

-- Command Output (stderr): -- Assertion failed: (0 && "Invalid SLocOffset or bad function choice"), function getFileIDLoaded, file /Users/buildslave/jenkins/workspace/lldb-cmake-sanitized/llvm-project/clang/lib/Basic/SourceManager.cpp, line 917.

Hide Details

--

Hide Details

******************** UNSUPPORTED: lldb-api :: functionalities/exec/TestExec.py (2127 of 2139) UNSUPPORTED: lldb-api :: functionalities/darwin_log/filter/exact_match/message/TestDarwinLogFilterMatchMessage.py (2128 of 2139) PASS: lldb-api :: python_api/value_var_update/TestValueVarUpdate.py (2129 of 2139) PASS: lldb-api :: sanity/TestModuleCacheSanity.py (2130 of 2139) PASS: lldb-unit :: Utility/./UtilityTests/StreamTest.SetIndentLevel (2131 of 2139) PASS: lldb-unit :: Utility/./UtilityTests/ScalarTest.Getters (2132 of 2139) PASS: lldb-api :: functionalities/thread/concurrent_events/TestConcurrentNWatchNBreak.py (2133 of 2139) PASS: lldb-unit :: ScriptInterpreter/Python/./ScriptInterpreterPythonTests/PythonDataObjectsTest.TestPythonByteArray (2134 of 2139) PASS: lldb-api :: lang/objc/conflicting-definition/TestConflictingDefinition.py (2135 of 2139) PASS: lldb-unit :: Utility/./UtilityTests/OptionsWithRawTest.QuotedSuffix (2136 of 2139) FAIL: lldb-api :: functionalities/breakpoint/breakpoint_ids/TestBreakpointIDs.py (2137 of 2139) ******************** TEST 'lldb-api :: functionalities/breakpoint/breakpoint_ids/TestBreakpointIDs.py' FAILED ******************** Script: -- /Users/buildslave/jenkins/workspace/lldb-cmake-sanitized/lldb-build/lldb-test-build.noindex/copied-python /Users/buildslave/jenkins/workspace/lldb-cmake-sanitized/llvm-project/lldb/test/API/dotest.py -s /Users/buildslave/jenkins/workspace/lldb-cmake-sanitized/lldb-build/lldb-test-traces -S nm -u CXXFLAGS -u CFLAGS --codesign-identity lldb_codesign --server /Users/buildslave/jenkins/workspace/lldb-cmake-sanitized/lldb-build/./bin/debugserver --arch x86_64 --build-dir /Users/buildslave/jenkins/workspace/lldb-cmake-sanitized/lldb-build/lldb-test-build.noindex -s=/Users/buildslave/jenkins/workspace/lldb-cmake-sanitized/test/logs -t --env TERM=vt100 --env LLVM_LIBS_DIR=/Users/buildslave/jenkins/workspace/lldb-cmake-sanitized/lldb-build/./lib --inferior-env ASAN_OPTIONS=detect_stack_use_after_return=1 --inferior-env DYLD_INSERT_LIBRARIES=/Users/buildslave/jenkins/workspace/lldb-cmake-sanitized/host-compiler/lib/clang/12.0.0/lib/darwin/libclang_rt.asan_osx_dynamic.dylib --arch x86_64 --build-dir /Users/buildslave/jenkins/workspace/lldb-cmake-sanitized/lldb-build/lldb-test-build.noindex --lldb-module-cache-dir /Users/buildslave/jenkins/workspace/lldb-cmake-sanitized/lldb-build/lldb-test-build.noindex/module-cache-lldb/lldb-api --clang-module-cache-dir /Users/buildslave/jenkins/workspace/lldb-cmake-sanitized/lldb-build/lldb-test-build.noindex/module-cache-clang/lldb-api --executable /Users/buildslave/jenkins/workspace/lldb-cmake-sanitized/lldb-build/./bin/lldb --compiler /Users/buildslave/jenkins/workspace/lldb-cmake-sanitized/lldb-build/./bin/clang --dsymutil /Users/buildslave/jenkins/workspace/lldb-cmake-sanitized/lldb-build/./bin/dsymutil --filecheck /Users/buildslave/jenkins/workspace/lldb-cmake-sanitized/lldb-build/./bin/FileCheck --yaml2obj /Users/buildslave/jenkins/workspace/lldb-cmake-sanitized/lldb-build/./bin/yaml2obj --lldb-libs-dir /Users/buildslave/jenkins/workspace/lldb-cmake-sanitized/lldb-build/./lib /Users/buildslave/jenkins/workspace/lldb-cmake-sanitized/llvm-project/lldb/test/API/functionalities/breakpoint/breakpoint_ids -p TestBreakpointIDs.py -- Exit Code: 1

Hide Details

Command Output (stdout): -- lldb version 12.0.99 clang revision d6ac649ccda289ecc2d2c0cb51892d57e8ec328c llvm revision d6ac649ccda289ecc2d2c0cb51892d57e8ec328c libstdcxx tests will not be run because: Don't know how to build with libstdcxx on macosx Skipping following debug info categories: ['dwo']

Hide Details

-- Command Output (stderr): --

Hide Details

Session logs for test failures/errors/unexpected successes will go into directory '/Users/buildslave/jenkins/workspace/lldb-cmake-sanitized/test/logs' Change dir to: /Users/buildslave/jenkins/workspace/lldb-cmake-sanitized/llvm-project/lldb/test/API/functionalities/breakpoint/breakpoint_ids runCmd: settings clear -all output:

Hide Details

runCmd: settings set symbols.enable-external-lookup false output:

Hide Details

runCmd: settings set target.inherit-tcc true output:

Hide Details

runCmd: settings set target.auto-apply-fixits false output:

Hide Details

runCmd: settings set plugin.process.gdb-remote.packet-timeout 60 output:

Hide Details

runCmd: settings set symbols.clang-modules-cache-path "/Users/buildslave/jenkins/workspace/lldb-cmake-sanitized/lldb-build/lldb-test-build.noindex/module-cache-lldb/lldb-api" output:

Hide Details

runCmd: settings set use-color false output:

Hide Details

runCmd: setting set target.prefer-dynamic-value no-dynamic-values output:

Hide Details

runCmd: settings set target.env-vars ASAN_OPTIONS=detect_stack_use_after_return=1 DYLD_INSERT_LIBRARIES=/Users/buildslave/jenkins/workspace/lldb-cmake-sanitized/host-compiler/lib/clang/12.0.0/lib/darwin/libclang_rt.asan_osx_dynamic.dylib output:

Hide Details

FAIL: LLDB (/Users/buildslave/jenkins/workspace/lldb-cmake-sanitized/lldb-build/bin/clang-x86_64) :: test_dsym (TestBreakpointIDs.BreakpointIDTestCase) runCmd: settings clear -all output:

Hide Details

runCmd: settings set symbols.enable-external-lookup false output:

Hide Details

runCmd: settings set target.inherit-tcc true output:

Hide Details

runCmd: settings set target.auto-apply-fixits false output:

Hide Details

runCmd: settings set plugin.process.gdb-remote.packet-timeout 60 output:

Hide Details

runCmd: settings set symbols.clang-modules-cache-path "/Users/buildslave/jenkins/workspace/lldb-cmake-sanitized/lldb-build/lldb-test-build.noindex/module-cache-lldb/lldb-api" output:

Hide Details

runCmd: settings set use-color false output:

Hide Details

runCmd: setting set target.prefer-dynamic-value no-dynamic-values output:

Hide Details

runCmd: settings set target.env-vars ASAN_OPTIONS=detect_stack_use_after_return=1 DYLD_INSERT_LIBRARIES=/Users/buildslave/jenkins/workspace/lldb-cmake-sanitized/host-compiler/lib/clang/12.0.0/lib/darwin/libclang_rt.asan_osx_dynamic.dylib output:

Hide Details

FAIL: LLDB (/Users/buildslave/jenkins/workspace/lldb-cmake-sanitized/lldb-build/bin/clang-x86_64) :: test_dwarf (TestBreakpointIDs.BreakpointIDTestCase) UNSUPPORTED: LLDB (/Users/buildslave/jenkins/workspace/lldb-cmake-sanitized/lldb-build/bin/clang-x86_64) :: test_dwo (TestBreakpointIDs.BreakpointIDTestCase) (test case does not fall in any category of interest for this run) runCmd: settings clear -all output:

Hide Details

runCmd: settings set symbols.enable-external-lookup false output:

Hide Details

runCmd: settings set target.inherit-tcc true output:

Hide Details

runCmd: settings set target.auto-apply-fixits false output:

Hide Details

runCmd: settings set plugin.process.gdb-remote.packet-timeout 60 output:

Hide Details

runCmd: settings set symbols.clang-modules-cache-path "/Users/buildslave/jenkins/workspace/lldb-cmake-sanitized/lldb-build/lldb-test-build.noindex/module-cache-lldb/lldb-api" output:

Hide Details

runCmd: settings set use-color false output:

Hide Details

runCmd: setting set target.prefer-dynamic-value no-dynamic-values output:

Hide Details

runCmd: settings set target.env-vars ASAN_OPTIONS=detect_stack_use_after_return=1 DYLD_INSERT_LIBRARIES=/Users/buildslave/jenkins/workspace/lldb-cmake-sanitized/host-compiler/lib/clang/12.0.0/lib/darwin/libclang_rt.asan_osx_dynamic.dylib output:

Hide Details

FAIL: LLDB (/Users/buildslave/jenkins/workspace/lldb-cmake-sanitized/lldb-build/bin/clang-x86_64) :: test_gmodules (TestBreakpointIDs.BreakpointIDTestCase) Restore dir to: /Users/buildslave/jenkins/workspace/lldb-cmake-sanitized/lldb-build/tools/lldb/test ====================================================================== ERROR: test_dsym (TestBreakpointIDs.BreakpointIDTestCase) ---------------------------------------------------------------------- Error when building test subject.

Hide Details

Build Command: make VPATH=/Users/buildslave/jenkins/workspace/lldb-cmake-sanitized/llvm-project/lldb/test/API/functionalities/breakpoint/breakpoint_ids -C /Users/buildslave/jenkins/workspace/lldb-cmake-sanitized/lldb-build/lldb-test-build.noindex/functionalities/breakpoint/breakpoint_ids/TestBreakpointIDs.test_dsym -I /Users/buildslave/jenkins/workspace/lldb-cmake-sanitized/llvm-project/lldb/test/API/functionalities/breakpoint/breakpoint_ids -I /Users/buildslave/jenkins/workspace/lldb-cmake-sanitized/llvm-project/lldb/packages/Python/lldbsuite/test/make -f /Users/buildslave/jenkins/workspace/lldb-cmake-sanitized/llvm-project/lldb/test/API/functionalities/breakpoint/breakpoint_ids/Makefile MAKE_DSYM=YES ARCH=x86_64 CC="/Users/buildslave/jenkins/workspace/lldb-cmake-sanitized/lldb-build/bin/clang" DSYMUTIL="/Users/buildslave/jenkins/workspace/lldb-cmake-sanitized/lldb-build/./bin/dsymutil" CLANG_MODULE_CACHE_DIR=/Users/buildslave/jenkins/workspace/lldb-cmake-sanitized/lldb-build/lldb-test-build.noindex/module-cache-clang/lldb-api all

Hide Details

Build Command Output: /Users/buildslave/jenkins/workspace/lldb-cmake-sanitized/lldb-build/bin/clang -std=c++11 -g -O0 -fno-builtin -isysroot "/Applications/Xcode.app/Contents/Developer/Platforms/MacOSX.platform/Developer/SDKs/MacOSX10.15.sdk" -arch x86_64 -I/Users/buildslave/jenkins/workspace/lldb-cmake-sanitized/llvm-project/lldb/packages/Python/lldbsuite/test/make/../../../../../include -I/Users/buildslave/jenkins/workspace/lldb-cmake-sanitized/llvm-project/lldb/test/API/functionalities/breakpoint/breakpoint_ids -I/Users/buildslave/jenkins/workspace/lldb-cmake-sanitized/llvm-project/lldb/packages/Python/lldbsuite/test/make -include /Users/buildslave/jenkins/workspace/lldb-cmake-sanitized/llvm-project/lldb/packages/Python/lldbsuite/test/make/test_common.h -fno-limit-debug-info --driver-mode=g++ -c -o main.o /Users/buildslave/jenkins/workspace/lldb-cmake-sanitized/llvm-project/lldb/test/API/functionalities/breakpoint/breakpoint_ids/main.cpp In file included from /Users/buildslave/jenkins/workspace/lldb-cmake-sanitized/llvm-project/lldb/test/API/functionalities/breakpoint/breakpoint_ids/main.cpp:3: In file included from /Users/buildslave/jenkins/workspace/lldb-cmake-sanitized/lldb-build/bin/../include/c++/v1/fstream:183: /Users/buildslave/jenkins/workspace/lldb-cmake-sanitized/lldb-build/bin/../include/c++/v1/ostream:1038:45: error: no template named 'enable_if_t'; did you mean 'enable_if'? template <class _Stream, class _Tp, class = enable_if_t< ^ /Users/buildslave/jenkins/workspace/lldb-cmake-sanitized/lldb-build/bin/../include/c++/v1/type_traits:538:63: note: 'enable_if' declared here template <bool, class _Tp = void> struct _LIBCPP_TEMPLATE_VIS enable_if {}; ^ In file included from /Users/buildslave/jenkins/workspace/lldb-cmake-sanitized/llvm-project/lldb/test/API/functionalities/breakpoint/breakpoint_ids/main.cpp:3: In file included from /Users/buildslave/jenkins/workspace/lldb-cmake-sanitized/lldb-build/bin/../include/c++/v1/fstream:184: /Users/buildslave/jenkins/workspace/lldb-cmake-sanitized/lldb-build/bin/../include/c++/v1/istream:1389:45: error: no template named 'enable_if_t'; did you mean 'enable_if'? template <class _Stream, class _Tp, class = enable_if_t< ^ /Users/buildslave/jenkins/workspace/lldb-cmake-sanitized/lldb-build/bin/../include/c++/v1/type_traits:538:63: note: 'enable_if' declared here template <bool, class _Tp = void> struct _LIBCPP_TEMPLATE_VIS enable_if {}; ^ 2 errors generated. make: *** [main.o] Error 1

Hide Details

Test Directory: /Users/buildslave/jenkins/workspace/lldb-cmake-sanitized/llvm-project/lldb/test/API/functionalities/breakpoint/breakpoint_ids ====================================================================== ERROR: test_dwarf (TestBreakpointIDs.BreakpointIDTestCase) ---------------------------------------------------------------------- Error when building test subject.

Hide Details

Build Command: make VPATH=/Users/buildslave/jenkins/workspace/lldb-cmake-sanitized/llvm-project/lldb/test/API/functionalities/breakpoint/breakpoint_ids -C /Users/buildslave/jenkins/workspace/lldb-cmake-sanitized/lldb-build/lldb-test-build.noindex/functionalities/breakpoint/breakpoint_ids/TestBreakpointIDs.test_dwarf -I /Users/buildslave/jenkins/workspace/lldb-cmake-sanitized/llvm-project/lldb/test/API/functionalities/breakpoint/breakpoint_ids -I /Users/buildslave/jenkins/workspace/lldb-cmake-sanitized/llvm-project/lldb/packages/Python/lldbsuite/test/make -f /Users/buildslave/jenkins/workspace/lldb-cmake-sanitized/llvm-project/lldb/test/API/functionalities/breakpoint/breakpoint_ids/Makefile MAKE_DSYM=NO ARCH=x86_64 CC="/Users/buildslave/jenkins/workspace/lldb-cmake-sanitized/lldb-build/bin/clang" DSYMUTIL="/Users/buildslave/jenkins/workspace/lldb-cmake-sanitized/lldb-build/./bin/dsymutil" CLANG_MODULE_CACHE_DIR=/Users/buildslave/jenkins/workspace/lldb-cmake-sanitized/lldb-build/lldb-test-build.noindex/module-cache-clang/lldb-api

Hide Details

Build Command Output: /Users/buildslave/jenkins/workspace/lldb-cmake-sanitized/lldb-build/bin/clang -std=c++11 -g -O0 -fno-builtin -isysroot "/Applications/Xcode.app/Contents/Developer/Platforms/MacOSX.platform/Developer/SDKs/MacOSX10.15.sdk" -arch x86_64 -I/Users/buildslave/jenkins/workspace/lldb-cmake-sanitized/llvm-project/lldb/packages/Python/lldbsuite/test/make/../../../../../include -I/Users/buildslave/jenkins/workspace/lldb-cmake-sanitized/llvm-project/lldb/test/API/functionalities/breakpoint/breakpoint_ids -I/Users/buildslave/jenkins/workspace/lldb-cmake-sanitized/llvm-project/lldb/packages/Python/lldbsuite/test/make -include /Users/buildslave/jenkins/workspace/lldb-cmake-sanitized/llvm-project/lldb/packages/Python/lldbsuite/test/make/test_common.h -fno-limit-debug-info --driver-mode=g++ -c -o main.o /Users/buildslave/jenkins/workspace/lldb-cmake-sanitized/llvm-project/lldb/test/API/functionalities/breakpoint/breakpoint_ids/main.cpp In file included from /Users/buildslave/jenkins/workspace/lldb-cmake-sanitized/llvm-project/lldb/test/API/functionalities/breakpoint/breakpoint_ids/main.cpp:3: In file included from /Users/buildslave/jenkins/workspace/lldb-cmake-sanitized/lldb-build/bin/../include/c++/v1/fstream:183: /Users/buildslave/jenkins/workspace/lldb-cmake-sanitized/lldb-build/bin/../include/c++/v1/ostream:1038:45: error: no template named 'enable_if_t'; did you mean 'enable_if'? template <class _Stream, class _Tp, class = enable_if_t< ^ /Users/buildslave/jenkins/workspace/lldb-cmake-sanitized/lldb-build/bin/../include/c++/v1/type_traits:538:63: note: 'enable_if' declared here template <bool, class _Tp = void> struct _LIBCPP_TEMPLATE_VIS enable_if {}; ^ In file included from /Users/buildslave/jenkins/workspace/lldb-cmake-sanitized/llvm-project/lldb/test/API/functionalities/breakpoint/breakpoint_ids/main.cpp:3: In file included from /Users/buildslave/jenkins/workspace/lldb-cmake-sanitized/lldb-build/bin/../include/c++/v1/fstream:184: /Users/buildslave/jenkins/workspace/lldb-cmake-sanitized/lldb-build/bin/../include/c++/v1/istream:1389:45: error: no template named 'enable_if_t'; did you mean 'enable_if'? template <class _Stream, class _Tp, class = enable_if_t< ^ /Users/buildslave/jenkins/workspace/lldb-cmake-sanitized/lldb-build/bin/../include/c++/v1/type_traits:538:63: note: 'enable_if' declared here template <bool, class _Tp = void> struct _LIBCPP_TEMPLATE_VIS enable_if {}; ^ 2 errors generated. make: *** [main.o] Error 1

Hide Details

Test Directory: /Users/buildslave/jenkins/workspace/lldb-cmake-sanitized/llvm-project/lldb/test/API/functionalities/breakpoint/breakpoint_ids ====================================================================== ERROR: test_gmodules (TestBreakpointIDs.BreakpointIDTestCase) ---------------------------------------------------------------------- Error when building test subject.

Hide Details

Build Command: make VPATH=/Users/buildslave/jenkins/workspace/lldb-cmake-sanitized/llvm-project/lldb/test/API/functionalities/breakpoint/breakpoint_ids -C /Users/buildslave/jenkins/workspace/lldb-cmake-sanitized/lldb-build/lldb-test-build.noindex/functionalities/breakpoint/breakpoint_ids/TestBreakpointIDs.test_gmodules -I /Users/buildslave/jenkins/workspace/lldb-cmake-sanitized/llvm-project/lldb/test/API/functionalities/breakpoint/breakpoint_ids -I /Users/buildslave/jenkins/workspace/lldb-cmake-sanitized/llvm-project/lldb/packages/Python/lldbsuite/test/make -f /Users/buildslave/jenkins/workspace/lldb-cmake-sanitized/llvm-project/lldb/test/API/functionalities/breakpoint/breakpoint_ids/Makefile MAKE_DSYM=NO MAKE_GMODULES=YES ARCH=x86_64 CC="/Users/buildslave/jenkins/workspace/lldb-cmake-sanitized/lldb-build/bin/clang" DSYMUTIL="/Users/buildslave/jenkins/workspace/lldb-cmake-sanitized/lldb-build/./bin/dsymutil" CLANG_MODULE_CACHE_DIR=/Users/buildslave/jenkins/workspace/lldb-cmake-sanitized/lldb-build/lldb-test-build.noindex/module-cache-clang/lldb-api

Hide Details

Build Command Output: While building module 'std' imported from /Users/buildslave/jenkins/workspace/lldb-cmake-sanitized/llvm-project/lldb/test/API/functionalities/breakpoint/breakpoint_ids/main.cpp:1: In file included from <module-includes>:31: In file included from /Users/buildslave/jenkins/workspace/lldb-cmake-sanitized/lldb-build/bin/../include/c++/v1/complex.h:28: In file included from /Users/buildslave/jenkins/workspace/lldb-cmake-sanitized/lldb-build/bin/../include/c++/v1/ccomplex:20: In file included from /Users/buildslave/jenkins/workspace/lldb-cmake-sanitized/lldb-build/bin/../include/c++/v1/complex:247: In file included from /Users/buildslave/jenkins/workspace/lldb-cmake-sanitized/lldb-build/bin/../include/c++/v1/sstream:173: /Users/buildslave/jenkins/workspace/lldb-cmake-sanitized/lldb-build/bin/../include/c++/v1/ostream:1038:45: error: no template named 'enable_if_t'; did you mean 'enable_if'? template <class _Stream, class _Tp, class = enable_if_t< ^ /Users/buildslave/jenkins/workspace/lldb-cmake-sanitized/lldb-build/bin/../include/c++/v1/type_traits:538:63: note: 'enable_if' declared here template <bool, class _Tp = void> struct _LIBCPP_TEMPLATE_VIS enable_if {}; ^ While building module 'std' imported from /Users/buildslave/jenkins/workspace/lldb-cmake-sanitized/llvm-project/lldb/test/API/functionalities/breakpoint/breakpoint_ids/main.cpp:1: In file included from <module-includes>:31: In file included from /Users/buildslave/jenkins/workspace/lldb-cmake-sanitized/lldb-build/bin/../include/c++/v1/complex.h:28: In file included from /Users/buildslave/jenkins/workspace/lldb-cmake-sanitized/lldb-build/bin/../include/c++/v1/ccomplex:20: In file included from /Users/buildslave/jenkins/workspace/lldb-cmake-sanitized/lldb-build/bin/../include/c++/v1/complex:247: In file included from /Users/buildslave/jenkins/workspace/lldb-cmake-sanitized/lldb-build/bin/../include/c++/v1/sstream:174: /Users/buildslave/jenkins/workspace/lldb-cmake-sanitized/lldb-build/bin/../include/c++/v1/istream:1389:45: error: no template named 'enable_if_t'; did you mean 'enable_if'? template <class _Stream, class _Tp, class = enable_if_t< ^ /Users/buildslave/jenkins/workspace/lldb-cmake-sanitized/lldb-build/bin/../include/c++/v1/type_traits:538:63: note: 'enable_if' declared here template <bool, class _Tp = void> struct _LIBCPP_TEMPLATE_VIS enable_if {}; ^ /Users/buildslave/jenkins/workspace/lldb-cmake-sanitized/llvm-project/lldb/test/API/functionalities/breakpoint/breakpoint_ids/main.cpp:1:10: fatal error: could not build module 'std' #include <cstdlib> ~~~~~~~~^ 3 errors generated. /Users/buildslave/jenkins/workspace/lldb-cmake-sanitized/lldb-build/bin/clang -fmodules -gmodules -fmodules-cache-path=/Users/buildslave/jenkins/workspace/lldb-cmake-sanitized/lldb-build/lldb-test-build.noindex/module-cache-clang/lldb-api -gmodules -fcxx-modules -std=c++11 -g -O0 -fno-builtin -isysroot "/Applications/Xcode.app/Contents/Developer/Platforms/MacOSX.platform/Developer/SDKs/MacOSX10.15.sdk" -arch x86_64 -I/Users/buildslave/jenkins/workspace/lldb-cmake-sanitized/llvm-project/lldb/packages/Python/lldbsuite/test/make/../../../../../include -I/Users/buildslave/jenkins/workspace/lldb-cmake-sanitized/llvm-project/lldb/test/API/functionalities/breakpoint/breakpoint_ids -I/Users/buildslave/jenkins/workspace/lldb-cmake-sanitized/llvm-project/lldb/packages/Python/lldbsuite/test/make -include /Users/buildslave/jenkins/workspace/lldb-cmake-sanitized/llvm-project/lldb/packages/Python/lldbsuite/test/make/test_common.h -fno-limit-debug-info -fmodules -gmodules -fmodules-cache-path=/Users/buildslave/jenkins/workspace/lldb-cmake-sanitized/lldb-build/lldb-test-build.noindex/module-cache-clang/lldb-api -gmodules -fcxx-modules --driver-mode=g++ -c -o main.o /Users/buildslave/jenkins/workspace/lldb-cmake-sanitized/llvm-project/lldb/test/API/functionalities/breakpoint/breakpoint_ids/main.cpp While building module 'std' imported from /Users/buildslave/jenkins/workspace/lldb-cmake-sanitized/llvm-project/lldb/test/API/functionalities/breakpoint/breakpoint_ids/main.cpp:1: In file included from <module-includes>:31: In file included from /Users/buildslave/jenkins/workspace/lldb-cmake-sanitized/lldb-build/bin/../include/c++/v1/complex.h:28: In file included from /Users/buildslave/jenkins/workspace/lldb-cmake-sanitized/lldb-build/bin/../include/c++/v1/ccomplex:20: In file included from /Users/buildslave/jenkins/workspace/lldb-cmake-sanitized/lldb-build/bin/../include/c++/v1/complex:247: In file included from /Users/buildslave/jenkins/workspace/lldb-cmake-sanitized/lldb-build/bin/../include/c++/v1/sstream:173: /Users/buildslave/jenkins/workspace/lldb-cmake-sanitized/lldb-build/bin/../include/c++/v1/ostream:1038:45: error: no template named 'enable_if_t'; did you mean 'enable_if'? template <class _Stream, class _Tp, class = enable_if_t< ^ /Users/buildslave/jenkins/workspace/lldb-cmake-sanitized/lldb-build/bin/../include/c++/v1/type_traits:538:63: note: 'enable_if' declared here template <bool, class _Tp = void> struct _LIBCPP_TEMPLATE_VIS enable_if {}; ^ While building module 'std' imported from /Users/buildslave/jenkins/workspace/lldb-cmake-sanitized/llvm-project/lldb/test/API/functionalities/breakpoint/breakpoint_ids/main.cpp:1: In file included from <module-includes>:31: In file included from /Users/buildslave/jenkins/workspace/lldb-cmake-sanitized/lldb-build/bin/../include/c++/v1/complex.h:28: In file included from /Users/buildslave/jenkins/workspace/lldb-cmake-sanitized/lldb-build/bin/../include/c++/v1/ccomplex:20: In file included from /Users/buildslave/jenkins/workspace/lldb-cmake-sanitized/lldb-build/bin/../include/c++/v1/complex:247: In file included from /Users/buildslave/jenkins/workspace/lldb-cmake-sanitized/lldb-build/bin/../include/c++/v1/sstream:174: /Users/buildslave/jenkins/workspace/lldb-cmake-sanitized/lldb-build/bin/../include/c++/v1/istream:1389:45: error: no template named 'enable_if_t'; did you mean 'enable_if'? template <class _Stream, class _Tp, class = enable_if_t< ^ /Users/buildslave/jenkins/workspace/lldb-cmake-sanitized/lldb-build/bin/../include/c++/v1/type_traits:538:63: note: 'enable_if' declared here template <bool, class _Tp = void> struct _LIBCPP_TEMPLATE_VIS enable_if {}; ^ /Users/buildslave/jenkins/workspace/lldb-cmake-sanitized/llvm-project/lldb/test/API/functionalities/breakpoint/breakpoint_ids/main.cpp:1:10: fatal error: could not build module 'std' #include <cstdlib> ~~~~~~~~^ 3 errors generated. make: *** [main.o] Error 1

Hide Details

Test Directory: /Users/buildslave/jenkins/workspace/lldb-cmake-sanitized/llvm-project/lldb/test/API/functionalities/breakpoint/breakpoint_ids ---------------------------------------------------------------------- Ran 4 tests in 45.039s

Hide Details

RESULT: FAILED (0 passes, 0 failures, 3 errors, 1 skipped, 0 expected failures, 0 unexpected successes)

Hide Details

--

Hide Details

******************** FAIL: lldb-api :: commands/expression/import-std-module/basic/TestImportStdModule.py (2138 of 2139) ******************** TEST 'lldb-api :: commands/expression/import-std-module/basic/TestImportStdModule.py' FAILED ******************** Script: -- /Users/buildslave/jenkins/workspace/lldb-cmake-sanitized/lldb-build/lldb-test-build.noindex/copied-python /Users/buildslave/jenkins/workspace/lldb-cmake-sanitized/llvm-project/lldb/test/API/dotest.py -s /Users/buildslave/jenkins/workspace/lldb-cmake-sanitized/lldb-build/lldb-test-traces -S nm -u CXXFLAGS -u CFLAGS --codesign-identity lldb_codesign --server /Users/buildslave/jenkins/workspace/lldb-cmake-sanitized/lldb-build/./bin/debugserver --arch x86_64 --build-dir /Users/buildslave/jenkins/workspace/lldb-cmake-sanitized/lldb-build/lldb-test-build.noindex -s=/Users/buildslave/jenkins/workspace/lldb-cmake-sanitized/test/logs -t --env TERM=vt100 --env LLVM_LIBS_DIR=/Users/buildslave/jenkins/workspace/lldb-cmake-sanitized/lldb-build/./lib --inferior-env ASAN_OPTIONS=detect_stack_use_after_return=1 --inferior-env DYLD_INSERT_LIBRARIES=/Users/buildslave/jenkins/workspace/lldb-cmake-sanitized/host-compiler/lib/clang/12.0.0/lib/darwin/libclang_rt.asan_osx_dynamic.dylib --arch x86_64 --build-dir /Users/buildslave/jenkins/workspace/lldb-cmake-sanitized/lldb-build/lldb-test-build.noindex --lldb-module-cache-dir /Users/buildslave/jenkins/workspace/lldb-cmake-sanitized/lldb-build/lldb-test-build.noindex/module-cache-lldb/lldb-api --clang-module-cache-dir /Users/buildslave/jenkins/workspace/lldb-cmake-sanitized/lldb-build/lldb-test-build.noindex/module-cache-clang/lldb-api --executable /Users/buildslave/jenkins/workspace/lldb-cmake-sanitized/lldb-build/./bin/lldb --compiler /Users/buildslave/jenkins/workspace/lldb-cmake-sanitized/lldb-build/./bin/clang --dsymutil /Users/buildslave/jenkins/workspace/lldb-cmake-sanitized/lldb-build/./bin/dsymutil --filecheck /Users/buildslave/jenkins/workspace/lldb-cmake-sanitized/lldb-build/./bin/FileCheck --yaml2obj /Users/buildslave/jenkins/workspace/lldb-cmake-sanitized/lldb-build/./bin/yaml2obj --lldb-libs-dir /Users/buildslave/jenkins/workspace/lldb-cmake-sanitized/lldb-build/./lib /Users/buildslave/jenkins/workspace/lldb-cmake-sanitized/llvm-project/lldb/test/API/commands/expression/import-std-module/basic -p TestImportStdModule.py -- Exit Code: 1

Hide Details

Command Output (stdout): -- lldb version 12.0.99 clang revision d6ac649ccda289ecc2d2c0cb51892d57e8ec328c llvm revision d6ac649ccda289ecc2d2c0cb51892d57e8ec328c libstdcxx tests will not be run because: Don't know how to build with libstdcxx on macosx Skipping following debug info categories: ['dwo']

Hide Details

-- Command Output (stderr): --

Hide Details

Session logs for test failures/errors/unexpected successes will go into directory '/Users/buildslave/jenkins/workspace/lldb-cmake-sanitized/test/logs' Change dir to: /Users/buildslave/jenkins/workspace/lldb-cmake-sanitized/llvm-project/lldb/test/API/commands/expression/import-std-module/basic runCmd: settings clear -all output:

Hide Details

runCmd: settings set symbols.enable-external-lookup false output:

Hide Details

runCmd: settings set target.inherit-tcc true output:

Hide Details

runCmd: settings set target.auto-apply-fixits false output:

Hide Details

runCmd: settings set plugin.process.gdb-remote.packet-timeout 60 output:

Hide Details

runCmd: settings set symbols.clang-modules-cache-path "/Users/buildslave/jenkins/workspace/lldb-cmake-sanitized/lldb-build/lldb-test-build.noindex/module-cache-lldb/lldb-api" output:

Hide Details

runCmd: settings set use-color false output:

Hide Details

runCmd: setting set target.prefer-dynamic-value no-dynamic-values output:

Hide Details

runCmd: settings set target.env-vars ASAN_OPTIONS=detect_stack_use_after_return=1 DYLD_INSERT_LIBRARIES=/Users/buildslave/jenkins/workspace/lldb-cmake-sanitized/host-compiler/lib/clang/12.0.0/lib/darwin/libclang_rt.asan_osx_dynamic.dylib output:

Hide Details

FAIL: LLDB (/Users/buildslave/jenkins/workspace/lldb-cmake-sanitized/lldb-build/bin/clang-x86_64) :: test_dsym (TestImportStdModule.ImportStdModule) runCmd: settings clear -all output:

Hide Details

runCmd: settings set symbols.enable-external-lookup false output:

Hide Details

runCmd: settings set target.inherit-tcc true output:

Hide Details

runCmd: settings set target.auto-apply-fixits false output:

Hide Details

runCmd: settings set plugin.process.gdb-remote.packet-timeout 60 output:

Hide Details

runCmd: settings set symbols.clang-modules-cache-path "/Users/buildslave/jenkins/workspace/lldb-cmake-sanitized/lldb-build/lldb-test-build.noindex/module-cache-lldb/lldb-api" output:

Hide Details

runCmd: settings set use-color false output:

Hide Details

runCmd: setting set target.prefer-dynamic-value no-dynamic-values output:

Hide Details

runCmd: settings set target.env-vars ASAN_OPTIONS=detect_stack_use_after_return=1 DYLD_INSERT_LIBRARIES=/Users/buildslave/jenkins/workspace/lldb-cmake-sanitized/host-compiler/lib/clang/12.0.0/lib/darwin/libclang_rt.asan_osx_dynamic.dylib output:

Hide Details

FAIL: LLDB (/Users/buildslave/jenkins/workspace/lldb-cmake-sanitized/lldb-build/bin/clang-x86_64) :: test_dwarf (TestImportStdModule.ImportStdModule) UNSUPPORTED: LLDB (/Users/buildslave/jenkins/workspace/lldb-cmake-sanitized/lldb-build/bin/clang-x86_64) :: test_dwo (TestImportStdModule.ImportStdModule) (test case does not fall in any category of interest for this run) runCmd: settings clear -all output:

Hide Details

runCmd: settings set symbols.enable-external-lookup false output:

Hide Details

runCmd: settings set target.inherit-tcc true output:

Hide Details

runCmd: settings set target.auto-apply-fixits false output:

Hide Details

runCmd: settings set plugin.process.gdb-remote.packet-timeout 60 output:

Hide Details

runCmd: settings set symbols.clang-modules-cache-path "/Users/buildslave/jenkins/workspace/lldb-cmake-sanitized/lldb-build/lldb-test-build.noindex/module-cache-lldb/lldb-api" output:

Hide Details

runCmd: settings set use-color false output:

Hide Details

runCmd: setting set target.prefer-dynamic-value no-dynamic-values output:

Hide Details

runCmd: settings set target.env-vars ASAN_OPTIONS=detect_stack_use_after_return=1 DYLD_INSERT_LIBRARIES=/Users/buildslave/jenkins/workspace/lldb-cmake-sanitized/host-compiler/lib/clang/12.0.0/lib/darwin/libclang_rt.asan_osx_dynamic.dylib output:

Hide Details

FAIL: LLDB (/Users/buildslave/jenkins/workspace/lldb-cmake-sanitized/lldb-build/bin/clang-x86_64) :: test_gmodules (TestImportStdModule.ImportStdModule) runCmd: settings clear -all output:

Hide Details

runCmd: settings set symbols.enable-external-lookup false output:

Hide Details

runCmd: settings set target.inherit-tcc true output:

Hide Details

runCmd: settings set target.auto-apply-fixits false output:

Hide Details

runCmd: settings set plugin.process.gdb-remote.packet-timeout 60 output:

Hide Details

runCmd: settings set symbols.clang-modules-cache-path "/Users/buildslave/jenkins/workspace/lldb-cmake-sanitized/lldb-build/lldb-test-build.noindex/module-cache-lldb/lldb-api" output:

Hide Details

runCmd: settings set use-color false output:

Hide Details

runCmd: setting set target.prefer-dynamic-value no-dynamic-values output:

Hide Details

runCmd: settings set target.env-vars ASAN_OPTIONS=detect_stack_use_after_return=1 DYLD_INSERT_LIBRARIES=/Users/buildslave/jenkins/workspace/lldb-cmake-sanitized/host-compiler/lib/clang/12.0.0/lib/darwin/libclang_rt.asan_osx_dynamic.dylib output:

Hide Details

FAIL: LLDB (/Users/buildslave/jenkins/workspace/lldb-cmake-sanitized/lldb-build/bin/clang-x86_64) :: test_non_cpp_language_dsym (TestImportStdModule.ImportStdModule) runCmd: settings clear -all output:

Hide Details

runCmd: settings set symbols.enable-external-lookup false output:

Hide Details

runCmd: settings set target.inherit-tcc true output:

Hide Details

runCmd: settings set target.auto-apply-fixits false output:

Hide Details

runCmd: settings set plugin.process.gdb-remote.packet-timeout 60 output:

Hide Details

runCmd: settings set symbols.clang-modules-cache-path "/Users/buildslave/jenkins/workspace/lldb-cmake-sanitized/lldb-build/lldb-test-build.noindex/module-cache-lldb/lldb-api" output:

Hide Details

runCmd: settings set use-color false output:

Hide Details

runCmd: setting set target.prefer-dynamic-value no-dynamic-values output:

Hide Details

runCmd: settings set target.env-vars ASAN_OPTIONS=detect_stack_use_after_return=1 DYLD_INSERT_LIBRARIES=/Users/buildslave/jenkins/workspace/lldb-cmake-sanitized/host-compiler/lib/clang/12.0.0/lib/darwin/libclang_rt.asan_osx_dynamic.dylib output:

Hide Details

FAIL: LLDB (/Users/buildslave/jenkins/workspace/lldb-cmake-sanitized/lldb-build/bin/clang-x86_64) :: test_non_cpp_language_dwarf (TestImportStdModule.ImportStdModule) UNSUPPORTED: LLDB (/Users/buildslave/jenkins/workspace/lldb-cmake-sanitized/lldb-build/bin/clang-x86_64) :: test_non_cpp_language_dwo (TestImportStdModule.ImportStdModule) (test case does not fall in any category of interest for this run) runCmd: settings clear -all output:

Hide Details

runCmd: settings set symbols.enable-external-lookup false output:

Hide Details

runCmd: settings set target.inherit-tcc true output:

Hide Details

runCmd: settings set target.auto-apply-fixits false output:

Hide Details

runCmd: settings set plugin.process.gdb-remote.packet-timeout 60 output:

Hide Details

runCmd: settings set symbols.clang-modules-cache-path "/Users/buildslave/jenkins/workspace/lldb-cmake-sanitized/lldb-build/lldb-test-build.noindex/module-cache-lldb/lldb-api" output:

Hide Details

runCmd: settings set use-color false output:

Hide Details

runCmd: setting set target.prefer-dynamic-value no-dynamic-values output:

Hide Details

runCmd: settings set target.env-vars ASAN_OPTIONS=detect_stack_use_after_return=1 DYLD_INSERT_LIBRARIES=/Users/buildslave/jenkins/workspace/lldb-cmake-sanitized/host-compiler/lib/clang/12.0.0/lib/darwin/libclang_rt.asan_osx_dynamic.dylib output:

Hide Details

FAIL: LLDB (/Users/buildslave/jenkins/workspace/lldb-cmake-sanitized/lldb-build/bin/clang-x86_64) :: test_non_cpp_language_gmodules (TestImportStdModule.ImportStdModule) Restore dir to: /Users/buildslave/jenkins/workspace/lldb-cmake-sanitized/lldb-build/tools/lldb/test ====================================================================== ERROR: test_dsym (TestImportStdModule.ImportStdModule) ---------------------------------------------------------------------- Error when building test subject.

Hide Details

Build Command: make VPATH=/Users/buildslave/jenkins/workspace/lldb-cmake-sanitized/llvm-project/lldb/test/API/commands/expression/import-std-module/basic -C /Users/buildslave/jenkins/workspace/lldb-cmake-sanitized/lldb-build/lldb-test-build.noindex/commands/expression/import-std-module/basic/TestImportStdModule.test_dsym -I /Users/buildslave/jenkins/workspace/lldb-cmake-sanitized/llvm-project/lldb/test/API/commands/expression/import-std-module/basic -I /Users/buildslave/jenkins/workspace/lldb-cmake-sanitized/llvm-project/lldb/packages/Python/lldbsuite/test/make -f /Users/buildslave/jenkins/workspace/lldb-cmake-sanitized/llvm-project/lldb/test/API/commands/expression/import-std-module/basic/Makefile MAKE_DSYM=YES ARCH=x86_64 CC="/Users/buildslave/jenkins/workspace/lldb-cmake-sanitized/lldb-build/bin/clang" DSYMUTIL="/Users/buildslave/jenkins/workspace/lldb-cmake-sanitized/lldb-build/./bin/dsymutil" CLANG_MODULE_CACHE_DIR=/Users/buildslave/jenkins/workspace/lldb-cmake-sanitized/lldb-build/lldb-test-build.noindex/module-cache-clang/lldb-api all

Hide Details

Build Command Output: /Users/buildslave/jenkins/workspace/lldb-cmake-sanitized/lldb-build/bin/clang -std=c++11 -g -O0 -fno-builtin -isysroot "/Applications/Xcode.app/Contents/Developer/Platforms/MacOSX.platform/Developer/SDKs/MacOSX10.15.sdk" -arch x86_64 -I/Users/buildslave/jenkins/workspace/lldb-cmake-sanitized/llvm-project/lldb/packages/Python/lldbsuite/test/make/../../../../../include -I/Users/buildslave/jenkins/workspace/lldb-cmake-sanitized/llvm-project/lldb/test/API/commands/expression/import-std-module/basic -I/Users/buildslave/jenkins/workspace/lldb-cmake-sanitized/llvm-project/lldb/packages/Python/lldbsuite/test/make -include /Users/buildslave/jenkins/workspace/lldb-cmake-sanitized/llvm-project/lldb/packages/Python/lldbsuite/test/make/test_common.h -fno-limit-debug-info -DLLDB_USING_LIBCPP -stdlib=libc++ --driver-mode=g++ -c -o main.o /Users/buildslave/jenkins/workspace/lldb-cmake-sanitized/llvm-project/lldb/test/API/commands/expression/import-std-module/basic/main.cpp In file included from /Users/buildslave/jenkins/workspace/lldb-cmake-sanitized/llvm-project/lldb/test/API/commands/expression/import-std-module/basic/main.cpp:2: In file included from /Users/buildslave/jenkins/workspace/lldb-cmake-sanitized/lldb-build/bin/../include/c++/v1/iostream:39: In file included from /Users/buildslave/jenkins/workspace/lldb-cmake-sanitized/lldb-build/bin/../include/c++/v1/istream:163: /Users/buildslave/jenkins/workspace/lldb-cmake-sanitized/lldb-build/bin/../include/c++/v1/ostream:1038:45: error: no template named 'enable_if_t'; did you mean 'enable_if'? template <class _Stream, class _Tp, class = enable_if_t< ^ /Users/buildslave/jenkins/workspace/lldb-cmake-sanitized/lldb-build/bin/../include/c++/v1/type_traits:538:63: note: 'enable_if' declared here template <bool, class _Tp = void> struct _LIBCPP_TEMPLATE_VIS enable_if {}; ^ In file included from /Users/buildslave/jenkins/workspace/lldb-cmake-sanitized/llvm-project/lldb/test/API/commands/expression/import-std-module/basic/main.cpp:2: In file included from /Users/buildslave/jenkins/workspace/lldb-cmake-sanitized/lldb-build/bin/../include/c++/v1/iostream:39: /Users/buildslave/jenkins/workspace/lldb-cmake-sanitized/lldb-build/bin/../include/c++/v1/istream:1389:45: error: no template named 'enable_if_t'; did you mean 'enable_if'? template <class _Stream, class _Tp, class = enable_if_t< ^ /Users/buildslave/jenkins/workspace/lldb-cmake-sanitized/lldb-build/bin/../include/c++/v1/type_traits:538:63: note: 'enable_if' declared here template <bool, class _Tp = void> struct _LIBCPP_TEMPLATE_VIS enable_if {}; ^ 2 errors generated. make: *** [main.o] Error 1

Hide Details

Test Directory: /Users/buildslave/jenkins/workspace/lldb-cmake-sanitized/llvm-project/lldb/test/API/commands/expression/import-std-module/basic ====================================================================== ERROR: test_dwarf (TestImportStdModule.ImportStdModule) ---------------------------------------------------------------------- Error when building test subject.

Hide Details

Build Command: make VPATH=/Users/buildslave/jenkins/workspace/lldb-cmake-sanitized/llvm-project/lldb/test/API/commands/expression/import-std-module/basic -C /Users/buildslave/jenkins/workspace/lldb-cmake-sanitized/lldb-build/lldb-test-build.noindex/commands/expression/import-std-module/basic/TestImportStdModule.test_dwarf -I /Users/buildslave/jenkins/workspace/lldb-cmake-sanitized/llvm-project/lldb/test/API/commands/expression/import-std-module/basic -I /Users/buildslave/jenkins/workspace/lldb-cmake-sanitized/llvm-project/lldb/packages/Python/lldbsuite/test/make -f /Users/buildslave/jenkins/workspace/lldb-cmake-sanitized/llvm-project/lldb/test/API/commands/expression/import-std-module/basic/Makefile MAKE_DSYM=NO ARCH=x86_64 CC="/Users/buildslave/jenkins/workspace/lldb-cmake-sanitized/lldb-build/bin/clang" DSYMUTIL="/Users/buildslave/jenkins/workspace/lldb-cmake-sanitized/lldb-build/./bin/dsymutil" CLANG_MODULE_CACHE_DIR=/Users/buildslave/jenkins/workspace/lldb-cmake-sanitized/lldb-build/lldb-test-build.noindex/module-cache-clang/lldb-api

Hide Details

Build Command Output: /Users/buildslave/jenkins/workspace/lldb-cmake-sanitized/lldb-build/bin/clang -std=c++11 -g -O0 -fno-builtin -isysroot "/Applications/Xcode.app/Contents/Developer/Platforms/MacOSX.platform/Developer/SDKs/MacOSX10.15.sdk" -arch x86_64 -I/Users/buildslave/jenkins/workspace/lldb-cmake-sanitized/llvm-project/lldb/packages/Python/lldbsuite/test/make/../../../../../include -I/Users/buildslave/jenkins/workspace/lldb-cmake-sanitized/llvm-project/lldb/test/API/commands/expression/import-std-module/basic -I/Users/buildslave/jenkins/workspace/lldb-cmake-sanitized/llvm-project/lldb/packages/Python/lldbsuite/test/make -include /Users/buildslave/jenkins/workspace/lldb-cmake-sanitized/llvm-project/lldb/packages/Python/lldbsuite/test/make/test_common.h -fno-limit-debug-info -DLLDB_USING_LIBCPP -stdlib=libc++ --driver-mode=g++ -c -o main.o /Users/buildslave/jenkins/workspace/lldb-cmake-sanitized/llvm-project/lldb/test/API/commands/expression/import-std-module/basic/main.cpp In file included from /Users/buildslave/jenkins/workspace/lldb-cmake-sanitized/llvm-project/lldb/test/API/commands/expression/import-std-module/basic/main.cpp:2: In file included from /Users/buildslave/jenkins/workspace/lldb-cmake-sanitized/lldb-build/bin/../include/c++/v1/iostream:39: In file included from /Users/buildslave/jenkins/workspace/lldb-cmake-sanitized/lldb-build/bin/../include/c++/v1/istream:163: /Users/buildslave/jenkins/workspace/lldb-cmake-sanitized/lldb-build/bin/../include/c++/v1/ostream:1038:45: error: no template named 'enable_if_t'; did you mean 'enable_if'? template <class _Stream, class _Tp, class = enable_if_t< ^ /Users/buildslave/jenkins/workspace/lldb-cmake-sanitized/lldb-build/bin/../include/c++/v1/type_traits:538:63: note: 'enable_if' declared here template <bool, class _Tp = void> struct _LIBCPP_TEMPLATE_VIS enable_if {}; ^ In file included from /Users/buildslave/jenkins/workspace/lldb-cmake-sanitized/llvm-project/lldb/test/API/commands/expression/import-std-module/basic/main.cpp:2: In file included from /Users/buildslave/jenkins/workspace/lldb-cmake-sanitized/lldb-build/bin/../include/c++/v1/iostream:39: /Users/buildslave/jenkins/workspace/lldb-cmake-sanitized/lldb-build/bin/../include/c++/v1/istream:1389:45: error: no template named 'enable_if_t'; did you mean 'enable_if'? template <class _Stream, class _Tp, class = enable_if_t< ^ /Users/buildslave/jenkins/workspace/lldb-cmake-sanitized/lldb-build/bin/../include/c++/v1/type_traits:538:63: note: 'enable_if' declared here template <bool, class _Tp = void> struct _LIBCPP_TEMPLATE_VIS enable_if {}; ^ 2 errors generated. make: *** [main.o] Error 1

Hide Details

Test Directory: /Users/buildslave/jenkins/workspace/lldb-cmake-sanitized/llvm-project/lldb/test/API/commands/expression/import-std-module/basic ====================================================================== ERROR: test_gmodules (TestImportStdModule.ImportStdModule) ---------------------------------------------------------------------- Error when building test subject.

Hide Details

Build Command: make VPATH=/Users/buildslave/jenkins/workspace/lldb-cmake-sanitized/llvm-project/lldb/test/API/commands/expression/import-std-module/basic -C /Users/buildslave/jenkins/workspace/lldb-cmake-sanitized/lldb-build/lldb-test-build.noindex/commands/expression/import-std-module/basic/TestImportStdModule.test_gmodules -I /Users/buildslave/jenkins/workspace/lldb-cmake-sanitized/llvm-project/lldb/test/API/commands/expression/import-std-module/basic -I /Users/buildslave/jenkins/workspace/lldb-cmake-sanitized/llvm-project/lldb/packages/Python/lldbsuite/test/make -f /Users/buildslave/jenkins/workspace/lldb-cmake-sanitized/llvm-project/lldb/test/API/commands/expression/import-std-module/basic/Makefile MAKE_DSYM=NO MAKE_GMODULES=YES ARCH=x86_64 CC="/Users/buildslave/jenkins/workspace/lldb-cmake-sanitized/lldb-build/bin/clang" DSYMUTIL="/Users/buildslave/jenkins/workspace/lldb-cmake-sanitized/lldb-build/./bin/dsymutil" CLANG_MODULE_CACHE_DIR=/Users/buildslave/jenkins/workspace/lldb-cmake-sanitized/lldb-build/lldb-test-build.noindex/module-cache-clang/lldb-api

Hide Details

Build Command Output: While building module 'std' imported from /Users/buildslave/jenkins/workspace/lldb-cmake-sanitized/llvm-project/lldb/test/API/commands/expression/import-std-module/basic/main.cpp:2: In file included from <module-includes>:31: In file included from /Users/buildslave/jenkins/workspace/lldb-cmake-sanitized/lldb-build/bin/../include/c++/v1/complex.h:28: In file included from /Users/buildslave/jenkins/workspace/lldb-cmake-sanitized/lldb-build/bin/../include/c++/v1/ccomplex:20: In file included from /Users/buildslave/jenkins/workspace/lldb-cmake-sanitized/lldb-build/bin/../include/c++/v1/complex:247: In file included from /Users/buildslave/jenkins/workspace/lldb-cmake-sanitized/lldb-build/bin/../include/c++/v1/sstream:173: /Users/buildslave/jenkins/workspace/lldb-cmake-sanitized/lldb-build/bin/../include/c++/v1/ostream:1038:45: error: no template named 'enable_if_t'; did you mean 'enable_if'? template <class _Stream, class _Tp, class = enable_if_t< ^ /Users/buildslave/jenkins/workspace/lldb-cmake-sanitized/lldb-build/bin/../include/c++/v1/type_traits:538:63: note: 'enable_if' declared here template <bool, class _Tp = void> struct _LIBCPP_TEMPLATE_VIS enable_if {}; ^ While building module 'std' imported from /Users/buildslave/jenkins/workspace/lldb-cmake-sanitized/llvm-project/lldb/test/API/commands/expression/import-std-module/basic/main.cpp:2: In file included from <module-includes>:31: In file included from /Users/buildslave/jenkins/workspace/lldb-cmake-sanitized/lldb-build/bin/../include/c++/v1/complex.h:28: In file included from /Users/buildslave/jenkins/workspace/lldb-cmake-sanitized/lldb-build/bin/../include/c++/v1/ccomplex:20: In file included from /Users/buildslave/jenkins/workspace/lldb-cmake-sanitized/lldb-build/bin/../include/c++/v1/complex:247: In file included from /Users/buildslave/jenkins/workspace/lldb-cmake-sanitized/lldb-build/bin/../include/c++/v1/sstream:174: /Users/buildslave/jenkins/workspace/lldb-cmake-sanitized/lldb-build/bin/../include/c++/v1/istream:1389:45: error: no template named 'enable_if_t'; did you mean 'enable_if'? template <class _Stream, class _Tp, class = enable_if_t< ^ /Users/buildslave/jenkins/workspace/lldb-cmake-sanitized/lldb-build/bin/../include/c++/v1/type_traits:538:63: note: 'enable_if' declared here template <bool, class _Tp = void> struct _LIBCPP_TEMPLATE_VIS enable_if {}; ^ /Users/buildslave/jenkins/workspace/lldb-cmake-sanitized/llvm-project/lldb/test/API/commands/expression/import-std-module/basic/main.cpp:2:10: fatal error: could not build module 'std' #include <iostream> ~~~~~~~~^ 3 errors generated. /Users/buildslave/jenkins/workspace/lldb-cmake-sanitized/lldb-build/bin/clang -fmodules -gmodules -fmodules-cache-path=/Users/buildslave/jenkins/workspace/lldb-cmake-sanitized/lldb-build/lldb-test-build.noindex/module-cache-clang/lldb-api -gmodules -fcxx-modules -std=c++11 -g -O0 -fno-builtin -isysroot "/Applications/Xcode.app/Contents/Developer/Platforms/MacOSX.platform/Developer/SDKs/MacOSX10.15.sdk" -arch x86_64 -I/Users/buildslave/jenkins/workspace/lldb-cmake-sanitized/llvm-project/lldb/packages/Python/lldbsuite/test/make/../../../../../include -I/Users/buildslave/jenkins/workspace/lldb-cmake-sanitized/llvm-project/lldb/test/API/commands/expression/import-std-module/basic -I/Users/buildslave/jenkins/workspace/lldb-cmake-sanitized/llvm-project/lldb/packages/Python/lldbsuite/test/make -include /Users/buildslave/jenkins/workspace/lldb-cmake-sanitized/llvm-project/lldb/packages/Python/lldbsuite/test/make/test_common.h -fno-limit-debug-info -fmodules -gmodules -fmodules-cache-path=/Users/buildslave/jenkins/workspace/lldb-cmake-sanitized/lldb-build/lldb-test-build.noindex/module-cache-clang/lldb-api -gmodules -fcxx-modules -DLLDB_USING_LIBCPP -stdlib=libc++ --driver-mode=g++ -c -o main.o /Users/buildslave/jenkins/workspace/lldb-cmake-sanitized/llvm-project/lldb/test/API/commands/expression/import-std-module/basic/main.cpp While building module 'std' imported from /Users/buildslave/jenkins/workspace/lldb-cmake-sanitized/llvm-project/lldb/test/API/commands/expression/import-std-module/basic/main.cpp:2: In file included from <module-includes>:31: In file included from /Users/buildslave/jenkins/workspace/lldb-cmake-sanitized/lldb-build/bin/../include/c++/v1/complex.h:28: In file included from /Users/buildslave/jenkins/workspace/lldb-cmake-sanitized/lldb-build/bin/../include/c++/v1/ccomplex:20: In file included from /Users/buildslave/jenkins/workspace/lldb-cmake-sanitized/lldb-build/bin/../include/c++/v1/complex:247: In file included from /Users/buildslave/jenkins/workspace/lldb-cmake-sanitized/lldb-build/bin/../include/c++/v1/sstream:173: /Users/buildslave/jenkins/workspace/lldb-cmake-sanitized/lldb-build/bin/../include/c++/v1/ostream:1038:45: error: no template named 'enable_if_t'; did you mean 'enable_if'? template <class _Stream, class _Tp, class = enable_if_t< ^ /Users/buildslave/jenkins/workspace/lldb-cmake-sanitized/lldb-build/bin/../include/c++/v1/type_traits:538:63: note: 'enable_if' declared here template <bool, class _Tp = void> struct _LIBCPP_TEMPLATE_VIS enable_if {}; ^ While building module 'std' imported from /Users/buildslave/jenkins/workspace/lldb-cmake-sanitized/llvm-project/lldb/test/API/commands/expression/import-std-module/basic/main.cpp:2: In file included from <module-includes>:31: In file included from /Users/buildslave/jenkins/workspace/lldb-cmake-sanitized/lldb-build/bin/../include/c++/v1/complex.h:28: In file included from /Users/buildslave/jenkins/workspace/lldb-cmake-sanitized/lldb-build/bin/../include/c++/v1/ccomplex:20: In file included from /Users/buildslave/jenkins/workspace/lldb-cmake-sanitized/lldb-build/bin/../include/c++/v1/complex:247: In file included from /Users/buildslave/jenkins/workspace/lldb-cmake-sanitized/lldb-build/bin/../include/c++/v1/sstream:174: /Users/buildslave/jenkins/workspace/lldb-cmake-sanitized/lldb-build/bin/../include/c++/v1/istream:1389:45: error: no template named 'enable_if_t'; did you mean 'enable_if'? template <class _Stream, class _Tp, class = enable_if_t< ^ /Users/buildslave/jenkins/workspace/lldb-cmake-sanitized/lldb-build/bin/../include/c++/v1/type_traits:538:63: note: 'enable_if' declared here template <bool, class _Tp = void> struct _LIBCPP_TEMPLATE_VIS enable_if {}; ^ /Users/buildslave/jenkins/workspace/lldb-cmake-sanitized/llvm-project/lldb/test/API/commands/expression/import-std-module/basic/main.cpp:2:10: fatal error: could not build module 'std' #include <iostream> ~~~~~~~~^ 3 errors generated. make: *** [main.o] Error 1

Hide Details

Test Directory: /Users/buildslave/jenkins/workspace/lldb-cmake-sanitized/llvm-project/lldb/test/API/commands/expression/import-std-module/basic ====================================================================== ERROR: test_non_cpp_language_dsym (TestImportStdModule.ImportStdModule) ---------------------------------------------------------------------- Error when building test subject.

Hide Details

Build Command: make VPATH=/Users/buildslave/jenkins/workspace/lldb-cmake-sanitized/llvm-project/lldb/test/API/commands/expression/import-std-module/basic -C /Users/buildslave/jenkins/workspace/lldb-cmake-sanitized/lldb-build/lldb-test-build.noindex/commands/expression/import-std-module/basic/TestImportStdModule.test_non_cpp_language_dsym -I /Users/buildslave/jenkins/workspace/lldb-cmake-sanitized/llvm-project/lldb/test/API/commands/expression/import-std-module/basic -I /Users/buildslave/jenkins/workspace/lldb-cmake-sanitized/llvm-project/lldb/packages/Python/lldbsuite/test/make -f /Users/buildslave/jenkins/workspace/lldb-cmake-sanitized/llvm-project/lldb/test/API/commands/expression/import-std-module/basic/Makefile MAKE_DSYM=YES ARCH=x86_64 CC="/Users/buildslave/jenkins/workspace/lldb-cmake-sanitized/lldb-build/bin/clang" DSYMUTIL="/Users/buildslave/jenkins/workspace/lldb-cmake-sanitized/lldb-build/./bin/dsymutil" CLANG_MODULE_CACHE_DIR=/Users/buildslave/jenkins/workspace/lldb-cmake-sanitized/lldb-build/lldb-test-build.noindex/module-cache-clang/lldb-api all

Hide Details

Build Command Output: /Users/buildslave/jenkins/workspace/lldb-cmake-sanitized/lldb-build/bin/clang -std=c++11 -g -O0 -fno-builtin -isysroot "/Applications/Xcode.app/Contents/Developer/Platforms/MacOSX.platform/Developer/SDKs/MacOSX10.15.sdk" -arch x86_64 -I/Users/buildslave/jenkins/workspace/lldb-cmake-sanitized/llvm-project/lldb/packages/Python/lldbsuite/test/make/../../../../../include -I/Users/buildslave/jenkins/workspace/lldb-cmake-sanitized/llvm-project/lldb/test/API/commands/expression/import-std-module/basic -I/Users/buildslave/jenkins/workspace/lldb-cmake-sanitized/llvm-project/lldb/packages/Python/lldbsuite/test/make -include /Users/buildslave/jenkins/workspace/lldb-cmake-sanitized/llvm-project/lldb/packages/Python/lldbsuite/test/make/test_common.h -fno-limit-debug-info -DLLDB_USING_LIBCPP -stdlib=libc++ --driver-mode=g++ -c -o main.o /Users/buildslave/jenkins/workspace/lldb-cmake-sanitized/llvm-project/lldb/test/API/commands/expression/import-std-module/basic/main.cpp In file included from /Users/buildslave/jenkins/workspace/lldb-cmake-sanitized/llvm-project/lldb/test/API/commands/expression/import-std-module/basic/main.cpp:2: In file included from /Users/buildslave/jenkins/workspace/lldb-cmake-sanitized/lldb-build/bin/../include/c++/v1/iostream:39: In file included from /Users/buildslave/jenkins/workspace/lldb-cmake-sanitized/lldb-build/bin/../include/c++/v1/istream:163: /Users/buildslave/jenkins/workspace/lldb-cmake-sanitized/lldb-build/bin/../include/c++/v1/ostream:1038:45: error: no template named 'enable_if_t'; did you mean 'enable_if'? template <class _Stream, class _Tp, class = enable_if_t< ^ /Users/buildslave/jenkins/workspace/lldb-cmake-sanitized/lldb-build/bin/../include/c++/v1/type_traits:538:63: note: 'enable_if' declared here template <bool, class _Tp = void> struct _LIBCPP_TEMPLATE_VIS enable_if {}; ^ In file included from /Users/buildslave/jenkins/workspace/lldb-cmake-sanitized/llvm-project/lldb/test/API/commands/expression/import-std-module/basic/main.cpp:2: In file included from /Users/buildslave/jenkins/workspace/lldb-cmake-sanitized/lldb-build/bin/../include/c++/v1/iostream:39: /Users/buildslave/jenkins/workspace/lldb-cmake-sanitized/lldb-build/bin/../include/c++/v1/istream:1389:45: error: no template named 'enable_if_t'; did you mean 'enable_if'? template <class _Stream, class _Tp, class = enable_if_t< ^ /Users/buildslave/jenkins/workspace/lldb-cmake-sanitized/lldb-build/bin/../include/c++/v1/type_traits:538:63: note: 'enable_if' declared here template <bool, class _Tp = void> struct _LIBCPP_TEMPLATE_VIS enable_if {}; ^ 2 errors generated. make: *** [main.o] Error 1

Hide Details

Test Directory: /Users/buildslave/jenkins/workspace/lldb-cmake-sanitized/llvm-project/lldb/test/API/commands/expression/import-std-module/basic ====================================================================== ERROR: test_non_cpp_language_dwarf (TestImportStdModule.ImportStdModule) ---------------------------------------------------------------------- Error when building test subject.

Hide Details

Build Command: make VPATH=/Users/buildslave/jenkins/workspace/lldb-cmake-sanitized/llvm-project/lldb/test/API/commands/expression/import-std-module/basic -C /Users/buildslave/jenkins/workspace/lldb-cmake-sanitized/lldb-build/lldb-test-build.noindex/commands/expression/import-std-module/basic/TestImportStdModule.test_non_cpp_language_dwarf -I /Users/buildslave/jenkins/workspace/lldb-cmake-sanitized/llvm-project/lldb/test/API/commands/expression/import-std-module/basic -I /Users/buildslave/jenkins/workspace/lldb-cmake-sanitized/llvm-project/lldb/packages/Python/lldbsuite/test/make -f /Users/buildslave/jenkins/workspace/lldb-cmake-sanitized/llvm-project/lldb/test/API/commands/expression/import-std-module/basic/Makefile MAKE_DSYM=NO ARCH=x86_64 CC="/Users/buildslave/jenkins/workspace/lldb-cmake-sanitized/lldb-build/bin/clang" DSYMUTIL="/Users/buildslave/jenkins/workspace/lldb-cmake-sanitized/lldb-build/./bin/dsymutil" CLANG_MODULE_CACHE_DIR=/Users/buildslave/jenkins/workspace/lldb-cmake-sanitized/lldb-build/lldb-test-build.noindex/module-cache-clang/lldb-api

Hide Details

Build Command Output: /Users/buildslave/jenkins/workspace/lldb-cmake-sanitized/lldb-build/bin/clang -std=c++11 -g -O0 -fno-builtin -isysroot "/Applications/Xcode.app/Contents/Developer/Platforms/MacOSX.platform/Developer/SDKs/MacOSX10.15.sdk" -arch x86_64 -I/Users/buildslave/jenkins/workspace/lldb-cmake-sanitized/llvm-project/lldb/packages/Python/lldbsuite/test/make/../../../../../include -I/Users/buildslave/jenkins/workspace/lldb-cmake-sanitized/llvm-project/lldb/test/API/commands/expression/import-std-module/basic -I/Users/buildslave/jenkins/workspace/lldb-cmake-sanitized/llvm-project/lldb/packages/Python/lldbsuite/test/make -include /Users/buildslave/jenkins/workspace/lldb-cmake-sanitized/llvm-project/lldb/packages/Python/lldbsuite/test/make/test_common.h -fno-limit-debug-info -DLLDB_USING_LIBCPP -stdlib=libc++ --driver-mode=g++ -c -o main.o /Users/buildslave/jenkins/workspace/lldb-cmake-sanitized/llvm-project/lldb/test/API/commands/expression/import-std-module/basic/main.cpp In file included from /Users/buildslave/jenkins/workspace/lldb-cmake-sanitized/llvm-project/lldb/test/API/commands/expression/import-std-module/basic/main.cpp:2: In file included from /Users/buildslave/jenkins/workspace/lldb-cmake-sanitized/lldb-build/bin/../include/c++/v1/iostream:39: In file included from /Users/buildslave/jenkins/workspace/lldb-cmake-sanitized/lldb-build/bin/../include/c++/v1/istream:163: /Users/buildslave/jenkins/workspace/lldb-cmake-sanitized/lldb-build/bin/../include/c++/v1/ostream:1038:45: error: no template named 'enable_if_t'; did you mean 'enable_if'? template <class _Stream, class _Tp, class = enable_if_t< ^ /Users/buildslave/jenkins/workspace/lldb-cmake-sanitized/lldb-build/bin/../include/c++/v1/type_traits:538:63: note: 'enable_if' declared here template <bool, class _Tp = void> struct _LIBCPP_TEMPLATE_VIS enable_if {}; ^ In file included from /Users/buildslave/jenkins/workspace/lldb-cmake-sanitized/llvm-project/lldb/test/API/commands/expression/import-std-module/basic/main.cpp:2: In file included from /Users/buildslave/jenkins/workspace/lldb-cmake-sanitized/lldb-build/bin/../include/c++/v1/iostream:39: /Users/buildslave/jenkins/workspace/lldb-cmake-sanitized/lldb-build/bin/../include/c++/v1/istream:1389:45: error: no template named 'enable_if_t'; did you mean 'enable_if'? template <class _Stream, class _Tp, class = enable_if_t< ^ /Users/buildslave/jenkins/workspace/lldb-cmake-sanitized/lldb-build/bin/../include/c++/v1/type_traits:538:63: note: 'enable_if' declared here template <bool, class _Tp = void> struct _LIBCPP_TEMPLATE_VIS enable_if {}; ^ 2 errors generated. make: *** [main.o] Error 1

Hide Details

Test Directory: /Users/buildslave/jenkins/workspace/lldb-cmake-sanitized/llvm-project/lldb/test/API/commands/expression/import-std-module/basic ====================================================================== ERROR: test_non_cpp_language_gmodules (TestImportStdModule.ImportStdModule) ---------------------------------------------------------------------- Error when building test subject.

Hide Details

Build Command: make VPATH=/Users/buildslave/jenkins/workspace/lldb-cmake-sanitized/llvm-project/lldb/test/API/commands/expression/import-std-module/basic -C /Users/buildslave/jenkins/workspace/lldb-cmake-sanitized/lldb-build/lldb-test-build.noindex/commands/expression/import-std-module/basic/TestImportStdModule.test_non_cpp_language_gmodules -I /Users/buildslave/jenkins/workspace/lldb-cmake-sanitized/llvm-project/lldb/test/API/commands/expression/import-std-module/basic -I /Users/buildslave/jenkins/workspace/lldb-cmake-sanitized/llvm-project/lldb/packages/Python/lldbsuite/test/make -f /Users/buildslave/jenkins/workspace/lldb-cmake-sanitized/llvm-project/lldb/test/API/commands/expression/import-std-module/basic/Makefile MAKE_DSYM=NO MAKE_GMODULES=YES ARCH=x86_64 CC="/Users/buildslave/jenkins/workspace/lldb-cmake-sanitized/lldb-build/bin/clang" DSYMUTIL="/Users/buildslave/jenkins/workspace/lldb-cmake-sanitized/lldb-build/./bin/dsymutil" CLANG_MODULE_CACHE_DIR=/Users/buildslave/jenkins/workspace/lldb-cmake-sanitized/lldb-build/lldb-test-build.noindex/module-cache-clang/lldb-api

Hide Details

Build Command Output: While building module 'std' imported from /Users/buildslave/jenkins/workspace/lldb-cmake-sanitized/llvm-project/lldb/test/API/commands/expression/import-std-module/basic/main.cpp:2: In file included from <module-includes>:31: In file included from /Users/buildslave/jenkins/workspace/lldb-cmake-sanitized/lldb-build/bin/../include/c++/v1/complex.h:28: In file included from /Users/buildslave/jenkins/workspace/lldb-cmake-sanitized/lldb-build/bin/../include/c++/v1/ccomplex:20: In file included from /Users/buildslave/jenkins/workspace/lldb-cmake-sanitized/lldb-build/bin/../include/c++/v1/complex:247: In file included from /Users/buildslave/jenkins/workspace/lldb-cmake-sanitized/lldb-build/bin/../include/c++/v1/sstream:173: /Users/buildslave/jenkins/workspace/lldb-cmake-sanitized/lldb-build/bin/../include/c++/v1/ostream:1038:45: error: no template named 'enable_if_t'; did you mean 'enable_if'? template <class _Stream, class _Tp, class = enable_if_t< ^ /Users/buildslave/jenkins/workspace/lldb-cmake-sanitized/lldb-build/bin/../include/c++/v1/type_traits:538:63: note: 'enable_if' declared here template <bool, class _Tp = void> struct _LIBCPP_TEMPLATE_VIS enable_if {}; ^ While building module 'std' imported from /Users/buildslave/jenkins/workspace/lldb-cmake-sanitized/llvm-project/lldb/test/API/commands/expression/import-std-module/basic/main.cpp:2: In file included from <module-includes>:31: In file included from /Users/buildslave/jenkins/workspace/lldb-cmake-sanitized/lldb-build/bin/../include/c++/v1/complex.h:28: In file included from /Users/buildslave/jenkins/workspace/lldb-cmake-sanitized/lldb-build/bin/../include/c++/v1/ccomplex:20: In file included from /Users/buildslave/jenkins/workspace/lldb-cmake-sanitized/lldb-build/bin/../include/c++/v1/complex:247: In file included from /Users/buildslave/jenkins/workspace/lldb-cmake-sanitized/lldb-build/bin/../include/c++/v1/sstream:174: /Users/buildslave/jenkins/workspace/lldb-cmake-sanitized/lldb-build/bin/../include/c++/v1/istream:1389:45: error: no template named 'enable_if_t'; did you mean 'enable_if'? template <class _Stream, class _Tp, class = enable_if_t< ^ /Users/buildslave/jenkins/workspace/lldb-cmake-sanitized/lldb-build/bin/../include/c++/v1/type_traits:538:63: note: 'enable_if' declared here template <bool, class _Tp = void> struct _LIBCPP_TEMPLATE_VIS enable_if {}; ^ /Users/buildslave/jenkins/workspace/lldb-cmake-sanitized/llvm-project/lldb/test/API/commands/expression/import-std-module/basic/main.cpp:2:10: fatal error: could not build module 'std' #include <iostream> ~~~~~~~~^ 3 errors generated. /Users/buildslave/jenkins/workspace/lldb-cmake-sanitized/lldb-build/bin/clang -fmodules -gmodules -fmodules-cache-path=/Users/buildslave/jenkins/workspace/lldb-cmake-sanitized/lldb-build/lldb-test-build.noindex/module-cache-clang/lldb-api -gmodules -fcxx-modules -std=c++11 -g -O0 -fno-builtin -isysroot "/Applications/Xcode.app/Contents/Developer/Platforms/MacOSX.platform/Developer/SDKs/MacOSX10.15.sdk" -arch x86_64 -I/Users/buildslave/jenkins/workspace/lldb-cmake-sanitized/llvm-project/lldb/packages/Python/lldbsuite/test/make/../../../../../include -I/Users/buildslave/jenkins/workspace/lldb-cmake-sanitized/llvm-project/lldb/test/API/commands/expression/import-std-module/basic -I/Users/buildslave/jenkins/workspace/lldb-cmake-sanitized/llvm-project/lldb/packages/Python/lldbsuite/test/make -include /Users/buildslave/jenkins/workspace/lldb-cmake-sanitized/llvm-project/lldb/packages/Python/lldbsuite/test/make/test_common.h -fno-limit-debug-info -fmodules -gmodules -fmodules-cache-path=/Users/buildslave/jenkins/workspace/lldb-cmake-sanitized/lldb-build/lldb-test-build.noindex/module-cache-clang/lldb-api -gmodules -fcxx-modules -DLLDB_USING_LIBCPP -stdlib=libc++ --driver-mode=g++ -c -o main.o /Users/buildslave/jenkins/workspace/lldb-cmake-sanitized/llvm-project/lldb/test/API/commands/expression/import-std-module/basic/main.cpp While building module 'std' imported from /Users/buildslave/jenkins/workspace/lldb-cmake-sanitized/llvm-project/lldb/test/API/commands/expression/import-std-module/basic/main.cpp:2: In file included from <module-includes>:31: In file included from /Users/buildslave/jenkins/workspace/lldb-cmake-sanitized/lldb-build/bin/../include/c++/v1/complex.h:28: In file included from /Users/buildslave/jenkins/workspace/lldb-cmake-sanitized/lldb-build/bin/../include/c++/v1/ccomplex:20: In file included from /Users/buildslave/jenkins/workspace/lldb-cmake-sanitized/lldb-build/bin/../include/c++/v1/complex:247: In file included from /Users/buildslave/jenkins/workspace/lldb-cmake-sanitized/lldb-build/bin/../include/c++/v1/sstream:173: /Users/buildslave/jenkins/workspace/lldb-cmake-sanitized/lldb-build/bin/../include/c++/v1/ostream:1038:45: error: no template named 'enable_if_t'; did you mean 'enable_if'? template <class _Stream, class _Tp, class = enable_if_t< ^ /Users/buildslave/jenkins/workspace/lldb-cmake-sanitized/lldb-build/bin/../include/c++/v1/type_traits:538:63: note: 'enable_if' declared here template <bool, class _Tp = void> struct _LIBCPP_TEMPLATE_VIS enable_if {}; ^ While building module 'std' imported from /Users/buildslave/jenkins/workspace/lldb-cmake-sanitized/llvm-project/lldb/test/API/commands/expression/import-std-module/basic/main.cpp:2: In file included from <module-includes>:31: In file included from /Users/buildslave/jenkins/workspace/lldb-cmake-sanitized/lldb-build/bin/../include/c++/v1/complex.h:28: In file included from /Users/buildslave/jenkins/workspace/lldb-cmake-sanitized/lldb-build/bin/../include/c++/v1/ccomplex:20: In file included from /Users/buildslave/jenkins/workspace/lldb-cmake-sanitized/lldb-build/bin/../include/c++/v1/complex:247: In file included from /Users/buildslave/jenkins/workspace/lldb-cmake-sanitized/lldb-build/bin/../include/c++/v1/sstream:174: /Users/buildslave/jenkins/workspace/lldb-cmake-sanitized/lldb-build/bin/../include/c++/v1/istream:1389:45: error: no template named 'enable_if_t'; did you mean 'enable_if'? template <class _Stream, class _Tp, class = enable_if_t< ^ /Users/buildslave/jenkins/workspace/lldb-cmake-sanitized/lldb-build/bin/../include/c++/v1/type_traits:538:63: note: 'enable_if' declared here template <bool, class _Tp = void> struct _LIBCPP_TEMPLATE_VIS enable_if {}; ^ /Users/buildslave/jenkins/workspace/lldb-cmake-sanitized/llvm-project/lldb/test/API/commands/expression/import-std-module/basic/main.cpp:2:10: fatal error: could not build module 'std' #include <iostream> ~~~~~~~~^ 3 errors generated. make: *** [main.o] Error 1

Hide Details

Test Directory: /Users/buildslave/jenkins/workspace/lldb-cmake-sanitized/llvm-project/lldb/test/API/commands/expression/import-std-module/basic ---------------------------------------------------------------------- Ran 8 tests in 80.329s

Hide Details

RESULT: FAILED (0 passes, 0 failures, 6 errors, 2 skipped, 0 expected failures, 0 unexpected successes)

Hide Details

--

Hide Details

******************** Cancelling nested steps due to timeout Sending interrupt signal to process ninja: build stopped: interrupted by user. script returned exit code 143 [Pipeline] } [Pipeline] // timeout [Pipeline] } [Pipeline] // stage [Pipeline] stage [Pipeline] { (Declarative: Post Actions) [Pipeline] scanForIssues [Clang (LLVM based)] Sleeping for 5 seconds due to JENKINS-32191... [Clang (LLVM based)] Parsing console log (workspace: '/Users/buildslave/jenkins/workspace/lldb-cmake-sanitized') [Clang (LLVM based)] Successfully parsed console log [Clang (LLVM based)] -> found 94 issues (skipped 1727 duplicates) [Clang (LLVM based)] Post processing issues on 'green-dragon-23' with source code encoding 'UTF-8' [Clang (LLVM based)] Creating SCM blamer to obtain author and commit information for affected files [Clang (LLVM based)] Creating SCM miner to obtain statistics for affected repository files [Clang (LLVM based)] Resolving file names for all issues in source directory '/Users/buildslave/jenkins/workspace/lldb-cmake-sanitized' [Clang (LLVM based)] -> resolved paths in source directory (93 found, 0 not found) [Clang (LLVM based)] Resolving module names from module definitions (build.xml, pom.xml, or Manifest.mf files) [Clang (LLVM based)] -> resolved module names for 94 issues [Clang (LLVM based)] Resolving package names (or namespaces) by parsing the affected files [Clang (LLVM based)] -> resolved package names of 93 affected files [Clang (LLVM based)] No filter has been set, publishing all 94 issues [Clang (LLVM based)] Creating fingerprints for all affected code blocks to track issues over different builds [Clang (LLVM based)] -> created fingerprints for 94 issues (skipped 0 issues) [Clang (LLVM based)] Copying affected files to Jenkins' build folder '/Users/Shared/Jenkins/Home/jobs/lldb-cmake-sanitized/builds/1810/files-with-issues' [Clang (LLVM based)] -> 74 copied, 20 not in workspace, 0 not-found, 0 with I/O error [Pipeline] junit Recording test results No test report files were found. Configuration error? Error when executing always post condition: Also: hudson.remoting.Channel$CallSiteStackTrace: Remote call to green-dragon-23 at hudson.remoting.Channel.attachCallSiteStackTrace(Channel.java:1788) at hudson.remoting.UserRequest$ExceptionResponse.retrieve(UserRequest.java:356) at hudson.remoting.Channel.call(Channel.java:998) at hudson.FilePath.act(FilePath.java:1069) at hudson.FilePath.act(FilePath.java:1058) at hudson.tasks.junit.JUnitParser.parseResult(JUnitParser.java:114) at hudson.tasks.junit.JUnitResultArchiver.parse(JUnitResultArchiver.java:137) at hudson.tasks.junit.JUnitResultArchiver.parseAndAttach(JUnitResultArchiver.java:167) at hudson.tasks.junit.pipeline.JUnitResultsStepExecution.run(JUnitResultsStepExecution.java:52) at hudson.tasks.junit.pipeline.JUnitResultsStepExecution.run(JUnitResultsStepExecution.java:25) at org.jenkinsci.plugins.workflow.steps.SynchronousNonBlockingStepExecution.lambda$start$0(SynchronousNonBlockingStepExecution.java:47) at java.util.concurrent.Executors$RunnableAdapter.call(Executors.java:511) hudson.AbortException: No test report files were found. Configuration error? at hudson.tasks.junit.JUnitParser$ParseResultCallable.invoke(JUnitParser.java:154) at hudson.tasks.junit.JUnitParser$ParseResultCallable.invoke(JUnitParser.java:118) at hudson.FilePath$FileCallableWrapper.call(FilePath.java:3073) at hudson.remoting.UserRequest.perform(UserRequest.java:211) at hudson.remoting.UserRequest.perform(UserRequest.java:54) at hudson.remoting.Request$2.run(Request.java:369) at hudson.remoting.InterceptingExecutorService$1.call(InterceptingExecutorService.java:72) at java.util.concurrent.FutureTask.run(FutureTask.java:266) at java.util.concurrent.ThreadPoolExecutor.runWorker(ThreadPoolExecutor.java:1149) at java.util.concurrent.ThreadPoolExecutor$Worker.run(ThreadPoolExecutor.java:624) at java.lang.Thread.run(Thread.java:748)

Hide Details

[Pipeline] } [Pipeline] // stage [Pipeline] } [Pipeline] // withEnv [Pipeline] } [Pipeline] // node [Pipeline] End of Pipeline Timeout has been exceeded Finished: ABORTED