FailedConsole Output

Skipping 9,790 KB.. Full Log
 tearDown hook:         def shutdown_socket():
            if sock:
                try:
                    # send the kill packet so lldb-server shuts down gracefully
                    sock.sendall(GdbRemoteTestCaseBase._GDBREMOTE_KILL_PACKET)
                except:
                    logger.warning(
                        "failed to send kill packet to debug monitor: {}; ignoring".format(
                            sys.exc_info()[0]))

Hide Details

try: sock.close() except: logger.warning( "failed to close socket to debug monitor: {}; ignoring".format( sys.exc_info()[0]))

Hide Details

Hide Details

2020-08-08 13:07:06,134 WARNING failed to send kill packet to debug monitor: <class 'TypeError'>; ignoring Executing tearDown hook: def shutdown_named_pipe(): # Close the pipe. try: named_pipe.close() except: print("failed to close named pipe") None

Hide Details

# Delete the pipe. try: os.remove(named_pipe_path) except: print("failed to delete named pipe: {}".format(named_pipe_path)) None

Hide Details

# Delete the temp directory. try: os.rmdir(temp_dir) except: print( "failed to delete temp dir: {}, directory contents: '{}'".format( temp_dir, os.listdir(temp_dir))) None

Hide Details

Hide Details

PASS: LLDB (/Users/buildslave/jenkins/workspace/lldb-cmake/lldb-build/bin/clang-x86_64) :: test_qMemoryRegionInfo_reports_heap_address_as_readable_writeable_debugserver (TestLldbGdbServer.LldbGdbServerTestCase) runCmd: settings clear -all output:

Hide Details

runCmd: settings set symbols.enable-external-lookup false output:

Hide Details

runCmd: settings set target.inherit-tcc true output:

Hide Details

runCmd: settings set target.auto-apply-fixits false output:

Hide Details

runCmd: settings set plugin.process.gdb-remote.packet-timeout 60 output:

Hide Details

runCmd: settings set symbols.clang-modules-cache-path "/Users/buildslave/jenkins/workspace/lldb-cmake/lldb-build/lldb-test-build.noindex/module-cache-lldb/lldb-api" output:

Hide Details

runCmd: settings set use-color false output:

Hide Details

runCmd: setting set target.prefer-dynamic-value no-dynamic-values output:

Hide Details

UNSUPPORTED: LLDB (/Users/buildslave/jenkins/workspace/lldb-cmake/lldb-build/bin/clang-x86_64) :: test_qMemoryRegionInfo_reports_heap_address_as_readable_writeable_llgs (TestLldbGdbServer.LldbGdbServerTestCase) (llgs tests) runCmd: settings clear -all output:

Hide Details

runCmd: settings set symbols.enable-external-lookup false output:

Hide Details

runCmd: settings set target.inherit-tcc true output:

Hide Details

runCmd: settings set target.auto-apply-fixits false output:

Hide Details

runCmd: settings set plugin.process.gdb-remote.packet-timeout 60 output:

Hide Details

runCmd: settings set symbols.clang-modules-cache-path "/Users/buildslave/jenkins/workspace/lldb-cmake/lldb-build/lldb-test-build.noindex/module-cache-lldb/lldb-api" output:

Hide Details

runCmd: settings set use-color false output:

Hide Details

runCmd: setting set target.prefer-dynamic-value no-dynamic-values output:

Hide Details

Adding tearDown hook: def shutdown_named_pipe(): # Close the pipe. try: named_pipe.close() except: print("failed to close named pipe") None

Hide Details

# Delete the pipe. try: os.remove(named_pipe_path) except: print("failed to delete named pipe: {}".format(named_pipe_path)) None

Hide Details

# Delete the temp directory. try: os.rmdir(temp_dir) except: print( "failed to delete temp dir: {}, directory contents: '{}'".format( temp_dir, os.listdir(temp_dir))) None

Hide Details

Hide Details

Adding tearDown hook: def shutdown_socket(): if sock: try: # send the kill packet so lldb-server shuts down gracefully sock.sendall(GdbRemoteTestCaseBase._GDBREMOTE_KILL_PACKET) except: logger.warning( "failed to send kill packet to debug monitor: {}; ignoring".format( sys.exc_info()[0]))

Hide Details

try: sock.close() except: logger.warning( "failed to close socket to debug monitor: {}; ignoring".format( sys.exc_info()[0]))

Hide Details

Hide Details

Executing tearDown hook: def shutdown_socket(): if sock: try: # send the kill packet so lldb-server shuts down gracefully sock.sendall(GdbRemoteTestCaseBase._GDBREMOTE_KILL_PACKET) except: logger.warning( "failed to send kill packet to debug monitor: {}; ignoring".format( sys.exc_info()[0]))

Hide Details

try: sock.close() except: logger.warning( "failed to close socket to debug monitor: {}; ignoring".format( sys.exc_info()[0]))

Hide Details

Hide Details

2020-08-08 13:07:12,345 WARNING failed to send kill packet to debug monitor: <class 'TypeError'>; ignoring Executing tearDown hook: def shutdown_named_pipe(): # Close the pipe. try: named_pipe.close() except: print("failed to close named pipe") None

Hide Details

# Delete the pipe. try: os.remove(named_pipe_path) except: print("failed to delete named pipe: {}".format(named_pipe_path)) None

Hide Details

# Delete the temp directory. try: os.rmdir(temp_dir) except: print( "failed to delete temp dir: {}, directory contents: '{}'".format( temp_dir, os.listdir(temp_dir))) None

Hide Details

Hide Details

PASS: LLDB (/Users/buildslave/jenkins/workspace/lldb-cmake/lldb-build/bin/clang-x86_64) :: test_qMemoryRegionInfo_reports_stack_address_as_readable_writeable_debugserver (TestLldbGdbServer.LldbGdbServerTestCase) runCmd: settings clear -all output:

Hide Details

runCmd: settings set symbols.enable-external-lookup false output:

Hide Details

runCmd: settings set target.inherit-tcc true output:

Hide Details

runCmd: settings set target.auto-apply-fixits false output:

Hide Details

runCmd: settings set plugin.process.gdb-remote.packet-timeout 60 output:

Hide Details

runCmd: settings set symbols.clang-modules-cache-path "/Users/buildslave/jenkins/workspace/lldb-cmake/lldb-build/lldb-test-build.noindex/module-cache-lldb/lldb-api" output:

Hide Details

runCmd: settings set use-color false output:

Hide Details

runCmd: setting set target.prefer-dynamic-value no-dynamic-values output:

Hide Details

UNSUPPORTED: LLDB (/Users/buildslave/jenkins/workspace/lldb-cmake/lldb-build/bin/clang-x86_64) :: test_qMemoryRegionInfo_reports_stack_address_as_readable_writeable_llgs (TestLldbGdbServer.LldbGdbServerTestCase) (llgs tests) runCmd: settings clear -all output:

Hide Details

runCmd: settings set symbols.enable-external-lookup false output:

Hide Details

runCmd: settings set target.inherit-tcc true output:

Hide Details

runCmd: settings set target.auto-apply-fixits false output:

Hide Details

runCmd: settings set plugin.process.gdb-remote.packet-timeout 60 output:

Hide Details

runCmd: settings set symbols.clang-modules-cache-path "/Users/buildslave/jenkins/workspace/lldb-cmake/lldb-build/lldb-test-build.noindex/module-cache-lldb/lldb-api" output:

Hide Details

runCmd: settings set use-color false output:

Hide Details

runCmd: setting set target.prefer-dynamic-value no-dynamic-values output:

Hide Details

Adding tearDown hook: def shutdown_named_pipe(): # Close the pipe. try: named_pipe.close() except: print("failed to close named pipe") None

Hide Details

# Delete the pipe. try: os.remove(named_pipe_path) except: print("failed to delete named pipe: {}".format(named_pipe_path)) None

Hide Details

# Delete the temp directory. try: os.rmdir(temp_dir) except: print( "failed to delete temp dir: {}, directory contents: '{}'".format( temp_dir, os.listdir(temp_dir))) None

Hide Details

Hide Details

Adding tearDown hook: def shutdown_socket(): if sock: try: # send the kill packet so lldb-server shuts down gracefully sock.sendall(GdbRemoteTestCaseBase._GDBREMOTE_KILL_PACKET) except: logger.warning( "failed to send kill packet to debug monitor: {}; ignoring".format( sys.exc_info()[0]))

Hide Details

try: sock.close() except: logger.warning( "failed to close socket to debug monitor: {}; ignoring".format( sys.exc_info()[0]))

Hide Details

Hide Details

Executing tearDown hook: def shutdown_socket(): if sock: try: # send the kill packet so lldb-server shuts down gracefully sock.sendall(GdbRemoteTestCaseBase._GDBREMOTE_KILL_PACKET) except: logger.warning( "failed to send kill packet to debug monitor: {}; ignoring".format( sys.exc_info()[0]))

Hide Details

try: sock.close() except: logger.warning( "failed to close socket to debug monitor: {}; ignoring".format( sys.exc_info()[0]))

Hide Details

Hide Details

2020-08-08 13:07:22,734 WARNING failed to send kill packet to debug monitor: <class 'TypeError'>; ignoring Executing tearDown hook: def shutdown_named_pipe(): # Close the pipe. try: named_pipe.close() except: print("failed to close named pipe") None

Hide Details

# Delete the pipe. try: os.remove(named_pipe_path) except: print("failed to delete named pipe: {}".format(named_pipe_path)) None

Hide Details

# Delete the temp directory. try: os.rmdir(temp_dir) except: print( "failed to delete temp dir: {}, directory contents: '{}'".format( temp_dir, os.listdir(temp_dir))) None

Hide Details

Hide Details

PASS: LLDB (/Users/buildslave/jenkins/workspace/lldb-cmake/lldb-build/bin/clang-x86_64) :: test_qRegisterInfo_contains_at_least_one_register_set_debugserver (TestLldbGdbServer.LldbGdbServerTestCase) runCmd: settings clear -all output:

Hide Details

runCmd: settings set symbols.enable-external-lookup false output:

Hide Details

runCmd: settings set target.inherit-tcc true output:

Hide Details

runCmd: settings set target.auto-apply-fixits false output:

Hide Details

runCmd: settings set plugin.process.gdb-remote.packet-timeout 60 output:

Hide Details

runCmd: settings set symbols.clang-modules-cache-path "/Users/buildslave/jenkins/workspace/lldb-cmake/lldb-build/lldb-test-build.noindex/module-cache-lldb/lldb-api" output:

Hide Details

runCmd: settings set use-color false output:

Hide Details

runCmd: setting set target.prefer-dynamic-value no-dynamic-values output:

Hide Details

UNSUPPORTED: LLDB (/Users/buildslave/jenkins/workspace/lldb-cmake/lldb-build/bin/clang-x86_64) :: test_qRegisterInfo_contains_at_least_one_register_set_llgs (TestLldbGdbServer.LldbGdbServerTestCase) (llgs tests) runCmd: settings clear -all output:

Hide Details

runCmd: settings set symbols.enable-external-lookup false output:

Hide Details

runCmd: settings set target.inherit-tcc true output:

Hide Details

runCmd: settings set target.auto-apply-fixits false output:

Hide Details

runCmd: settings set plugin.process.gdb-remote.packet-timeout 60 output:

Hide Details

runCmd: settings set symbols.clang-modules-cache-path "/Users/buildslave/jenkins/workspace/lldb-cmake/lldb-build/lldb-test-build.noindex/module-cache-lldb/lldb-api" output:

Hide Details

runCmd: settings set use-color false output:

Hide Details

runCmd: setting set target.prefer-dynamic-value no-dynamic-values output:

Hide Details

UNSUPPORTED: LLDB (/Users/buildslave/jenkins/workspace/lldb-cmake/lldb-build/bin/clang-x86_64) :: test_qRegisterInfo_contains_avx_registers_llgs (TestLldbGdbServer.LldbGdbServerTestCase) (llgs tests) runCmd: settings clear -all output:

Hide Details

runCmd: settings set symbols.enable-external-lookup false output:

Hide Details

runCmd: settings set target.inherit-tcc true output:

Hide Details

runCmd: settings set target.auto-apply-fixits false output:

Hide Details

runCmd: settings set plugin.process.gdb-remote.packet-timeout 60 output:

Hide Details

runCmd: settings set symbols.clang-modules-cache-path "/Users/buildslave/jenkins/workspace/lldb-cmake/lldb-build/lldb-test-build.noindex/module-cache-lldb/lldb-api" output:

Hide Details

runCmd: settings set use-color false output:

Hide Details

runCmd: setting set target.prefer-dynamic-value no-dynamic-values output:

Hide Details

Adding tearDown hook: def shutdown_named_pipe(): # Close the pipe. try: named_pipe.close() except: print("failed to close named pipe") None

Hide Details

# Delete the pipe. try: os.remove(named_pipe_path) except: print("failed to delete named pipe: {}".format(named_pipe_path)) None

Hide Details

# Delete the temp directory. try: os.rmdir(temp_dir) except: print( "failed to delete temp dir: {}, directory contents: '{}'".format( temp_dir, os.listdir(temp_dir))) None

Hide Details

Hide Details

Adding tearDown hook: def shutdown_socket(): if sock: try: # send the kill packet so lldb-server shuts down gracefully sock.sendall(GdbRemoteTestCaseBase._GDBREMOTE_KILL_PACKET) except: logger.warning( "failed to send kill packet to debug monitor: {}; ignoring".format( sys.exc_info()[0]))

Hide Details

try: sock.close() except: logger.warning( "failed to close socket to debug monitor: {}; ignoring".format( sys.exc_info()[0]))

Hide Details

Hide Details

Executing tearDown hook: def shutdown_socket(): if sock: try: # send the kill packet so lldb-server shuts down gracefully sock.sendall(GdbRemoteTestCaseBase._GDBREMOTE_KILL_PACKET) except: logger.warning( "failed to send kill packet to debug monitor: {}; ignoring".format( sys.exc_info()[0]))

Hide Details

try: sock.close() except: logger.warning( "failed to close socket to debug monitor: {}; ignoring".format( sys.exc_info()[0]))

Hide Details

Hide Details

2020-08-08 13:07:39,502 WARNING failed to send kill packet to debug monitor: <class 'TypeError'>; ignoring Executing tearDown hook: def shutdown_named_pipe(): # Close the pipe. try: named_pipe.close() except: print("failed to close named pipe") None

Hide Details

# Delete the pipe. try: os.remove(named_pipe_path) except: print("failed to delete named pipe: {}".format(named_pipe_path)) None

Hide Details

# Delete the temp directory. try: os.rmdir(temp_dir) except: print( "failed to delete temp dir: {}, directory contents: '{}'".format( temp_dir, os.listdir(temp_dir))) None

Hide Details

Hide Details

PASS: LLDB (/Users/buildslave/jenkins/workspace/lldb-cmake/lldb-build/bin/clang-x86_64) :: test_qRegisterInfo_contains_required_generics_debugserver (TestLldbGdbServer.LldbGdbServerTestCase) runCmd: settings clear -all output:

Hide Details

runCmd: settings set symbols.enable-external-lookup false output:

Hide Details

runCmd: settings set target.inherit-tcc true output:

Hide Details

runCmd: settings set target.auto-apply-fixits false output:

Hide Details

runCmd: settings set plugin.process.gdb-remote.packet-timeout 60 output:

Hide Details

runCmd: settings set symbols.clang-modules-cache-path "/Users/buildslave/jenkins/workspace/lldb-cmake/lldb-build/lldb-test-build.noindex/module-cache-lldb/lldb-api" output:

Hide Details

runCmd: settings set use-color false output:

Hide Details

runCmd: setting set target.prefer-dynamic-value no-dynamic-values output:

Hide Details

UNSUPPORTED: LLDB (/Users/buildslave/jenkins/workspace/lldb-cmake/lldb-build/bin/clang-x86_64) :: test_qRegisterInfo_contains_required_generics_llgs (TestLldbGdbServer.LldbGdbServerTestCase) (llgs tests) runCmd: settings clear -all output:

Hide Details

runCmd: settings set symbols.enable-external-lookup false output:

Hide Details

runCmd: settings set target.inherit-tcc true output:

Hide Details

runCmd: settings set target.auto-apply-fixits false output:

Hide Details

runCmd: settings set plugin.process.gdb-remote.packet-timeout 60 output:

Hide Details

runCmd: settings set symbols.clang-modules-cache-path "/Users/buildslave/jenkins/workspace/lldb-cmake/lldb-build/lldb-test-build.noindex/module-cache-lldb/lldb-api" output:

Hide Details

runCmd: settings set use-color false output:

Hide Details

runCmd: setting set target.prefer-dynamic-value no-dynamic-values output:

Hide Details

Adding tearDown hook: def shutdown_named_pipe(): # Close the pipe. try: named_pipe.close() except: print("failed to close named pipe") None

Hide Details

# Delete the pipe. try: os.remove(named_pipe_path) except: print("failed to delete named pipe: {}".format(named_pipe_path)) None

Hide Details

# Delete the temp directory. try: os.rmdir(temp_dir) except: print( "failed to delete temp dir: {}, directory contents: '{}'".format( temp_dir, os.listdir(temp_dir))) None

Hide Details

Hide Details

Adding tearDown hook: def shutdown_socket(): if sock: try: # send the kill packet so lldb-server shuts down gracefully sock.sendall(GdbRemoteTestCaseBase._GDBREMOTE_KILL_PACKET) except: logger.warning( "failed to send kill packet to debug monitor: {}; ignoring".format( sys.exc_info()[0]))

Hide Details

try: sock.close() except: logger.warning( "failed to close socket to debug monitor: {}; ignoring".format( sys.exc_info()[0]))

Hide Details

Hide Details

Executing tearDown hook: def shutdown_socket(): if sock: try: # send the kill packet so lldb-server shuts down gracefully sock.sendall(GdbRemoteTestCaseBase._GDBREMOTE_KILL_PACKET) except: logger.warning( "failed to send kill packet to debug monitor: {}; ignoring".format( sys.exc_info()[0]))

Hide Details

try: sock.close() except: logger.warning( "failed to close socket to debug monitor: {}; ignoring".format( sys.exc_info()[0]))

Hide Details

Hide Details

2020-08-08 13:07:55,021 WARNING failed to send kill packet to debug monitor: <class 'TypeError'>; ignoring Executing tearDown hook: def shutdown_named_pipe(): # Close the pipe. try: named_pipe.close() except: print("failed to close named pipe") None

Hide Details

# Delete the pipe. try: os.remove(named_pipe_path) except: print("failed to delete named pipe: {}".format(named_pipe_path)) None

Hide Details

# Delete the temp directory. try: os.rmdir(temp_dir) except: print( "failed to delete temp dir: {}, directory contents: '{}'".format( temp_dir, os.listdir(temp_dir))) None

Hide Details

Hide Details

PASS: LLDB (/Users/buildslave/jenkins/workspace/lldb-cmake/lldb-build/bin/clang-x86_64) :: test_qRegisterInfo_returns_all_valid_results_debugserver (TestLldbGdbServer.LldbGdbServerTestCase) runCmd: settings clear -all output:

Hide Details

runCmd: settings set symbols.enable-external-lookup false output:

Hide Details

runCmd: settings set target.inherit-tcc true output:

Hide Details

runCmd: settings set target.auto-apply-fixits false output:

Hide Details

runCmd: settings set plugin.process.gdb-remote.packet-timeout 60 output:

Hide Details

runCmd: settings set symbols.clang-modules-cache-path "/Users/buildslave/jenkins/workspace/lldb-cmake/lldb-build/lldb-test-build.noindex/module-cache-lldb/lldb-api" output:

Hide Details

runCmd: settings set use-color false output:

Hide Details

runCmd: setting set target.prefer-dynamic-value no-dynamic-values output:

Hide Details

UNSUPPORTED: LLDB (/Users/buildslave/jenkins/workspace/lldb-cmake/lldb-build/bin/clang-x86_64) :: test_qRegisterInfo_returns_all_valid_results_llgs (TestLldbGdbServer.LldbGdbServerTestCase) (llgs tests) runCmd: settings clear -all output:

Hide Details

runCmd: settings set symbols.enable-external-lookup false output:

Hide Details

runCmd: settings set target.inherit-tcc true output:

Hide Details

runCmd: settings set target.auto-apply-fixits false output:

Hide Details

runCmd: settings set plugin.process.gdb-remote.packet-timeout 60 output:

Hide Details

runCmd: settings set symbols.clang-modules-cache-path "/Users/buildslave/jenkins/workspace/lldb-cmake/lldb-build/lldb-test-build.noindex/module-cache-lldb/lldb-api" output:

Hide Details

runCmd: settings set use-color false output:

Hide Details

runCmd: setting set target.prefer-dynamic-value no-dynamic-values output:

Hide Details

Adding tearDown hook: def shutdown_named_pipe(): # Close the pipe. try: named_pipe.close() except: print("failed to close named pipe") None

Hide Details

# Delete the pipe. try: os.remove(named_pipe_path) except: print("failed to delete named pipe: {}".format(named_pipe_path)) None

Hide Details

# Delete the temp directory. try: os.rmdir(temp_dir) except: print( "failed to delete temp dir: {}, directory contents: '{}'".format( temp_dir, os.listdir(temp_dir))) None

Hide Details

Hide Details

Adding tearDown hook: def shutdown_socket(): if sock: try: # send the kill packet so lldb-server shuts down gracefully sock.sendall(GdbRemoteTestCaseBase._GDBREMOTE_KILL_PACKET) except: logger.warning( "failed to send kill packet to debug monitor: {}; ignoring".format( sys.exc_info()[0]))

Hide Details

try: sock.close() except: logger.warning( "failed to close socket to debug monitor: {}; ignoring".format( sys.exc_info()[0]))

Hide Details

Hide Details

Executing tearDown hook: def shutdown_socket(): if sock: try: # send the kill packet so lldb-server shuts down gracefully sock.sendall(GdbRemoteTestCaseBase._GDBREMOTE_KILL_PACKET) except: logger.warning( "failed to send kill packet to debug monitor: {}; ignoring".format( sys.exc_info()[0]))

Hide Details

try: sock.close() except: logger.warning( "failed to close socket to debug monitor: {}; ignoring".format( sys.exc_info()[0]))

Hide Details

Hide Details

2020-08-08 13:08:01,788 WARNING failed to send kill packet to debug monitor: <class 'TypeError'>; ignoring Executing tearDown hook: def shutdown_named_pipe(): # Close the pipe. try: named_pipe.close() except: print("failed to close named pipe") None

Hide Details

# Delete the pipe. try: os.remove(named_pipe_path) except: print("failed to delete named pipe: {}".format(named_pipe_path)) None

Hide Details

# Delete the temp directory. try: os.rmdir(temp_dir) except: print( "failed to delete temp dir: {}, directory contents: '{}'".format( temp_dir, os.listdir(temp_dir))) None

Hide Details

Hide Details

PASS: LLDB (/Users/buildslave/jenkins/workspace/lldb-cmake/lldb-build/bin/clang-x86_64) :: test_qRegisterInfo_returns_one_valid_result_debugserver (TestLldbGdbServer.LldbGdbServerTestCase) runCmd: settings clear -all output:

Hide Details

runCmd: settings set symbols.enable-external-lookup false output:

Hide Details

runCmd: settings set target.inherit-tcc true output:

Hide Details

runCmd: settings set target.auto-apply-fixits false output:

Hide Details

runCmd: settings set plugin.process.gdb-remote.packet-timeout 60 output:

Hide Details

runCmd: settings set symbols.clang-modules-cache-path "/Users/buildslave/jenkins/workspace/lldb-cmake/lldb-build/lldb-test-build.noindex/module-cache-lldb/lldb-api" output:

Hide Details

runCmd: settings set use-color false output:

Hide Details

runCmd: setting set target.prefer-dynamic-value no-dynamic-values output:

Hide Details

UNSUPPORTED: LLDB (/Users/buildslave/jenkins/workspace/lldb-cmake/lldb-build/bin/clang-x86_64) :: test_qRegisterInfo_returns_one_valid_result_llgs (TestLldbGdbServer.LldbGdbServerTestCase) (llgs tests) runCmd: settings clear -all output:

Hide Details

runCmd: settings set symbols.enable-external-lookup false output:

Hide Details

runCmd: settings set target.inherit-tcc true output:

Hide Details

runCmd: settings set target.auto-apply-fixits false output:

Hide Details

runCmd: settings set plugin.process.gdb-remote.packet-timeout 60 output:

Hide Details

runCmd: settings set symbols.clang-modules-cache-path "/Users/buildslave/jenkins/workspace/lldb-cmake/lldb-build/lldb-test-build.noindex/module-cache-lldb/lldb-api" output:

Hide Details

runCmd: settings set use-color false output:

Hide Details

runCmd: setting set target.prefer-dynamic-value no-dynamic-values output:

Hide Details

Adding tearDown hook: def shutdown_named_pipe(): # Close the pipe. try: named_pipe.close() except: print("failed to close named pipe") None

Hide Details

# Delete the pipe. try: os.remove(named_pipe_path) except: print("failed to delete named pipe: {}".format(named_pipe_path)) None

Hide Details

# Delete the temp directory. try: os.rmdir(temp_dir) except: print( "failed to delete temp dir: {}, directory contents: '{}'".format( temp_dir, os.listdir(temp_dir))) None

Hide Details

Hide Details

Adding tearDown hook: def shutdown_socket(): if sock: try: # send the kill packet so lldb-server shuts down gracefully sock.sendall(GdbRemoteTestCaseBase._GDBREMOTE_KILL_PACKET) except: logger.warning( "failed to send kill packet to debug monitor: {}; ignoring".format( sys.exc_info()[0]))

Hide Details

try: sock.close() except: logger.warning( "failed to close socket to debug monitor: {}; ignoring".format( sys.exc_info()[0]))

Hide Details

Hide Details

Executing tearDown hook: def shutdown_socket(): if sock: try: # send the kill packet so lldb-server shuts down gracefully sock.sendall(GdbRemoteTestCaseBase._GDBREMOTE_KILL_PACKET) except: logger.warning( "failed to send kill packet to debug monitor: {}; ignoring".format( sys.exc_info()[0]))

Hide Details

try: sock.close() except: logger.warning( "failed to close socket to debug monitor: {}; ignoring".format( sys.exc_info()[0]))

Hide Details

Hide Details

2020-08-08 13:08:12,321 WARNING failed to send kill packet to debug monitor: <class 'TypeError'>; ignoring Executing tearDown hook: def shutdown_named_pipe(): # Close the pipe. try: named_pipe.close() except: print("failed to close named pipe") None

Hide Details

# Delete the pipe. try: os.remove(named_pipe_path) except: print("failed to delete named pipe: {}".format(named_pipe_path)) None

Hide Details

# Delete the temp directory. try: os.rmdir(temp_dir) except: print( "failed to delete temp dir: {}, directory contents: '{}'".format( temp_dir, os.listdir(temp_dir))) None

Hide Details

Hide Details

PASS: LLDB (/Users/buildslave/jenkins/workspace/lldb-cmake/lldb-build/bin/clang-x86_64) :: test_qSupported_returns_known_stub_features_debugserver (TestLldbGdbServer.LldbGdbServerTestCase) runCmd: settings clear -all output:

Hide Details

runCmd: settings set symbols.enable-external-lookup false output:

Hide Details

runCmd: settings set target.inherit-tcc true output:

Hide Details

runCmd: settings set target.auto-apply-fixits false output:

Hide Details

runCmd: settings set plugin.process.gdb-remote.packet-timeout 60 output:

Hide Details

runCmd: settings set symbols.clang-modules-cache-path "/Users/buildslave/jenkins/workspace/lldb-cmake/lldb-build/lldb-test-build.noindex/module-cache-lldb/lldb-api" output:

Hide Details

runCmd: settings set use-color false output:

Hide Details

runCmd: setting set target.prefer-dynamic-value no-dynamic-values output:

Hide Details

UNSUPPORTED: LLDB (/Users/buildslave/jenkins/workspace/lldb-cmake/lldb-build/bin/clang-x86_64) :: test_qSupported_returns_known_stub_features_llgs (TestLldbGdbServer.LldbGdbServerTestCase) (llgs tests) runCmd: settings clear -all output:

Hide Details

runCmd: settings set symbols.enable-external-lookup false output:

Hide Details

runCmd: settings set target.inherit-tcc true output:

Hide Details

runCmd: settings set target.auto-apply-fixits false output:

Hide Details

runCmd: settings set plugin.process.gdb-remote.packet-timeout 60 output:

Hide Details

runCmd: settings set symbols.clang-modules-cache-path "/Users/buildslave/jenkins/workspace/lldb-cmake/lldb-build/lldb-test-build.noindex/module-cache-lldb/lldb-api" output:

Hide Details

runCmd: settings set use-color false output:

Hide Details

runCmd: setting set target.prefer-dynamic-value no-dynamic-values output:

Hide Details

Adding tearDown hook: def shutdown_named_pipe(): # Close the pipe. try: named_pipe.close() except: print("failed to close named pipe") None

Hide Details

# Delete the pipe. try: os.remove(named_pipe_path) except: print("failed to delete named pipe: {}".format(named_pipe_path)) None

Hide Details

# Delete the temp directory. try: os.rmdir(temp_dir) except: print( "failed to delete temp dir: {}, directory contents: '{}'".format( temp_dir, os.listdir(temp_dir))) None

Hide Details

Hide Details

Adding tearDown hook: def shutdown_socket(): if sock: try: # send the kill packet so lldb-server shuts down gracefully sock.sendall(GdbRemoteTestCaseBase._GDBREMOTE_KILL_PACKET) except: logger.warning( "failed to send kill packet to debug monitor: {}; ignoring".format( sys.exc_info()[0]))

Hide Details

try: sock.close() except: logger.warning( "failed to close socket to debug monitor: {}; ignoring".format( sys.exc_info()[0]))

Hide Details

Hide Details

Executing tearDown hook: def shutdown_socket(): if sock: try: # send the kill packet so lldb-server shuts down gracefully sock.sendall(GdbRemoteTestCaseBase._GDBREMOTE_KILL_PACKET) except: logger.warning( "failed to send kill packet to debug monitor: {}; ignoring".format( sys.exc_info()[0]))

Hide Details

try: sock.close() except: logger.warning( "failed to close socket to debug monitor: {}; ignoring".format( sys.exc_info()[0]))

Hide Details

Hide Details

2020-08-08 13:08:28,178 WARNING failed to send kill packet to debug monitor: <class 'TypeError'>; ignoring Executing tearDown hook: def shutdown_named_pipe(): # Close the pipe. try: named_pipe.close() except: print("failed to close named pipe") None

Hide Details

# Delete the pipe. try: os.remove(named_pipe_path) except: print("failed to delete named pipe: {}".format(named_pipe_path)) None

Hide Details

# Delete the temp directory. try: os.rmdir(temp_dir) except: print( "failed to delete temp dir: {}, directory contents: '{}'".format( temp_dir, os.listdir(temp_dir))) None

Hide Details

Hide Details

PASS: LLDB (/Users/buildslave/jenkins/workspace/lldb-cmake/lldb-build/bin/clang-x86_64) :: test_qThreadInfo_contains_thread_attach_debugserver (TestLldbGdbServer.LldbGdbServerTestCase) runCmd: settings clear -all output:

Hide Details

runCmd: settings set symbols.enable-external-lookup false output:

Hide Details

runCmd: settings set target.inherit-tcc true output:

Hide Details

runCmd: settings set target.auto-apply-fixits false output:

Hide Details

runCmd: settings set plugin.process.gdb-remote.packet-timeout 60 output:

Hide Details

runCmd: settings set symbols.clang-modules-cache-path "/Users/buildslave/jenkins/workspace/lldb-cmake/lldb-build/lldb-test-build.noindex/module-cache-lldb/lldb-api" output:

Hide Details

runCmd: settings set use-color false output:

Hide Details

runCmd: setting set target.prefer-dynamic-value no-dynamic-values output:

Hide Details

UNSUPPORTED: LLDB (/Users/buildslave/jenkins/workspace/lldb-cmake/lldb-build/bin/clang-x86_64) :: test_qThreadInfo_contains_thread_attach_llgs (TestLldbGdbServer.LldbGdbServerTestCase) (llgs tests) runCmd: settings clear -all output:

Hide Details

runCmd: settings set symbols.enable-external-lookup false output:

Hide Details

runCmd: settings set target.inherit-tcc true output:

Hide Details

runCmd: settings set target.auto-apply-fixits false output:

Hide Details

runCmd: settings set plugin.process.gdb-remote.packet-timeout 60 output:

Hide Details

runCmd: settings set symbols.clang-modules-cache-path "/Users/buildslave/jenkins/workspace/lldb-cmake/lldb-build/lldb-test-build.noindex/module-cache-lldb/lldb-api" output:

Hide Details

runCmd: settings set use-color false output:

Hide Details

runCmd: setting set target.prefer-dynamic-value no-dynamic-values output:

Hide Details

Adding tearDown hook: def shutdown_named_pipe(): # Close the pipe. try: named_pipe.close() except: print("failed to close named pipe") None

Hide Details

# Delete the pipe. try: os.remove(named_pipe_path) except: print("failed to delete named pipe: {}".format(named_pipe_path)) None

Hide Details

# Delete the temp directory. try: os.rmdir(temp_dir) except: print( "failed to delete temp dir: {}, directory contents: '{}'".format( temp_dir, os.listdir(temp_dir))) None

Hide Details

Hide Details

Adding tearDown hook: def shutdown_socket(): if sock: try: # send the kill packet so lldb-server shuts down gracefully sock.sendall(GdbRemoteTestCaseBase._GDBREMOTE_KILL_PACKET) except: logger.warning( "failed to send kill packet to debug monitor: {}; ignoring".format( sys.exc_info()[0]))

Hide Details

try: sock.close() except: logger.warning( "failed to close socket to debug monitor: {}; ignoring".format( sys.exc_info()[0]))

Hide Details

Hide Details

Executing tearDown hook: def shutdown_socket(): if sock: try: # send the kill packet so lldb-server shuts down gracefully sock.sendall(GdbRemoteTestCaseBase._GDBREMOTE_KILL_PACKET) except: logger.warning( "failed to send kill packet to debug monitor: {}; ignoring".format( sys.exc_info()[0]))

Hide Details

try: sock.close() except: logger.warning( "failed to close socket to debug monitor: {}; ignoring".format( sys.exc_info()[0]))

Hide Details

Hide Details

2020-08-08 13:08:44,441 WARNING failed to send kill packet to debug monitor: <class 'TypeError'>; ignoring Executing tearDown hook: def shutdown_named_pipe(): # Close the pipe. try: named_pipe.close() except: print("failed to close named pipe") None

Hide Details

# Delete the pipe. try: os.remove(named_pipe_path) except: print("failed to delete named pipe: {}".format(named_pipe_path)) None

Hide Details

# Delete the temp directory. try: os.rmdir(temp_dir) except: print( "failed to delete temp dir: {}, directory contents: '{}'".format( temp_dir, os.listdir(temp_dir))) None

Hide Details

Hide Details

PASS: LLDB (/Users/buildslave/jenkins/workspace/lldb-cmake/lldb-build/bin/clang-x86_64) :: test_qThreadInfo_contains_thread_launch_debugserver (TestLldbGdbServer.LldbGdbServerTestCase) runCmd: settings clear -all output:

Hide Details

runCmd: settings set symbols.enable-external-lookup false output:

Hide Details

runCmd: settings set target.inherit-tcc true output:

Hide Details

runCmd: settings set target.auto-apply-fixits false output:

Hide Details

runCmd: settings set plugin.process.gdb-remote.packet-timeout 60 output:

Hide Details

runCmd: settings set symbols.clang-modules-cache-path "/Users/buildslave/jenkins/workspace/lldb-cmake/lldb-build/lldb-test-build.noindex/module-cache-lldb/lldb-api" output:

Hide Details

runCmd: settings set use-color false output:

Hide Details

runCmd: setting set target.prefer-dynamic-value no-dynamic-values output:

Hide Details

UNSUPPORTED: LLDB (/Users/buildslave/jenkins/workspace/lldb-cmake/lldb-build/bin/clang-x86_64) :: test_qThreadInfo_contains_thread_launch_llgs (TestLldbGdbServer.LldbGdbServerTestCase) (llgs tests) runCmd: settings clear -all output:

Hide Details

runCmd: settings set symbols.enable-external-lookup false output:

Hide Details

runCmd: settings set target.inherit-tcc true output:

Hide Details

runCmd: settings set target.auto-apply-fixits false output:

Hide Details

runCmd: settings set plugin.process.gdb-remote.packet-timeout 60 output:

Hide Details

runCmd: settings set symbols.clang-modules-cache-path "/Users/buildslave/jenkins/workspace/lldb-cmake/lldb-build/lldb-test-build.noindex/module-cache-lldb/lldb-api" output:

Hide Details

runCmd: settings set use-color false output:

Hide Details

runCmd: setting set target.prefer-dynamic-value no-dynamic-values output:

Hide Details

Adding tearDown hook: def shutdown_named_pipe(): # Close the pipe. try: named_pipe.close() except: print("failed to close named pipe") None

Hide Details

# Delete the pipe. try: os.remove(named_pipe_path) except: print("failed to delete named pipe: {}".format(named_pipe_path)) None

Hide Details

# Delete the temp directory. try: os.rmdir(temp_dir) except: print( "failed to delete temp dir: {}, directory contents: '{}'".format( temp_dir, os.listdir(temp_dir))) None

Hide Details

Hide Details

FAIL: LLDB (/Users/buildslave/jenkins/workspace/lldb-cmake/lldb-build/bin/clang-x86_64) :: test_qThreadInfo_matches_qC_attach_debugserver (TestLldbGdbServer.LldbGdbServerTestCase) Executing tearDown hook: def shutdown_named_pipe(): # Close the pipe. try: named_pipe.close() except: print("failed to close named pipe") None

Hide Details

# Delete the pipe. try: os.remove(named_pipe_path) except: print("failed to delete named pipe: {}".format(named_pipe_path)) None

Hide Details

# Delete the temp directory. try: os.rmdir(temp_dir) except: print( "failed to delete temp dir: {}, directory contents: '{}'".format( temp_dir, os.listdir(temp_dir))) None

Hide Details

Hide Details

runCmd: settings clear -all output:

Hide Details

runCmd: settings set symbols.enable-external-lookup false output:

Hide Details

runCmd: settings set target.inherit-tcc true output:

Hide Details

runCmd: settings set target.auto-apply-fixits false output:

Hide Details

runCmd: settings set plugin.process.gdb-remote.packet-timeout 60 output:

Hide Details

runCmd: settings set symbols.clang-modules-cache-path "/Users/buildslave/jenkins/workspace/lldb-cmake/lldb-build/lldb-test-build.noindex/module-cache-lldb/lldb-api" output:

Hide Details

runCmd: settings set use-color false output:

Hide Details

runCmd: setting set target.prefer-dynamic-value no-dynamic-values output:

Hide Details

UNSUPPORTED: LLDB (/Users/buildslave/jenkins/workspace/lldb-cmake/lldb-build/bin/clang-x86_64) :: test_qThreadInfo_matches_qC_attach_llgs (TestLldbGdbServer.LldbGdbServerTestCase) (llgs tests) runCmd: settings clear -all output:

Hide Details

runCmd: settings set symbols.enable-external-lookup false output:

Hide Details

runCmd: settings set target.inherit-tcc true output:

Hide Details

runCmd: settings set target.auto-apply-fixits false output:

Hide Details

runCmd: settings set plugin.process.gdb-remote.packet-timeout 60 output:

Hide Details

runCmd: settings set symbols.clang-modules-cache-path "/Users/buildslave/jenkins/workspace/lldb-cmake/lldb-build/lldb-test-build.noindex/module-cache-lldb/lldb-api" output:

Hide Details

runCmd: settings set use-color false output:

Hide Details

runCmd: setting set target.prefer-dynamic-value no-dynamic-values output:

Hide Details

Adding tearDown hook: def shutdown_named_pipe(): # Close the pipe. try: named_pipe.close() except: print("failed to close named pipe") None

Hide Details

# Delete the pipe. try: os.remove(named_pipe_path) except: print("failed to delete named pipe: {}".format(named_pipe_path)) None

Hide Details

# Delete the temp directory. try: os.rmdir(temp_dir) except: print( "failed to delete temp dir: {}, directory contents: '{}'".format( temp_dir, os.listdir(temp_dir))) None

Hide Details

Hide Details

Adding tearDown hook: def shutdown_socket(): if sock: try: # send the kill packet so lldb-server shuts down gracefully sock.sendall(GdbRemoteTestCaseBase._GDBREMOTE_KILL_PACKET) except: logger.warning( "failed to send kill packet to debug monitor: {}; ignoring".format( sys.exc_info()[0]))

Hide Details

try: sock.close() except: logger.warning( "failed to close socket to debug monitor: {}; ignoring".format( sys.exc_info()[0]))

Hide Details

Hide Details

Executing tearDown hook: def shutdown_socket(): if sock: try: # send the kill packet so lldb-server shuts down gracefully sock.sendall(GdbRemoteTestCaseBase._GDBREMOTE_KILL_PACKET) except: logger.warning( "failed to send kill packet to debug monitor: {}; ignoring".format( sys.exc_info()[0]))

Hide Details

try: sock.close() except: logger.warning( "failed to close socket to debug monitor: {}; ignoring".format( sys.exc_info()[0]))

Hide Details

Hide Details

2020-08-08 13:10:06,857 WARNING failed to send kill packet to debug monitor: <class 'TypeError'>; ignoring Executing tearDown hook: def shutdown_named_pipe(): # Close the pipe. try: named_pipe.close() except: print("failed to close named pipe") None

Hide Details

# Delete the pipe. try: os.remove(named_pipe_path) except: print("failed to delete named pipe: {}".format(named_pipe_path)) None

Hide Details

# Delete the temp directory. try: os.rmdir(temp_dir) except: print( "failed to delete temp dir: {}, directory contents: '{}'".format( temp_dir, os.listdir(temp_dir))) None

Hide Details

Hide Details

PASS: LLDB (/Users/buildslave/jenkins/workspace/lldb-cmake/lldb-build/bin/clang-x86_64) :: test_qThreadInfo_matches_qC_launch_debugserver (TestLldbGdbServer.LldbGdbServerTestCase) runCmd: settings clear -all output:

Hide Details

runCmd: settings set symbols.enable-external-lookup false output:

Hide Details

runCmd: settings set target.inherit-tcc true output:

Hide Details

runCmd: settings set target.auto-apply-fixits false output:

Hide Details

runCmd: settings set plugin.process.gdb-remote.packet-timeout 60 output:

Hide Details

runCmd: settings set symbols.clang-modules-cache-path "/Users/buildslave/jenkins/workspace/lldb-cmake/lldb-build/lldb-test-build.noindex/module-cache-lldb/lldb-api" output:

Hide Details

runCmd: settings set use-color false output:

Hide Details

runCmd: setting set target.prefer-dynamic-value no-dynamic-values output:

Hide Details

UNSUPPORTED: LLDB (/Users/buildslave/jenkins/workspace/lldb-cmake/lldb-build/bin/clang-x86_64) :: test_qThreadInfo_matches_qC_launch_llgs (TestLldbGdbServer.LldbGdbServerTestCase) (llgs tests) runCmd: settings clear -all output:

Hide Details

runCmd: settings set symbols.enable-external-lookup false output:

Hide Details

runCmd: settings set target.inherit-tcc true output:

Hide Details

runCmd: settings set target.auto-apply-fixits false output:

Hide Details

runCmd: settings set plugin.process.gdb-remote.packet-timeout 60 output:

Hide Details

runCmd: settings set symbols.clang-modules-cache-path "/Users/buildslave/jenkins/workspace/lldb-cmake/lldb-build/lldb-test-build.noindex/module-cache-lldb/lldb-api" output:

Hide Details

runCmd: settings set use-color false output:

Hide Details

runCmd: setting set target.prefer-dynamic-value no-dynamic-values output:

Hide Details

Adding tearDown hook: def shutdown_named_pipe(): # Close the pipe. try: named_pipe.close() except: print("failed to close named pipe") None

Hide Details

# Delete the pipe. try: os.remove(named_pipe_path) except: print("failed to delete named pipe: {}".format(named_pipe_path)) None

Hide Details

# Delete the temp directory. try: os.rmdir(temp_dir) except: print( "failed to delete temp dir: {}, directory contents: '{}'".format( temp_dir, os.listdir(temp_dir))) None

Hide Details

Hide Details

Adding tearDown hook: def shutdown_socket(): if sock: try: # send the kill packet so lldb-server shuts down gracefully sock.sendall(GdbRemoteTestCaseBase._GDBREMOTE_KILL_PACKET) except: logger.warning( "failed to send kill packet to debug monitor: {}; ignoring".format( sys.exc_info()[0]))

Hide Details

try: sock.close() except: logger.warning( "failed to close socket to debug monitor: {}; ignoring".format( sys.exc_info()[0]))

Hide Details

Hide Details

Executing tearDown hook: def shutdown_socket(): if sock: try: # send the kill packet so lldb-server shuts down gracefully sock.sendall(GdbRemoteTestCaseBase._GDBREMOTE_KILL_PACKET) except: logger.warning( "failed to send kill packet to debug monitor: {}; ignoring".format( sys.exc_info()[0]))

Hide Details

try: sock.close() except: logger.warning( "failed to close socket to debug monitor: {}; ignoring".format( sys.exc_info()[0]))

Hide Details

Hide Details

2020-08-08 13:10:54,841 WARNING failed to send kill packet to debug monitor: <class 'TypeError'>; ignoring Executing tearDown hook: def shutdown_named_pipe(): # Close the pipe. try: named_pipe.close() except: print("failed to close named pipe") None

Hide Details

# Delete the pipe. try: os.remove(named_pipe_path) except: print("failed to delete named pipe: {}".format(named_pipe_path)) None

Hide Details

# Delete the temp directory. try: os.rmdir(temp_dir) except: print( "failed to delete temp dir: {}, directory contents: '{}'".format( temp_dir, os.listdir(temp_dir))) None

Hide Details

Hide Details

PASS: LLDB (/Users/buildslave/jenkins/workspace/lldb-cmake/lldb-build/bin/clang-x86_64) :: test_software_breakpoint_set_and_remove_work_debugserver (TestLldbGdbServer.LldbGdbServerTestCase) runCmd: settings clear -all output:

Hide Details

runCmd: settings set symbols.enable-external-lookup false output:

Hide Details

runCmd: settings set target.inherit-tcc true output:

Hide Details

runCmd: settings set target.auto-apply-fixits false output:

Hide Details

runCmd: settings set plugin.process.gdb-remote.packet-timeout 60 output:

Hide Details

runCmd: settings set symbols.clang-modules-cache-path "/Users/buildslave/jenkins/workspace/lldb-cmake/lldb-build/lldb-test-build.noindex/module-cache-lldb/lldb-api" output:

Hide Details

runCmd: settings set use-color false output:

Hide Details

runCmd: setting set target.prefer-dynamic-value no-dynamic-values output:

Hide Details

UNSUPPORTED: LLDB (/Users/buildslave/jenkins/workspace/lldb-cmake/lldb-build/bin/clang-x86_64) :: test_software_breakpoint_set_and_remove_work_llgs (TestLldbGdbServer.LldbGdbServerTestCase) (llgs tests) runCmd: settings clear -all output:

Hide Details

runCmd: settings set symbols.enable-external-lookup false output:

Hide Details

runCmd: settings set target.inherit-tcc true output:

Hide Details

runCmd: settings set target.auto-apply-fixits false output:

Hide Details

runCmd: settings set plugin.process.gdb-remote.packet-timeout 60 output:

Hide Details

runCmd: settings set symbols.clang-modules-cache-path "/Users/buildslave/jenkins/workspace/lldb-cmake/lldb-build/lldb-test-build.noindex/module-cache-lldb/lldb-api" output:

Hide Details

runCmd: settings set use-color false output:

Hide Details

runCmd: setting set target.prefer-dynamic-value no-dynamic-values output:

Hide Details

Adding tearDown hook: def shutdown_named_pipe(): # Close the pipe. try: named_pipe.close() except: print("failed to close named pipe") None

Hide Details

# Delete the pipe. try: os.remove(named_pipe_path) except: print("failed to delete named pipe: {}".format(named_pipe_path)) None

Hide Details

# Delete the temp directory. try: os.rmdir(temp_dir) except: print( "failed to delete temp dir: {}, directory contents: '{}'".format( temp_dir, os.listdir(temp_dir))) None

Hide Details

Hide Details

Adding tearDown hook: def shutdown_socket(): if sock: try: # send the kill packet so lldb-server shuts down gracefully sock.sendall(GdbRemoteTestCaseBase._GDBREMOTE_KILL_PACKET) except: logger.warning( "failed to send kill packet to debug monitor: {}; ignoring".format( sys.exc_info()[0]))

Hide Details

try: sock.close() except: logger.warning( "failed to close socket to debug monitor: {}; ignoring".format( sys.exc_info()[0]))

Hide Details

Hide Details

Executing tearDown hook: def shutdown_socket(): if sock: try: # send the kill packet so lldb-server shuts down gracefully sock.sendall(GdbRemoteTestCaseBase._GDBREMOTE_KILL_PACKET) except: logger.warning( "failed to send kill packet to debug monitor: {}; ignoring".format( sys.exc_info()[0]))

Hide Details

try: sock.close() except: logger.warning( "failed to close socket to debug monitor: {}; ignoring".format( sys.exc_info()[0]))

Hide Details

Hide Details

2020-08-08 13:10:59,169 WARNING failed to send kill packet to debug monitor: <class 'TypeError'>; ignoring Executing tearDown hook: def shutdown_named_pipe(): # Close the pipe. try: named_pipe.close() except: print("failed to close named pipe") None

Hide Details

# Delete the pipe. try: os.remove(named_pipe_path) except: print("failed to delete named pipe: {}".format(named_pipe_path)) None

Hide Details

# Delete the temp directory. try: os.rmdir(temp_dir) except: print( "failed to delete temp dir: {}, directory contents: '{}'".format( temp_dir, os.listdir(temp_dir))) None

Hide Details

Hide Details

PASS: LLDB (/Users/buildslave/jenkins/workspace/lldb-cmake/lldb-build/bin/clang-x86_64) :: test_start_no_ack_mode_debugserver (TestLldbGdbServer.LldbGdbServerTestCase) runCmd: settings clear -all output:

Hide Details

runCmd: settings set symbols.enable-external-lookup false output:

Hide Details

runCmd: settings set target.inherit-tcc true output:

Hide Details

runCmd: settings set target.auto-apply-fixits false output:

Hide Details

runCmd: settings set plugin.process.gdb-remote.packet-timeout 60 output:

Hide Details

runCmd: settings set symbols.clang-modules-cache-path "/Users/buildslave/jenkins/workspace/lldb-cmake/lldb-build/lldb-test-build.noindex/module-cache-lldb/lldb-api" output:

Hide Details

runCmd: settings set use-color false output:

Hide Details

runCmd: setting set target.prefer-dynamic-value no-dynamic-values output:

Hide Details

UNSUPPORTED: LLDB (/Users/buildslave/jenkins/workspace/lldb-cmake/lldb-build/bin/clang-x86_64) :: test_start_no_ack_mode_llgs (TestLldbGdbServer.LldbGdbServerTestCase) (llgs tests) runCmd: settings clear -all output:

Hide Details

runCmd: settings set symbols.enable-external-lookup false output:

Hide Details

runCmd: settings set target.inherit-tcc true output:

Hide Details

runCmd: settings set target.auto-apply-fixits false output:

Hide Details

runCmd: settings set plugin.process.gdb-remote.packet-timeout 60 output:

Hide Details

runCmd: settings set symbols.clang-modules-cache-path "/Users/buildslave/jenkins/workspace/lldb-cmake/lldb-build/lldb-test-build.noindex/module-cache-lldb/lldb-api" output:

Hide Details

runCmd: settings set use-color false output:

Hide Details

runCmd: setting set target.prefer-dynamic-value no-dynamic-values output:

Hide Details

Adding tearDown hook: def shutdown_named_pipe(): # Close the pipe. try: named_pipe.close() except: print("failed to close named pipe") None

Hide Details

# Delete the pipe. try: os.remove(named_pipe_path) except: print("failed to delete named pipe: {}".format(named_pipe_path)) None

Hide Details

# Delete the temp directory. try: os.rmdir(temp_dir) except: print( "failed to delete temp dir: {}, directory contents: '{}'".format( temp_dir, os.listdir(temp_dir))) None

Hide Details

Hide Details

Adding tearDown hook: def shutdown_socket(): if sock: try: # send the kill packet so lldb-server shuts down gracefully sock.sendall(GdbRemoteTestCaseBase._GDBREMOTE_KILL_PACKET) except: logger.warning( "failed to send kill packet to debug monitor: {}; ignoring".format( sys.exc_info()[0]))

Hide Details

try: sock.close() except: logger.warning( "failed to close socket to debug monitor: {}; ignoring".format( sys.exc_info()[0]))

Hide Details

Hide Details

Executing tearDown hook: def shutdown_socket(): if sock: try: # send the kill packet so lldb-server shuts down gracefully sock.sendall(GdbRemoteTestCaseBase._GDBREMOTE_KILL_PACKET) except: logger.warning( "failed to send kill packet to debug monitor: {}; ignoring".format( sys.exc_info()[0]))

Hide Details

try: sock.close() except: logger.warning( "failed to close socket to debug monitor: {}; ignoring".format( sys.exc_info()[0]))

Hide Details

Hide Details

2020-08-08 13:11:11,678 WARNING failed to send kill packet to debug monitor: <class 'TypeError'>; ignoring Executing tearDown hook: def shutdown_named_pipe(): # Close the pipe. try: named_pipe.close() except: print("failed to close named pipe") None

Hide Details

# Delete the pipe. try: os.remove(named_pipe_path) except: print("failed to delete named pipe: {}".format(named_pipe_path)) None

Hide Details

# Delete the temp directory. try: os.rmdir(temp_dir) except: print( "failed to delete temp dir: {}, directory contents: '{}'".format( temp_dir, os.listdir(temp_dir))) None

Hide Details

Hide Details

PASS: LLDB (/Users/buildslave/jenkins/workspace/lldb-cmake/lldb-build/bin/clang-x86_64) :: test_thread_suffix_supported_debugserver (TestLldbGdbServer.LldbGdbServerTestCase) runCmd: settings clear -all output:

Hide Details

runCmd: settings set symbols.enable-external-lookup false output:

Hide Details

runCmd: settings set target.inherit-tcc true output:

Hide Details

runCmd: settings set target.auto-apply-fixits false output:

Hide Details

runCmd: settings set plugin.process.gdb-remote.packet-timeout 60 output:

Hide Details

runCmd: settings set symbols.clang-modules-cache-path "/Users/buildslave/jenkins/workspace/lldb-cmake/lldb-build/lldb-test-build.noindex/module-cache-lldb/lldb-api" output:

Hide Details

runCmd: settings set use-color false output:

Hide Details

runCmd: setting set target.prefer-dynamic-value no-dynamic-values output:

Hide Details

UNSUPPORTED: LLDB (/Users/buildslave/jenkins/workspace/lldb-cmake/lldb-build/bin/clang-x86_64) :: test_thread_suffix_supported_llgs (TestLldbGdbServer.LldbGdbServerTestCase) (llgs tests) runCmd: settings clear -all output:

Hide Details

runCmd: settings set symbols.enable-external-lookup false output:

Hide Details

runCmd: settings set target.inherit-tcc true output:

Hide Details

runCmd: settings set target.auto-apply-fixits false output:

Hide Details

runCmd: settings set plugin.process.gdb-remote.packet-timeout 60 output:

Hide Details

runCmd: settings set symbols.clang-modules-cache-path "/Users/buildslave/jenkins/workspace/lldb-cmake/lldb-build/lldb-test-build.noindex/module-cache-lldb/lldb-api" output:

Hide Details

runCmd: settings set use-color false output:

Hide Details

runCmd: setting set target.prefer-dynamic-value no-dynamic-values output:

Hide Details

Adding tearDown hook: def shutdown_named_pipe(): # Close the pipe. try: named_pipe.close() except: print("failed to close named pipe") None

Hide Details

# Delete the pipe. try: os.remove(named_pipe_path) except: print("failed to delete named pipe: {}".format(named_pipe_path)) None

Hide Details

# Delete the temp directory. try: os.rmdir(temp_dir) except: print( "failed to delete temp dir: {}, directory contents: '{}'".format( temp_dir, os.listdir(temp_dir))) None

Hide Details

Hide Details

Adding tearDown hook: def shutdown_socket(): if sock: try: # send the kill packet so lldb-server shuts down gracefully sock.sendall(GdbRemoteTestCaseBase._GDBREMOTE_KILL_PACKET) except: logger.warning( "failed to send kill packet to debug monitor: {}; ignoring".format( sys.exc_info()[0]))

Hide Details

try: sock.close() except: logger.warning( "failed to close socket to debug monitor: {}; ignoring".format( sys.exc_info()[0]))

Hide Details

Hide Details

Executing tearDown hook: def shutdown_socket(): if sock: try: # send the kill packet so lldb-server shuts down gracefully sock.sendall(GdbRemoteTestCaseBase._GDBREMOTE_KILL_PACKET) except: logger.warning( "failed to send kill packet to debug monitor: {}; ignoring".format( sys.exc_info()[0]))

Hide Details

try: sock.close() except: logger.warning( "failed to close socket to debug monitor: {}; ignoring".format( sys.exc_info()[0]))

Hide Details

Hide Details

2020-08-08 13:11:22,120 WARNING failed to send kill packet to debug monitor: <class 'TypeError'>; ignoring Executing tearDown hook: def shutdown_named_pipe(): # Close the pipe. try: named_pipe.close() except: print("failed to close named pipe") None

Hide Details

# Delete the pipe. try: os.remove(named_pipe_path) except: print("failed to delete named pipe: {}".format(named_pipe_path)) None

Hide Details

# Delete the temp directory. try: os.rmdir(temp_dir) except: print( "failed to delete temp dir: {}, directory contents: '{}'".format( temp_dir, os.listdir(temp_dir))) None

Hide Details

Hide Details

PASS: LLDB (/Users/buildslave/jenkins/workspace/lldb-cmake/lldb-build/bin/clang-x86_64) :: test_written_M_content_reads_back_correctly_debugserver (TestLldbGdbServer.LldbGdbServerTestCase) runCmd: settings clear -all output:

Hide Details

runCmd: settings set symbols.enable-external-lookup false output:

Hide Details

runCmd: settings set target.inherit-tcc true output:

Hide Details

runCmd: settings set target.auto-apply-fixits false output:

Hide Details

runCmd: settings set plugin.process.gdb-remote.packet-timeout 60 output:

Hide Details

runCmd: settings set symbols.clang-modules-cache-path "/Users/buildslave/jenkins/workspace/lldb-cmake/lldb-build/lldb-test-build.noindex/module-cache-lldb/lldb-api" output:

Hide Details

runCmd: settings set use-color false output:

Hide Details

runCmd: setting set target.prefer-dynamic-value no-dynamic-values output:

Hide Details

UNSUPPORTED: LLDB (/Users/buildslave/jenkins/workspace/lldb-cmake/lldb-build/bin/clang-x86_64) :: test_written_M_content_reads_back_correctly_llgs (TestLldbGdbServer.LldbGdbServerTestCase) (llgs tests) Restore dir to: /Users/buildslave/jenkins/workspace/lldb-cmake/lldb-build/tools/lldb/test ====================================================================== FAIL: test_qThreadInfo_matches_qC_attach_debugserver (TestLldbGdbServer.LldbGdbServerTestCase) ---------------------------------------------------------------------- Traceback (most recent call last): File "/Users/buildslave/jenkins/workspace/lldb-cmake/llvm-project/lldb/packages/Python/lldbsuite/test/decorators.py", line 135, in wrapper return func(*args, **kwargs) File "/Users/buildslave/jenkins/workspace/lldb-cmake/llvm-project/lldb/test/API/tools/lldb-server/TestLldbGdbServer.py", line 540, in test_qThreadInfo_matches_qC_attach_debugserver self.qThreadInfo_matches_qC() File "/Users/buildslave/jenkins/workspace/lldb-cmake/llvm-project/lldb/test/API/tools/lldb-server/TestLldbGdbServer.py", line 492, in qThreadInfo_matches_qC procs = self.prep_debug_monitor_and_inferior() File "/Users/buildslave/jenkins/workspace/lldb-cmake/llvm-project/lldb/packages/Python/lldbsuite/test/tools/lldb-server/gdbremote_testcase.py", line 555, in prep_debug_monitor_and_inferior server = self.connect_to_debug_monitor(attach_pid=attach_pid) File "/Users/buildslave/jenkins/workspace/lldb-cmake/llvm-project/lldb/packages/Python/lldbsuite/test/tools/lldb-server/gdbremote_testcase.py", line 417, in connect_to_debug_monitor server = self.launch_debug_monitor(attach_pid=attach_pid) File "/Users/buildslave/jenkins/workspace/lldb-cmake/llvm-project/lldb/packages/Python/lldbsuite/test/tools/lldb-server/gdbremote_testcase.py", line 410, in launch_debug_monitor self.port = self.get_stub_port_from_named_socket() File "/Users/buildslave/jenkins/workspace/lldb-cmake/llvm-project/lldb/packages/Python/lldbsuite/test/tools/lldb-server/gdbremote_testcase.py", line 217, in get_stub_port_from_named_socket "write side of pipe has not written anything - stub isn't writing to pipe.") AssertionError: 0 == 0 : write side of pipe has not written anything - stub isn't writing to pipe. Config=x86_64-/Users/buildslave/jenkins/workspace/lldb-cmake/lldb-build/bin/clang ---------------------------------------------------------------------- Ran 65 tests in 329.373s

Hide Details

RESULT: FAILED (29 passes, 1 failures, 0 errors, 34 skipped, 1 expected failures, 0 unexpected successes)

Hide Details

--

Hide Details

******************** PASS: lldb-unit :: Core/./LLDBCoreTests/RichManglingContextTest.SwitchProvider (1316 of 2119) PASS: lldb-api :: functionalities/breakpoint/breakpoint_ids/TestBreakpointIDs.py (1317 of 2119) PASS: lldb-unit :: Utility/./UtilityTests/StringListTest.InsertStringAtIndexStdString (1318 of 2119) PASS: lldb-api :: commands/expression/persist_objc_pointeetype/TestPersistObjCPointeeType.py (1319 of 2119) PASS: lldb-unit :: Utility/./UtilityTests/NameMatchesTest.Equals (1320 of 2119) PASS: lldb-unit :: Expression/./ExpressionTests/DiagnosticManagerTest.HasFixits (1321 of 2119) PASS: lldb-unit :: Symbol/./SymbolTests/TestClangASTImporter.MetadataPropagationAfterCopying (1322 of 2119) PASS: lldb-api :: lang/objc/objc-ivar-protocols/TestIvarProtocols.py (1323 of 2119) PASS: lldb-unit :: UnwindAssembly/x86/./UnwindAssemblyx86Tests/Testx86AssemblyInspectionEngine.TestPush0 (1324 of 2119) PASS: lldb-unit :: Utility/./UtilityTests/DataExtractorTest.GetMaxU64 (1325 of 2119) PASS: lldb-api :: functionalities/show_location/TestShowLocationDwarf5.py (1326 of 2119) PASS: lldb-unit :: Utility/./UtilityTests/FileSpecTest.PrependPathComponent (1327 of 2119) PASS: lldb-unit :: SymbolFile/DWARF/./SymbolFileDWARFTests/SymbolFileDWARFTests.TestAbbrevNullAttrValidForm (1328 of 2119) PASS: lldb-unit :: Utility/./UtilityTests/StringListTest.InsertStringAtIndexEnd (1329 of 2119) PASS: lldb-unit :: Utility/./UtilityTests/StreamTest.AddressRange (1330 of 2119) PASS: lldb-shell :: Minidump/no-process-id.yaml (1331 of 2119) PASS: lldb-api :: commands/expression/multiline-completion/TestMultilineCompletion.py (1332 of 2119) PASS: lldb-api :: functionalities/breakpoint/cpp/TestCPPBreakpointLocations.py (1333 of 2119) PASS: lldb-unit :: Utility/./UtilityTests/StreamTest.PutHex64ByteOrderBig (1334 of 2119) PASS: lldb-unit :: Symbol/./SymbolTests/TestTypeSystemClang.TestConvertAccessTypeToAccessSpecifier (1335 of 2119) PASS: lldb-shell :: ExecControl/StopHook/stop-hook.test (1336 of 2119) PASS: lldb-shell :: Register/x86-64-ymm-read.test (1337 of 2119) PASS: lldb-unit :: Utility/./UtilityTests/StringLexerTest.PutBack (1338 of 2119) PASS: lldb-shell :: Reproducer/TestWorkingDir.test (1339 of 2119) PASS: lldb-unit :: Language/Highlighting/./HighlighterTests/HighlighterTest.ClangIdentifiers (1340 of 2119) PASS: lldb-unit :: Process/gdb-remote/./ProcessGdbRemoteTests/GDBRemoteCommunicationClientTest.ReadRegister (1341 of 2119) PASS: lldb-unit :: Utility/./UtilityTests/StreamTest.PutHex8 (1342 of 2119) PASS: lldb-api :: functionalities/breakpoint/breakpoint_by_line_and_column/TestBreakpointByLineAndColumn.py (1343 of 2119) PASS: lldb-api :: functionalities/object-file/TestImageListMultiArchitecture.py (1344 of 2119) PASS: lldb-shell :: Reproducer/TestDriverOptions.test (1345 of 2119) UNSUPPORTED: lldb-shell :: ScriptInterpreter/Lua/watchpoint_callback.test (1346 of 2119) PASS: lldb-unit :: UnwindAssembly/x86/./UnwindAssemblyx86Tests/Testx86AssemblyInspectionEngine.TestLEAVE (1347 of 2119) PASS: lldb-api :: commands/expression/call-function/TestCallStdStringFunction.py (1348 of 2119) PASS: lldb-api :: commands/expression/dont_allow_jit/TestAllowJIT.py (1349 of 2119) PASS: lldb-unit :: Symbol/./SymbolTests/Type.GetTypeScopeAndBasename (1350 of 2119) PASS: lldb-unit :: debugserver/./debugserverTests/RNBSocket.LoopBackConnectIPv6 (1351 of 2119) PASS: lldb-unit :: Symbol/./SymbolTests/DWARFCallFrameInfoTest.Basic_dwarf3 (1352 of 2119) PASS: lldb-unit :: Utility/./UtilityTests/StringExtractorTest.GetHexU8_Extra_NoEof (1353 of 2119) UNSUPPORTED: lldb-api :: tools/lldb-server/registers-target-xml-reading/TestGdbRemoteTargetXmlPacket.py (1354 of 2119) PASS: lldb-shell :: Breakpoint/split-dwarf-5-addrbase.test (1355 of 2119) PASS: lldb-unit :: Utility/./UtilityTests/RangeTest.EqualInvalid (1356 of 2119) PASS: lldb-api :: commands/expression/result_numbering/TestResultNumbering.py (1357 of 2119) PASS: lldb-api :: commands/expression/weak_symbols/TestWeakSymbols.py (1358 of 2119) PASS: lldb-unit :: Utility/./UtilityTests/StringLexerTest.Peek (1359 of 2119) PASS: lldb-api :: python_api/lldbutil/process/TestPrintStackTraces.py (1360 of 2119) PASS: lldb-unit :: Utility/./UtilityTests/StringExtractorTest.GetHexBytesAvail (1361 of 2119) PASS: lldb-unit :: Utility/./UtilityTests/StringExtractorTest.GetHexU8_Exact (1362 of 2119) PASS: lldb-api :: lang/objc/single-entry-dictionary/TestObjCSingleEntryDictionary.py (1363 of 2119) PASS: lldb-api :: functionalities/breakpoint/step_over_breakpoint/TestStepOverBreakpoint.py (1364 of 2119) PASS: lldb-unit :: Process/gdb-remote/./ProcessGdbRemoteTests/GDBRemoteCommunicationClientTest.GetModulesInfo_UUID20 (1365 of 2119) PASS: lldb-api :: commands/expression/char/TestExprsChar.py (1366 of 2119) PASS: lldb-unit :: Language/Highlighting/./HighlighterTests/HighlighterTest.ClangTrailingBackslashBeforeNewline (1367 of 2119) PASS: lldb-api :: types/TestRecursiveTypes.py (1368 of 2119) PASS: lldb-unit :: Process/gdb-remote/./ProcessGdbRemoteTests/GDBRemoteClientBaseTest.SendContinueDelegateInterface (1369 of 2119) PASS: lldb-unit :: Utility/./UtilityTests/TimerTest.CategoryTimesNested (1370 of 2119) PASS: lldb-unit :: Interpreter/./InterpreterTests/OptionArgParserTest.toChar (1371 of 2119) PASS: lldb-api :: python_api/watchpoint/condition/TestWatchpointConditionAPI.py (1372 of 2119) PASS: lldb-api :: lang/objc/modules/TestObjCModules.py (1373 of 2119) PASS: lldb-api :: functionalities/data-formatter/data-formatter-objc/TestDataFormatterObjCCF.py (1374 of 2119) PASS: lldb-unit :: Process/gdb-remote/./ProcessGdbRemoteTests/GDBRemoteClientBaseTest.SendContinueDelegateStructuredDataReceipt (1375 of 2119) PASS: lldb-unit :: Utility/./UtilityTests/RangeDataVector.FindEntryThatContains (1376 of 2119) XFAIL: lldb-shell :: Register/x86-64-write.test (1377 of 2119) PASS: lldb-api :: lang/c/strings/TestCStrings.py (1378 of 2119) PASS: lldb-unit :: ObjectFile/PECOFF/./ObjectFilePECOFFTests/PECallFrameInfoTest.Frame_reg_eh (1379 of 2119) PASS: lldb-unit :: Utility/./UtilityTests/StringListTest.AppendStringMove (1380 of 2119) PASS: lldb-shell :: SymbolFile/Breakpad/unwind-via-stack-win.test (1381 of 2119) PASS: lldb-api :: commands/expression/issue_11588/Test11588.py (1382 of 2119) PASS: lldb-api :: functionalities/gdb_remote_client/TestTargetXMLArch.py (1383 of 2119) PASS: lldb-api :: api/check_public_api_headers/TestPublicAPIHeaders.py (1384 of 2119) PASS: lldb-unit :: ScriptInterpreter/Python/./ScriptInterpreterPythonTests/PythonDataObjectsTest.TestDictionaryResolutionWithDot (1385 of 2119) PASS: lldb-shell :: SymbolFile/Breakpad/line-table-edgecases.test (1386 of 2119) PASS: lldb-api :: commands/expression/rdar42038760/TestScalarURem.py (1387 of 2119) PASS: lldb-api :: commands/command/script_alias/TestCommandScriptAlias.py (1388 of 2119) PASS: lldb-unit :: Utility/./UtilityTests/ScalarTest.Equality (1389 of 2119) PASS: lldb-unit :: Utility/./UtilityTests/DataExtractorTest.GetULEB128_bit63 (1390 of 2119) UNSUPPORTED: lldb-shell :: SymbolFile/PDB/pointers.test (1391 of 2119) PASS: lldb-api :: api/log/TestAPILog.py (1392 of 2119) PASS: lldb-api :: functionalities/tail_call_frames/cross_object/TestCrossObjectTailCalls.py (1393 of 2119) PASS: lldb-api :: functionalities/breakpoint/serialize/TestBreakpointSerialization.py (1394 of 2119) PASS: lldb-api :: functionalities/recursion/TestValueObjectRecursion.py (1395 of 2119) PASS: lldb-unit :: Symbol/./SymbolTests/TestTypeSystemClang.TestRemoveFastQualifiers (1396 of 2119) PASS: lldb-unit :: Utility/./UtilityTests/VMRange.Comparison (1397 of 2119) PASS: lldb-api :: lang/c/unions/TestUnionMembers.py (1398 of 2119) PASS: lldb-unit :: Process/minidump/./LLDBMinidumpTests/RegisterContextMinidump.ConvertMinidumpContext_x86_64 (1399 of 2119) PASS: lldb-shell :: SymbolFile/DWARF/inline-function-address.ll (1400 of 2119) PASS: lldb-unit :: Signals/./SignalsTests/UnixSignalsTest.VersionChange (1401 of 2119) PASS: lldb-api :: commands/session/save/TestSessionSave.py (1402 of 2119) PASS: lldb-api :: lang/objc/foundation/TestObjCMethods2.py (1403 of 2119) PASS: lldb-unit :: Expression/./ExpressionTests/ClangHostTest.ComputeClangResourceDirectory (1404 of 2119) PASS: lldb-api :: lang/cpp/multiple-inheritance/TestCppMultipleInheritance.py (1405 of 2119) PASS: lldb-api :: commands/watchpoints/watchpoint_commands/TestWatchpointCommands.py (1406 of 2119) PASS: lldb-unit :: Language/Highlighting/./HighlighterTests/HighlighterTest.ClangCommas (1407 of 2119) PASS: lldb-shell :: Breakpoint/single-file-split-dwarf.test (1408 of 2119) UNSUPPORTED: lldb-api :: tools/lldb-server/TestGdbRemoteModuleInfo.py (1409 of 2119) PASS: lldb-api :: lang/cpp/char8_t/TestCxxChar8_t.py (1410 of 2119) PASS: lldb-shell :: Quit/TestQuitExitCode-30.test (1411 of 2119) UNSUPPORTED: lldb-api :: functionalities/process_save_core/TestProcessSaveCore.py (1412 of 2119) PASS: lldb-api :: commands/apropos/basic/TestApropos.py (1413 of 2119) PASS: lldb-unit :: Target/./TargetTests/StackFrameRecognizerTest.NullModuleRegex (1414 of 2119) PASS: lldb-unit :: Utility/./UtilityTests/SubsystemRAIITest.SubsystemWithErrorSuccess (1415 of 2119) PASS: lldb-unit :: Core/./LLDBCoreTests/MangledTest.ResultForValidName (1416 of 2119) PASS: lldb-shell :: Reproducer/Functionalities/TestDataFormatter.test (1417 of 2119) UNSUPPORTED: lldb-api :: commands/target/auto-install-main-executable/TestAutoInstallMainExecutable.py (1418 of 2119) PASS: lldb-shell :: Host/TestCustomShell.test (1419 of 2119) PASS: lldb-unit :: Utility/./UtilityTests/NameMatchesTest.EndsWith (1420 of 2119) PASS: lldb-unit :: Process/gdb-remote/./ProcessGdbRemoteTests/GDBRemoteCommunicationClientTest.SendGetDataPacket (1421 of 2119) PASS: lldb-unit :: Utility/./UtilityTests/StructuredDataTest.ParseJSONFromFile (1422 of 2119) PASS: lldb-api :: commands/expression/import-std-module/weak_ptr-dbg-info-content/TestDbgInfoContentWeakPtrFromStdModule.py (1423 of 2119) PASS: lldb-unit :: Utility/./UtilityTests/ArgsTest.TestSingleArgWithQuotedSpace (1424 of 2119) PASS: lldb-api :: functionalities/data-formatter/ostypeformatting/TestFormattersOsType.py (1425 of 2119) UNSUPPORTED: lldb-api :: functionalities/darwin_log/filter/exact_match/activity-chain/TestDarwinLogFilterMatchActivityChain.py (1426 of 2119) PASS: lldb-shell :: Settings/TestFrameFormatMangling.test (1427 of 2119) PASS: lldb-unit :: ScriptInterpreter/Python/./ScriptInterpreterPythonTests/PythonDataObjectsTest.TestScript (1428 of 2119) PASS: lldb-api :: functionalities/data-formatter/synthcapping/TestSyntheticCapping.py (1429 of 2119) PASS: lldb-shell :: SymbolFile/DWARF/debug-types-dwarf5.s (1430 of 2119) PASS: lldb-unit :: Utility/./UtilityTests/LogChannelTest.EnableOptions (1431 of 2119) PASS: lldb-api :: functionalities/data-formatter/data-formatter-stl/libcxx/multimap/TestDataFormatterLibccMultiMap.py (1432 of 2119) PASS: lldb-unit :: Utility/./UtilityTests/RegisterValueTest.GetSet8 (1433 of 2119) PASS: lldb-unit :: Utility/./UtilityTests/StreamTest.PutHex16ByteOrderBig (1434 of 2119) PASS: lldb-shell :: Expr/TestIRMemoryMap.test (1435 of 2119) PASS: lldb-api :: functionalities/data-formatter/typedef_array/TestTypedefArray.py (1436 of 2119) PASS: lldb-api :: functionalities/postmortem/minidump/TestMiniDump.py (1437 of 2119) PASS: lldb-unit :: Utility/./UtilityTests/CompletionRequest.DuplicateFilteringWithComments (1438 of 2119) PASS: lldb-api :: functionalities/data-formatter/data-formatter-objc/TestDataFormatterObjCKVO.py (1439 of 2119) PASS: lldb-shell :: SymbolFile/symbol-binding.test (1440 of 2119) PASS: lldb-api :: macosx/queues/TestQueues.py (1441 of 2119) PASS: lldb-shell :: ObjectFile/PECOFF/invalid-export-table.yaml (1442 of 2119) PASS: lldb-api :: python_api/lldbutil/TestSwigVersion.py (1443 of 2119) PASS: lldb-api :: commands/command/script/import/TestImport.py (1444 of 2119) PASS: lldb-api :: sanity/TestModuleCacheSanity.py (1445 of 2119) PASS: lldb-unit :: Utility/./UtilityTests/ConstStringTest.NullAndEmptyStates (1446 of 2119) PASS: lldb-unit :: Utility/./UtilityTests/RecordReplayTest.InstrumentedBarPtr (1447 of 2119) PASS: lldb-api :: lang/c/step_over_no_deadlock/TestStepOverDoesntBlock.py (1448 of 2119) PASS: lldb-unit :: Utility/./UtilityTests/StringExtractorTest.GetHexBytes_OddPair (1449 of 2119) PASS: lldb-unit :: Utility/./UtilityTests/StringExtractorTest.DecodeHexU8_Extra (1450 of 2119) UNSUPPORTED: lldb-shell :: SymbolFile/PDB/variables.test (1451 of 2119) PASS: lldb-api :: python_api/type/TestTypeList.py (1452 of 2119) PASS: lldb-unit :: Utility/./UtilityTests/StringExtractorTest.GetHexU8_Underflow2 (1453 of 2119) PASS: lldb-api :: lang/objc/modules-update/TestClangModulesUpdate.py (1454 of 2119) PASS: lldb-unit :: Utility/./UtilityTests/UriParserTest.BracketedHostnameWithPortIPv4 (1455 of 2119) PASS: lldb-unit :: Symbol/./SymbolTests/TestTypeSystemClang.TestIsClangType (1456 of 2119) PASS: lldb-unit :: Utility/./UtilityTests/ScalarTest.CastOperations (1457 of 2119) PASS: lldb-shell :: SymbolFile/Breakpad/unwind-via-stack-win-no-memory-info.yaml (1458 of 2119) PASS: lldb-unit :: Utility/./UtilityTests/DataExtractorTest.GetMaxS64 (1459 of 2119) PASS: lldb-api :: functionalities/inferior-changed/TestInferiorChanged.py (1460 of 2119) PASS: lldb-api :: macosx/find-app-in-bundle/TestFindAppInBundle.py (1461 of 2119) PASS: lldb-api :: types/TestShortTypeExpr.py (1462 of 2119) PASS: lldb-unit :: Utility/./UtilityTests/BinaryStreamTest.PutSLEB128Zero (1463 of 2119) PASS: lldb-shell :: Minidump/memory-region.yaml (1464 of 2119) PASS: lldb-api :: commands/target/stop-hooks/TestStopHooks.py (1465 of 2119) PASS: lldb-api :: tools/lldb-server/TestGdbRemoteRegisterState.py (1466 of 2119) PASS: lldb-shell :: ObjectFile/PECOFF/disassemble-thumb.yaml (1467 of 2119) PASS: lldb-unit :: SymbolFile/NativePDB/./SymbolFileNativePDBTests/PDBFPOProgramToDWARFExpressionTests.SingleAssignmentRegisterRef (1468 of 2119) PASS: lldb-api :: commands/process/launch/TestProcessLaunch.py (1469 of 2119) PASS: lldb-unit :: Core/./LLDBCoreTests/RichManglingContextTest.Basic (1470 of 2119) PASS: lldb-api :: commands/expression/import-std-module/vector/TestVectorFromStdModule.py (1471 of 2119) PASS: lldb-unit :: ScriptInterpreter/Python/./ScriptInterpreterPythonTests/PythonDataObjectsTest.TestCallable (1472 of 2119) PASS: lldb-unit :: Utility/./UtilityTests/VMRange.CollectionContains (1473 of 2119) PASS: lldb-api :: functionalities/data-formatter/data-formatter-stl/libstdcpp/unique_ptr/invalid/TestDataFormatterInvalidStdUniquePtr.py (1474 of 2119) PASS: lldb-unit :: Utility/./UtilityTests/Flags.Reset (1475 of 2119) PASS: lldb-unit :: Utility/./UtilityTests/LogChannelEnabledTest.LogVerboseThread (1476 of 2119) PASS: lldb-unit :: Host/./HostTests/Host.WaitStatusFormat (1477 of 2119) PASS: lldb-unit :: Utility/./UtilityTests/ScalarTest.GetBytes (1478 of 2119) PASS: lldb-unit :: SymbolFile/NativePDB/./SymbolFileNativePDBTests/PDBFPOProgramToDWARFExpressionTests.UnresolvedDependentCyclicRegisterAssignmentReference (1479 of 2119) PASS: lldb-unit :: Utility/./UtilityTests/CompletionRequest.TestCompletionOwnership (1480 of 2119) PASS: lldb-unit :: debugserver/./debugserverTests/JSON.Parse (1481 of 2119) PASS: lldb-api :: types/TestFloatTypesExpr.py (1482 of 2119) UNSUPPORTED: lldb-api :: benchmarks/frame_variable/TestFrameVariableResponse.py (1483 of 2119) PASS: lldb-api :: functionalities/data-formatter/var-in-aggregate-misuse/TestVarInAggregateMisuse.py (1484 of 2119) UNSUPPORTED: lldb-api :: functionalities/darwin_log/filter/regex/activity/TestDarwinLogFilterRegexActivity.py (1485 of 2119) PASS: lldb-api :: functionalities/postmortem/netbsd-core/TestNetBSDCore.py (1486 of 2119) PASS: lldb-unit :: Symbol/./SymbolTests/TestClangASTImporter.DeportTypeTagDecl (1487 of 2119) PASS: lldb-api :: functionalities/data-formatter/summary-string-onfail/Test-rdar-9974002.py (1488 of 2119) PASS: lldb-api :: functionalities/thread/step_until/TestStepUntil.py (1489 of 2119) PASS: lldb-unit :: Utility/./UtilityTests/LogChannelEnabledTest.LLDB_LOG_ERROR (1490 of 2119) PASS: lldb-api :: lang/cpp/chained-calls/TestCppChainedCalls.py (1491 of 2119) PASS: lldb-shell :: SymbolFile/DWARF/clang-ast-from-dwarf-unamed-and-anon-structs.cpp (1492 of 2119) PASS: lldb-api :: lang/objc/bitfield_ivars/TestBitfieldIvars.py (1493 of 2119) PASS: lldb-unit :: Process/gdb-remote/./ProcessGdbRemoteTests/GDBRemoteCommunicationClientTest.GetModulesInfoInvalidResponse (1494 of 2119) PASS: lldb-api :: commands/expression/test/TestExprs.py (1495 of 2119) PASS: lldb-api :: tools/lldb-vscode/attach/TestVSCode_attach.py (1496 of 2119) PASS: lldb-unit :: Utility/./UtilityTests/NameMatchesTest.StartsWith (1497 of 2119) PASS: lldb-shell :: Driver/TestTarget.test (1498 of 2119) UNSUPPORTED: lldb-api :: tools/lldb-vscode/disconnect/TestVSCode_disconnect.py (1499 of 2119) PASS: lldb-unit :: ScriptInterpreter/Python/./ScriptInterpreterPythonTests/PythonDataObjectsTest.TestPythonDictionaryValueEquality (1500 of 2119) PASS: lldb-unit :: Utility/./UtilityTests/OptionsWithRawTest.LeadingSpaceArgs (1501 of 2119) PASS: lldb-api :: lang/objcxx/cxx-bridged-po/TestObjCXXBridgedPO.py (1502 of 2119) PASS: lldb-api :: lang/c/modules/TestCModules.py (1503 of 2119) PASS: lldb-shell :: VSCode/TestOptions.test (1504 of 2119) PASS: lldb-api :: functionalities/thread/num_threads/TestNumThreads.py (1505 of 2119) PASS: lldb-api :: lang/objc/print-obj/TestPrintObj.py (1506 of 2119) PASS: lldb-unit :: Utility/./UtilityTests/TimeoutTest.Format (1507 of 2119) PASS: lldb-api :: python_api/default-constructor/TestDefaultConstructorForAPIObjects.py (1508 of 2119) PASS: lldb-api :: functionalities/conditional_break/TestConditionalBreak.py (1509 of 2119) PASS: lldb-unit :: Core/./LLDBCoreTests/RichManglingContextTest.FromCxxMethodName (1510 of 2119) PASS: lldb-api :: lang/objc/modules-compile-error/TestModulesCompileError.py (1511 of 2119) PASS: lldb-unit :: Utility/./UtilityTests/TimerTest.CategoryTimes2 (1512 of 2119) PASS: lldb-unit :: Utility/./UtilityTests/Flags.AnySet (1513 of 2119) PASS: lldb-api :: functionalities/inferior-assert/TestInferiorAssert.py (1514 of 2119) PASS: lldb-unit :: Host/./HostTests/SocketTest.TCPGetConnectURI (1515 of 2119) PASS: lldb-api :: commands/disassemble/basic/TestDisassembleBreakpoint.py (1516 of 2119) PASS: lldb-api :: functionalities/data-formatter/type_summary_list_script/TestTypeSummaryListScript.py (1517 of 2119) PASS: lldb-api :: functionalities/thread/concurrent_events/TestConcurrentTwoBreakpointsOneSignal.py (1518 of 2119) PASS: lldb-unit :: Utility/./UtilityTests/UUIDTest.RelationalOperators (1519 of 2119) PASS: lldb-unit :: Process/minidump/./LLDBMinidumpTests/MinidumpParserTest.GetFilteredModuleList (1520 of 2119) PASS: lldb-api :: commands/frame/var/TestFrameVar.py (1521 of 2119) PASS: lldb-api :: lang/objc/variadic_methods/TestVariadicMethods.py (1522 of 2119) PASS: lldb-shell :: ScriptInterpreter/None/import_module.test (1523 of 2119) PASS: lldb-shell :: Commands/command-disassemble.s (1524 of 2119) PASS: lldb-unit :: Utility/./UtilityTests/ScalarTest.ComparisonFloat (1525 of 2119) PASS: lldb-unit :: Utility/./UtilityTests/RangeTest.Equal (1526 of 2119) PASS: lldb-shell :: ObjectFile/MachO/lc_build_version.yaml (1527 of 2119) UNSUPPORTED: lldb-shell :: SymbolFile/PDB/func-symbols.test (1528 of 2119) PASS: lldb-api :: commands/expression/deleting-implicit-copy-constructor/TestDeletingImplicitCopyConstructor.py (1529 of 2119) PASS: lldb-shell :: Commands/CommandScriptImmediateOutput/CommandScriptImmediateOutputConsole.test (1530 of 2119) PASS: lldb-unit :: Editline/./EditlineTests/EditlineTestFixture.EditlineReceivesMultiLineText (1531 of 2119) PASS: lldb-shell :: SymbolFile/NativePDB/bitfields.cpp (1532 of 2119) PASS: lldb-unit :: Utility/./UtilityTests/UriParserTest.MinimalPort (1533 of 2119) PASS: lldb-api :: commands/expression/scoped_enums/TestScopedEnumType.py (1534 of 2119) PASS: lldb-unit :: Expression/./ExpressionTests/DiagnosticManagerTest.GetStringMultipleDiags (1535 of 2119) UNSUPPORTED: lldb-shell :: ScriptInterpreter/Lua/nested_sessions.test (1536 of 2119) PASS: lldb-unit :: Platform/./LLDBPlatformTests/PlatformAppleSimulatorTest.TestSimHasSimEnvionament (1537 of 2119) PASS: lldb-unit :: Signals/./SignalsTests/UnixSignalsTest.Iteration (1538 of 2119) PASS: lldb-api :: commands/frame/recognizer/TestFrameRecognizer.py (1539 of 2119) PASS: lldb-api :: commands/thread/select/TestThreadSelect.py (1540 of 2119) PASS: lldb-unit :: Utility/./UtilityTests/VMRange.ContainsRange (1541 of 2119) PASS: lldb-shell :: SymbolFile/DWARF/find-inline-method.s (1542 of 2119) PASS: lldb-unit :: Utility/./UtilityTests/GeneratorTest.Create (1543 of 2119) PASS: lldb-unit :: Symbol/./SymbolTests/TestTypeSystemClang.TestGetTypeClassDeclType (1544 of 2119) PASS: lldb-shell :: SymbolFile/DWARF/DW_OP_piece-struct.s (1545 of 2119) PASS: lldb-unit :: ScriptInterpreter/Python/./ScriptInterpreterPythonTests/PythonDataObjectsTest.TestPythonTupleInitializerList2 (1546 of 2119) PASS: lldb-api :: functionalities/breakpoint/debugbreak/TestDebugBreak.py (1547 of 2119) PASS: lldb-shell :: Quit/TestQuitExitCode30.test (1548 of 2119) PASS: lldb-shell :: SymbolFile/DWARF/debug_ranges-missing-section.s (1549 of 2119) PASS: lldb-unit :: Expression/./ExpressionTests/CppModuleConfigurationTest.UnknownLibCppFile (1550 of 2119) PASS: lldb-api :: functionalities/breakpoint/hardware_breakpoints/require_hw_breakpoints/TestRequireHWBreakpoints.py (1551 of 2119) PASS: lldb-api :: lang/objc/foundation/TestObjCMethodsString.py (1552 of 2119) PASS: lldb-unit :: Language/Highlighting/./HighlighterTests/HighlighterTest.DefaultHighlighter (1553 of 2119) PASS: lldb-api :: python_api/section/TestSectionAPI.py (1554 of 2119) PASS: lldb-api :: commands/expression/invalid-args/TestInvalidArgsExpression.py (1555 of 2119) PASS: lldb-api :: functionalities/thread/concurrent_events/TestConcurrentManyBreakpoints.py (1556 of 2119) PASS: lldb-unit :: Host/./HostTests/NativeProcessProtocolTest.ReadMemoryWithoutTrap (1557 of 2119) PASS: lldb-unit :: Utility/./UtilityTests/StreamTest.PutRawBytesToMixedEndian (1558 of 2119) PASS: lldb-unit :: Language/CPlusPlus/./LanguageCPlusPlusTests/CPlusPlusLanguage.MethodNameParsing (1559 of 2119) PASS: lldb-unit :: SymbolFile/NativePDB/./SymbolFileNativePDBTests/PDBFPOProgramToDWARFExpressionTests.UnknownOp (1560 of 2119) UNSUPPORTED: lldb-api :: commands/expression/call-restarts/TestCallThatRestarts.py (1561 of 2119) PASS: lldb-api :: commands/process/launch-with-shellexpand/TestLaunchWithShellExpand.py (1562 of 2119) UNSUPPORTED: lldb-shell :: Register/x86-64-xmm16-write.test (1563 of 2119) PASS: lldb-api :: functionalities/data-formatter/nsarraysynth/TestNSArraySynthetic.py (1564 of 2119) PASS: lldb-api :: functionalities/target_var/TestTargetVar.py (1565 of 2119) UNSUPPORTED: lldb-api :: functionalities/darwin_log/filter/exact_match/activity/TestDarwinLogFilterMatchActivity.py (1566 of 2119) PASS: lldb-api :: commands/frame/var-scope/TestFrameVariableScope.py (1567 of 2119) PASS: lldb-api :: commands/expression/po_verbosity/TestPoVerbosity.py (1568 of 2119) PASS: lldb-unit :: Utility/./UtilityTests/CompletionRequest.Constructor (1569 of 2119) PASS: lldb-unit :: Utility/./UtilityTests/Flags.Test (1570 of 2119) PASS: lldb-api :: functionalities/paths/TestPaths.py (1571 of 2119) PASS: lldb-unit :: Language/CPlusPlus/./LanguageCPlusPlusTests/CPlusPlusLanguage.CPlusPlusNameParser (1572 of 2119) PASS: lldb-unit :: Target/./TargetTests/ExecutionContextTest.GetByteOrderTarget (1573 of 2119) UNSUPPORTED: lldb-api :: benchmarks/libcxxmap/TestBenchmarkLibcxxMap.py (1574 of 2119) PASS: lldb-unit :: SymbolFile/NativePDB/./SymbolFileNativePDBTests/PDBFPOProgramToDWARFExpressionTests.InvalidAssignmentMultiple (1575 of 2119) PASS: lldb-unit :: Symbol/./SymbolTests/TestClangASTImporter.DeportDeclTagDecl (1576 of 2119) PASS: lldb-shell :: Unwind/thread-step-out-ret-addr-check.test (1577 of 2119) PASS: lldb-shell :: ObjectFile/ELF/section-overlap.yaml (1578 of 2119) PASS: lldb-unit :: Utility/./UtilityTests/SubsystemRAIITest.SubsystemWithErrorFailure (1579 of 2119) PASS: lldb-shell :: SymbolFile/DWARF/dwp-debug-types.s (1580 of 2119) PASS: lldb-shell :: Reproducer/TestVersionCheck.test (1581 of 2119) PASS: lldb-api :: lang/objc/objc-optimized/TestObjcOptimized.py (1582 of 2119) PASS: lldb-shell :: Commands/command-backtrace.test (1583 of 2119) PASS: lldb-api :: commands/frame/diagnose/dereference-function-return/TestDiagnoseDereferenceFunctionReturn.py (1584 of 2119) PASS: lldb-shell :: SymbolFile/DWARF/debug-types-basic.test (1585 of 2119) PASS: lldb-api :: functionalities/float-display/TestFloatDisplay.py (1586 of 2119) PASS: lldb-shell :: SymbolFile/DWARF/debug_loc-aslr.s (1587 of 2119) PASS: lldb-unit :: Utility/./UtilityTests/BinaryStreamTest.PutSLEB128One (1588 of 2119) PASS: lldb-unit :: Utility/./UtilityTests/PassiveReplayTest.InstrumentedBarRef (1589 of 2119) PASS: lldb-unit :: UnwindAssembly/x86/./UnwindAssemblyx86Tests/Testx86AssemblyInspectionEngine.TestStackRealign8BitDisp_i386 (1590 of 2119) PASS: lldb-api :: functionalities/inferior-crashing/recursive-inferior/TestRecursiveInferiorStep.py (1591 of 2119) PASS: lldb-unit :: Utility/./UtilityTests/FileSpecTest.OperatorBool (1592 of 2119) PASS: lldb-api :: lang/objc/objc-static-method/TestObjCStaticMethod.py (1593 of 2119) PASS: lldb-unit :: Utility/./UtilityTests/DataExtractorTest.GetCStrAtEnd (1594 of 2119) PASS: lldb-api :: python_api/breakpoint/TestBreakpointAPI.py (1595 of 2119) PASS: lldb-api :: commands/expression/namespace_local_var_same_name_cpp_and_c/TestNamespaceLocalVarSameNameCppAndC.py (1596 of 2119) PASS: lldb-unit :: Utility/./UtilityTests/VMRange.Reset (1597 of 2119) PASS: lldb-unit :: Utility/./UtilityTests/ArgsTest.TestMultipleArgs (1598 of 2119) PASS: lldb-api :: lang/cpp/modules-import/TestCXXModulesImport.py (1599 of 2119) PASS: lldb-unit :: Utility/./UtilityTests/RegularExpression.Empty (1600 of 2119) PASS: lldb-api :: functionalities/data-formatter/data-formatter-script/TestDataFormatterScript.py (1601 of 2119) PASS: lldb-api :: functionalities/source-map/TestTargetSourceMap.py (1602 of 2119) PASS: lldb-api :: commands/expression/import-std-module/basic/TestImportStdModule.py (1603 of 2119) PASS: lldb-api :: lang/c/tls_globals/TestTlsGlobals.py (1604 of 2119) PASS: lldb-shell :: SymbolFile/DWARF/debug_line-tombstone.s (1605 of 2119) PASS: lldb-api :: commands/help/TestHelp.py (1606 of 2119) UNSUPPORTED: lldb-api :: commands/register/register/intel_xtended_registers/mpx_offset_intersection/TestMPXOffsetIntersection.py (1607 of 2119) PASS: lldb-unit :: Process/minidump/./LLDBMinidumpTests/MinidumpParserTest.GetMemory (1608 of 2119) PASS: lldb-api :: python_api/value/TestValueAPI.py (1609 of 2119) PASS: lldb-api :: python_api/frame/TestFrames.py (1610 of 2119) PASS: lldb-shell :: SymbolFile/DWARF/DW_AT_low_pc-addrx.s (1611 of 2119) PASS: lldb-unit :: Utility/./UtilityTests/ReproducerTest.SetCapture (1612 of 2119) PASS: lldb-unit :: Host/./HostTests/MainLoopTest.TerminatesImmediately (1613 of 2119) PASS: lldb-api :: commands/target/stop-hook/delete/TestTargetStopHookDelete.py (1614 of 2119) PASS: lldb-unit :: Utility/./UtilityTests/VASprintfTest.NoBufferResize (1615 of 2119) PASS: lldb-shell :: SymbolFile/DWARF/dir-separator-posix.s (1616 of 2119) PASS: lldb-unit :: Expression/./ExpressionTests/DiagnosticManagerTest.GetStringNoDiags (1617 of 2119) PASS: lldb-unit :: Process/minidump/./LLDBMinidumpTests/MinidumpParserTest.MinidumpModuleOrder (1618 of 2119) UNSUPPORTED: lldb-shell :: Register/x86-64-xmm16-read.test (1619 of 2119) PASS: lldb-unit :: Utility/./UtilityTests/StatusTest.Formatv (1620 of 2119) PASS: lldb-api :: commands/expression/radar_9673664/TestExprHelpExamples.py (1621 of 2119) PASS: lldb-unit :: Target/./TargetTests/PathMappingListTest.RelativeTests (1622 of 2119) PASS: lldb-api :: lang/c/global_variables/TestGlobalVariables.py (1623 of 2119) PASS: lldb-api :: commands/expression/anonymous-struct/TestCallUserAnonTypedef.py (1624 of 2119) PASS: lldb-api :: functionalities/breakpoint/scripted_bkpt/TestScriptedResolver.py (1625 of 2119) PASS: lldb-api :: lang/cpp/auto/TestCPPAuto.py (1626 of 2119) PASS: lldb-api :: functionalities/breakpoint/breakpoint_hit_count/TestBreakpointHitCount.py (1627 of 2119) PASS: lldb-unit :: debugserver/./debugserverTests/RNBSocket.LoopBackConnectIPv4 (1628 of 2119) PASS: lldb-api :: lang/c/find_struct_type/TestFindStructTypes.py (1629 of 2119) PASS: lldb-unit :: Utility/./UtilityTests/DataExtractorTest.GetCStrUnterminated (1630 of 2119) PASS: lldb-api :: lang/objc/hidden-ivars/TestHiddenIvars.py (1631 of 2119) PASS: lldb-unit :: Utility/./UtilityTests/StreamTest.PutHex32ByteOrderBig (1632 of 2119) PASS: lldb-unit :: Process/minidump/./LLDBMinidumpTests/MinidumpParserTest.GetThreadContext_x86_32 (1633 of 2119) PASS: lldb-unit :: Language/Highlighting/./HighlighterTests/HighlighterTest.HighlighterSelectionType (1634 of 2119) UNSUPPORTED: lldb-shell :: Breakpoint/case-insensitive.test (1635 of 2119) PASS: lldb-shell :: Process/TestEnvironment.test (1636 of 2119) PASS: lldb-api :: functionalities/breakpoint/comp_dir_symlink/TestCompDirSymLink.py (1637 of 2119) PASS: lldb-api :: macosx/DBGSourcePathRemapping/TestDSYMSourcePathRemapping.py (1638 of 2119) PASS: lldb-shell :: ObjectFile/ELF/PT_LOAD-overlap-section.yaml (1639 of 2119) PASS: lldb-unit :: Utility/./UtilityTests/StringListTest.InsertStringAtIndexMove (1640 of 2119) PASS: lldb-api :: commands/expression/call-function/TestCallBuiltinFunction.py (1641 of 2119) PASS: lldb-unit :: ObjectFile/Breakpad/./ObjectFileBreakpadTests/FileRecord.parse (1642 of 2119) PASS: lldb-unit :: Symbol/./SymbolTests/TestTypeSystemClang.TestRecordHasFields (1643 of 2119) PASS: lldb-unit :: Utility/./UtilityTests/StringExtractorTest.GetHexBytesAvail_OddPair (1644 of 2119) PASS: lldb-api :: functionalities/thread/concurrent_events/TestConcurrentSignalNWatchNBreak.py (1645 of 2119) PASS: lldb-unit :: Utility/./UtilityTests/VMRange.Clear (1646 of 2119) UNSUPPORTED: lldb-shell :: SymbolFile/PDB/vbases.test (1647 of 2119) PASS: lldb-api :: lang/objc/conflicting-definition/TestConflictingDefinition.py (1648 of 2119) UNSUPPORTED: lldb-api :: functionalities/darwin_log/basic/TestDarwinLogBasic.py (1649 of 2119) PASS: lldb-unit :: Utility/./UtilityTests/ScalarTest.Division (1650 of 2119) PASS: lldb-api :: lang/objc/forward-decl/TestForwardDecl.py (1651 of 2119) PASS: lldb-unit :: Process/minidump/./LLDBMinidumpTests/MinidumpParserTest.GetMemoryRegionInfo (1652 of 2119) PASS: lldb-unit :: Process/minidump/./LLDBMinidumpTests/MinidumpParserTest.InvalidMinidump (1653 of 2119) PASS: lldb-api :: lang/objc/modules-inline-functions/TestModulesInlineFunctions.py (1654 of 2119) PASS: lldb-api :: commands/target/dump-symtab-demangle/TestDumpSymtabDemangle.py (1655 of 2119) PASS: lldb-api :: lang/c/blocks/TestBlocks.py (1656 of 2119) UNSUPPORTED: lldb-api :: functionalities/data-formatter/data-formatter-stl/libstdcpp/string/TestDataFormatterStdString.py (1657 of 2119) PASS: lldb-api :: lang/cpp/extern_c/TestExternCSymbols.py (1658 of 2119) PASS: lldb-api :: lang/objc/radar-9691614/TestObjCMethodReturningBOOL.py (1659 of 2119) PASS: lldb-unit :: Utility/./UtilityTests/StringListTest.SplitIntoLinesSingleTrailingCR (1660 of 2119) PASS: lldb-api :: functionalities/thread/concurrent_events/TestConcurrentWatchBreak.py (1661 of 2119) PASS: lldb-api :: macosx/find-dsym/deep-bundle/TestDeepBundle.py (1662 of 2119) PASS: lldb-api :: lang/cpp/limit-debug-info/TestWithLimitDebugInfo.py (1663 of 2119) PASS: lldb-api :: lang/cpp/breakpoint_in_member_func_w_non_primitive_params/TestBreakpointInMemberFuncWNonPrimitiveParams.py (1664 of 2119) PASS: lldb-unit :: Utility/./UtilityTests/VASprintfTest.EncodingError (1665 of 2119) UNSUPPORTED: lldb-shell :: ScriptInterpreter/Lua/convenience_variables.test (1666 of 2119) PASS: lldb-unit :: Symbol/./SymbolTests/TestClangASTImporter.CompleteFwdDeclWithOtherOrigin (1667 of 2119) PASS: lldb-unit :: Utility/./UtilityTests/StructuredDataTest.StringDump (1668 of 2119) PASS: lldb-unit :: Symbol/./SymbolTests/TestTypeSystemClang.TestGetTypeClassTypeOfExpr (1669 of 2119) PASS: lldb-unit :: Instruction/./EmulatorTests/TestAArch64Emulator.TestOverflow (1670 of 2119) PASS: lldb-api :: commands/expression/options/TestExprOptions.py (1671 of 2119) PASS: lldb-unit :: Utility/./UtilityTests/DataExtractorTest.GetSLEB128_bit63 (1672 of 2119) PASS: lldb-api :: functionalities/postmortem/elf-core/gcore/TestGCore.py (1673 of 2119) PASS: lldb-shell :: ObjectFile/ELF/section-permissions.yaml (1674 of 2119) PASS: lldb-unit :: Core/./LLDBCoreTests/MangledTest.ResultForBlockInvocation (1675 of 2119) PASS: lldb-api :: functionalities/data-formatter/data-formatter-synthval/TestDataFormatterSynthVal.py (1676 of 2119) PASS: lldb-api :: functionalities/breakpoint/move_nearest/TestMoveNearest.py (1677 of 2119) PASS: lldb-unit :: Symbol/./SymbolTests/TestClangASTImporter.CopyTypeTagDecl (1678 of 2119) PASS: lldb-unit :: Utility/./UtilityTests/DataExtractorTest.GetDouble (1679 of 2119) PASS: lldb-api :: lang/cpp/global_variables/TestCPPGlobalVariables.py (1680 of 2119) PASS: lldb-unit :: Utility/./UtilityTests/StringListTest.JoinSingle (1681 of 2119) PASS: lldb-unit :: Utility/./UtilityTests/DataExtractorTest.GetCStrAtNullOffset (1682 of 2119) PASS: lldb-api :: lang/objc/objc-super/TestObjCSuper.py (1683 of 2119) PASS: lldb-unit :: Target/./TargetTests/PathMappingListTest.RemapRoot (1684 of 2119) PASS: lldb-unit :: Utility/./UtilityTests/CompletionRequest.TryCompleteCurrentArgBad (1685 of 2119) PASS: lldb-unit :: DataFormatter/./LLDBFormatterTests/TypeMatcherTests.CreatedBySameMatchString (1686 of 2119) PASS: lldb-unit :: Language/Highlighting/./HighlighterTests/HighlighterTest.ClangPreserveNewLine (1687 of 2119) PASS: lldb-api :: commands/expression/import-std-module/deque-basic/TestDequeFromStdModule.py (1688 of 2119) PASS: lldb-unit :: Utility/./UtilityTests/EnvironmentTest.EnvpConversion (1689 of 2119) PASS: lldb-api :: functionalities/data-formatter/data-formatter-proper-plurals/TestFormattersOneIsSingular.py (1690 of 2119) UNSUPPORTED: lldb-api :: functionalities/darwin_log/filter/exact_match/subsystem/TestDarwinLogFilterMatchSubsystem.py (1691 of 2119) PASS: lldb-unit :: Utility/./UtilityTests/RecordReplayTest.InstrumentedBarRef (1692 of 2119) PASS: lldb-shell :: Settings/TestModuleCacheSanity.test (1693 of 2119) PASS: lldb-shell :: SymbolFile/DWARF/debug-types-dwo-cross-reference.cpp (1694 of 2119) PASS: lldb-unit :: Utility/./UtilityTests/OptionsWithRawTest.WhitespaceInput (1695 of 2119) PASS: lldb-api :: functionalities/signal/raise/TestRaise.py (1696 of 2119) PASS: lldb-unit :: Utility/./UtilityTests/StreamTeeTest.AppendStream (1697 of 2119) PASS: lldb-api :: lang/cpp/virtual-overload/TestVirtualOverload.py (1698 of 2119) PASS: lldb-api :: commands/gui/basicdebug/TestGuiBasicDebug.py (1699 of 2119) PASS: lldb-shell :: ObjectFile/ELF/gnu-debuglink.yaml (1700 of 2119) PASS: lldb-unit :: UnwindAssembly/x86/./UnwindAssemblyx86Tests/Testx86AssemblyInspectionEngine.TestDisassemblyJunkBytes (1701 of 2119) PASS: lldb-unit :: Utility/./UtilityTests/RecordReplayTest.InstrumentedBar (1702 of 2119) PASS: lldb-api :: lang/objc/rdar-11355592/TestRdar11355592.py (1703 of 2119) PASS: lldb-unit :: UnwindAssembly/x86/./UnwindAssemblyx86Tests/Testx86AssemblyInspectionEngine.TestSimplei386ugmented (1704 of 2119) PASS: lldb-unit :: Expression/./ExpressionTests/DiagnosticManagerTest.GetStringBasic (1705 of 2119) PASS: lldb-shell :: Breakpoint/jitbp_elf.test (1706 of 2119) PASS: lldb-unit :: Utility/./UtilityTests/AnsiTerminal.Unknown (1707 of 2119) PASS: lldb-unit :: Utility/./UtilityTests/FileSpecTest.GuessPathStyle (1708 of 2119) PASS: lldb-shell :: SymbolFile/DWARF/debug_loclists-dwo.s (1709 of 2119) PASS: lldb-unit :: DataFormatter/./LLDBFormatterTests/TypeMatcherTests.CreatedBySameMatchStringExactNamePrefixes (1710 of 2119) PASS: lldb-unit :: Host/./HostTests/FileSystemTest.EnumerateDirectory (1711 of 2119) PASS: lldb-unit :: Utility/./UtilityTests/FileSpecTest.IsRelative (1712 of 2119) PASS: lldb-shell :: Commands/command-thread-select.test (1713 of 2119) XFAIL: lldb-shell :: Register/x86-mm-xmm-write.test (1714 of 2119) PASS: lldb-api :: functionalities/inline-stepping/TestInlineStepping.py (1715 of 2119) PASS: lldb-api :: commands/expression/top-level/TestTopLevelExprs.py (1716 of 2119) PASS: lldb-api :: functionalities/inferior-crashing/TestInferiorCrashing.py (1717 of 2119) UNSUPPORTED: lldb-shell :: Register/x86-ymm-read.test (1718 of 2119) PASS: lldb-unit :: Process/gdb-remote/./ProcessGdbRemoteTests/GDBRemoteCommunicationClientTest.WriteRegister (1719 of 2119) PASS: lldb-shell :: Reproducer/TestSynchronous.test (1720 of 2119) PASS: lldb-api :: functionalities/data-formatter/data-formatter-ptr-to-array/TestPtrToArrayFormatting.py (1721 of 2119) PASS: lldb-unit :: Utility/./UtilityTests/FileSpecTest.EqualSeparator (1722 of 2119) PASS: lldb-unit :: Utility/./UtilityTests/UriParserTest.BracketedHostnameWithColon (1723 of 2119) PASS: lldb-unit :: Utility/./UtilityTests/StringExtractorTest.GetHexBytesAvail_Partial (1724 of 2119) PASS: lldb-api :: functionalities/memory/cache/TestMemoryCache.py (1725 of 2119) PASS: lldb-unit :: Utility/./UtilityTests/StringExtractorTest.GetHexBytes_Underflow (1726 of 2119) PASS: lldb-shell :: Settings/TestFrameFormatNoColor.test (1727 of 2119) PASS: lldb-shell :: ObjectFile/ELF/PT_LOAD-empty.yaml (1728 of 2119) PASS: lldb-api :: macosx/duplicate-archive-members/TestDuplicateMembers.py (1729 of 2119) PASS: lldb-shell :: SymbolFile/Breakpad/symtab.test (1730 of 2119) PASS: lldb-api :: commands/watchpoints/watchpoint_commands/condition/TestWatchpointConditionCmd.py (1731 of 2119) UNSUPPORTED: lldb-api :: arm/breakpoint-thumb-codesection/TestBreakpointThumbCodesection.py (1732 of 2119) PASS: lldb-unit :: Utility/./UtilityTests/UriParserTest.Minimal (1733 of 2119) PASS: lldb-shell :: ObjectFile/ELF/compressed-sections.yaml (1734 of 2119) PASS: lldb-unit :: Symbol/./SymbolTests/SymbolsTest.TerminateLocateExecutableSymbolFileForUnknownExecutableAndUnknownSymbolFile (1735 of 2119) PASS: lldb-unit :: Utility/./UtilityTests/StringExtractorTest.GetNameColonValueNoSemicolon (1736 of 2119) PASS: lldb-api :: functionalities/data-formatter/builtin-formats/TestBuiltinFormats.py (1737 of 2119) PASS: lldb-api :: python_api/lldbutil/frame/TestFrameUtils.py (1738 of 2119) PASS: lldb-api :: functionalities/inferior-crashing/TestInferiorCrashingStep.py (1739 of 2119) PASS: lldb-api :: python_api/sbtype_typeclass/TestSBTypeTypeClass.py (1740 of 2119) UNSUPPORTED: lldb-api :: tools/lldb-server/thread-name/TestGdbRemoteThreadName.py (1741 of 2119) PASS: lldb-shell :: Reproducer/TestDump.test (1742 of 2119) PASS: lldb-unit :: Host/./HostTests/MainLoopTest.UnmonitoredSignal (1743 of 2119) PASS: lldb-api :: commands/command/invalid-args/TestInvalidArgsCommand.py (1744 of 2119) PASS: lldb-unit :: Editline/./EditlineTests/EditlineTestFixture.EditlineReceivesSingleLineText (1745 of 2119) PASS: lldb-shell :: SymbolFile/NativePDB/break-by-line.cpp (1746 of 2119) PASS: lldb-unit :: Utility/./UtilityTests/UserIDResolver.GetUserName (1747 of 2119) PASS: lldb-shell :: ObjectFile/MachO/symtab.yaml (1748 of 2119) PASS: lldb-api :: commands/expression/timeout/TestCallWithTimeout.py (1749 of 2119) PASS: lldb-unit :: Utility/./UtilityTests/ScalarTest.Comparison (1750 of 2119) PASS: lldb-unit :: Language/Highlighting/./HighlighterTests/HighlighterTest.ClangCursorPos (1751 of 2119) PASS: lldb-unit :: Utility/./UtilityTests/StatusTest.ErrorCodeConstructor (1752 of 2119) PASS: lldb-api :: functionalities/thread/concurrent_events/TestConcurrentCrashWithWatchpoint.py (1753 of 2119) PASS: lldb-unit :: Utility/./UtilityTests/ScalarTest.Promotion (1754 of 2119) PASS: lldb-api :: lang/cpp/this_class_type_mixing/TestThisClassTypeMixing.py (1755 of 2119) PASS: lldb-unit :: Language/Highlighting/./HighlighterTests/HighlighterTest.DefaultHighlighterWithCursor (1756 of 2119) PASS: lldb-unit :: Utility/./UtilityTests/RegularExpression.Valid (1757 of 2119) PASS: lldb-unit :: Utility/./UtilityTests/PassiveReplayTest.InstrumentedFooInvalid (1758 of 2119) PASS: lldb-unit :: UnwindAssembly/x86/./UnwindAssemblyx86Tests/Testx86AssemblyInspectionEngine.TestPushR14 (1759 of 2119) UNSUPPORTED: lldb-api :: functionalities/darwin_log/filter/regex/message/TestDarwinLogFilterRegexMessage.py (1760 of 2119) PASS: lldb-shell :: ObjectFile/wasm/basic.yaml (1761 of 2119) PASS: lldb-api :: lang/c/offsetof/TestOffsetof.py (1762 of 2119) PASS: lldb-unit :: UnwindAssembly/x86/./UnwindAssemblyx86Tests/Testx86AssemblyInspectionEngine.TestSpillRegToStackViaMOVi386 (1763 of 2119) PASS: lldb-api :: functionalities/thread/concurrent_events/TestConcurrentManyCrash.py (1764 of 2119) PASS: lldb-shell :: Driver/TestConvenienceVariables.test (1765 of 2119) PASS: lldb-unit :: ScriptInterpreter/Python/./ScriptInterpreterPythonTests/PythonDataObjectsTest.TestPythonDictionaryManipulation (1766 of 2119) PASS: lldb-unit :: UnwindAssembly/x86/./UnwindAssemblyx86Tests/Testx86AssemblyInspectionEngine.TestAddRSP (1767 of 2119) PASS: lldb-api :: macosx/version_zero/TestGetVersionZeroVersion.py (1768 of 2119) PASS: lldb-api :: linux/builtin_trap/TestBuiltinTrap.py (1769 of 2119) PASS: lldb-api :: functionalities/data-formatter/data-formatter-stl/libcxx/list/TestDataFormatterLibcxxList.py (1770 of 2119) PASS: lldb-unit :: Utility/./UtilityTests/Predicate.WaitForValueNotEqualTo (1771 of 2119) PASS: lldb-unit :: UnwindAssembly/x86/./UnwindAssemblyx86Tests/Testx86AssemblyInspectionEngine.TestPopR15 (1772 of 2119) PASS: lldb-api :: functionalities/data-formatter/language_category_updates/TestDataFormatterLanguageCategoryUpdates.py (1773 of 2119) PASS: lldb-api :: lang/cpp/static_methods/TestCPPStaticMethods.py (1774 of 2119) PASS: lldb-unit :: Utility/./UtilityTests/DataExtractorTest.UncommonAddressSize (1775 of 2119) PASS: lldb-unit :: Host/./HostTests/MainLoopTest.ReadObject (1776 of 2119) PASS: lldb-unit :: UnwindAssembly/x86/./UnwindAssemblyx86Tests/Testx86AssemblyInspectionEngine.Test64bitFramelessSmallStackFrame (1777 of 2119) PASS: lldb-api :: functionalities/thread/concurrent_events/TestConcurrentTwoWatchpointsOneDelayBreakpoint.py (1778 of 2119) PASS: lldb-api :: lang/objc/objc-baseclass-sbtype/TestObjCBaseClassSBType.py (1779 of 2119) PASS: lldb-unit :: Utility/./UtilityTests/ArgsTest.AppendArguments (1780 of 2119) PASS: lldb-api :: lang/objc/objc-property/TestObjCProperty.py (1781 of 2119) PASS: lldb-api :: python_api/formatters/TestFormattersSBAPI.py (1782 of 2119) PASS: lldb-unit :: Utility/./UtilityTests/SerializationRountripTest.SerializeDeserializeObjectPointer (1783 of 2119) PASS: lldb-api :: functionalities/breakpoint/breakpoint_by_file_colon_line/TestBreakpointByFileColonLine.py (1784 of 2119) PASS: lldb-api :: functionalities/thread/concurrent_events/TestConcurrentTwoBreakpointsOneDelaySignal.py (1785 of 2119) PASS: lldb-api :: functionalities/data-formatter/poarray/TestPrintObjectArray.py (1786 of 2119) UNSUPPORTED: lldb-shell :: SymbolFile/PDB/calling-conventions.test (1787 of 2119) PASS: lldb-unit :: Symbol/./SymbolTests/TestTypeSystemClang.TestFunctionTemplateInRecordConstruction (1788 of 2119) PASS: lldb-unit :: UnwindAssembly/x86/./UnwindAssemblyx86Tests/Testx86AssemblyInspectionEngine.TestPushRBP (1789 of 2119) UNSUPPORTED: lldb-api :: tools/intel-features/intel-pt/test/TestIntelPTSimpleBinary.py (1790 of 2119) PASS: lldb-unit :: Utility/./UtilityTests/NameMatchesTest.Ignore (1791 of 2119) PASS: lldb-unit :: UnwindAssembly/x86/./UnwindAssemblyx86Tests/Testx86AssemblyInspectionEngine.TestPushECX (1792 of 2119) PASS: lldb-api :: functionalities/breakpoint/dummy_target_breakpoints/TestBreakpointsWithNoTargets.py (1793 of 2119) PASS: lldb-shell :: SymbolFile/DWARF/win-i386-line-table.s (1794 of 2119) PASS: lldb-api :: functionalities/data-formatter/data-formatter-skip-summary/TestDataFormatterSkipSummary.py (1795 of 2119) PASS: lldb-unit :: Utility/./UtilityTests/PassiveReplayTest.InstrumentedFoo (1796 of 2119) PASS: lldb-api :: lang/c/stepping/TestStepAndBreakpoints.py (1797 of 2119) PASS: lldb-unit :: Utility/./UtilityTests/StreamTest.AddressRangeEmptyRange (1798 of 2119) PASS: lldb-shell :: SymbolFile/DWARF/find-qualified-variable.cpp (1799 of 2119) PASS: lldb-shell :: Minidump/Windows/find-module.test (1800 of 2119) PASS: lldb-unit :: Process/gdb-remote/./ProcessGdbRemoteTests/GDBRemoteCommunicationClientTest.SyncThreadState (1801 of 2119) PASS: lldb-unit :: Core/./LLDBCoreTests/MangledTest.EmptyForInvalidName (1802 of 2119) PASS: lldb-api :: commands/expression/codegen-crash-typedefdecl-not-in_declcontext/TestCodegenCrashTypedefDeclNotInDeclContext.py (1803 of 2119) PASS: lldb-unit :: UnwindAssembly/x86/./UnwindAssemblyx86Tests/Testx86AssemblyInspectionEngine.TestAddESP (1804 of 2119) PASS: lldb-api :: functionalities/signal/handle-abrt/TestHandleAbort.py (1805 of 2119) PASS: lldb-api :: commands/expression/import-std-module/shared_ptr-dbg-info-content/TestSharedPtrDbgInfoContentFromStdModule.py (1806 of 2119) PASS: lldb-api :: functionalities/dynamic_value_child_count/TestDynamicValueChildCount.py (1807 of 2119) PASS: lldb-shell :: Reproducer/TestCaptureEnvOverride.test (1808 of 2119) PASS: lldb-api :: functionalities/type_completion/TestTypeCompletion.py (1809 of 2119) PASS: lldb-unit :: Utility/./UtilityTests/RangeTest.ContainsEndInclusive (1810 of 2119) PASS: lldb-api :: lang/objc/foundation/TestSymbolTable.py (1811 of 2119) PASS: lldb-unit :: Utility/./UtilityTests/StreamTeeTest.Write (1812 of 2119) PASS: lldb-unit :: UnwindAssembly/x86/./UnwindAssemblyx86Tests/Testx86AssemblyInspectionEngine.TestPushR12 (1813 of 2119) UNSUPPORTED: lldb-shell :: Register/aarch64-gp-read.test (1814 of 2119) UNSUPPORTED: lldb-shell :: ScriptInterpreter/Lua/io.test (1815 of 2119) PASS: lldb-unit :: SymbolFile/NativePDB/./SymbolFileNativePDBTests/PDBFPOProgramToDWARFExpressionTests.UnresolvedCyclicRegisterAssignmentReference (1816 of 2119) PASS: lldb-api :: functionalities/fat_archives/TestFatArchives.py (1817 of 2119) PASS: lldb-unit :: Utility/./UtilityTests/ConstStringTest.FromMidOfBufferStringRef (1818 of 2119) PASS: lldb-shell :: Settings/TestDisassemblyFormat.test (1819 of 2119) PASS: lldb-unit :: Utility/./UtilityTests/UriParserTest.Empty (1820 of 2119) PASS: lldb-unit :: Utility/./UtilityTests/StreamTeeTest.Flush (1821 of 2119) PASS: lldb-api :: lang/objc/self/TestObjCSelf.py (1822 of 2119) PASS: lldb-shell :: Process/UnsupportedLanguage.test (1823 of 2119) PASS: lldb-unit :: Symbol/./SymbolTests/LineEntryTest.GetSameLineContiguousAddressRangeNestedInline (1824 of 2119) UNSUPPORTED: lldb-api :: commands/expression/completion-crash-invalid-iterator/TestInvalidIteratorCompletionCrash.py (1825 of 2119) PASS: lldb-unit :: Language/Highlighting/./HighlighterTests/HighlighterTest.ClangCursorPosEndOfLine (1826 of 2119) PASS: lldb-api :: python_api/interpreter/TestRunCommandInterpreterAPI.py (1827 of 2119) PASS: lldb-unit :: UnwindAssembly/x86/./UnwindAssemblyx86Tests/Testx86AssemblyInspectionEngine.TestSpArithx86_64Augmented (1828 of 2119) PASS: lldb-api :: functionalities/data-formatter/synthupdate/TestSyntheticFilterRecompute.py (1829 of 2119) PASS: lldb-unit :: Utility/./UtilityTests/UriParserTest.TypicalPortPathIPv6 (1830 of 2119) PASS: lldb-unit :: Host/./HostTests/File.GetStreamFromDescriptor (1831 of 2119) PASS: lldb-shell :: ObjectFile/ELF/duplicate-section.yaml (1832 of 2119) PASS: lldb-unit :: Utility/./UtilityTests/BroadcasterTest.BroadcastEvent (1833 of 2119) UNSUPPORTED: lldb-shell :: SymbolFile/NativePDB/ast-functions-msvc.cpp (1834 of 2119) PASS: lldb-unit :: ScriptInterpreter/Python/./ScriptInterpreterPythonTests/PythonDataObjectsTest.TestPythonTupleToStructuredList (1835 of 2119) PASS: lldb-unit :: Symbol/./SymbolTests/TestTypeSystemClang.TestGetEnumIntegerTypeInvalid (1836 of 2119) PASS: lldb-api :: commands/target/basic/TestTargetCommand.py (1837 of 2119) PASS: lldb-shell :: ObjectFile/wasm/embedded-debug-sections.yaml (1838 of 2119) PASS: lldb-api :: functionalities/var_path/TestVarPath.py (1839 of 2119) PASS: lldb-unit :: Utility/./UtilityTests/StreamTest.PutBytesAsRawHex8ToLittleEndian (1840 of 2119) PASS: lldb-api :: functionalities/gdb_remote_client/TestPlatformClient.py (1841 of 2119) PASS: lldb-shell :: SymbolFile/DWARF/anon_class_w_and_wo_export_symbols.ll (1842 of 2119) PASS: lldb-unit :: Core/./LLDBCoreTests/SourceFileCache.FindSourceFileFound (1843 of 2119) PASS: lldb-shell :: ObjectFile/PECOFF/section-types.yaml (1844 of 2119) PASS: lldb-unit :: DataFormatter/./LLDBFormatterTests/StringPrinterTests.CxxUTF8 (1845 of 2119) PASS: lldb-unit :: Host/./HostTests/FileSystemTest.MakeAbsolute (1846 of 2119) PASS: lldb-api :: lang/c/vla/TestVLA.py (1847 of 2119) PASS: lldb-unit :: Utility/./UtilityTests/StringListTest.JoinThree (1848 of 2119) PASS: lldb-unit :: Utility/./UtilityTests/ArchSpecTest.TestParseMachCPUDashSubtypeTripleSimple (1849 of 2119) PASS: lldb-api :: lang/cpp/breakpoint-commands/TestCPPBreakpointCommands.py (1850 of 2119) UNSUPPORTED: lldb-api :: functionalities/unwind/standard/TestStandardUnwind.py (1851 of 2119) PASS: lldb-api :: functionalities/data-formatter/compactvectors/TestCompactVectors.py (1852 of 2119) PASS: lldb-unit :: ScriptInterpreter/Python/./ScriptInterpreterPythonTests/PythonDataObjectsTest.TestPythonIntegerToStr (1853 of 2119) PASS: lldb-unit :: SymbolFile/NativePDB/./SymbolFileNativePDBTests/PDBFPOProgramToDWARFExpressionTests.InvalidOpUnary (1854 of 2119) UNSUPPORTED: lldb-api :: functionalities/darwin_log/filter/regex/activity-chain/TestDarwinLogFilterRegexActivityChain.py (1855 of 2119) PASS: lldb-api :: lang/cpp/unicode-literals/TestUnicodeLiterals.py (1856 of 2119) PASS: lldb-unit :: Utility/./UtilityTests/RangeTest.Slide (1857 of 2119) PASS: lldb-unit :: Process/gdb-remote/./ProcessGdbRemoteTests/GDBRemoteClientBaseTest.InterruptNoResponse (1858 of 2119) PASS: lldb-unit :: Expression/./ExpressionTests/CppModuleConfigurationTest.MissingLibCpp (1859 of 2119) PASS: lldb-unit :: Process/gdb-remote/./ProcessGdbRemoteTests/GDBRemoteCommunicationServerTest.SendErrorResponse_ErrorList (1860 of 2119) PASS: lldb-unit :: Process/gdb-remote/./ProcessGdbRemoteTests/GDBRemoteCommunicationServerTest.SendErrorResponse_StringError (1861 of 2119) PASS: lldb-api :: lang/mixed/TestMixedLanguages.py (1862 of 2119) PASS: lldb-api :: commands/expression/persistent_ptr_update/TestPersistentPtrUpdate.py (1863 of 2119) PASS: lldb-shell :: Driver/TestPositionalArgs.test (1864 of 2119) PASS: lldb-api :: lang/objc/foundation/TestObjectDescriptionAPI.py (1865 of 2119) PASS: lldb-unit :: UnwindAssembly/ARM64/./Arm64InstEmulationTests/TestArm64InstEmulation.TestCFARegisterTrackedAcrossJumps (1866 of 2119) PASS: lldb-api :: lang/objc/objc-dyn-sbtype/TestObjCDynamicSBType.py (1867 of 2119) PASS: lldb-unit :: Utility/./UtilityTests/ArgsTest.GetQuotedCommandString (1868 of 2119) PASS: lldb-unit :: UnwindAssembly/x86/./UnwindAssemblyx86Tests/Testx86AssemblyInspectionEngine.TestPopRBP (1869 of 2119) PASS: lldb-api :: sample_test/TestSampleTest.py (1870 of 2119) PASS: lldb-unit :: ScriptInterpreter/Python/./ScriptInterpreterPythonTests/PythonDataObjectsTest.TestResetting (1871 of 2119) PASS: lldb-unit :: Utility/./UtilityTests/FileSpecTest.GetPath (1872 of 2119) UNSUPPORTED: lldb-api :: tools/lldb-server/TestGdbRemote_vContThreads.py (1873 of 2119) UNSUPPORTED: lldb-shell :: Expr/TestIRMemoryMapWindows.test (1874 of 2119) PASS: lldb-unit :: Utility/./UtilityTests/BinaryStreamTest.PutULEB128One (1875 of 2119) PASS: lldb-api :: lang/objc/rdar-10967107/TestRdar10967107.py (1876 of 2119) PASS: lldb-api :: functionalities/thread/concurrent_events/TestConcurrentSignalWatch.py (1877 of 2119) PASS: lldb-api :: commands/frame/diagnose/inheritance/TestDiagnoseInheritance.py (1878 of 2119) PASS: lldb-api :: commands/watchpoints/multiple_threads/TestWatchpointMultipleThreads.py (1879 of 2119) PASS: lldb-unit :: Utility/./UtilityTests/StreamTeeTest.Constructor1Stream (1880 of 2119) PASS: lldb-unit :: Utility/./UtilityTests/StreamTest.PutRawBytesToLittleEndian (1881 of 2119) PASS: lldb-unit :: Symbol/./SymbolTests/TestTypeSystemClang.TestGetBasicTypeFromEnum (1882 of 2119) PASS: lldb-api :: lang/cpp/this/TestCPPThis.py (1883 of 2119) PASS: lldb-api :: functionalities/gdb_remote_client/TestArmRegisterDefinition.py (1884 of 2119) PASS: lldb-api :: commands/target/stop-hook/enable/TestTargetStopHookEnable.py (1885 of 2119) PASS: lldb-api :: commands/settings/TestSettings.py (1886 of 2119) PASS: lldb-unit :: Utility/./UtilityTests/StringExtractorTest.GetNameColonValueNoColon (1887 of 2119) UNSUPPORTED: lldb-api :: functionalities/darwin_log/format/TestDarwinLogMessageFormat.py (1888 of 2119) PASS: lldb-shell :: Reproducer/TestReuseDirectory.test (1889 of 2119) PASS: lldb-unit :: Core/./LLDBCoreTests/ModuleSpecTest.InvalidInMemoryBufferValidFile (1890 of 2119) PASS: lldb-api :: functionalities/process_group/TestChangeProcessGroup.py (1891 of 2119) PASS: lldb-unit :: Utility/./UtilityTests/CompletionRequest.TryCompleteCurrentArgMode (1892 of 2119) PASS: lldb-api :: functionalities/data-formatter/data-formatter-disabling/TestDataFormatterDisabling.py (1893 of 2119) PASS: lldb-unit :: Utility/./UtilityTests/StreamTest.ChangingByteOrder (1894 of 2119) PASS: lldb-unit :: UnwindAssembly/x86/./UnwindAssemblyx86Tests/Testx86AssemblyInspectionEngine.TestStackRealignMSVC_i386 (1895 of 2119) UNSUPPORTED: lldb-api :: functionalities/breakpoint/hardware_breakpoints/write_memory_with_hw_breakpoint/TestWriteMemoryWithHWBreakpoint.py (1896 of 2119) PASS: lldb-shell :: SymbolFile/DWARF/clang-ast-from-dwarf-objc-property.m (1897 of 2119) PASS: lldb-api :: lang/cpp/class-template-parameter-pack/TestClassTemplateParameterPack.py (1898 of 2119) PASS: lldb-api :: tools/lldb-vscode/console/TestVSCode_console.py (1899 of 2119) PASS: lldb-api :: functionalities/data-formatter/data-formatter-stl/libcxx/vector/TestDataFormatterLibcxxVector.py (1900 of 2119) PASS: lldb-unit :: Utility/./UtilityTests/VMRange.IsValid (1901 of 2119) PASS: lldb-shell :: SymbolFile/DWARF/debug-types-signature-loop.s (1902 of 2119) PASS: lldb-shell :: SymbolFile/DWARF/apple-index-is-used.cpp (1903 of 2119) PASS: lldb-unit :: Utility/./UtilityTests/UriParserTest.MinimalPath (1904 of 2119) PASS: lldb-api :: functionalities/data-formatter/cstring-utf8-summary/TestCstringUnicode.py (1905 of 2119) PASS: lldb-unit :: Utility/./UtilityTests/OptionsWithRawTest.EmptyInput (1906 of 2119) PASS: lldb-shell :: SymbolFile/DWARF/find-variable-file.cpp (1907 of 2119) PASS: lldb-unit :: Utility/./UtilityTests/StreamTest.PutRawBytesToBigEndian (1908 of 2119) PASS: lldb-api :: python_api/sbvalue_persist/TestSBValuePersist.py (1909 of 2119) PASS: lldb-api :: commands/expression/two-files/TestObjCTypeQueryFromOtherCompileUnit.py (1910 of 2119) UNSUPPORTED: lldb-api :: commands/watchpoints/variable_out_of_scope/TestWatchedVarHitWhenInScope.py (1911 of 2119) PASS: lldb-api :: functionalities/tail_call_frames/ambiguous_tail_call_seq1/TestAmbiguousTailCallSeq1.py (1912 of 2119) PASS: lldb-api :: functionalities/tsan/cpp_global_location/TestTsanCPPGlobalLocation.py (1913 of 2119) PASS: lldb-unit :: Utility/./UtilityTests/StringExtractorTest.GetHexBytesAvail_OddPair2 (1914 of 2119) PASS: lldb-unit :: Utility/./UtilityTests/RangeTest.NotEqual (1915 of 2119) PASS: lldb-unit :: Utility/./UtilityTests/DeserializerTest.HasData (1916 of 2119) PASS: lldb-shell :: SymbolFile/DWARF/debug_aranges-empty-section.s (1917 of 2119) PASS: lldb-shell :: SymbolFile/DWARF/find-basic-namespace.cpp (1918 of 2119) PASS: lldb-unit :: Utility/./UtilityTests/ConstStringTest.CompareStringRef (1919 of 2119) PASS: lldb-unit :: Utility/./UtilityTests/StringExtractorTest.GetNameColonValueSuccess (1920 of 2119) PASS: lldb-unit :: Utility/./UtilityTests/BinaryStreamTest.PutSLEB128ThreeBytes (1921 of 2119) PASS: lldb-api :: functionalities/data-formatter/data-formatter-objc/TestDataFormatterObjCNSContainer.py (1922 of 2119) PASS: lldb-unit :: Language/Highlighting/./HighlighterTests/HighlighterTest.ClangTrailingBackslashMissingNewLine (1923 of 2119) PASS: lldb-api :: functionalities/thread/ignore_suspended/TestIgnoreSuspendedThread.py (1924 of 2119) PASS: lldb-api :: functionalities/plugins/command_plugin/TestPluginCommands.py (1925 of 2119) PASS: lldb-unit :: Interpreter/./InterpreterTests/CompletionTest.FileCompletionAbsolute (1926 of 2119) PASS: lldb-api :: commands/expression/ir-interpreter-phi-nodes/TestIRInterpreterPHINodes.py (1927 of 2119) PASS: lldb-api :: python_api/value/change_values/TestChangeValueAPI.py (1928 of 2119) PASS: lldb-unit :: UnwindAssembly/ARM64/./Arm64InstEmulationTests/TestArm64InstEmulation.TestRegisterDoubleSpills (1929 of 2119) PASS: lldb-unit :: Symbol/./SymbolTests/TestClangASTImporter.MetadataPropagationIndirectImport (1930 of 2119) PASS: lldb-unit :: Utility/./UtilityTests/StringExtractorTest.GetU32BigEndian (1931 of 2119) PASS: lldb-api :: macosx/load-kext/TestLoadKext.py (1932 of 2119) UNSUPPORTED: lldb-shell :: Register/x86-zmm-write.test (1933 of 2119) PASS: lldb-unit :: Utility/./UtilityTests/StringListTest.AppendListCStringArrayEmpty (1934 of 2119) UNSUPPORTED: lldb-api :: functionalities/data-formatter/data-formatter-stl/libstdcpp/vbool/TestDataFormatterStdVBool.py (1935 of 2119) PASS: lldb-unit :: UnwindAssembly/x86/./UnwindAssemblyx86Tests/Testx86AssemblyInspectionEngine.TestMovRSPtoRBP (1936 of 2119) PASS: lldb-api :: commands/frame/select/TestFrameSelect.py (1937 of 2119) PASS: lldb-api :: functionalities/postmortem/minidump-new/TestMiniDumpUUID.py (1938 of 2119) PASS: lldb-shell :: SymbolFile/NativePDB/break-by-function.cpp (1939 of 2119) UNSUPPORTED: lldb-shell :: Register/x86-64-zmm-read.test (1940 of 2119) PASS: lldb-shell :: SymbolFile/DWARF/split-dwarf-multiple-cu.ll (1941 of 2119) PASS: lldb-unit :: Utility/./UtilityTests/ArgsTest.TestAppendArg (1942 of 2119) PASS: lldb-api :: iohandler/resize/TestIOHandlerResize.py (1943 of 2119) PASS: lldb-api :: functionalities/breakpoint/breakpoint_options/TestBreakpointOptions.py (1944 of 2119) PASS: lldb-api :: functionalities/gdb_remote_client/TestIOSSimulator.py (1945 of 2119) PASS: lldb-unit :: Language/Highlighting/./HighlighterTests/HighlighterTest.ClangTrailingBackslashWithWhitespace (1946 of 2119) PASS: lldb-unit :: UnwindAssembly/x86/./UnwindAssemblyx86Tests/Testx86AssemblyInspectionEngine.TestSimplex86_64Augmented (1947 of 2119) PASS: lldb-unit :: Utility/./UtilityTests/BinaryStreamTest.PutSLEB128OneByte (1948 of 2119) PASS: lldb-api :: functionalities/tail_call_frames/inlining_and_tail_calls/TestInliningAndTailCalls.py (1949 of 2119) PASS: lldb-unit :: Utility/./UtilityTests/SerializationRountripTest.SerializeDeserializePodPointers (1950 of 2119) PASS: lldb-api :: commands/settings/quoting/TestQuoting.py (1951 of 2119) PASS: lldb-api :: functionalities/data-formatter/dump_dynamic/TestDumpDynamic.py (1952 of 2119) PASS: lldb-api :: functionalities/thread/concurrent_events/TestConcurrentDelayedCrashWithBreakpointWatchpoint.py (1953 of 2119) UNSUPPORTED: lldb-shell :: SymbolFile/PDB/typedefs.test (1954 of 2119) PASS: lldb-unit :: Utility/./UtilityTests/StringExtractorTest.GetHexU8_Underflow2_NoEof (1955 of 2119) PASS: lldb-api :: commands/expression/context-object-objc/TestContextObjectObjc.py (1956 of 2119) PASS: lldb-api :: lang/cpp/diamond/TestDiamond.py (1957 of 2119) PASS: lldb-api :: functionalities/breakpoint/cpp_exception/TestCPPExceptionBreakpoint.py (1958 of 2119) PASS: lldb-unit :: Host/./HostTests/NativeProcessProtocolTest.SetBreakpointFailVerify (1959 of 2119) PASS: lldb-shell :: SymbolFile/DWARF/debug_loc_and_loclists.s (1960 of 2119) PASS: lldb-unit :: Utility/./UtilityTests/StringListTest.ShiftMove (1961 of 2119) PASS: lldb-api :: functionalities/data-formatter/data-formatter-stl/libcxx/variant/TestDataFormatterLibcxxVariant.py (1962 of 2119) PASS: lldb-api :: functionalities/tail_call_frames/disambiguate_call_site/TestDisambiguateCallSite.py (1963 of 2119) PASS: lldb-api :: commands/apropos/with-process/TestAproposWithProcess.py (1964 of 2119) UNSUPPORTED: lldb-api :: lang/cpp/static_members/TestCPPStaticMembers.py (1965 of 2119) UNSUPPORTED: lldb-shell :: Register/x86-gp-read.test (1966 of 2119) PASS: lldb-api :: functionalities/gdb_remote_client/TestProcessConnect.py (1967 of 2119) PASS: lldb-unit :: Utility/./UtilityTests/GeneratorTest.GetOrCreate (1968 of 2119) PASS: lldb-api :: functionalities/data-formatter/format-propagation/TestFormatPropagation.py (1969 of 2119) PASS: lldb-api :: python_api/function_symbol/TestDisasmAPI.py (1970 of 2119) PASS: lldb-unit :: Process/gdb-remote/./ProcessGdbRemoteTests/GDBRemoteCommunicationClientTest.SaveRestoreRegistersNoSuffix (1971 of 2119) PASS: lldb-unit :: Utility/./UtilityTests/TimerTest.CategoryTimesStats (1972 of 2119) PASS: lldb-api :: lang/cpp/std-function-step-into-callable/TestStdFunctionStepIntoCallable.py (1973 of 2119) PASS: lldb-unit :: Host/./HostTests/NativeProcessProtocolTest.SetBreakpointFailWrite (1974 of 2119) PASS: lldb-shell :: Heap/heap-cstr.test (1975 of 2119) PASS: lldb-api :: functionalities/thread/create_after_attach/TestCreateAfterAttach.py (1976 of 2119) PASS: lldb-unit :: Utility/./UtilityTests/RangeTest.SlideZero (1977 of 2119) PASS: lldb-api :: functionalities/tsan/multiple/TestTsanMultiple.py (1978 of 2119) PASS: lldb-shell :: Driver/TestNoUseColor.test (1979 of 2119) UNSUPPORTED: lldb-api :: lang/c/typedef/Testtypedef.py (1980 of 2119) PASS: lldb-api :: python_api/objc_type/TestObjCType.py (1981 of 2119) PASS: lldb-unit :: DataFormatter/./LLDBFormatterTests/TypeMatcherTests.RegexName (1982 of 2119) PASS: lldb-unit :: Core/./LLDBCoreTests/ModuleSpecTest.TestMachOFile (1983 of 2119) UNSUPPORTED: lldb-api :: commands/register/register/intel_xtended_registers/TestMPXRegisters.py (1984 of 2119) PASS: lldb-api :: lang/cpp/template-function/TestTemplateFunctions.py (1985 of 2119) PASS: lldb-api :: lang/cpp/namespace/TestNamespaceLookup.py (1986 of 2119) PASS: lldb-api :: functionalities/ptr_refs/TestPtrRefs.py (1987 of 2119) PASS: lldb-api :: commands/expression/completion-crash-incomplete-record/TestCompletionCrashIncompleteRecord.py (1988 of 2119) PASS: lldb-api :: commands/expression/expr-in-syscall/TestExpressionInSyscall.py (1989 of 2119) PASS: lldb-shell :: SymbolFile/DWARF/find-method-local-struct.cpp (1990 of 2119) PASS: lldb-shell :: Reproducer/Modules/TestModuleCXX.test (1991 of 2119) PASS: lldb-unit :: Utility/./UtilityTests/DataExtractorTest.PeekData (1992 of 2119) PASS: lldb-unit :: Utility/./UtilityTests/RangeDataVector.CustomSort (1993 of 2119) PASS: lldb-api :: lang/cpp/overloaded-functions/TestOverloadedFunctions.py (1994 of 2119) PASS: lldb-unit :: Utility/./UtilityTests/StringListTest.ForRange (1995 of 2119) PASS: lldb-unit :: Utility/./UtilityTests/StringExtractorTest.GetHexBytes_FullString (1996 of 2119) PASS: lldb-api :: python_api/disassemble-raw-data/TestDisassemble_VST1_64.py (1997 of 2119) PASS: lldb-api :: commands/process/attach-resume/TestAttachResume.py (1998 of 2119) PASS: lldb-api :: commands/register/register/register_command/TestRegisters.py (1999 of 2119) PASS: lldb-api :: functionalities/thread/concurrent_events/TestConcurrentTwoBreakpointThreads.py (2000 of 2119) PASS: lldb-shell :: SymbolFile/Breakpad/unwind-via-stack-cfi.test (2001 of 2119) PASS: lldb-unit :: Process/gdb-remote/./ProcessGdbRemoteTests/GDBRemoteCommunicationClientTest.SendStartTracePacket (2002 of 2119) PASS: lldb-api :: functionalities/unwind/noreturn/TestNoreturnUnwind.py (2003 of 2119) PASS: lldb-unit :: Host/./HostTests/SocketAddressTest.GetAddressInfo (2004 of 2119) PASS: lldb-unit :: Utility/./UtilityTests/StringExtractorTest.GetU64LittleEndian (2005 of 2119) PASS: lldb-api :: commands/expression/calculator_mode/TestCalculatorMode.py (2006 of 2119) PASS: lldb-unit :: ScriptInterpreter/Python/./ScriptInterpreterPythonTests/PythonDataObjectsTest.TestPythonBytes (2007 of 2119) PASS: lldb-shell :: SymbolFile/DWARF/find-variable-dwo.cpp (2008 of 2119) PASS: lldb-unit :: Utility/./UtilityTests/StreamTest.AddressSize (2009 of 2119) PASS: lldb-api :: lang/objc/ivar-IMP/TestObjCiVarIMP.py (2010 of 2119) PASS: lldb-unit :: Utility/./UtilityTests/StateTest.Formatv (2011 of 2119) PASS: lldb-unit :: Language/Highlighting/./HighlighterTests/HighlighterTest.DefaultHighlighterWithCursorOutOfBounds (2012 of 2119) PASS: lldb-api :: lang/c/inlines/TestRedefinitionsInInlines.py (2013 of 2119) UNSUPPORTED: lldb-shell :: BuildScript/toolchain-clang-cl.test (2014 of 2119) PASS: lldb-shell :: Commands/command-target-modules-dump-sections.yaml (2015 of 2119) PASS: lldb-unit :: Language/CPlusPlus/./LanguageCPlusPlusTests/CPlusPlusLanguage.FindAlternateFunctionManglings (2016 of 2119) PASS: lldb-api :: functionalities/tail_call_frames/thread_step_out_or_return/TestSteppingOutWithArtificialFrames.py (2017 of 2119) PASS: lldb-api :: lang/cpp/member-and-local-vars-with-same-name/TestMembersAndLocalsWithSameName.py (2018 of 2119) PASS: lldb-unit :: Utility/./UtilityTests/StatusTest.ErrorConstructor (2019 of 2119) PASS: lldb-shell :: SymbolFile/DWARF/debug-types-address-ranges.s (2020 of 2119) PASS: lldb-api :: lang/cpp/namespace_definitions/TestNamespaceDefinitions.py (2021 of 2119) PASS: lldb-unit :: Utility/./UtilityTests/ArgsTest.ReplaceArgumentAtIndexOutOfRange (2022 of 2119) PASS: lldb-api :: functionalities/data-formatter/data-formatter-objc/nsstring/TestDataFormatterNSString.py (2023 of 2119) PASS: lldb-unit :: Utility/./UtilityTests/StringLexerTest.HasAtLeast (2024 of 2119) PASS: lldb-shell :: SymbolFile/Breakpad/line-table-discontinuous-file-ids.test (2025 of 2119) PASS: lldb-api :: lang/cpp/type_lookup/TestCppTypeLookup.py (2026 of 2119) PASS: lldb-unit :: Language/Highlighting/./HighlighterTests/HighlighterTest.ClangBraces (2027 of 2119) PASS: lldb-unit :: Utility/./UtilityTests/RangeVector.CombineConsecutiveRanges (2028 of 2119) PASS: lldb-unit :: Symbol/./SymbolTests/PostfixExpression.ParseFPOProgram (2029 of 2119) PASS: lldb-unit :: Utility/./UtilityTests/AnsiTerminal.AtEnd (2030 of 2119) PASS: lldb-unit :: Utility/./UtilityTests/StringListTest.CopyListEmpty (2031 of 2119) UNSUPPORTED: lldb-shell :: Register/arm-gp-read.test (2032 of 2119) PASS: lldb-unit :: Interpreter/./InterpreterTests/OptionValueFileColonLine.setFromString (2033 of 2119) PASS: lldb-api :: functionalities/thread/concurrent_events/TestConcurrentWatchpointWithDelayWatchpointThreads.py (2034 of 2119) PASS: lldb-unit :: Utility/./UtilityTests/FileSpecTest.Yaml (2035 of 2119) PASS: lldb-unit :: ObjectFile/Breakpad/./ObjectFileBreakpadTests/StackWinRecord.parse (2036 of 2119) PASS: lldb-api :: commands/platform/process/list/TestProcessList.py (2037 of 2119) PASS: lldb-unit :: Utility/./UtilityTests/StringListTest.AppendStringCString (2038 of 2119) PASS: lldb-api :: functionalities/data-formatter/data-formatter-objc/cmtime/TestDataFormatterCMTime.py (2039 of 2119) PASS: lldb-unit :: Utility/./UtilityTests/StringListTest.DefaultConstructor (2040 of 2119) PASS: lldb-api :: python_api/frame/inlines/TestInlinedFrame.py (2041 of 2119) PASS: lldb-api :: lang/c/complex/TestComplexC99.py (2042 of 2119) PASS: lldb-api :: python_api/lldbutil/iter/TestRegistersIterator.py (2043 of 2119) UNSUPPORTED: lldb-shell :: Watchpoint/netbsd-nouserdbregs.test (2044 of 2119) PASS: lldb-shell :: SymbolFile/DWARF/find-basic-function.cpp (2045 of 2119) PASS: lldb-shell :: SymbolFile/NativePDB/globals-fundamental.cpp (2046 of 2119) PASS: lldb-api :: functionalities/gdb_remote_client/TestWasm.py (2047 of 2119) PASS: lldb-unit :: Expression/./ExpressionTests/DiagnosticManagerTest.AddDiagnostic (2048 of 2119) PASS: lldb-unit :: Utility/./UtilityTests/UUIDTest.SetFromStringRef (2049 of 2119) PASS: lldb-unit :: Utility/./UtilityTests/XcodeSDKTest.GetSDKTypeForTriple (2050 of 2119) PASS: lldb-unit :: Utility/./UtilityTests/UriParserTest.BadPort2 (2051 of 2119) PASS: lldb-unit :: Utility/./UtilityTests/StringListTest.ShiftStdString (2052 of 2119) PASS: lldb-unit :: Utility/./UtilityTests/ProcessInstanceInfo.DumpTable_invalidUID (2053 of 2119) UNSUPPORTED: lldb-shell :: Reproducer/TestLuaImport.test (2054 of 2119) UNSUPPORTED: lldb-api :: benchmarks/expression/TestExpressionCmd.py (2055 of 2119) PASS: lldb-unit :: Utility/./UtilityTests/StringListTest.JoinEmpty (2056 of 2119) PASS: lldb-api :: functionalities/data-formatter/frameformat_smallstruct/TestFrameFormatSmallStruct.py (2057 of 2119) PASS: lldb-unit :: Target/./TargetTests/ModuleCacheTest.GetAndPutStrangeHostname (2058 of 2119) PASS: lldb-shell :: ObjectFile/PECOFF/basic-info-arm64.yaml (2059 of 2119) PASS: lldb-unit :: ScriptInterpreter/Python/./ScriptInterpreterPythonTests/PythonDataObjectsTest.TestPythonListToStructuredList (2060 of 2119) PASS: lldb-unit :: Utility/./UtilityTests/LogChannelEnabledTest.log_options (2061 of 2119) PASS: lldb-api :: functionalities/postmortem/minidump-new/TestMiniDumpNew.py (2062 of 2119) PASS: lldb-api :: functionalities/thread/concurrent_events/TestConcurrentBreakpointOneDelayBreakpointThreads.py (2063 of 2119) PASS: lldb-unit :: Utility/./UtilityTests/StringLexerTest.NextIfList (2064 of 2119) PASS: lldb-unit :: Utility/./UtilityTests/XcodeSDKTest.MergeTest (2065 of 2119) PASS: lldb-unit :: ScriptInterpreter/Python/./ScriptInterpreterPythonTests/PythonDataObjectsTest.TestGlobalNameResolutionNoDot (2066 of 2119) PASS: lldb-api :: sample_test/TestSampleInlineTest.py (2067 of 2119) PASS: lldb-api :: functionalities/data-formatter/data-formatter-cpp/TestDataFormatterCpp.py (2068 of 2119) PASS: lldb-unit :: Utility/./UtilityTests/BinaryStreamTest.PutSLEB128MaxValue (2069 of 2119) PASS: lldb-api :: tools/lldb-vscode/stackTrace/TestVSCode_stackTrace.py (2070 of 2119) PASS: lldb-unit :: Utility/./UtilityTests/StringExtractorTest.DecodeHexU8_Underflow (2071 of 2119) PASS: lldb-shell :: Breakpoint/debug_rnglist_rlestartend.test (2072 of 2119) PASS: lldb-api :: functionalities/tail_call_frames/ambiguous_tail_call_seq2/TestAmbiguousTailCallSeq2.py (2073 of 2119) PASS: lldb-api :: types/TestDoubleTypesExpr.py (2074 of 2119) PASS: lldb-unit :: Utility/./UtilityTests/FileSpecTest.EqualDotsPosix (2075 of 2119) PASS: lldb-api :: tools/lldb-vscode/breakpoint/TestVSCode_setExceptionBreakpoints.py (2076 of 2119) PASS: lldb-unit :: Expression/./ExpressionTests/DiagnosticManagerTest.AppendMessageSubsequentDiags (2077 of 2119) PASS: lldb-shell :: SymbolFile/DWARF/dwp.s (2078 of 2119) PASS: lldb-unit :: SymbolFile/DWARF/./SymbolFileDWARFTests/SymbolFileDWARFTests.TestAbilitiesForDWARF (2079 of 2119) PASS: lldb-api :: macosx/dyld-trie-symbols/TestDyldTrieSymbols.py (2080 of 2119) PASS: lldb-shell :: SymbolFile/DWARF/DW_OP_piece-smaller-than-struct.s (2081 of 2119) PASS: lldb-api :: functionalities/breakpoint/breakpoint_set_restart/TestBreakpointSetRestart.py (2082 of 2119) PASS: lldb-unit :: UnwindAssembly/x86/./UnwindAssemblyx86Tests/Testx86AssemblyInspectionEngine.TestPopESI (2083 of 2119) PASS: lldb-unit :: Language/Highlighting/./HighlighterTests/HighlighterTest.ClangScalarLiterals (2084 of 2119) PASS: lldb-api :: commands/breakpoint/set/func-regex/TestBreakpointRegexError.py (2085 of 2119) PASS: lldb-unit :: Utility/./UtilityTests/ArgsTest.TestSingleArg (2086 of 2119) PASS: lldb-unit :: UnwindAssembly/x86/./UnwindAssemblyx86Tests/Testx86AssemblyInspectionEngine.Test32BitOnlyInstruction (2087 of 2119) PASS: lldb-api :: lang/objc/objc-checker/TestObjCCheckers.py (2088 of 2119) PASS: lldb-api :: commands/expression/unwind_expression/TestUnwindExpression.py (2089 of 2119) UNSUPPORTED: lldb-api :: functionalities/unwind/ehframe/TestEhFrameUnwind.py (2090 of 2119) PASS: lldb-api :: commands/expression/import-std-module/forward_list-dbg-info-content/TestDbgInfoContentForwardListFromStdModule.py (2091 of 2119) PASS: lldb-unit :: Utility/./UtilityTests/BinaryStreamTest.PutSLEB128FourBytes (2092 of 2119) PASS: lldb-unit :: Utility/./UtilityTests/StreamTeeTest.SetStreamAtIndexOverwrite (2093 of 2119) PASS: lldb-api :: commands/expression/completion/TestExprCompletion.py (2094 of 2119) PASS: lldb-unit :: Utility/./UtilityTests/EnvironmentTest.EnvpConstruction (2095 of 2119) PASS: lldb-api :: functionalities/tsan/thread_numbers/TestTsanThreadNumbers.py (2096 of 2119) PASS: lldb-api :: lang/objc/modules-app-update/TestClangModulesAppUpdate.py (2097 of 2119) PASS: lldb-unit :: Utility/./UtilityTests/StringListTest.GetMaxStringLengthIncreasingSize (2098 of 2119) PASS: lldb-unit :: Utility/./UtilityTests/StringExtractorTest.GetHexU8_Extra (2099 of 2119) PASS: lldb-unit :: API/./APITests/SBCommandInterpreterTest.SingleWordCommand (2100 of 2119) PASS: lldb-shell :: SymbolFile/DWARF/debug_line-relative_path.s (2101 of 2119) PASS: lldb-api :: lang/cpp/trivial_abi/TestTrivialABI.py (2102 of 2119) PASS: lldb-api :: commands/watchpoints/watchpoint_commands/command/TestWatchpointCommandLLDB.py (2103 of 2119) PASS: lldb-unit :: Utility/./UtilityTests/ArgsTest.TestSingleQuotedArgWithSpace (2104 of 2119) PASS: lldb-unit :: Utility/./UtilityTests/AnsiTerminal.Basic (2105 of 2119) PASS: lldb-api :: lang/objc/objc_direct-methods/TestObjCDirectMethods.py (2106 of 2119) PASS: lldb-api :: functionalities/thread/concurrent_events/TestConcurrentSignalDelayBreak.py (2107 of 2119) PASS: lldb-shell :: SymbolFile/DWARF/inline-function-address-shared.test (2108 of 2119) PASS: lldb-unit :: Interpreter/./InterpreterTests/OptionArgParserTest.toBoolean (2109 of 2119) PASS: lldb-shell :: SymbolFile/DWARF/find-basic-type.cpp (2110 of 2119) PASS: lldb-api :: functionalities/jitloader_gdb/TestJITLoaderGDB.py (2111 of 2119) PASS: lldb-api :: functionalities/target-new-solib-notifications/TestModuleLoadedNotifys.py (2112 of 2119) PASS: lldb-api :: lang/cpp/operators/TestCppOperators.py (2113 of 2119) PASS: lldb-api :: functionalities/non-overlapping-index-variable-i/TestIndexVariable.py (2114 of 2119) PASS: lldb-api :: commands/expression/formatters/TestFormatters.py (2115 of 2119) PASS: lldb-api :: lang/objc/foundation/TestRuntimeTypes.py (2116 of 2119) PASS: lldb-api :: functionalities/data-formatter/data-formatter-stl/libcxx/multiset/TestDataFormatterLibcxxMultiSet.py (2117 of 2119) PASS: lldb-api :: types/TestLongTypesExpr.py (2118 of 2119) PASS: lldb-api :: lang/objc/objc-new-syntax/TestObjCNewSyntaxLiteral.py (2119 of 2119) Slowest Tests: -------------------------------------------------------------------------- 600.73s: lldb-api :: macosx/simulator/TestSimulatorPlatform.py 433.95s: lldb-api :: functionalities/postmortem/mach-core/TestMachCore.py 366.97s: lldb-api :: commands/expression/persist_objc_pointeetype/TestPersistObjCPointeeType.py 331.28s: lldb-api :: tools/lldb-server/TestLldbGdbServer.py 280.24s: lldb-api :: lang/objc/objc-ivar-protocols/TestIvarProtocols.py 229.52s: lldb-api :: source-manager/TestSourceManager.py 205.57s: lldb-api :: functionalities/breakpoint/breakpoint_ids/TestBreakpointIDs.py 188.27s: lldb-api :: functionalities/thread/exit_during_expression/TestExitDuringExpression.py 121.61s: lldb-api :: lang/objc/single-entry-dictionary/TestObjCSingleEntryDictionary.py 119.31s: lldb-api :: api/multithreaded/TestMultithreaded.py 109.94s: lldb-api :: types/TestLongTypes.py 108.39s: lldb-api :: functionalities/gdb_remote_client/TestRestartBug.py 99.22s: lldb-api :: lang/objc/hidden-ivars/TestHiddenIvars.py 96.04s: lldb-api :: functionalities/data-formatter/data-formatter-objc/TestDataFormatterObjCNSError.py 93.47s: lldb-api :: lang/cpp/enum_types/TestCPP11EnumTypes.py 91.66s: lldb-api :: types/TestIntegerTypeExpr.py 86.83s: lldb-api :: lang/objc/objc-new-syntax/TestObjCNewSyntaxDictionary.py 80.13s: lldb-api :: lang/objc/foundation/TestFoundationDisassembly.py 79.00s: lldb-api :: lang/objc/foundation/TestObjCMethods.py 77.18s: lldb-api :: functionalities/breakpoint/breakpoint_conditions/TestBreakpointConditions.py

Hide Details

Tests Times: -------------------------------------------------------------------------- [ Range ] :: [ Percentage ] :: [ Count ] -------------------------------------------------------------------------- [600s,650s) :: [ ] :: [ 1/2119] [550s,600s) :: [ ] :: [ 0/2119] [500s,550s) :: [ ] :: [ 0/2119] [450s,500s) :: [ ] :: [ 1/2119] [400s,450s) :: [ ] :: [ 0/2119] [350s,400s) :: [ ] :: [ 2/2119] [300s,350s) :: [ ] :: [ 1/2119] [250s,300s) :: [ ] :: [ 0/2119] [200s,250s) :: [ ] :: [ 3/2119] [150s,200s) :: [ ] :: [ 0/2119] [100s,150s) :: [ ] :: [ 7/2119] [ 50s,100s) :: [ ] :: [ 23/2119] [ 0s, 50s) :: [*************************************** ] :: [2081/2119] -------------------------------------------------------------------------- ******************** Timed Out Tests (1): lldb-api :: macosx/simulator/TestSimulatorPlatform.py

Hide Details

******************** Failed Tests (1): lldb-api :: tools/lldb-server/TestLldbGdbServer.py

Hide Details

Hide Details

Testing Time: 1608.42s Unsupported : 150 Passed : 1961 Expectedly Failed: 6 Timed Out : 1 Failed : 1 FAILED: tools/lldb/test/CMakeFiles/check-lldb-lit cd /Users/buildslave/jenkins/workspace/lldb-cmake/lldb-build/tools/lldb/test && /usr/local/Frameworks/Python.framework/Versions/3.7/bin/python3.7 /Users/buildslave/jenkins/workspace/lldb-cmake/lldb-build/./bin/llvm-lit -v --time-tests --shuffle --xunit-xml-output=/Users/buildslave/jenkins/workspace/lldb-cmake/test/results.xml -v /Users/buildslave/jenkins/workspace/lldb-cmake/lldb-build/tools/lldb/test ninja: build stopped: subcommand failed. Command failed: Command '['/usr/bin/env', 'TERM=vt100', '/usr/local/bin/ninja', '-v', 'check-lldb']' returned non-zero exit status 1 Command: ['/usr/bin/env', 'TERM=vt100', '/usr/local/bin/ninja', '-v', 'check-lldb'] [Pipeline] } [Pipeline] // timeout [Pipeline] } [Pipeline] // stage [Pipeline] stage [Pipeline] { (Declarative: Post Actions) [Pipeline] scanForIssues [Clang (LLVM based)] Sleeping for 5 seconds due to JENKINS-32191... [Clang (LLVM based)] Parsing console log (workspace: '/Users/buildslave/jenkins/workspace/lldb-cmake') [Clang (LLVM based)] Successfully parsed console log [Clang (LLVM based)] -> found 95 issues (skipped 132 duplicates) [Clang (LLVM based)] Post processing issues on 'green-dragon-10' with source code encoding 'UTF-8' [Clang (LLVM based)] Creating SCM blamer to obtain author and commit information for affected files [Clang (LLVM based)] Creating SCM miner to obtain statistics for affected repository files [Clang (LLVM based)] Resolving file names for all issues in source directory '/Users/buildslave/jenkins/workspace/lldb-cmake' [Clang (LLVM based)] -> resolved paths in source directory (29 found, 0 not found) [Clang (LLVM based)] Resolving module names from module definitions (build.xml, pom.xml, or Manifest.mf files) [Clang (LLVM based)] -> resolved module names for 95 issues [Clang (LLVM based)] Resolving package names (or namespaces) by parsing the affected files [Clang (LLVM based)] -> resolved package names of 26 affected files [Clang (LLVM based)] No filter has been set, publishing all 91 issues [Clang (LLVM based)] Creating fingerprints for all affected code blocks to track issues over different builds [Clang (LLVM based)] -> created fingerprints for 91 issues (skipped 0 issues) [Clang (LLVM based)] Copying affected files to Jenkins' build folder '/Users/Shared/Jenkins/Home/jobs/lldb-cmake/builds/23291/files-with-issues' [Clang (LLVM based)] -> 24 copied, 2 not in workspace, 0 not-found, 0 with I/O error [Pipeline] junit Recording test results [Pipeline] } [Pipeline] // stage [Pipeline] } [Pipeline] // withEnv [Pipeline] } [Pipeline] // node [Pipeline] End of Pipeline ERROR: script returned exit code 1 Finished: FAILURE