FailedConsole Output

Skipping 42,864 KB.. Full Log
.ClangCursorPos (1008 of 2119)
PASS: lldb-unit :: Utility/./UtilityTests/StringExtractorTest.GetU32LittleEndian (1009 of 2119)
PASS: lldb-unit :: Host/./HostTests/MainLoopTest.ReadObject (1010 of 2119)
PASS: lldb-api :: python_api/frame/get-variables/TestGetVariables.py (1011 of 2119)
PASS: lldb-unit :: Symbol/./SymbolTests/TestTypeSystemClang.TestConvertAccessTypeToAccessSpecifier (1012 of 2119)
PASS: lldb-unit :: SymbolFile/NativePDB/./SymbolFileNativePDBTests/PDBFPOProgramToDWARFExpressionTests.UnresolvedDependentCyclicRegisterAssignmentReference (1013 of 2119)
UNSUPPORTED: lldb-api :: functionalities/darwin_log/source/info/TestDarwinLogSourceInfo.py (1014 of 2119)
PASS: lldb-shell :: Commands/command-regex-delete.test (1015 of 2119)
PASS: lldb-api :: python_api/symbol-context/two-files/TestSymbolContextTwoFiles.py (1016 of 2119)
PASS: lldb-unit :: Language/Highlighting/./HighlighterTests/HighlighterTest.ClangTrailingBackslashMissingNewLine (1017 of 2119)
PASS: lldb-unit :: Utility/./UtilityTests/UriParserTest.PortOverflow (1018 of 2119)
PASS: lldb-unit :: ScriptInterpreter/Python/./ScriptInterpreterPythonTests/PythonDataObjectsTest.TestPythonDictionaryManipulation (1019 of 2119)
PASS: lldb-unit :: Symbol/./SymbolTests/PostfixExpression.ParseOneExpression (1020 of 2119)
PASS: lldb-unit :: Utility/./UtilityTests/PassiveReplayTest.InstrumentedBar (1021 of 2119)
PASS: lldb-api :: types/TestIntegerType.py (1022 of 2119)
PASS: lldb-unit :: Utility/./UtilityTests/FileSpecTest.Yaml (1023 of 2119)
PASS: lldb-api :: lang/objc/foundation/TestFoundationDisassembly.py (1024 of 2119)
PASS: lldb-api :: commands/expression/import-std-module/no-std-module/TestMissingStdModule.py (1025 of 2119)
UNSUPPORTED: lldb-shell :: SymbolFile/PDB/udt-layout.test (1026 of 2119)
PASS: lldb-api :: commands/target/create-deps/TestTargetCreateDeps.py (1027 of 2119)
PASS: lldb-unit :: UnwindAssembly/x86/./UnwindAssemblyx86Tests/Testx86AssemblyInspectionEngine.TestSpArithx86_64Augmented (1028 of 2119)
PASS: lldb-unit :: Symbol/./SymbolTests/TestTypeSystemClang.TestGetTypeClassTypeOf (1029 of 2119)
PASS: lldb-api :: functionalities/postmortem/wow64_minidump/TestWow64MiniDump.py (1030 of 2119)
PASS: lldb-unit :: Expression/./ExpressionTests/ClangHostTest.ComputeClangResourceDirectory (1031 of 2119)
PASS: lldb-unit :: Utility/./UtilityTests/XcodeSDKTest.GetSDKTypeForTriple (1032 of 2119)
PASS: lldb-unit :: tools/lldb-server/tests/./LLDBServerTests/StandardStartupTest.TestStopReplyContainsThreadPcs (1033 of 2119)
PASS: lldb-api :: python_api/sbtype_typeclass/TestSBTypeTypeClass.py (1034 of 2119)
PASS: lldb-api :: lang/cpp/operator-overload/TestOperatorOverload.py (1035 of 2119)
PASS: lldb-api :: commands/expression/char/TestExprsChar.py (1036 of 2119)
PASS: lldb-unit :: UnwindAssembly/x86/./UnwindAssemblyx86Tests/Testx86AssemblyInspectionEngine.TestSimple64bitFrameFunction (1037 of 2119)
PASS: lldb-api :: functionalities/breakpoint/global_constructor/TestBreakpointInGlobalConstructor.py (1038 of 2119)
PASS: lldb-unit :: Utility/./UtilityTests/StringExtractorTest.GetHexU8_Extra (1039 of 2119)
PASS: lldb-api :: commands/gui/breakpoints/TestGuiBreakpoints.py (1040 of 2119)
PASS: lldb-api :: commands/expression/class_template_specialization_empty_pack/TestClassTemplateSpecializationParametersHandling.py (1041 of 2119)
PASS: lldb-unit :: Utility/./UtilityTests/StreamTest.PutMaxHex64ByteOrderLittle (1042 of 2119)
PASS: lldb-unit :: SymbolFile/DWARF/./SymbolFileDWARFTests/SymbolFileDWARFTests.TestAbbrevOutOfOrder (1043 of 2119)
PASS: lldb-api :: commands/command/script/import/TestImport.py (1044 of 2119)
PASS: lldb-unit :: SymbolFile/NativePDB/./SymbolFileNativePDBTests/PDBFPOProgramToDWARFExpressionTests.MultipleIndependentAssignments (1045 of 2119)
PASS: lldb-unit :: Language/Highlighting/./HighlighterTests/HighlighterTest.Colons (1046 of 2119)
PASS: lldb-unit :: Utility/./UtilityTests/StreamTeeTest.GetStreamAtIndexOutOfBounds (1047 of 2119)
PASS: lldb-api :: lang/objc/objc-foundation-dictionary-empty/TestNSDictionary0.py (1048 of 2119)
PASS: lldb-unit :: Utility/./UtilityTests/StringListTest.AppendStringCString (1049 of 2119)
PASS: lldb-api :: tools/lldb-vscode/coreFile/TestVSCode_coreFile.py (1050 of 2119)
PASS: lldb-unit :: Host/./HostTests/NativeProcessProtocolTest.SetBreakpointFailVerify (1051 of 2119)
PASS: lldb-unit :: Utility/./UtilityTests/StringListTest.InsertStringAtIndexOutOfBounds (1052 of 2119)
PASS: lldb-unit :: SymbolFile/DWARF/./SymbolFileDWARFTests/DWARFASTParserClangTests.EnsureAllDIEsInDeclContextHaveBeenParsedParsesOnlyMatchingEntries (1053 of 2119)
PASS: lldb-unit :: Utility/./UtilityTests/ReproducerTest.SetCapture (1054 of 2119)
PASS: lldb-unit :: Utility/./UtilityTests/DataExtractorTest.GetDoubleUnaligned (1055 of 2119)
PASS: lldb-api :: tools/lldb-vscode/breakpoint/TestVSCode_setFunctionBreakpoints.py (1056 of 2119)
PASS: lldb-api :: python_api/file_handle/TestFileHandle.py (1057 of 2119)
PASS: lldb-api :: lang/objc/objc-baseclass-sbtype/TestObjCBaseClassSBType.py (1058 of 2119)
PASS: lldb-unit :: Utility/./UtilityTests/FileSpecTest.RemoveLastPathComponent (1059 of 2119)
PASS: lldb-unit :: Utility/./UtilityTests/StringExtractorTest.GetHexU8_Underflow2_NoEof (1060 of 2119)
PASS: lldb-api :: python_api/signals/TestSignalsAPI.py (1061 of 2119)
PASS: lldb-api :: types/TestFloatTypes.py (1062 of 2119)
PASS: lldb-unit :: Process/gdb-remote/./ProcessGdbRemoteTests/GDBRemoteCommunicationClientTest.SendSignalsToIgnore (1063 of 2119)
PASS: lldb-unit :: Utility/./UtilityTests/StreamTeeTest.GetStreamAtIndexOutOfBoundsEmpty (1064 of 2119)
PASS: lldb-unit :: UnwindAssembly/x86/./UnwindAssemblyx86Tests/Testx86AssemblyInspectionEngine.TestPushR13 (1065 of 2119)
PASS: lldb-unit :: Utility/./UtilityTests/Flags.AnySet (1066 of 2119)
PASS: lldb-api :: terminal/TestEditline.py (1067 of 2119)
PASS: lldb-api :: functionalities/gdb_remote_client/TestWriteMemory.py (1068 of 2119)
PASS: lldb-unit :: Process/gdb-remote/./ProcessGdbRemoteTests/GDBRemoteCommunicationClientTest.SendGetDataPacket (1069 of 2119)
XFAIL: lldb-shell :: SymbolFile/DWARF/find-type-in-function.cpp (1070 of 2119)
PASS: lldb-api :: commands/expression/import_builtin_fileid/TestImportBuiltinFileID.py (1071 of 2119)
PASS: lldb-api :: lang/objc/ivar-IMP/TestObjCiVarIMP.py (1072 of 2119)
PASS: lldb-unit :: Language/Highlighting/./HighlighterTests/HighlighterTest.ClangTrailingBackslashWithWhitespace (1073 of 2119)
PASS: lldb-unit :: API/./APITests/SBCommandInterpreterTest.MultiWordCommand (1074 of 2119)
PASS: lldb-api :: commands/watchpoints/watchpoint_size/TestWatchpointSizes.py (1075 of 2119)
UNSUPPORTED: lldb-api :: commands/expression/macros/TestMacros.py (1076 of 2119)
PASS: lldb-shell :: SymbolFile/DWARF/compilercontext.ll (1077 of 2119)
PASS: lldb-unit :: Target/./TargetTests/ModuleCacheTest.GetAndPut (1078 of 2119)
PASS: lldb-api :: commands/settings/use_source_cache/TestUseSourceCache.py (1079 of 2119)
PASS: lldb-unit :: Utility/./UtilityTests/RangeDataVector.CustomSort (1080 of 2119)
PASS: lldb-api :: lang/objc/modules-update/TestClangModulesUpdate.py (1081 of 2119)
UNSUPPORTED: lldb-shell :: Register/x86-64-ymm16-write.test (1082 of 2119)
PASS: lldb-unit :: Utility/./UtilityTests/OptionsWithRawTest.EmptySuffixSingleWhitespace (1083 of 2119)
PASS: lldb-api :: lang/objc/orderedset/TestOrderedSet.py (1084 of 2119)
PASS: lldb-api :: functionalities/data-formatter/varscript_formatting/TestDataFormatterVarScriptFormatting.py (1085 of 2119)
PASS: lldb-api :: commands/settings/TestSettings.py (1086 of 2119)
PASS: lldb-api :: functionalities/inferior-crashing/TestInferiorCrashing.py (1087 of 2119)
PASS: lldb-unit :: Process/minidump/./LLDBMinidumpTests/MinidumpParserTest.GetThreadContext_x86_32 (1088 of 2119)
PASS: lldb-unit :: Target/./TargetTests/ModuleCacheTest.GetAndPutUuidExists (1089 of 2119)
PASS: lldb-shell :: SymbolFile/Breakpad/unwind-via-stack-win.test (1090 of 2119)
PASS: lldb-unit :: Core/./LLDBCoreTests/SourceFileCache.FindSourceFileNotFound (1091 of 2119)
PASS: lldb-unit :: Expression/./ExpressionTests/DiagnosticManagerTest.PutStringSeverities (1092 of 2119)
PASS: lldb-unit :: Expression/./ExpressionTests/DiagnosticManagerTest.PutStringMultiple (1093 of 2119)
UNSUPPORTED: lldb-shell :: SymbolFile/PDB/calling-conventions.test (1094 of 2119)
PASS: lldb-shell :: SymbolFile/NativePDB/disassembly.cpp (1095 of 2119)
PASS: lldb-api :: functionalities/gdb_remote_client/TestRegDefinitionInParts.py (1096 of 2119)
PASS: lldb-unit :: Core/./LLDBCoreTests/ModuleSpecTest.InvalidInMemoryBufferValidFile (1097 of 2119)
PASS: lldb-unit :: Utility/./UtilityTests/RangeTest.ContainsAddr (1098 of 2119)
PASS: lldb-unit :: ObjectFile/Breakpad/./ObjectFileBreakpadTests/StackWinRecord.parse (1099 of 2119)
PASS: lldb-api :: commands/command/invalid-args/TestInvalidArgsCommand.py (1100 of 2119)
PASS: lldb-unit :: Utility/./UtilityTests/StringListTest.InsertStringAtIndexEnd (1101 of 2119)
PASS: lldb-shell :: SymbolFile/DWARF/deterministic-build.cpp (1102 of 2119)
PASS: lldb-unit :: SymbolFile/DWARF/./SymbolFileDWARFTests/SymbolFileDWARFTests.ParseArangesNonzeroSegmentSize (1103 of 2119)
PASS: lldb-unit :: Language/CPlusPlus/./LanguageCPlusPlusTests/CPlusPlusLanguage.FindAlternateFunctionManglings (1104 of 2119)
PASS: lldb-unit :: Utility/./UtilityTests/TildeExpressionResolver.ResolveFullPath (1105 of 2119)
PASS: lldb-unit :: Core/./LLDBCoreTests/MangledTest.NameIndexes_FindFunctionSymbols (1106 of 2119)
PASS: lldb-unit :: Utility/./UtilityTests/ArgsTest.EscapeLLDBCommandArgument (1107 of 2119)
PASS: lldb-api :: commands/watchpoints/multiple_hits/TestMultipleHits.py (1108 of 2119)
UNSUPPORTED: lldb-api :: functionalities/signal/handle-segv/TestHandleSegv.py (1109 of 2119)
PASS: lldb-unit :: ObjectFile/MachO/./ObjectFileMachOTests/ObjectFileMachOTest.ModuleFromSharedCacheInfo (1110 of 2119)
PASS: lldb-unit :: Symbol/./SymbolTests/TestClangASTImporter.DeportDeclTagDecl (1111 of 2119)
PASS: lldb-api :: functionalities/data-formatter/data-formatter-stl/libcxx/atomic/TestLibCxxAtomic.py (1112 of 2119)
PASS: lldb-unit :: Expression/./ExpressionTests/CppModuleConfigurationTest.Xcode (1113 of 2119)
PASS: lldb-unit :: Utility/./UtilityTests/StringExtractorTest.GetHexU8_InvalidHex_NoEof (1114 of 2119)
UNSUPPORTED: lldb-shell :: Register/x86-64-ymm16-read.test (1115 of 2119)
PASS: lldb-unit :: Utility/./UtilityTests/FileSpecTest.GuessPathStyle (1116 of 2119)
PASS: lldb-unit :: Utility/./UtilityTests/StatusTest.ErrorConversion (1117 of 2119)
PASS: lldb-api :: functionalities/data-formatter/data-formatter-stl/libcxx/tuple/TestDataFormatterLibcxxTuple.py (1118 of 2119)
PASS: lldb-api :: lang/c/shared_lib/TestSharedLib.py (1119 of 2119)
PASS: lldb-unit :: Utility/./UtilityTests/StringLexerTest.AdvanceIf (1120 of 2119)
PASS: lldb-api :: commands/session/save/TestSessionSave.py (1121 of 2119)
PASS: lldb-api :: functionalities/data-formatter/hexcaps/TestDataFormatterHexCaps.py (1122 of 2119)
PASS: lldb-shell :: Settings/TestLineMarkerColor.test (1123 of 2119)
PASS: lldb-shell :: SymbolFile/DWARF/find-method.cpp (1124 of 2119)
PASS: lldb-shell :: VSCode/TestOptions.test (1125 of 2119)
UNSUPPORTED: lldb-api :: lang/cpp/function-template-parameter-pack/TestFunctionTemplateParameterPack.py (1126 of 2119)
PASS: lldb-api :: functionalities/history/TestHistoryRecall.py (1127 of 2119)
PASS: lldb-unit :: Utility/./UtilityTests/SerializationRountripTest.SerializeDeserializePod (1128 of 2119)
PASS: lldb-api :: functionalities/breakpoint/breakpoint_locations/TestBreakpointLocations.py (1129 of 2119)
PASS: lldb-api :: lang/cpp/dynamic-value-same-basename/TestDynamicValueSameBase.py (1130 of 2119)
PASS: lldb-api :: lang/objc/real-definition/TestRealDefinition.py (1131 of 2119)
PASS: lldb-unit :: ScriptInterpreter/Python/./ScriptInterpreterPythonTests/PythonDataObjectsTest.TestModuleNameResolutionNoDot (1132 of 2119)
PASS: lldb-unit :: ScriptInterpreter/Python/./ScriptInterpreterPythonTests/PythonDataObjectsTest.TestPythonString (1133 of 2119)
PASS: lldb-unit :: Utility/./UtilityTests/StringExtractorTest.DecodeHexU8_Extra (1134 of 2119)
PASS: lldb-unit :: Process/gdb-remote/./ProcessGdbRemoteTests/GDBRemoteClientBaseTest.SendContinueDelegateStructuredDataReceipt (1135 of 2119)
PASS: lldb-unit :: Utility/./UtilityTests/RangeTest.Constructor (1136 of 2119)
PASS: lldb-shell :: SymbolFile/DWARF/debug_ranges_and_rnglists.test (1137 of 2119)
PASS: lldb-api :: functionalities/breakpoint/breakpoint_ids/TestBreakpointIDs.py (1138 of 2119)
PASS: lldb-unit :: Symbol/./SymbolTests/TestTypeSystemClang.TestDisplayName (1139 of 2119)
PASS: lldb-api :: lang/objc/objc-property/TestObjCProperty.py (1140 of 2119)
UNSUPPORTED: lldb-api :: arm/breakpoint-it/TestBreakpointIt.py (1141 of 2119)
PASS: lldb-unit :: Utility/./UtilityTests/RecordReplayTest.InstrumentedBarRef (1142 of 2119)
PASS: lldb-api :: functionalities/dynamic_value_child_count/TestDynamicValueChildCount.py (1143 of 2119)
PASS: lldb-api :: commands/frame/diagnose/inheritance/TestDiagnoseInheritance.py (1144 of 2119)
PASS: lldb-shell :: Reproducer/Functionalities/TestStepping.test (1145 of 2119)
PASS: lldb-api :: functionalities/dlopen_other_executable/TestDlopenOtherExecutable.py (1146 of 2119)
PASS: lldb-unit :: Process/minidump/./LLDBMinidumpTests/MinidumpParserTest.GetMemoryRegionInfoLinuxMaps (1147 of 2119)
PASS: lldb-shell :: Driver/TestSingleQuote.test (1148 of 2119)
PASS: lldb-api :: functionalities/postmortem/elf-core/gcore/TestGCore.py (1149 of 2119)
PASS: lldb-unit :: Utility/./UtilityTests/BinaryStreamTest.PutULEB128SixBytes (1150 of 2119)
PASS: lldb-unit :: Utility/./UtilityTests/RegularExpression.Valid (1151 of 2119)
PASS: lldb-api :: macosx/version_zero/TestGetVersionZeroVersion.py (1152 of 2119)
PASS: lldb-api :: commands/frame/diagnose/complicated-expression/TestComplicatedExpression.py (1153 of 2119)
PASS: lldb-unit :: Utility/./UtilityTests/BinaryStreamTest.PutULEB128EightBytes (1154 of 2119)
PASS: lldb-api :: commands/expression/completion/TestExprCompletion.py (1155 of 2119)
PASS: lldb-api :: commands/expression/formatters/TestFormatters.py (1156 of 2119)
PASS: lldb-api :: commands/gui/basicdebug/TestGuiBasicDebug.py (1157 of 2119)
PASS: lldb-shell :: SymbolFile/DWARF/parallel-indexing-stress.s (1158 of 2119)
PASS: lldb-api :: functionalities/tail_call_frames/cross_object/TestCrossObjectTailCalls.py (1159 of 2119)
PASS: lldb-shell :: Reproducer/TestWorkingDir.test (1160 of 2119)
PASS: lldb-unit :: Target/./TargetTests/ExecutionContextTest.GetByteOrderTarget (1161 of 2119)
PASS: lldb-api :: lang/cpp/template/TestTemplateArgs.py (1162 of 2119)
PASS: lldb-unit :: Signals/./SignalsTests/UnixSignalsTest.GetFilteredSignals (1163 of 2119)
PASS: lldb-unit :: Utility/./UtilityTests/VMRange.IsValid (1164 of 2119)
PASS: lldb-api :: commands/expression/ignore-artificial-constructors/TestIgnoreArtificialConstructors.py (1165 of 2119)
PASS: lldb-unit :: Utility/./UtilityTests/XcodeSDKTest.SDKSupportsSwift (1166 of 2119)
PASS: lldb-unit :: Utility/./UtilityTests/LogChannelTest.EnableOptions (1167 of 2119)
PASS: lldb-unit :: Thread/./ThreadTests/ThreadTest.GetPrivateStopInfo (1168 of 2119)
PASS: lldb-unit :: Symbol/./SymbolTests/TestTypeSystemClang.TestGetTypeClassNested (1169 of 2119)
PASS: lldb-api :: functionalities/data-formatter/data-formatter-stl/libcxx/map/TestDataFormatterLibccMap.py (1170 of 2119)
UNSUPPORTED: lldb-shell :: Register/x86-64-zmm-write.test (1171 of 2119)
PASS: lldb-unit :: Process/minidump/./LLDBMinidumpTests/MinidumpParserTest.GetThreadsAndGetThreadContext (1172 of 2119)
PASS: lldb-unit :: Utility/./UtilityTests/XcodeSDKTest.GetCanonicalNameAndConstruct (1173 of 2119)
PASS: lldb-unit :: UnwindAssembly/x86/./UnwindAssemblyx86Tests/Testx86AssemblyInspectionEngine.TestSimplei386ugmented (1174 of 2119)
PASS: lldb-unit :: Utility/./UtilityTests/ArchSpecTest.TestParseMachCPUDashSubtypeTripleSimple (1175 of 2119)
PASS: lldb-unit :: Utility/./UtilityTests/StringExtractorTest.DecodeHexU8_Underflow (1176 of 2119)
PASS: lldb-shell :: Reproducer/TestProcessList.test (1177 of 2119)
PASS: lldb-unit :: ScriptInterpreter/Python/./ScriptInterpreterPythonTests/PythonDataObjectsTest.TestBorrowedReferences (1178 of 2119)
PASS: lldb-api :: commands/expression/call-function/TestCallBuiltinFunction.py (1179 of 2119)
PASS: lldb-api :: lang/objc/radar-9691614/TestObjCMethodReturningBOOL.py (1180 of 2119)
PASS: lldb-unit :: UnwindAssembly/x86/./UnwindAssemblyx86Tests/Testx86AssemblyInspectionEngine.TestDisassemblyJunkBytes (1181 of 2119)
PASS: lldb-api :: functionalities/data-formatter/data-formatter-stl/libcxx/forward_list/TestDataFormatterLibcxxForwardList.py (1182 of 2119)
PASS: lldb-api :: functionalities/breakpoint/breakpoint_names/TestBreakpointNames.py (1183 of 2119)
UNSUPPORTED: lldb-api :: lang/c/typedef/Testtypedef.py (1184 of 2119)
PASS: lldb-api :: tools/lldb-server/TestGdbRemoteRegisterState.py (1185 of 2119)
UNSUPPORTED: lldb-api :: commands/register/register/intel_xtended_registers/TestMPXRegisters.py (1186 of 2119)
PASS: lldb-shell :: Driver/TestTarget.test (1187 of 2119)
PASS: lldb-unit :: Expression/./ExpressionTests/DWARFExpression.DW_OP_pick (1188 of 2119)
PASS: lldb-unit :: SymbolFile/NativePDB/./SymbolFileNativePDBTests/PDBFPOProgramToDWARFExpressionTests.MissingTargetRegister (1189 of 2119)
PASS: lldb-unit :: Utility/./UtilityTests/CompletionRequest.TestCompletionOwnership (1190 of 2119)
PASS: lldb-unit :: Utility/./UtilityTests/StreamTest.PutCStringWithStringRef (1191 of 2119)
PASS: lldb-unit :: Signals/./SignalsTests/UnixSignalsTest.VersionChange (1192 of 2119)
PASS: lldb-api :: commands/register/register/register_command/TestRegisters.py (1193 of 2119)
PASS: lldb-api :: functionalities/tail_call_frames/sbapi_support/TestTailCallFrameSBAPI.py (1194 of 2119)
UNSUPPORTED: lldb-api :: functionalities/data-formatter/data-formatter-stl/libstdcpp/iterator/TestDataFormatterStdIterator.py (1195 of 2119)
PASS: lldb-unit :: Utility/./UtilityTests/ScalarTest.Division (1196 of 2119)
PASS: lldb-unit :: Process/minidump/./LLDBMinidumpTests/RegisterContextMinidump.ConvertMinidumpContext_x86_32 (1197 of 2119)
PASS: lldb-shell :: Unwind/thread-step-out-ret-addr-check.test (1198 of 2119)
PASS: lldb-api :: functionalities/tail_call_frames/ambiguous_tail_call_seq2/TestAmbiguousTailCallSeq2.py (1199 of 2119)
PASS: lldb-unit :: Core/./LLDBCoreTests/CommunicationTest.SynchronizeWhileClosing (1200 of 2119)
PASS: lldb-unit :: Host/./HostTests/NativeProcessProtocolTest.SetBreakpoint (1201 of 2119)
PASS: lldb-api :: lang/cpp/rvalue-references/TestRvalueReferences.py (1202 of 2119)
PASS: lldb-unit :: debugserver/./debugserverTests/RNBSocket.LoopBackConnectIPv6 (1203 of 2119)
PASS: lldb-shell :: SymbolFile/DWARF/DW_TAG_variable-DW_AT_const_value.s (1204 of 2119)
PASS: lldb-unit :: Process/gdb-remote/./ProcessGdbRemoteTests/GDBRemoteCommunicationClientTest.SendGetTraceConfigPacket (1205 of 2119)
PASS: lldb-api :: types/TestIntegerTypeExpr.py (1206 of 2119)
UNSUPPORTED: lldb-shell :: ObjectFile/ELF/minidebuginfo-no-lzma.yaml (1207 of 2119)
PASS: lldb-unit :: Expression/./ExpressionTests/DiagnosticManagerTest.AppendMessageAttachToLastDiag (1208 of 2119)
PASS: lldb-unit :: Utility/./UtilityTests/StringExtractorTest.GetHexU8_Extra_NoEof (1209 of 2119)
PASS: lldb-unit :: Utility/./UtilityTests/SerializationRountripTest.SerializeDeserializeObjectPointer (1210 of 2119)
UNSUPPORTED: lldb-shell :: BuildScript/toolchain-msvc.test (1211 of 2119)
PASS: lldb-unit :: DataFormatter/./LLDBFormatterTests/TypeMatcherTests.GetMatchStringExactName (1212 of 2119)
PASS: lldb-unit :: DataFormatter/./LLDBFormatterTests/TypeMatcherTests.GetMatchStringRegex (1213 of 2119)
PASS: lldb-shell :: SymbolFile/Breakpad/line-table-missing-file.test (1214 of 2119)
PASS: lldb-api :: functionalities/postmortem/elf-core/TestLinuxCore.py (1215 of 2119)
PASS: lldb-api :: lang/cpp/std-function-step-into-callable/TestStdFunctionStepIntoCallable.py (1216 of 2119)
PASS: lldb-api :: commands/reproducer/invalid-args/TestInvalidArgsReproducer.py (1217 of 2119)
PASS: lldb-api :: functionalities/thread/concurrent_events/TestConcurrentDelaySignalWatch.py (1218 of 2119)
PASS: lldb-shell :: Breakpoint/case-sensitive.test (1219 of 2119)
PASS: lldb-unit :: Utility/./UtilityTests/ArgsTest.TestTrailingBackslash (1220 of 2119)
PASS: lldb-api :: functionalities/breakpoint/address_breakpoints/TestAddressBreakpoints.py (1221 of 2119)
PASS: lldb-api :: lang/objc/foundation/TestObjectDescriptionAPI.py (1222 of 2119)
PASS: lldb-unit :: Process/gdb-remote/./ProcessGdbRemoteTests/GDBRemoteCommunicationClientTest.GetQOffsets (1223 of 2119)
PASS: lldb-unit :: Utility/./UtilityTests/BinaryStreamTest.PutSLEB128SixBytes (1224 of 2119)
PASS: lldb-unit :: Disassembler/./DisassemblerTests/TestArmv7Disassembly.TestCortexFPDisass (1225 of 2119)
PASS: lldb-api :: lang/objc/objc-struct-argument/TestObjCStructArgument.py (1226 of 2119)
PASS: lldb-api :: api/multiple-targets/TestMultipleTargets.py (1227 of 2119)
PASS: lldb-shell :: SymbolFile/DWARF/debug_line-relative_path.s (1228 of 2119)
PASS: lldb-api :: tools/lldb-vscode/attach/TestVSCode_attach.py (1229 of 2119)
PASS: lldb-api :: commands/frame/language/TestGuessLanguage.py (1230 of 2119)
PASS: lldb-unit :: Language/Highlighting/./HighlighterTests/HighlighterTest.ClangEmptyInput (1231 of 2119)
PASS: lldb-shell :: BuildScript/modes.test (1232 of 2119)
PASS: lldb-unit :: Utility/./UtilityTests/CompletionRequest.Constructor (1233 of 2119)
PASS: lldb-unit :: Utility/./UtilityTests/StringExtractorTest.GetHexBytesAvail_OddPair2 (1234 of 2119)
PASS: lldb-api :: functionalities/breakpoint/inlined_breakpoints/TestInlinedBreakpoints.py (1235 of 2119)
UNSUPPORTED: lldb-shell :: SymbolFile/PDB/variables-locations.test (1236 of 2119)
PASS: lldb-api :: commands/expression/multiline-completion/TestMultilineCompletion.py (1237 of 2119)
UNSUPPORTED: lldb-shell :: Expr/TestIRMemoryMapWindows.test (1238 of 2119)
PASS: lldb-unit :: ScriptInterpreter/Python/./ScriptInterpreterPythonTests/PythonDataObjectsTest.TestPythonTupleValues (1239 of 2119)
PASS: lldb-unit :: UnwindAssembly/x86/./UnwindAssemblyx86Tests/Testx86AssemblyInspectionEngine.TestMovRSPtoRBP (1240 of 2119)
PASS: lldb-shell :: ScriptInterpreter/Python/eof.test (1241 of 2119)
PASS: lldb-unit :: Process/gdb-remote/./ProcessGdbRemoteTests/GDBRemoteCommunicationClientTest.GetMemoryRegionInfoInvalidResponse (1242 of 2119)
PASS: lldb-api :: functionalities/breakpoint/breakpoint_set_restart/TestBreakpointSetRestart.py (1243 of 2119)
PASS: lldb-unit :: Process/minidump/./LLDBMinidumpTests/MinidumpParserTest.GetMemoryRegionInfo (1244 of 2119)
PASS: lldb-shell :: Settings/TestSettingsWrite.test (1245 of 2119)
PASS: lldb-api :: functionalities/testid/TestTestId.py (1246 of 2119)
PASS: lldb-unit :: Utility/./UtilityTests/StreamTest.AddressRangeSize (1247 of 2119)
PASS: lldb-api :: lang/cpp/member-and-local-vars-with-same-name/TestMembersAndLocalsWithSameName.py (1248 of 2119)
PASS: lldb-unit :: Utility/./UtilityTests/StringListTest.GetMaxStringLengthEqualSize (1249 of 2119)
PASS: lldb-unit :: ScriptInterpreter/Python/./ScriptInterpreterPythonTests/PythonDataObjectsTest.TestPythonBoolean (1250 of 2119)
PASS: lldb-api :: lang/cpp/auto/TestCPPAuto.py (1251 of 2119)
PASS: lldb-shell :: ObjectFile/ELF/section-types.yaml (1252 of 2119)
PASS: lldb-unit :: Utility/./UtilityTests/RangeTest.ContainsRange (1253 of 2119)
UNSUPPORTED: lldb-api :: functionalities/darwin_log/filter/exact_match/message/TestDarwinLogFilterMatchMessage.py (1254 of 2119)
PASS: lldb-api :: source-manager/TestSourceManager.py (1255 of 2119)
PASS: lldb-api :: lang/cpp/namespace_definitions/TestNamespaceDefinitions.py (1256 of 2119)
UNSUPPORTED: lldb-shell :: SymbolFile/PDB/function-level-linking.test (1257 of 2119)
PASS: lldb-api :: functionalities/thread/state_after_expression/TestStateAfterExpression.py (1258 of 2119)
PASS: lldb-shell :: ObjectFile/PECOFF/basic-info.yaml (1259 of 2119)
PASS: lldb-api :: python_api/objc_type/TestObjCType.py (1260 of 2119)
PASS: lldb-shell :: ObjectFile/ELF/aarch64-relocations.yaml (1261 of 2119)
PASS: lldb-api :: lang/cpp/global_operators/TestCppGlobalOperators.py (1262 of 2119)
UNSUPPORTED: lldb-api :: functionalities/darwin_log/filter/exact_match/activity/TestDarwinLogFilterMatchActivity.py (1263 of 2119)
UNSUPPORTED: lldb-api :: lang/cpp/static_members/TestCPPStaticMembers.py (1264 of 2119)
PASS: lldb-unit :: Utility/./UtilityTests/AnsiTerminal.AtEnd (1265 of 2119)
PASS: lldb-shell :: ObjectFile/MachO/subsections.yaml (1266 of 2119)
PASS: lldb-unit :: Utility/./UtilityTests/ArchSpecTest.TestParseMachCPUDashSubtypeTripleExtra (1267 of 2119)
PASS: lldb-api :: commands/add-dsym/uuid/TestAddDsymCommand.py (1268 of 2119)
PASS: lldb-api :: lang/c/const_variables/TestConstVariables.py (1269 of 2119)
PASS: lldb-unit :: Utility/./UtilityTests/IndexToObjectTest.ObjectForIndex (1270 of 2119)
PASS: lldb-unit :: UnwindAssembly/x86/./UnwindAssemblyx86Tests/Testx86AssemblyInspectionEngine.TestStackRealignMSVC_i386 (1271 of 2119)
PASS: lldb-unit :: Utility/./UtilityTests/SubsystemRAIITest.SubsystemWithErrorSuccess (1272 of 2119)
PASS: lldb-unit :: ObjectFile/PECOFF/./ObjectFilePECOFFTests/PECallFrameInfoTest.Basic_eh (1273 of 2119)
PASS: lldb-unit :: Utility/./UtilityTests/SerializationRountripTest.SerializeDeserializePodReferences (1274 of 2119)
PASS: lldb-api :: tools/lldb-server/TestGdbRemote_qThreadStopInfo.py (1275 of 2119)
PASS: lldb-api :: lang/objc/foundation/TestObjCMethods.py (1276 of 2119)
PASS: lldb-shell :: SymbolFile/DWARF/find-inline-method.s (1277 of 2119)
PASS: lldb-api :: iohandler/completion/TestIOHandlerCompletion.py (1278 of 2119)
PASS: lldb-unit :: Core/./LLDBCoreTests/RichManglingContextTest.SwitchProvider (1279 of 2119)
PASS: lldb-api :: iohandler/resize/TestIOHandlerResize.py (1280 of 2119)
PASS: lldb-api :: functionalities/breakpoint/address_breakpoints/TestBadAddressBreakpoints.py (1281 of 2119)
PASS: lldb-api :: functionalities/gdb_remote_client/TestqOffsets.py (1282 of 2119)
PASS: lldb-api :: lang/cpp/breakpoint_in_member_func_w_non_primitive_params/TestBreakpointInMemberFuncWNonPrimitiveParams.py (1283 of 2119)
PASS: lldb-unit :: Utility/./UtilityTests/NameMatchesTest.EndsWith (1284 of 2119)
PASS: lldb-api :: lang/objcxx/cxx-bridged-po/TestObjCXXBridgedPO.py (1285 of 2119)
PASS: lldb-api :: functionalities/thread/exit_during_expression/TestExitDuringExpression.py (1286 of 2119)
FAIL: lldb-api :: functionalities/gdb_remote_client/TestGDBRemoteClient.py (1287 of 2119)
******************** TEST 'lldb-api :: functionalities/gdb_remote_client/TestGDBRemoteClient.py' FAILED ********************
Script:
--
/usr/local/Frameworks/Python.framework/Versions/3.7/bin/python3.7 /Users/buildslave/jenkins/workspace/lldb-cmake/llvm-project/lldb/test/API/dotest.py --arch x86_64 -s /Users/buildslave/jenkins/workspace/lldb-cmake/lldb-build/lldb-test-traces -S nm -u CXXFLAGS -u CFLAGS --codesign-identity - --server /Users/buildslave/jenkins/workspace/lldb-cmake/lldb-build/./bin/debugserver --arch x86_64 --build-dir /Users/buildslave/jenkins/workspace/lldb-cmake/lldb-build/lldb-test-build.noindex -s=/Users/buildslave/jenkins/workspace/lldb-cmake/test/logs -t --env TERM=vt100 --env LLVM_LIBS_DIR=/Users/buildslave/jenkins/workspace/lldb-cmake/lldb-build/./lib --build-dir /Users/buildslave/jenkins/workspace/lldb-cmake/lldb-build/lldb-test-build.noindex --lldb-module-cache-dir /Users/buildslave/jenkins/workspace/lldb-cmake/lldb-build/lldb-test-build.noindex/module-cache-lldb/lldb-api --clang-module-cache-dir /Users/buildslave/jenkins/workspace/lldb-cmake/lldb-build/lldb-test-build.noindex/module-cache-clang/lldb-api --executable /Users/buildslave/jenkins/workspace/lldb-cmake/lldb-build/./bin/lldb --compiler /Users/buildslave/jenkins/workspace/lldb-cmake/lldb-build/./bin/clang --dsymutil /Users/buildslave/jenkins/workspace/lldb-cmake/lldb-build/./bin/dsymutil --filecheck /Users/buildslave/jenkins/workspace/lldb-cmake/lldb-build/./bin/FileCheck --yaml2obj /Users/buildslave/jenkins/workspace/lldb-cmake/lldb-build/./bin/yaml2obj --lldb-libs-dir /Users/buildslave/jenkins/workspace/lldb-cmake/lldb-build/./lib /Users/buildslave/jenkins/workspace/lldb-cmake/llvm-project/lldb/test/API/functionalities/gdb_remote_client -p TestGDBRemoteClient.py
--
Exit Code: 1

Hide Details

Command Output (stdout): -- lldb version 12.0.99 clang revision c8b629a3a5854506dd25e84f9b4174b53f8f667b llvm revision c8b629a3a5854506dd25e84f9b4174b53f8f667b < 1> send packet: + history[1] tid=0x0307 < 1> send packet: + < 19> send packet: $QStartNoAckMode#b0 < 1> read packet: + < 6> read packet: $OK#9a < 1> send packet: + < 45> send packet: $qSupported:xmlRegisters=i386,arm,mips,arc#74 < 57> read packet: $qXfer:features:read+;PacketSize=3fff;QStartNoAckMode+#86 < 26> send packet: $QThreadSuffixSupported#e4 < 4> read packet: $#00 < 27> send packet: $QListThreadsInStopReply#21 < 4> read packet: $#00 < 13> send packet: $qHostInfo#9b < 28> read packet: $ptrsize:8;endian:little;#30 < 10> send packet: $vCont?#49 < 4> read packet: $#00 < 27> send packet: $qVAttachOrWaitSupported#38 < 4> read packet: $#00 < 23> send packet: $QEnableErrorStrings#8c < 6> read packet: $OK#9a < 16> send packet: $qProcessInfo#dc < 4> read packet: $#00 < 6> send packet: $qC#b4 < 7> read packet: $E42#ab < 16> send packet: $qfThreadInfo#bb < 6> read packet: $OK#9a < 38> send packet: $QSetSTDIN:2f6465762f74747973303035#89 < 4> read packet: $#00 < 39> send packet: $QSetSTDOUT:2f6465762f74747973303035#ea < 4> read packet: $#00 < 39> send packet: $QSetSTDERR:2f6465762f74747973303035#db < 4> read packet: $#00 < 21> send packet: $QSetDisableASLR:0#cd < 4> read packet: $#00 < 23> send packet: $QSetDetachOnError:0#f7 < 4> read packet: $#00 < 19> send packet: $QLaunchArch:arm#a4 < 4> read packet: $#00 < 94> send packet: $QEnvironment:LLDB_SESSION_DIRNAME=/Users/buildslave/jenkins/workspace/lldb-cmake/test/logs#e5 < 4> read packet: $#00 < 319> send packet: $A308,0,2f55736572732f6275696c64736c6176652f6a656e6b696e732f776f726b73706163652f6c6c64622d636d616b652f6c6c64622d6275696c642f6c6c64622d746573742d6275696c642e6e6f696e6465782f66756e6374696f6e616c69746965732f6764625f72656d6f74655f636c69656e742f5465737447444252656d6f7465436c69656e742e746573745f6c61756e63685f6661696c2f61#e4 < 7> read packet: $E47#b0 < 1> send packet: + history[1] tid=0x0307 < 1> send packet: + < 19> send packet: $QStartNoAckMode#b0 < 1> read packet: + < 6> read packet: $OK#9a < 1> send packet: + < 45> send packet: $qSupported:xmlRegisters=i386,arm,mips,arc#74 < 57> read packet: $qXfer:features:read+;PacketSize=3fff;QStartNoAckMode+#86 < 26> send packet: $QThreadSuffixSupported#e4 < 4> read packet: $#00 < 27> send packet: $QListThreadsInStopReply#21 < 4> read packet: $#00 < 13> send packet: $qHostInfo#9b < 28> read packet: $ptrsize:8;endian:little;#30 < 10> send packet: $vCont?#49 < 4> read packet: $#00 < 27> send packet: $qVAttachOrWaitSupported#38 < 4> read packet: $#00 < 23> send packet: $QEnableErrorStrings#8c < 6> read packet: $OK#9a < 16> send packet: $qProcessInfo#dc < 4> read packet: $#00 < 6> send packet: $qC#b4 < 7> read packet: $QC0#c4 < 16> send packet: $qfThreadInfo#bb < 5> read packet: $l#6c < 5> send packet: $?#3f < 7> read packet: $S02#b5 < 16> send packet: $qProcessInfo#dc < 4> read packet: $#00 < 41> send packet: $qXfer:features:read:target.xml:0,3ffe#af < 4> read packet: $#00 < 18> send packet: $qRegisterInfo0#72 < 4> read packet: $#00 < 16> send packet: $qfThreadInfo#bb < 5> read packet: $l#6c < 7> send packet: $Hg1#e0 < 6> read packet: $OK#9a < 6> send packet: $p0#a0 < 12> read packet: $00000000#80 < 16> send packet: $qProcessInfo#dc < 4> read packet: $#00 < 12> send packet: $qOffsets#4b < 4> read packet: $#00 < 26> send packet: $qStructuredDataPlugins#02 < 4> read packet: $#00 < 13> send packet: $qSymbol::#5b < 6> read packet: $OK#9a < 16> send packet: $qfThreadInfo#bb < 5> read packet: $l#6c < 16> send packet: $qfThreadInfo#bb < 5> read packet: $l#6c < 5> send packet: $g#67 < 860> read packet: $0000000000000000000000000000000000000000000000000000000000000000000000000000000000000000000000000000000000000000000000000000000000000000000000000000000000000000000000000000000000000000000000000000000000000000000000000000000000000000000000000000000000000000000000000000000000000000000000000000000000000000000000000000000000000000000000000000000000000000000000000000000000000000000000000000000000000000000000000000000000000000000000000000000000000000000000000000000000000000000000000000000000000000000000000000000000000000000000000000000000000000000000000000000000000000000000000000000000000000000000000000000000000000000000000000000000000000000000000000000000000000000000000000000000000000000000000000000000000000000000000000000000000000000000000000000000000000000000000000000000000000000000000000000000000000000000000000000000000000000000000000000000000000#80 < 5> send packet: $k#6b < 4> read packet: $#00 < 1> send packet: + history[1] tid=0x0307 < 1> send packet: + < 19> send packet: $QStartNoAckMode#b0 < 1> read packet: + < 6> read packet: $OK#9a < 1> send packet: + < 45> send packet: $qSupported:xmlRegisters=i386,arm,mips,arc#74 < 57> read packet: $qXfer:features:read+;PacketSize=3fff;QStartNoAckMode+#86 < 26> send packet: $QThreadSuffixSupported#e4 < 4> read packet: $#00 < 27> send packet: $QListThreadsInStopReply#21 < 4> read packet: $#00 < 13> send packet: $qHostInfo#9b < 28> read packet: $ptrsize:8;endian:little;#30 < 10> send packet: $vCont?#49 < 4> read packet: $#00 < 27> send packet: $qVAttachOrWaitSupported#38 < 4> read packet: $#00 < 23> send packet: $QEnableErrorStrings#8c < 6> read packet: $OK#9a < 16> send packet: $qProcessInfo#dc < 4> read packet: $#00 < 6> send packet: $qC#b4 < 7> read packet: $QC0#c4 < 16> send packet: $qfThreadInfo#bb < 5> read packet: $l#6c < 5> send packet: $?#3f < 7> read packet: $S02#b5 < 16> send packet: $qProcessInfo#dc < 4> read packet: $#00 < 41> send packet: $qXfer:features:read:target.xml:0,3ffe#af < 4> read packet: $#00 < 18> send packet: $qRegisterInfo0#72 < 4> read packet: $#00 < 16> send packet: $qfThreadInfo#bb < 5> read packet: $l#6c < 7> send packet: $Hg1#e0 < 6> read packet: $OK#9a < 6> send packet: $p0#a0 < 12> read packet: $00000000#80 < 16> send packet: $qProcessInfo#dc < 4> read packet: $#00 < 12> send packet: $qOffsets#4b < 4> read packet: $#00 < 26> send packet: $qStructuredDataPlugins#02 < 4> read packet: $#00 < 13> send packet: $qSymbol::#5b < 6> read packet: $OK#9a < 16> send packet: $qfThreadInfo#bb < 5> read packet: $l#6c < 16> send packet: $qfThreadInfo#bb < 5> read packet: $l#6c < 6> send packet: $pf#d6 < 12> read packet: $00000000#80 < 6> send packet: $pd#d4 < 12> read packet: $00000000#80 < 6> send packet: $p0#a0 < 12> read packet: $00000000#80 < 6> send packet: $p1#a1 < 12> read packet: $00000000#80 < 6> send packet: $p2#a2 < 12> read packet: $00000000#80 < 6> send packet: $p3#a3 < 12> read packet: $00000000#80 < 6> send packet: $p4#a4 < 12> read packet: $00000000#80 < 6> send packet: $p5#a5 < 12> read packet: $00000000#80 < 6> send packet: $p6#a6 < 12> read packet: $00000000#80 < 6> send packet: $p7#a7 < 12> read packet: $00000000#80 < 6> send packet: $p8#a8 < 12> read packet: $00000000#80 < 6> send packet: $p9#a9 < 12> read packet: $00000000#80 < 6> send packet: $pa#d1 < 12> read packet: $00000000#80 < 6> send packet: $pb#d2 < 12> read packet: $00000000#80 < 6> send packet: $pc#d3 < 12> read packet: $00000000#80 < 6> send packet: $pe#d5 < 12> read packet: $00000000#80 < 7> send packet: $p19#da < 12> read packet: $00000000#80 < 5> send packet: $k#6b < 4> read packet: $#00 < 1> send packet: + history[1] tid=0x0307 < 1> send packet: + < 19> send packet: $QStartNoAckMode#b0 < 1> read packet: + < 6> read packet: $OK#9a < 1> send packet: + < 45> send packet: $qSupported:xmlRegisters=i386,arm,mips,arc#74 < 57> read packet: $qXfer:features:read+;PacketSize=3fff;QStartNoAckMode+#86 < 26> send packet: $QThreadSuffixSupported#e4 < 4> read packet: $#00 < 27> send packet: $QListThreadsInStopReply#21 < 4> read packet: $#00 < 13> send packet: $qHostInfo#9b < 28> read packet: $ptrsize:8;endian:little;#30 < 10> send packet: $vCont?#49 < 4> read packet: $#00 < 27> send packet: $qVAttachOrWaitSupported#38 < 4> read packet: $#00 < 23> send packet: $QEnableErrorStrings#8c < 6> read packet: $OK#9a < 16> send packet: $qProcessInfo#dc < 4> read packet: $#00 < 6> send packet: $qC#b4 < 7> read packet: $QC0#c4 < 16> send packet: $qfThreadInfo#bb < 5> read packet: $l#6c < 5> send packet: $?#3f < 7> read packet: $S02#b5 < 16> send packet: $qProcessInfo#dc < 4> read packet: $#00 < 41> send packet: $qXfer:features:read:target.xml:0,3ffe#af < 4> read packet: $#00 < 18> send packet: $qRegisterInfo0#72 < 4> read packet: $#00 < 16> send packet: $qfThreadInfo#bb < 5> read packet: $l#6c < 7> send packet: $Hg1#e0 < 6> read packet: $OK#9a < 6> send packet: $p0#a0 < 4> read packet: $#00 < 16> send packet: $qProcessInfo#dc < 4> read packet: $#00 < 12> send packet: $qOffsets#4b < 4> read packet: $#00 < 26> send packet: $qStructuredDataPlugins#02 < 4> read packet: $#00 < 13> send packet: $qSymbol::#5b < 6> read packet: $OK#9a < 16> send packet: $qfThreadInfo#bb < 5> read packet: $l#6c < 16> send packet: $qfThreadInfo#bb < 5> read packet: $l#6c < 5> send packet: $g#67 < 860> read packet: $0000000000000000000000000000000000000000000000000000000000000000000000000000000000000000000000000000000000000000000000000000000000000000000000000000000000000000000000000000000000000000000000000000000000000000000000000000000000000000000000000000000000000000000000000000000000000000000000000000000000000000000000000000000000000000000000000000000000000000000000000000000000000000000000000000000000000000000000000000000000000000000000000000000000000000000000000000000000000000000000000000000000000000000000000000000000000000000000000000000000000000000000000000000000000000000000000000000000000000000000000000000000000000000000000000000000000000000000000000000000000000000000000000000000000000000000000000000000000000000000000000000000000000000000000000000000000000000000000000000000000000000000000000000000000000000000000000000000000000000000000000000000000000#80 < 861> send packet: $G0000000000000000000000000000000000000000000000000000000000000000000000000000000000000000000000000000000000000000000000000000000000000000000000000000000000000000000000000000000000000000000000000000000000000000000000000000000000000000000000000000000000000000000000000000000000000000000000000000000000000000000000000000000000000000000000000000000000000000000000000000000000000000000000000000000000000000000000000000000000000000000000000000000000000000000000000000000000000000000000000000000000000000000000000000000000000000000000000000000000000000000000000000000000000000000000000000000000000000000000000000000000000000000000000000000000000000000000000000000000000000000000000000000000000000000000000000000000000000000000000000000000000000000000000000000000000000000000000000000000000000000000000000000000000000000000000000000000000000000000000000000000000000#c7 < 6> read packet: $OK#9a < 861> send packet: $G0000000000000000000000000000000000000000000000000000000000000000000000000000000000000000000000000000000000000000000000000000000000000000000000000000000000000000000000000000000000000000000000000000000000000000000000000000000000000000000000000000000000000000000000000000000000000000000000000000000000000000000000000000000000000000000000000000000000000000000000000000000000000000000000000000000000000000000000000000000000000000000000000000000000000000000000000000000000000000000000000000000000000000000000000000000000000000000000000000000000000000000000000000000000000000000000000000000000000000000000000000000000000000000000000000000000000000000000000000000000000000000000000000000000000000000000000000000000000000000000000000000000000000000000000000000000000000000000000000000000000000000000000000000000000000000000000000000000000000000000000000000000000000#c7 < 6> read packet: $OK#9a < 861> send packet: $G0000000000000000000000000000000000000000000000000000000000000000000000000000000000000000000000000000000000000000000000000000000000000000000000000000000000000000000000000000000000000000000000000000000000000000000000000000000000000000000000000000000000000000000000000000000000000000000000000000000000000000000000000000000000000000000000000000000000000000000000000000000000000000000000000000000000000000000000000000000000000000000000000000000000000000000000000000000000000000000000000000000000000000000000000000000000000000000000000000000000000000000000000000000000000000000000000000000000000000000000000000000000000000000000000000000000000000000000000000000000000000000000000000000000000000000000000000000000000000000000000000000000000000000000000000000000000000000000000000000000000000000000000000000000000000000000000000000000000000000000000000000000000000#c7 < 6> read packet: $OK#9a < 861> send packet: $G0000000000000000000000000000000000000000000000000000000000000000000000000000000000000000000000000000000000000000000000000000000000000000000000000000000000000000000000000000000000000000000000000000000000000000000000000000000000000000000000000000000000000000000000000000000000000000000000000000000000000000000000000000000000000000000000000000000000000000000000000000000000000000000000000000000000000000000000000000000000000000000000000000000000000000000000000000000000000000000000000000000000000000000000000000000000000000000000000000000000000000000000000000000000000000000000000000000000000000000000000000000000000000000000000000000000000000000000000000000000000000000000000000000000000000000000000000000000000000000000000000000000000000000000000000000000000000000000000000000000000000000000000000000000000000000000000000000000000000000000000000000000000000#c7 < 6> read packet: $OK#9a < 861> send packet: $G0000000000000000000000000000000000000000000000000000000000000000000000000000000000000000000000000000000000000000000000000000000000000000000000000000000000000000000000000000000000000000000000000000000000000000000000000000000000000000000000000000000000000000000000000000000000000000000000000000000000000000000000000000000000000000000000000000000000000000000000000000000000000000000000000000000000000000000000000000000000000000000000000000000000000000000000000000000000000000000000000000000000000000000000000000000000000000000000000000000000000000000000000000000000000000000000000000000000000000000000000000000000000000000000000000000000000000000000000000000000000000000000000000000000000000000000000000000000000000000000000000000000000000000000000000000000000000000000000000000000000000000000000000000000000000000000000000000000000000000000000000000000000000#c7 < 6> read packet: $OK#9a < 861> send packet: $G0000000000000000000000000000000000000000000000000000000000000000000000000000000000000000000000000000000000000000000000000000000000000000000000000000000000000000000000000000000000000000000000000000000000000000000000000000000000000000000000000000000000000000000000000000000000000000000000000000000000000000000000000000000000000000000000000000000000000000000000000000000000000000000000000000000000000000000000000000000000000000000000000000000000000000000000000000000000000000000000000000000000000000000000000000000000000000000000000000000000000000000000000000000000000000000000000000000000000000000000000000000000000000000000000000000000000000000000000000000000000000000000000000000000000000000000000000000000000000000000000000000000000000000000000000000000000000000000000000000000000000000000000000000000000000000000000000000000000000000000000000000000000000#c7 < 6> read packet: $OK#9a < 861> send packet: $G0000000000000000000000000000000000000000000000000000000000000000000000000000000000000000000000000000000000000000000000000000000000000000000000000000000000000000000000000000000000000000000000000000000000000000000000000000000000000000000000000000000000000000000000000000000000000000000000000000000000000000000000000000000000000000000000000000000000000000000000000000000000000000000000000000000000000000000000000000000000000000000000000000000000000000000000000000000000000000000000000000000000000000000000000000000000000000000000000000000000000000000000000000000000000000000000000000000000000000000000000000000000000000000000000000000000000000000000000000000000000000000000000000000000000000000000000000000000000000000000000000000000000000000000000000000000000000000000000000000000000000000000000000000000000000000000000000000000000000000000000000000000000000#c7 < 6> read packet: $OK#9a < 861> send packet: $G0000000000000000000000000000000000000000000000000000000000000000000000000000000000000000000000000000000000000000000000000000000000000000000000000000000000000000000000000000000000000000000000000000000000000000000000000000000000000000000000000000000000000000000000000000000000000000000000000000000000000000000000000000000000000000000000000000000000000000000000000000000000000000000000000000000000000000000000000000000000000000000000000000000000000000000000000000000000000000000000000000000000000000000000000000000000000000000000000000000000000000000000000000000000000000000000000000000000000000000000000000000000000000000000000000000000000000000000000000000000000000000000000000000000000000000000000000000000000000000000000000000000000000000000000000000000000000000000000000000000000000000000000000000000000000000000000000000000000000000000000000000000000000#c7 < 6> read packet: $OK#9a < 861> send packet: $G0000000000000000000000000000000000000000000000000000000000000000000000000000000000000000000000000000000000000000000000000000000000000000000000000000000000000000000000000000000000000000000000000000000000000000000000000000000000000000000000000000000000000000000000000000000000000000000000000000000000000000000000000000000000000000000000000000000000000000000000000000000000000000000000000000000000000000000000000000000000000000000000000000000000000000000000000000000000000000000000000000000000000000000000000000000000000000000000000000000000000000000000000000000000000000000000000000000000000000000000000000000000000000000000000000000000000000000000000000000000000000000000000000000000000000000000000000000000000000000000000000000000000000000000000000000000000000000000000000000000000000000000000000000000000000000000000000000000000000000000000000000000000000#c7 < 6> read packet: $OK#9a < 861> send packet: $G0000000000000000000000000000000000000000000000000000000000000000000000000000000000000000000000000000000000000000000000000000000000000000000000000000000000000000000000000000000000000000000000000000000000000000000000000000000000000000000000000000000000000000000000000000000000000000000000000000000000000000000000000000000000000000000000000000000000000000000000000000000000000000000000000000000000000000000000000000000000000000000000000000000000000000000000000000000000000000000000000000000000000000000000000000000000000000000000000000000000000000000000000000000000000000000000000000000000000000000000000000000000000000000000000000000000000000000000000000000000000000000000000000000000000000000000000000000000000000000000000000000000000000000000000000000000000000000000000000000000000000000000000000000000000000000000000000000000000000000000000000000000000000#c7 < 6> read packet: $OK#9a < 861> send packet: $G0000000000000000000000000000000000000000000000000000000000000000000000000000000000000000000000000000000000000000000000000000000000000000000000000000000000000000000000000000000000000000000000000000000000000000000000000000000000000000000000000000000000000000000000000000000000000000000000000000000000000000000000000000000000000000000000000000000000000000000000000000000000000000000000000000000000000000000000000000000000000000000000000000000000000000000000000000000000000000000000000000000000000000000000000000000000000000000000000000000000000000000000000000000000000000000000000000000000000000000000000000000000000000000000000000000000000000000000000000000000000000000000000000000000000000000000000000000000000000000000000000000000000000000000000000000000000000000000000000000000000000000000000000000000000000000000000000000000000000000000000000000000000000#c7 < 6> read packet: $OK#9a < 861> send packet: $G0000000000000000000000000000000000000000000000000000000000000000000000000000000000000000000000000000000000000000000000000000000000000000000000000000000000000000000000000000000000000000000000000000000000000000000000000000000000000000000000000000000000000000000000000000000000000000000000000000000000000000000000000000000000000000000000000000000000000000000000000000000000000000000000000000000000000000000000000000000000000000000000000000000000000000000000000000000000000000000000000000000000000000000000000000000000000000000000000000000000000000000000000000000000000000000000000000000000000000000000000000000000000000000000000000000000000000000000000000000000000000000000000000000000000000000000000000000000000000000000000000000000000000000000000000000000000000000000000000000000000000000000000000000000000000000000000000000000000000000000000000000000000000#c7 < 6> read packet: $OK#9a < 861> send packet: $G0000000000000000000000000000000000000000000000000000000000000000000000000000000000000000000000000000000000000000000000000000000000000000000000000000000000000000000000000000000000000000000000000000000000000000000000000000000000000000000000000000000000000000000000000000000000000000000000000000000000000000000000000000000000000000000000000000000000000000000000000000000000000000000000000000000000000000000000000000000000000000000000000000000000000000000000000000000000000000000000000000000000000000000000000000000000000000000000000000000000000000000000000000000000000000000000000000000000000000000000000000000000000000000000000000000000000000000000000000000000000000000000000000000000000000000000000000000000000000000000000000000000000000000000000000000000000000000000000000000000000000000000000000000000000000000000000000000000000000000000000000000000000000#c7 < 6> read packet: $OK#9a < 861> send packet: $G0000000000000000000000000000000000000000000000000000000000000000000000000000000000000000000000000000000000000000000000000000000000000000000000000000000000000000000000000000000000000000000000000000000000000000000000000000000000000000000000000000000000000000000000000000000000000000000000000000000000000000000000000000000000000000000000000000000000000000000000000000000000000000000000000000000000000000000000000000000000000000000000000000000000000000000000000000000000000000000000000000000000000000000000000000000000000000000000000000000000000000000000000000000000000000000000000000000000000000000000000000000000000000000000000000000000000000000000000000000000000000000000000000000000000000000000000000000000000000000000000000000000000000000000000000000000000000000000000000000000000000000000000000000000000000000000000000000000000000000000000000000000000000#c7 < 6> read packet: $OK#9a < 861> send packet: $G0000000000000000000000000000000000000000000000000000000000000000000000000000000000000000000000000000000000000000000000000000000000000000000000000000000000000000000000000000000000000000000000000000000000000000000000000000000000000000000000000000000000000000000000000000000000000000000000000000000000000000000000000000000000000000000000000000000000000000000000000000000000000000000000000000000000000000000000000000000000000000000000000000000000000000000000000000000000000000000000000000000000000000000000000000000000000000000000000000000000000000000000000000000000000000000000000000000000000000000000000000000000000000000000000000000000000000000000000000000000000000000000000000000000000000000000000000000000000000000000000000000000000000000000000000000000000000000000000000000000000000000000000000000000000000000000000000000000000000000000000000000000000000#c7 < 6> read packet: $OK#9a < 861> send packet: $G0000000000000000000000000000000000000000000000000000000000000000000000000000000000000000000000000000000000000000000000000000000000000000000000000000000000000000000000000000000000000000000000000000000000000000000000000000000000000000000000000000000000000000000000000000000000000000000000000000000000000000000000000000000000000000000000000000000000000000000000000000000000000000000000000000000000000000000000000000000000000000000000000000000000000000000000000000000000000000000000000000000000000000000000000000000000000000000000000000000000000000000000000000000000000000000000000000000000000000000000000000000000000000000000000000000000000000000000000000000000000000000000000000000000000000000000000000000000000000000000000000000000000000000000000000000000000000000000000000000000000000000000000000000000000000000000000000000000000000000000000000000000000000#c7 < 6> read packet: $OK#9a < 861> send packet: $G0000000000000000000000000000000000000000000000000000000000000000000000000000000000000000000000000000000000000000000000000000000000000000000000000000000000000000000000000000000000000000000000000000000000000000000000000000000000000000000000000000000000000000000000000000000000000000000000000000000000000000000000000000000000000000000000000000000000000000000000000000000000000000000000000000000000000000000000000000000000000000000000000000000000000000000000000000000000000000000000000000000000000000000000000000000000000000000000000000000000000000000000000000000000000000000000000000000000000000000000000000000000000000000000000000000000000000000000000000000000000000000000000000000000000000000000000000000000000000000000000000000000000000000000000000000000000000000000000000000000000000000000000000000000000000000000000000000000000000000000000000000000000000#c7 < 6> read packet: $OK#9a < 5> send packet: $k#6b < 4> read packet: $#00 < 1> send packet: + history[1] tid=0x0307 < 1> send packet: + < 19> send packet: $QStartNoAckMode#b0 < 1> read packet: + < 6> read packet: $OK#9a < 1> send packet: + < 45> send packet: $qSupported:xmlRegisters=i386,arm,mips,arc#74 < 57> read packet: $qXfer:features:read+;PacketSize=3fff;QStartNoAckMode+#86 < 26> send packet: $QThreadSuffixSupported#e4 < 4> read packet: $#00 < 27> send packet: $QListThreadsInStopReply#21 < 4> read packet: $#00 < 13> send packet: $qHostInfo#9b < 28> read packet: $ptrsize:8;endian:little;#30 < 10> send packet: $vCont?#49 < 4> read packet: $#00 < 27> send packet: $qVAttachOrWaitSupported#38 < 4> read packet: $#00 < 23> send packet: $QEnableErrorStrings#8c < 6> read packet: $OK#9a < 16> send packet: $qProcessInfo#dc < 4> read packet: $#00 < 6> send packet: $qC#b4 < 7> read packet: $QC0#c4 < 16> send packet: $qfThreadInfo#bb < 5> read packet: $l#6c < 5> send packet: $?#3f < 7> read packet: $S02#b5 < 16> send packet: $qProcessInfo#dc < 4> read packet: $#00 < 41> send packet: $qXfer:features:read:target.xml:0,3ffe#af < 4> read packet: $#00 < 18> send packet: $qRegisterInfo0#72 < 4> read packet: $#00 < 16> send packet: $qfThreadInfo#bb < 5> read packet: $l#6c < 7> send packet: $Hg1#e0 < 6> read packet: $OK#9a < 6> send packet: $p0#a0 < 12> read packet: $00000000#80 < 16> send packet: $qProcessInfo#dc < 4> read packet: $#00 < 12> send packet: $qOffsets#4b < 4> read packet: $#00 < 26> send packet: $qStructuredDataPlugins#02 < 4> read packet: $#00 < 13> send packet: $qSymbol::#5b < 6> read packet: $OK#9a < 16> send packet: $qfThreadInfo#bb < 5> read packet: $l#6c < 16> send packet: $qfThreadInfo#bb < 5> read packet: $l#6c < 6> send packet: $pf#d6 < 12> read packet: $00000000#80 < 6> send packet: $pd#d4 < 12> read packet: $00000000#80 < 15> send packet: $P0=00000000#3d < 6> read packet: $OK#9a < 15> send packet: $P1=00000000#3e < 6> read packet: $OK#9a < 15> send packet: $P2=00000000#3f < 6> read packet: $OK#9a < 15> send packet: $P3=00000000#40 < 6> read packet: $OK#9a < 15> send packet: $P4=00000000#41 < 6> read packet: $OK#9a < 15> send packet: $P5=00000000#42 < 6> read packet: $OK#9a < 15> send packet: $P6=00000000#43 < 6> read packet: $OK#9a < 15> send packet: $P7=00000000#44 < 6> read packet: $OK#9a < 15> send packet: $P8=00000000#45 < 6> read packet: $OK#9a < 15> send packet: $P9=00000000#46 < 6> read packet: $OK#9a < 15> send packet: $Pa=00000000#6e < 6> read packet: $OK#9a < 15> send packet: $Pb=00000000#6f < 6> read packet: $OK#9a < 15> send packet: $Pc=00000000#70 < 6> read packet: $OK#9a < 15> send packet: $Pd=00000000#71 < 6> read packet: $OK#9a < 15> send packet: $Pe=00000000#72 < 6> read packet: $OK#9a < 15> send packet: $Pf=00000000#73 < 6> read packet: $OK#9a < 16> send packet: $P19=00000000#77 < 6> read packet: $OK#9a < 5> send packet: $k#6b < 4> read packet: $#00 LLDB library dir: /Users/buildslave/jenkins/workspace/lldb-cmake/lldb-build/bin LLDB import library dir: /Users/buildslave/jenkins/workspace/lldb-cmake/lldb-build/./lib libstdcxx tests will not be run because: Don't know how to build with libstdcxx on macosx Skipping following debug info categories: ['dwo']

Hide Details

-- Command Output (stderr): --

Hide Details

Session logs for test failures/errors/unexpected successes will go into directory '/Users/buildslave/jenkins/workspace/lldb-cmake/test/logs' Change dir to: /Users/buildslave/jenkins/workspace/lldb-cmake/llvm-project/lldb/test/API/functionalities/gdb_remote_client runCmd: settings clear -all output:

Hide Details

runCmd: settings set symbols.enable-external-lookup false output:

Hide Details

runCmd: settings set target.inherit-tcc true output:

Hide Details

runCmd: settings set target.auto-apply-fixits false output:

Hide Details

runCmd: settings set plugin.process.gdb-remote.packet-timeout 60 output:

Hide Details

runCmd: settings set symbols.clang-modules-cache-path "/Users/buildslave/jenkins/workspace/lldb-cmake/lldb-build/lldb-test-build.noindex/module-cache-lldb/lldb-api" output:

Hide Details

runCmd: settings set use-color false output:

Hide Details

runCmd: setting set target.prefer-dynamic-value no-dynamic-values output:

Hide Details

<bound method SBProcess.Kill of <lldb.SBProcess; proxy of <Swig Object of type 'lldb::SBProcess *' at 0x100f2c720> >>: success

Hide Details

PASS: LLDB (/Users/buildslave/jenkins/workspace/lldb-cmake/lldb-build/bin/clang-x86_64) :: test_attach_fail (TestGDBRemoteClient.TestGDBRemoteClient) runCmd: settings clear -all output:

Hide Details

runCmd: settings set symbols.enable-external-lookup false output:

Hide Details

runCmd: settings set target.inherit-tcc true output:

Hide Details

runCmd: settings set target.auto-apply-fixits false output:

Hide Details

runCmd: settings set plugin.process.gdb-remote.packet-timeout 60 output:

Hide Details

runCmd: settings set symbols.clang-modules-cache-path "/Users/buildslave/jenkins/workspace/lldb-cmake/lldb-build/lldb-test-build.noindex/module-cache-lldb/lldb-api" output:

Hide Details

runCmd: settings set use-color false output:

Hide Details

runCmd: setting set target.prefer-dynamic-value no-dynamic-values output:

Hide Details

FAIL: LLDB (/Users/buildslave/jenkins/workspace/lldb-cmake/lldb-build/bin/clang-x86_64) :: test_connect (TestGDBRemoteClient.TestGDBRemoteClient) <bound method SBProcess.Kill of <lldb.SBProcess; proxy of <Swig Object of type 'lldb::SBProcess *' at 0x100dae630> >>: success

Hide Details

runCmd: settings clear -all output:

Hide Details

runCmd: settings set symbols.enable-external-lookup false output:

Hide Details

runCmd: settings set target.inherit-tcc true output:

Hide Details

runCmd: settings set target.auto-apply-fixits false output:

Hide Details

runCmd: settings set plugin.process.gdb-remote.packet-timeout 60 output:

Hide Details

runCmd: settings set symbols.clang-modules-cache-path "/Users/buildslave/jenkins/workspace/lldb-cmake/lldb-build/lldb-test-build.noindex/module-cache-lldb/lldb-api" output:

Hide Details

runCmd: settings set use-color false output:

Hide Details

runCmd: setting set target.prefer-dynamic-value no-dynamic-values output:

Hide Details

runCmd: log enable gdb-remote packets output:

Hide Details

<bound method SBProcess.Kill of <lldb.SBProcess; proxy of <Swig Object of type 'lldb::SBProcess *' at 0x100f2c720> >>: success

Hide Details

PASS: LLDB (/Users/buildslave/jenkins/workspace/lldb-cmake/lldb-build/bin/clang-x86_64) :: test_launch_fail (TestGDBRemoteClient.TestGDBRemoteClient) runCmd: settings clear -all output:

Hide Details

runCmd: settings set symbols.enable-external-lookup false output:

Hide Details

runCmd: settings set target.inherit-tcc true output:

Hide Details

runCmd: settings set target.auto-apply-fixits false output:

Hide Details

runCmd: settings set plugin.process.gdb-remote.packet-timeout 60 output:

Hide Details

runCmd: settings set symbols.clang-modules-cache-path "/Users/buildslave/jenkins/workspace/lldb-cmake/lldb-build/lldb-test-build.noindex/module-cache-lldb/lldb-api" output:

Hide Details

runCmd: settings set use-color false output:

Hide Details

runCmd: setting set target.prefer-dynamic-value no-dynamic-values output:

Hide Details

Adding tearDown hook: self.addTearDownHook(lambda: self.runCmd("settings set plugin.process.gdb-remote.use-g-packet-for-reading false"))

Hide Details

Hide Details

<bound method SBProcess.Kill of <lldb.SBProcess; proxy of <Swig Object of type 'lldb::SBProcess *' at 0x100dae600> >>: success

Hide Details

Executing tearDown hook: self.addTearDownHook(lambda: self.runCmd("settings set plugin.process.gdb-remote.use-g-packet-for-reading false"))

Hide Details

Hide Details

runCmd: settings set plugin.process.gdb-remote.use-g-packet-for-reading false output:

Hide Details

PASS: LLDB (/Users/buildslave/jenkins/workspace/lldb-cmake/lldb-build/bin/clang-x86_64) :: test_read_registers_using_g_packets (TestGDBRemoteClient.TestGDBRemoteClient) runCmd: settings clear -all output:

Hide Details

runCmd: settings set symbols.enable-external-lookup false output:

Hide Details

runCmd: settings set target.inherit-tcc true output:

Hide Details

runCmd: settings set target.auto-apply-fixits false output:

Hide Details

runCmd: settings set plugin.process.gdb-remote.packet-timeout 60 output:

Hide Details

runCmd: settings set symbols.clang-modules-cache-path "/Users/buildslave/jenkins/workspace/lldb-cmake/lldb-build/lldb-test-build.noindex/module-cache-lldb/lldb-api" output:

Hide Details

runCmd: settings set use-color false output:

Hide Details

runCmd: setting set target.prefer-dynamic-value no-dynamic-values output:

Hide Details

<bound method SBProcess.Kill of <lldb.SBProcess; proxy of <Swig Object of type 'lldb::SBProcess *' at 0x100f2c720> >>: success

Hide Details

PASS: LLDB (/Users/buildslave/jenkins/workspace/lldb-cmake/lldb-build/bin/clang-x86_64) :: test_read_registers_using_p_packets (TestGDBRemoteClient.TestGDBRemoteClient) runCmd: settings clear -all output:

Hide Details

runCmd: settings set symbols.enable-external-lookup false output:

Hide Details

runCmd: settings set target.inherit-tcc true output:

Hide Details

runCmd: settings set target.auto-apply-fixits false output:

Hide Details

runCmd: settings set plugin.process.gdb-remote.packet-timeout 60 output:

Hide Details

runCmd: settings set symbols.clang-modules-cache-path "/Users/buildslave/jenkins/workspace/lldb-cmake/lldb-build/lldb-test-build.noindex/module-cache-lldb/lldb-api" output:

Hide Details

runCmd: settings set use-color false output:

Hide Details

runCmd: setting set target.prefer-dynamic-value no-dynamic-values output:

Hide Details

<bound method SBProcess.Kill of <lldb.SBProcess; proxy of <Swig Object of type 'lldb::SBProcess *' at 0x100dae600> >>: success

Hide Details

PASS: LLDB (/Users/buildslave/jenkins/workspace/lldb-cmake/lldb-build/bin/clang-x86_64) :: test_write_registers_using_G_packets (TestGDBRemoteClient.TestGDBRemoteClient) runCmd: settings clear -all output:

Hide Details

runCmd: settings set symbols.enable-external-lookup false output:

Hide Details

runCmd: settings set target.inherit-tcc true output:

Hide Details

runCmd: settings set target.auto-apply-fixits false output:

Hide Details

runCmd: settings set plugin.process.gdb-remote.packet-timeout 60 output:

Hide Details

runCmd: settings set symbols.clang-modules-cache-path "/Users/buildslave/jenkins/workspace/lldb-cmake/lldb-build/lldb-test-build.noindex/module-cache-lldb/lldb-api" output:

Hide Details

runCmd: settings set use-color false output:

Hide Details

runCmd: setting set target.prefer-dynamic-value no-dynamic-values output:

Hide Details

<bound method SBProcess.Kill of <lldb.SBProcess; proxy of <Swig Object of type 'lldb::SBProcess *' at 0x100f2c720> >>: success

Hide Details

PASS: LLDB (/Users/buildslave/jenkins/workspace/lldb-cmake/lldb-build/bin/clang-x86_64) :: test_write_registers_using_P_packets (TestGDBRemoteClient.TestGDBRemoteClient) Restore dir to: /Users/buildslave/jenkins/workspace/lldb-cmake/lldb-build/tools/lldb/test ====================================================================== FAIL: test_connect (TestGDBRemoteClient.TestGDBRemoteClient) Test connecting to a remote gdb server ---------------------------------------------------------------------- Traceback (most recent call last): File "/Users/buildslave/jenkins/workspace/lldb-cmake/llvm-project/lldb/packages/Python/lldbsuite/test/decorators.py", line 135, in wrapper return func(*args, **kwargs) File "/Users/buildslave/jenkins/workspace/lldb-cmake/llvm-project/lldb/test/API/functionalities/gdb_remote_client/TestGDBRemoteClient.py", line 18, in test_connect process = self.connect(target) File "/Users/buildslave/jenkins/workspace/lldb-cmake/llvm-project/lldb/test/API/functionalities/gdb_remote_client/gdbclientutils.py", line 519, in connect self.assertTrue(error.Success(), error.description) AssertionError: False is not True : failed to get reply to handshake packet Config=x86_64-/Users/buildslave/jenkins/workspace/lldb-cmake/lldb-build/bin/clang ---------------------------------------------------------------------- Ran 7 tests in 103.848s

Hide Details

RESULT: FAILED (6 passes, 1 failures, 0 errors, 0 skipped, 0 expected failures, 0 unexpected successes)

Hide Details

--

Hide Details

******************** PASS: lldb-api :: functionalities/object-file/TestImageListMultiArchitecture.py (1288 of 2119) PASS: lldb-unit :: Utility/./UtilityTests/BinaryStreamTest.PutSLEB128FourBytes (1289 of 2119) PASS: lldb-api :: functionalities/data-formatter/data-formatter-objc/TestDataFormatterObjCNSData.py (1290 of 2119) PASS: lldb-api :: functionalities/tail_call_frames/disambiguate_call_site/TestDisambiguateCallSite.py (1291 of 2119) UNSUPPORTED: lldb-shell :: SymbolFile/PDB/variables.test (1292 of 2119) PASS: lldb-unit :: UnwindAssembly/x86/./UnwindAssemblyx86Tests/Testx86AssemblyInspectionEngine.Test64bitFramelessSmallStackFrame (1293 of 2119) PASS: lldb-unit :: Utility/./UtilityTests/StringListTest.LongestCommonPrefix (1294 of 2119) PASS: lldb-api :: functionalities/postmortem/mach-core/TestMachCore.py (1295 of 2119) PASS: lldb-unit :: Host/./HostTests/FileSystemTest.GetPermissions (1296 of 2119) PASS: lldb-api :: functionalities/thread/concurrent_events/TestConcurrentTwoBreakpointThreads.py (1297 of 2119) PASS: lldb-api :: functionalities/abbreviation/TestAbbreviations.py (1298 of 2119) PASS: lldb-api :: commands/expression/entry-bp/TestExprEntryBP.py (1299 of 2119) PASS: lldb-api :: functionalities/avoids-fd-leak/TestFdLeak.py (1300 of 2119) PASS: lldb-unit :: Utility/./UtilityTests/StringExtractorTest.GetNameColonValueNoSemicolon (1301 of 2119) PASS: lldb-unit :: Utility/./UtilityTests/StreamTest.PutHex8 (1302 of 2119) PASS: lldb-api :: functionalities/thread/ignore_suspended/TestIgnoreSuspendedThread.py (1303 of 2119) PASS: lldb-api :: functionalities/data-formatter/ptr_ref_typedef/TestPtrRef2Typedef.py (1304 of 2119) PASS: lldb-api :: commands/disassemble/basic/TestDisassembleBreakpoint.py (1305 of 2119) PASS: lldb-unit :: Expression/./ExpressionTests/DiagnosticManagerTest.GetStringMultiline (1306 of 2119) PASS: lldb-unit :: Utility/./UtilityTests/UriParserTest.MinimalPath (1307 of 2119) PASS: lldb-api :: commands/expression/context-object/TestContextObject.py (1308 of 2119) PASS: lldb-api :: commands/expression/import-std-module/vector-dbg-info-content/TestDbgInfoContentVectorFromStdModule.py (1309 of 2119) PASS: lldb-api :: lang/cpp/function-qualifiers/TestCppFunctionQualifiers.py (1310 of 2119) UNSUPPORTED: lldb-api :: functionalities/thread/create_during_step/TestCreateDuringStep.py (1311 of 2119) PASS: lldb-unit :: Utility/./UtilityTests/StreamTest.AddressEmptyPrefix (1312 of 2119) PASS: lldb-unit :: Utility/./UtilityTests/StreamTest.PutCharWhitespace (1313 of 2119) PASS: lldb-unit :: UnwindAssembly/x86/./UnwindAssemblyx86Tests/Testx86AssemblyInspectionEngine.Test32BitOnlyInstruction (1314 of 2119) PASS: lldb-shell :: Settings/TestStopCommandSourceOnError.test (1315 of 2119) PASS: lldb-api :: lang/cpp/diamond/TestDiamond.py (1316 of 2119) PASS: lldb-unit :: SymbolFile/NativePDB/./SymbolFileNativePDBTests/PDBFPOProgramToDWARFExpressionTests.InvalidAssignmentSingle (1317 of 2119) UNSUPPORTED: lldb-shell :: SymbolFile/NativePDB/ast-functions-msvc.cpp (1318 of 2119) PASS: lldb-shell :: SymbolFile/NativePDB/nested-types.cpp (1319 of 2119) PASS: lldb-unit :: Utility/./UtilityTests/StreamTeeTest.Constructor2Streams (1320 of 2119) PASS: lldb-unit :: Symbol/./SymbolTests/DWARFCallFrameInfoTest.Basic_dwarf3 (1321 of 2119) UNSUPPORTED: lldb-api :: commands/watchpoints/variable_out_of_scope/TestWatchedVarHitWhenInScope.py (1322 of 2119) PASS: lldb-api :: macosx/universal/TestUniversal.py (1323 of 2119) PASS: lldb-api :: python_api/function_symbol/TestDisasmAPI.py (1324 of 2119) PASS: lldb-api :: functionalities/data-formatter/data-formatter-stl/libcxx/list/TestDataFormatterLibcxxList.py (1325 of 2119) PASS: lldb-unit :: Utility/./UtilityTests/ScalarTest.TruncOrExtendTo (1326 of 2119) PASS: lldb-unit :: Utility/./UtilityTests/StringExtractorTest.DecodeHexU8_InvalidHex2 (1327 of 2119) XFAIL: lldb-shell :: Register/x86-64-write.test (1328 of 2119) UNSUPPORTED: lldb-api :: functionalities/darwin_log/basic/TestDarwinLogBasic.py (1329 of 2119) UNSUPPORTED: lldb-shell :: Register/x86-64-xmm16-write.test (1330 of 2119) PASS: lldb-unit :: UnwindAssembly/x86/./UnwindAssemblyx86Tests/Testx86AssemblyInspectionEngine.TestStackRealign8BitDisp_i386 (1331 of 2119) PASS: lldb-shell :: Commands/command-source.test (1332 of 2119) PASS: lldb-api :: functionalities/data-formatter/data-formatter-globals/TestDataFormatterGlobals.py (1333 of 2119) UNSUPPORTED: lldb-api :: commands/register/register/intel_xtended_registers/mpx_bound_violation/TestBoundViolation.py (1334 of 2119) PASS: lldb-api :: sample_test/TestSampleTest.py (1335 of 2119) PASS: lldb-unit :: ScriptInterpreter/Python/./ScriptInterpreterPythonTests/PythonDataObjectsTest.TestPythonListToStructuredList (1336 of 2119) PASS: lldb-unit :: Utility/./UtilityTests/StringListTest.AppendListCStringArrayEmpty (1337 of 2119) PASS: lldb-shell :: Driver/TestRepl.test (1338 of 2119) PASS: lldb-shell :: SymbolFile/DWARF/dwarf5_locations.s (1339 of 2119) PASS: lldb-api :: functionalities/mtc/simple/TestMTCSimple.py (1340 of 2119) PASS: lldb-api :: tools/lldb-server/TestLldbGdbServer.py (1341 of 2119) PASS: lldb-unit :: SymbolFile/NativePDB/./SymbolFileNativePDBTests/PDBFPOProgramToDWARFExpressionTests.InvalidOpBinary (1342 of 2119) PASS: lldb-unit :: Utility/./UtilityTests/LogChannelEnabledTest.LogVerboseThread (1343 of 2119) UNSUPPORTED: lldb-shell :: Register/aarch64-fp-read.test (1344 of 2119) PASS: lldb-unit :: ScriptInterpreter/Python/./ScriptInterpreterPythonTests/PythonDataObjectsTest.TestPythonFile (1345 of 2119) UNSUPPORTED: lldb-shell :: ScriptInterpreter/Lua/bindings.test (1346 of 2119) PASS: lldb-api :: lang/cpp/gmodules-templates/TestGModules.py (1347 of 2119) UNSUPPORTED: lldb-api :: linux/add-symbols/TestTargetSymbolsAddCommand.py (1348 of 2119) PASS: lldb-shell :: Reproducer/TestDSYM.test (1349 of 2119) PASS: lldb-unit :: Utility/./UtilityTests/StringExtractorTest.GetHexBytesAvail_Partial (1350 of 2119) PASS: lldb-unit :: Utility/./UtilityTests/LogChannelTest.List (1351 of 2119) PASS: lldb-api :: lang/cpp/alignas_base_class/TestAlignAsBaseClass.py (1352 of 2119) PASS: lldb-unit :: Utility/./UtilityTests/RangeTest.Slide (1353 of 2119) PASS: lldb-api :: commands/expression/import-std-module/shared_ptr/TestSharedPtrFromStdModule.py (1354 of 2119) PASS: lldb-shell :: SymbolFile/DWARF/inline-function-address.ll (1355 of 2119) PASS: lldb-shell :: SymbolFile/DWARF/module-ownership.mm (1356 of 2119) PASS: lldb-api :: lang/objc/direct-dispatch-step/TestObjCDirectDispatchStepping.py (1357 of 2119) PASS: lldb-unit :: Utility/./UtilityTests/ScalarTest.RightShiftOperator (1358 of 2119) PASS: lldb-api :: functionalities/breakpoint/breakpoint_options/TestBreakpointOptions.py (1359 of 2119) PASS: lldb-api :: types/TestShortType.py (1360 of 2119) PASS: lldb-unit :: Utility/./UtilityTests/ScalarTest.Getters (1361 of 2119) PASS: lldb-unit :: Utility/./UtilityTests/UserIDResolver.GetUserName (1362 of 2119) PASS: lldb-unit :: Symbol/./SymbolTests/TestClangASTImporter.ImportInvalidType (1363 of 2119) PASS: lldb-unit :: Editline/./EditlineTests/EditlineTestFixture.EditlineReceivesSingleLineText (1364 of 2119) PASS: lldb-api :: lang/cpp/extern_c/TestExternCSymbols.py (1365 of 2119) PASS: lldb-unit :: Utility/./UtilityTests/Predicate.WaitForValueEqualTo (1366 of 2119) PASS: lldb-unit :: Process/minidump/./LLDBMinidumpTests/MinidumpParserTest.FindMemoryRangeWithFullMemoryMinidump (1367 of 2119) PASS: lldb-shell :: Breakpoint/split-dwarf-5-addrbase.test (1368 of 2119) PASS: lldb-api :: commands/expression/rdar44436068/Test128BitsInteger.py (1369 of 2119) PASS: lldb-unit :: Utility/./UtilityTests/RecordReplayTest.InstrumentedFooSameThis (1370 of 2119) PASS: lldb-shell :: Settings/TestFrameFormatMangling.test (1371 of 2119) UNSUPPORTED: lldb-shell :: Watchpoint/netbsd-nouserdbregs.test (1372 of 2119) PASS: lldb-shell :: ObjectFile/ELF/basic-info.yaml (1373 of 2119) PASS: lldb-api :: python_api/process/read-mem-cstring/TestReadMemCString.py (1374 of 2119) PASS: lldb-unit :: debugserver/./debugserverTests/RNBSocket.LoopBackConnectIPv4 (1375 of 2119) PASS: lldb-unit :: Utility/./UtilityTests/ConstStringTest.YAML (1376 of 2119) PASS: lldb-api :: functionalities/thread/step_until/TestStepUntil.py (1377 of 2119) PASS: lldb-unit :: Utility/./UtilityTests/DataExtractorTest.UncommonAddressSize (1378 of 2119) PASS: lldb-api :: functionalities/signal/handle-abrt/TestHandleAbort.py (1379 of 2119) PASS: lldb-api :: functionalities/unwind/noreturn/TestNoreturnUnwind.py (1380 of 2119) PASS: lldb-api :: python_api/sbvalue_persist/TestSBValuePersist.py (1381 of 2119) PASS: lldb-api :: functionalities/thread/crash_during_step/TestCrashDuringStep.py (1382 of 2119) PASS: lldb-unit :: Utility/./UtilityTests/CompletionRequest.TryCompleteCurrentArgGood (1383 of 2119) PASS: lldb-shell :: ObjectFile/PECOFF/section-types.yaml (1384 of 2119) PASS: lldb-unit :: Utility/./UtilityTests/StreamTest.ShiftOperatorChars (1385 of 2119) PASS: lldb-unit :: Host/./HostTests/File.GetWaitableHandleFileno (1386 of 2119) UNSUPPORTED: lldb-api :: lang/c/unicode/TestUnicodeSymbols.py (1387 of 2119) PASS: lldb-api :: commands/target/modules/search-paths/insert/TestTargetModulesSearchpathsInsert.py (1388 of 2119) PASS: lldb-unit :: Utility/./UtilityTests/BinaryStreamTest.PutULEB128FiveBytes (1389 of 2119) PASS: lldb-api :: lang/cpp/accelerator-table/TestCPPAccelerator.py (1390 of 2119) PASS: lldb-unit :: Expression/./ExpressionTests/DiagnosticManagerTest.AddDiagnostic (1391 of 2119) PASS: lldb-unit :: Utility/./UtilityTests/ProcessInstanceInfo.Dump (1392 of 2119) PASS: lldb-api :: commands/apropos/basic/TestApropos.py (1393 of 2119) PASS: lldb-shell :: ObjectFile/PECOFF/basic-info-arm.yaml (1394 of 2119) PASS: lldb-unit :: Utility/./UtilityTests/ConstStringTest.NullAndEmptyStates (1395 of 2119) PASS: lldb-unit :: Utility/./UtilityTests/FileSpecTest.EqualDotsPosixRoot (1396 of 2119) PASS: lldb-unit :: ObjectFile/Breakpad/./ObjectFileBreakpadTests/LineRecord.parse (1397 of 2119) PASS: lldb-shell :: Unwind/trap_frame_sym_ctx.test (1398 of 2119) PASS: lldb-api :: commands/expression/options/TestExprOptions.py (1399 of 2119) PASS: lldb-api :: functionalities/thread/concurrent_events/TestConcurrentTwoBreakpointsOneWatchpoint.py (1400 of 2119) PASS: lldb-unit :: Utility/./UtilityTests/AnsiTerminal.Twice (1401 of 2119) PASS: lldb-unit :: Process/minidump/./LLDBMinidumpTests/MinidumpParserTest.GetMemory (1402 of 2119) PASS: lldb-api :: lang/c/set_values/TestSetValues.py (1403 of 2119) PASS: lldb-unit :: Core/./LLDBCoreTests/ModuleSpecTest.TestELFFile (1404 of 2119) PASS: lldb-unit :: Process/gdb-remote/./ProcessGdbRemoteTests/GDBRemoteCommunicationClientTest.ReadRegister (1405 of 2119) PASS: lldb-unit :: Utility/./UtilityTests/BinaryStreamTest.PutULEB128Zero (1406 of 2119) UNSUPPORTED: lldb-shell :: Register/x86-64-zmm-read.test (1407 of 2119) PASS: lldb-shell :: Host/TestCustomShell.test (1408 of 2119) PASS: lldb-unit :: Utility/./UtilityTests/ArgsTest.TestArgv (1409 of 2119) PASS: lldb-unit :: Utility/./UtilityTests/StreamTest.PutSLEB128 (1410 of 2119) PASS: lldb-api :: lang/objc/objc-new-syntax/TestObjCNewSyntaxDictionary.py (1411 of 2119) PASS: lldb-shell :: SymbolFile/NativePDB/globals-bss.cpp (1412 of 2119) PASS: lldb-unit :: Language/Highlighting/./HighlighterTests/HighlighterTest.ClangStringLiterals (1413 of 2119) PASS: lldb-api :: functionalities/data-formatter/compactvectors/TestCompactVectors.py (1414 of 2119) PASS: lldb-shell :: Quit/TestQuitExitCodeHexA.test (1415 of 2119) PASS: lldb-api :: functionalities/postmortem/netbsd-core/TestNetBSDCore.py (1416 of 2119) PASS: lldb-shell :: SymbolFile/DWARF/debug-names-compressed.cpp (1417 of 2119) PASS: lldb-unit :: Utility/./UtilityTests/ArgsTest.TestQuotedUnknownEscape (1418 of 2119) PASS: lldb-unit :: Platform/Android/./AdbClientTests/AdbClientTest.CreateByDeviceId (1419 of 2119) PASS: lldb-shell :: SymbolFile/NativePDB/function-types-classes.cpp (1420 of 2119) PASS: lldb-shell :: Register/x86-64-read.test (1421 of 2119) PASS: lldb-unit :: Utility/./UtilityTests/StringListTest.Join (1422 of 2119) PASS: lldb-api :: commands/expression/cast_int_to_anonymous_enum/TestCastIntToAnonymousEnum.py (1423 of 2119) PASS: lldb-unit :: Utility/./UtilityTests/StringListTest.AppendList (1424 of 2119) PASS: lldb-unit :: Process/minidump/./LLDBMinidumpTests/MinidumpParserTest.GetMemoryRegionInfoFromMemoryList (1425 of 2119) PASS: lldb-unit :: Process/minidump/./LLDBMinidumpTests/MinidumpParserTest.GetPid (1426 of 2119) PASS: lldb-unit :: Symbol/./SymbolTests/PostfixExpression.ToDWARF (1427 of 2119) PASS: lldb-shell :: Commands/command-target-modules-dump-sections.yaml (1428 of 2119) UNSUPPORTED: lldb-api :: tools/lldb-server/platform-process-connect/TestPlatformProcessConnect.py (1429 of 2119) PASS: lldb-unit :: Utility/./UtilityTests/RangeTest.ContainsEndInclusive (1430 of 2119) PASS: lldb-api :: functionalities/breakpoint/cpp/TestCPPBreakpointLocations.py (1431 of 2119) PASS: lldb-api :: lang/cpp/wchar_t/TestCxxWCharT.py (1432 of 2119) PASS: lldb-unit :: Utility/./UtilityTests/VMRange.Comparison (1433 of 2119) PASS: lldb-unit :: Symbol/./SymbolTests/TestTypeSystemClang.TestBuiltinTypeForEncodingAndBitSize (1434 of 2119) PASS: lldb-unit :: Utility/./UtilityTests/RangeTest.DoesAdjoinOrIntersect (1435 of 2119) PASS: lldb-api :: lang/objc/objc-stepping/TestObjCStepping.py (1436 of 2119) PASS: lldb-unit :: Utility/./UtilityTests/Flags.GetBitSize (1437 of 2119) UNSUPPORTED: lldb-api :: tools/lldb-server/TestGdbRemoteModuleInfo.py (1438 of 2119) PASS: lldb-unit :: UnwindAssembly/x86/./UnwindAssemblyx86Tests/Testx86AssemblyInspectionEngine.TestPushEDX (1439 of 2119) UNSUPPORTED: lldb-api :: api/multiple-debuggers/TestMultipleDebuggers.py (1440 of 2119) PASS: lldb-shell :: SymbolFile/symbol-binding.test (1441 of 2119) PASS: lldb-api :: lang/objc/objc-new-syntax/TestObjCNewSyntaxLiteral.py (1442 of 2119) PASS: lldb-api :: functionalities/data-formatter/data-formatter-stl/libcxx/multiset/TestDataFormatterLibcxxMultiSet.py (1443 of 2119) PASS: lldb-unit :: Utility/./UtilityTests/ListenerTest.GetEventWait (1444 of 2119) PASS: lldb-shell :: Commands/CommandScriptImmediateOutput/CommandScriptImmediateOutputFile.test (1445 of 2119) PASS: lldb-unit :: Utility/./UtilityTests/StreamTest.PutHex32ByteOrderBig (1446 of 2119) PASS: lldb-api :: functionalities/breakpoint/breakpoint_hit_count/TestBreakpointHitCount.py (1447 of 2119) PASS: lldb-unit :: UnwindAssembly/x86/./UnwindAssemblyx86Tests/Testx86AssemblyInspectionEngine.TestAddRSP (1448 of 2119) PASS: lldb-unit :: Utility/./UtilityTests/UriParserTest.TypicalPortPathIPv4 (1449 of 2119) PASS: lldb-unit :: ObjectFile/Breakpad/./ObjectFileBreakpadTests/FuncRecord.parse (1450 of 2119) PASS: lldb-api :: functionalities/tail_call_frames/inlining_and_tail_calls/TestInliningAndTailCalls.py (1451 of 2119) PASS: lldb-api :: functionalities/multidebugger_commands/TestMultipleDebuggersCommands.py (1452 of 2119) PASS: lldb-unit :: Utility/./UtilityTests/PassiveReplayTest.InstrumentedBarPtr (1453 of 2119) PASS: lldb-shell :: SymbolFile/DWARF/find-method-local-struct.cpp (1454 of 2119) PASS: lldb-api :: functionalities/data-formatter/typedef_array/TestTypedefArray.py (1455 of 2119) PASS: lldb-api :: lang/objc/rdar-10967107/TestRdar10967107.py (1456 of 2119) PASS: lldb-unit :: Utility/./UtilityTests/UriParserTest.MinimalPort (1457 of 2119) PASS: lldb-shell :: SymbolFile/DWARF/debug-types-line-tables.s (1458 of 2119) PASS: lldb-api :: functionalities/data-formatter/synthupdate/TestSyntheticFilterRecompute.py (1459 of 2119) PASS: lldb-api :: functionalities/multiword-commands/TestMultiWordCommands.py (1460 of 2119) PASS: lldb-shell :: BuildScript/script-args.test (1461 of 2119) PASS: lldb-api :: commands/expression/result_numbering/TestResultNumbering.py (1462 of 2119) UNSUPPORTED: lldb-api :: functionalities/data-formatter/data-formatter-stl/libstdcpp/vector/TestDataFormatterStdVector.py (1463 of 2119) PASS: lldb-api :: functionalities/gdb_remote_client/TestTargetXMLArch.py (1464 of 2119) PASS: lldb-unit :: Utility/./UtilityTests/AnsiTerminal.Empty (1465 of 2119) PASS: lldb-api :: functionalities/breakpoint/scripted_bkpt/TestScriptedResolver.py (1466 of 2119) PASS: lldb-unit :: Host/./HostTests/MainLoopTest.DetectsEOF (1467 of 2119) PASS: lldb-api :: functionalities/tail_call_frames/disambiguate_tail_call_seq/TestDisambiguateTailCallSeq.py (1468 of 2119) PASS: lldb-api :: lang/cpp/dynamic-value/TestCppValueCast.py (1469 of 2119) PASS: lldb-unit :: Utility/./UtilityTests/GeneratorTest.GetOrCreate (1470 of 2119) PASS: lldb-unit :: Language/Highlighting/./HighlighterTests/HighlighterTest.ClangScalarLiterals (1471 of 2119) PASS: lldb-unit :: SymbolFile/NativePDB/./SymbolFileNativePDBTests/PDBFPOProgramToDWARFExpressionTests.SingleAssignmentRegisterRef (1472 of 2119) PASS: lldb-shell :: Breakpoint/debug_rnglist_basic.test (1473 of 2119) PASS: lldb-api :: lang/objcxx/hide-runtime-values/TestObjCXXHideRuntimeValues.py (1474 of 2119) PASS: lldb-unit :: Thread/./ThreadTests/ThreadTest.SetStopInfo (1475 of 2119) PASS: lldb-api :: functionalities/jitloader_gdb/TestJITLoaderGDB.py (1476 of 2119) PASS: lldb-shell :: SymbolFile/NativePDB/bitfields.cpp (1477 of 2119) PASS: lldb-unit :: Utility/./UtilityTests/XcodeSDKTest.ParseTest (1478 of 2119) PASS: lldb-api :: tools/lldb-server/commandline/TestStubReverseConnect.py (1479 of 2119) PASS: lldb-shell :: Reproducer/TestFileRepro.test (1480 of 2119) PASS: lldb-unit :: Utility/./UtilityTests/FileSpecTest.Match (1481 of 2119) PASS: lldb-unit :: Utility/./UtilityTests/RangeTest.NotEqual (1482 of 2119) PASS: lldb-unit :: Expression/./ExpressionTests/DiagnosticManagerTest.FixedExpression (1483 of 2119) PASS: lldb-unit :: Utility/./UtilityTests/StringLexerTest.PutBack (1484 of 2119) PASS: lldb-unit :: Target/./TargetTests/StackFrameRecognizerTest.NullModuleRegex (1485 of 2119) PASS: lldb-unit :: Language/Highlighting/./HighlighterTests/HighlighterTest.ClangIdentifiers (1486 of 2119) PASS: lldb-shell :: SymbolFile/DWARF/debug-line-basic.s (1487 of 2119) PASS: lldb-unit :: Utility/./UtilityTests/RangeDataVector.FindEntryThatContains_Overlap (1488 of 2119) PASS: lldb-unit :: Symbol/./SymbolTests/TestTypeSystemClang.TestFunctionTemplateInRecordConstruction (1489 of 2119) PASS: lldb-api :: functionalities/data-formatter/data-formatter-stl/libcxx/optional/TestDataFormatterLibcxxOptional.py (1490 of 2119) PASS: lldb-shell :: Driver/TestPositionalArgs.test (1491 of 2119) PASS: lldb-shell :: Quit/TestQuitExitCodeTooManyArgs.test (1492 of 2119) PASS: lldb-api :: functionalities/breakpoint/comp_dir_symlink/TestCompDirSymLink.py (1493 of 2119) PASS: lldb-shell :: Settings/TestDisableColor.test (1494 of 2119) PASS: lldb-api :: types/TestDoubleTypes.py (1495 of 2119) PASS: lldb-unit :: Utility/./UtilityTests/ConstStringTest.UpdateMangledCounterpart (1496 of 2119) PASS: lldb-api :: commands/expression/radar_9673664/TestExprHelpExamples.py (1497 of 2119) PASS: lldb-unit :: Utility/./UtilityTests/DataExtractorTest.GetULEB128_bit63 (1498 of 2119) PASS: lldb-unit :: Utility/./UtilityTests/ArgsTest.TestSingleQuotedArgWithSpace (1499 of 2119) PASS: lldb-unit :: Host/./HostTests/HostInfoTest.GetXcodeSDK (1500 of 2119) PASS: lldb-unit :: Utility/./UtilityTests/StatusTest.ErrorConstructor (1501 of 2119) PASS: lldb-api :: lang/cpp/stl/TestStdCXXDisassembly.py (1502 of 2119) UNSUPPORTED: lldb-api :: functionalities/breakpoint/breakpoint_in_delayslot/TestAvoidBreakpointInDelaySlot.py (1503 of 2119) PASS: lldb-shell :: SymbolFile/DWARF/dir-separator-no-comp-dir-relative-name.s (1504 of 2119) PASS: lldb-unit :: ScriptInterpreter/Python/./ScriptInterpreterPythonTests/PythonDataObjectsTest.TestPythonListValueEquality (1505 of 2119) PASS: lldb-api :: commands/expression/dollar-in-variable/TestDollarInVariable.py (1506 of 2119) UNSUPPORTED: lldb-api :: commands/target/auto-install-main-executable/TestAutoInstallMainExecutable.py (1507 of 2119) PASS: lldb-api :: functionalities/target_var/TestTargetVar.py (1508 of 2119) PASS: lldb-api :: commands/watchpoints/watchpoint_commands/command/TestWatchpointCommandLLDB.py (1509 of 2119) PASS: lldb-unit :: Utility/./UtilityTests/VASprintfTest.NoBufferResize (1510 of 2119) PASS: lldb-api :: commands/expression/completion-in-lambda-and-unnamed-class/TestCompletionInLambdaAndUnnamedClass.py (1511 of 2119) PASS: lldb-api :: functionalities/data-formatter/data-formatter-synthval/TestDataFormatterSynthVal.py (1512 of 2119) PASS: lldb-unit :: Utility/./UtilityTests/VASprintfTest.BufferResize (1513 of 2119) PASS: lldb-unit :: Utility/./UtilityTests/UriParserTest.MinimalPortPath (1514 of 2119) PASS: lldb-api :: lang/c/find_struct_type/TestFindStructTypes.py (1515 of 2119) PASS: lldb-api :: commands/expression/codegen-crash-typedefdecl-not-in_declcontext/TestCodegenCrashTypedefDeclNotInDeclContext.py (1516 of 2119) PASS: lldb-unit :: Interpreter/./InterpreterTests/CompletionTest.DirCompletionAbsolute (1517 of 2119) PASS: lldb-unit :: Utility/./UtilityTests/StringListTest.ForRange (1518 of 2119) PASS: lldb-shell :: Minidump/Windows/broken-unwind.test (1519 of 2119) PASS: lldb-unit :: Utility/./UtilityTests/StringExtractorTest.GetHexBytes_Underflow (1520 of 2119) PASS: lldb-unit :: Utility/./UtilityTests/BinaryStreamTest.PutSLEB128SevenBytes (1521 of 2119) UNSUPPORTED: lldb-shell :: SymbolFile/PDB/vbases.test (1522 of 2119) PASS: lldb-shell :: ObjectFile/ELF/PT_LOAD-overlap-PT_INTERP.yaml (1523 of 2119) PASS: lldb-unit :: Utility/./UtilityTests/EventTest.DumpEventDataBytes (1524 of 2119) PASS: lldb-unit :: Utility/./UtilityTests/StringExtractorTest.GetHexBytes_OddPair (1525 of 2119) PASS: lldb-api :: functionalities/thread/concurrent_events/TestConcurrentDelayedCrashWithBreakpointWatchpoint.py (1526 of 2119) PASS: lldb-unit :: ObjectFile/PECOFF/./ObjectFilePECOFFTests/PECallFrameInfoTest.Frame_reg_eh (1527 of 2119) PASS: lldb-api :: lang/c/bitfields/TestBitfields.py (1528 of 2119) PASS: lldb-api :: lang/cpp/unicode-literals/TestUnicodeLiterals.py (1529 of 2119) PASS: lldb-unit :: Utility/./UtilityTests/ArchSpecTest.Compatibility (1530 of 2119) PASS: lldb-api :: functionalities/source-map/TestTargetSourceMap.py (1531 of 2119) PASS: lldb-unit :: Core/./LLDBCoreTests/MangledTest.ResultForValidName (1532 of 2119) PASS: lldb-api :: python_api/breakpoint/TestBreakpointAPI.py (1533 of 2119) PASS: lldb-unit :: Utility/./UtilityTests/ArchSpecTest.OperatorBool (1534 of 2119) PASS: lldb-api :: functionalities/show_location/TestShowLocationDwarf5.py (1535 of 2119) PASS: lldb-api :: commands/watchpoints/watchpoint_commands/command/TestWatchpointCommandPython.py (1536 of 2119) PASS: lldb-unit :: Utility/./UtilityTests/StringExtractorTest.GetHexBytesAvail_OddPair (1537 of 2119) PASS: lldb-api :: functionalities/data-formatter/data-formatter-objc/cmtime/TestDataFormatterCMTime.py (1538 of 2119) PASS: lldb-unit :: Language/Highlighting/./HighlighterTests/HighlighterTest.ClangBraces (1539 of 2119) PASS: lldb-shell :: SymbolFile/DWARF/DW_TAG_basic_type_DW_ATE_UTF_nonC.ll (1540 of 2119) PASS: lldb-unit :: Utility/./UtilityTests/ConstStringTest.FromMidOfBufferStringRef (1541 of 2119) PASS: lldb-api :: commands/frame/diagnose/dereference-argument/TestDiagnoseDereferenceArgument.py (1542 of 2119) PASS: lldb-unit :: Utility/./UtilityTests/ScalarTest.Promotion (1543 of 2119) PASS: lldb-api :: functionalities/asan/TestReportData.py (1544 of 2119) PASS: lldb-unit :: Utility/./UtilityTests/FileSpecTest.Equal (1545 of 2119) PASS: lldb-api :: functionalities/data-formatter/data-formatter-python-synth/TestDataFormatterPythonSynth.py (1546 of 2119) PASS: lldb-unit :: Utility/./UtilityTests/SerializationRountripTest.SerializeDeserializeCString (1547 of 2119) PASS: lldb-unit :: Platform/./LLDBPlatformTests/PlatformDarwinTest.FindComponentInPath (1548 of 2119) PASS: lldb-unit :: Utility/./UtilityTests/StringExtractorTest.GetU32BigEndian (1549 of 2119) PASS: lldb-api :: lang/objc/objc-dyn-sbtype/TestObjCDynamicSBType.py (1550 of 2119) PASS: lldb-api :: functionalities/signal/TestSendSignal.py (1551 of 2119) PASS: lldb-unit :: Process/gdb-remote/./ProcessGdbRemoteTests/GDBRemoteCommunicationServerTest.SendErrorResponse_UnimplementedError (1552 of 2119) PASS: lldb-api :: commands/watchpoints/hello_watchpoint/TestMyFirstWatchpoint.py (1553 of 2119) PASS: lldb-shell :: SymbolFile/DWARF/find-function-regex.cpp (1554 of 2119) PASS: lldb-unit :: Utility/./UtilityTests/ProcessInstanceInfo.Yaml (1555 of 2119) PASS: lldb-api :: commands/watchpoints/watchpoint_events/TestWatchpointEvents.py (1556 of 2119) PASS: lldb-unit :: Utility/./UtilityTests/RangeTest.NotEqualInvalid (1557 of 2119) PASS: lldb-unit :: Utility/./UtilityTests/RangeTest.Clear (1558 of 2119) UNSUPPORTED: lldb-shell :: ScriptInterpreter/Lua/quit.test (1559 of 2119) PASS: lldb-unit :: Utility/./UtilityTests/StringListTest.DefaultConstructor (1560 of 2119) PASS: lldb-api :: python_api/section/TestSectionAPI.py (1561 of 2119) PASS: lldb-api :: functionalities/gdb_remote_client/TestGDBRemoteLoad.py (1562 of 2119) PASS: lldb-api :: commands/disassemble/basic/TestFrameDisassemble.py (1563 of 2119) PASS: lldb-unit :: SymbolFile/DWARF/./SymbolFileDWARFTests/XcodeSDKModuleTests.TestModuleGetXcodeSDK (1564 of 2119) PASS: lldb-api :: commands/expression/test/TestExprs2.py (1565 of 2119) PASS: lldb-unit :: Host/./HostTests/NativeProcessProtocolTest.ReadCStringFromMemory (1566 of 2119) PASS: lldb-api :: functionalities/process_group/TestChangeProcessGroup.py (1567 of 2119) UNSUPPORTED: lldb-api :: benchmarks/stepping/TestSteppingSpeed.py (1568 of 2119) PASS: lldb-api :: functionalities/data-formatter/dump_dynamic/TestDumpDynamic.py (1569 of 2119) PASS: lldb-unit :: Host/./HostTests/HostInfoTest.GetHostname (1570 of 2119) PASS: lldb-shell :: Breakpoint/single-file-split-dwarf.test (1571 of 2119) PASS: lldb-unit :: Utility/./UtilityTests/UriParserTest.BadPort (1572 of 2119) PASS: lldb-api :: lang/c/register_variables/TestRegisterVariables.py (1573 of 2119) PASS: lldb-api :: functionalities/thread/concurrent_events/TestConcurrentCrashWithBreak.py (1574 of 2119) PASS: lldb-shell :: SymbolFile/DWARF/limit-debug-info.s (1575 of 2119) PASS: lldb-api :: functionalities/breakpoint/breakpoint_ignore_count/TestBreakpointIgnoreCount.py (1576 of 2119) PASS: lldb-unit :: Expression/./ExpressionTests/DiagnosticManagerTest.GetStringPreserveOrder (1577 of 2119) PASS: lldb-unit :: ScriptInterpreter/Python/./ScriptInterpreterPythonTests/PythonDataObjectsTest.TestScript (1578 of 2119) PASS: lldb-unit :: Process/minidump/./LLDBMinidumpTests/MinidumpParserTest.InvalidMinidump (1579 of 2119) PASS: lldb-api :: commands/expression/import-std-module/queue/TestQueueFromStdModule.py (1580 of 2119) PASS: lldb-unit :: Utility/./UtilityTests/StreamTeeTest.Constructor1Stream (1581 of 2119) PASS: lldb-api :: functionalities/inline-stepping/TestInlineStepping.py (1582 of 2119) PASS: lldb-shell :: ObjectFile/ELF/PT_LOAD-overlap-PT_TLS.yaml (1583 of 2119) PASS: lldb-unit :: Host/./HostTests/FileSystemTest.OpenErrno (1584 of 2119) PASS: lldb-unit :: Utility/./UtilityTests/UriParserTest.BracketedHostnameWithPortIPv6 (1585 of 2119) PASS: lldb-unit :: Utility/./UtilityTests/StreamTest.PutCharNull (1586 of 2119) PASS: lldb-unit :: UnwindAssembly/ARM64/./Arm64InstEmulationTests/TestArm64InstEmulation.TestCFARegisterTrackedAcrossJumps (1587 of 2119) PASS: lldb-unit :: Core/./LLDBCoreTests/RichManglingContextTest.Basic (1588 of 2119) PASS: lldb-shell :: Watchpoint/SetErrorCases.test (1589 of 2119) PASS: lldb-api :: functionalities/float-display/TestFloatDisplay.py (1590 of 2119) PASS: lldb-unit :: Utility/./UtilityTests/LogChannelEnabledTest.LLDB_LOG_ERROR (1591 of 2119) PASS: lldb-api :: lang/cpp/class_static/TestStaticVariables.py (1592 of 2119) PASS: lldb-unit :: Utility/./UtilityTests/RecordReplayTest.InstrumentedFoo (1593 of 2119) PASS: lldb-unit :: ScriptInterpreter/Python/./ScriptInterpreterPythonTests/PythonDataObjectsTest.TestDictionaryResolutionWithDot (1594 of 2119) PASS: lldb-api :: commands/gui/basic/TestGuiBasic.py (1595 of 2119) PASS: lldb-unit :: UnwindAssembly/x86/./UnwindAssemblyx86Tests/Testx86AssemblyInspectionEngine.Test32bitFramelessBigStackFrame (1596 of 2119) UNSUPPORTED: lldb-shell :: Register/x86-64-xmm16-read.test (1597 of 2119) PASS: lldb-api :: tools/lldb-vscode/variables/TestVSCode_variables.py (1598 of 2119) PASS: lldb-unit :: Process/gdb-remote/./ProcessGdbRemoteTests/GDBRemoteCommunicationClientTest.GetModulesInfoInvalidResponse (1599 of 2119) PASS: lldb-api :: commands/platform/file/close/TestPlatformFileClose.py (1600 of 2119) UNSUPPORTED: lldb-shell :: Register/x86-gp-write.test (1601 of 2119) PASS: lldb-unit :: Core/./LLDBCoreTests/MangledTest.EmptyForInvalidName (1602 of 2119) PASS: lldb-unit :: Utility/./UtilityTests/CompletionRequest.DuplicateFiltering (1603 of 2119) PASS: lldb-unit :: Process/gdb-remote/./ProcessGdbRemoteTests/GDBRemoteCommunicationClientTest.SendStopTracePacket (1604 of 2119) PASS: lldb-api :: functionalities/breakpoint/serialize/TestBreakpointSerialization.py (1605 of 2119) PASS: lldb-unit :: Utility/./UtilityTests/StreamTest.PutRawBytesToBigEndian (1606 of 2119) PASS: lldb-api :: functionalities/thread/step_out/TestThreadStepOut.py (1607 of 2119) PASS: lldb-shell :: BuildScript/toolchain-clang.test (1608 of 2119) PASS: lldb-api :: lang/objc/objc-class-method/TestObjCClassMethod.py (1609 of 2119) PASS: lldb-unit :: UnwindAssembly/x86/./UnwindAssemblyx86Tests/Testx86AssemblyInspectionEngine.TestPush0 (1610 of 2119) PASS: lldb-unit :: Utility/./UtilityTests/RangeTest.Union (1611 of 2119) PASS: lldb-shell :: SymbolFile/DWARF/debug-types-signature-loop.s (1612 of 2119) PASS: lldb-api :: lang/cpp/chained-calls/TestCppChainedCalls.py (1613 of 2119) PASS: lldb-unit :: Utility/./UtilityTests/StreamTeeTest.CopyConstructor (1614 of 2119) PASS: lldb-shell :: SymbolFile/DWARF/debug_loc-aslr.s (1615 of 2119) PASS: lldb-api :: commands/target/dump-symtab-demangle/TestDumpSymtabDemangle.py (1616 of 2119) PASS: lldb-unit :: Process/gdb-remote/./ProcessGdbRemoteTests/GDBRemoteCommunicationClientTest.WriteRegister (1617 of 2119) PASS: lldb-unit :: Utility/./UtilityTests/StreamTeeTest.Write (1618 of 2119) PASS: lldb-api :: commands/expression/completion-crash-incomplete-record/TestCompletionCrashIncompleteRecord.py (1619 of 2119) PASS: lldb-api :: functionalities/thread/concurrent_events/TestConcurrentCrashWithWatchpointBreakpointSignal.py (1620 of 2119) PASS: lldb-api :: api/multithreaded/TestMultithreaded.py (1621 of 2119) PASS: lldb-api :: lang/c/forward/TestForwardDeclaration.py (1622 of 2119) PASS: lldb-api :: functionalities/limit-debug-info/TestLimitDebugInfo.py (1623 of 2119) PASS: lldb-unit :: Utility/./UtilityTests/BroadcasterTest.BroadcastEvent (1624 of 2119) PASS: lldb-unit :: Utility/./UtilityTests/UriParserTest.SchemeHostSeparator3 (1625 of 2119) PASS: lldb-unit :: Utility/./UtilityTests/StringExtractorTest.GetHexBytesAvail_Underflow (1626 of 2119) PASS: lldb-shell :: SymbolFile/NativePDB/tag-types.cpp (1627 of 2119) PASS: lldb-api :: commands/expression/namespace_local_var_same_name_cpp_and_c/TestNamespaceLocalVarSameNameCppAndC.py (1628 of 2119) PASS: lldb-api :: functionalities/gdb_remote_client/TestNoWatchpointSupportInfo.py (1629 of 2119) PASS: lldb-api :: functionalities/data-formatter/type_summary_list_arg/TestTypeSummaryListArg.py (1630 of 2119) PASS: lldb-unit :: ObjectFile/ELF/./ObjectFileELFTests/ObjectFileELFTest.GetModuleSpecifications_EarlySectionHeaders (1631 of 2119) PASS: lldb-unit :: Utility/./UtilityTests/BinaryStreamTest.PutULEB128OneByte (1632 of 2119) UNSUPPORTED: lldb-api :: functionalities/data-formatter/data-formatter-stl/libstdcpp/list/TestDataFormatterStdList.py (1633 of 2119) PASS: lldb-api :: commands/expression/import-std-module/unique_ptr/TestUniquePtrFromStdModule.py (1634 of 2119) PASS: lldb-shell :: Driver/TestError.test (1635 of 2119) PASS: lldb-api :: functionalities/unwind/zeroth_frame/TestZerothFrame.py (1636 of 2119) PASS: lldb-api :: lang/objc/hidden-ivars/TestHiddenIvars.py (1637 of 2119) PASS: lldb-shell :: SymbolFile/DWARF/find-basic-namespace.cpp (1638 of 2119) UNSUPPORTED: lldb-api :: python_api/event/TestEvents.py (1639 of 2119) PASS: lldb-unit :: API/./APITests/SBCommandInterpreterTest.SingleWordCommand (1640 of 2119) PASS: lldb-api :: commands/frame/diagnose/bad-reference/TestBadReference.py (1641 of 2119) PASS: lldb-api :: functionalities/data-formatter/data-formatter-stl/libcxx/unique_ptr/TestDataFormatterLibcxxUniquePtr.py (1642 of 2119) PASS: lldb-unit :: Target/./TargetTests/MemoryRegionInfoTest.Formatv (1643 of 2119) PASS: lldb-unit :: UnwindAssembly/x86/./UnwindAssemblyx86Tests/Testx86AssemblyInspectionEngine.TestSubESP (1644 of 2119) PASS: lldb-api :: iohandler/unicode/TestUnicode.py (1645 of 2119) PASS: lldb-unit :: Utility/./UtilityTests/StringListTest.ShiftCString (1646 of 2119) PASS: lldb-api :: functionalities/thread/concurrent_events/TestConcurrentManyBreakpoints.py (1647 of 2119) PASS: lldb-api :: python_api/frame/inlines/TestInlinedFrame.py (1648 of 2119) PASS: lldb-unit :: Utility/./UtilityTests/StreamTest.PutCString (1649 of 2119) PASS: lldb-unit :: Utility/./UtilityTests/StringListTest.Assignment (1650 of 2119) PASS: lldb-shell :: Register/x86-64-ymm-read.test (1651 of 2119) PASS: lldb-api :: functionalities/thread/concurrent_events/TestConcurrentCrashWithSignal.py (1652 of 2119) PASS: lldb-api :: lang/objc/objc-static-method/TestObjCStaticMethod.py (1653 of 2119) UNSUPPORTED: lldb-shell :: SymbolFile/DWARF/DW_TAG_GNU_call_site-DW_AT_low_pc.s (1654 of 2119) PASS: lldb-unit :: Utility/./UtilityTests/StringExtractorTest.GetHexU8_Underflow2 (1655 of 2119) PASS: lldb-unit :: Utility/./UtilityTests/ScalarTest.Equality (1656 of 2119) PASS: lldb-unit :: Utility/./UtilityTests/RangeTest.SlideZero (1657 of 2119) UNSUPPORTED: lldb-api :: functionalities/tty/TestTerminal.py (1658 of 2119) PASS: lldb-api :: lang/c/inlines/TestRedefinitionsInInlines.py (1659 of 2119) UNSUPPORTED: lldb-api :: functionalities/data-formatter/data-formatter-stl/libstdcpp/map/TestDataFormatterStdMap.py (1660 of 2119) PASS: lldb-api :: tools/lldb-vscode/launch/TestVSCode_launch.py (1661 of 2119) PASS: lldb-shell :: ScriptInterpreter/Python/crashlog.test (1662 of 2119) PASS: lldb-unit :: Expression/./ExpressionTests/CppModuleConfigurationTest.MissingLibCpp (1663 of 2119) PASS: lldb-api :: commands/frame/diagnose/dereference-function-return/TestDiagnoseDereferenceFunctionReturn.py (1664 of 2119) PASS: lldb-api :: commands/expression/persistent_types/TestNestedPersistentTypes.py (1665 of 2119) PASS: lldb-shell :: ObjectFile/MachO/lc_version_min.yaml (1666 of 2119) PASS: lldb-shell :: Minidump/memory-region-from-module.yaml (1667 of 2119) PASS: lldb-api :: tools/lldb-server/TestGdbRemote_vCont.py (1668 of 2119) PASS: lldb-unit :: SymbolFile/DWARF/./SymbolFileDWARFTests/SymbolFileDWARFTests.TestAbilitiesForDWARF (1669 of 2119) PASS: lldb-api :: python_api/watchpoint/watchlocation/TestSetWatchlocation.py (1670 of 2119) PASS: lldb-shell :: ObjectFile/ELF/gnu-debuglink.yaml (1671 of 2119) PASS: lldb-api :: functionalities/data-formatter/data-formatter-categories/TestDataFormatterCategories.py (1672 of 2119) PASS: lldb-api :: commands/process/signal/TestProcessSignal.py (1673 of 2119) PASS: lldb-unit :: Symbol/./SymbolTests/TestTypeSystemClang.TestGetTypeClassTypeOfExpr (1674 of 2119) PASS: lldb-api :: python_api/watchpoint/watchlocation/TestTargetWatchAddress.py (1675 of 2119) PASS: lldb-shell :: SymbolFile/Breakpad/line-table-discontinuous-file-ids.test (1676 of 2119) PASS: lldb-unit :: Utility/./UtilityTests/Flags.AllClear (1677 of 2119) PASS: lldb-unit :: Platform/Android/./AdbClientTests/AdbClientTest.CreateByDeviceId_ByEnvVar (1678 of 2119) PASS: lldb-api :: lang/cpp/dynamic-value/TestDynamicValue.py (1679 of 2119) PASS: lldb-api :: functionalities/tsan/thread_leak/TestTsanThreadLeak.py (1680 of 2119) PASS: lldb-api :: types/TestLongTypesExpr.py (1681 of 2119) PASS: lldb-shell :: SymbolFile/DWARF/clang-ast-from-dwarf-objc-property.m (1682 of 2119) UNSUPPORTED: lldb-api :: functionalities/darwin_log/filter/regex/category/TestDarwinLogFilterRegexCategory.py (1683 of 2119) PASS: lldb-shell :: SymbolFile/DWARF/debug_aranges-empty-section.s (1684 of 2119) PASS: lldb-unit :: Target/./TargetTests/PathMappingListTest.AbsoluteTests (1685 of 2119) PASS: lldb-unit :: Utility/./UtilityTests/StatusTest.Formatv (1686 of 2119) PASS: lldb-shell :: SymbolFile/DWARF/debug_rnglists.s (1687 of 2119) PASS: lldb-unit :: Utility/./UtilityTests/ArgsTest.TestUnknownEscape (1688 of 2119) PASS: lldb-unit :: UnwindAssembly/x86/./UnwindAssemblyx86Tests/Testx86AssemblyInspectionEngine.TestLEAVE (1689 of 2119) PASS: lldb-unit :: ObjectFile/ELF/./ObjectFileELFTests/ObjectFileELFTest.GetSymtab_NoSymEntryPointArmThumbAddressClass (1690 of 2119) PASS: lldb-api :: functionalities/gdb_remote_client/TestNoGPacketSupported.py (1691 of 2119) PASS: lldb-unit :: Utility/./UtilityTests/UUIDTest.RelationalOperators (1692 of 2119) PASS: lldb-api :: macosx/find-app-in-bundle/TestFindAppInBundle.py (1693 of 2119) PASS: lldb-unit :: Host/./HostTests/Host.WaitStatusFormat (1694 of 2119) PASS: lldb-shell :: Reproducer/TestDump.test (1695 of 2119) PASS: lldb-api :: lang/objc/objc-builtin-types/TestObjCBuiltinTypes.py (1696 of 2119) PASS: lldb-unit :: Utility/./UtilityTests/UriParserTest.BracketedHostnameWithColon (1697 of 2119) PASS: lldb-api :: lang/objc/objc-new-syntax/TestObjCNewSyntaxArray.py (1698 of 2119) PASS: lldb-api :: commands/expression/diagnostics/TestExprDiagnostics.py (1699 of 2119) PASS: lldb-unit :: Utility/./UtilityTests/StringExtractorTest.InitMisc (1700 of 2119) PASS: lldb-shell :: SymbolFile/NativePDB/source-list.cpp (1701 of 2119) PASS: lldb-unit :: Utility/./UtilityTests/RangeTest.EqualInvalid (1702 of 2119) PASS: lldb-api :: functionalities/rerun/TestRerun.py (1703 of 2119) PASS: lldb-api :: lang/objc/single-entry-dictionary/TestObjCSingleEntryDictionary.py (1704 of 2119) PASS: lldb-api :: functionalities/tail_call_frames/thread_step_out_message/TestArtificialFrameStepOutMessage.py (1705 of 2119) PASS: lldb-unit :: Host/./HostTests/NativeProcessProtocolTest.SetBreakpointFailRead (1706 of 2119) PASS: lldb-api :: commands/platform/file/read/TestPlatformFileRead.py (1707 of 2119) PASS: lldb-api :: commands/frame/var/TestFrameVar.py (1708 of 2119) PASS: lldb-unit :: Utility/./UtilityTests/ArgsTest.TestSingleArgWithQuotedSpace (1709 of 2119) PASS: lldb-unit :: Utility/./UtilityTests/UriParserTest.LongPath (1710 of 2119) PASS: lldb-unit :: Utility/./UtilityTests/RangeDataVector.FindEntryIndexesThatContain (1711 of 2119) PASS: lldb-unit :: Process/gdb-remote/./ProcessGdbRemoteTests/GDBRemoteClientBaseTest.SendContinueAndInterrupt (1712 of 2119) PASS: lldb-unit :: UnwindAssembly/x86/./UnwindAssemblyx86Tests/Testx86AssemblyInspectionEngine.TestPushECX (1713 of 2119) PASS: lldb-api :: functionalities/inferior-crashing/recursive-inferior/TestRecursiveInferior.py (1714 of 2119) PASS: lldb-api :: commands/watchpoints/step_over_watchpoint/TestStepOverWatchpoint.py (1715 of 2119) PASS: lldb-api :: functionalities/breakpoint/auto_continue/TestBreakpointAutoContinue.py (1716 of 2119) PASS: lldb-api :: functionalities/thread/concurrent_events/TestConcurrentSignalWatch.py (1717 of 2119) PASS: lldb-api :: tools/lldb-server/TestGdbRemoteAttach.py (1718 of 2119) PASS: lldb-unit :: Utility/./UtilityTests/BinaryStreamTest.PutULEB128FourBytes (1719 of 2119) PASS: lldb-unit :: Signals/./SignalsTests/UnixSignalsTest.GetInfo (1720 of 2119) PASS: lldb-shell :: Minidump/Windows/find-module.test (1721 of 2119) PASS: lldb-api :: python_api/process/io/TestProcessIO.py (1722 of 2119) PASS: lldb-unit :: Symbol/./SymbolTests/LineEntryTest.GetSameLineContiguousAddressRangeNoInlines (1723 of 2119) PASS: lldb-api :: commands/expression/call-function/TestCallStopAndContinue.py (1724 of 2119) PASS: lldb-unit :: UnwindAssembly/x86/./UnwindAssemblyx86Tests/Testx86AssemblyInspectionEngine.TestPushEBP (1725 of 2119) PASS: lldb-unit :: Symbol/./SymbolTests/SymbolsTest.LocateExecutableSymbolFileForUnknownExecutableAndMissingSymbolFile (1726 of 2119) UNSUPPORTED: lldb-api :: functionalities/breakpoint/hardware_breakpoints/hardware_breakpoint_on_multiple_threads/TestHWBreakMultiThread.py (1727 of 2119) PASS: lldb-api :: macosx/load-kext/TestLoadKext.py (1728 of 2119) PASS: lldb-shell :: SymbolFile/NativePDB/ast-functions.cpp (1729 of 2119) PASS: lldb-unit :: Expression/./ExpressionTests/DWARFExpression.DW_OP_unknown (1730 of 2119) PASS: lldb-api :: commands/expression/xvalue/TestXValuePrinting.py (1731 of 2119) PASS: lldb-shell :: SymbolFile/NativePDB/function-types-calling-conv.cpp (1732 of 2119) PASS: lldb-api :: commands/quit/TestQuit.py (1733 of 2119) PASS: lldb-shell :: ObjectFile/PECOFF/uuid.yaml (1734 of 2119) PASS: lldb-unit :: Host/./HostTests/FileActionTest.Open (1735 of 2119) PASS: lldb-unit :: Symbol/./SymbolTests/TestTypeSystemClang.AddMethodToObjCObjectType (1736 of 2119) PASS: lldb-api :: lang/cpp/offsetof/TestOffsetofCpp.py (1737 of 2119) PASS: lldb-shell :: Commands/command-disassemble.s (1738 of 2119) PASS: lldb-api :: functionalities/data-formatter/data-formatter-skip-summary/TestDataFormatterSkipSummary.py (1739 of 2119) PASS: lldb-unit :: Utility/./UtilityTests/ArgsTest.ReplaceArgumentAtIndexEqual (1740 of 2119) PASS: lldb-api :: commands/expression/radar_8638051/Test8638051.py (1741 of 2119) PASS: lldb-unit :: Utility/./UtilityTests/StreamTest.AddressPrefixAndSuffix (1742 of 2119) PASS: lldb-unit :: Utility/./UtilityTests/TimerTest.CategoryTimes2 (1743 of 2119) PASS: lldb-api :: lang/cpp/gmodules/TestWithModuleDebugging.py (1744 of 2119) PASS: lldb-unit :: Utility/./UtilityTests/BroadcasterTest.EventTypeHasListeners (1745 of 2119) PASS: lldb-shell :: Reproducer/TestCaptureEnvOverride.test (1746 of 2119) PASS: lldb-unit :: Utility/./UtilityTests/FileSpecTest.EqualDotsPosix (1747 of 2119) XFAIL: lldb-shell :: Register/x86-mm-xmm-read.test (1748 of 2119) PASS: lldb-api :: commands/expression/import-std-module/weak_ptr-dbg-info-content/TestDbgInfoContentWeakPtrFromStdModule.py (1749 of 2119) PASS: lldb-api :: commands/process/attach/TestProcessAttach.py (1750 of 2119) UNSUPPORTED: lldb-shell :: ScriptInterpreter/Lua/watchpoint_callback.test (1751 of 2119) PASS: lldb-api :: commands/process/attach-resume/TestAttachResume.py (1752 of 2119) PASS: lldb-api :: functionalities/tsan/thread_numbers/TestTsanThreadNumbers.py (1753 of 2119) PASS: lldb-unit :: Expression/./ExpressionTests/CppModuleConfigurationTest.UnrelatedLibrary (1754 of 2119) PASS: lldb-api :: lang/objc/modules-auto-import/TestModulesAutoImport.py (1755 of 2119) PASS: lldb-unit :: Utility/./UtilityTests/OptionsWithRawTest.EmptyInput (1756 of 2119) PASS: lldb-api :: functionalities/data-formatter/array_typedef/TestArrayTypedef.py (1757 of 2119) PASS: lldb-api :: functionalities/thread/concurrent_events/TestConcurrentBreakpointDelayBreakpointOneSignal.py (1758 of 2119) PASS: lldb-shell :: Process/Optimization.test (1759 of 2119) PASS: lldb-unit :: Utility/./UtilityTests/OptionsWithRawTest.WhitespaceSuffix (1760 of 2119) PASS: lldb-api :: functionalities/unwind/sigtramp/TestSigtrampUnwind.py (1761 of 2119) PASS: lldb-unit :: UnwindAssembly/ARM64/./Arm64InstEmulationTests/TestArm64InstEmulation.TestSimpleDarwinFunction (1762 of 2119) PASS: lldb-api :: functionalities/data-formatter/data-formatter-objc/TestDataFormatterObjCNSDate.py (1763 of 2119) PASS: lldb-api :: macosx/profile_vrs_detach/TestDetachVrsProfile.py (1764 of 2119) PASS: lldb-unit :: Utility/./UtilityTests/TimerTest.CategoryTimesNested (1765 of 2119) PASS: lldb-shell :: Reproducer/TestPythonImport.test (1766 of 2119) PASS: lldb-unit :: Utility/./UtilityTests/StreamTest.PutRawBytesToLittleEndian (1767 of 2119) PASS: lldb-unit :: Utility/./UtilityTests/ArgsTest.TestSingleArg (1768 of 2119) PASS: lldb-shell :: SymbolFile/NativePDB/break-by-line.cpp (1769 of 2119) PASS: lldb-api :: terminal/TestSTTYBeforeAndAfter.py (1770 of 2119) PASS: lldb-api :: functionalities/thread/create_after_attach/TestCreateAfterAttach.py (1771 of 2119) PASS: lldb-unit :: Utility/./UtilityTests/BinaryStreamTest.PutULEB128One (1772 of 2119) PASS: lldb-unit :: Utility/./UtilityTests/StringLexerTest.HasAtLeast (1773 of 2119) UNSUPPORTED: lldb-api :: commands/watchpoints/multi_watchpoint_slots/TestWatchpointMultipleSlots.py (1774 of 2119) PASS: lldb-unit :: Expression/./ExpressionTests/DiagnosticManagerTest.HasFixits (1775 of 2119) PASS: lldb-shell :: Driver/TestCore.test (1776 of 2119) PASS: lldb-api :: functionalities/data-formatter/data-formatter-stl/libcxx/vector/TestDataFormatterLibcxxVector.py (1777 of 2119) PASS: lldb-api :: lang/cpp/class-template-parameter-pack/TestClassTemplateParameterPack.py (1778 of 2119) PASS: lldb-unit :: Host/./HostTests/SocketTest.TCPGetConnectURI (1779 of 2119) PASS: lldb-unit :: ScriptInterpreter/Python/./ScriptInterpreterPythonTests/PythonDataObjectsTest.TestPythonIntegerToStr (1780 of 2119) PASS: lldb-unit :: Utility/./UtilityTests/RangeTest.ContainsEndInclusiveInvalid (1781 of 2119) PASS: lldb-unit :: Utility/./UtilityTests/FileSpecTest.AppendPathComponent (1782 of 2119) PASS: lldb-shell :: Minidump/breakpad-symbols.test (1783 of 2119) PASS: lldb-api :: lang/cpp/modules-import/TestCXXModulesImport.py (1784 of 2119) PASS: lldb-api :: functionalities/target-new-solib-notifications/TestModuleLoadedNotifys.py (1785 of 2119) UNSUPPORTED: lldb-shell :: ScriptInterpreter/Lua/independent_state.test (1786 of 2119) PASS: lldb-api :: functionalities/thread/thread_exit/TestThreadExit.py (1787 of 2119) UNSUPPORTED: lldb-shell :: SymbolFile/PDB/class-layout.test (1788 of 2119) PASS: lldb-unit :: Host/./HostTests/ProcessLaunchInfoTest.Constructor (1789 of 2119) PASS: lldb-unit :: Symbol/./SymbolTests/TestTypeSystemClang.TestRemoveFastQualifiers (1790 of 2119) PASS: lldb-unit :: Utility/./UtilityTests/FileSpecTest.IsRelative (1791 of 2119) PASS: lldb-api :: functionalities/backticks/TestBackticksWithoutATarget.py (1792 of 2119) UNSUPPORTED: lldb-api :: functionalities/longjmp/TestLongjmp.py (1793 of 2119) PASS: lldb-unit :: ObjectFile/ELF/./ObjectFileELFTests/ObjectFileELFTest.SectionsResolveConsistently (1794 of 2119) PASS: lldb-unit :: UnwindAssembly/PPC64/./PPC64InstEmulationTests/TestPPC64InstEmulation.TestMediumFunction (1795 of 2119) UNSUPPORTED: lldb-shell :: Register/arm-gp-read.test (1796 of 2119) PASS: lldb-api :: commands/frame/var-scope/TestFrameVariableScope.py (1797 of 2119) PASS: lldb-shell :: SymbolFile/DWARF/inline-function-address-shared.test (1798 of 2119) PASS: lldb-unit :: Interpreter/./InterpreterTests/OptionArgParserTest.toScriptLanguage (1799 of 2119) PASS: lldb-api :: functionalities/reproducers/attach/TestReproducerAttach.py (1800 of 2119) UNSUPPORTED: lldb-api :: functionalities/data-formatter/data-formatter-stl/libstdcpp/unique_ptr/TestDataFormatterStdUniquePtr.py (1801 of 2119) PASS: lldb-api :: commands/expression/namespace_local_var_same_name_obj_c/TestNamespaceLocalVarSameNameObjC.py (1802 of 2119) PASS: lldb-unit :: Process/gdb-remote/./ProcessGdbRemoteTests/GDBRemoteClientBaseTest.SendContinueDelegateInterface (1803 of 2119) PASS: lldb-api :: python_api/interpreter/TestRunCommandInterpreterAPI.py (1804 of 2119) PASS: lldb-unit :: Utility/./UtilityTests/ArgsTest.TestInsertArg (1805 of 2119) PASS: lldb-shell :: Minidump/no-process-id.yaml (1806 of 2119) PASS: lldb-api :: functionalities/data-formatter/data-formatter-proper-plurals/TestFormattersOneIsSingular.py (1807 of 2119) PASS: lldb-shell :: Breakpoint/debug_addrx.test (1808 of 2119) PASS: lldb-api :: functionalities/thread/concurrent_events/TestConcurrentNWatchNBreak.py (1809 of 2119) UNSUPPORTED: lldb-api :: linux/mix-dwo-and-regular-objects/TestMixedDwarfBinary.py (1810 of 2119) PASS: lldb-api :: commands/thread/select/TestThreadSelect.py (1811 of 2119) UNSUPPORTED: lldb-shell :: Register/x86-zmm-write.test (1812 of 2119) PASS: lldb-api :: functionalities/gdb_remote_client/TestPlatformClient.py (1813 of 2119) PASS: lldb-api :: functionalities/data-formatter/data-formatter-objc/TestDataFormatterObjCCF.py (1814 of 2119) PASS: lldb-shell :: Reproducer/Modules/TestModuleCXX.test (1815 of 2119) PASS: lldb-unit :: Language/Highlighting/./HighlighterTests/HighlighterTest.HighlighterSelectionType (1816 of 2119) UNSUPPORTED: lldb-api :: arm/breakpoint-thumb-codesection/TestBreakpointThumbCodesection.py (1817 of 2119) PASS: lldb-shell :: Register/x86-64-gp-read.test (1818 of 2119) PASS: lldb-unit :: Utility/./UtilityTests/StreamTest.AddressPrefix (1819 of 2119) UNSUPPORTED: lldb-shell :: Register/aarch64-gp-read.test (1820 of 2119) PASS: lldb-api :: lang/objc/objc-ivar-offsets/TestObjCIvarOffsets.py (1821 of 2119) PASS: lldb-api :: functionalities/thread/concurrent_events/TestConcurrentManyCrash.py (1822 of 2119) PASS: lldb-unit :: ScriptInterpreter/Python/./ScriptInterpreterPythonTests/PythonDataObjectsTest.TestPythonTupleSize (1823 of 2119) PASS: lldb-unit :: Utility/./UtilityTests/BinaryStreamTest.PutSLEB128MaxValue (1824 of 2119) PASS: lldb-shell :: SymbolFile/DWARF/dwarf5-atomic.s (1825 of 2119) PASS: lldb-unit :: Process/gdb-remote/./ProcessGdbRemoteTests/GDBRemoteClientBaseTest.SendContinueAndLateInterrupt (1826 of 2119) PASS: lldb-api :: python_api/interpreter/TestCommandInterpreterAPI.py (1827 of 2119) UNSUPPORTED: lldb-api :: benchmarks/startup/TestStartupDelays.py (1828 of 2119) PASS: lldb-api :: functionalities/data-formatter/data-formatter-objc/TestDataFormatterObjCExpr.py (1829 of 2119) PASS: lldb-unit :: Utility/./UtilityTests/DataExtractorTest.GetDouble (1830 of 2119) UNSUPPORTED: lldb-api :: functionalities/thread/multi_break/TestMultipleBreakpoints.py (1831 of 2119) PASS: lldb-unit :: Expression/./ExpressionTests/DiagnosticManagerTest.GetStringMultipleDiags (1832 of 2119) PASS: lldb-unit :: Utility/./UtilityTests/OptionsWithRawTest.TerminatedQuote (1833 of 2119) PASS: lldb-unit :: Host/./HostTests/FileSystemTest.GetByteSize (1834 of 2119) PASS: lldb-api :: arm/emulation/TestEmulations.py (1835 of 2119) PASS: lldb-api :: types/TestRecursiveTypes.py (1836 of 2119) PASS: lldb-unit :: SymbolFile/NativePDB/./SymbolFileNativePDBTests/PDBFPOProgramToDWARFExpressionTests.UnresolvedCyclicRegisterAssignmentReference (1837 of 2119) PASS: lldb-api :: lang/cpp/lambdas/TestLambdas.py (1838 of 2119) PASS: lldb-api :: commands/expression/deleting-implicit-copy-constructor/TestDeletingImplicitCopyConstructor.py (1839 of 2119) PASS: lldb-api :: functionalities/data-formatter/data-formatter-named-summaries/TestDataFormatterNamedSummaries.py (1840 of 2119) PASS: lldb-api :: tools/lldb-server/TestGdbRemoteThreadsInStopReply.py (1841 of 2119) PASS: lldb-unit :: Symbol/./SymbolTests/TestClangASTImporter.MetadataPropagationAfterCopying (1842 of 2119) PASS: lldb-unit :: DataFormatter/./LLDBFormatterTests/TypeMatcherTests.CreatedBySameMatchStringExactNamePrefixes (1843 of 2119) PASS: lldb-api :: functionalities/data-formatter/data-formatter-script/TestDataFormatterScript.py (1844 of 2119) PASS: lldb-shell :: Breakpoint/ppc64-localentry.test (1845 of 2119) PASS: lldb-api :: functionalities/data-formatter/data-formatter-objc/TestDataFormatterObjCNSBundle.py (1846 of 2119) PASS: lldb-api :: macosx/find-dsym/bundle-with-dot-in-filename/TestBundleWithDotInFilename.py (1847 of 2119) PASS: lldb-api :: functionalities/data-formatter/data-formatter-disabling/TestDataFormatterDisabling.py (1848 of 2119) PASS: lldb-api :: commands/breakpoint/set/func-regex/TestBreakpointRegexError.py (1849 of 2119) PASS: lldb-unit :: Process/minidump/./LLDBMinidumpTests/MinidumpParserTest.MinidumpModuleOrder (1850 of 2119) PASS: lldb-unit :: Target/./TargetTests/ExecutionContextTest.GetByteOrderProcess (1851 of 2119) PASS: lldb-unit :: Symbol/./SymbolTests/TestTypeSystemClang.TestGetEnumIntegerTypeInvalid (1852 of 2119) PASS: lldb-unit :: Utility/./UtilityTests/OptionsWithRawTest.UnterminatedQuote (1853 of 2119) PASS: lldb-unit :: Process/minidump/./LLDBMinidumpTests/MinidumpParserTest.GetArchitecture (1854 of 2119) PASS: lldb-unit :: Utility/./UtilityTests/ScalarTest.GetValue (1855 of 2119) PASS: lldb-unit :: UnwindAssembly/x86/./UnwindAssemblyx86Tests/Testx86AssemblyInspectionEngine.TestPushEBX (1856 of 2119) UNSUPPORTED: lldb-shell :: ScriptInterpreter/Lua/command_script_import.test (1857 of 2119) PASS: lldb-unit :: ScriptInterpreter/Python/./ScriptInterpreterPythonTests/PythonDataObjectsTest.TestRun (1858 of 2119) PASS: lldb-unit :: Utility/./UtilityTests/AnsiTerminal.KnownPrefix (1859 of 2119) PASS: lldb-api :: lang/objc/objc-runtime-ivars/TestRuntimeIvars.py (1860 of 2119) PASS: lldb-unit :: Platform/./LLDBPlatformTests/PlatformAppleSimulatorTest.TestSimHasSimEnvionament (1861 of 2119) PASS: lldb-api :: functionalities/ubsan/basic/TestUbsanBasic.py (1862 of 2119) PASS: lldb-api :: commands/expression/no-deadlock/TestExprDoesntBlock.py (1863 of 2119) PASS: lldb-shell :: SymbolFile/DWARF/childless-compile-unit.s (1864 of 2119) PASS: lldb-unit :: Expression/./ExpressionTests/CppModuleConfigurationTest.MissingUsrInclude (1865 of 2119) PASS: lldb-unit :: Expression/./ExpressionTests/CppModuleConfigurationTest.LinuxLocalLibCpp (1866 of 2119) PASS: lldb-api :: functionalities/data-formatter/data-formatter-synthtype/TestDataFormatterSynthType.py (1867 of 2119) PASS: lldb-api :: lang/c/struct_types/TestStructTypes.py (1868 of 2119) PASS: lldb-api :: lang/objc/modules-inline-functions/TestModulesInlineFunctions.py (1869 of 2119) PASS: lldb-unit :: Utility/./UtilityTests/StringListTest.InsertStringAtIndexStart (1870 of 2119) PASS: lldb-unit :: Utility/./UtilityTests/StreamTest.AddressRangeInvalidRange (1871 of 2119) PASS: lldb-api :: commands/expression/import-std-module/deque-dbg-info-content/TestDbgInfoContentDequeFromStdModule.py (1872 of 2119) PASS: lldb-unit :: Utility/./UtilityTests/AnsiTerminal.AtStart (1873 of 2119) PASS: lldb-unit :: Utility/./UtilityTests/DataExtractorTest.PeekData (1874 of 2119) PASS: lldb-unit :: Utility/./UtilityTests/StateTest.Formatv (1875 of 2119) PASS: lldb-unit :: Utility/./UtilityTests/StringListTest.ShiftStdString (1876 of 2119) PASS: lldb-api :: commands/command/script/TestCommandScript.py (1877 of 2119) PASS: lldb-api :: commands/expression/rdar42038760/TestScalarURem.py (1878 of 2119) UNSUPPORTED: lldb-api :: benchmarks/expression/TestRepeatedExprs.py (1879 of 2119) PASS: lldb-api :: commands/expression/call-function/TestCallUserDefinedFunction.py (1880 of 2119) PASS: lldb-unit :: ObjectFile/Breakpad/./ObjectFileBreakpadTests/FileRecord.parse (1881 of 2119) PASS: lldb-api :: lang/c/vla/TestVLA.py (1882 of 2119) PASS: lldb-unit :: Core/./LLDBCoreTests/ModuleSpecTest.InvalidInMemoryBuffer (1883 of 2119) PASS: lldb-api :: commands/expression/test/TestExprs.py (1884 of 2119) PASS: lldb-unit :: Utility/./UtilityTests/BinaryStreamTest.PutULEB128MaxValue (1885 of 2119) PASS: lldb-api :: python_api/thread/TestThreadAPI.py (1886 of 2119) PASS: lldb-unit :: Target/./TargetTests/PathMappingListTest.RemapRoot (1887 of 2119) PASS: lldb-api :: functionalities/data-formatter/refpointer-recursion/TestDataFormatterRefPtrRecursion.py (1888 of 2119) PASS: lldb-api :: lang/cpp/bool/TestCPPBool.py (1889 of 2119) PASS: lldb-api :: functionalities/data-formatter/parray/TestPrintArray.py (1890 of 2119) PASS: lldb-unit :: Utility/./UtilityTests/EnvironmentTest.EnvpConstruction (1891 of 2119) PASS: lldb-unit :: Symbol/./SymbolTests/TestTypeSystemClang.TestNotDeletingUserCopyCstrDueToMoveCStr (1892 of 2119) PASS: lldb-api :: python_api/sbdata/TestSBData.py (1893 of 2119) PASS: lldb-shell :: ObjectFile/MachO/lc_build_version.yaml (1894 of 2119) PASS: lldb-api :: macosx/macCatalyst/TestMacCatalyst.py (1895 of 2119) PASS: lldb-unit :: Target/./TargetTests/ExecutionContextTest.GetByteOrder (1896 of 2119) PASS: lldb-api :: functionalities/data-formatter/data-formatter-stl/libcxx/string/TestDataFormatterLibcxxString.py (1897 of 2119) PASS: lldb-api :: lang/objc/objc-static-method-stripped/TestObjCStaticMethodStripped.py (1898 of 2119) PASS: lldb-unit :: Process/gdb-remote/./ProcessGdbRemoteTests/GDBRemoteCommunicationServerTest.SendErrorResponse_Status (1899 of 2119) PASS: lldb-shell :: SymbolFile/DWARF/array-sizes.s (1900 of 2119) PASS: lldb-shell :: Reproducer/Functionalities/TestExpressionEvaluation.test (1901 of 2119) PASS: lldb-api :: functionalities/data-formatter/data-formatter-objc/TestDataFormatterObjNSException.py (1902 of 2119) PASS: lldb-unit :: Language/Highlighting/./HighlighterTests/HighlighterTest.ClangOperators (1903 of 2119) PASS: lldb-unit :: Process/./ProcessEventDataTests/ProcessEventDataTest.DoOnRemoval (1904 of 2119) PASS: lldb-api :: macosx/lc-note/kern-ver-str/TestKernVerStrLCNOTE.py (1905 of 2119) UNSUPPORTED: lldb-shell :: Register/x86-gp-read.test (1906 of 2119) PASS: lldb-api :: commands/expression/timeout/TestCallWithTimeout.py (1907 of 2119) PASS: lldb-unit :: Instruction/./EmulatorTests/TestAArch64Emulator.TestOverflow (1908 of 2119) UNSUPPORTED: lldb-api :: functionalities/data-formatter/data-formatter-stl/libstdcpp/tuple/TestDataFormatterStdTuple.py (1909 of 2119) PASS: lldb-shell :: ScriptInterpreter/Python/sb_address_exception.test (1910 of 2119) PASS: lldb-unit :: Utility/./UtilityTests/StringListTest.ForRangeEmpty (1911 of 2119) PASS: lldb-api :: functionalities/value_md5_crash/TestValueMD5Crash.py (1912 of 2119) PASS: lldb-unit :: Utility/./UtilityTests/ArgsTest.DoubleQuotedItem (1913 of 2119) PASS: lldb-api :: commands/expression/import-std-module/list/TestListFromStdModule.py (1914 of 2119) PASS: lldb-unit :: Utility/./UtilityTests/StringListTest.InsertStringAtIndexStdString (1915 of 2119) PASS: lldb-api :: functionalities/data-formatter/poarray/TestPrintObjectArray.py (1916 of 2119) PASS: lldb-shell :: ObjectFile/ELF/PT_LOAD-overlap-section.yaml (1917 of 2119) PASS: lldb-unit :: UnwindAssembly/x86/./UnwindAssemblyx86Tests/Testx86AssemblyInspectionEngine.TestSimple32bitFrameFunction (1918 of 2119) UNSUPPORTED: lldb-api :: tools/lldb-server/signal-filtering/TestGdbRemote_QPassSignals.py (1919 of 2119) PASS: lldb-api :: lang/cpp/overloaded-functions/TestOverloadedFunctions.py (1920 of 2119) PASS: lldb-api :: functionalities/breakpoint/hardware_breakpoints/require_hw_breakpoints/TestRequireHWBreakpoints.py (1921 of 2119) PASS: lldb-shell :: Reproducer/Functionalities/TestDataFormatter.test (1922 of 2119) PASS: lldb-api :: lang/objc/foundation/TestObjCMethodsNSArray.py (1923 of 2119) PASS: lldb-unit :: Expression/./ExpressionTests/CppModuleConfigurationTest.IgnoreLibStdCpp (1924 of 2119) PASS: lldb-api :: functionalities/data-formatter/data-formatter-stl/libcxx/iterator/TestDataFormatterLibccIterator.py (1925 of 2119) PASS: lldb-api :: functionalities/breakpoint/move_nearest/TestMoveNearest.py (1926 of 2119) PASS: lldb-unit :: Host/./HostTests/SocketTest.UDPGetConnectURI (1927 of 2119) PASS: lldb-shell :: SymbolFile/DWARF/DW_OP_piece-smaller-than-struct.s (1928 of 2119) PASS: lldb-api :: python_api/lldbutil/TestSwigVersion.py (1929 of 2119) UNSUPPORTED: lldb-shell :: ExecControl/StopHook/stop-hook-threads.test (1930 of 2119) PASS: lldb-unit :: Expression/./ExpressionTests/DiagnosticManagerTest.AppendMessageSubsequentDiags (1931 of 2119) PASS: lldb-api :: functionalities/data-formatter/data-formatter-objc/TestDataFormatterObjCNSContainer.py (1932 of 2119) PASS: lldb-unit :: Process/minidump/./LLDBMinidumpTests/MinidumpParserTest.GetExceptionStream (1933 of 2119) UNSUPPORTED: lldb-shell :: Process/Windows/exception_access_violation.cpp (1934 of 2119) PASS: lldb-unit :: Utility/./UtilityTests/StringListTest.GetMaxStringLengthDecreasingSize (1935 of 2119) PASS: lldb-unit :: Process/gdb-remote/./ProcessGdbRemoteTests/GDBRemoteCommunicationServerTest.SendErrorResponse_StringError (1936 of 2119) PASS: lldb-unit :: Process/minidump/./LLDBMinidumpTests/MinidumpParserTest.GetArchitectureWindows (1937 of 2119) PASS: lldb-api :: lang/objcxx/class-name-clash/TestNameClash.py (1938 of 2119) PASS: lldb-unit :: Utility/./UtilityTests/FileSpecTest.EqualDotsWindows (1939 of 2119) PASS: lldb-unit :: Utility/./UtilityTests/StatusTest.ErrorCodeConstructor (1940 of 2119) PASS: lldb-api :: functionalities/paths/TestPaths.py (1941 of 2119) PASS: lldb-unit :: Core/./LLDBCoreTests/ModuleSpecTest.TestCOFFFile (1942 of 2119) PASS: lldb-api :: commands/expression/call-throws/TestCallThatThrows.py (1943 of 2119) PASS: lldb-api :: functionalities/data-formatter/data-formatter-caching/TestDataFormatterCaching.py (1944 of 2119) UNSUPPORTED: lldb-api :: tools/intel-features/intel-pt/test/TestIntelPTSimpleBinary.py (1945 of 2119) PASS: lldb-api :: python_api/class_members/TestSBTypeClassMembers.py (1946 of 2119) PASS: lldb-api :: commands/expression/import-std-module/forward_list/TestForwardListFromStdModule.py (1947 of 2119) PASS: lldb-unit :: Utility/./UtilityTests/StringExtractorTest.InitEmpty (1948 of 2119) PASS: lldb-shell :: SymbolFile/DWARF/dir-separator-no-comp-dir.s (1949 of 2119) PASS: lldb-api :: commands/platform/basic/TestPlatformCommand.py (1950 of 2119) PASS: lldb-unit :: Utility/./UtilityTests/RangeTest.Copy (1951 of 2119) PASS: lldb-shell :: SymbolFile/DWARF/debug_rnglists-dwo.s (1952 of 2119) PASS: lldb-unit :: Expression/./ExpressionTests/DiagnosticManagerTest.AppendMessageNoDiag (1953 of 2119) PASS: lldb-api :: commands/expression/inline-namespace/TestInlineNamespace.py (1954 of 2119) PASS: lldb-shell :: Driver/TestFile.test (1955 of 2119) PASS: lldb-unit :: ScriptInterpreter/Python/./ScriptInterpreterPythonTests/PythonDataObjectsTest.TestGlobalNameResolutionWithDot (1956 of 2119) PASS: lldb-api :: tools/lldb-server/inferior-crash/TestGdbRemoteAbort.py (1957 of 2119) PASS: lldb-unit :: Utility/./UtilityTests/OptionsWithRawTest.SingleWordSuffix (1958 of 2119) PASS: lldb-api :: functionalities/data-formatter/frameformat_smallstruct/TestFrameFormatSmallStruct.py (1959 of 2119) PASS: lldb-api :: commands/expression/static-initializers/TestStaticInitializers.py (1960 of 2119) PASS: lldb-unit :: Utility/./UtilityTests/StreamTest.PutRawBytesToMixedEndian (1961 of 2119) PASS: lldb-unit :: Utility/./UtilityTests/StringExtractorTest.GetHexU8_InvalidHex (1962 of 2119) PASS: lldb-api :: lang/c/enum_types/TestEnumTypes.py (1963 of 2119) PASS: lldb-unit :: Language/Highlighting/./HighlighterTests/HighlighterTest.Keywords (1964 of 2119) PASS: lldb-api :: functionalities/data-formatter/ostypeformatting/TestFormattersOsType.py (1965 of 2119) PASS: lldb-unit :: ScriptInterpreter/Python/./ScriptInterpreterPythonTests/PythonDataObjectsTest.TestPythonBytes (1966 of 2119) PASS: lldb-shell :: SymbolFile/DWARF/win-i386-line-table.s (1967 of 2119) PASS: lldb-unit :: Expression/./ExpressionTests/CppModuleConfigurationTest.LibCppV2 (1968 of 2119) PASS: lldb-api :: functionalities/gdb_remote_client/TestJLink6Armv7RegisterDefinition.py (1969 of 2119) PASS: lldb-unit :: Symbol/./SymbolTests/TestClangASTImporter.CopyTypeTagDecl (1970 of 2119) PASS: lldb-api :: functionalities/tsan/global_location/TestTsanGlobalLocation.py (1971 of 2119) PASS: lldb-api :: functionalities/breakpoint/breakpoint_command/TestBreakpointCommand.py (1972 of 2119) PASS: lldb-unit :: Utility/./UtilityTests/StringListTest.LongestCommonPrefixNoPrefix (1973 of 2119) PASS: lldb-api :: functionalities/inferior-crashing/recursive-inferior/TestRecursiveInferiorStep.py (1974 of 2119) PASS: lldb-unit :: SymbolFile/DWARF/./SymbolFileDWARFTests/SymbolFileDWARFTests.TestAbbrevInvalidNULLTag (1975 of 2119) PASS: lldb-unit :: Utility/./UtilityTests/ProcessInstanceInfo.DumpTable_invalidUID (1976 of 2119) PASS: lldb-shell :: SymbolFile/DWARF/debug_ranges-missing-section.s (1977 of 2119) PASS: lldb-api :: commands/expression/persistent_ptr_update/TestPersistentPtrUpdate.py (1978 of 2119) PASS: lldb-unit :: Expression/./ExpressionTests/ClangHostTest.MacOSX (1979 of 2119) PASS: lldb-api :: functionalities/fat_archives/TestFatArchives.py (1980 of 2119) PASS: lldb-unit :: Utility/./UtilityTests/StreamTest.PutChar (1981 of 2119) PASS: lldb-api :: lang/cpp/multiple-inheritance/TestCppMultipleInheritance.py (1982 of 2119) PASS: lldb-api :: python_api/sbplatform/TestSBPlatform.py (1983 of 2119) PASS: lldb-api :: lang/cpp/constructors/TestCppConstructors.py (1984 of 2119) PASS: lldb-shell :: SymbolFile/DWARF/apple-index-is-used.cpp (1985 of 2119) PASS: lldb-unit :: Utility/./UtilityTests/StreamTeeTest.Flush (1986 of 2119) PASS: lldb-api :: functionalities/thread/backtrace_all/TestBacktraceAll.py (1987 of 2119) PASS: lldb-unit :: Utility/./UtilityTests/AnsiTerminal.WhiteSpace (1988 of 2119) UNSUPPORTED: lldb-api :: tools/lldb-server/libraries-svr4/TestGdbRemoteLibrariesSvr4Support.py (1989 of 2119) PASS: lldb-api :: commands/command/nested_alias/TestNestedAlias.py (1990 of 2119) PASS: lldb-unit :: Utility/./UtilityTests/BinaryStreamTest.PutSLEB128TwoBytes (1991 of 2119) PASS: lldb-unit :: Utility/./UtilityTests/XcodeSDKTest.MergeTest (1992 of 2119) PASS: lldb-api :: functionalities/return-value/TestReturnValue.py (1993 of 2119) PASS: lldb-api :: functionalities/thread/concurrent_events/TestConcurrentSignalWatchBreak.py (1994 of 2119) PASS: lldb-api :: lang/objc/modules-hash-mismatch/TestClangModulesHashMismatch.py (1995 of 2119) PASS: lldb-api :: functionalities/non-overlapping-index-variable-i/TestIndexVariable.py (1996 of 2119) PASS: lldb-api :: iohandler/resize/TestIOHandlerResizeNoEditline.py (1997 of 2119) PASS: lldb-unit :: Utility/./UtilityTests/ScalarTest.ComparisonFloat (1998 of 2119) PASS: lldb-unit :: Utility/./UtilityTests/ScalarTest.Comparison (1999 of 2119) PASS: lldb-unit :: Utility/./UtilityTests/ArgsTest.ReplaceArgumentAtIndexShort (2000 of 2119) PASS: lldb-shell :: SymbolFile/DWARF/split-dwarf-multiple-cu.ll (2001 of 2119) PASS: lldb-unit :: Utility/./UtilityTests/UriParserTest.Minimal (2002 of 2119) PASS: lldb-shell :: SymbolFile/DWARF/anon_class_w_and_wo_export_symbols.ll (2003 of 2119) PASS: lldb-unit :: UnwindAssembly/ARM64/./Arm64InstEmulationTests/TestArm64InstEmulation.TestFramelessThreeEpilogueFunction (2004 of 2119) PASS: lldb-unit :: Utility/./UtilityTests/UUIDTest.SetFromStringRef (2005 of 2119) PASS: lldb-shell :: ObjectFile/wasm/basic.yaml (2006 of 2119) PASS: lldb-shell :: SymbolFile/Breakpad/line-table.test (2007 of 2119) PASS: lldb-shell :: SymbolFile/NativePDB/ast-types.cpp (2008 of 2119) PASS: lldb-unit :: Utility/./UtilityTests/ProcessInstanceInfo.DumpTable (2009 of 2119) PASS: lldb-api :: functionalities/breakpoint/breakpoint_conditions/TestBreakpointConditions.py (2010 of 2119) PASS: lldb-unit :: Utility/./UtilityTests/ArgsTest.StringListConstructor (2011 of 2119) PASS: lldb-api :: commands/expression/top-level/TestTopLevelExprs.py (2012 of 2119) PASS: lldb-unit :: Process/minidump/./LLDBMinidumpTests/MinidumpParserTest.GetMemoryRegionInfoFromMemory64List (2013 of 2119) PASS: lldb-unit :: Utility/./UtilityTests/StringListTest.CopyList (2014 of 2119) PASS: lldb-unit :: Utility/./UtilityTests/DataExtractorTest.GetMaxU64_unchecked (2015 of 2119) UNSUPPORTED: lldb-shell :: Register/x86-ymm-write.test (2016 of 2119) UNSUPPORTED: lldb-shell :: ScriptInterpreter/Lua/persistent_state.test (2017 of 2119) PASS: lldb-shell :: Driver/TestUseColor.test (2018 of 2119) PASS: lldb-api :: functionalities/data-formatter/data-formatter-objc/TestDataFormatterObjCPlain.py (2019 of 2119) PASS: lldb-api :: types/TestFloatTypesExpr.py (2020 of 2119) PASS: lldb-api :: tools/lldb-vscode/step/TestVSCode_step.py (2021 of 2119) PASS: lldb-api :: tools/lldb-server/TestGdbRemoteKill.py (2022 of 2119) PASS: lldb-unit :: Utility/./UtilityTests/ConstStringTest.format_provider (2023 of 2119) PASS: lldb-api :: python_api/symbol-context/TestSymbolContext.py (2024 of 2119) PASS: lldb-unit :: Utility/./UtilityTests/StreamTest.PutHex64ByteOrderBig (2025 of 2119) PASS: lldb-api :: functionalities/data-formatter/data-formatter-stl/libcxx/list/loop/TestDataFormatterLibcxxListLoop.py (2026 of 2119) PASS: lldb-api :: lang/cpp/limit-debug-info/TestWithLimitDebugInfo.py (2027 of 2119) PASS: lldb-api :: tools/lldb-server/commandline/TestStubSetSID.py (2028 of 2119) PASS: lldb-api :: functionalities/thread/concurrent_events/TestConcurrentTwoBreakpointsOneSignal.py (2029 of 2119) PASS: lldb-unit :: UnwindAssembly/x86/./UnwindAssemblyx86Tests/Testx86AssemblyInspectionEngine.TestAddESP (2030 of 2119) PASS: lldb-shell :: SymbolFile/DWARF/static_scope.s (2031 of 2119) PASS: lldb-api :: functionalities/data-formatter/data-formatter-objc/TestDataFormatterObjCKVO.py (2032 of 2119) PASS: lldb-api :: commands/watchpoints/watchpoint_commands/condition/TestWatchpointConditionCmd.py (2033 of 2119) PASS: lldb-unit :: Utility/./UtilityTests/ScalarTest.CastOperations (2034 of 2119) PASS: lldb-api :: macosx/nslog/TestDarwinNSLogOutput.py (2035 of 2119) PASS: lldb-shell :: Reproducer/TestGDBRemoteRepro.test (2036 of 2119) PASS: lldb-shell :: SymbolFile/Breakpad/symtab.test (2037 of 2119) PASS: lldb-shell :: SymbolFile/DWARF/find-qualified-variable.cpp (2038 of 2119) PASS: lldb-api :: lang/c/stepping/TestThreadStepping.py (2039 of 2119) PASS: lldb-shell :: SymbolFile/Breakpad/symtab-macho.test (2040 of 2119) PASS: lldb-api :: lang/mixed/TestMixedLanguages.py (2041 of 2119) PASS: lldb-unit :: Utility/./UtilityTests/FileSpecTest.PrependPathComponent (2042 of 2119) PASS: lldb-api :: api/log/TestAPILog.py (2043 of 2119) PASS: lldb-unit :: Utility/./UtilityTests/XcodeSDKTest.FindXcodeContentsDirectoryInPath (2044 of 2119) PASS: lldb-api :: commands/version/TestVersion.py (2045 of 2119) PASS: lldb-unit :: UnwindAssembly/ARM64/./Arm64InstEmulationTests/TestArm64InstEmulation.TestRegisterSavedTwice (2046 of 2119) PASS: lldb-api :: macosx/save_crashlog/TestSaveCrashlog.py (2047 of 2119) PASS: lldb-unit :: Process/./ProcessEventDataTests/ProcessEventDataTest.ShouldStop (2048 of 2119) PASS: lldb-api :: commands/process/launch-with-shellexpand/TestLaunchWithShellExpand.py (2049 of 2119) PASS: lldb-shell :: SymbolFile/Breakpad/unwind-via-stack-cfi.test (2050 of 2119) PASS: lldb-unit :: UnwindAssembly/x86/./UnwindAssemblyx86Tests/Testx86AssemblyInspectionEngine.TestPushImm (2051 of 2119) PASS: lldb-unit :: Language/CPlusPlus/./LanguageCPlusPlusTests/CPlusPlusLanguage.ExtractContextAndIdentifier (2052 of 2119) UNSUPPORTED: lldb-api :: functionalities/darwin_log/filter/regex/message/TestDarwinLogFilterRegexMessage.py (2053 of 2119) PASS: lldb-unit :: Platform/./LLDBPlatformTests/PlatformDarwinTest.TestParseVersionBuildDir (2054 of 2119) PASS: lldb-api :: types/TestCharType.py (2055 of 2119) PASS: lldb-api :: functionalities/param_entry_vals/basic_entry_values/TestBasicEntryValues.py (2056 of 2119) PASS: lldb-api :: functionalities/data-formatter/data-formatter-stl/libcxx/queue/TestDataFormatterLibcxxQueue.py (2057 of 2119) PASS: lldb-api :: lang/objc/foundation/TestConstStrings.py (2058 of 2119) PASS: lldb-unit :: Utility/./UtilityTests/SubsystemRAIITest.NormalSubsystem (2059 of 2119) PASS: lldb-api :: functionalities/stats_api/TestStatisticsAPI.py (2060 of 2119) PASS: lldb-shell :: SymbolFile/NativePDB/globals-fundamental.cpp (2061 of 2119) PASS: lldb-unit :: Utility/./UtilityTests/StringListTest.JoinEmpty (2062 of 2119) PASS: lldb-api :: lang/objc/print-obj/TestPrintObj.py (2063 of 2119) PASS: lldb-api :: functionalities/gdb_remote_client/TestStopPCs.py (2064 of 2119) PASS: lldb-api :: functionalities/thread/concurrent_events/TestConcurrentDelayedCrashWithBreakpointSignal.py (2065 of 2119) PASS: lldb-unit :: Expression/./ExpressionTests/ClangExpressionDeclMapTest.TestPersistentDeclLookup (2066 of 2119) PASS: lldb-unit :: Utility/./UtilityTests/ArchSpecTest.MergeFromMachOUnknown (2067 of 2119) PASS: lldb-shell :: Driver/TestHelp.test (2068 of 2119) PASS: lldb-api :: lang/cpp/covariant-return-types/TestCovariantReturnTypes.py (2069 of 2119) PASS: lldb-unit :: Language/Highlighting/./HighlighterTests/HighlighterTest.ClangSquareBrackets (2070 of 2119) UNSUPPORTED: lldb-api :: lang/objc/objc-dynamic-value/TestObjCDynamicValue.py (2071 of 2119) PASS: lldb-shell :: SymbolFile/DWARF/DW_TAG_variable-invalid_location.s (2072 of 2119) PASS: lldb-unit :: Expression/./ExpressionTests/ClangExpressionDeclMapTest.TestUnknownIdentifierLookup (2073 of 2119) UNSUPPORTED: lldb-api :: tools/lldb-server/TestGdbRemoteAuxvSupport.py (2074 of 2119) PASS: lldb-unit :: Symbol/./SymbolTests/TestTypeSystemClang.TestOwningModule (2075 of 2119) PASS: lldb-api :: commands/expression/po_verbosity/TestPoVerbosity.py (2076 of 2119) PASS: lldb-unit :: Interpreter/./InterpreterTests/OptionArgParserTest.toBoolean (2077 of 2119) PASS: lldb-api :: lang/cpp/static_methods/TestCPPStaticMethods.py (2078 of 2119) PASS: lldb-unit :: Symbol/./SymbolTests/TestClangASTImporter.MetadataPropagation (2079 of 2119) PASS: lldb-unit :: SymbolFile/NativePDB/./SymbolFileNativePDBTests/PDBFPOProgramToDWARFExpressionTests.UnsupportedRASearch (2080 of 2119) PASS: lldb-api :: lang/objc/conflicting-definition/TestConflictingDefinition.py (2081 of 2119) PASS: lldb-unit :: UnwindAssembly/x86/./UnwindAssemblyx86Tests/Testx86AssemblyInspectionEngine.TestPushR15 (2082 of 2119) PASS: lldb-unit :: Process/gdb-remote/./ProcessGdbRemoteTests/GDBRemoteClientBaseTest.SendContinueAndInterrupt2PacketBug (2083 of 2119) PASS: lldb-unit :: Utility/./UtilityTests/FileSpecTest.OperatorBool (2084 of 2119) PASS: lldb-api :: types/TestCharTypeExpr.py (2085 of 2119) PASS: lldb-unit :: Utility/./UtilityTests/SerializationRountripTest.SerializeDeserializeCStringNull (2086 of 2119) PASS: lldb-shell :: SymbolFile/DWARF/DW_OP_piece-struct.s (2087 of 2119) PASS: lldb-unit :: Process/minidump/./LLDBMinidumpTests/MinidumpParserTest.FindMemoryRange (2088 of 2119) UNSUPPORTED: lldb-shell :: SymbolFile/PDB/pointers.test (2089 of 2119) PASS: lldb-unit :: Language/Highlighting/./HighlighterTests/HighlighterTest.FallbackHighlighter (2090 of 2119) PASS: lldb-shell :: ObjectFile/ELF/avr-basic-info.yaml (2091 of 2119) PASS: lldb-unit :: Utility/./UtilityTests/DataExtractorTest.GetFloatUnaligned (2092 of 2119) PASS: lldb-shell :: SymbolFile/Breakpad/unwind-via-stack-win-no-memory-info.yaml (2093 of 2119) PASS: lldb-unit :: Host/./HostTests/SocketTest.TCPListen0ConnectAccept (2094 of 2119) PASS: lldb-unit :: UnwindAssembly/x86/./UnwindAssemblyx86Tests/Testx86AssemblyInspectionEngine.Testi386IgnoredRegisters (2095 of 2119) PASS: lldb-unit :: DataFormatter/./LLDBFormatterTests/TypeMatcherTests.RegexName (2096 of 2119) PASS: lldb-api :: functionalities/data-formatter/data-formatter-objc/TestDataFormatterObjCNSError.py (2097 of 2119) PASS: lldb-unit :: Host/./HostTests/ConnectionFileDescriptorTest.TCPGetURIv4 (2098 of 2119) PASS: lldb-unit :: Utility/./UtilityTests/ArgsTest.TestQuotedTrailingBackslash (2099 of 2119) PASS: lldb-unit :: Utility/./UtilityTests/StreamTeeTest.AppendStream (2100 of 2119) PASS: lldb-shell :: SymbolFile/DWARF/debug_line-tombstone.s (2101 of 2119) PASS: lldb-api :: lang/objc/modules-non-objc-target/TestObjCModulesNonObjCTarget.py (2102 of 2119) PASS: lldb-shell :: ObjectFile/PECOFF/basic-info-arm64.yaml (2103 of 2119) PASS: lldb-api :: lang/cpp/typedef/TestCppTypedef.py (2104 of 2119) PASS: lldb-unit :: Language/CPlusPlus/./LanguageCPlusPlusTests/CPlusPlusLanguage.MethodNameParsing (2105 of 2119) PASS: lldb-unit :: Process/minidump/./LLDBMinidumpTests/MinidumpParserTest.GetLinuxProcStatus_no_stream (2106 of 2119) PASS: lldb-unit :: Utility/./UtilityTests/TimeoutTest.Construction (2107 of 2119) PASS: lldb-api :: macosx/queues/TestQueues.py (2108 of 2119) PASS: lldb-api :: lang/c/local_variables/TestLocalVariables.py (2109 of 2119) PASS: lldb-api :: commands/watchpoints/watchpoint_disable/TestWatchpointDisable.py (2110 of 2119) UNSUPPORTED: lldb-api :: commands/watchpoints/hello_watchlocation/TestWatchLocation.py (2111 of 2119) PASS: lldb-api :: commands/expression/argument_passing_restrictions/TestArgumentPassingRestrictions.py (2112 of 2119) PASS: lldb-api :: functionalities/thread/concurrent_events/TestConcurrentTwoWatchpointThreads.py (2113 of 2119) PASS: lldb-api :: functionalities/plugins/command_plugin/TestPluginCommands.py (2114 of 2119) PASS: lldb-api :: python_api/hello_world/TestHelloWorld.py (2115 of 2119) PASS: lldb-api :: commands/expression/context-object-objc/TestContextObjectObjc.py (2116 of 2119) PASS: lldb-api :: lang/objc/exceptions/TestObjCExceptions.py (2117 of 2119) PASS: lldb-api :: types/TestLongTypes.py (2118 of 2119) PASS: lldb-api :: macosx/simulator/TestSimulatorPlatform.py (2119 of 2119) Slowest Tests: -------------------------------------------------------------------------- 428.51s: lldb-api :: macosx/simulator/TestSimulatorPlatform.py 130.98s: lldb-api :: tools/lldb-server/TestLldbGdbServer.py 104.73s: lldb-api :: functionalities/gdb_remote_client/TestGDBRemoteClient.py 103.63s: lldb-api :: lang/cpp/enum_types/TestCPP11EnumTypes.py 101.48s: lldb-api :: lang/objc/foundation/TestFoundationDisassembly.py 91.58s: lldb-api :: lang/objc/hidden-ivars/TestHiddenIvars.py 88.40s: lldb-api :: lang/objc/foundation/TestObjCMethods.py 85.25s: lldb-api :: lang/objc/objc-new-syntax/TestObjCNewSyntaxLiteral.py 78.76s: lldb-api :: commands/expression/persist_objc_pointeetype/TestPersistObjCPointeeType.py 77.97s: lldb-api :: lang/objc/real-definition/TestRealDefinition.py 73.41s: lldb-api :: api/multithreaded/TestMultithreaded.py 72.54s: lldb-api :: lang/objc/exceptions/TestObjCExceptions.py 70.15s: lldb-api :: types/TestLongTypesExpr.py 68.50s: lldb-api :: lang/objc/foundation/TestObjCMethodsNSError.py 66.10s: lldb-api :: commands/expression/import_builtin_fileid/TestImportBuiltinFileID.py 64.37s: lldb-api :: lang/objc/objc-new-syntax/TestObjCNewSyntaxDictionary.py 61.75s: lldb-api :: functionalities/postmortem/wow64_minidump/TestWow64MiniDump.py 60.23s: lldb-api :: lang/cpp/namespace/TestNamespaceLookup.py 60.16s: lldb-api :: lang/objc/objc-new-syntax/TestObjCNewSyntaxArray.py 57.76s: lldb-api :: functionalities/gdb_remote_client/TestArmRegisterDefinition.py

Hide Details

Tests Times: -------------------------------------------------------------------------- [ Range ] :: [ Percentage ] :: [ Count ] -------------------------------------------------------------------------- [420s,440s) :: [ ] :: [ 1/2119] [400s,420s) :: [ ] :: [ 0/2119] [380s,400s) :: [ ] :: [ 0/2119] [360s,380s) :: [ ] :: [ 0/2119] [340s,360s) :: [ ] :: [ 0/2119] [320s,340s) :: [ ] :: [ 0/2119] [300s,320s) :: [ ] :: [ 0/2119] [280s,300s) :: [ ] :: [ 0/2119] [260s,280s) :: [ ] :: [ 0/2119] [240s,260s) :: [ ] :: [ 0/2119] [220s,240s) :: [ ] :: [ 0/2119] [200s,220s) :: [ ] :: [ 0/2119] [180s,200s) :: [ ] :: [ 0/2119] [160s,180s) :: [ ] :: [ 0/2119] [140s,160s) :: [ ] :: [ 0/2119] [120s,140s) :: [ ] :: [ 1/2119] [100s,120s) :: [ ] :: [ 3/2119] [ 80s,100s) :: [ ] :: [ 5/2119] [ 60s, 80s) :: [ ] :: [ 9/2119] [ 40s, 60s) :: [ ] :: [ 25/2119] [ 20s, 40s) :: [* ] :: [ 80/2119] [ 0s, 20s) :: [************************************* ] :: [1995/2119] -------------------------------------------------------------------------- ******************** Failed Tests (2): lldb-api :: python_api/target/TestTargetAPI.py lldb-api :: functionalities/gdb_remote_client/TestGDBRemoteClient.py

Hide Details

Hide Details

Testing Time: 1692.15s Unsupported : 150 Passed : 1961 Expectedly Failed: 6 Failed : 2 FAILED: tools/lldb/test/CMakeFiles/check-lldb-lit cd /Users/buildslave/jenkins/workspace/lldb-cmake/lldb-build/tools/lldb/test && /usr/local/Frameworks/Python.framework/Versions/3.7/bin/python3.7 /Users/buildslave/jenkins/workspace/lldb-cmake/lldb-build/./bin/llvm-lit -v --time-tests --shuffle --xunit-xml-output=/Users/buildslave/jenkins/workspace/lldb-cmake/test/results.xml -v /Users/buildslave/jenkins/workspace/lldb-cmake/lldb-build/tools/lldb/test ninja: build stopped: subcommand failed. Command failed: Command '['/usr/bin/env', 'TERM=vt100', '/usr/local/bin/ninja', '-v', 'check-lldb']' returned non-zero exit status 1 Command: ['/usr/bin/env', 'TERM=vt100', '/usr/local/bin/ninja', '-v', 'check-lldb'] [Pipeline] } [Pipeline] // timeout [Pipeline] } [Pipeline] // stage [Pipeline] stage [Pipeline] { (Declarative: Post Actions) [Pipeline] scanForIssues [Clang (LLVM based)] Sleeping for 5 seconds due to JENKINS-32191... [Clang (LLVM based)] Parsing console log (workspace: '/Users/buildslave/jenkins/workspace/lldb-cmake') [Clang (LLVM based)] Successfully parsed console log [Clang (LLVM based)] -> found 92 issues (skipped 132 duplicates) [Clang (LLVM based)] Post processing issues on 'green-dragon-10' with source code encoding 'UTF-8' [Clang (LLVM based)] Creating SCM blamer to obtain author and commit information for affected files [Clang (LLVM based)] Creating SCM miner to obtain statistics for affected repository files [Clang (LLVM based)] Resolving file names for all issues in source directory '/Users/buildslave/jenkins/workspace/lldb-cmake' [Clang (LLVM based)] -> resolved paths in source directory (27 found, 0 not found) [Clang (LLVM based)] Resolving module names from module definitions (build.xml, pom.xml, or Manifest.mf files) [Clang (LLVM based)] -> resolved module names for 92 issues [Clang (LLVM based)] Resolving package names (or namespaces) by parsing the affected files [Clang (LLVM based)] -> resolved package names of 24 affected files [Clang (LLVM based)] No filter has been set, publishing all 88 issues [Clang (LLVM based)] Creating fingerprints for all affected code blocks to track issues over different builds [Clang (LLVM based)] -> created fingerprints for 88 issues (skipped 0 issues) [Clang (LLVM based)] Copying affected files to Jenkins' build folder '/Users/Shared/Jenkins/Home/jobs/lldb-cmake/builds/23299/files-with-issues' [Clang (LLVM based)] -> 22 copied, 2 not in workspace, 0 not-found, 0 with I/O error [Pipeline] junit Recording test results [Pipeline] } [Pipeline] // stage [Pipeline] } [Pipeline] // withEnv [Pipeline] } [Pipeline] // node [Pipeline] End of Pipeline ERROR: script returned exit code 1 Finished: FAILURE