FailedConsole Output

Skipping 35,023 KB.. Full Log
rget.auto-apply-fixits false
output: 

Hide Details

runCmd: settings set plugin.process.gdb-remote.packet-timeout 60 output:

Hide Details

runCmd: settings set symbols.clang-modules-cache-path "/Users/buildslave/jenkins/workspace/lldb-cmake/lldb-build/lldb-test-build.noindex/module-cache-lldb/lldb-api" output:

Hide Details

runCmd: settings set use-color false output:

Hide Details

runCmd: setting set target.prefer-dynamic-value no-dynamic-values output:

Hide Details

PASS: LLDB (/Users/buildslave/jenkins/workspace/lldb-cmake/lldb-build/bin/clang-x86_64) :: test_get_platform_dsym (TestTargetAPI.TargetAPITestCase) runCmd: settings clear -all output:

Hide Details

runCmd: settings set symbols.enable-external-lookup false output:

Hide Details

runCmd: settings set target.inherit-tcc true output:

Hide Details

runCmd: settings set target.auto-apply-fixits false output:

Hide Details

runCmd: settings set plugin.process.gdb-remote.packet-timeout 60 output:

Hide Details

runCmd: settings set symbols.clang-modules-cache-path "/Users/buildslave/jenkins/workspace/lldb-cmake/lldb-build/lldb-test-build.noindex/module-cache-lldb/lldb-api" output:

Hide Details

runCmd: settings set use-color false output:

Hide Details

runCmd: setting set target.prefer-dynamic-value no-dynamic-values output:

Hide Details

PASS: LLDB (/Users/buildslave/jenkins/workspace/lldb-cmake/lldb-build/bin/clang-x86_64) :: test_get_platform_dwarf (TestTargetAPI.TargetAPITestCase) UNSUPPORTED: LLDB (/Users/buildslave/jenkins/workspace/lldb-cmake/lldb-build/bin/clang-x86_64) :: test_get_platform_dwo (TestTargetAPI.TargetAPITestCase) (test case does not fall in any category of interest for this run) runCmd: settings clear -all output:

Hide Details

runCmd: settings set symbols.enable-external-lookup false output:

Hide Details

runCmd: settings set target.inherit-tcc true output:

Hide Details

runCmd: settings set target.auto-apply-fixits false output:

Hide Details

runCmd: settings set plugin.process.gdb-remote.packet-timeout 60 output:

Hide Details

runCmd: settings set symbols.clang-modules-cache-path "/Users/buildslave/jenkins/workspace/lldb-cmake/lldb-build/lldb-test-build.noindex/module-cache-lldb/lldb-api" output:

Hide Details

runCmd: settings set use-color false output:

Hide Details

runCmd: setting set target.prefer-dynamic-value no-dynamic-values output:

Hide Details

PASS: LLDB (/Users/buildslave/jenkins/workspace/lldb-cmake/lldb-build/bin/clang-x86_64) :: test_get_platform_gmodules (TestTargetAPI.TargetAPITestCase) runCmd: settings clear -all output:

Hide Details

runCmd: settings set symbols.enable-external-lookup false output:

Hide Details

runCmd: settings set target.inherit-tcc true output:

Hide Details

runCmd: settings set target.auto-apply-fixits false output:

Hide Details

runCmd: settings set plugin.process.gdb-remote.packet-timeout 60 output:

Hide Details

runCmd: settings set symbols.clang-modules-cache-path "/Users/buildslave/jenkins/workspace/lldb-cmake/lldb-build/lldb-test-build.noindex/module-cache-lldb/lldb-api" output:

Hide Details

runCmd: settings set use-color false output:

Hide Details

runCmd: setting set target.prefer-dynamic-value no-dynamic-values output:

Hide Details

looking at: a(1) returns 4 b(2) returns 5 a(3) returns 6 env: LLDB_SESSION_DIRNAME=/Users/buildslave/jenkins/workspace/lldb-cmake/test/logs env: COLUMNS=80 env: LLVM_LIBS_DIR=/Users/buildslave/jenkins/workspace/lldb-cmake/lldb-build/./lib env: LLDB_SRC=/Users/buildslave/jenkins/workspace/lldb-cmake/llvm-project/lldb env: LLDBVSCODE_EXEC=/Users/buildslave/jenkins/workspace/lldb-cmake/lldb-build/bin/lldb-vscode env: LLDB_DEBUGSERVER_PATH=/Users/buildslave/jenkins/workspace/lldb-cmake/lldb-build/./bin/debugserver env: OS_ACTIVITY_DT_MODE=enable env: LLDB_COMMAND_TRACE=YES env: LLDB_CAPTURE_REPRODUCER=1 env: LLDB_FRAMEWORK=/Users/buildslave/jenkins/workspace/lldb-cmake/lldb-build/lib env: PATH=/usr/local/bin:/usr/local/sbin:/usr/bin:/bin:/usr/sbin:/sbin:/usr/bin:/usr/local/bin env: __CF_USER_TEXT_ENCODING=0x1F5:0x0:0x0 env: TMPDIR=/var/folders/09/r4vw4v8n5kb67jl66zvlbljw0000gn/T/ env: LLDB_LIB_DIR=/Users/buildslave/jenkins/workspace/lldb-cmake/lldb-build/bin env: LC_CTYPE=UTF-8 env: __PYVENV_LAUNCHER__=/usr/local/Cellar/python/3.7.1/Frameworks/Python.framework/Versions/3.7/bin/python3.7 env: TERM=vt100 env: LLVM_DISABLE_CRASH_REPORT=1 env: LLDB_IMPLIB_DIR=/Users/buildslave/jenkins/workspace/lldb-cmake/lldb-build/./lib env: LINES=24 env: LLDB_TEST=/Users/buildslave/jenkins/workspace/lldb-cmake/llvm-project/lldb/packages/Python/lldbsuite/test

Hide Details

Hide Details

Expecting sub string: a(1) Matched

Hide Details

Expecting sub string: b(2) Matched

Hide Details

Expecting sub string: a(3) Matched

Hide Details

<bound method SBProcess.Kill of <lldb.SBProcess; proxy of <Swig Object of type 'lldb::SBProcess *' at 0x116a69e70> >>: success

Hide Details

PASS: LLDB (/Users/buildslave/jenkins/workspace/lldb-cmake/lldb-build/bin/clang-x86_64) :: test_launch_new_process_and_redirect_stdout (TestTargetAPI.TargetAPITestCase) runCmd: settings clear -all output:

Hide Details

runCmd: settings set symbols.enable-external-lookup false output:

Hide Details

runCmd: settings set target.inherit-tcc true output:

Hide Details

runCmd: settings set target.auto-apply-fixits false output:

Hide Details

runCmd: settings set plugin.process.gdb-remote.packet-timeout 60 output:

Hide Details

runCmd: settings set symbols.clang-modules-cache-path "/Users/buildslave/jenkins/workspace/lldb-cmake/lldb-build/lldb-test-build.noindex/module-cache-lldb/lldb-api" output:

Hide Details

runCmd: settings set use-color false output:

Hide Details

runCmd: setting set target.prefer-dynamic-value no-dynamic-values output:

Hide Details

runCmd: run output: Process 3589 exited with status = 0 (0x00000000)

Hide Details

Process 3589 launched: '/Users/buildslave/jenkins/workspace/lldb-cmake/lldb-build/lldb-test-build.noindex/python_api/target/TestTargetAPI.test_launch_simple/b.out' (x86_64)

Hide Details

Hide Details

FAIL: LLDB (/Users/buildslave/jenkins/workspace/lldb-cmake/lldb-build/bin/clang-x86_64) :: test_launch_simple (TestTargetAPI.TargetAPITestCase) <bound method SBProcess.Kill of <lldb.SBProcess; proxy of <Swig Object of type 'lldb::SBProcess *' at 0x117016660> >>: success

Hide Details

runCmd: settings clear -all output:

Hide Details

runCmd: settings set symbols.enable-external-lookup false output:

Hide Details

runCmd: settings set target.inherit-tcc true output:

Hide Details

runCmd: settings set target.auto-apply-fixits false output:

Hide Details

runCmd: settings set plugin.process.gdb-remote.packet-timeout 60 output:

Hide Details

runCmd: settings set symbols.clang-modules-cache-path "/Users/buildslave/jenkins/workspace/lldb-cmake/lldb-build/lldb-test-build.noindex/module-cache-lldb/lldb-api" output:

Hide Details

runCmd: settings set use-color false output:

Hide Details

runCmd: setting set target.prefer-dynamic-value no-dynamic-values output:

Hide Details

<bound method SBProcess.Kill of <lldb.SBProcess; proxy of <Swig Object of type 'lldb::SBProcess *' at 0x116a69e70> >>: success

Hide Details

PASS: LLDB (/Users/buildslave/jenkins/workspace/lldb-cmake/lldb-build/bin/clang-x86_64) :: test_read_memory_dsym (TestTargetAPI.TargetAPITestCase) runCmd: settings clear -all output:

Hide Details

runCmd: settings set symbols.enable-external-lookup false output:

Hide Details

runCmd: settings set target.inherit-tcc true output:

Hide Details

runCmd: settings set target.auto-apply-fixits false output:

Hide Details

runCmd: settings set plugin.process.gdb-remote.packet-timeout 60 output:

Hide Details

runCmd: settings set symbols.clang-modules-cache-path "/Users/buildslave/jenkins/workspace/lldb-cmake/lldb-build/lldb-test-build.noindex/module-cache-lldb/lldb-api" output:

Hide Details

runCmd: settings set use-color false output:

Hide Details

runCmd: setting set target.prefer-dynamic-value no-dynamic-values output:

Hide Details

<bound method SBProcess.Kill of <lldb.SBProcess; proxy of <Swig Object of type 'lldb::SBProcess *' at 0x117016750> >>: success

Hide Details

PASS: LLDB (/Users/buildslave/jenkins/workspace/lldb-cmake/lldb-build/bin/clang-x86_64) :: test_read_memory_dwarf (TestTargetAPI.TargetAPITestCase) UNSUPPORTED: LLDB (/Users/buildslave/jenkins/workspace/lldb-cmake/lldb-build/bin/clang-x86_64) :: test_read_memory_dwo (TestTargetAPI.TargetAPITestCase) (test case does not fall in any category of interest for this run) runCmd: settings clear -all output:

Hide Details

runCmd: settings set symbols.enable-external-lookup false output:

Hide Details

runCmd: settings set target.inherit-tcc true output:

Hide Details

runCmd: settings set target.auto-apply-fixits false output:

Hide Details

runCmd: settings set plugin.process.gdb-remote.packet-timeout 60 output:

Hide Details

runCmd: settings set symbols.clang-modules-cache-path "/Users/buildslave/jenkins/workspace/lldb-cmake/lldb-build/lldb-test-build.noindex/module-cache-lldb/lldb-api" output:

Hide Details

runCmd: settings set use-color false output:

Hide Details

runCmd: setting set target.prefer-dynamic-value no-dynamic-values output:

Hide Details

<bound method SBProcess.Kill of <lldb.SBProcess; proxy of <Swig Object of type 'lldb::SBProcess *' at 0x116a69e70> >>: success

Hide Details

PASS: LLDB (/Users/buildslave/jenkins/workspace/lldb-cmake/lldb-build/bin/clang-x86_64) :: test_read_memory_gmodules (TestTargetAPI.TargetAPITestCase) runCmd: settings clear -all output:

Hide Details

runCmd: settings set symbols.enable-external-lookup false output:

Hide Details

runCmd: settings set target.inherit-tcc true output:

Hide Details

runCmd: settings set target.auto-apply-fixits false output:

Hide Details

runCmd: settings set plugin.process.gdb-remote.packet-timeout 60 output:

Hide Details

runCmd: settings set symbols.clang-modules-cache-path "/Users/buildslave/jenkins/workspace/lldb-cmake/lldb-build/lldb-test-build.noindex/module-cache-lldb/lldb-api" output:

Hide Details

runCmd: settings set use-color false output:

Hide Details

runCmd: setting set target.prefer-dynamic-value no-dynamic-values output:

Hide Details

PASS: LLDB (/Users/buildslave/jenkins/workspace/lldb-cmake/lldb-build/bin/clang-x86_64) :: test_resolve_file_address_dsym (TestTargetAPI.TargetAPITestCase) runCmd: settings clear -all output:

Hide Details

runCmd: settings set symbols.enable-external-lookup false output:

Hide Details

runCmd: settings set target.inherit-tcc true output:

Hide Details

runCmd: settings set target.auto-apply-fixits false output:

Hide Details

runCmd: settings set plugin.process.gdb-remote.packet-timeout 60 output:

Hide Details

runCmd: settings set symbols.clang-modules-cache-path "/Users/buildslave/jenkins/workspace/lldb-cmake/lldb-build/lldb-test-build.noindex/module-cache-lldb/lldb-api" output:

Hide Details

runCmd: settings set use-color false output:

Hide Details

runCmd: setting set target.prefer-dynamic-value no-dynamic-values output:

Hide Details

PASS: LLDB (/Users/buildslave/jenkins/workspace/lldb-cmake/lldb-build/bin/clang-x86_64) :: test_resolve_file_address_dwarf (TestTargetAPI.TargetAPITestCase) UNSUPPORTED: LLDB (/Users/buildslave/jenkins/workspace/lldb-cmake/lldb-build/bin/clang-x86_64) :: test_resolve_file_address_dwo (TestTargetAPI.TargetAPITestCase) (test case does not fall in any category of interest for this run) runCmd: settings clear -all output:

Hide Details

runCmd: settings set symbols.enable-external-lookup false output:

Hide Details

runCmd: settings set target.inherit-tcc true output:

Hide Details

runCmd: settings set target.auto-apply-fixits false output:

Hide Details

runCmd: settings set plugin.process.gdb-remote.packet-timeout 60 output:

Hide Details

runCmd: settings set symbols.clang-modules-cache-path "/Users/buildslave/jenkins/workspace/lldb-cmake/lldb-build/lldb-test-build.noindex/module-cache-lldb/lldb-api" output:

Hide Details

runCmd: settings set use-color false output:

Hide Details

runCmd: setting set target.prefer-dynamic-value no-dynamic-values output:

Hide Details

PASS: LLDB (/Users/buildslave/jenkins/workspace/lldb-cmake/lldb-build/bin/clang-x86_64) :: test_resolve_file_address_gmodules (TestTargetAPI.TargetAPITestCase) runCmd: settings clear -all output:

Hide Details

runCmd: settings set symbols.enable-external-lookup false output:

Hide Details

runCmd: settings set target.inherit-tcc true output:

Hide Details

runCmd: settings set target.auto-apply-fixits false output:

Hide Details

runCmd: settings set plugin.process.gdb-remote.packet-timeout 60 output:

Hide Details

runCmd: settings set symbols.clang-modules-cache-path "/Users/buildslave/jenkins/workspace/lldb-cmake/lldb-build/lldb-test-build.noindex/module-cache-lldb/lldb-api" output:

Hide Details

runCmd: settings set use-color false output:

Hide Details

runCmd: setting set target.prefer-dynamic-value no-dynamic-values output:

Hide Details

breakpoint1: SBBreakpoint: id = 1, file = 'main.c', line = 21, exact_match = 0, locations = 1

Hide Details

breakpoint2: SBBreakpoint: id = 2, file = 'main.c', line = 26, exact_match = 0, locations = 1

Hide Details

address1: a.out`a + 11 at main.c:21:13

Hide Details

address2: a.out`a + 63 at main.c:26:12

Hide Details

context1: Module: file = "/Users/buildslave/jenkins/workspace/lldb-cmake/lldb-build/lldb-test-build.noindex/python_api/target/TestTargetAPI.test_resolve_symbol_context_with_address_dsym/a.out", arch = "x86_64" CompileUnit: id = {0x00000000}, file = "/Users/buildslave/jenkins/workspace/lldb-cmake/llvm-project/lldb/test/API/python_api/target/main.c", language = "c99" Function: id = {0x7fffffff0000004e}, name = "a", range = [0x0000000100000dd0-0x0000000100000e18) FuncType: id = {0x7fffffff0000004e}, byte-size = 0, decl = main.c:19, compiler_type = "int (int)" Blocks: id = {0x7fffffff0000004e}, range = [0x100000dd0-0x100000e18) LineEntry: [0x0000000100000ddb-0x0000000100000ddf): /Users/buildslave/jenkins/workspace/lldb-cmake/llvm-project/lldb/test/API/python_api/target/main.c:21:13, is_start_of_statement = TRUE, is_prologue_end = TRUE Symbol: id = {0x00000005}, range = [0x0000000100000dd0-0x0000000100000e20), name="a"

Hide Details

context2: Module: file = "/Users/buildslave/jenkins/workspace/lldb-cmake/lldb-build/lldb-test-build.noindex/python_api/target/TestTargetAPI.test_resolve_symbol_context_with_address_dsym/a.out", arch = "x86_64" CompileUnit: id = {0x00000000}, file = "/Users/buildslave/jenkins/workspace/lldb-cmake/llvm-project/lldb/test/API/python_api/target/main.c", language = "c99" Function: id = {0x7fffffff0000004e}, name = "a", range = [0x0000000100000dd0-0x0000000100000e18) FuncType: id = {0x7fffffff0000004e}, byte-size = 0, decl = main.c:19, compiler_type = "int (int)" Blocks: id = {0x7fffffff0000004e}, range = [0x100000dd0-0x100000e18) LineEntry: [0x0000000100000e0f-0x0000000100000e12): /Users/buildslave/jenkins/workspace/lldb-cmake/llvm-project/lldb/test/API/python_api/target/main.c:26:12, is_start_of_statement = TRUE Symbol: id = {0x00000005}, range = [0x0000000100000dd0-0x0000000100000e20), name="a"

Hide Details

symbol1: id = {0x00000005}, range = [0x0000000100000dd0-0x0000000100000e20), name="a"

Hide Details

symbol2: id = {0x00000005}, range = [0x0000000100000dd0-0x0000000100000e20), name="a"

Hide Details

<bound method SBProcess.Kill of <lldb.SBProcess; proxy of <Swig Object of type 'lldb::SBProcess *' at 0x117016660> >>: success

Hide Details

PASS: LLDB (/Users/buildslave/jenkins/workspace/lldb-cmake/lldb-build/bin/clang-x86_64) :: test_resolve_symbol_context_with_address_dsym (TestTargetAPI.TargetAPITestCase) runCmd: settings clear -all output:

Hide Details

runCmd: settings set symbols.enable-external-lookup false output:

Hide Details

runCmd: settings set target.inherit-tcc true output:

Hide Details

runCmd: settings set target.auto-apply-fixits false output:

Hide Details

runCmd: settings set plugin.process.gdb-remote.packet-timeout 60 output:

Hide Details

runCmd: settings set symbols.clang-modules-cache-path "/Users/buildslave/jenkins/workspace/lldb-cmake/lldb-build/lldb-test-build.noindex/module-cache-lldb/lldb-api" output:

Hide Details

runCmd: settings set use-color false output:

Hide Details

runCmd: setting set target.prefer-dynamic-value no-dynamic-values output:

Hide Details

breakpoint1: SBBreakpoint: id = 1, file = 'main.c', line = 21, exact_match = 0, locations = 1

Hide Details

breakpoint2: SBBreakpoint: id = 2, file = 'main.c', line = 26, exact_match = 0, locations = 1

Hide Details

address1: a.out`a + 11 at main.c:21:13

Hide Details

address2: a.out`a + 63 at main.c:26:12

Hide Details

context1: Module: file = "/Users/buildslave/jenkins/workspace/lldb-cmake/lldb-build/lldb-test-build.noindex/python_api/target/TestTargetAPI.test_resolve_symbol_context_with_address_dwarf/a.out", arch = "x86_64" CompileUnit: id = {0x00000000}, file = "/Users/buildslave/jenkins/workspace/lldb-cmake/llvm-project/lldb/test/API/python_api/target/main.c", language = "unknown" Function: id = {0x10000004e}, name = "a", range = [0x0000000100000dd0-0x0000000100000e18) FuncType: id = {0x10000004e}, byte-size = 0, decl = main.c:19, compiler_type = "int (int)" Blocks: id = {0x10000004e}, range = [0x100000dd0-0x100000e18) LineEntry: [0x0000000100000ddb-0x0000000100000ddf): /Users/buildslave/jenkins/workspace/lldb-cmake/llvm-project/lldb/test/API/python_api/target/main.c:21:13, is_start_of_statement = TRUE, is_prologue_end = TRUE Symbol: id = {0x00000005}, range = [0x0000000100000dd0-0x0000000100000e20), name="a"

Hide Details

context2: Module: file = "/Users/buildslave/jenkins/workspace/lldb-cmake/lldb-build/lldb-test-build.noindex/python_api/target/TestTargetAPI.test_resolve_symbol_context_with_address_dwarf/a.out", arch = "x86_64" CompileUnit: id = {0x00000000}, file = "/Users/buildslave/jenkins/workspace/lldb-cmake/llvm-project/lldb/test/API/python_api/target/main.c", language = "unknown" Function: id = {0x10000004e}, name = "a", range = [0x0000000100000dd0-0x0000000100000e18) FuncType: id = {0x10000004e}, byte-size = 0, decl = main.c:19, compiler_type = "int (int)" Blocks: id = {0x10000004e}, range = [0x100000dd0-0x100000e18) LineEntry: [0x0000000100000e0f-0x0000000100000e12): /Users/buildslave/jenkins/workspace/lldb-cmake/llvm-project/lldb/test/API/python_api/target/main.c:26:12, is_start_of_statement = TRUE Symbol: id = {0x00000005}, range = [0x0000000100000dd0-0x0000000100000e20), name="a"

Hide Details

symbol1: id = {0x00000005}, range = [0x0000000100000dd0-0x0000000100000e20), name="a"

Hide Details

symbol2: id = {0x00000005}, range = [0x0000000100000dd0-0x0000000100000e20), name="a"

Hide Details

<bound method SBProcess.Kill of <lldb.SBProcess; proxy of <Swig Object of type 'lldb::SBProcess *' at 0x116a69a80> >>: success

Hide Details

PASS: LLDB (/Users/buildslave/jenkins/workspace/lldb-cmake/lldb-build/bin/clang-x86_64) :: test_resolve_symbol_context_with_address_dwarf (TestTargetAPI.TargetAPITestCase) UNSUPPORTED: LLDB (/Users/buildslave/jenkins/workspace/lldb-cmake/lldb-build/bin/clang-x86_64) :: test_resolve_symbol_context_with_address_dwo (TestTargetAPI.TargetAPITestCase) (test case does not fall in any category of interest for this run) runCmd: settings clear -all output:

Hide Details

runCmd: settings set symbols.enable-external-lookup false output:

Hide Details

runCmd: settings set target.inherit-tcc true output:

Hide Details

runCmd: settings set target.auto-apply-fixits false output:

Hide Details

runCmd: settings set plugin.process.gdb-remote.packet-timeout 60 output:

Hide Details

runCmd: settings set symbols.clang-modules-cache-path "/Users/buildslave/jenkins/workspace/lldb-cmake/lldb-build/lldb-test-build.noindex/module-cache-lldb/lldb-api" output:

Hide Details

runCmd: settings set use-color false output:

Hide Details

runCmd: setting set target.prefer-dynamic-value no-dynamic-values output:

Hide Details

breakpoint1: SBBreakpoint: id = 1, file = 'main.c', line = 21, exact_match = 0, locations = 1

Hide Details

breakpoint2: SBBreakpoint: id = 2, file = 'main.c', line = 26, exact_match = 0, locations = 1

Hide Details

address1: a.out`a + 11 at main.c:21:13

Hide Details

address2: a.out`a + 63 at main.c:26:12

Hide Details

context1: Module: file = "/Users/buildslave/jenkins/workspace/lldb-cmake/lldb-build/lldb-test-build.noindex/python_api/target/TestTargetAPI.test_resolve_symbol_context_with_address_gmodules/a.out", arch = "x86_64" CompileUnit: id = {0x00000000}, file = "/Users/buildslave/jenkins/workspace/lldb-cmake/llvm-project/lldb/test/API/python_api/target/main.c", language = "unknown" Function: id = {0x100000072}, name = "a", range = [0x0000000100000dd0-0x0000000100000e18) FuncType: id = {0x100000072}, byte-size = 0, decl = main.c:19, compiler_type = "int (int)" Blocks: id = {0x100000072}, range = [0x100000dd0-0x100000e18) LineEntry: [0x0000000100000ddb-0x0000000100000ddf): /Users/buildslave/jenkins/workspace/lldb-cmake/llvm-project/lldb/test/API/python_api/target/main.c:21:13, is_start_of_statement = TRUE, is_prologue_end = TRUE Symbol: id = {0x00000005}, range = [0x0000000100000dd0-0x0000000100000e20), name="a"

Hide Details

context2: Module: file = "/Users/buildslave/jenkins/workspace/lldb-cmake/lldb-build/lldb-test-build.noindex/python_api/target/TestTargetAPI.test_resolve_symbol_context_with_address_gmodules/a.out", arch = "x86_64" CompileUnit: id = {0x00000000}, file = "/Users/buildslave/jenkins/workspace/lldb-cmake/llvm-project/lldb/test/API/python_api/target/main.c", language = "unknown" Function: id = {0x100000072}, name = "a", range = [0x0000000100000dd0-0x0000000100000e18) FuncType: id = {0x100000072}, byte-size = 0, decl = main.c:19, compiler_type = "int (int)" Blocks: id = {0x100000072}, range = [0x100000dd0-0x100000e18) LineEntry: [0x0000000100000e0f-0x0000000100000e12): /Users/buildslave/jenkins/workspace/lldb-cmake/llvm-project/lldb/test/API/python_api/target/main.c:26:12, is_start_of_statement = TRUE Symbol: id = {0x00000005}, range = [0x0000000100000dd0-0x0000000100000e20), name="a"

Hide Details

symbol1: id = {0x00000005}, range = [0x0000000100000dd0-0x0000000100000e20), name="a"

Hide Details

symbol2: id = {0x00000005}, range = [0x0000000100000dd0-0x0000000100000e20), name="a"

Hide Details

<bound method SBProcess.Kill of <lldb.SBProcess; proxy of <Swig Object of type 'lldb::SBProcess *' at 0x117016660> >>: success

Hide Details

PASS: LLDB (/Users/buildslave/jenkins/workspace/lldb-cmake/lldb-build/bin/clang-x86_64) :: test_resolve_symbol_context_with_address_gmodules (TestTargetAPI.TargetAPITestCase) Restore dir to: /Users/buildslave/jenkins/workspace/lldb-cmake/lldb-build/tools/lldb/test ====================================================================== FAIL: test_launch_simple (TestTargetAPI.TargetAPITestCase) ---------------------------------------------------------------------- Traceback (most recent call last): File "/Users/buildslave/jenkins/workspace/lldb-cmake/llvm-project/lldb/packages/Python/lldbsuite/test/decorators.py", line 135, in wrapper return func(*args, **kwargs) File "/Users/buildslave/jenkins/workspace/lldb-cmake/llvm-project/lldb/packages/Python/lldbsuite/test/decorators.py", line 345, in wrapper return func(self, *args, **kwargs) File "/Users/buildslave/jenkins/workspace/lldb-cmake/llvm-project/lldb/test/API/python_api/target/TestTargetAPI.py", line 172, in test_launch_simple self.assertEqual(process.GetState(), lldb.eStateExited) AssertionError: 0 != 10 Config=x86_64-/Users/buildslave/jenkins/workspace/lldb-cmake/lldb-build/bin/clang ---------------------------------------------------------------------- Ran 42 tests in 67.592s

Hide Details

RESULT: FAILED (31 passes, 1 failures, 0 errors, 10 skipped, 0 expected failures, 0 unexpected successes)

Hide Details

--

Hide Details

******************** PASS: lldb-api :: functionalities/data-formatter/data-formatter-objc/TestDataFormatterObjCNSData.py (1244 of 2119) PASS: lldb-unit :: Language/Highlighting/./HighlighterTests/HighlighterTest.ClangIdentifiers (1245 of 2119) PASS: lldb-unit :: Utility/./UtilityTests/StreamTest.PutHex16ByteOrderLittle (1246 of 2119) PASS: lldb-api :: commands/frame/diagnose/local-variable/TestLocalVariable.py (1247 of 2119) PASS: lldb-api :: functionalities/gdb_remote_client/TestqOffsets.py (1248 of 2119) PASS: lldb-unit :: Utility/./UtilityTests/StringExtractorTest.GetHexBytes_OddPair2 (1249 of 2119) PASS: lldb-unit :: Utility/./UtilityTests/StringListTest.JoinSingle (1250 of 2119) UNSUPPORTED: lldb-api :: benchmarks/stepping/TestSteppingSpeed.py (1251 of 2119) PASS: lldb-api :: lang/objc/objc-foundation-dictionary-empty/TestNSDictionary0.py (1252 of 2119) PASS: lldb-unit :: Utility/./UtilityTests/AnsiTerminal.Basic (1253 of 2119) PASS: lldb-unit :: Host/./HostTests/ProcessLaunchInfoTest.Constructor (1254 of 2119) PASS: lldb-api :: commands/watchpoints/watchpoint_commands/condition/TestWatchpointConditionCmd.py (1255 of 2119) PASS: lldb-api :: lang/objc/foundation/TestFoundationDisassembly.py (1256 of 2119) PASS: lldb-unit :: UnwindAssembly/x86/./UnwindAssemblyx86Tests/Testx86AssemblyInspectionEngine.Test32bitFramelessSmallStackFrame (1257 of 2119) PASS: lldb-unit :: Utility/./UtilityTests/BroadcasterTest.BroadcastEvent (1258 of 2119) PASS: lldb-unit :: UnwindAssembly/x86/./UnwindAssemblyx86Tests/Testx86AssemblyInspectionEngine.TestAddESP (1259 of 2119) PASS: lldb-unit :: Interpreter/./InterpreterTests/OptionArgParserTest.toScriptLanguage (1260 of 2119) PASS: lldb-unit :: Host/./HostTests/FileSystemTest.GetPermissions (1261 of 2119) PASS: lldb-shell :: Process/Optimization.test (1262 of 2119) PASS: lldb-api :: commands/target/create-no-such-arch/TestNoSuchArch.py (1263 of 2119) PASS: lldb-unit :: ScriptInterpreter/Python/./ScriptInterpreterPythonTests/PythonDataObjectsTest.TestGlobalNameResolutionNoDot (1264 of 2119) PASS: lldb-unit :: Target/./TargetTests/StackFrameRecognizerTest.NullModuleRegex (1265 of 2119) PASS: lldb-unit :: Symbol/./SymbolTests/PostfixExpression.ToDWARF (1266 of 2119) PASS: lldb-unit :: Utility/./UtilityTests/OptionsWithRawTest.MultiWordSuffix (1267 of 2119) UNSUPPORTED: lldb-shell :: ScriptInterpreter/Lua/io.test (1268 of 2119) PASS: lldb-api :: python_api/watchpoint/TestSetWatchpoint.py (1269 of 2119) PASS: lldb-unit :: UnwindAssembly/x86/./UnwindAssemblyx86Tests/Testx86AssemblyInspectionEngine.TestPopRBX (1270 of 2119) PASS: lldb-api :: functionalities/breakpoint/breakpoint_ids/TestBreakpointIDs.py (1271 of 2119) PASS: lldb-shell :: Reproducer/Functionalities/TestExpressionEvaluation.test (1272 of 2119) PASS: lldb-shell :: SymbolFile/DWARF/dir-separator-posix.s (1273 of 2119) PASS: lldb-api :: functionalities/data-formatter/data-formatter-objc/nsstring/TestDataFormatterNSString.py (1274 of 2119) PASS: lldb-api :: functionalities/data-formatter/data-formatter-stl/libcxx/set/TestDataFormatterLibcxxSet.py (1275 of 2119) PASS: lldb-unit :: Utility/./UtilityTests/StringListTest.AppendStringStdString (1276 of 2119) PASS: lldb-api :: lang/cpp/unique-types/TestUniqueTypes.py (1277 of 2119) PASS: lldb-unit :: Utility/./UtilityTests/TimerTest.CategoryTimes (1278 of 2119) PASS: lldb-unit :: Utility/./UtilityTests/DataExtractorTest.GetMaxU64_unchecked (1279 of 2119) PASS: lldb-unit :: ScriptInterpreter/Python/./ScriptInterpreterPythonTests/PythonDataObjectsTest.TestPythonByteArray (1280 of 2119) PASS: lldb-unit :: Expression/./ExpressionTests/DiagnosticManagerTest.PutStringSeverities (1281 of 2119) PASS: lldb-shell :: Commands/command-source.test (1282 of 2119) PASS: lldb-api :: sample_test/TestSampleTest.py (1283 of 2119) PASS: lldb-api :: python_api/get-value-32bit-int/TestGetValue32BitInt.py (1284 of 2119) PASS: lldb-api :: commands/expression/rdar42038760/TestScalarURem.py (1285 of 2119) PASS: lldb-api :: lang/cpp/multiple-inheritance/TestCppMultipleInheritance.py (1286 of 2119) PASS: lldb-unit :: Language/Highlighting/./HighlighterTests/HighlighterTest.ClangCursorOutOfBounds (1287 of 2119) PASS: lldb-api :: lang/objc/objc-dyn-sbtype/TestObjCDynamicSBType.py (1288 of 2119) PASS: lldb-unit :: Utility/./UtilityTests/BinaryStreamTest.PutSLEB128EightBytes (1289 of 2119) PASS: lldb-unit :: Utility/./UtilityTests/ArgsTest.TestTrailingBackslash (1290 of 2119) PASS: lldb-shell :: Driver/TestProcessAttach.test (1291 of 2119) PASS: lldb-unit :: Utility/./UtilityTests/CompletionRequest.DuplicateFiltering (1292 of 2119) PASS: lldb-api :: functionalities/gdb_remote_client/TestTargetXMLArch.py (1293 of 2119) PASS: lldb-shell :: Watchpoint/SetErrorCases.test (1294 of 2119) PASS: lldb-unit :: Utility/./UtilityTests/UriParserTest.BracketedHostnamePort (1295 of 2119) PASS: lldb-unit :: Host/./HostTests/FileSystemTest.Exists (1296 of 2119) PASS: lldb-unit :: Utility/./UtilityTests/RangeTest.ContainsEndInclusiveInvalid (1297 of 2119) PASS: lldb-api :: functionalities/thread/backtrace_limit/TestBacktraceLimit.py (1298 of 2119) PASS: lldb-unit :: Utility/./UtilityTests/SerializationRountripTest.SerializeDeserializePodPointers (1299 of 2119) PASS: lldb-shell :: Breakpoint/split-dwarf5-debug-stroffsets.test (1300 of 2119) PASS: lldb-api :: commands/expression/completion-crash-incomplete-record/TestCompletionCrashIncompleteRecord.py (1301 of 2119) PASS: lldb-api :: macosx/dyld-trie-symbols/TestDyldTrieSymbols.py (1302 of 2119) PASS: lldb-unit :: Expression/./ExpressionTests/ClangHostTest.MacOSX (1303 of 2119) PASS: lldb-unit :: Utility/./UtilityTests/RangeTest.SetRangeBase (1304 of 2119) PASS: lldb-api :: functionalities/breakpoint/scripted_bkpt/TestScriptedResolver.py (1305 of 2119) PASS: lldb-unit :: Utility/./UtilityTests/ArchSpecTest.TestParseMachCPUDashSubtypeTripleExtra (1306 of 2119) PASS: lldb-api :: commands/frame/diagnose/complicated-expression/TestComplicatedExpression.py (1307 of 2119) PASS: lldb-shell :: ObjectFile/Breakpad/breakpad-identification.test (1308 of 2119) PASS: lldb-unit :: Host/./HostTests/SocketTest.TCPGetAddress (1309 of 2119) PASS: lldb-api :: commands/expression/import_builtin_fileid/TestImportBuiltinFileID.py (1310 of 2119) PASS: lldb-api :: types/TestLongTypes.py (1311 of 2119) PASS: lldb-unit :: Utility/./UtilityTests/StreamTest.PutHex16ByteOrderBig (1312 of 2119) PASS: lldb-unit :: Expression/./ExpressionTests/DiagnosticManagerTest.GetStringMultipleDiags (1313 of 2119) PASS: lldb-unit :: Utility/./UtilityTests/CompletionRequest.DuplicateFilteringWithComments (1314 of 2119) PASS: lldb-api :: lang/objc/global_ptrs/TestGlobalObjects.py (1315 of 2119) PASS: lldb-shell :: SymbolFile/DWARF/DW_OP_piece-smaller-than-struct.s (1316 of 2119) PASS: lldb-api :: lang/objc/self/TestObjCSelf.py (1317 of 2119) UNSUPPORTED: lldb-api :: tools/lldb-server/thread-name/TestGdbRemoteThreadName.py (1318 of 2119) PASS: lldb-shell :: SymbolFile/DWARF/DW_AT_declaration-with-children.s (1319 of 2119) PASS: lldb-shell :: Settings/TestFrameFormatColor.test (1320 of 2119) PASS: lldb-unit :: Platform/./LLDBPlatformTests/PlatformAppleSimulatorTest.TestHostPlatformToSim (1321 of 2119) PASS: lldb-api :: functionalities/dlopen_other_executable/TestDlopenOtherExecutable.py (1322 of 2119) PASS: lldb-unit :: UnwindAssembly/x86/./UnwindAssemblyx86Tests/Testx86AssemblyInspectionEngine.TestPushECX (1323 of 2119) PASS: lldb-unit :: Symbol/./SymbolTests/TestTypeSystemClang.TestBuiltinTypeForEncodingAndBitSize (1324 of 2119) PASS: lldb-unit :: Utility/./UtilityTests/OptionsWithRawTest.TerminatedQuote (1325 of 2119) PASS: lldb-shell :: SymbolFile/NativePDB/globals-fundamental.cpp (1326 of 2119) UNSUPPORTED: lldb-shell :: Watchpoint/netbsd-nouserdbregs.test (1327 of 2119) PASS: lldb-api :: functionalities/gdb_remote_client/TestProcessConnect.py (1328 of 2119) PASS: lldb-api :: commands/expression/import-std-module/no-std-module/TestMissingStdModule.py (1329 of 2119) PASS: lldb-unit :: Thread/./ThreadTests/ThreadTest.SetStopInfo (1330 of 2119) PASS: lldb-shell :: SymbolFile/DWARF/gnu-style-compression.cpp (1331 of 2119) PASS: lldb-unit :: Utility/./UtilityTests/ArgsTest.GetArgumentArrayRef (1332 of 2119) PASS: lldb-unit :: Host/./HostTests/MainLoopTest.Signal (1333 of 2119) PASS: lldb-unit :: Utility/./UtilityTests/StreamTest.PutBytesAsRawHex8ToBigEndian (1334 of 2119) PASS: lldb-unit :: SymbolFile/DWARF/./SymbolFileDWARFTests/SymbolFileDWARFTests.TestAbbrevInvalidNULLTag (1335 of 2119) PASS: lldb-unit :: Utility/./UtilityTests/BinaryStreamTest.PutSLEB128ThreeBytes (1336 of 2119) PASS: lldb-api :: functionalities/jitloader_gdb/TestJITLoaderGDB.py (1337 of 2119) PASS: lldb-api :: commands/watchpoints/watchpoint_commands/command/TestWatchpointCommandPython.py (1338 of 2119) PASS: lldb-api :: functionalities/gdb_remote_client/TestPlatformClient.py (1339 of 2119) PASS: lldb-api :: terminal/TestEditline.py (1340 of 2119) PASS: lldb-api :: lang/objc/objc++/TestObjCXX.py (1341 of 2119) PASS: lldb-unit :: Utility/./UtilityTests/StreamTest.AddressSize (1342 of 2119) PASS: lldb-api :: functionalities/data-formatter/nssetsynth/TestNSSetSynthetic.py (1343 of 2119) PASS: lldb-shell :: BuildScript/script-args.test (1344 of 2119) PASS: lldb-unit :: Platform/./LLDBPlatformTests/PlatformDarwinTest.FindComponentInPath (1345 of 2119) PASS: lldb-unit :: Host/./HostTests/FileSystemTest.MakeAbsolute (1346 of 2119) PASS: lldb-unit :: Utility/./UtilityTests/BinaryStreamTest.PutULEB128TwoBytes (1347 of 2119) PASS: lldb-unit :: UnwindAssembly/x86/./UnwindAssemblyx86Tests/Testx86AssemblyInspectionEngine.TestStackRealignMSVC_i386 (1348 of 2119) PASS: lldb-api :: python_api/watchpoint/watchlocation/TestTargetWatchAddress.py (1349 of 2119) PASS: lldb-unit :: Process/gdb-remote/./ProcessGdbRemoteTests/GDBRemoteCommunicationClientTest.SendGetTraceConfigPacket (1350 of 2119) PASS: lldb-unit :: Interpreter/./InterpreterTests/CompletionTest.FileCompletionAbsolute (1351 of 2119) PASS: lldb-shell :: Heap/heap-cstr.test (1352 of 2119) PASS: lldb-api :: commands/expression/radar_9531204/TestPrintfAfterUp.py (1353 of 2119) PASS: lldb-api :: lang/objc/foundation/TestObjCMethodsString.py (1354 of 2119) UNSUPPORTED: lldb-shell :: SymbolFile/PDB/ast-restore.test (1355 of 2119) FAIL: lldb-api :: functionalities/gdb_remote_client/TestGDBRemoteClient.py (1356 of 2119) ******************** TEST 'lldb-api :: functionalities/gdb_remote_client/TestGDBRemoteClient.py' FAILED ******************** Script: -- /usr/local/Frameworks/Python.framework/Versions/3.7/bin/python3.7 /Users/buildslave/jenkins/workspace/lldb-cmake/llvm-project/lldb/test/API/dotest.py --arch x86_64 -s /Users/buildslave/jenkins/workspace/lldb-cmake/lldb-build/lldb-test-traces -S nm -u CXXFLAGS -u CFLAGS --codesign-identity - --server /Users/buildslave/jenkins/workspace/lldb-cmake/lldb-build/./bin/debugserver --arch x86_64 --build-dir /Users/buildslave/jenkins/workspace/lldb-cmake/lldb-build/lldb-test-build.noindex -s=/Users/buildslave/jenkins/workspace/lldb-cmake/test/logs -t --env TERM=vt100 --env LLVM_LIBS_DIR=/Users/buildslave/jenkins/workspace/lldb-cmake/lldb-build/./lib --build-dir /Users/buildslave/jenkins/workspace/lldb-cmake/lldb-build/lldb-test-build.noindex --lldb-module-cache-dir /Users/buildslave/jenkins/workspace/lldb-cmake/lldb-build/lldb-test-build.noindex/module-cache-lldb/lldb-api --clang-module-cache-dir /Users/buildslave/jenkins/workspace/lldb-cmake/lldb-build/lldb-test-build.noindex/module-cache-clang/lldb-api --executable /Users/buildslave/jenkins/workspace/lldb-cmake/lldb-build/./bin/lldb --compiler /Users/buildslave/jenkins/workspace/lldb-cmake/lldb-build/./bin/clang --dsymutil /Users/buildslave/jenkins/workspace/lldb-cmake/lldb-build/./bin/dsymutil --filecheck /Users/buildslave/jenkins/workspace/lldb-cmake/lldb-build/./bin/FileCheck --yaml2obj /Users/buildslave/jenkins/workspace/lldb-cmake/lldb-build/./bin/yaml2obj --lldb-libs-dir /Users/buildslave/jenkins/workspace/lldb-cmake/lldb-build/./lib /Users/buildslave/jenkins/workspace/lldb-cmake/llvm-project/lldb/test/API/functionalities/gdb_remote_client -p TestGDBRemoteClient.py -- Exit Code: 1

Hide Details

Command Output (stdout): -- lldb version 12.0.99 clang revision 4e681fad46868c1c68a5ff9193447eb245824ca1 llvm revision 4e681fad46868c1c68a5ff9193447eb245824ca1 < 1> send packet: + history[1] tid=0x0307 < 1> send packet: + < 19> send packet: $QStartNoAckMode#b0 < 1> read packet: + < 6> read packet: $OK#9a < 1> send packet: + < 45> send packet: $qSupported:xmlRegisters=i386,arm,mips,arc#74 < 57> read packet: $qXfer:features:read+;PacketSize=3fff;QStartNoAckMode+#86 < 26> send packet: $QThreadSuffixSupported#e4 < 4> read packet: $#00 < 27> send packet: $QListThreadsInStopReply#21 < 4> read packet: $#00 < 13> send packet: $qHostInfo#9b < 28> read packet: $ptrsize:8;endian:little;#30 < 10> send packet: $vCont?#49 < 4> read packet: $#00 < 27> send packet: $qVAttachOrWaitSupported#38 < 4> read packet: $#00 < 23> send packet: $QEnableErrorStrings#8c < 6> read packet: $OK#9a < 16> send packet: $qProcessInfo#dc < 4> read packet: $#00 < 6> send packet: $qC#b4 < 7> read packet: $E42#ab < 16> send packet: $qfThreadInfo#bb < 6> read packet: $OK#9a < 38> send packet: $QSetSTDIN:2f6465762f74747973303034#88 < 4> read packet: $#00 < 39> send packet: $QSetSTDOUT:2f6465762f74747973303034#e9 < 4> read packet: $#00 < 39> send packet: $QSetSTDERR:2f6465762f74747973303034#da < 4> read packet: $#00 < 21> send packet: $QSetDisableASLR:0#cd < 4> read packet: $#00 < 23> send packet: $QSetDetachOnError:0#f7 < 4> read packet: $#00 < 19> send packet: $QLaunchArch:arm#a4 < 4> read packet: $#00 < 94> send packet: $QEnvironment:LLDB_SESSION_DIRNAME=/Users/buildslave/jenkins/workspace/lldb-cmake/test/logs#e5 < 4> read packet: $#00 < 319> send packet: $A308,0,2f55736572732f6275696c64736c6176652f6a656e6b696e732f776f726b73706163652f6c6c64622d636d616b652f6c6c64622d6275696c642f6c6c64622d746573742d6275696c642e6e6f696e6465782f66756e6374696f6e616c69746965732f6764625f72656d6f74655f636c69656e742f5465737447444252656d6f7465436c69656e742e746573745f6c61756e63685f6661696c2f61#e4 < 7> read packet: $E47#b0 < 1> send packet: + history[1] tid=0x0307 < 1> send packet: + < 19> send packet: $QStartNoAckMode#b0 < 1> read packet: + < 6> read packet: $OK#9a < 1> send packet: + < 45> send packet: $qSupported:xmlRegisters=i386,arm,mips,arc#74 < 57> read packet: $qXfer:features:read+;PacketSize=3fff;QStartNoAckMode+#86 < 26> send packet: $QThreadSuffixSupported#e4 < 4> read packet: $#00 < 27> send packet: $QListThreadsInStopReply#21 < 4> read packet: $#00 < 13> send packet: $qHostInfo#9b < 28> read packet: $ptrsize:8;endian:little;#30 < 10> send packet: $vCont?#49 < 4> read packet: $#00 < 27> send packet: $qVAttachOrWaitSupported#38 < 4> read packet: $#00 < 23> send packet: $QEnableErrorStrings#8c < 6> read packet: $OK#9a < 16> send packet: $qProcessInfo#dc < 4> read packet: $#00 < 6> send packet: $qC#b4 < 7> read packet: $QC0#c4 < 16> send packet: $qfThreadInfo#bb < 5> read packet: $l#6c < 5> send packet: $?#3f < 7> read packet: $S02#b5 < 16> send packet: $qProcessInfo#dc < 4> read packet: $#00 < 41> send packet: $qXfer:features:read:target.xml:0,3ffe#af < 4> read packet: $#00 < 18> send packet: $qRegisterInfo0#72 < 4> read packet: $#00 < 16> send packet: $qfThreadInfo#bb < 5> read packet: $l#6c < 7> send packet: $Hg1#e0 < 6> read packet: $OK#9a < 6> send packet: $p0#a0 < 12> read packet: $00000000#80 < 16> send packet: $qProcessInfo#dc < 4> read packet: $#00 < 12> send packet: $qOffsets#4b < 4> read packet: $#00 < 26> send packet: $qStructuredDataPlugins#02 < 4> read packet: $#00 < 13> send packet: $qSymbol::#5b < 6> read packet: $OK#9a < 16> send packet: $qfThreadInfo#bb < 5> read packet: $l#6c < 16> send packet: $qfThreadInfo#bb < 5> read packet: $l#6c < 5> send packet: $g#67 < 860> read packet: $0000000000000000000000000000000000000000000000000000000000000000000000000000000000000000000000000000000000000000000000000000000000000000000000000000000000000000000000000000000000000000000000000000000000000000000000000000000000000000000000000000000000000000000000000000000000000000000000000000000000000000000000000000000000000000000000000000000000000000000000000000000000000000000000000000000000000000000000000000000000000000000000000000000000000000000000000000000000000000000000000000000000000000000000000000000000000000000000000000000000000000000000000000000000000000000000000000000000000000000000000000000000000000000000000000000000000000000000000000000000000000000000000000000000000000000000000000000000000000000000000000000000000000000000000000000000000000000000000000000000000000000000000000000000000000000000000000000000000000000000000000000000000000#80 < 5> send packet: $k#6b < 4> read packet: $#00 < 1> send packet: + history[1] tid=0x0307 < 1> send packet: + < 19> send packet: $QStartNoAckMode#b0 < 1> read packet: + < 6> read packet: $OK#9a < 1> send packet: + < 45> send packet: $qSupported:xmlRegisters=i386,arm,mips,arc#74 < 57> read packet: $qXfer:features:read+;PacketSize=3fff;QStartNoAckMode+#86 < 26> send packet: $QThreadSuffixSupported#e4 < 4> read packet: $#00 < 27> send packet: $QListThreadsInStopReply#21 < 4> read packet: $#00 < 13> send packet: $qHostInfo#9b < 28> read packet: $ptrsize:8;endian:little;#30 < 10> send packet: $vCont?#49 < 4> read packet: $#00 < 27> send packet: $qVAttachOrWaitSupported#38 < 4> read packet: $#00 < 23> send packet: $QEnableErrorStrings#8c < 6> read packet: $OK#9a < 16> send packet: $qProcessInfo#dc < 4> read packet: $#00 < 6> send packet: $qC#b4 < 7> read packet: $QC0#c4 < 16> send packet: $qfThreadInfo#bb < 5> read packet: $l#6c < 5> send packet: $?#3f < 7> read packet: $S02#b5 < 16> send packet: $qProcessInfo#dc < 4> read packet: $#00 < 41> send packet: $qXfer:features:read:target.xml:0,3ffe#af < 4> read packet: $#00 < 18> send packet: $qRegisterInfo0#72 < 4> read packet: $#00 < 16> send packet: $qfThreadInfo#bb < 5> read packet: $l#6c < 7> send packet: $Hg1#e0 < 6> read packet: $OK#9a < 6> send packet: $p0#a0 < 12> read packet: $00000000#80 < 16> send packet: $qProcessInfo#dc < 4> read packet: $#00 < 12> send packet: $qOffsets#4b < 4> read packet: $#00 < 26> send packet: $qStructuredDataPlugins#02 < 4> read packet: $#00 < 13> send packet: $qSymbol::#5b < 6> read packet: $OK#9a < 16> send packet: $qfThreadInfo#bb < 5> read packet: $l#6c < 16> send packet: $qfThreadInfo#bb < 5> read packet: $l#6c < 6> send packet: $pf#d6 < 12> read packet: $00000000#80 < 6> send packet: $pd#d4 < 12> read packet: $00000000#80 < 6> send packet: $p0#a0 < 12> read packet: $00000000#80 < 6> send packet: $p1#a1 < 12> read packet: $00000000#80 < 6> send packet: $p2#a2 < 12> read packet: $00000000#80 < 6> send packet: $p3#a3 < 12> read packet: $00000000#80 < 6> send packet: $p4#a4 < 12> read packet: $00000000#80 < 6> send packet: $p5#a5 < 12> read packet: $00000000#80 < 6> send packet: $p6#a6 < 12> read packet: $00000000#80 < 6> send packet: $p7#a7 < 12> read packet: $00000000#80 < 6> send packet: $p8#a8 < 12> read packet: $00000000#80 < 6> send packet: $p9#a9 < 12> read packet: $00000000#80 < 6> send packet: $pa#d1 < 12> read packet: $00000000#80 < 6> send packet: $pb#d2 < 12> read packet: $00000000#80 < 6> send packet: $pc#d3 < 12> read packet: $00000000#80 < 6> send packet: $pe#d5 < 12> read packet: $00000000#80 < 7> send packet: $p19#da < 12> read packet: $00000000#80 < 5> send packet: $k#6b < 4> read packet: $#00 < 1> send packet: + history[1] tid=0x0307 < 1> send packet: + < 19> send packet: $QStartNoAckMode#b0 < 1> read packet: + < 6> read packet: $OK#9a < 1> send packet: + < 45> send packet: $qSupported:xmlRegisters=i386,arm,mips,arc#74 < 57> read packet: $qXfer:features:read+;PacketSize=3fff;QStartNoAckMode+#86 < 26> send packet: $QThreadSuffixSupported#e4 < 4> read packet: $#00 < 27> send packet: $QListThreadsInStopReply#21 < 4> read packet: $#00 < 13> send packet: $qHostInfo#9b < 28> read packet: $ptrsize:8;endian:little;#30 < 10> send packet: $vCont?#49 < 4> read packet: $#00 < 27> send packet: $qVAttachOrWaitSupported#38 < 4> read packet: $#00 < 23> send packet: $QEnableErrorStrings#8c < 6> read packet: $OK#9a < 16> send packet: $qProcessInfo#dc < 4> read packet: $#00 < 6> send packet: $qC#b4 < 7> read packet: $QC0#c4 < 16> send packet: $qfThreadInfo#bb < 5> read packet: $l#6c < 5> send packet: $?#3f < 7> read packet: $S02#b5 < 16> send packet: $qProcessInfo#dc < 4> read packet: $#00 < 41> send packet: $qXfer:features:read:target.xml:0,3ffe#af < 4> read packet: $#00 < 18> send packet: $qRegisterInfo0#72 < 4> read packet: $#00 < 16> send packet: $qfThreadInfo#bb < 5> read packet: $l#6c < 7> send packet: $Hg1#e0 < 6> read packet: $OK#9a < 6> send packet: $p0#a0 < 4> read packet: $#00 < 16> send packet: $qProcessInfo#dc < 4> read packet: $#00 < 12> send packet: $qOffsets#4b < 4> read packet: $#00 < 26> send packet: $qStructuredDataPlugins#02 < 4> read packet: $#00 < 13> send packet: $qSymbol::#5b < 6> read packet: $OK#9a < 16> send packet: $qfThreadInfo#bb < 5> read packet: $l#6c < 16> send packet: $qfThreadInfo#bb < 5> read packet: $l#6c < 5> send packet: $g#67 < 860> read packet: $0000000000000000000000000000000000000000000000000000000000000000000000000000000000000000000000000000000000000000000000000000000000000000000000000000000000000000000000000000000000000000000000000000000000000000000000000000000000000000000000000000000000000000000000000000000000000000000000000000000000000000000000000000000000000000000000000000000000000000000000000000000000000000000000000000000000000000000000000000000000000000000000000000000000000000000000000000000000000000000000000000000000000000000000000000000000000000000000000000000000000000000000000000000000000000000000000000000000000000000000000000000000000000000000000000000000000000000000000000000000000000000000000000000000000000000000000000000000000000000000000000000000000000000000000000000000000000000000000000000000000000000000000000000000000000000000000000000000000000000000000000000000000000#80 < 861> send packet: $G0000000000000000000000000000000000000000000000000000000000000000000000000000000000000000000000000000000000000000000000000000000000000000000000000000000000000000000000000000000000000000000000000000000000000000000000000000000000000000000000000000000000000000000000000000000000000000000000000000000000000000000000000000000000000000000000000000000000000000000000000000000000000000000000000000000000000000000000000000000000000000000000000000000000000000000000000000000000000000000000000000000000000000000000000000000000000000000000000000000000000000000000000000000000000000000000000000000000000000000000000000000000000000000000000000000000000000000000000000000000000000000000000000000000000000000000000000000000000000000000000000000000000000000000000000000000000000000000000000000000000000000000000000000000000000000000000000000000000000000000000000000000000000#c7 < 6> read packet: $OK#9a < 861> send packet: $G0000000000000000000000000000000000000000000000000000000000000000000000000000000000000000000000000000000000000000000000000000000000000000000000000000000000000000000000000000000000000000000000000000000000000000000000000000000000000000000000000000000000000000000000000000000000000000000000000000000000000000000000000000000000000000000000000000000000000000000000000000000000000000000000000000000000000000000000000000000000000000000000000000000000000000000000000000000000000000000000000000000000000000000000000000000000000000000000000000000000000000000000000000000000000000000000000000000000000000000000000000000000000000000000000000000000000000000000000000000000000000000000000000000000000000000000000000000000000000000000000000000000000000000000000000000000000000000000000000000000000000000000000000000000000000000000000000000000000000000000000000000000000000#c7 < 6> read packet: $OK#9a < 861> send packet: $G0000000000000000000000000000000000000000000000000000000000000000000000000000000000000000000000000000000000000000000000000000000000000000000000000000000000000000000000000000000000000000000000000000000000000000000000000000000000000000000000000000000000000000000000000000000000000000000000000000000000000000000000000000000000000000000000000000000000000000000000000000000000000000000000000000000000000000000000000000000000000000000000000000000000000000000000000000000000000000000000000000000000000000000000000000000000000000000000000000000000000000000000000000000000000000000000000000000000000000000000000000000000000000000000000000000000000000000000000000000000000000000000000000000000000000000000000000000000000000000000000000000000000000000000000000000000000000000000000000000000000000000000000000000000000000000000000000000000000000000000000000000000000000#c7 < 6> read packet: $OK#9a < 861> send packet: $G0000000000000000000000000000000000000000000000000000000000000000000000000000000000000000000000000000000000000000000000000000000000000000000000000000000000000000000000000000000000000000000000000000000000000000000000000000000000000000000000000000000000000000000000000000000000000000000000000000000000000000000000000000000000000000000000000000000000000000000000000000000000000000000000000000000000000000000000000000000000000000000000000000000000000000000000000000000000000000000000000000000000000000000000000000000000000000000000000000000000000000000000000000000000000000000000000000000000000000000000000000000000000000000000000000000000000000000000000000000000000000000000000000000000000000000000000000000000000000000000000000000000000000000000000000000000000000000000000000000000000000000000000000000000000000000000000000000000000000000000000000000000000000#c7 < 6> read packet: $OK#9a < 861> send packet: $G0000000000000000000000000000000000000000000000000000000000000000000000000000000000000000000000000000000000000000000000000000000000000000000000000000000000000000000000000000000000000000000000000000000000000000000000000000000000000000000000000000000000000000000000000000000000000000000000000000000000000000000000000000000000000000000000000000000000000000000000000000000000000000000000000000000000000000000000000000000000000000000000000000000000000000000000000000000000000000000000000000000000000000000000000000000000000000000000000000000000000000000000000000000000000000000000000000000000000000000000000000000000000000000000000000000000000000000000000000000000000000000000000000000000000000000000000000000000000000000000000000000000000000000000000000000000000000000000000000000000000000000000000000000000000000000000000000000000000000000000000000000000000000#c7 < 6> read packet: $OK#9a < 861> send packet: $G0000000000000000000000000000000000000000000000000000000000000000000000000000000000000000000000000000000000000000000000000000000000000000000000000000000000000000000000000000000000000000000000000000000000000000000000000000000000000000000000000000000000000000000000000000000000000000000000000000000000000000000000000000000000000000000000000000000000000000000000000000000000000000000000000000000000000000000000000000000000000000000000000000000000000000000000000000000000000000000000000000000000000000000000000000000000000000000000000000000000000000000000000000000000000000000000000000000000000000000000000000000000000000000000000000000000000000000000000000000000000000000000000000000000000000000000000000000000000000000000000000000000000000000000000000000000000000000000000000000000000000000000000000000000000000000000000000000000000000000000000000000000000000#c7 < 6> read packet: $OK#9a < 861> send packet: $G0000000000000000000000000000000000000000000000000000000000000000000000000000000000000000000000000000000000000000000000000000000000000000000000000000000000000000000000000000000000000000000000000000000000000000000000000000000000000000000000000000000000000000000000000000000000000000000000000000000000000000000000000000000000000000000000000000000000000000000000000000000000000000000000000000000000000000000000000000000000000000000000000000000000000000000000000000000000000000000000000000000000000000000000000000000000000000000000000000000000000000000000000000000000000000000000000000000000000000000000000000000000000000000000000000000000000000000000000000000000000000000000000000000000000000000000000000000000000000000000000000000000000000000000000000000000000000000000000000000000000000000000000000000000000000000000000000000000000000000000000000000000000000#c7 < 6> read packet: $OK#9a < 861> send packet: $G0000000000000000000000000000000000000000000000000000000000000000000000000000000000000000000000000000000000000000000000000000000000000000000000000000000000000000000000000000000000000000000000000000000000000000000000000000000000000000000000000000000000000000000000000000000000000000000000000000000000000000000000000000000000000000000000000000000000000000000000000000000000000000000000000000000000000000000000000000000000000000000000000000000000000000000000000000000000000000000000000000000000000000000000000000000000000000000000000000000000000000000000000000000000000000000000000000000000000000000000000000000000000000000000000000000000000000000000000000000000000000000000000000000000000000000000000000000000000000000000000000000000000000000000000000000000000000000000000000000000000000000000000000000000000000000000000000000000000000000000000000000000000000#c7 < 6> read packet: $OK#9a < 861> send packet: $G0000000000000000000000000000000000000000000000000000000000000000000000000000000000000000000000000000000000000000000000000000000000000000000000000000000000000000000000000000000000000000000000000000000000000000000000000000000000000000000000000000000000000000000000000000000000000000000000000000000000000000000000000000000000000000000000000000000000000000000000000000000000000000000000000000000000000000000000000000000000000000000000000000000000000000000000000000000000000000000000000000000000000000000000000000000000000000000000000000000000000000000000000000000000000000000000000000000000000000000000000000000000000000000000000000000000000000000000000000000000000000000000000000000000000000000000000000000000000000000000000000000000000000000000000000000000000000000000000000000000000000000000000000000000000000000000000000000000000000000000000000000000000000#c7 < 6> read packet: $OK#9a < 861> send packet: $G0000000000000000000000000000000000000000000000000000000000000000000000000000000000000000000000000000000000000000000000000000000000000000000000000000000000000000000000000000000000000000000000000000000000000000000000000000000000000000000000000000000000000000000000000000000000000000000000000000000000000000000000000000000000000000000000000000000000000000000000000000000000000000000000000000000000000000000000000000000000000000000000000000000000000000000000000000000000000000000000000000000000000000000000000000000000000000000000000000000000000000000000000000000000000000000000000000000000000000000000000000000000000000000000000000000000000000000000000000000000000000000000000000000000000000000000000000000000000000000000000000000000000000000000000000000000000000000000000000000000000000000000000000000000000000000000000000000000000000000000000000000000000000#c7 < 6> read packet: $OK#9a < 861> send packet: $G0000000000000000000000000000000000000000000000000000000000000000000000000000000000000000000000000000000000000000000000000000000000000000000000000000000000000000000000000000000000000000000000000000000000000000000000000000000000000000000000000000000000000000000000000000000000000000000000000000000000000000000000000000000000000000000000000000000000000000000000000000000000000000000000000000000000000000000000000000000000000000000000000000000000000000000000000000000000000000000000000000000000000000000000000000000000000000000000000000000000000000000000000000000000000000000000000000000000000000000000000000000000000000000000000000000000000000000000000000000000000000000000000000000000000000000000000000000000000000000000000000000000000000000000000000000000000000000000000000000000000000000000000000000000000000000000000000000000000000000000000000000000000000#c7 < 6> read packet: $OK#9a < 861> send packet: $G0000000000000000000000000000000000000000000000000000000000000000000000000000000000000000000000000000000000000000000000000000000000000000000000000000000000000000000000000000000000000000000000000000000000000000000000000000000000000000000000000000000000000000000000000000000000000000000000000000000000000000000000000000000000000000000000000000000000000000000000000000000000000000000000000000000000000000000000000000000000000000000000000000000000000000000000000000000000000000000000000000000000000000000000000000000000000000000000000000000000000000000000000000000000000000000000000000000000000000000000000000000000000000000000000000000000000000000000000000000000000000000000000000000000000000000000000000000000000000000000000000000000000000000000000000000000000000000000000000000000000000000000000000000000000000000000000000000000000000000000000000000000000000#c7 < 6> read packet: $OK#9a < 861> send packet: $G0000000000000000000000000000000000000000000000000000000000000000000000000000000000000000000000000000000000000000000000000000000000000000000000000000000000000000000000000000000000000000000000000000000000000000000000000000000000000000000000000000000000000000000000000000000000000000000000000000000000000000000000000000000000000000000000000000000000000000000000000000000000000000000000000000000000000000000000000000000000000000000000000000000000000000000000000000000000000000000000000000000000000000000000000000000000000000000000000000000000000000000000000000000000000000000000000000000000000000000000000000000000000000000000000000000000000000000000000000000000000000000000000000000000000000000000000000000000000000000000000000000000000000000000000000000000000000000000000000000000000000000000000000000000000000000000000000000000000000000000000000000000000000#c7 < 6> read packet: $OK#9a < 861> send packet: $G0000000000000000000000000000000000000000000000000000000000000000000000000000000000000000000000000000000000000000000000000000000000000000000000000000000000000000000000000000000000000000000000000000000000000000000000000000000000000000000000000000000000000000000000000000000000000000000000000000000000000000000000000000000000000000000000000000000000000000000000000000000000000000000000000000000000000000000000000000000000000000000000000000000000000000000000000000000000000000000000000000000000000000000000000000000000000000000000000000000000000000000000000000000000000000000000000000000000000000000000000000000000000000000000000000000000000000000000000000000000000000000000000000000000000000000000000000000000000000000000000000000000000000000000000000000000000000000000000000000000000000000000000000000000000000000000000000000000000000000000000000000000000000#c7 < 6> read packet: $OK#9a < 861> send packet: $G0000000000000000000000000000000000000000000000000000000000000000000000000000000000000000000000000000000000000000000000000000000000000000000000000000000000000000000000000000000000000000000000000000000000000000000000000000000000000000000000000000000000000000000000000000000000000000000000000000000000000000000000000000000000000000000000000000000000000000000000000000000000000000000000000000000000000000000000000000000000000000000000000000000000000000000000000000000000000000000000000000000000000000000000000000000000000000000000000000000000000000000000000000000000000000000000000000000000000000000000000000000000000000000000000000000000000000000000000000000000000000000000000000000000000000000000000000000000000000000000000000000000000000000000000000000000000000000000000000000000000000000000000000000000000000000000000000000000000000000000000000000000000000#c7 < 6> read packet: $OK#9a < 861> send packet: $G0000000000000000000000000000000000000000000000000000000000000000000000000000000000000000000000000000000000000000000000000000000000000000000000000000000000000000000000000000000000000000000000000000000000000000000000000000000000000000000000000000000000000000000000000000000000000000000000000000000000000000000000000000000000000000000000000000000000000000000000000000000000000000000000000000000000000000000000000000000000000000000000000000000000000000000000000000000000000000000000000000000000000000000000000000000000000000000000000000000000000000000000000000000000000000000000000000000000000000000000000000000000000000000000000000000000000000000000000000000000000000000000000000000000000000000000000000000000000000000000000000000000000000000000000000000000000000000000000000000000000000000000000000000000000000000000000000000000000000000000000000000000000000#c7 < 6> read packet: $OK#9a < 861> send packet: $G0000000000000000000000000000000000000000000000000000000000000000000000000000000000000000000000000000000000000000000000000000000000000000000000000000000000000000000000000000000000000000000000000000000000000000000000000000000000000000000000000000000000000000000000000000000000000000000000000000000000000000000000000000000000000000000000000000000000000000000000000000000000000000000000000000000000000000000000000000000000000000000000000000000000000000000000000000000000000000000000000000000000000000000000000000000000000000000000000000000000000000000000000000000000000000000000000000000000000000000000000000000000000000000000000000000000000000000000000000000000000000000000000000000000000000000000000000000000000000000000000000000000000000000000000000000000000000000000000000000000000000000000000000000000000000000000000000000000000000000000000000000000000000#c7 < 6> read packet: $OK#9a < 5> send packet: $k#6b < 4> read packet: $#00 < 1> send packet: + history[1] tid=0x0307 < 1> send packet: + < 19> send packet: $QStartNoAckMode#b0 < 1> read packet: + < 6> read packet: $OK#9a < 1> send packet: + < 45> send packet: $qSupported:xmlRegisters=i386,arm,mips,arc#74 < 57> read packet: $qXfer:features:read+;PacketSize=3fff;QStartNoAckMode+#86 < 26> send packet: $QThreadSuffixSupported#e4 < 4> read packet: $#00 < 27> send packet: $QListThreadsInStopReply#21 < 4> read packet: $#00 < 13> send packet: $qHostInfo#9b < 28> read packet: $ptrsize:8;endian:little;#30 < 10> send packet: $vCont?#49 < 4> read packet: $#00 < 27> send packet: $qVAttachOrWaitSupported#38 < 4> read packet: $#00 < 23> send packet: $QEnableErrorStrings#8c < 6> read packet: $OK#9a < 16> send packet: $qProcessInfo#dc < 4> read packet: $#00 < 6> send packet: $qC#b4 < 7> read packet: $QC0#c4 < 16> send packet: $qfThreadInfo#bb < 5> read packet: $l#6c < 5> send packet: $?#3f < 7> read packet: $S02#b5 < 16> send packet: $qProcessInfo#dc < 4> read packet: $#00 < 41> send packet: $qXfer:features:read:target.xml:0,3ffe#af < 4> read packet: $#00 < 18> send packet: $qRegisterInfo0#72 < 4> read packet: $#00 < 16> send packet: $qfThreadInfo#bb < 5> read packet: $l#6c < 7> send packet: $Hg1#e0 < 6> read packet: $OK#9a < 6> send packet: $p0#a0 < 12> read packet: $00000000#80 < 16> send packet: $qProcessInfo#dc < 4> read packet: $#00 < 12> send packet: $qOffsets#4b < 4> read packet: $#00 < 26> send packet: $qStructuredDataPlugins#02 < 4> read packet: $#00 < 13> send packet: $qSymbol::#5b < 6> read packet: $OK#9a < 16> send packet: $qfThreadInfo#bb < 5> read packet: $l#6c < 16> send packet: $qfThreadInfo#bb < 5> read packet: $l#6c < 6> send packet: $pf#d6 < 12> read packet: $00000000#80 < 6> send packet: $pd#d4 < 12> read packet: $00000000#80 < 15> send packet: $P0=00000000#3d < 6> read packet: $OK#9a < 15> send packet: $P1=00000000#3e < 6> read packet: $OK#9a < 15> send packet: $P2=00000000#3f < 6> read packet: $OK#9a < 15> send packet: $P3=00000000#40 < 6> read packet: $OK#9a < 15> send packet: $P4=00000000#41 < 6> read packet: $OK#9a < 15> send packet: $P5=00000000#42 < 6> read packet: $OK#9a < 15> send packet: $P6=00000000#43 < 6> read packet: $OK#9a < 15> send packet: $P7=00000000#44 < 6> read packet: $OK#9a < 15> send packet: $P8=00000000#45 < 6> read packet: $OK#9a < 15> send packet: $P9=00000000#46 < 6> read packet: $OK#9a < 15> send packet: $Pa=00000000#6e < 6> read packet: $OK#9a < 15> send packet: $Pb=00000000#6f < 6> read packet: $OK#9a < 15> send packet: $Pc=00000000#70 < 6> read packet: $OK#9a < 15> send packet: $Pd=00000000#71 < 6> read packet: $OK#9a < 15> send packet: $Pe=00000000#72 < 6> read packet: $OK#9a < 15> send packet: $Pf=00000000#73 < 6> read packet: $OK#9a < 16> send packet: $P19=00000000#77 < 6> read packet: $OK#9a < 5> send packet: $k#6b < 4> read packet: $#00 LLDB library dir: /Users/buildslave/jenkins/workspace/lldb-cmake/lldb-build/bin LLDB import library dir: /Users/buildslave/jenkins/workspace/lldb-cmake/lldb-build/./lib libstdcxx tests will not be run because: Don't know how to build with libstdcxx on macosx Skipping following debug info categories: ['dwo']

Hide Details

-- Command Output (stderr): --

Hide Details

Session logs for test failures/errors/unexpected successes will go into directory '/Users/buildslave/jenkins/workspace/lldb-cmake/test/logs' Change dir to: /Users/buildslave/jenkins/workspace/lldb-cmake/llvm-project/lldb/test/API/functionalities/gdb_remote_client runCmd: settings clear -all output:

Hide Details

runCmd: settings set symbols.enable-external-lookup false output:

Hide Details

runCmd: settings set target.inherit-tcc true output:

Hide Details

runCmd: settings set target.auto-apply-fixits false output:

Hide Details

runCmd: settings set plugin.process.gdb-remote.packet-timeout 60 output:

Hide Details

runCmd: settings set symbols.clang-modules-cache-path "/Users/buildslave/jenkins/workspace/lldb-cmake/lldb-build/lldb-test-build.noindex/module-cache-lldb/lldb-api" output:

Hide Details

runCmd: settings set use-color false output:

Hide Details

runCmd: setting set target.prefer-dynamic-value no-dynamic-values output:

Hide Details

<bound method SBProcess.Kill of <lldb.SBProcess; proxy of <Swig Object of type 'lldb::SBProcess *' at 0x102c86750> >>: success

Hide Details

PASS: LLDB (/Users/buildslave/jenkins/workspace/lldb-cmake/lldb-build/bin/clang-x86_64) :: test_attach_fail (TestGDBRemoteClient.TestGDBRemoteClient) runCmd: settings clear -all output:

Hide Details

runCmd: settings set symbols.enable-external-lookup false output:

Hide Details

runCmd: settings set target.inherit-tcc true output:

Hide Details

runCmd: settings set target.auto-apply-fixits false output:

Hide Details

runCmd: settings set plugin.process.gdb-remote.packet-timeout 60 output:

Hide Details

runCmd: settings set symbols.clang-modules-cache-path "/Users/buildslave/jenkins/workspace/lldb-cmake/lldb-build/lldb-test-build.noindex/module-cache-lldb/lldb-api" output:

Hide Details

runCmd: settings set use-color false output:

Hide Details

runCmd: setting set target.prefer-dynamic-value no-dynamic-values output:

Hide Details

FAIL: LLDB (/Users/buildslave/jenkins/workspace/lldb-cmake/lldb-build/bin/clang-x86_64) :: test_connect (TestGDBRemoteClient.TestGDBRemoteClient) <bound method SBProcess.Kill of <lldb.SBProcess; proxy of <Swig Object of type 'lldb::SBProcess *' at 0x102b25bd0> >>: success

Hide Details

runCmd: settings clear -all output:

Hide Details

runCmd: settings set symbols.enable-external-lookup false output:

Hide Details

runCmd: settings set target.inherit-tcc true output:

Hide Details

runCmd: settings set target.auto-apply-fixits false output:

Hide Details

runCmd: settings set plugin.process.gdb-remote.packet-timeout 60 output:

Hide Details

runCmd: settings set symbols.clang-modules-cache-path "/Users/buildslave/jenkins/workspace/lldb-cmake/lldb-build/lldb-test-build.noindex/module-cache-lldb/lldb-api" output:

Hide Details

runCmd: settings set use-color false output:

Hide Details

runCmd: setting set target.prefer-dynamic-value no-dynamic-values output:

Hide Details

runCmd: log enable gdb-remote packets output:

Hide Details

<bound method SBProcess.Kill of <lldb.SBProcess; proxy of <Swig Object of type 'lldb::SBProcess *' at 0x102c86750> >>: success

Hide Details

PASS: LLDB (/Users/buildslave/jenkins/workspace/lldb-cmake/lldb-build/bin/clang-x86_64) :: test_launch_fail (TestGDBRemoteClient.TestGDBRemoteClient) runCmd: settings clear -all output:

Hide Details

runCmd: settings set symbols.enable-external-lookup false output:

Hide Details

runCmd: settings set target.inherit-tcc true output:

Hide Details

runCmd: settings set target.auto-apply-fixits false output:

Hide Details

runCmd: settings set plugin.process.gdb-remote.packet-timeout 60 output:

Hide Details

runCmd: settings set symbols.clang-modules-cache-path "/Users/buildslave/jenkins/workspace/lldb-cmake/lldb-build/lldb-test-build.noindex/module-cache-lldb/lldb-api" output:

Hide Details

runCmd: settings set use-color false output:

Hide Details

runCmd: setting set target.prefer-dynamic-value no-dynamic-values output:

Hide Details

Adding tearDown hook: self.addTearDownHook(lambda: self.runCmd("settings set plugin.process.gdb-remote.use-g-packet-for-reading false"))

Hide Details

Hide Details

<bound method SBProcess.Kill of <lldb.SBProcess; proxy of <Swig Object of type 'lldb::SBProcess *' at 0x102b25600> >>: success

Hide Details

Executing tearDown hook: self.addTearDownHook(lambda: self.runCmd("settings set plugin.process.gdb-remote.use-g-packet-for-reading false"))

Hide Details

Hide Details

runCmd: settings set plugin.process.gdb-remote.use-g-packet-for-reading false output:

Hide Details

PASS: LLDB (/Users/buildslave/jenkins/workspace/lldb-cmake/lldb-build/bin/clang-x86_64) :: test_read_registers_using_g_packets (TestGDBRemoteClient.TestGDBRemoteClient) runCmd: settings clear -all output:

Hide Details

runCmd: settings set symbols.enable-external-lookup false output:

Hide Details

runCmd: settings set target.inherit-tcc true output:

Hide Details

runCmd: settings set target.auto-apply-fixits false output:

Hide Details

runCmd: settings set plugin.process.gdb-remote.packet-timeout 60 output:

Hide Details

runCmd: settings set symbols.clang-modules-cache-path "/Users/buildslave/jenkins/workspace/lldb-cmake/lldb-build/lldb-test-build.noindex/module-cache-lldb/lldb-api" output:

Hide Details

runCmd: settings set use-color false output:

Hide Details

runCmd: setting set target.prefer-dynamic-value no-dynamic-values output:

Hide Details

<bound method SBProcess.Kill of <lldb.SBProcess; proxy of <Swig Object of type 'lldb::SBProcess *' at 0x102c86750> >>: success

Hide Details

PASS: LLDB (/Users/buildslave/jenkins/workspace/lldb-cmake/lldb-build/bin/clang-x86_64) :: test_read_registers_using_p_packets (TestGDBRemoteClient.TestGDBRemoteClient) runCmd: settings clear -all output:

Hide Details

runCmd: settings set symbols.enable-external-lookup false output:

Hide Details

runCmd: settings set target.inherit-tcc true output:

Hide Details

runCmd: settings set target.auto-apply-fixits false output:

Hide Details

runCmd: settings set plugin.process.gdb-remote.packet-timeout 60 output:

Hide Details

runCmd: settings set symbols.clang-modules-cache-path "/Users/buildslave/jenkins/workspace/lldb-cmake/lldb-build/lldb-test-build.noindex/module-cache-lldb/lldb-api" output:

Hide Details

runCmd: settings set use-color false output:

Hide Details

runCmd: setting set target.prefer-dynamic-value no-dynamic-values output:

Hide Details

<bound method SBProcess.Kill of <lldb.SBProcess; proxy of <Swig Object of type 'lldb::SBProcess *' at 0x102b25bd0> >>: success

Hide Details

PASS: LLDB (/Users/buildslave/jenkins/workspace/lldb-cmake/lldb-build/bin/clang-x86_64) :: test_write_registers_using_G_packets (TestGDBRemoteClient.TestGDBRemoteClient) runCmd: settings clear -all output:

Hide Details

runCmd: settings set symbols.enable-external-lookup false output:

Hide Details

runCmd: settings set target.inherit-tcc true output:

Hide Details

runCmd: settings set target.auto-apply-fixits false output:

Hide Details

runCmd: settings set plugin.process.gdb-remote.packet-timeout 60 output:

Hide Details

runCmd: settings set symbols.clang-modules-cache-path "/Users/buildslave/jenkins/workspace/lldb-cmake/lldb-build/lldb-test-build.noindex/module-cache-lldb/lldb-api" output:

Hide Details

runCmd: settings set use-color false output:

Hide Details

runCmd: setting set target.prefer-dynamic-value no-dynamic-values output:

Hide Details

<bound method SBProcess.Kill of <lldb.SBProcess; proxy of <Swig Object of type 'lldb::SBProcess *' at 0x102c86750> >>: success

Hide Details

PASS: LLDB (/Users/buildslave/jenkins/workspace/lldb-cmake/lldb-build/bin/clang-x86_64) :: test_write_registers_using_P_packets (TestGDBRemoteClient.TestGDBRemoteClient) Restore dir to: /Users/buildslave/jenkins/workspace/lldb-cmake/lldb-build/tools/lldb/test ====================================================================== FAIL: test_connect (TestGDBRemoteClient.TestGDBRemoteClient) Test connecting to a remote gdb server ---------------------------------------------------------------------- Traceback (most recent call last): File "/Users/buildslave/jenkins/workspace/lldb-cmake/llvm-project/lldb/packages/Python/lldbsuite/test/decorators.py", line 135, in wrapper return func(*args, **kwargs) File "/Users/buildslave/jenkins/workspace/lldb-cmake/llvm-project/lldb/test/API/functionalities/gdb_remote_client/TestGDBRemoteClient.py", line 18, in test_connect process = self.connect(target) File "/Users/buildslave/jenkins/workspace/lldb-cmake/llvm-project/lldb/test/API/functionalities/gdb_remote_client/gdbclientutils.py", line 519, in connect self.assertTrue(error.Success(), error.description) AssertionError: False is not True : failed to get reply to handshake packet Config=x86_64-/Users/buildslave/jenkins/workspace/lldb-cmake/lldb-build/bin/clang ---------------------------------------------------------------------- Ran 7 tests in 102.182s

Hide Details

RESULT: FAILED (6 passes, 1 failures, 0 errors, 0 skipped, 0 expected failures, 0 unexpected successes)

Hide Details

--

Hide Details

******************** PASS: lldb-unit :: Process/gdb-remote/./ProcessGdbRemoteTests/GDBRemoteCommunicationClientTest.GetModulesInfo (1357 of 2119) PASS: lldb-api :: commands/expression/persistent_variables/TestPersistentVariables.py (1358 of 2119) PASS: lldb-shell :: SymbolFile/NativePDB/ast-methods.cpp (1359 of 2119) PASS: lldb-shell :: ObjectFile/PECOFF/sections.yaml (1360 of 2119) PASS: lldb-shell :: ObjectFile/PECOFF/basic-info-arm.yaml (1361 of 2119) PASS: lldb-api :: commands/target/stop-hook/enable/TestTargetStopHookEnable.py (1362 of 2119) PASS: lldb-api :: functionalities/thread/concurrent_events/TestConcurrentCrashWithWatchpoint.py (1363 of 2119) PASS: lldb-api :: functionalities/breakpoint/breakpoint_by_line_and_column/TestBreakpointByLineAndColumn.py (1364 of 2119) PASS: lldb-unit :: Utility/./UtilityTests/ConstStringTest.UpdateMangledCounterpart (1365 of 2119) PASS: lldb-shell :: ObjectFile/ELF/aarch64-relocations.yaml (1366 of 2119) PASS: lldb-api :: python_api/lldbutil/process/TestPrintStackTraces.py (1367 of 2119) PASS: lldb-unit :: Utility/./UtilityTests/VASprintfTest.EncodingError (1368 of 2119) PASS: lldb-api :: python_api/sbstructureddata/TestStructuredDataAPI.py (1369 of 2119) PASS: lldb-shell :: SymbolFile/DWARF/find-function-regex.cpp (1370 of 2119) PASS: lldb-api :: api/multiple-targets/TestMultipleTargets.py (1371 of 2119) PASS: lldb-unit :: ScriptInterpreter/Python/./ScriptInterpreterPythonTests/PythonDataObjectsTest.TestPythonTupleInitializerList2 (1372 of 2119) PASS: lldb-unit :: Utility/./UtilityTests/FileSpecTest.Equal (1373 of 2119) PASS: lldb-unit :: Process/gdb-remote/./ProcessGdbRemoteTests/GDBRemoteClientBaseTest.SendContinueDelegateInterface (1374 of 2119) PASS: lldb-unit :: Utility/./UtilityTests/StreamTest.PutHex64ByteOrderBig (1375 of 2119) PASS: lldb-shell :: Quit/TestQuitExitCodeImplicit0.test (1376 of 2119) PASS: lldb-unit :: Utility/./UtilityTests/BinaryStreamTest.PutULEB128MaxValue (1377 of 2119) PASS: lldb-unit :: ObjectFile/PECOFF/./ObjectFilePECOFFTests/PECallFrameInfoTest.Chained_eh (1378 of 2119) PASS: lldb-api :: commands/expression/scoped_enums/TestScopedEnumType.py (1379 of 2119) PASS: lldb-unit :: Utility/./UtilityTests/VMRange.Comparison (1380 of 2119) PASS: lldb-unit :: Symbol/./SymbolTests/TestTypeSystemClang.TestGetTypeClassNested (1381 of 2119) PASS: lldb-unit :: Editline/./EditlineTests/EditlineTestFixture.EditlineReceivesSingleLineText (1382 of 2119) PASS: lldb-unit :: UnwindAssembly/x86/./UnwindAssemblyx86Tests/Testx86AssemblyInspectionEngine.TestPopEDI (1383 of 2119) PASS: lldb-unit :: Utility/./UtilityTests/ArgsTest.AppendArguments (1384 of 2119) PASS: lldb-api :: commands/frame/diagnose/inheritance/TestDiagnoseInheritance.py (1385 of 2119) PASS: lldb-api :: functionalities/gdb_remote_client/TestRegDefinitionInParts.py (1386 of 2119) PASS: lldb-api :: functionalities/thread/concurrent_events/TestConcurrentWatchBreak.py (1387 of 2119) PASS: lldb-unit :: Utility/./UtilityTests/StreamTest.AddressRangeEmptyRange (1388 of 2119) PASS: lldb-api :: functionalities/asan/TestReportData.py (1389 of 2119) PASS: lldb-shell :: SymbolFile/DWARF/debug_loc-aslr.s (1390 of 2119) PASS: lldb-unit :: debugserver/./debugserverTests/RNBSocket.AnyListen (1391 of 2119) PASS: lldb-unit :: Utility/./UtilityTests/OptionsWithRawTest.EmptySuffixSingleWhitespace (1392 of 2119) PASS: lldb-unit :: Utility/./UtilityTests/StreamTest.AddressPrefixAndSuffix (1393 of 2119) PASS: lldb-unit :: Expression/./ExpressionTests/CppModuleConfigurationTest.UnrelatedLibrary (1394 of 2119) UNSUPPORTED: lldb-api :: tools/lldb-server/signal-filtering/TestGdbRemote_QPassSignals.py (1395 of 2119) PASS: lldb-shell :: Commands/command-thread-select.test (1396 of 2119) PASS: lldb-shell :: SymbolFile/DWARF/clang-ast-from-dwarf-objc-property.m (1397 of 2119) PASS: lldb-unit :: Utility/./UtilityTests/XcodeSDKTest.ParseTest (1398 of 2119) PASS: lldb-api :: commands/expression/diagnostics/TestExprDiagnostics.py (1399 of 2119) UNSUPPORTED: lldb-shell :: Unwind/unwind-plan-dwarf-dump.test (1400 of 2119) PASS: lldb-unit :: Process/minidump/./LLDBMinidumpTests/MinidumpParserTest.GetThreadContext_x86_32_wow64 (1401 of 2119) PASS: lldb-api :: commands/expression/import-std-module/conflicts/TestStdModuleWithConflicts.py (1402 of 2119) PASS: lldb-unit :: Utility/./UtilityTests/StringListTest.CopyListEmpty (1403 of 2119) PASS: lldb-unit :: Utility/./UtilityTests/CompletionRequest.Constructor (1404 of 2119) PASS: lldb-api :: lang/cpp/accelerator-table/TestCPPAccelerator.py (1405 of 2119) PASS: lldb-unit :: Utility/./UtilityTests/EnvironmentTest.EnvpConversion (1406 of 2119) PASS: lldb-unit :: Utility/./UtilityTests/VASprintfTest.NoBufferResize (1407 of 2119) PASS: lldb-unit :: Symbol/./SymbolTests/PostfixExpression.ParseFPOProgram (1408 of 2119) PASS: lldb-api :: functionalities/archives/TestBSDArchives.py (1409 of 2119) PASS: lldb-unit :: Utility/./UtilityTests/ScalarTest.Division (1410 of 2119) PASS: lldb-unit :: Utility/./UtilityTests/EnvironmentTest.EnvpConstruction (1411 of 2119) PASS: lldb-shell :: ObjectFile/PECOFF/section-types.yaml (1412 of 2119) PASS: lldb-api :: python_api/exprpath_synthetic/TestExprPathSynthetic.py (1413 of 2119) PASS: lldb-shell :: ObjectFile/ELF/PT_LOAD.yaml (1414 of 2119) PASS: lldb-api :: functionalities/data-formatter/stringprinter/TestStringPrinter.py (1415 of 2119) PASS: lldb-unit :: Host/./HostTests/SocketTest.TCPGetConnectURI (1416 of 2119) PASS: lldb-unit :: Utility/./UtilityTests/FileSpecTest.Match (1417 of 2119) PASS: lldb-api :: api/listeners/TestListener.py (1418 of 2119) PASS: lldb-api :: macosx/save_crashlog/TestSaveCrashlog.py (1419 of 2119) PASS: lldb-unit :: Utility/./UtilityTests/RangeTest.DefaultConstructor (1420 of 2119) PASS: lldb-unit :: Utility/./UtilityTests/StringListTest.SetSize (1421 of 2119) PASS: lldb-shell :: ObjectFile/ELF/compressed-sections.yaml (1422 of 2119) PASS: lldb-unit :: UnwindAssembly/x86/./UnwindAssemblyx86Tests/Testx86AssemblyInspectionEngine.TestPushR15 (1423 of 2119) PASS: lldb-api :: functionalities/breakpoint/cpp/TestCPPBreakpointLocations.py (1424 of 2119) PASS: lldb-api :: lang/objc/foundation/TestConstStrings.py (1425 of 2119) PASS: lldb-unit :: Utility/./UtilityTests/ArchSpecTest.TripleComponentsWereSpecified (1426 of 2119) PASS: lldb-shell :: SymbolFile/DWARF/debug-types-dwarf5.s (1427 of 2119) PASS: lldb-unit :: Utility/./UtilityTests/ListenerTest.GetEventWait (1428 of 2119) PASS: lldb-unit :: Process/gdb-remote/./ProcessGdbRemoteTests/GDBRemoteCommunicationClientTest.GetQOffsets (1429 of 2119) PASS: lldb-unit :: Utility/./UtilityTests/StreamTest.Indent (1430 of 2119) PASS: lldb-unit :: Symbol/./SymbolTests/TestTypeSystemClang.TestNotDeletingUserCopyCstrDueToMoveCStr (1431 of 2119) PASS: lldb-api :: functionalities/non-overlapping-index-variable-i/TestIndexVariable.py (1432 of 2119) PASS: lldb-unit :: UnwindAssembly/x86/./UnwindAssemblyx86Tests/Testx86AssemblyInspectionEngine.TestPopR15 (1433 of 2119) PASS: lldb-unit :: Utility/./UtilityTests/StringListTest.AppendList (1434 of 2119) PASS: lldb-api :: functionalities/breakpoint/breakpoint_command/TestBreakpointCommandsFromPython.py (1435 of 2119) PASS: lldb-unit :: SymbolFile/DWARF/./SymbolFileDWARFTests/SymbolFileDWARFTests.TestAbbrevValidAttrNullForm (1436 of 2119) PASS: lldb-shell :: Commands/command-script-import.test (1437 of 2119) PASS: lldb-unit :: Utility/./UtilityTests/ScalarTest.RightShiftOperator (1438 of 2119) PASS: lldb-unit :: Utility/./UtilityTests/LogChannelTest.Disable (1439 of 2119) PASS: lldb-unit :: Utility/./UtilityTests/VMRange.ContainsAddr (1440 of 2119) PASS: lldb-unit :: Utility/./UtilityTests/StringListTest.ForRangeEmpty (1441 of 2119) PASS: lldb-unit :: UnwindAssembly/x86/./UnwindAssemblyx86Tests/Testx86AssemblyInspectionEngine.TestSubESP (1442 of 2119) PASS: lldb-api :: commands/process/launch/TestProcessLaunch.py (1443 of 2119) PASS: lldb-api :: functionalities/mtc/simple/TestMTCSimple.py (1444 of 2119) PASS: lldb-shell :: Unwind/trap_frame_sym_ctx.test (1445 of 2119) PASS: lldb-unit :: Process/minidump/./LLDBMinidumpTests/MinidumpParserTest.GetThreadContext_x86_32 (1446 of 2119) PASS: lldb-api :: lang/cpp/signed_types/TestSignedTypes.py (1447 of 2119) PASS: lldb-unit :: UnwindAssembly/x86/./UnwindAssemblyx86Tests/Testx86AssemblyInspectionEngine.TestSimplei386ugmented (1448 of 2119) PASS: lldb-api :: macosx/profile_vrs_detach/TestDetachVrsProfile.py (1449 of 2119) PASS: lldb-unit :: Target/./TargetTests/MemoryRegionInfoTest.Formatv (1450 of 2119) PASS: lldb-shell :: Driver/TestConvenienceVariables.test (1451 of 2119) PASS: lldb-api :: commands/expression/import-std-module/deque-dbg-info-content/TestDbgInfoContentDequeFromStdModule.py (1452 of 2119) XFAIL: lldb-shell :: Register/x86-64-ymm-write.test (1453 of 2119) PASS: lldb-api :: source-manager/TestSourceManager.py (1454 of 2119) PASS: lldb-unit :: Language/Highlighting/./HighlighterTests/HighlighterTest.FallbackHighlighter (1455 of 2119) PASS: lldb-api :: commands/expression/import-std-module/unique_ptr-dbg-info-content/TestUniquePtrDbgInfoContent.py (1456 of 2119) PASS: lldb-unit :: Utility/./UtilityTests/ScalarTest.Promotion (1457 of 2119) PASS: lldb-api :: commands/expression/class_template_specialization_empty_pack/TestClassTemplateSpecializationParametersHandling.py (1458 of 2119) PASS: lldb-api :: functionalities/inferior-crashing/TestInferiorCrashing.py (1459 of 2119) UNSUPPORTED: lldb-shell :: Unwind/eh-frame-small-fde.test (1460 of 2119) PASS: lldb-api :: commands/log/basic/TestLogging.py (1461 of 2119) PASS: lldb-api :: python_api/sbenvironment/TestSBEnvironment.py (1462 of 2119) PASS: lldb-api :: functionalities/inferior-crashing/TestInferiorCrashingStep.py (1463 of 2119) UNSUPPORTED: lldb-api :: lang/objc/objc-dynamic-value/TestObjCDynamicValue.py (1464 of 2119) PASS: lldb-unit :: UnwindAssembly/x86/./UnwindAssemblyx86Tests/Testx86AssemblyInspectionEngine.TestPushEDX (1465 of 2119) PASS: lldb-api :: commands/expression/xvalue/TestXValuePrinting.py (1466 of 2119) PASS: lldb-api :: types/TestRecursiveTypes.py (1467 of 2119) PASS: lldb-unit :: Symbol/./SymbolTests/TestTypeSystemClang.TestGetEnumIntegerTypeInvalid (1468 of 2119) PASS: lldb-api :: functionalities/data-formatter/cstring-utf8-summary/TestCstringUnicode.py (1469 of 2119) PASS: lldb-shell :: Driver/TestNoUseColor.test (1470 of 2119) PASS: lldb-unit :: Utility/./UtilityTests/ConstStringTest.CompareStringRef (1471 of 2119) PASS: lldb-unit :: Utility/./UtilityTests/Flags.GetBitSize (1472 of 2119) PASS: lldb-unit :: Utility/./UtilityTests/StringExtractorTest.GetHexBytesAvail_OddPair2 (1473 of 2119) PASS: lldb-api :: functionalities/tail_call_frames/thread_step_out_or_return/TestSteppingOutWithArtificialFrames.py (1474 of 2119) PASS: lldb-shell :: Breakpoint/debug_rnglist_rlestartend.test (1475 of 2119) PASS: lldb-unit :: Utility/./UtilityTests/ProcessInfoTest.Constructor (1476 of 2119) UNSUPPORTED: lldb-api :: functionalities/process_save_core/TestProcessSaveCore.py (1477 of 2119) PASS: lldb-shell :: SymbolFile/Breakpad/line-table-edgecases.test (1478 of 2119) PASS: lldb-unit :: tools/lldb-server/tests/./LLDBServerTests/StandardStartupTest.TestStopReplyContainsThreadPcs (1479 of 2119) UNSUPPORTED: lldb-shell :: Register/x86-gp-read.test (1480 of 2119) PASS: lldb-api :: functionalities/rerun/TestRerun.py (1481 of 2119) PASS: lldb-unit :: Utility/./UtilityTests/ScalarTest.LongLongAssigmentOperator (1482 of 2119) PASS: lldb-unit :: Target/./TargetTests/ExecutionContextTest.GetByteOrderTarget (1483 of 2119) PASS: lldb-api :: functionalities/set-data/TestSetData.py (1484 of 2119) PASS: lldb-unit :: Utility/./UtilityTests/EventTest.DumpEventDataBytes (1485 of 2119) PASS: lldb-api :: functionalities/tail_call_frames/disambiguate_paths_to_common_sink/TestDisambiguatePathsToCommonSink.py (1486 of 2119) PASS: lldb-api :: commands/process/attach-resume/TestAttachResume.py (1487 of 2119) PASS: lldb-shell :: Commands/command-target-modules-dump-sections.yaml (1488 of 2119) PASS: lldb-api :: commands/expression/namespace_local_var_same_name_cpp_and_c/TestNamespaceLocalVarSameNameCppAndC.py (1489 of 2119) PASS: lldb-unit :: Platform/./LLDBPlatformTests/PlatformAppleSimulatorTest.TestSimHasSimEnvionament (1490 of 2119) PASS: lldb-api :: commands/watchpoints/watchpoint_on_vectors/TestValueOfVectorVariable.py (1491 of 2119) PASS: lldb-shell :: ExecControl/StopHook/stop-hook.test (1492 of 2119) PASS: lldb-unit :: Utility/./UtilityTests/BinaryStreamTest.PutSLEB128NineBytes (1493 of 2119) PASS: lldb-shell :: ObjectFile/wasm/unified-debug-sections.yaml (1494 of 2119) UNSUPPORTED: lldb-api :: lang/objc/rdar-12408181/TestRdar12408181.py (1495 of 2119) PASS: lldb-api :: commands/platform/process/list/TestProcessList.py (1496 of 2119) PASS: lldb-unit :: Utility/./UtilityTests/OptionsWithRawTest.UnterminatedQuote (1497 of 2119) UNSUPPORTED: lldb-api :: macosx/macCatalystAppMacOSFramework/TestMacCatalystAppWithMacOSFramework.py (1498 of 2119) PASS: lldb-api :: functionalities/data-formatter/data-formatter-stl/libcxx/unique_ptr/TestDataFormatterLibcxxUniquePtr.py (1499 of 2119) PASS: lldb-shell :: Minidump/memory-region-from-module.yaml (1500 of 2119) PASS: lldb-api :: functionalities/breakpoint/global_constructor/TestBreakpointInGlobalConstructor.py (1501 of 2119) PASS: lldb-unit :: UnwindAssembly/PPC64/./PPC64InstEmulationTests/TestPPC64InstEmulation.TestMediumFunction (1502 of 2119) PASS: lldb-api :: commands/expression/dollar-in-variable/TestDollarInVariable.py (1503 of 2119) PASS: lldb-api :: lang/objc/objc-builtin-types/TestObjCBuiltinTypes.py (1504 of 2119) UNSUPPORTED: lldb-shell :: ScriptInterpreter/Lua/convenience_variables.test (1505 of 2119) PASS: lldb-unit :: ObjectFile/ELF/./ObjectFileELFTests/ObjectFileELFTest.GetSymtab_NoSymEntryPointArmAddressClass (1506 of 2119) UNSUPPORTED: lldb-api :: lang/c/unicode/TestUnicodeSymbols.py (1507 of 2119) PASS: lldb-unit :: Utility/./UtilityTests/RangeTest.NotEqual (1508 of 2119) PASS: lldb-api :: lang/objc/objc-new-syntax/TestObjCNewSyntaxLiteral.py (1509 of 2119) PASS: lldb-api :: python_api/lldbutil/iter/TestRegistersIterator.py (1510 of 2119) PASS: lldb-unit :: Utility/./UtilityTests/StringListTest.PopBack (1511 of 2119) PASS: lldb-api :: functionalities/multidebugger_commands/TestMultipleDebuggersCommands.py (1512 of 2119) PASS: lldb-api :: types/TestFloatTypes.py (1513 of 2119) PASS: lldb-api :: functionalities/data-formatter/data-formatter-objc/TestDataFormatterObjNSException.py (1514 of 2119) PASS: lldb-api :: lang/cpp/template-function/TestTemplateFunctions.py (1515 of 2119) PASS: lldb-unit :: Process/minidump/./LLDBMinidumpTests/MinidumpParserTest.GetMiscInfo_no_stream (1516 of 2119) PASS: lldb-unit :: Platform/Android/./AdbClientTests/AdbClientTest.CreateByDeviceId (1517 of 2119) PASS: lldb-api :: lang/c/modules/TestCModules.py (1518 of 2119) PASS: lldb-unit :: Utility/./UtilityTests/LogChannelEnabledTest.LogVerboseThread (1519 of 2119) PASS: lldb-shell :: VSCode/TestOptions.test (1520 of 2119) PASS: lldb-unit :: Utility/./UtilityTests/StringListTest.JoinMultiCharSeparator (1521 of 2119) PASS: lldb-unit :: DataFormatter/./LLDBFormatterTests/TypeMatcherTests.GetMatchStringExactName (1522 of 2119) PASS: lldb-api :: commands/command/delete/TestCommandDelete.py (1523 of 2119) PASS: lldb-api :: functionalities/data-formatter/data-formatter-objc/TestDataFormatterObjCNSDate.py (1524 of 2119) PASS: lldb-shell :: ObjectFile/ELF/basic-info.yaml (1525 of 2119) UNSUPPORTED: lldb-shell :: SymbolFile/DWARF/split-dwarf-expression-eval-bug.cpp (1526 of 2119) PASS: lldb-unit :: debugserver/./debugserverTests/RNBSocket.LoopBackConnectIPv4 (1527 of 2119) PASS: lldb-shell :: Driver/TestSingleQuote.test (1528 of 2119) PASS: lldb-unit :: Expression/./ExpressionTests/DiagnosticManagerTest.AppendMessageNoDiag (1529 of 2119) PASS: lldb-unit :: Core/./LLDBCoreTests/MangledTest.ResultForBlockInvocation (1530 of 2119) PASS: lldb-unit :: Utility/./UtilityTests/StringLexerTest.GetUnlexed (1531 of 2119) UNSUPPORTED: lldb-api :: functionalities/tty/TestTerminal.py (1532 of 2119) PASS: lldb-unit :: Utility/./UtilityTests/GeneratorTest.GetOrCreate (1533 of 2119) PASS: lldb-api :: functionalities/paths/TestPaths.py (1534 of 2119) PASS: lldb-api :: lang/c/step-target/TestStepTarget.py (1535 of 2119) PASS: lldb-unit :: Symbol/./SymbolTests/TestTypeSystemClang.TestGetEnumIntegerTypeUnexpectedType (1536 of 2119) PASS: lldb-shell :: Breakpoint/dummy-target.test (1537 of 2119) UNSUPPORTED: lldb-shell :: SymbolFile/PDB/expressions.test (1538 of 2119) PASS: lldb-api :: macosx/nslog/TestDarwinNSLogOutput.py (1539 of 2119) PASS: lldb-api :: lang/cpp/nested-class-other-compilation-unit/TestNestedClassWithParentInAnotherCU.py (1540 of 2119) PASS: lldb-unit :: Target/./TargetTests/ExecutionContextTest.GetByteOrder (1541 of 2119) PASS: lldb-unit :: ScriptInterpreter/Python/./ScriptInterpreterPythonTests/PythonDataObjectsTest.TestPythonBoolean (1542 of 2119) PASS: lldb-api :: linux/builtin_trap/TestBuiltinTrap.py (1543 of 2119) PASS: lldb-api :: python_api/watchpoint/TestWatchpointIter.py (1544 of 2119) PASS: lldb-api :: python_api/disassemble-raw-data/TestDisassemble_VST1_64.py (1545 of 2119) PASS: lldb-shell :: Reproducer/TestPythonImport.test (1546 of 2119) PASS: lldb-api :: functionalities/breakpoint/breakpoint_locations/TestBreakpointLocations.py (1547 of 2119) PASS: lldb-api :: functionalities/data-formatter/summary-string-onfail/Test-rdar-9974002.py (1548 of 2119) PASS: lldb-api :: lang/cpp/dynamic-value/TestCppValueCast.py (1549 of 2119) PASS: lldb-unit :: Process/gdb-remote/./ProcessGdbRemoteTests/GDBRemoteClientBaseTest.SendContinueAndAsyncSignal (1550 of 2119) PASS: lldb-unit :: Utility/./UtilityTests/StatusTest.ErrorCodeConstructor (1551 of 2119) PASS: lldb-api :: functionalities/gdb_remote_client/TestNoWatchpointSupportInfo.py (1552 of 2119) PASS: lldb-shell :: SymbolFile/DWARF/inline-function-address-shared.test (1553 of 2119) PASS: lldb-api :: lang/cpp/this_class_type_mixing/TestThisClassTypeMixing.py (1554 of 2119) PASS: lldb-api :: functionalities/thread/exit_during_break/TestExitDuringBreak.py (1555 of 2119) PASS: lldb-api :: tools/lldb-server/TestGdbRemoteHostInfo.py (1556 of 2119) PASS: lldb-api :: functionalities/pre_run_dylibs/TestPreRunDylibs.py (1557 of 2119) PASS: lldb-unit :: Utility/./UtilityTests/ConstStringTest.NullAndEmptyStates (1558 of 2119) PASS: lldb-api :: lang/objc/objc-struct-argument/TestObjCStructArgument.py (1559 of 2119) PASS: lldb-api :: python_api/sbvalue_const_addrof/TestSBValueConstAddrOf.py (1560 of 2119) PASS: lldb-api :: commands/process/signal/TestProcessSignal.py (1561 of 2119) PASS: lldb-shell :: SymbolFile/NativePDB/break-by-function.cpp (1562 of 2119) PASS: lldb-api :: functionalities/gdb_remote_client/TestRecognizeBreakpoint.py (1563 of 2119) PASS: lldb-api :: commands/platform/basic/TestPlatformCommand.py (1564 of 2119) PASS: lldb-api :: functionalities/tail_call_frames/cross_dso/TestCrossDSOTailCalls.py (1565 of 2119) PASS: lldb-unit :: Process/gdb-remote/./ProcessGdbRemoteTests/GDBRemoteCommunicationServerTest.SendErrorResponse_StringError (1566 of 2119) PASS: lldb-api :: functionalities/optimized_code/TestNoASanExceptionAfterEvalOP_piece.py (1567 of 2119) PASS: lldb-api :: commands/gui/invalid-args/TestInvalidArgsGui.py (1568 of 2119) PASS: lldb-api :: functionalities/postmortem/netbsd-core/TestNetBSDCore.py (1569 of 2119) PASS: lldb-unit :: Utility/./UtilityTests/OptionsWithRawTest.EmptyArgsOnlySuffix (1570 of 2119) PASS: lldb-shell :: ScriptInterpreter/Python/sb_address_exception.test (1571 of 2119) PASS: lldb-api :: commands/frame/var/TestFrameVar.py (1572 of 2119) PASS: lldb-api :: lang/cpp/function_refs/TestFunctionRefs.py (1573 of 2119) UNSUPPORTED: lldb-shell :: SymbolFile/target-symbols-add-unwind.test (1574 of 2119) PASS: lldb-api :: lang/c/enum_types/TestEnumTypes.py (1575 of 2119) PASS: lldb-unit :: Utility/./UtilityTests/CompletionRequest.TryCompleteCurrentArgMode (1576 of 2119) PASS: lldb-api :: functionalities/value_md5_crash/TestValueMD5Crash.py (1577 of 2119) PASS: lldb-unit :: Platform/./LLDBPlatformTests/PlatformDarwinTest.TestParseVersionBuildDir (1578 of 2119) PASS: lldb-api :: functionalities/return-value/TestReturnValue.py (1579 of 2119) UNSUPPORTED: lldb-shell :: SymbolFile/PDB/udt-layout.test (1580 of 2119) PASS: lldb-api :: iohandler/resize/TestIOHandlerResize.py (1581 of 2119) PASS: lldb-shell :: BuildScript/compiler-full-path.test (1582 of 2119) PASS: lldb-unit :: Host/./HostTests/SocketTest.DomainListenConnectAccept (1583 of 2119) PASS: lldb-api :: commands/command/script/TestCommandScript.py (1584 of 2119) PASS: lldb-unit :: Utility/./UtilityTests/LogChannelEnabledTest.LogThread (1585 of 2119) PASS: lldb-unit :: Utility/./UtilityTests/StringListTest.LongestCommonPrefixSingleElement (1586 of 2119) UNSUPPORTED: lldb-shell :: ScriptInterpreter/Lua/quit.test (1587 of 2119) PASS: lldb-unit :: ScriptInterpreter/Python/./ScriptInterpreterPythonTests/PythonDataObjectsTest.TestOwnedReferences (1588 of 2119) PASS: lldb-api :: functionalities/data-formatter/builtin-formats/TestBuiltinFormats.py (1589 of 2119) UNSUPPORTED: lldb-api :: functionalities/unwind/ehframe/TestEhFrameUnwind.py (1590 of 2119) PASS: lldb-unit :: Utility/./UtilityTests/RangeTest.Union (1591 of 2119) PASS: lldb-api :: python_api/name_lookup/TestNameLookup.py (1592 of 2119) PASS: lldb-api :: lang/objc/objc-ivar-stripped/TestObjCIvarStripped.py (1593 of 2119) PASS: lldb-unit :: Utility/./UtilityTests/RangeTest.Equal (1594 of 2119) PASS: lldb-unit :: Language/Highlighting/./HighlighterTests/HighlighterTest.ClangTrailingBackslashBeforeNewline (1595 of 2119) PASS: lldb-api :: functionalities/tsan/thread_leak/TestTsanThreadLeak.py (1596 of 2119) PASS: lldb-unit :: Utility/./UtilityTests/StringListTest.LongestCommonPrefixEmpty (1597 of 2119) PASS: lldb-api :: macosx/find-dsym/bundle-with-dot-in-filename/TestBundleWithDotInFilename.py (1598 of 2119) PASS: lldb-shell :: SymbolFile/NativePDB/function-types-builtins.cpp (1599 of 2119) PASS: lldb-unit :: Utility/./UtilityTests/RangeDataVector.FindEntryThatContains (1600 of 2119) PASS: lldb-unit :: Utility/./UtilityTests/OptionsWithRawTest.ArgsButNoDelimiter (1601 of 2119) PASS: lldb-unit :: Utility/./UtilityTests/ArgsTest.TestSingleArgWithQuotedSpace (1602 of 2119) PASS: lldb-api :: python_api/lldbutil/frame/TestFrameUtils.py (1603 of 2119) PASS: lldb-api :: functionalities/load_unload/TestLoadUnload.py (1604 of 2119) PASS: lldb-unit :: Process/minidump/./LLDBMinidumpTests/MinidumpParserTest.GetArchitecture (1605 of 2119) PASS: lldb-api :: functionalities/abbreviation/TestCommonShortSpellings.py (1606 of 2119) PASS: lldb-unit :: Utility/./UtilityTests/StringExtractorTest.GetU64LittleEndian (1607 of 2119) PASS: lldb-unit :: Utility/./UtilityTests/StatusTest.ErrorConversion (1608 of 2119) PASS: lldb-api :: functionalities/data-formatter/data-formatter-objc/TestDataFormatterObjCNSURL.py (1609 of 2119) PASS: lldb-unit :: Utility/./UtilityTests/OptionsWithRawTest.WhitespaceInput (1610 of 2119) PASS: lldb-api :: python_api/module_section/TestModuleAndSection.py (1611 of 2119) PASS: lldb-shell :: ObjectFile/PECOFF/disassemble-thumb.yaml (1612 of 2119) PASS: lldb-api :: lang/c/shared_lib/TestSharedLib.py (1613 of 2119) PASS: lldb-api :: functionalities/tail_call_frames/cross_object/TestCrossObjectTailCalls.py (1614 of 2119) PASS: lldb-unit :: Target/./TargetTests/ModuleCacheTest.GetAndPutStrangeHostname (1615 of 2119) PASS: lldb-unit :: Host/./HostTests/FileSystemTest.Resolve (1616 of 2119) PASS: lldb-api :: functionalities/thread/concurrent_events/TestConcurrentSignalNWatchNBreak.py (1617 of 2119) UNSUPPORTED: lldb-shell :: Register/x86-64-ymm16-read.test (1618 of 2119) PASS: lldb-api :: commands/frame/select/TestFrameSelect.py (1619 of 2119) PASS: lldb-api :: functionalities/data-formatter/data-formatter-objc/nsindexpath/TestDataFormatterNSIndexPath.py (1620 of 2119) PASS: lldb-unit :: Utility/./UtilityTests/ArgsTest.EscapeLLDBCommandArgument (1621 of 2119) PASS: lldb-unit :: Utility/./UtilityTests/ArchSpecTest.MergeFromMachOUnknown (1622 of 2119) PASS: lldb-api :: functionalities/lazy-loading/TestLazyLoading.py (1623 of 2119) PASS: lldb-unit :: Process/gdb-remote/./ProcessGdbRemoteTests/GDBRemoteClientBaseTest.SendContinueAndInterrupt2PacketBug (1624 of 2119) PASS: lldb-shell :: SymbolFile/DWARF/dwarf5-index-is-used.cpp (1625 of 2119) PASS: lldb-api :: python_api/formatters/TestFormattersSBAPI.py (1626 of 2119) PASS: lldb-unit :: Target/./TargetTests/ModuleCacheTest.GetAndPut (1627 of 2119) PASS: lldb-unit :: Utility/./UtilityTests/SerializationRountripTest.SerializeDeserializeCStringArrayNullptrElem (1628 of 2119) PASS: lldb-api :: python_api/value/change_values/TestChangeValueAPI.py (1629 of 2119) PASS: lldb-shell :: ObjectFile/ELF/PT_LOAD-overlap-section.yaml (1630 of 2119) PASS: lldb-unit :: UnwindAssembly/x86/./UnwindAssemblyx86Tests/Testx86AssemblyInspectionEngine.TestPushEDI (1631 of 2119) PASS: lldb-shell :: SymbolFile/DWARF/dwarf5_locations.s (1632 of 2119) PASS: lldb-unit :: Utility/./UtilityTests/StringListTest.AppendListCStringArrayEmpty (1633 of 2119) PASS: lldb-unit :: Core/./LLDBCoreTests/SourceFileCache.FindSourceFileFound (1634 of 2119) PASS: lldb-unit :: Expression/./ExpressionTests/ClangExpressionDeclMapTest.TestUnknownIdentifierLookup (1635 of 2119) PASS: lldb-unit :: Utility/./UtilityTests/StreamTest.PutPtr (1636 of 2119) PASS: lldb-unit :: Utility/./UtilityTests/BroadcasterTest.EventTypeHasListeners (1637 of 2119) PASS: lldb-unit :: UnwindAssembly/x86/./UnwindAssemblyx86Tests/Testx86AssemblyInspectionEngine.TestAddRSP (1638 of 2119) PASS: lldb-shell :: SymbolFile/Breakpad/line-table-mixed-path-styles.test (1639 of 2119) UNSUPPORTED: lldb-api :: functionalities/data-formatter/data-formatter-stl/libstdcpp/map/TestDataFormatterStdMap.py (1640 of 2119) PASS: lldb-api :: functionalities/tsan/thread_numbers/TestTsanThreadNumbers.py (1641 of 2119) PASS: lldb-api :: functionalities/thread/concurrent_events/TestConcurrentCrashWithBreak.py (1642 of 2119) PASS: lldb-unit :: Utility/./UtilityTests/RegisterValueTest.GetSet8 (1643 of 2119) PASS: lldb-unit :: Utility/./UtilityTests/BinaryStreamTest.PutSLEB128FiveBytes (1644 of 2119) PASS: lldb-api :: functionalities/thread/concurrent_events/TestConcurrentDelayedCrashWithBreakpointSignal.py (1645 of 2119) PASS: lldb-unit :: Utility/./UtilityTests/ConstStringTest.FromMidOfBufferStringRef (1646 of 2119) PASS: lldb-api :: functionalities/completion/TestCompletion.py (1647 of 2119) PASS: lldb-api :: functionalities/memory/cache/TestMemoryCache.py (1648 of 2119) PASS: lldb-api :: lang/cpp/chained-calls/TestCppChainedCalls.py (1649 of 2119) PASS: lldb-api :: python_api/breakpoint/TestBreakpointAPI.py (1650 of 2119) PASS: lldb-api :: functionalities/breakpoint/breakpoint_by_file_colon_line/TestBreakpointByFileColonLine.py (1651 of 2119) PASS: lldb-api :: functionalities/thread/concurrent_events/TestConcurrentDelayedCrashWithBreakpointWatchpoint.py (1652 of 2119) UNSUPPORTED: lldb-api :: functionalities/longjmp/TestLongjmp.py (1653 of 2119) UNSUPPORTED: lldb-shell :: SymbolFile/DWARF/debug-types-expressions.test (1654 of 2119) PASS: lldb-api :: commands/frame/diagnose/array/TestArray.py (1655 of 2119) PASS: lldb-api :: functionalities/gdb_remote_client/TestNoGPacketSupported.py (1656 of 2119) PASS: lldb-unit :: Utility/./UtilityTests/RecordReplayTest.InstrumentedBar (1657 of 2119) PASS: lldb-api :: functionalities/gdb_remote_client/TestWasm.py (1658 of 2119) PASS: lldb-api :: functionalities/breakpoint/serialize/TestBreakpointSerialization.py (1659 of 2119) PASS: lldb-shell :: SymbolFile/Breakpad/stack-cfi-arm.yaml (1660 of 2119) PASS: lldb-api :: functionalities/gdb_remote_client/TestThreadSelectionBug.py (1661 of 2119) PASS: lldb-api :: commands/expression/import-std-module/unique_ptr/TestUniquePtrFromStdModule.py (1662 of 2119) PASS: lldb-unit :: Host/./HostTests/SocketTest.UDPGetConnectURI (1663 of 2119) PASS: lldb-unit :: Utility/./UtilityTests/ArgsTest.TestSingleQuotedArgWithSpace (1664 of 2119) UNSUPPORTED: lldb-api :: functionalities/darwin_log/filter/regex/message/TestDarwinLogFilterRegexMessage.py (1665 of 2119) PASS: lldb-api :: lang/c/vla/TestVLA.py (1666 of 2119) PASS: lldb-api :: commands/target/basic/TestTargetCommand.py (1667 of 2119) PASS: lldb-shell :: ObjectFile/Breakpad/discontiguous-sections.test (1668 of 2119) PASS: lldb-shell :: Expr/TestIRMemoryMap.test (1669 of 2119) PASS: lldb-api :: functionalities/breakpoint/objc/TestObjCBreakpoints.py (1670 of 2119) PASS: lldb-shell :: ObjectFile/ELF/netbsd-exec-8.99.30-amd64.yaml (1671 of 2119) PASS: lldb-api :: api/check_public_api_headers/TestPublicAPIHeaders.py (1672 of 2119) PASS: lldb-shell :: ObjectFile/ELF/netbsd-core-amd64.test (1673 of 2119) PASS: lldb-shell :: ObjectFile/Breakpad/uuid-matching-mac.test (1674 of 2119) PASS: lldb-unit :: ObjectFile/MachO/./ObjectFileMachOTests/ObjectFileMachOTest.ModuleFromSharedCacheInfo (1675 of 2119) UNSUPPORTED: lldb-shell :: Register/x86-ymm-write.test (1676 of 2119) PASS: lldb-unit :: Process/gdb-remote/./ProcessGdbRemoteTests/GDBRemoteCommunicationServerTest.SendErrorResponse_ErrorNumber (1677 of 2119) PASS: lldb-unit :: SymbolFile/DWARF/./SymbolFileDWARFTests/SymbolFileDWARFTests.TestAbilitiesForDWARF (1678 of 2119) PASS: lldb-api :: lang/objc/foundation/TestSymbolTable.py (1679 of 2119) PASS: lldb-unit :: Symbol/./SymbolTests/Type.CompilerContextPattern (1680 of 2119) PASS: lldb-unit :: Utility/./UtilityTests/DataExtractorTest.GetMaxU64 (1681 of 2119) PASS: lldb-unit :: Utility/./UtilityTests/RangeTest.ContainsEndInclusive (1682 of 2119) PASS: lldb-api :: commands/expression/call-function/TestCallBuiltinFunction.py (1683 of 2119) PASS: lldb-api :: lang/cpp/virtual-functions/TestCppVirtualFunctions.py (1684 of 2119) PASS: lldb-unit :: Process/gdb-remote/./ProcessGdbRemoteTests/GDBRemoteCommunicationClientTest.SendStartTracePacket (1685 of 2119) PASS: lldb-api :: python_api/value/linked_list/TestValueAPILinkedList.py (1686 of 2119) PASS: lldb-api :: lang/objc/variadic_methods/TestVariadicMethods.py (1687 of 2119) UNSUPPORTED: lldb-api :: benchmarks/startup/TestStartupDelays.py (1688 of 2119) PASS: lldb-unit :: Utility/./UtilityTests/StreamTest.ShiftOperatorStrings (1689 of 2119) UNSUPPORTED: lldb-shell :: Process/Windows/exception_access_violation.cpp (1690 of 2119) PASS: lldb-shell :: SymbolFile/DWARF/find-qualified-variable.cpp (1691 of 2119) PASS: lldb-unit :: Utility/./UtilityTests/StatusTest.Formatv (1692 of 2119) PASS: lldb-shell :: Settings/TestStopCommandSourceOnError.test (1693 of 2119) PASS: lldb-unit :: Utility/./UtilityTests/StringExtractorTest.GetNameColonValueNoColon (1694 of 2119) PASS: lldb-unit :: UnwindAssembly/x86/./UnwindAssemblyx86Tests/Testx86AssemblyInspectionEngine.TestPushR14 (1695 of 2119) PASS: lldb-api :: commands/expression/dont_allow_jit/TestAllowJIT.py (1696 of 2119) PASS: lldb-unit :: Expression/./ExpressionTests/CppModuleConfigurationTest.LibCppV2 (1697 of 2119) PASS: lldb-api :: functionalities/data-formatter/dump_dynamic/TestDumpDynamic.py (1698 of 2119) PASS: lldb-unit :: Symbol/./SymbolTests/TestTypeSystemClang.TestGetEnumIntegerTypeBasicTypes (1699 of 2119) PASS: lldb-api :: commands/expression/context-object/TestContextObject.py (1700 of 2119) PASS: lldb-unit :: Language/Highlighting/./HighlighterTests/HighlighterTest.ClangStringLiterals (1701 of 2119) PASS: lldb-api :: lang/c/array_types/TestArrayTypes.py (1702 of 2119) PASS: lldb-unit :: Utility/./UtilityTests/StreamTest.PutChar (1703 of 2119) PASS: lldb-unit :: Utility/./UtilityTests/OptionsWithRawTest.WhitespaceSuffix (1704 of 2119) PASS: lldb-api :: commands/expression/options/TestExprOptions.py (1705 of 2119) PASS: lldb-api :: functionalities/data-formatter/data-formatter-stl/libcxx/vbool/TestDataFormatterLibcxxVBool.py (1706 of 2119) PASS: lldb-unit :: Utility/./UtilityTests/StringListTest.Clear (1707 of 2119) PASS: lldb-shell :: SymbolFile/DWARF/dwp.s (1708 of 2119) PASS: lldb-unit :: ObjectFile/Breakpad/./ObjectFileBreakpadTests/FuncRecord.parse (1709 of 2119) PASS: lldb-shell :: Unwind/eh-frame-dwarf-unwind.test (1710 of 2119) PASS: lldb-unit :: Expression/./ExpressionTests/CppModuleConfigurationTest.Linux (1711 of 2119) PASS: lldb-unit :: Utility/./UtilityTests/BinaryStreamTest.PutULEB128One (1712 of 2119) PASS: lldb-unit :: Utility/./UtilityTests/StringExtractorTest.GetHexBytes (1713 of 2119) PASS: lldb-unit :: UnwindAssembly/x86/./UnwindAssemblyx86Tests/Testx86AssemblyInspectionEngine.TestStackRealign8BitDisp_i386 (1714 of 2119) PASS: lldb-unit :: UnwindAssembly/PPC64/./PPC64InstEmulationTests/TestPPC64InstEmulation.TestSimpleFunction (1715 of 2119) PASS: lldb-shell :: Breakpoint/jitbp_elf.test (1716 of 2119) PASS: lldb-unit :: Utility/./UtilityTests/RangeDataVector.FindEntryThatContains_Overlap (1717 of 2119) PASS: lldb-unit :: Symbol/./SymbolTests/TestTypeSystemClang.AddMethodToObjCObjectType (1718 of 2119) PASS: lldb-unit :: Utility/./UtilityTests/AnsiTerminal.Empty (1719 of 2119) PASS: lldb-unit :: Utility/./UtilityTests/ScalarTest.Scalar_512 (1720 of 2119) PASS: lldb-unit :: Utility/./UtilityTests/SerializationRountripTest.SerializeDeserializeCStringArray (1721 of 2119) PASS: lldb-unit :: Utility/./UtilityTests/StringListTest.Assignment (1722 of 2119) PASS: lldb-api :: lang/c/inlines/TestRedefinitionsInInlines.py (1723 of 2119) PASS: lldb-api :: functionalities/data-formatter/typedef_array/TestTypedefArray.py (1724 of 2119) PASS: lldb-unit :: Process/minidump/./LLDBMinidumpTests/MinidumpParserTest.InvalidMinidump (1725 of 2119) PASS: lldb-api :: functionalities/data-formatter/data-formatter-objc/TestDataFormatterObjCKVO.py (1726 of 2119) UNSUPPORTED: lldb-api :: python_api/event/TestEvents.py (1727 of 2119) PASS: lldb-api :: tools/lldb-server/TestGdbRemoteKill.py (1728 of 2119) PASS: lldb-api :: functionalities/dead-strip/TestDeadStrip.py (1729 of 2119) PASS: lldb-unit :: Utility/./UtilityTests/StreamTest.AddressPrefix (1730 of 2119) PASS: lldb-api :: commands/expression/persistent_types/TestPersistentTypes.py (1731 of 2119) PASS: lldb-shell :: SymbolFile/DWARF/array-sizes.s (1732 of 2119) PASS: lldb-api :: commands/watchpoints/watchpoint_count/TestWatchpointCount.py (1733 of 2119) PASS: lldb-unit :: Utility/./UtilityTests/FileSpecTest.EqualSeparator (1734 of 2119) PASS: lldb-api :: lang/cpp/overloaded-functions/TestOverloadedFunctions.py (1735 of 2119) PASS: lldb-shell :: SymbolFile/DWARF/debug_ranges-missing-section.s (1736 of 2119) PASS: lldb-api :: functionalities/exec/TestExec.py (1737 of 2119) PASS: lldb-unit :: Utility/./UtilityTests/CompletionRequest.ShiftArguments (1738 of 2119) PASS: lldb-unit :: Utility/./UtilityTests/StringExtractorTest.GetHexU8_Underflow (1739 of 2119) PASS: lldb-api :: lang/cpp/unicode-literals/TestUnicodeLiterals.py (1740 of 2119) PASS: lldb-unit :: Target/./TargetTests/ModuleCacheTest.GetAndPutUuidExists (1741 of 2119) PASS: lldb-unit :: Utility/./UtilityTests/ScalarTest.SetValueFromData (1742 of 2119) PASS: lldb-unit :: Process/minidump/./LLDBMinidumpTests/MinidumpParserTest.GetMemoryRegionInfoFromMemory64List (1743 of 2119) PASS: lldb-unit :: Expression/./ExpressionTests/DiagnosticManagerTest.GetStringBasic (1744 of 2119) PASS: lldb-api :: commands/apropos/basic/TestApropos.py (1745 of 2119) UNSUPPORTED: lldb-api :: functionalities/data-formatter/data-formatter-stl/libstdcpp/iterator/TestDataFormatterStdIterator.py (1746 of 2119) PASS: lldb-unit :: Process/gdb-remote/./ProcessGdbRemoteTests/GDBRemoteCommunicationClientTest.GetModulesInfoInvalidResponse (1747 of 2119) UNSUPPORTED: lldb-api :: functionalities/thread/thread_specific_break_plus_condition/TestThreadSpecificBpPlusCondition.py (1748 of 2119) PASS: lldb-api :: commands/gui/viewlarge/TestGuiViewLarge.py (1749 of 2119) PASS: lldb-unit :: Utility/./UtilityTests/StringExtractorTest.GetHexBytes_OddPair (1750 of 2119) PASS: lldb-unit :: Expression/./ExpressionTests/CppModuleConfigurationTest.AmbiguousCLib (1751 of 2119) PASS: lldb-api :: lang/objc/ivar-IMP/TestObjCiVarIMP.py (1752 of 2119) PASS: lldb-unit :: Utility/./UtilityTests/StringExtractorTest.GetHexU8_InvalidHex (1753 of 2119) PASS: lldb-unit :: SymbolFile/DWARF/./SymbolFileDWARFTests/DWARFASTParserClangTests.EnsureAllDIEsInDeclContextHaveBeenParsedParsesOnlyMatchingEntries (1754 of 2119) UNSUPPORTED: lldb-api :: functionalities/data-formatter/data-formatter-stl/libstdcpp/vector/TestDataFormatterStdVector.py (1755 of 2119) PASS: lldb-unit :: Utility/./UtilityTests/ProcessInstanceInfoList.Yaml (1756 of 2119) PASS: lldb-unit :: UnwindAssembly/x86/./UnwindAssemblyx86Tests/Testx86AssemblyInspectionEngine.TestPopR13 (1757 of 2119) PASS: lldb-unit :: Process/minidump/./LLDBMinidumpTests/MinidumpParserTest.GetArchitectureWindows (1758 of 2119) PASS: lldb-api :: functionalities/gdb_remote_client/TestStopPCs.py (1759 of 2119) PASS: lldb-api :: commands/gui/breakpoints/TestGuiBreakpoints.py (1760 of 2119) PASS: lldb-api :: lang/cpp/scope/TestCppScope.py (1761 of 2119) PASS: lldb-shell :: Breakpoint/debug_rnglistx_rlex.test (1762 of 2119) PASS: lldb-shell :: SymbolFile/DWARF/DW_TAG_basic_type_DW_ATE_UTF_nonC.ll (1763 of 2119) PASS: lldb-api :: sanity/TestModuleCacheSanity.py (1764 of 2119) PASS: lldb-unit :: Utility/./UtilityTests/StringExtractorTest.GetHexBytesAvail_Underflow (1765 of 2119) PASS: lldb-shell :: ObjectFile/MachO/symtab.yaml (1766 of 2119) PASS: lldb-unit :: Host/./HostTests/HostInfoTest.GetXcodeSDK (1767 of 2119) PASS: lldb-api :: commands/expression/namespace_local_var_same_name_obj_c/TestNamespaceLocalVarSameNameObjC.py (1768 of 2119) PASS: lldb-unit :: Language/Highlighting/./HighlighterTests/HighlighterTest.ClangComments (1769 of 2119) PASS: lldb-unit :: Expression/./ExpressionTests/DWARFExpression.DW_OP_pick (1770 of 2119) PASS: lldb-unit :: Utility/./UtilityTests/StringExtractorTest.GetHexBytesAvail (1771 of 2119) PASS: lldb-unit :: Utility/./UtilityTests/StreamTeeTest.CopyConstructor (1772 of 2119) PASS: lldb-shell :: SymbolFile/dissassemble-entry-point.s (1773 of 2119) PASS: lldb-api :: functionalities/data-formatter/data-formatter-stl/libstdcpp/unique_ptr/invalid/TestDataFormatterInvalidStdUniquePtr.py (1774 of 2119) PASS: lldb-api :: tools/lldb-vscode/step/TestVSCode_step.py (1775 of 2119) PASS: lldb-api :: lang/cpp/breakpoint_in_member_func_w_non_primitive_params/TestBreakpointInMemberFuncWNonPrimitiveParams.py (1776 of 2119) PASS: lldb-unit :: Utility/./UtilityTests/DataExtractorTest.UncommonAddressSize (1777 of 2119) PASS: lldb-unit :: Utility/./UtilityTests/ConstStringTest.MangledCounterpart (1778 of 2119) PASS: lldb-unit :: UnwindAssembly/x86/./UnwindAssemblyx86Tests/Testx86AssemblyInspectionEngine.Test64bitFramelessBigStackFrame (1779 of 2119) PASS: lldb-unit :: Utility/./UtilityTests/XcodeSDKTest.FindXcodeContentsDirectoryInPath (1780 of 2119) UNSUPPORTED: lldb-api :: functionalities/darwin_log/filter/exact_match/activity-chain/TestDarwinLogFilterMatchActivityChain.py (1781 of 2119) PASS: lldb-api :: commands/expression/unicode-in-variable/TestUnicodeInVariable.py (1782 of 2119) PASS: lldb-unit :: API/./APITests/SBCommandInterpreterTest.MultiWordCommand (1783 of 2119) PASS: lldb-unit :: Utility/./UtilityTests/StreamTest.SetIndentLevel (1784 of 2119) PASS: lldb-api :: macosx/find-dsym/deep-bundle/TestDeepBundle.py (1785 of 2119) PASS: lldb-api :: functionalities/data-formatter/data-formatter-stl/libcxx/bitset/TestDataFormatterLibcxxBitset.py (1786 of 2119) PASS: lldb-unit :: Utility/./UtilityTests/StringListTest.InsertStringAtIndexStart (1787 of 2119) PASS: lldb-shell :: Reproducer/TestSynchronous.test (1788 of 2119) PASS: lldb-unit :: Host/./HostTests/NativeProcessProtocolTest.ReadCStringFromMemory (1789 of 2119) PASS: lldb-unit :: Utility/./UtilityTests/RegularExpression.Empty (1790 of 2119) PASS: lldb-unit :: Utility/./UtilityTests/DataExtractorTest.GetCStr (1791 of 2119) PASS: lldb-unit :: ScriptInterpreter/Python/./ScriptInterpreterPythonTests/PythonDataObjectsTest.TestBorrowedReferences (1792 of 2119) PASS: lldb-unit :: Utility/./UtilityTests/StreamTest.PutBytesAsRawHex8ToLittleEndian (1793 of 2119) UNSUPPORTED: lldb-shell :: Register/x86-64-zmm-write.test (1794 of 2119) PASS: lldb-shell :: ObjectFile/PECOFF/export-dllfunc.yaml (1795 of 2119) PASS: lldb-unit :: Utility/./UtilityTests/StreamTest.PutHex32ByteOrderBig (1796 of 2119) PASS: lldb-api :: tools/lldb-server/TestGdbRemoteProcessInfo.py (1797 of 2119) PASS: lldb-unit :: ScriptInterpreter/Python/./ScriptInterpreterPythonTests/PythonDataObjectsTest.TestPythonFile (1798 of 2119) PASS: lldb-unit :: Utility/./UtilityTests/BinaryStreamTest.PutULEB128Zero (1799 of 2119) PASS: lldb-shell :: Commands/CommandScriptImmediateOutput/CommandScriptImmediateOutputFile.test (1800 of 2119) PASS: lldb-unit :: Utility/./UtilityTests/UriParserTest.LongPath (1801 of 2119) PASS: lldb-api :: commands/expression/po_verbosity/TestPoVerbosity.py (1802 of 2119) PASS: lldb-unit :: Core/./LLDBCoreTests/SourceFileCache.FindSourceFileNotFound (1803 of 2119) PASS: lldb-unit :: Utility/./UtilityTests/UriParserTest.MinimalPort (1804 of 2119) UNSUPPORTED: lldb-api :: functionalities/thread/multi_break/TestMultipleBreakpoints.py (1805 of 2119) PASS: lldb-unit :: Utility/./UtilityTests/ProcessInstanceInfoMatch.Name (1806 of 2119) PASS: lldb-api :: python_api/sbdata/TestSBData.py (1807 of 2119) PASS: lldb-shell :: SymbolFile/DWARF/debug_aranges-empty-section.s (1808 of 2119) PASS: lldb-api :: lang/objc/real-definition/TestRealDefinition.py (1809 of 2119) PASS: lldb-shell :: Reproducer/TestDSYM.test (1810 of 2119) PASS: lldb-unit :: Host/./HostTests/SocketTest.UDPConnect (1811 of 2119) PASS: lldb-unit :: Utility/./UtilityTests/VMRange.Ordering (1812 of 2119) PASS: lldb-unit :: DataFormatter/./LLDBFormatterTests/StringPrinterTests.SwiftUTF8 (1813 of 2119) PASS: lldb-shell :: ObjectFile/ELF/minidebuginfo-corrupt-xz.yaml (1814 of 2119) PASS: lldb-unit :: Utility/./UtilityTests/RangeDataVector.FindEntryIndexesThatContain (1815 of 2119) PASS: lldb-shell :: Quit/TestQuitExitCodeTooManyArgs.test (1816 of 2119) PASS: lldb-unit :: Utility/./UtilityTests/DataExtractorTest.GetCStrUnterminated (1817 of 2119) PASS: lldb-unit :: Utility/./UtilityTests/RangeTest.ClearWithStarAddress (1818 of 2119) PASS: lldb-api :: tools/lldb-vscode/stackTrace/TestVSCode_stackTrace.py (1819 of 2119) PASS: lldb-unit :: Utility/./UtilityTests/StringLexerTest.HasAtLeast (1820 of 2119) PASS: lldb-shell :: ObjectFile/ELF/base-address.yaml (1821 of 2119) PASS: lldb-unit :: Signals/./SignalsTests/UnixSignalsTest.VersionChange (1822 of 2119) PASS: lldb-shell :: Process/TestEnvironment.test (1823 of 2119) PASS: lldb-unit :: Utility/./UtilityTests/FileSpecTest.OperatorBool (1824 of 2119) PASS: lldb-api :: lang/c/register_variables/TestRegisterVariables.py (1825 of 2119) PASS: lldb-shell :: SymbolFile/DWARF/debug_rnglists-dwo.s (1826 of 2119) PASS: lldb-api :: commands/process/attach/TestProcessAttach.py (1827 of 2119) UNSUPPORTED: lldb-shell :: SymbolFile/PDB/variables-locations.test (1828 of 2119) PASS: lldb-shell :: ObjectFile/MachO/lc_build_version_notools.yaml (1829 of 2119) PASS: lldb-api :: functionalities/thread/concurrent_events/TestConcurrentDelaySignalBreak.py (1830 of 2119) PASS: lldb-unit :: ObjectFile/ELF/./ObjectFileELFTests/ObjectFileELFTest.SectionsResolveConsistently (1831 of 2119) PASS: lldb-api :: python_api/thread/TestThreadAPI.py (1832 of 2119) PASS: lldb-unit :: UnwindAssembly/x86/./UnwindAssemblyx86Tests/Testx86AssemblyInspectionEngine.TestSpillRegToStackViaMOVi386 (1833 of 2119) PASS: lldb-unit :: Utility/./UtilityTests/StreamTest.PutMaxHex64ByteOrderBig (1834 of 2119) UNSUPPORTED: lldb-api :: functionalities/breakpoint/hardware_breakpoints/write_memory_with_hw_breakpoint/TestWriteMemoryWithHWBreakpoint.py (1835 of 2119) PASS: lldb-unit :: Utility/./UtilityTests/GeneratorTest.YamlMultiProvider (1836 of 2119) PASS: lldb-unit :: Expression/./ExpressionTests/DWARFExpression.DW_OP_unknown (1837 of 2119) PASS: lldb-api :: functionalities/breakpoint/auto_continue/TestBreakpointAutoContinue.py (1838 of 2119) PASS: lldb-unit :: Symbol/./SymbolTests/PostfixExpression.ParseOneExpression (1839 of 2119) PASS: lldb-unit :: DataFormatter/./LLDBFormatterTests/StringPrinterTests.CxxASCII (1840 of 2119) PASS: lldb-api :: commands/expression/persist_objc_pointeetype/TestPersistObjCPointeeType.py (1841 of 2119) PASS: lldb-unit :: Utility/./UtilityTests/Flags.Reset (1842 of 2119) PASS: lldb-api :: functionalities/recursion/TestValueObjectRecursion.py (1843 of 2119) UNSUPPORTED: lldb-api :: commands/expression/completion-crash-invalid-iterator/TestInvalidIteratorCompletionCrash.py (1844 of 2119) PASS: lldb-unit :: Utility/./UtilityTests/AnsiTerminal.KnownPrefix (1845 of 2119) PASS: lldb-unit :: Language/Highlighting/./HighlighterTests/HighlighterTest.Keywords (1846 of 2119) PASS: lldb-unit :: ScriptInterpreter/Python/./ScriptInterpreterPythonTests/PythonDataObjectsTest.TestPythonTupleInitializerList (1847 of 2119) PASS: lldb-unit :: ScriptInterpreter/Python/./ScriptInterpreterPythonTests/PythonDataObjectsTest.TestPythonListToStructuredList (1848 of 2119) PASS: lldb-api :: functionalities/abbreviation/TestAbbreviations.py (1849 of 2119) PASS: lldb-api :: lang/cpp/gmodules/TestWithModuleDebugging.py (1850 of 2119) PASS: lldb-unit :: Utility/./UtilityTests/PassiveReplayTest.InstrumentedFoo (1851 of 2119) PASS: lldb-api :: macosx/DBGSourcePathRemapping/TestDSYMSourcePathRemapping.py (1852 of 2119) PASS: lldb-shell :: SymbolFile/symbol-binding.test (1853 of 2119) PASS: lldb-shell :: Minidump/Windows/find-module.test (1854 of 2119) PASS: lldb-unit :: Utility/./UtilityTests/ArchSpecTest.YAML (1855 of 2119) PASS: lldb-api :: tools/lldb-server/TestLldbGdbServer.py (1856 of 2119) PASS: lldb-unit :: Symbol/./SymbolTests/TestTypeSystemClang.TestFunctionTemplateInRecordConstruction (1857 of 2119) PASS: lldb-unit :: Interpreter/./InterpreterTests/CompletionTest.DirCompletionUsername (1858 of 2119) UNSUPPORTED: lldb-shell :: ObjectFile/ELF/minidebuginfo-set-and-hit-breakpoint.test (1859 of 2119) PASS: lldb-api :: lang/objcxx/hide-runtime-values/TestObjCXXHideRuntimeValues.py (1860 of 2119) PASS: lldb-unit :: Utility/./UtilityTests/UUIDTest.RelationalOperators (1861 of 2119) UNSUPPORTED: lldb-shell :: Register/aarch64-gp-read.test (1862 of 2119) PASS: lldb-shell :: Reproducer/TestCrash.test (1863 of 2119) PASS: lldb-api :: functionalities/tail_call_frames/ambiguous_tail_call_seq1/TestAmbiguousTailCallSeq1.py (1864 of 2119) PASS: lldb-api :: tools/lldb-vscode/module/TestVSCode_module.py (1865 of 2119) PASS: lldb-unit :: Utility/./UtilityTests/XcodeSDKTest.GetCanonicalNameAndConstruct (1866 of 2119) PASS: lldb-api :: macosx/duplicate-archive-members/TestDuplicateMembers.py (1867 of 2119) PASS: lldb-api :: commands/expression/completion-in-lambda-and-unnamed-class/TestCompletionInLambdaAndUnnamedClass.py (1868 of 2119) PASS: lldb-shell :: SymbolFile/DWARF/DW_OP_piece-struct.s (1869 of 2119) PASS: lldb-api :: lang/c/local_types/TestUseClosestType.py (1870 of 2119) PASS: lldb-api :: tools/lldb-vscode/coreFile/TestVSCode_coreFile.py (1871 of 2119) PASS: lldb-api :: commands/expression/import-std-module/list-dbg-info-content/TestDbgInfoContentListFromStdModule.py (1872 of 2119) PASS: lldb-api :: commands/frame/diagnose/bad-reference/TestBadReference.py (1873 of 2119) UNSUPPORTED: lldb-api :: tools/intel-features/intel-pt/test/TestIntelPTSimpleBinary.py (1874 of 2119) PASS: lldb-unit :: Utility/./UtilityTests/StreamTest.PutHex32ByteOrderLittle (1875 of 2119) PASS: lldb-api :: macosx/order/TestOrderFile.py (1876 of 2119) PASS: lldb-api :: functionalities/data-formatter/data-formatter-stl/libcxx/optional/TestDataFormatterLibcxxOptional.py (1877 of 2119) PASS: lldb-unit :: Utility/./UtilityTests/StringListTest.GetSize (1878 of 2119) PASS: lldb-api :: functionalities/float-display/TestFloatDisplay.py (1879 of 2119) PASS: lldb-unit :: Utility/./UtilityTests/OptionsWithRawTest.ArgsButNoLeadingDash (1880 of 2119) PASS: lldb-unit :: Expression/./ExpressionTests/ClangHostTest.ComputeClangResourceDirectory (1881 of 2119) PASS: lldb-api :: commands/expression/import-std-module/stack/TestStackFromStdModule.py (1882 of 2119) PASS: lldb-api :: functionalities/postmortem/elf-core/TestLinuxCore.py (1883 of 2119) PASS: lldb-api :: lang/cpp/virtual-overload/TestVirtualOverload.py (1884 of 2119) PASS: lldb-unit :: SymbolFile/NativePDB/./SymbolFileNativePDBTests/PDBFPOProgramToDWARFExpressionTests.MultipleDependentAssignments (1885 of 2119) PASS: lldb-api :: functionalities/data-formatter/data-formatter-stl/libcxx/tuple/TestDataFormatterLibcxxTuple.py (1886 of 2119) PASS: lldb-shell :: Commands/command-disassemble.s (1887 of 2119) PASS: lldb-api :: functionalities/backticks/TestBackticksWithoutATarget.py (1888 of 2119) PASS: lldb-unit :: Utility/./UtilityTests/BinaryStreamTest.PutULEB128FourBytes (1889 of 2119) PASS: lldb-unit :: Symbol/./SymbolTests/TestClangASTImporter.CompleteFwdDeclWithOtherOrigin (1890 of 2119) PASS: lldb-unit :: Utility/./UtilityTests/RangeDataVector.CustomSort (1891 of 2119) PASS: lldb-unit :: UnwindAssembly/x86/./UnwindAssemblyx86Tests/Testx86AssemblyInspectionEngine.TestPushRBX (1892 of 2119) PASS: lldb-unit :: Utility/./UtilityTests/ArchSpecTest.OperatorBool (1893 of 2119) PASS: lldb-unit :: Utility/./UtilityTests/LogChannelTest.List (1894 of 2119) PASS: lldb-api :: lang/objc/objc-baseclass-sbtype/TestObjCBaseClassSBType.py (1895 of 2119) PASS: lldb-shell :: Settings/TestModuleCacheSanity.test (1896 of 2119) PASS: lldb-shell :: Minidump/Windows/broken-unwind.test (1897 of 2119) PASS: lldb-unit :: Utility/./UtilityTests/RangeTest.DoesAdjoinOrIntersect (1898 of 2119) PASS: lldb-api :: functionalities/thread/concurrent_events/TestConcurrentTwoBreakpointsOneWatchpoint.py (1899 of 2119) PASS: lldb-unit :: Core/./LLDBCoreTests/UniqueCStringMap.NoDefaultConstructor (1900 of 2119) PASS: lldb-unit :: Language/Highlighting/./HighlighterTests/HighlighterTest.HighlighterSelectionType (1901 of 2119) PASS: lldb-api :: functionalities/thread/concurrent_events/TestConcurrentWatchpointDelayWatchpointOneBreakpoint.py (1902 of 2119) PASS: lldb-api :: functionalities/tail_call_frames/disambiguate_call_site/TestDisambiguateCallSite.py (1903 of 2119) UNSUPPORTED: lldb-shell :: ScriptInterpreter/Lua/command_script_import.test (1904 of 2119) PASS: lldb-api :: macosx/universal/TestUniversal.py (1905 of 2119) PASS: lldb-api :: commands/expression/import-std-module/vector-bool/TestVectorBoolFromStdModule.py (1906 of 2119) PASS: lldb-shell :: SymbolFile/DWARF/limit-debug-info.s (1907 of 2119) PASS: lldb-unit :: Utility/./UtilityTests/StringLexerTest.Peek (1908 of 2119) PASS: lldb-unit :: Disassembler/./DisassemblerTests/TestArm64Disassembly.TestArmv81Instruction (1909 of 2119) PASS: lldb-unit :: Utility/./UtilityTests/StringListTest.LongestCommonPrefix (1910 of 2119) PASS: lldb-unit :: Utility/./UtilityTests/DataExtractorTest.GetULEB128_bit63 (1911 of 2119) PASS: lldb-api :: arm/emulation/TestEmulations.py (1912 of 2119) PASS: lldb-unit :: Utility/./UtilityTests/TimeoutTest.Format (1913 of 2119) PASS: lldb-api :: functionalities/data-formatter/data-formatter-objc/TestDataFormatterObjCPlain.py (1914 of 2119) PASS: lldb-api :: functionalities/signal/handle-abrt/TestHandleAbort.py (1915 of 2119) PASS: lldb-unit :: Utility/./UtilityTests/UriParserTest.SchemeHostSeparator3 (1916 of 2119) PASS: lldb-api :: python_api/findvalue_duplist/TestSBFrameFindValue.py (1917 of 2119) PASS: lldb-api :: lang/c/unions/TestUnionMembers.py (1918 of 2119) PASS: lldb-api :: commands/expression/invalid-args/TestInvalidArgsExpression.py (1919 of 2119) PASS: lldb-api :: commands/command/script/import/TestImport.py (1920 of 2119) PASS: lldb-api :: tools/lldb-server/TestGdbRemote_vCont.py (1921 of 2119) PASS: lldb-shell :: Driver/TestCommands.test (1922 of 2119) PASS: lldb-api :: types/TestIntegerType.py (1923 of 2119) PASS: lldb-unit :: Utility/./UtilityTests/DataExtractorTest.GetFloatUnaligned (1924 of 2119) PASS: lldb-api :: functionalities/breakpoint/breakpoint_set_restart/TestBreakpointSetRestart.py (1925 of 2119) PASS: lldb-api :: functionalities/breakpoint/breakpoint_names/TestBreakpointNames.py (1926 of 2119) PASS: lldb-shell :: ObjectFile/ELF/section-types-edgecases.yaml (1927 of 2119) PASS: lldb-unit :: Utility/./UtilityTests/OptionsWithRawTest.EmptySuffix (1928 of 2119) PASS: lldb-api :: functionalities/ptr_refs/TestPtrRefs.py (1929 of 2119) PASS: lldb-api :: commands/session/save/TestSessionSave.py (1930 of 2119) PASS: lldb-api :: functionalities/data-formatter/data-formatter-stl/libcxx/multimap/TestDataFormatterLibccMultiMap.py (1931 of 2119) PASS: lldb-api :: tools/lldb-server/TestGdbRemoteExitCode.py (1932 of 2119) PASS: lldb-shell :: SymbolFile/DWARF/dwp-separate-debug-file.cpp (1933 of 2119) PASS: lldb-unit :: Utility/./UtilityTests/UUIDTest.Validity (1934 of 2119) PASS: lldb-api :: functionalities/breakpoint/breakpoint_command/TestBreakpointCommand.py (1935 of 2119) PASS: lldb-api :: functionalities/thread/concurrent_events/TestConcurrentTwoBreakpointThreads.py (1936 of 2119) PASS: lldb-api :: functionalities/asan/TestMemoryHistory.py (1937 of 2119) PASS: lldb-api :: functionalities/thread/concurrent_events/TestConcurrentWatchpointWithDelayWatchpointThreads.py (1938 of 2119) PASS: lldb-api :: functionalities/breakpoint/breakpoint_conditions/TestBreakpointConditions.py (1939 of 2119) UNSUPPORTED: lldb-shell :: Unwind/eh-frame-augment-noop.test (1940 of 2119) PASS: lldb-api :: functionalities/gdb_remote_client/TestNestedRegDefinitions.py (1941 of 2119) PASS: lldb-shell :: Reproducer/TestDump.test (1942 of 2119) PASS: lldb-unit :: UnwindAssembly/x86/./UnwindAssemblyx86Tests/Testx86AssemblyInspectionEngine.TestCALLNextInsn (1943 of 2119) PASS: lldb-unit :: Target/./TargetTests/PathMappingListTest.RemapRoot (1944 of 2119) PASS: lldb-shell :: ObjectFile/ELF/duplicate-section.yaml (1945 of 2119) PASS: lldb-api :: lang/objc/foundation/TestObjCMethods.py (1946 of 2119) PASS: lldb-unit :: Host/./HostTests/FileSystemTest.EnumerateDirectory (1947 of 2119) PASS: lldb-api :: functionalities/data-formatter/frameformat_smallstruct/TestFrameFormatSmallStruct.py (1948 of 2119) PASS: lldb-api :: functionalities/data-formatter/refpointer-recursion/TestDataFormatterRefPtrRecursion.py (1949 of 2119) PASS: lldb-api :: tools/lldb-vscode/breakpoint/TestVSCode_setBreakpoints.py (1950 of 2119) PASS: lldb-unit :: Utility/./UtilityTests/StreamTest.PutULEB128 (1951 of 2119) PASS: lldb-api :: functionalities/data-formatter/pyobjsynthprovider/TestPyObjSynthProvider.py (1952 of 2119) PASS: lldb-unit :: UnwindAssembly/x86/./UnwindAssemblyx86Tests/Testx86AssemblyInspectionEngine.Testi386IgnoredRegisters (1953 of 2119) PASS: lldb-api :: lang/objc/hidden-ivars/TestHiddenIvars.py (1954 of 2119) PASS: lldb-shell :: SymbolFile/NativePDB/bitfields.cpp (1955 of 2119) PASS: lldb-shell :: Driver/TestPositionalArgs.test (1956 of 2119) PASS: lldb-unit :: Utility/./UtilityTests/StringExtractorTest.InitMisc (1957 of 2119) PASS: lldb-api :: functionalities/gdb_remote_client/TestJLink6Armv7RegisterDefinition.py (1958 of 2119) PASS: lldb-api :: lang/cpp/class_static/TestStaticVariables.py (1959 of 2119) PASS: lldb-api :: commands/expression/persistent_types/TestNestedPersistentTypes.py (1960 of 2119) PASS: lldb-unit :: Utility/./UtilityTests/DataExtractorTest.GetSLEB128_bit63 (1961 of 2119) PASS: lldb-unit :: Utility/./UtilityTests/ScalarTest.SetValueFromCString (1962 of 2119) PASS: lldb-api :: commands/expression/function_template_specialization_temp_args/TestFunctionTemplateSpecializationTempArgs.py (1963 of 2119) PASS: lldb-unit :: ScriptInterpreter/Python/./ScriptInterpreterPythonTests/PythonDataObjectsTest.TestDictionaryResolutionWithDot (1964 of 2119) PASS: lldb-unit :: Utility/./UtilityTests/PassiveReplayTest.InstrumentedFooInvalid (1965 of 2119) UNSUPPORTED: lldb-shell :: Register/x86-zmm-write.test (1966 of 2119) PASS: lldb-unit :: Utility/./UtilityTests/DataExtractorTest.GetMaxS64 (1967 of 2119) PASS: lldb-unit :: Utility/./UtilityTests/StringListTest.SplitIntoLinesSingleTrailingCR (1968 of 2119) PASS: lldb-unit :: Utility/./UtilityTests/FileSpecTest.RemoveLastPathComponent (1969 of 2119) PASS: lldb-unit :: UnwindAssembly/x86/./UnwindAssemblyx86Tests/Testx86AssemblyInspectionEngine.TestSimple32bitFrameFunction (1970 of 2119) PASS: lldb-shell :: ObjectFile/PECOFF/symbol.yaml (1971 of 2119) PASS: lldb-api :: commands/version/TestVersion.py (1972 of 2119) PASS: lldb-unit :: Utility/./UtilityTests/AnsiTerminal.AtStart (1973 of 2119) PASS: lldb-unit :: Language/Highlighting/./HighlighterTests/HighlighterTest.ClangCursorPosInOtherToken (1974 of 2119) PASS: lldb-shell :: BuildScript/toolchain-clang.test (1975 of 2119) PASS: lldb-api :: functionalities/breakpoint/consecutive_breakpoints/TestConsecutiveBreakpoints.py (1976 of 2119) PASS: lldb-api :: functionalities/unwind/sigtramp/TestSigtrampUnwind.py (1977 of 2119) PASS: lldb-api :: python_api/symbol-context/two-files/TestSymbolContextTwoFiles.py (1978 of 2119) PASS: lldb-unit :: Utility/./UtilityTests/RangeTest.SlideZero (1979 of 2119) UNSUPPORTED: lldb-shell :: SymbolFile/PDB/function-nested-block.test (1980 of 2119) PASS: lldb-unit :: ObjectFile/Breakpad/./ObjectFileBreakpadTests/ModuleRecord.parse (1981 of 2119) PASS: lldb-unit :: Utility/./UtilityTests/StreamTest.ShiftOperatorPtr (1982 of 2119) PASS: lldb-api :: commands/session/history/TestSessionHistory.py (1983 of 2119) UNSUPPORTED: lldb-api :: linux/sepdebugsymlink/TestTargetSymbolsSepDebugSymlink.py (1984 of 2119) PASS: lldb-shell :: Minidump/dump-all.test (1985 of 2119) PASS: lldb-api :: tools/lldb-vscode/attach/TestVSCode_attach.py (1986 of 2119) PASS: lldb-api :: functionalities/thread/backtrace_all/TestBacktraceAll.py (1987 of 2119) PASS: lldb-api :: commands/platform/file/read/TestPlatformFileRead.py (1988 of 2119) PASS: lldb-api :: functionalities/process_crash_info/TestProcessCrashInfo.py (1989 of 2119) PASS: lldb-api :: lang/objc/foundation/TestObjCMethodsNSArray.py (1990 of 2119) PASS: lldb-unit :: Expression/./ExpressionTests/CppModuleConfigurationTest.UnknownLibCppFile (1991 of 2119) PASS: lldb-unit :: DataFormatter/./LLDBFormatterTests/TypeMatcherTests.CreatedBySameMatchStringExactNamePrefixes (1992 of 2119) UNSUPPORTED: lldb-shell :: BuildScript/toolchain-clang-cl.test (1993 of 2119) PASS: lldb-unit :: Utility/./UtilityTests/LogTest.LLDB_LOG_nullptr (1994 of 2119) PASS: lldb-api :: functionalities/tail_call_frames/thread_step_out_message/TestArtificialFrameStepOutMessage.py (1995 of 2119) PASS: lldb-unit :: Utility/./UtilityTests/RegularExpression.Valid (1996 of 2119) PASS: lldb-unit :: Utility/./UtilityTests/ArgsTest.StringListConstructor (1997 of 2119) PASS: lldb-shell :: Minidump/Windows/arm-fp-unwind.test (1998 of 2119) PASS: lldb-api :: tools/lldb-server/register-reading/TestGdbRemoteGPacket.py (1999 of 2119) PASS: lldb-unit :: Core/./LLDBCoreTests/StreamCallbackTest.Callback (2000 of 2119) PASS: lldb-api :: functionalities/thread_plan/TestThreadPlanCommands.py (2001 of 2119) UNSUPPORTED: lldb-shell :: ScriptInterpreter/Lua/nested_sessions.test (2002 of 2119) UNSUPPORTED: lldb-api :: benchmarks/turnaround/TestCompileRunToBreakpointTurnaround.py (2003 of 2119) PASS: lldb-api :: commands/expression/import-std-module/list/TestListFromStdModule.py (2004 of 2119) PASS: lldb-unit :: Utility/./UtilityTests/Flags.AllClear (2005 of 2119) PASS: lldb-shell :: Reproducer/TestVersionCheck.test (2006 of 2119) PASS: lldb-unit :: Utility/./UtilityTests/AnsiTerminal.Unknown (2007 of 2119) PASS: lldb-api :: lang/c/forward/TestForwardDeclaration.py (2008 of 2119) PASS: lldb-shell :: ScriptInterpreter/None/none.test (2009 of 2119) PASS: lldb-unit :: Utility/./UtilityTests/StringExtractorTest.GetHexBytesAvail_FullString (2010 of 2119) PASS: lldb-api :: commands/expression/anonymous-struct/TestCallUserAnonTypedef.py (2011 of 2119) PASS: lldb-unit :: Process/gdb-remote/./ProcessGdbRemoteTests/GDBRemoteCommunicationClientTest.SaveRestoreRegistersNoSuffix (2012 of 2119) PASS: lldb-api :: commands/expression/radar_8638051/Test8638051.py (2013 of 2119) PASS: lldb-api :: functionalities/target_var/TestTargetVar.py (2014 of 2119) PASS: lldb-api :: functionalities/tsan/cpp_global_location/TestTsanCPPGlobalLocation.py (2015 of 2119) PASS: lldb-api :: api/command-return-object/TestSBCommandReturnObject.py (2016 of 2119) PASS: lldb-api :: functionalities/thread/concurrent_events/TestConcurrentTwoWatchpointsOneSignal.py (2017 of 2119) PASS: lldb-unit :: UnwindAssembly/x86/./UnwindAssemblyx86Tests/Testx86AssemblyInspectionEngine.TestSpillRegToStackViaMOVx86_64 (2018 of 2119) PASS: lldb-unit :: Host/./HostTests/HostInfoTest.GetHostname (2019 of 2119) PASS: lldb-unit :: Process/minidump/./LLDBMinidumpTests/MinidumpParserTest.GetMemory (2020 of 2119) PASS: lldb-api :: lang/cpp/nsimport/TestCppNsImport.py (2021 of 2119) PASS: lldb-api :: lang/cpp/wchar_t/TestCxxWCharT.py (2022 of 2119) PASS: lldb-api :: functionalities/data-formatter/data-formatter-stl/libcxx/queue/TestDataFormatterLibcxxQueue.py (2023 of 2119) UNSUPPORTED: lldb-shell :: SymbolFile/PDB/calling-conventions.test (2024 of 2119) PASS: lldb-unit :: Utility/./UtilityTests/FileSpecTest.AppendPathComponent (2025 of 2119) PASS: lldb-api :: functionalities/data-formatter/user-format-vs-summary/TestUserFormatVsSummary.py (2026 of 2119) PASS: lldb-api :: functionalities/data-formatter/data-formatter-stl/libcxx/variant/TestDataFormatterLibcxxVariant.py (2027 of 2119) PASS: lldb-shell :: SymbolFile/NativePDB/function-types-classes.cpp (2028 of 2119) PASS: lldb-api :: functionalities/multiword-commands/TestMultiWordCommands.py (2029 of 2119) PASS: lldb-api :: functionalities/data-formatter/data-formatter-stl/libcxx/initializerlist/TestInitializerList.py (2030 of 2119) PASS: lldb-unit :: UnwindAssembly/x86/./UnwindAssemblyx86Tests/Testx86AssemblyInspectionEngine.TestPushR13 (2031 of 2119) PASS: lldb-unit :: Utility/./UtilityTests/StringExtractorTest.GetHexBytesAvail_Partial (2032 of 2119) PASS: lldb-unit :: Utility/./UtilityTests/StreamTest.AddressRange (2033 of 2119) PASS: lldb-api :: commands/platform/file/close/TestPlatformFileClose.py (2034 of 2119) PASS: lldb-unit :: UnwindAssembly/x86/./UnwindAssemblyx86Tests/Testx86AssemblyInspectionEngine.Test64bitFramelessSmallStackFrame (2035 of 2119) PASS: lldb-unit :: Utility/./UtilityTests/StreamTeeTest.GetStreamAtIndexOutOfBounds (2036 of 2119) PASS: lldb-api :: functionalities/breakpoint/cpp_exception/TestCPPExceptionBreakpoint.py (2037 of 2119) PASS: lldb-api :: commands/expression/calculator_mode/TestCalculatorMode.py (2038 of 2119) PASS: lldb-api :: lang/c/const_variables/TestConstVariables.py (2039 of 2119) PASS: lldb-unit :: Core/./LLDBCoreTests/ModuleSpecTest.InvalidInMemoryBufferValidFile (2040 of 2119) PASS: lldb-unit :: Utility/./UtilityTests/StreamTest.PutRawBytesToBigEndian (2041 of 2119) PASS: lldb-unit :: Utility/./UtilityTests/StringExtractorTest.GetHexU8_Exact (2042 of 2119) PASS: lldb-shell :: Expr/TestMultilineExpr.test (2043 of 2119) PASS: lldb-shell :: ObjectFile/ELF/short-build-id.yaml (2044 of 2119) PASS: lldb-api :: functionalities/data-formatter/data-formatter-stl/libcxx/map/TestDataFormatterLibccMap.py (2045 of 2119) PASS: lldb-api :: python_api/signals/TestSignalsAPI.py (2046 of 2119) PASS: lldb-unit :: Utility/./UtilityTests/AnsiTerminal.WhiteSpace (2047 of 2119) PASS: lldb-unit :: UnwindAssembly/x86/./UnwindAssemblyx86Tests/Testx86AssemblyInspectionEngine.TestSubRSP (2048 of 2119) PASS: lldb-unit :: Utility/./UtilityTests/ArgsTest.TestAppendArg (2049 of 2119) PASS: lldb-api :: commands/frame/diagnose/virtual-method-call/TestDiagnoseDereferenceVirtualMethodCall.py (2050 of 2119) PASS: lldb-unit :: Core/./LLDBCoreTests/ModuleSpecTest.TestELFFile (2051 of 2119) PASS: lldb-unit :: Utility/./UtilityTests/ScalarTest.Comparison (2052 of 2119) PASS: lldb-api :: commands/expression/rdar44436068/Test128BitsInteger.py (2053 of 2119) PASS: lldb-api :: commands/watchpoints/watchpoint_events/TestWatchpointEvents.py (2054 of 2119) PASS: lldb-unit :: Utility/./UtilityTests/StringExtractorTest.GetHexU8_InvalidHex_NoEof (2055 of 2119) UNSUPPORTED: lldb-api :: functionalities/thread/create_during_step/TestCreateDuringStep.py (2056 of 2119) PASS: lldb-unit :: Utility/./UtilityTests/FileSpecTest.EqualDotsPosix (2057 of 2119) PASS: lldb-api :: commands/expression/codegen-crash-typedefdecl-not-in_declcontext/TestCodegenCrashTypedefDeclNotInDeclContext.py (2058 of 2119) PASS: lldb-api :: lang/c/set_values/TestSetValues.py (2059 of 2119) PASS: lldb-unit :: ObjectFile/ELF/./ObjectFileELFTests/ObjectFileELFTest.GetModuleSpecifications_EarlySectionHeaders (2060 of 2119) PASS: lldb-unit :: Process/./ProcessEventDataTests/ProcessEventDataTest.ShouldStop (2061 of 2119) PASS: lldb-api :: lang/objc/modules-auto-import/TestModulesAutoImport.py (2062 of 2119) PASS: lldb-api :: functionalities/conditional_break/TestConditionalBreak.py (2063 of 2119) PASS: lldb-unit :: Utility/./UtilityTests/StringExtractorTest.DecodeHexU8_Exact (2064 of 2119) PASS: lldb-unit :: Utility/./UtilityTests/SerializationRountripTest.SerializeDeserializeCStringArrayNullptr (2065 of 2119) PASS: lldb-shell :: Breakpoint/case-sensitive.test (2066 of 2119) PASS: lldb-unit :: Host/./HostTests/SocketTest.TCPListen0GetPort (2067 of 2119) PASS: lldb-unit :: Utility/./UtilityTests/ProcessInstanceInfo.DumpTable (2068 of 2119) UNSUPPORTED: lldb-api :: android/platform/TestDefaultCacheLineSize.py (2069 of 2119) PASS: lldb-unit :: Symbol/./SymbolTests/TestTypeSystemClang.TestOwningModule (2070 of 2119) PASS: lldb-api :: functionalities/breakpoint/breakpoint_command/TestRegexpBreakCommand.py (2071 of 2119) PASS: lldb-shell :: Breakpoint/debug_rnglist_offset_pair.test (2072 of 2119) PASS: lldb-api :: types/TestShortTypeExpr.py (2073 of 2119) PASS: lldb-unit :: Utility/./UtilityTests/GeneratorTest.Create (2074 of 2119) PASS: lldb-api :: tools/lldb-server/TestGdbRemoteAttach.py (2075 of 2119) PASS: lldb-api :: lang/c/anonymous/TestAnonymous.py (2076 of 2119) PASS: lldb-unit :: Utility/./UtilityTests/NameMatchesTest.Equals (2077 of 2119) PASS: lldb-shell :: ObjectFile/wasm/stripped-debug-sections.yaml (2078 of 2119) PASS: lldb-unit :: UnwindAssembly/x86/./UnwindAssemblyx86Tests/Testx86AssemblyInspectionEngine.TestSimple64bitFrameFunction (2079 of 2119) PASS: lldb-unit :: Utility/./UtilityTests/StringListTest.ForRange (2080 of 2119) PASS: lldb-api :: functionalities/data-formatter/synthcapping/TestSyntheticCapping.py (2081 of 2119) PASS: lldb-unit :: UnwindAssembly/x86/./UnwindAssemblyx86Tests/Testx86AssemblyInspectionEngine.Test32bitFramelessBigStackFrame (2082 of 2119) PASS: lldb-unit :: UnwindAssembly/x86/./UnwindAssemblyx86Tests/Testx86AssemblyInspectionEngine.TestPopEBP (2083 of 2119) UNSUPPORTED: lldb-api :: functionalities/data-formatter/data-formatter-stl/libstdcpp/tuple/TestDataFormatterStdTuple.py (2084 of 2119) PASS: lldb-api :: functionalities/plugins/python_os_plugin/stepping_plugin_threads/TestOSPluginStepping.py (2085 of 2119) UNSUPPORTED: lldb-shell :: SymbolFile/PDB/variables.test (2086 of 2119) PASS: lldb-api :: lang/objc/unicode-string/TestUnicodeString.py (2087 of 2119) PASS: lldb-unit :: ScriptInterpreter/Python/./ScriptInterpreterPythonTests/PythonDataObjectsTest.TestPythonInteger (2088 of 2119) PASS: lldb-shell :: SymbolFile/Breakpad/unwind-via-stack-win.test (2089 of 2119) PASS: lldb-api :: functionalities/data-formatter/parray/TestPrintArray.py (2090 of 2119) XFAIL: lldb-shell :: Register/x86-mm-xmm-read.test (2091 of 2119) PASS: lldb-unit :: Utility/./UtilityTests/VMRange.Clear (2092 of 2119) PASS: lldb-shell :: Commands/command-backtrace.test (2093 of 2119) PASS: lldb-unit :: Host/./HostTests/FileSystemTest.OpenErrno (2094 of 2119) PASS: lldb-unit :: Utility/./UtilityTests/RangeTest.SizeTypes (2095 of 2119) PASS: lldb-unit :: Utility/./UtilityTests/Flags.AnyClear (2096 of 2119) PASS: lldb-unit :: Utility/./UtilityTests/UriParserTest.BadPort2 (2097 of 2119) PASS: lldb-api :: functionalities/thread/concurrent_events/TestConcurrentManyWatchpoints.py (2098 of 2119) PASS: lldb-unit :: Utility/./UtilityTests/StreamTeeTest.Write (2099 of 2119) PASS: lldb-shell :: SymbolFile/DWARF/dir-separator-windows.s (2100 of 2119) PASS: lldb-api :: lang/objcxx/objcxx-ivar-vector/TestIvarVector.py (2101 of 2119) PASS: lldb-api :: lang/cpp/dynamic-value-same-basename/TestDynamicValueSameBase.py (2102 of 2119) PASS: lldb-api :: commands/target/modules/search-paths/insert/TestTargetModulesSearchpathsInsert.py (2103 of 2119) PASS: lldb-shell :: SymbolFile/DWARF/win-i386-line-table.s (2104 of 2119) PASS: lldb-unit :: Process/gdb-remote/./ProcessGdbRemoteTests/GDBRemoteClientBaseTest.SendContinueAndAsyncPacket (2105 of 2119) PASS: lldb-api :: lang/objc/objc-new-syntax/TestObjCNewSyntaxDictionary.py (2106 of 2119) PASS: lldb-unit :: Utility/./UtilityTests/BinaryStreamTest.PutSLEB128FourBytes (2107 of 2119) UNSUPPORTED: lldb-shell :: SymbolFile/PDB/type-quals.test (2108 of 2119) PASS: lldb-api :: commands/expression/fixits/TestFixIts.py (2109 of 2119) PASS: lldb-api :: functionalities/param_entry_vals/basic_entry_values/TestBasicEntryValues.py (2110 of 2119) PASS: lldb-shell :: Register/x86-64-ymm-read.test (2111 of 2119) PASS: lldb-shell :: ObjectFile/MachO/lc_build_version.yaml (2112 of 2119) PASS: lldb-api :: commands/expression/deleting-implicit-copy-constructor/TestDeletingImplicitCopyConstructor.py (2113 of 2119) PASS: lldb-api :: commands/expression/formatters/TestFormatters.py (2114 of 2119) PASS: lldb-shell :: Reproducer/TestReuseDirectory.test (2115 of 2119) PASS: lldb-api :: commands/expression/import-std-module/weak_ptr-dbg-info-content/TestDbgInfoContentWeakPtrFromStdModule.py (2116 of 2119) PASS: lldb-api :: lang/cpp/enum_types/TestCPP11EnumTypes.py (2117 of 2119) PASS: lldb-api :: lang/objc/blocks/TestObjCIvarsInBlocks.py (2118 of 2119) PASS: lldb-api :: commands/expression/char/TestExprsChar.py (2119 of 2119) Slowest Tests: -------------------------------------------------------------------------- 600.86s: lldb-api :: macosx/simulator/TestSimulatorPlatform.py 496.34s: lldb-api :: functionalities/postmortem/mach-core/TestMachCore.py 327.08s: lldb-api :: lang/objc/exceptions/TestObjCExceptions.py 280.74s: lldb-api :: functionalities/thread/create_after_attach/TestCreateAfterAttach.py 278.97s: lldb-api :: commands/expression/import-std-module/shared_ptr-dbg-info-content/TestSharedPtrDbgInfoContentFromStdModule.py 274.25s: lldb-api :: commands/expression/import-std-module/vector/TestVectorFromStdModule.py 270.42s: lldb-api :: functionalities/inferior-changed/TestInferiorChanged.py 269.10s: lldb-api :: lang/cpp/llvm-style/TestLLVMStyle.py 172.87s: lldb-api :: functionalities/data-formatter/data-formatter-objc/cmtime/TestDataFormatterCMTime.py 162.88s: lldb-api :: commands/expression/import_builtin_fileid/TestImportBuiltinFileID.py 158.99s: lldb-api :: tools/lldb-server/TestLldbGdbServer.py 149.05s: lldb-api :: lang/c/shared_lib_stripped_symbols/TestSharedLibStrippedSymbols.py 134.53s: lldb-api :: tools/lldb-server/TestGdbRemoteSingleStep.py 126.27s: lldb-api :: functionalities/gdb_remote_client/TestGDBRemoteLoad.py 111.77s: lldb-api :: lang/cpp/static_methods/TestCPPStaticMethods.py 110.91s: lldb-api :: lang/c/local_variables/TestLocalVariables.py 110.42s: lldb-api :: commands/expression/persist_objc_pointeetype/TestPersistObjCPointeeType.py 110.03s: lldb-api :: functionalities/gdb_remote_client/TestGDBRemoteClient.py 106.93s: lldb-api :: lang/objc/foundation/TestObjCMethods.py 106.90s: lldb-api :: lang/objc/hidden-ivars/TestHiddenIvars.py

Hide Details

Tests Times: -------------------------------------------------------------------------- [ Range ] :: [ Percentage ] :: [ Count ] -------------------------------------------------------------------------- [600s,650s) :: [ ] :: [ 1/2119] [550s,600s) :: [ ] :: [ 0/2119] [500s,550s) :: [ ] :: [ 1/2119] [450s,500s) :: [ ] :: [ 0/2119] [400s,450s) :: [ ] :: [ 0/2119] [350s,400s) :: [ ] :: [ 1/2119] [300s,350s) :: [ ] :: [ 2/2119] [250s,300s) :: [ ] :: [ 3/2119] [200s,250s) :: [ ] :: [ 0/2119] [150s,200s) :: [ ] :: [ 4/2119] [100s,150s) :: [ ] :: [ 13/2119] [ 50s,100s) :: [ ] :: [ 27/2119] [ 0s, 50s) :: [*************************************** ] :: [2067/2119] -------------------------------------------------------------------------- ******************** Timed Out Tests (1): lldb-api :: macosx/simulator/TestSimulatorPlatform.py

Hide Details

******************** Failed Tests (3): lldb-api :: functionalities/gdb_remote_client/TestGDBRemoteLoad.py lldb-api :: python_api/target/TestTargetAPI.py lldb-api :: functionalities/gdb_remote_client/TestGDBRemoteClient.py

Hide Details

Hide Details

Testing Time: 2026.64s Unsupported : 150 Passed : 1959 Expectedly Failed: 6 Timed Out : 1 Failed : 3 FAILED: tools/lldb/test/CMakeFiles/check-lldb-lit cd /Users/buildslave/jenkins/workspace/lldb-cmake/lldb-build/tools/lldb/test && /usr/local/Frameworks/Python.framework/Versions/3.7/bin/python3.7 /Users/buildslave/jenkins/workspace/lldb-cmake/lldb-build/./bin/llvm-lit -v --time-tests --shuffle --xunit-xml-output=/Users/buildslave/jenkins/workspace/lldb-cmake/test/results.xml -v /Users/buildslave/jenkins/workspace/lldb-cmake/lldb-build/tools/lldb/test ninja: build stopped: subcommand failed. Command failed: Command '['/usr/bin/env', 'TERM=vt100', '/usr/local/bin/ninja', '-v', 'check-lldb']' returned non-zero exit status 1 Command: ['/usr/bin/env', 'TERM=vt100', '/usr/local/bin/ninja', '-v', 'check-lldb'] [Pipeline] } [Pipeline] // timeout [Pipeline] } [Pipeline] // stage [Pipeline] stage [Pipeline] { (Declarative: Post Actions) [Pipeline] scanForIssues [Clang (LLVM based)] Sleeping for 5 seconds due to JENKINS-32191... [Clang (LLVM based)] Parsing console log (workspace: '/Users/buildslave/jenkins/workspace/lldb-cmake') [Clang (LLVM based)] Successfully parsed console log [Clang (LLVM based)] -> found 31 issues (skipped 132 duplicates) [Clang (LLVM based)] Post processing issues on 'green-dragon-10' with source code encoding 'UTF-8' [Clang (LLVM based)] Creating SCM blamer to obtain author and commit information for affected files [Clang (LLVM based)] Creating SCM miner to obtain statistics for affected repository files [Clang (LLVM based)] Resolving file names for all issues in source directory '/Users/buildslave/jenkins/workspace/lldb-cmake' [Clang (LLVM based)] -> resolved paths in source directory (17 found, 0 not found) [Clang (LLVM based)] Resolving module names from module definitions (build.xml, pom.xml, or Manifest.mf files) [Clang (LLVM based)] -> resolved module names for 31 issues [Clang (LLVM based)] Resolving package names (or namespaces) by parsing the affected files [Clang (LLVM based)] -> resolved package names of 14 affected files [Clang (LLVM based)] No filter has been set, publishing all 27 issues [Clang (LLVM based)] Creating fingerprints for all affected code blocks to track issues over different builds [Clang (LLVM based)] -> created fingerprints for 27 issues (skipped 0 issues) [Clang (LLVM based)] Copying affected files to Jenkins' build folder '/Users/Shared/Jenkins/Home/jobs/lldb-cmake/builds/23302/files-with-issues' [Clang (LLVM based)] -> 12 copied, 2 not in workspace, 0 not-found, 0 with I/O error [Pipeline] junit Recording test results [Pipeline] emailext Warning: flo@fhahn.com is not a recognized user, but sending mail anyway Warning: craig.topper@intel.com is not a recognized user, but sending mail anyway Warning: flo@fhahn.com is not a recognized user, but sending mail anyway Warning: craig.topper@intel.com is not a recognized user, but sending mail anyway

Hide Details

Begin Pre-Send Script... Sending email to: mschifer@apple.com flo@fhahn.com piotr.sobczak@amd.com craig.topper@intel.com Erik Pilkington <epilkington@apple.com> Azhar Mohammed <azhar@apple.com>
[Pipeline] } [Pipeline] // stage [Pipeline] } [Pipeline] // withEnv [Pipeline] } [Pipeline] // node [Pipeline] End of Pipeline ERROR: script returned exit code 1 Finished: FAILURE