FailedConsole Output

Skipping 7,827 KB.. Full Log
119)
PASS: lldb-api :: python_api/findvalue_duplist/TestSBFrameFindValue.py (613 of 2119)
PASS: lldb-unit :: Language/Highlighting/./HighlighterTests/HighlighterTest.ClangTrailingBackslashBeforeNewline (614 of 2119)
PASS: lldb-unit :: Symbol/./SymbolTests/TestClangASTImporter.DeportTypeTagDecl (615 of 2119)
PASS: lldb-api :: commands/expression/dollar-in-variable/TestDollarInVariable.py (616 of 2119)
PASS: lldb-api :: commands/expression/import-std-module/vector-of-vectors/TestVectorOfVectorsFromStdModule.py (617 of 2119)
PASS: lldb-api :: lang/cpp/class_types/TestClassTypes.py (618 of 2119)
PASS: lldb-api :: lang/c/array_types/TestArrayTypes.py (619 of 2119)
PASS: lldb-shell :: Quit/TestQuitExitCodeTooManyArgs.test (620 of 2119)
PASS: lldb-unit :: Utility/./UtilityTests/ScalarTest.Division (621 of 2119)
PASS: lldb-api :: python_api/lldbutil/process/TestPrintStackTraces.py (622 of 2119)
PASS: lldb-api :: commands/frame/diagnose/dereference-function-return/TestDiagnoseDereferenceFunctionReturn.py (623 of 2119)
PASS: lldb-api :: functionalities/postmortem/mach-core/TestMachCore.py (624 of 2119)
PASS: lldb-api :: functionalities/inline-stepping/TestInlineStepping.py (625 of 2119)
PASS: lldb-api :: python_api/value/TestValueAPI.py (626 of 2119)
PASS: lldb-shell :: Settings/TestFrameFormatNoColor.test (627 of 2119)
PASS: lldb-unit :: Symbol/./SymbolTests/TestTypeSystemClang.TestGetTypeClassNested (628 of 2119)
PASS: lldb-unit :: Expression/./ExpressionTests/CppModuleConfigurationTest.LinuxLocalLibCpp (629 of 2119)
PASS: lldb-api :: lang/cpp/template-function/TestTemplateFunctions.py (630 of 2119)
PASS: lldb-unit :: UnwindAssembly/x86/./UnwindAssemblyx86Tests/Testx86AssemblyInspectionEngine.TestPushEBX (631 of 2119)
PASS: lldb-api :: lang/cpp/accelerator-table/TestCPPAccelerator.py (632 of 2119)
PASS: lldb-api :: lang/cpp/global_variables/TestCPPGlobalVariables.py (633 of 2119)
PASS: lldb-unit :: Utility/./UtilityTests/ArgsTest.ReplaceArgumentAtIndexShort (634 of 2119)
PASS: lldb-api :: lang/cpp/namespace/TestNamespace.py (635 of 2119)
UNSUPPORTED: lldb-api :: tools/lldb-server/TestGdbRemoteAuxvSupport.py (636 of 2119)
PASS: lldb-unit :: Utility/./UtilityTests/ProcessInstanceInfo.Dump (637 of 2119)
PASS: lldb-api :: functionalities/breakpoint/scripted_bkpt/TestScriptedResolver.py (638 of 2119)
PASS: lldb-api :: commands/expression/import-std-module/no-std-module/TestMissingStdModule.py (639 of 2119)
PASS: lldb-api :: commands/command/script/import/TestImport.py (640 of 2119)
PASS: lldb-api :: functionalities/breakpoint/breakpoint_language/TestBreakpointLanguage.py (641 of 2119)
PASS: lldb-api :: macosx/indirect_symbol/TestIndirectSymbols.py (642 of 2119)
PASS: lldb-unit :: ScriptInterpreter/Python/./ScriptInterpreterPythonTests/PythonDataObjectsTest.TestRun (643 of 2119)
PASS: lldb-unit :: Process/minidump/./LLDBMinidumpTests/MinidumpParserTest.MinidumpModuleOrder (644 of 2119)
PASS: lldb-api :: commands/version/TestVersion.py (645 of 2119)
PASS: lldb-api :: commands/frame/diagnose/complicated-expression/TestComplicatedExpression.py (646 of 2119)
PASS: lldb-api :: python_api/sbdata/TestSBData.py (647 of 2119)
PASS: lldb-api :: functionalities/thread/concurrent_events/TestConcurrentDelaySignalWatch.py (648 of 2119)
PASS: lldb-api :: commands/expression/scoped_enums/TestScopedEnumType.py (649 of 2119)
PASS: lldb-api :: commands/expression/regression-access-function-template-in-record/TestRegressionAccessFunctionTemplateInRecord.py (650 of 2119)
PASS: lldb-unit :: Symbol/./SymbolTests/TestTypeSystemClang.TestRecordHasFields (651 of 2119)
PASS: lldb-api :: commands/thread/select/TestThreadSelect.py (652 of 2119)
PASS: lldb-unit :: Utility/./UtilityTests/StringListTest.GetMaxStringLengthMixed (653 of 2119)
PASS: lldb-unit :: Utility/./UtilityTests/StringListTest.LongestCommonPrefixDuplicateElement (654 of 2119)
PASS: lldb-api :: functionalities/thread/exit_during_step/TestExitDuringStep.py (655 of 2119)
PASS: lldb-unit :: Symbol/./SymbolTests/TestClangASTImporter.RecordLayout (656 of 2119)
PASS: lldb-api :: functionalities/limit-debug-info/TestLimitDebugInfo.py (657 of 2119)
PASS: lldb-shell :: ObjectFile/ELF/basic-info.yaml (658 of 2119)
PASS: lldb-api :: functionalities/gdb_remote_client/TestRestartBug.py (659 of 2119)
PASS: lldb-unit :: Utility/./UtilityTests/ArchSpecTest.YAML (660 of 2119)
PASS: lldb-unit :: debugserver/./debugserverTests/JSON.Parse (661 of 2119)
PASS: lldb-shell :: ObjectFile/PECOFF/symbol.yaml (662 of 2119)
PASS: lldb-api :: functionalities/process_crash_info/TestProcessCrashInfo.py (663 of 2119)
PASS: lldb-api :: python_api/sbvalue_persist/TestSBValuePersist.py (664 of 2119)
PASS: lldb-shell :: ObjectFile/ELF/PT_LOAD-overlap-section.yaml (665 of 2119)
PASS: lldb-unit :: Utility/./UtilityTests/Flags.AllClear (666 of 2119)
PASS: lldb-unit :: Utility/./UtilityTests/LogTest.Register (667 of 2119)
PASS: lldb-api :: python_api/frame/inlines/TestInlinedFrame.py (668 of 2119)
UNSUPPORTED: lldb-shell :: Register/x86-64-gp-write.test (669 of 2119)
PASS: lldb-api :: functionalities/data-formatter/data-formatter-synth/TestDataFormatterSynth.py (670 of 2119)
PASS: lldb-unit :: Utility/./UtilityTests/StringExtractorTest.GetHexBytes_Underflow (671 of 2119)
PASS: lldb-shell :: SymbolFile/DWARF/DW_OP_piece-smaller-than-struct.s (672 of 2119)
PASS: lldb-unit :: Utility/./UtilityTests/BinaryStreamTest.PutULEB128NineBytes (673 of 2119)
PASS: lldb-shell :: SymbolFile/NativePDB/function-types-builtins.cpp (674 of 2119)
PASS: lldb-api :: functionalities/breakpoint/cpp/TestCPPBreakpointLocations.py (675 of 2119)
PASS: lldb-shell :: Driver/TestSingleQuote.test (676 of 2119)
PASS: lldb-api :: lang/cpp/stl/TestSTL.py (677 of 2119)
PASS: lldb-unit :: Process/minidump/./LLDBMinidumpTests/RegisterContextMinidump.ConvertMinidumpContext_x86_32 (678 of 2119)
PASS: lldb-unit :: Utility/./UtilityTests/UriParserTest.BracketedHostnameWithPortIPv4 (679 of 2119)
UNSUPPORTED: lldb-shell :: ObjectFile/ELF/minidebuginfo-no-lzma.yaml (680 of 2119)
PASS: lldb-api :: python_api/symbol-context/two-files/TestSymbolContextTwoFiles.py (681 of 2119)
PASS: lldb-unit :: Core/./LLDBCoreTests/MangledTest.ResultForValidName (682 of 2119)
PASS: lldb-unit :: Utility/./UtilityTests/UriParserTest.MinimalPath (683 of 2119)
PASS: lldb-api :: sanity/TestSettingSkipping.py (684 of 2119)
PASS: lldb-unit :: Language/CPlusPlus/./LanguageCPlusPlusTests/CPlusPlusLanguage.CPlusPlusNameParser (685 of 2119)
PASS: lldb-shell :: Reproducer/TestDSYM.test (686 of 2119)
PASS: lldb-unit :: Utility/./UtilityTests/StreamTest.PutMaxHex64ByteOrderBig (687 of 2119)
PASS: lldb-api :: commands/expression/options/TestExprOptions.py (688 of 2119)
PASS: lldb-api :: commands/expression/save_jit_objects/TestSaveJITObjects.py (689 of 2119)
PASS: lldb-api :: tools/lldb-server/TestGdbRemoteKill.py (690 of 2119)
PASS: lldb-unit :: Process/gdb-remote/./ProcessGdbRemoteTests/GDBRemoteCommunicationClientTest.WriteRegister (691 of 2119)
UNSUPPORTED: lldb-shell :: Register/x86-64-zmm-read.test (692 of 2119)
UNSUPPORTED: lldb-api :: commands/target/auto-install-main-executable/TestAutoInstallMainExecutable.py (693 of 2119)
PASS: lldb-unit :: Symbol/./SymbolTests/TestClangASTImporter.MetadataPropagation (694 of 2119)
PASS: lldb-api :: functionalities/var_path/TestVarPath.py (695 of 2119)
PASS: lldb-unit :: Language/Highlighting/./HighlighterTests/HighlighterTest.HighlighterSelectionType (696 of 2119)
PASS: lldb-shell :: Heap/heap-cstr.test (697 of 2119)
PASS: lldb-unit :: Utility/./UtilityTests/RangeTest.NotEqualInvalid (698 of 2119)
PASS: lldb-api :: functionalities/data-formatter/type_summary_list_arg/TestTypeSummaryListArg.py (699 of 2119)
PASS: lldb-api :: commands/expression/two-files/TestObjCTypeQueryFromOtherCompileUnit.py (700 of 2119)
PASS: lldb-unit :: Utility/./UtilityTests/StringLexerTest.NextIf (701 of 2119)
PASS: lldb-api :: lang/objc/objc-ivar-protocols/TestIvarProtocols.py (702 of 2119)
PASS: lldb-unit :: Target/./TargetTests/ModuleCacheTest.GetAndPutStrangeHostname (703 of 2119)
PASS: lldb-shell :: ObjectFile/ELF/PT_LOAD-overlap-PT_INTERP.yaml (704 of 2119)
PASS: lldb-api :: types/TestRecursiveTypes.py (705 of 2119)
PASS: lldb-unit :: Utility/./UtilityTests/LogChannelEnabledTest.LLDB_LOG_ERROR (706 of 2119)
PASS: lldb-api :: functionalities/breakpoint/breakpoint_set_restart/TestBreakpointSetRestart.py (707 of 2119)
PASS: lldb-shell :: SymbolFile/DWARF/debug-types-dwo-cross-reference.cpp (708 of 2119)
PASS: lldb-api :: lang/objc/objc-static-method/TestObjCStaticMethod.py (709 of 2119)
PASS: lldb-unit :: Utility/./UtilityTests/DataExtractorTest.PeekData (710 of 2119)
PASS: lldb-api :: commands/target/stop-hooks/TestStopHooks.py (711 of 2119)
PASS: lldb-api :: python_api/debugger/TestDebuggerAPI.py (712 of 2119)
PASS: lldb-shell :: Reproducer/TestFileRepro.test (713 of 2119)
PASS: lldb-api :: functionalities/pre_run_dylibs/TestPreRunDylibs.py (714 of 2119)
PASS: lldb-shell :: ObjectFile/ELF/avr-basic-info.yaml (715 of 2119)
PASS: lldb-api :: functionalities/data-formatter/data-formatter-objc/cmtime/TestDataFormatterCMTime.py (716 of 2119)
PASS: lldb-api :: functionalities/tail_call_frames/ambiguous_tail_call_seq2/TestAmbiguousTailCallSeq2.py (717 of 2119)
PASS: lldb-shell :: SymbolFile/DWARF/compilercontext.ll (718 of 2119)
PASS: lldb-shell :: Reproducer/TestProcessList.test (719 of 2119)
UNSUPPORTED: lldb-shell :: SymbolFile/NativePDB/local-variables.cpp (720 of 2119)
PASS: lldb-unit :: Utility/./UtilityTests/DataExtractorTest.GetSLEB128_bit63 (721 of 2119)
PASS: lldb-unit :: Utility/./UtilityTests/StringListTest.InsertStringAtIndexMove (722 of 2119)
PASS: lldb-api :: types/TestShortType.py (723 of 2119)
PASS: lldb-shell :: ObjectFile/MachO/lc_build_version_notools.yaml (724 of 2119)
PASS: lldb-unit :: ObjectFile/PECOFF/./ObjectFilePECOFFTests/PECallFrameInfoTest.Basic_eh (725 of 2119)
PASS: lldb-unit :: Utility/./UtilityTests/ArchSpecTest.Compatibility (726 of 2119)
PASS: lldb-unit :: Disassembler/./DisassemblerTests/TestArmv7Disassembly.TestCortexFPDisass (727 of 2119)
PASS: lldb-unit :: Utility/./UtilityTests/DataExtractorTest.GetMaxU64_unchecked (728 of 2119)
PASS: lldb-unit :: Utility/./UtilityTests/LogChannelEnabledTest.LogVerboseThread (729 of 2119)
PASS: lldb-shell :: SymbolFile/DWARF/dwarf5-debug_line.s (730 of 2119)
PASS: lldb-unit :: UnwindAssembly/x86/./UnwindAssemblyx86Tests/Testx86AssemblyInspectionEngine.TestSpillRegToStackViaMOVi386 (731 of 2119)
PASS: lldb-api :: functionalities/thread/thread_exit/TestThreadExit.py (732 of 2119)
PASS: lldb-api :: tools/lldb-vscode/stackTrace/TestVSCode_stackTrace.py (733 of 2119)
PASS: lldb-unit :: Utility/./UtilityTests/Predicate.WaitForValueNotEqualTo (734 of 2119)
PASS: lldb-unit :: Utility/./UtilityTests/DataExtractorTest.GetBitfield (735 of 2119)
PASS: lldb-unit :: Process/minidump/./LLDBMinidumpTests/MinidumpParserTest.MinidumpDuplicateModuleMinAddress (736 of 2119)
PASS: lldb-unit :: Language/Highlighting/./HighlighterTests/HighlighterTest.ClangCursorPos (737 of 2119)
PASS: lldb-unit :: UnwindAssembly/ARM64/./Arm64InstEmulationTests/TestArm64InstEmulation.TestSimpleDarwinFunction (738 of 2119)
PASS: lldb-api :: lang/c/struct_types/TestStructTypes.py (739 of 2119)
PASS: lldb-unit :: Utility/./UtilityTests/StreamTest.ShiftOperatorStrings (740 of 2119)
PASS: lldb-unit :: Utility/./UtilityTests/StringListTest.LongestCommonPrefixSingleElement (741 of 2119)
UNSUPPORTED: lldb-api :: functionalities/data-formatter/data-formatter-stl/libstdcpp/iterator/TestDataFormatterStdIterator.py (742 of 2119)
PASS: lldb-api :: lang/cpp/this_class_type_mixing/TestThisClassTypeMixing.py (743 of 2119)
PASS: lldb-api :: commands/target/select/TestTargetSelect.py (744 of 2119)
PASS: lldb-unit :: UnwindAssembly/PPC64/./PPC64InstEmulationTests/TestPPC64InstEmulation.TestMediumFunction (745 of 2119)
PASS: lldb-unit :: Expression/./ExpressionTests/DiagnosticManagerTest.AppendMessageSubsequentDiags (746 of 2119)
PASS: lldb-shell :: SymbolFile/DWARF/dir-separator-windows.s (747 of 2119)
PASS: lldb-unit :: UnwindAssembly/x86/./UnwindAssemblyx86Tests/Testx86AssemblyInspectionEngine.Test32BitOnlyInstruction (748 of 2119)
PASS: lldb-api :: lang/cpp/auto/TestCPPAuto.py (749 of 2119)
PASS: lldb-unit :: ScriptInterpreter/Python/./ScriptInterpreterPythonTests/PythonDataObjectsTest.TestPythonBytes (750 of 2119)
PASS: lldb-api :: python_api/watchpoint/watchlocation/TestTargetWatchAddress.py (751 of 2119)
PASS: lldb-api :: functionalities/data-formatter/data-formatter-stl/libcxx/tuple/TestDataFormatterLibcxxTuple.py (752 of 2119)
PASS: lldb-api :: functionalities/data-formatter/builtin-formats/TestBuiltinFormats.py (753 of 2119)
PASS: lldb-unit :: Host/./HostTests/SocketTest.TCPGetConnectURI (754 of 2119)
UNSUPPORTED: lldb-api :: functionalities/thread/state/TestThreadStates.py (755 of 2119)
PASS: lldb-api :: linux/builtin_trap/TestBuiltinTrap.py (756 of 2119)
PASS: lldb-api :: functionalities/data-formatter/data-formatter-synthval/TestDataFormatterSynthVal.py (757 of 2119)
PASS: lldb-api :: lang/objc/objc-struct-argument/TestObjCStructArgument.py (758 of 2119)
PASS: lldb-unit :: Utility/./UtilityTests/StreamTest.PutRawBytesToBigEndian (759 of 2119)
PASS: lldb-api :: functionalities/gdb_remote_client/TestJLink6Armv7RegisterDefinition.py (760 of 2119)
PASS: lldb-api :: tools/lldb-server/TestGdbRemoteThreadsInStopReply.py (761 of 2119)
PASS: lldb-api :: commands/settings/quoting/TestQuoting.py (762 of 2119)
PASS: lldb-unit :: Utility/./UtilityTests/EnvironmentTest.EnvpConversion (763 of 2119)
PASS: lldb-api :: api/multiple-targets/TestMultipleTargets.py (764 of 2119)
PASS: lldb-api :: python_api/sblaunchinfo/TestSBLaunchInfo.py (765 of 2119)
PASS: lldb-api :: commands/expression/ignore-artificial-constructors/TestIgnoreArtificialConstructors.py (766 of 2119)
PASS: lldb-unit :: Expression/./ExpressionTests/DiagnosticManagerTest.GetStringBasic (767 of 2119)
PASS: lldb-unit :: Symbol/./SymbolTests/TestTypeSystemClang.TestUnifyAccessSpecifiers (768 of 2119)
PASS: lldb-api :: macosx/order/TestOrderFile.py (769 of 2119)
PASS: lldb-api :: python_api/module_section/TestModuleAndSection.py (770 of 2119)
PASS: lldb-unit :: Target/./TargetTests/MCBasedABI.MapRegisterName (771 of 2119)
PASS: lldb-shell :: Breakpoint/debug_addrx.test (772 of 2119)
PASS: lldb-shell :: BuildScript/toolchain-clang.test (773 of 2119)
PASS: lldb-unit :: Utility/./UtilityTests/StringExtractorTest.GetHexBytesAvail_OddPair2 (774 of 2119)
PASS: lldb-api :: functionalities/memory-region/TestMemoryRegion.py (775 of 2119)
PASS: lldb-shell :: SymbolFile/DWARF/parallel-indexing-stress.s (776 of 2119)
PASS: lldb-api :: commands/expression/context-object/TestContextObject.py (777 of 2119)
PASS: lldb-api :: functionalities/tsan/thread_leak/TestTsanThreadLeak.py (778 of 2119)
UNSUPPORTED: lldb-api :: functionalities/darwin_log/filter/exact_match/message/TestDarwinLogFilterMatchMessage.py (779 of 2119)
PASS: lldb-unit :: SymbolFile/NativePDB/./SymbolFileNativePDBTests/PDBFPOProgramToDWARFExpressionTests.DependencyChain (780 of 2119)
PASS: lldb-unit :: Expression/./ExpressionTests/DiagnosticManagerTest.GetStringNoDiags (781 of 2119)
PASS: lldb-shell :: Quit/TestQuitExitCodeHexA.test (782 of 2119)
PASS: lldb-api :: lang/cpp/extern_c/TestExternCSymbols.py (783 of 2119)
PASS: lldb-api :: lang/objc/foundation/TestObjCMethods.py (784 of 2119)
PASS: lldb-unit :: Utility/./UtilityTests/NameMatchesTest.RegularExpression (785 of 2119)
PASS: lldb-unit :: Symbol/./SymbolTests/TestTypeSystemClang.TestFunctionTemplateConstruction (786 of 2119)
PASS: lldb-api :: commands/frame/diagnose/bad-reference/TestBadReference.py (787 of 2119)
PASS: lldb-unit :: Utility/./UtilityTests/FileSpecTest.GetPath (788 of 2119)
UNSUPPORTED: lldb-shell :: Register/x86-64-xmm16-read.test (789 of 2119)
PASS: lldb-unit :: ScriptInterpreter/Python/./ScriptInterpreterPythonTests/PythonDataObjectsTest.TestGlobalNameResolutionWithDot (790 of 2119)
PASS: lldb-api :: commands/expression/radar_9673664/TestExprHelpExamples.py (791 of 2119)
PASS: lldb-api :: functionalities/exec/TestExec.py (792 of 2119)
UNSUPPORTED: lldb-api :: functionalities/longjmp/TestLongjmp.py (793 of 2119)
PASS: lldb-api :: functionalities/thread/concurrent_events/TestConcurrentBreakpointOneDelayBreakpointThreads.py (794 of 2119)
PASS: lldb-api :: lang/objc/objc-optimized/TestObjcOptimized.py (795 of 2119)
PASS: lldb-unit :: Utility/./UtilityTests/NameMatchesTest.EndsWith (796 of 2119)
PASS: lldb-unit :: Utility/./UtilityTests/ArgsTest.TestArgv (797 of 2119)
UNSUPPORTED: lldb-api :: functionalities/data-formatter/data-formatter-stl/libstdcpp/vector/TestDataFormatterStdVector.py (798 of 2119)
PASS: lldb-unit :: Utility/./UtilityTests/StringListTest.SplitIntoLinesSingleTrailingCR (799 of 2119)
PASS: lldb-api :: functionalities/data-formatter/data-formatter-advanced/TestDataFormatterAdv.py (800 of 2119)
UNSUPPORTED: lldb-shell :: SymbolFile/PDB/enums-layout.test (801 of 2119)
PASS: lldb-shell :: SymbolFile/DWARF/static_scope.s (802 of 2119)
PASS: lldb-api :: commands/expression/anonymous-struct/TestCallUserAnonTypedef.py (803 of 2119)
UNSUPPORTED: lldb-api :: benchmarks/expression/TestExpressionCmd.py (804 of 2119)
PASS: lldb-api :: lang/objc/objc-stepping/TestObjCStepping.py (805 of 2119)
PASS: lldb-unit :: Utility/./UtilityTests/ArgsTest.TestOverwriteArgs (806 of 2119)
PASS: lldb-api :: commands/frame/var/TestFrameVar.py (807 of 2119)
PASS: lldb-unit :: Utility/./UtilityTests/BinaryStreamTest.PutULEB128MaxValue (808 of 2119)
PASS: lldb-unit :: Utility/./UtilityTests/FileSpecTest.CopyByAppendingPathComponent (809 of 2119)
UNSUPPORTED: lldb-shell :: SymbolFile/target-symbols-add-unwind.test (810 of 2119)
PASS: lldb-api :: functionalities/tail_call_frames/disambiguate_tail_call_seq/TestDisambiguateTailCallSeq.py (811 of 2119)
PASS: lldb-api :: python_api/value_var_update/TestValueVarUpdate.py (812 of 2119)
PASS: lldb-unit :: UnwindAssembly/x86/./UnwindAssemblyx86Tests/Testx86AssemblyInspectionEngine.TestPush0 (813 of 2119)
PASS: lldb-shell :: SymbolFile/DWARF/find-function-regex.cpp (814 of 2119)
PASS: lldb-api :: lang/c/set_values/TestSetValues.py (815 of 2119)
PASS: lldb-api :: lang/cpp/thread_local/TestThreadLocal.py (816 of 2119)
PASS: lldb-unit :: Utility/./UtilityTests/StringExtractorTest.GetHexU8_Exact (817 of 2119)
PASS: lldb-unit :: Utility/./UtilityTests/StreamTeeTest.AppendStream (818 of 2119)
PASS: lldb-unit :: Utility/./UtilityTests/DataExtractorTest.GetCStr (819 of 2119)
PASS: lldb-shell :: ObjectFile/PECOFF/export-dllfunc.yaml (820 of 2119)
PASS: lldb-shell :: Reproducer/Modules/TestModuleCXX.test (821 of 2119)
PASS: lldb-unit :: Host/./HostTests/SocketTest.DecodeHostAndPort (822 of 2119)
PASS: lldb-shell :: Commands/command-regex-delete.test (823 of 2119)
PASS: lldb-unit :: Language/Highlighting/./HighlighterTests/HighlighterTest.ClangComments (824 of 2119)
PASS: lldb-unit :: Utility/./UtilityTests/Flags.Test (825 of 2119)
PASS: lldb-unit :: Process/gdb-remote/./ProcessGdbRemoteTests/GDBRemoteCommunicationClientTest.TestPacketSpeedJSON (826 of 2119)
PASS: lldb-shell :: SymbolFile/DWARF/dir-separator-no-comp-dir-relative-name.s (827 of 2119)
PASS: lldb-unit :: Process/minidump/./LLDBMinidumpTests/MinidumpParserTest.GetMemoryRegionInfoFromMemory64List (828 of 2119)
UNSUPPORTED: lldb-shell :: Unwind/unwind-plan-dwarf-dump.test (829 of 2119)
PASS: lldb-unit :: Utility/./UtilityTests/CompletionRequest.FakeLastArg (830 of 2119)
PASS: lldb-unit :: Utility/./UtilityTests/ScalarTest.Equality (831 of 2119)
PASS: lldb-api :: commands/disassemble/basic/TestFrameDisassemble.py (832 of 2119)
PASS: lldb-shell :: SymbolFile/DWARF/debug-line-basic.s (833 of 2119)
PASS: lldb-shell :: SymbolFile/dissassemble-entry-point.s (834 of 2119)
UNSUPPORTED: lldb-api :: lang/cpp/function-template-parameter-pack/TestFunctionTemplateParameterPack.py (835 of 2119)
PASS: lldb-unit :: Core/./LLDBCoreTests/MangledTest.ResultForBlockInvocation (836 of 2119)
PASS: lldb-unit :: UnwindAssembly/x86/./UnwindAssemblyx86Tests/Testx86AssemblyInspectionEngine.Testi386IgnoredRegisters (837 of 2119)
UNSUPPORTED: lldb-api :: benchmarks/frame_variable/TestFrameVariableResponse.py (838 of 2119)
PASS: lldb-api :: functionalities/gdb_remote_client/TestWriteMemory.py (839 of 2119)
PASS: lldb-unit :: ObjectFile/PECOFF/./ObjectFilePECOFFTests/PECallFrameInfoTest.Chained_eh (840 of 2119)
PASS: lldb-unit :: Symbol/./SymbolTests/DWARFCallFrameInfoTest.Basic_dwarf3 (841 of 2119)
PASS: lldb-unit :: SymbolFile/NativePDB/./SymbolFileNativePDBTests/PDBFPOProgramToDWARFExpressionTests.SingleAssignmentRegisterRef (842 of 2119)
PASS: lldb-unit :: Process/minidump/./LLDBMinidumpTests/MinidumpParserTest.GetExceptionStream (843 of 2119)
PASS: lldb-shell :: SymbolFile/DWARF/find-inline-method.s (844 of 2119)
PASS: lldb-api :: commands/expression/import-std-module/empty-module/TestEmptyStdModule.py (845 of 2119)
PASS: lldb-unit :: ScriptInterpreter/Python/./ScriptInterpreterPythonTests/PythonDataObjectsTest.TestPythonListManipulation (846 of 2119)
PASS: lldb-unit :: Utility/./UtilityTests/FileSpecTest.EqualSeparator (847 of 2119)
PASS: lldb-unit :: Utility/./UtilityTests/ScalarTest.SetValueFromData (848 of 2119)
PASS: lldb-api :: commands/target/create-no-such-arch/TestNoSuchArch.py (849 of 2119)
PASS: lldb-api :: api/log/TestAPILog.py (850 of 2119)
UNSUPPORTED: lldb-api :: linux/thread/create_during_instruction_step/TestCreateDuringInstructionStep.py (851 of 2119)
PASS: lldb-api :: functionalities/breakpoint/hardware_breakpoints/require_hw_breakpoints/TestRequireHWBreakpoints.py (852 of 2119)
PASS: lldb-unit :: Disassembler/./DisassemblerTests/TestArm64Disassembly.TestArmv81Instruction (853 of 2119)
PASS: lldb-api :: functionalities/breakpoint/breakpoint_ignore_count/TestBreakpointIgnoreCount.py (854 of 2119)
PASS: lldb-api :: functionalities/abbreviation/TestCommonShortSpellings.py (855 of 2119)
PASS: lldb-shell :: Breakpoint/jitbp_elf.test (856 of 2119)
PASS: lldb-unit :: ObjectFile/Breakpad/./ObjectFileBreakpadTests/InfoRecord.parse (857 of 2119)
PASS: lldb-api :: functionalities/data-formatter/summary-string-onfail/Test-rdar-9974002.py (858 of 2119)
PASS: lldb-unit :: Utility/./UtilityTests/ArchSpecTest.OperatorBool (859 of 2119)
PASS: lldb-api :: sample_test/TestSampleInlineTest.py (860 of 2119)
PASS: lldb-unit :: Host/./HostTests/SocketTest.TCPGetAddress (861 of 2119)
PASS: lldb-unit :: Utility/./UtilityTests/SubsystemRAIITest.SubsystemWithErrorFailure (862 of 2119)
PASS: lldb-unit :: Host/./HostTests/SocketTest.UDPGetConnectURI (863 of 2119)
UNSUPPORTED: lldb-shell :: SymbolFile/PDB/vbases.test (864 of 2119)
PASS: lldb-api :: functionalities/recursion/TestValueObjectRecursion.py (865 of 2119)
PASS: lldb-unit :: Utility/./UtilityTests/StringExtractorTest.GetHexBytesAvail (866 of 2119)
PASS: lldb-unit :: ScriptInterpreter/Python/./ScriptInterpreterPythonTests/PythonDataObjectsTest.TestPythonCallableInvoke (867 of 2119)
PASS: lldb-api :: lang/cpp/char8_t/TestCxxChar8_t.py (868 of 2119)
PASS: lldb-unit :: Utility/./UtilityTests/ConstStringTest.MangledCounterpart (869 of 2119)
PASS: lldb-unit :: Utility/./UtilityTests/VMRange.Clear (870 of 2119)
PASS: lldb-unit :: Platform/./LLDBPlatformTests/PlatformAppleSimulatorTest.TestHostPlatformToSim (871 of 2119)
PASS: lldb-api :: lang/c/const_variables/TestConstVariables.py (872 of 2119)
PASS: lldb-unit :: Utility/./UtilityTests/ListenerTest.GetEventImmediate (873 of 2119)
PASS: lldb-unit :: ScriptInterpreter/Python/./ScriptInterpreterPythonTests/PythonDataObjectsTest.TestPythonDictionaryToStructuredDictionary (874 of 2119)
PASS: lldb-api :: functionalities/tsan/thread_numbers/TestTsanThreadNumbers.py (875 of 2119)
PASS: lldb-unit :: UnwindAssembly/x86/./UnwindAssemblyx86Tests/Testx86AssemblyInspectionEngine.TestSimple64bitFrameFunction (876 of 2119)
UNSUPPORTED: lldb-shell :: SymbolFile/PDB/typedefs.test (877 of 2119)
UNSUPPORTED: lldb-api :: tools/lldb-server/TestGdbRemoteModuleInfo.py (878 of 2119)
PASS: lldb-shell :: Minidump/disassemble-no-module.yaml (879 of 2119)
PASS: lldb-unit :: Utility/./UtilityTests/BinaryStreamTest.PutSLEB128SevenBytes (880 of 2119)
PASS: lldb-unit :: Utility/./UtilityTests/RangeDataVector.CustomSort (881 of 2119)
PASS: lldb-unit :: Utility/./UtilityTests/StringExtractorTest.DecodeHexU8_Underflow2 (882 of 2119)
PASS: lldb-api :: python_api/process/io/TestProcessIO.py (883 of 2119)
PASS: lldb-unit :: Utility/./UtilityTests/BinaryStreamTest.PutSLEB128One (884 of 2119)
PASS: lldb-api :: macosx/safe-to-func-call/TestSafeFuncCalls.py (885 of 2119)
PASS: lldb-unit :: ObjectFile/PECOFF/./ObjectFilePECOFFTests/PECallFrameInfoTest.Frame_reg_eh (886 of 2119)
PASS: lldb-unit :: Host/./HostTests/FileSystemTest.Resolve (887 of 2119)
PASS: lldb-api :: lang/objc/orderedset/TestOrderedSet.py (888 of 2119)
PASS: lldb-api :: lang/cpp/enum_types/TestCPP11EnumTypes.py (889 of 2119)
PASS: lldb-unit :: Utility/./UtilityTests/RangeTest.ContainsEndInclusiveInvalid (890 of 2119)
PASS: lldb-unit :: Utility/./UtilityTests/ScalarTest.APIntConstructor (891 of 2119)
UNSUPPORTED: lldb-shell :: Register/x86-ymm-write.test (892 of 2119)
PASS: lldb-api :: lang/cpp/unicode-literals/TestUnicodeLiterals.py (893 of 2119)
PASS: lldb-unit :: Expression/./ExpressionTests/DiagnosticManagerTest.GetStringMultiline (894 of 2119)
PASS: lldb-unit :: ObjectFile/Breakpad/./ObjectFileBreakpadTests/LineRecord.parse (895 of 2119)
PASS: lldb-unit :: Process/minidump/./LLDBMinidumpTests/MinidumpParserTest.InvalidMinidump (896 of 2119)
PASS: lldb-unit :: Utility/./UtilityTests/StreamTest.QuotedCString (897 of 2119)
UNSUPPORTED: lldb-api :: benchmarks/stepping/TestSteppingSpeed.py (898 of 2119)
PASS: lldb-shell :: SymbolFile/Breakpad/unwind-via-stack-win.test (899 of 2119)
PASS: lldb-api :: commands/expression/pr35310/TestExprsBug35310.py (900 of 2119)
PASS: lldb-api :: functionalities/reproducers/attach/TestReproducerAttach.py (901 of 2119)
PASS: lldb-unit :: Core/./LLDBCoreTests/MangledTest.EmptyForInvalidName (902 of 2119)
PASS: lldb-api :: python_api/function_symbol/TestSymbolAPI.py (903 of 2119)
PASS: lldb-api :: functionalities/tail_call_frames/ambiguous_tail_call_seq1/TestAmbiguousTailCallSeq1.py (904 of 2119)
PASS: lldb-unit :: SymbolFile/NativePDB/./SymbolFileNativePDBTests/PDBFPOProgramToDWARFExpressionTests.UnsupportedRASearch (905 of 2119)
PASS: lldb-api :: lang/cpp/rvalue-references/TestRvalueReferences.py (906 of 2119)
PASS: lldb-unit :: Utility/./UtilityTests/ArgsTest.BareSingleQuote (907 of 2119)
PASS: lldb-api :: commands/expression/import-std-module/list/TestListFromStdModule.py (908 of 2119)
UNSUPPORTED: lldb-api :: functionalities/darwin_log/filter/exact_match/subsystem/TestDarwinLogFilterMatchSubsystem.py (909 of 2119)
PASS: lldb-api :: functionalities/thread/exit_during_break/TestExitDuringBreak.py (910 of 2119)
PASS: lldb-unit :: Process/gdb-remote/./ProcessGdbRemoteTests/GDBRemoteCommunicationClientTest.WriteRegisterNoSuffix (911 of 2119)
PASS: lldb-api :: functionalities/value_md5_crash/TestValueMD5Crash.py (912 of 2119)
PASS: lldb-api :: functionalities/data-formatter/data-formatter-stl/libcxx/unique_ptr/TestDataFormatterLibcxxUniquePtr.py (913 of 2119)
PASS: lldb-unit :: Language/Highlighting/./HighlighterTests/HighlighterTest.ClangEmptyInput (914 of 2119)
PASS: lldb-unit :: Utility/./UtilityTests/ArgsTest.TestUnknownEscape (915 of 2119)
PASS: lldb-api :: lang/c/complex_int/TestComplexInt.py (916 of 2119)
PASS: lldb-shell :: Breakpoint/split-dwarf-5-addrbase.test (917 of 2119)
PASS: lldb-shell :: SymbolFile/DWARF/debug_aranges-empty-section.s (918 of 2119)
PASS: lldb-shell :: ObjectFile/ELF/section-types.yaml (919 of 2119)
PASS: lldb-unit :: Language/Highlighting/./HighlighterTests/HighlighterTest.DefaultHighlighter (920 of 2119)
PASS: lldb-unit :: Expression/./ExpressionTests/CppModuleConfigurationTest.UnrelatedLibrary (921 of 2119)
PASS: lldb-unit :: Utility/./UtilityTests/StringExtractorTest.GetHexBytes_OddPair2 (922 of 2119)
PASS: lldb-unit :: Utility/./UtilityTests/StreamTest.AddressPrefixAndSuffix (923 of 2119)
PASS: lldb-unit :: Utility/./UtilityTests/RegularExpression.Valid (924 of 2119)
PASS: lldb-unit :: DataFormatter/./LLDBFormatterTests/TypeMatcherTests.GetMatchStringRegex (925 of 2119)
PASS: lldb-api :: commands/watchpoints/watchpoint_count/TestWatchpointCount.py (926 of 2119)
PASS: lldb-api :: commands/watchpoints/multiple_hits/TestMultipleHits.py (927 of 2119)
PASS: lldb-unit :: Utility/./UtilityTests/BinaryStreamTest.PutSLEB128Zero (928 of 2119)
PASS: lldb-unit :: Utility/./UtilityTests/BinaryStreamTest.PutSLEB128EightBytes (929 of 2119)
PASS: lldb-api :: functionalities/gdb_remote_client/TestPlatformClient.py (930 of 2119)
PASS: lldb-api :: types/TestFloatTypes.py (931 of 2119)
PASS: lldb-api :: functionalities/pointer_num_children/TestPointerNumChildren.py (932 of 2119)
PASS: lldb-unit :: Utility/./UtilityTests/StatusTest.ErrorCodeConstructor (933 of 2119)
PASS: lldb-api :: lang/cpp/function-qualifiers/TestCppFunctionQualifiers.py (934 of 2119)
PASS: lldb-unit :: Utility/./UtilityTests/StringListTest.InsertStringAtIndexStdString (935 of 2119)
PASS: lldb-unit :: Host/./HostTests/ConnectionFileDescriptorTest.TCPGetURIv4 (936 of 2119)
PASS: lldb-unit :: SymbolFile/DWARF/./SymbolFileDWARFTests/DWARFASTParserClangTests.EnsureAllDIEsInDeclContextHaveBeenParsedParsesOnlyMatchingEntries (937 of 2119)
PASS: lldb-api :: commands/expression/import-std-module/weak_ptr-dbg-info-content/TestDbgInfoContentWeakPtrFromStdModule.py (938 of 2119)
UNSUPPORTED: lldb-shell :: ExecControl/StopHook/stop-hook-threads.test (939 of 2119)
FAIL: lldb-api :: functionalities/gdb_remote_client/TestThreadSelectionBug.py (940 of 2119)
******************** TEST 'lldb-api :: functionalities/gdb_remote_client/TestThreadSelectionBug.py' FAILED ********************
Script:
--
/usr/local/Frameworks/Python.framework/Versions/3.7/bin/python3.7 /Users/buildslave/jenkins/workspace/lldb-cmake/llvm-project/lldb/test/API/dotest.py --arch x86_64 -s /Users/buildslave/jenkins/workspace/lldb-cmake/lldb-build/lldb-test-traces -S nm -u CXXFLAGS -u CFLAGS --codesign-identity - --server /Users/buildslave/jenkins/workspace/lldb-cmake/lldb-build/./bin/debugserver --arch x86_64 --build-dir /Users/buildslave/jenkins/workspace/lldb-cmake/lldb-build/lldb-test-build.noindex -s=/Users/buildslave/jenkins/workspace/lldb-cmake/test/logs -t --env TERM=vt100 --env LLVM_LIBS_DIR=/Users/buildslave/jenkins/workspace/lldb-cmake/lldb-build/./lib --build-dir /Users/buildslave/jenkins/workspace/lldb-cmake/lldb-build/lldb-test-build.noindex --lldb-module-cache-dir /Users/buildslave/jenkins/workspace/lldb-cmake/lldb-build/lldb-test-build.noindex/module-cache-lldb/lldb-api --clang-module-cache-dir /Users/buildslave/jenkins/workspace/lldb-cmake/lldb-build/lldb-test-build.noindex/module-cache-clang/lldb-api --executable /Users/buildslave/jenkins/workspace/lldb-cmake/lldb-build/./bin/lldb --compiler /Users/buildslave/jenkins/workspace/lldb-cmake/lldb-build/./bin/clang --dsymutil /Users/buildslave/jenkins/workspace/lldb-cmake/lldb-build/./bin/dsymutil --filecheck /Users/buildslave/jenkins/workspace/lldb-cmake/lldb-build/./bin/FileCheck --yaml2obj /Users/buildslave/jenkins/workspace/lldb-cmake/lldb-build/./bin/yaml2obj --lldb-libs-dir /Users/buildslave/jenkins/workspace/lldb-cmake/lldb-build/./lib /Users/buildslave/jenkins/workspace/lldb-cmake/llvm-project/lldb/test/API/functionalities/gdb_remote_client -p TestThreadSelectionBug.py
--
Exit Code: 1

Hide Details

Command Output (stdout): -- lldb version 12.0.99 clang revision 3a34228bff6fdf45b50cb57cf5fb85d659eeb672 llvm revision 3a34228bff6fdf45b50cb57cf5fb85d659eeb672 LLDB library dir: /Users/buildslave/jenkins/workspace/lldb-cmake/lldb-build/bin LLDB import library dir: /Users/buildslave/jenkins/workspace/lldb-cmake/lldb-build/./lib libstdcxx tests will not be run because: Don't know how to build with libstdcxx on macosx Skipping following debug info categories: ['dwo']

Hide Details

-- Command Output (stderr): --

Hide Details

Session logs for test failures/errors/unexpected successes will go into directory '/Users/buildslave/jenkins/workspace/lldb-cmake/test/logs' Change dir to: /Users/buildslave/jenkins/workspace/lldb-cmake/llvm-project/lldb/test/API/functionalities/gdb_remote_client runCmd: settings clear -all output:

Hide Details

runCmd: settings set symbols.enable-external-lookup false output:

Hide Details

runCmd: settings set target.inherit-tcc true output:

Hide Details

runCmd: settings set target.auto-apply-fixits false output:

Hide Details

runCmd: settings set plugin.process.gdb-remote.packet-timeout 60 output:

Hide Details

runCmd: settings set symbols.clang-modules-cache-path "/Users/buildslave/jenkins/workspace/lldb-cmake/lldb-build/lldb-test-build.noindex/module-cache-lldb/lldb-api" output:

Hide Details

runCmd: settings set use-color false output:

Hide Details

runCmd: setting set target.prefer-dynamic-value no-dynamic-values output:

Hide Details

FAIL: LLDB (/Users/buildslave/jenkins/workspace/lldb-cmake/lldb-build/bin/clang-x86_64) :: test (TestThreadSelectionBug.TestThreadSelectionBug) <bound method SBProcess.Kill of <lldb.SBProcess; proxy of <Swig Object of type 'lldb::SBProcess *' at 0x10276c390> >>: success

Hide Details

Restore dir to: /Users/buildslave/jenkins/workspace/lldb-cmake/lldb-build/tools/lldb/test ====================================================================== FAIL: test (TestThreadSelectionBug.TestThreadSelectionBug) ---------------------------------------------------------------------- Traceback (most recent call last): File "/Users/buildslave/jenkins/workspace/lldb-cmake/llvm-project/lldb/test/API/functionalities/gdb_remote_client/TestThreadSelectionBug.py", line 16, in test process = self.connect(target) File "/Users/buildslave/jenkins/workspace/lldb-cmake/llvm-project/lldb/test/API/functionalities/gdb_remote_client/gdbclientutils.py", line 519, in connect self.assertTrue(error.Success(), error.description) AssertionError: False is not True : failed to get reply to handshake packet Config=x86_64-/Users/buildslave/jenkins/workspace/lldb-cmake/lldb-build/bin/clang ---------------------------------------------------------------------- Ran 1 test in 106.398s

Hide Details

RESULT: FAILED (0 passes, 1 failures, 0 errors, 0 skipped, 0 expected failures, 0 unexpected successes)

Hide Details

--

Hide Details

******************** PASS: lldb-unit :: Target/./TargetTests/PathMappingListTest.AbsoluteTests (941 of 2119) PASS: lldb-unit :: Utility/./UtilityTests/StringExtractorTest.GetHexU8_InvalidHex (942 of 2119) PASS: lldb-unit :: Utility/./UtilityTests/RangeDataVector.FindEntryThatContains (943 of 2119) PASS: lldb-unit :: Expression/./ExpressionTests/CppModuleConfigurationTest.UnknownLibCppFile (944 of 2119) PASS: lldb-unit :: Symbol/./SymbolTests/TestTypeSystemClang.AddMethodToObjCObjectType (945 of 2119) PASS: lldb-api :: lang/objc/hidden-ivars/TestHiddenIvars.py (946 of 2119) UNSUPPORTED: lldb-api :: lang/c/unicode/TestUnicodeSymbols.py (947 of 2119) PASS: lldb-unit :: DataFormatter/./LLDBFormatterTests/TypeMatcherTests.GetMatchStringExactName (948 of 2119) PASS: lldb-unit :: ObjectFile/Breakpad/./ObjectFileBreakpadTests/FileRecord.parse (949 of 2119) PASS: lldb-api :: lang/objc/exceptions/TestObjCExceptions.py (950 of 2119) PASS: lldb-api :: lang/cpp/offsetof/TestOffsetofCpp.py (951 of 2119) PASS: lldb-api :: commands/process/launch-with-shellexpand/TestLaunchWithShellExpand.py (952 of 2119) PASS: lldb-unit :: Utility/./UtilityTests/LogTest.LLDB_LOG_nullptr (953 of 2119) PASS: lldb-api :: macosx/add-dsym/TestAddDsymMidExecutionCommand.py (954 of 2119) PASS: lldb-unit :: Utility/./UtilityTests/StringListTest.DefaultConstructor (955 of 2119) PASS: lldb-unit :: Utility/./UtilityTests/StringExtractorTest.GetU32LittleEndian (956 of 2119) PASS: lldb-api :: functionalities/breakpoint/source_regexp/TestSourceRegexBreakpoints.py (957 of 2119) PASS: lldb-api :: commands/platform/file/close/TestPlatformFileClose.py (958 of 2119) PASS: lldb-unit :: Utility/./UtilityTests/BinaryStreamTest.PutSLEB128MaxValue (959 of 2119) PASS: lldb-shell :: Breakpoint/ppc64-localentry.test (960 of 2119) PASS: lldb-shell :: SymbolFile/DWARF/split-dwarf-inlining.cpp (961 of 2119) PASS: lldb-api :: functionalities/data-formatter/type_summary_list_script/TestTypeSummaryListScript.py (962 of 2119) PASS: lldb-shell :: Minidump/Windows/broken-unwind.test (963 of 2119) PASS: lldb-api :: lang/c/unions/TestUnionMembers.py (964 of 2119) PASS: lldb-api :: commands/add-dsym/uuid/TestAddDsymCommand.py (965 of 2119) PASS: lldb-unit :: Core/./LLDBCoreTests/ModuleSpecTest.TestCOFFFile (966 of 2119) PASS: lldb-shell :: SymbolFile/DWARF/dir-separator-no-comp-dir.s (967 of 2119) PASS: lldb-api :: macosx/find-app-in-bundle/TestFindAppInBundle.py (968 of 2119) PASS: lldb-api :: functionalities/thread/concurrent_events/TestConcurrentDelayedCrashWithBreakpointWatchpoint.py (969 of 2119) PASS: lldb-unit :: Utility/./UtilityTests/ConstStringTest.CompareConstString (970 of 2119) PASS: lldb-api :: functionalities/thread/concurrent_events/TestConcurrentDelayWatchBreak.py (971 of 2119) PASS: lldb-unit :: Utility/./UtilityTests/StreamTest.AddressSuffix (972 of 2119) PASS: lldb-unit :: SymbolFile/NativePDB/./SymbolFileNativePDBTests/PDBFPOProgramToDWARFExpressionTests.InvalidOpUnary (973 of 2119) PASS: lldb-unit :: ScriptInterpreter/Python/./ScriptInterpreterPythonTests/PythonDataObjectsTest.TestPythonBoolean (974 of 2119) PASS: lldb-unit :: Interpreter/./InterpreterTests/CompletionTest.DirCompletionUsername (975 of 2119) PASS: lldb-api :: commands/expression/top-level/TestTopLevelExprs.py (976 of 2119) PASS: lldb-api :: functionalities/signal/handle-abrt/TestHandleAbort.py (977 of 2119) PASS: lldb-shell :: SymbolFile/DWARF/clang-ast-from-dwarf-unamed-and-anon-structs.cpp (978 of 2119) PASS: lldb-unit :: Interpreter/./InterpreterTests/CompletionTest.FileCompletionAbsolute (979 of 2119) PASS: lldb-unit :: Process/gdb-remote/./ProcessGdbRemoteTests/GDBRemoteCommunicationClientTest.SendGetMetaDataPacket (980 of 2119) PASS: lldb-shell :: SymbolFile/DWARF/find-basic-function.cpp (981 of 2119) PASS: lldb-unit :: SymbolFile/NativePDB/./SymbolFileNativePDBTests/PDBFPOProgramToDWARFExpressionTests.UnknownOp (982 of 2119) UNSUPPORTED: lldb-api :: functionalities/darwin_log/filter/regex/category/TestDarwinLogFilterRegexCategory.py (983 of 2119) PASS: lldb-unit :: Utility/./UtilityTests/UUIDTest.SetFromStringRef (984 of 2119) PASS: lldb-unit :: Utility/./UtilityTests/BinaryStreamTest.PutSLEB128NineBytes (985 of 2119) UNSUPPORTED: lldb-api :: functionalities/darwin_log/source/debug/TestDarwinLogSourceDebug.py (986 of 2119) PASS: lldb-api :: commands/watchpoints/watchpoint_commands/condition/TestWatchpointConditionCmd.py (987 of 2119) PASS: lldb-unit :: Utility/./UtilityTests/VMRange.CollectionContains (988 of 2119) PASS: lldb-api :: functionalities/non-overlapping-index-variable-i/TestIndexVariable.py (989 of 2119) PASS: lldb-api :: functionalities/breakpoint/global_constructor/TestBreakpointInGlobalConstructor.py (990 of 2119) PASS: lldb-unit :: Expression/./ExpressionTests/DiagnosticManagerTest.HasFixits (991 of 2119) PASS: lldb-unit :: Core/./LLDBCoreTests/SourceFileCache.FindSourceFileNotFound (992 of 2119) UNSUPPORTED: lldb-api :: functionalities/darwin_log/filter/exact_match/category/TestDarwinLogFilterMatchCategory.py (993 of 2119) PASS: lldb-unit :: ScriptInterpreter/Python/./ScriptInterpreterPythonTests/PythonDataObjectsTest.TestResetting (994 of 2119) PASS: lldb-unit :: DataFormatter/./LLDBFormatterTests/FormatManagerTests.CompatibleLangs (995 of 2119) PASS: lldb-unit :: Utility/./UtilityTests/ArchSpecTest.TestParseMachCPUDashSubtypeTripleExtra (996 of 2119) PASS: lldb-api :: commands/command/nested_alias/TestNestedAlias.py (997 of 2119) PASS: lldb-api :: functionalities/thread/concurrent_events/TestConcurrentNWatchNBreak.py (998 of 2119) PASS: lldb-unit :: Expression/./ExpressionTests/CppModuleConfigurationTest.Linux (999 of 2119) PASS: lldb-unit :: Utility/./UtilityTests/StringListTest.PopBack (1000 of 2119) PASS: lldb-api :: lang/objc/modules-non-objc-target/TestObjCModulesNonObjCTarget.py (1001 of 2119) PASS: lldb-unit :: Signals/./SignalsTests/UnixSignalsTest.GetFilteredSignals (1002 of 2119) PASS: lldb-api :: commands/expression/timeout/TestCallWithTimeout.py (1003 of 2119) PASS: lldb-shell :: SymbolFile/DWARF/DW_AT_declaration-with-children.s (1004 of 2119) PASS: lldb-unit :: Process/gdb-remote/./ProcessGdbRemoteTests/GDBRemoteClientBaseTest.SendContinueAndWait (1005 of 2119) PASS: lldb-shell :: Quit/TestQuitExitCode0.test (1006 of 2119) PASS: lldb-unit :: Interpreter/./InterpreterTests/CompletionTest.DirCompletionAbsolute (1007 of 2119) PASS: lldb-unit :: Utility/./UtilityTests/StreamTeeTest.SetStreamAtIndexOutOfBounds (1008 of 2119) PASS: lldb-api :: python_api/target/TestTargetAPI.py (1009 of 2119) PASS: lldb-api :: macosx/queues/TestQueues.py (1010 of 2119) PASS: lldb-shell :: SymbolFile/NativePDB/nested-types.cpp (1011 of 2119) PASS: lldb-unit :: Utility/./UtilityTests/StringExtractorTest.GetNameColonValueContainsColon (1012 of 2119) PASS: lldb-unit :: Expression/./ExpressionTests/DWARFExpression.DW_OP_unknown (1013 of 2119) UNSUPPORTED: lldb-shell :: Register/x86-gp-read.test (1014 of 2119) PASS: lldb-api :: macosx/find-dsym/deep-bundle/TestDeepBundle.py (1015 of 2119) PASS: lldb-api :: functionalities/data-formatter/data-formatter-stl/libcxx/variant/TestDataFormatterLibcxxVariant.py (1016 of 2119) PASS: lldb-api :: lang/objc/objc-class-method/TestObjCClassMethod.py (1017 of 2119) PASS: lldb-api :: functionalities/data-formatter/data-formatter-stl/libcxx/list/loop/TestDataFormatterLibcxxListLoop.py (1018 of 2119) UNSUPPORTED: lldb-api :: benchmarks/libcxxmap/TestBenchmarkLibcxxMap.py (1019 of 2119) PASS: lldb-api :: functionalities/object-file/TestImageListMultiArchitecture.py (1020 of 2119) PASS: lldb-unit :: Expression/./ExpressionTests/DiagnosticManagerTest.AddDiagnostic (1021 of 2119) PASS: lldb-shell :: ScriptInterpreter/None/none.test (1022 of 2119) PASS: lldb-unit :: Utility/./UtilityTests/StringExtractorTest.GetHexU8_InvalidHex_NoEof (1023 of 2119) PASS: lldb-unit :: Utility/./UtilityTests/StreamTest.PutHex32ByteOrderBig (1024 of 2119) PASS: lldb-unit :: Utility/./UtilityTests/StringExtractorTest.DecodeHexU8_InvalidHex (1025 of 2119) PASS: lldb-api :: lang/cpp/alignas_base_class/TestAlignAsBaseClass.py (1026 of 2119) PASS: lldb-shell :: Driver/TestUseColor.test (1027 of 2119) PASS: lldb-unit :: UnwindAssembly/x86/./UnwindAssemblyx86Tests/Testx86AssemblyInspectionEngine.TestPopEDI (1028 of 2119) PASS: lldb-unit :: Utility/./UtilityTests/XcodeSDKTest.SDKSupportsModules (1029 of 2119) PASS: lldb-api :: iohandler/unicode/TestUnicode.py (1030 of 2119) PASS: lldb-api :: commands/process/attach/TestProcessAttach.py (1031 of 2119) PASS: lldb-unit :: UnwindAssembly/x86/./UnwindAssemblyx86Tests/Testx86AssemblyInspectionEngine.TestSubESP (1032 of 2119) PASS: lldb-api :: commands/expression/deleting-implicit-copy-constructor/TestDeletingImplicitCopyConstructor.py (1033 of 2119) PASS: lldb-shell :: SymbolFile/NativePDB/tag-types.cpp (1034 of 2119) PASS: lldb-unit :: Utility/./UtilityTests/SerializationRountripTest.SerializeDeserializeCStringNull (1035 of 2119) PASS: lldb-api :: python_api/class_members/TestSBTypeClassMembers.py (1036 of 2119) PASS: lldb-api :: python_api/sbtype_typeclass/TestSBTypeTypeClass.py (1037 of 2119) PASS: lldb-api :: types/TestIntegerTypeExpr.py (1038 of 2119) UNSUPPORTED: lldb-api :: functionalities/data-formatter/data-formatter-stl/libstdcpp/unique_ptr/TestDataFormatterStdUniquePtr.py (1039 of 2119) UNSUPPORTED: lldb-api :: tools/lldb-server/thread-name/TestGdbRemoteThreadName.py (1040 of 2119) PASS: lldb-api :: commands/platform/basic/TestPlatformPython.py (1041 of 2119) PASS: lldb-shell :: SymbolFile/DWARF/debug_loclists-dwo.s (1042 of 2119) PASS: lldb-unit :: Utility/./UtilityTests/OptionsWithRawTest.WhitespaceInput (1043 of 2119) PASS: lldb-unit :: Utility/./UtilityTests/SerializationRountripTest.SerializeDeserializePod (1044 of 2119) PASS: lldb-unit :: Language/Highlighting/./HighlighterTests/HighlighterTest.ClangUnterminatedString (1045 of 2119) PASS: lldb-api :: lang/objc/foundation/TestConstStrings.py (1046 of 2119) PASS: lldb-api :: functionalities/breakpoint/address_breakpoints/TestAddressBreakpoints.py (1047 of 2119) PASS: lldb-api :: functionalities/avoids-fd-leak/TestFdLeak.py (1048 of 2119) PASS: lldb-shell :: Breakpoint/dummy-target.test (1049 of 2119) PASS: lldb-unit :: Utility/./UtilityTests/StreamTest.ShiftOperatorPtr (1050 of 2119) PASS: lldb-unit :: Utility/./UtilityTests/VMRange.SetEndAddress (1051 of 2119) PASS: lldb-unit :: Symbol/./SymbolTests/TestTypeSystemClang.TestRemoveFastQualifiers (1052 of 2119) PASS: lldb-unit :: Utility/./UtilityTests/RangeTest.DoesAdjoinOrIntersect (1053 of 2119) PASS: lldb-api :: commands/expression/codegen-crash-typedefdecl-not-in_declcontext/TestCodegenCrashTypedefDeclNotInDeclContext.py (1054 of 2119) PASS: lldb-shell :: BuildScript/compiler-full-path.test (1055 of 2119) PASS: lldb-shell :: SymbolFile/DWARF/dwp.s (1056 of 2119) PASS: lldb-api :: lang/cpp/class_types/TestClassTypesDisassembly.py (1057 of 2119) PASS: lldb-shell :: SymbolFile/DWARF/clang-ast-from-dwarf-objc-property.m (1058 of 2119) PASS: lldb-unit :: Process/./ProcessEventDataTests/ProcessEventDataTest.DoOnRemoval (1059 of 2119) PASS: lldb-unit :: Utility/./UtilityTests/BinaryStreamTest.PutULEB128SevenBytes (1060 of 2119) UNSUPPORTED: lldb-shell :: Process/Windows/exception_access_violation.cpp (1061 of 2119) XFAIL: lldb-shell :: Register/x86-mm-xmm-write.test (1062 of 2119) PASS: lldb-unit :: Symbol/./SymbolTests/TestTypeSystemClang.TestGetBasicTypeFromEnum (1063 of 2119) PASS: lldb-api :: functionalities/data-formatter/data-formatter-stl/libcxx/list/TestDataFormatterLibcxxList.py (1064 of 2119) PASS: lldb-api :: commands/expression/import-std-module/unique_ptr/TestUniquePtrFromStdModule.py (1065 of 2119) PASS: lldb-unit :: Utility/./UtilityTests/StringListTest.SplitIntoLines (1066 of 2119) PASS: lldb-shell :: Host/TestCustomShell.test (1067 of 2119) PASS: lldb-unit :: Utility/./UtilityTests/StreamTest.AddressEmptyPrefix (1068 of 2119) PASS: lldb-shell :: Commands/command-source.test (1069 of 2119) PASS: lldb-unit :: Utility/./UtilityTests/FileSpecTest.GuessPathStyle (1070 of 2119) PASS: lldb-unit :: Utility/./UtilityTests/ArgsTest.TestAppendArg (1071 of 2119) PASS: lldb-unit :: Utility/./UtilityTests/RangeTest.Clear (1072 of 2119) PASS: lldb-unit :: Utility/./UtilityTests/SerializationRountripTest.SerializeDeserializeCStringArrayNullptr (1073 of 2119) PASS: lldb-unit :: Host/./HostTests/File.GetStreamFromDescriptor (1074 of 2119) UNSUPPORTED: lldb-api :: lang/cpp/static_members/TestCPPStaticMembers.py (1075 of 2119) PASS: lldb-api :: types/TestLongTypesExpr.py (1076 of 2119) PASS: lldb-api :: lang/cpp/namespace_definitions/TestNamespaceDefinitions.py (1077 of 2119) PASS: lldb-api :: lang/c/local_types/TestUseClosestType.py (1078 of 2119) UNSUPPORTED: lldb-api :: benchmarks/libcxxlist/TestBenchmarkLibcxxList.py (1079 of 2119) PASS: lldb-unit :: Utility/./UtilityTests/OptionsWithRawTest.UnterminatedQuote (1080 of 2119) PASS: lldb-api :: commands/expression/import-std-module/stack/TestStackFromStdModule.py (1081 of 2119) PASS: lldb-api :: commands/frame/diagnose/local-variable/TestLocalVariable.py (1082 of 2119) PASS: lldb-unit :: UnwindAssembly/ARM64/./Arm64InstEmulationTests/TestArm64InstEmulation.TestFramelessThreeEpilogueFunction (1083 of 2119) PASS: lldb-api :: lang/c/local_variables/TestLocalVariables.py (1084 of 2119) PASS: lldb-shell :: ObjectFile/PECOFF/section-types.yaml (1085 of 2119) PASS: lldb-shell :: Reproducer/Functionalities/TestDataFormatter.test (1086 of 2119) PASS: lldb-api :: functionalities/thread/concurrent_events/TestConcurrentCrashWithWatchpointBreakpointSignal.py (1087 of 2119) PASS: lldb-shell :: Commands/CommandScriptImmediateOutput/CommandScriptImmediateOutputConsole.test (1088 of 2119) PASS: lldb-api :: functionalities/asan/TestReportData.py (1089 of 2119) PASS: lldb-api :: commands/gui/invalid-args/TestInvalidArgsGui.py (1090 of 2119) PASS: lldb-unit :: Process/./ProcessEventDataTests/ProcessEventDataTest.ShouldStop (1091 of 2119) PASS: lldb-unit :: Utility/./UtilityTests/StreamTeeTest.CopyConstructor (1092 of 2119) PASS: lldb-api :: functionalities/data-formatter/data-formatter-ptr-to-array/TestPtrToArrayFormatting.py (1093 of 2119) PASS: lldb-api :: commands/expression/multiline-navigation/TestMultilineNavigation.py (1094 of 2119) PASS: lldb-unit :: ScriptInterpreter/Python/./ScriptInterpreterPythonTests/PythonDataObjectsTest.TestPythonStringToStr (1095 of 2119) PASS: lldb-api :: commands/expression/import_builtin_fileid/TestImportBuiltinFileID.py (1096 of 2119) PASS: lldb-api :: commands/log/invalid-args/TestInvalidArgsLog.py (1097 of 2119) PASS: lldb-unit :: Utility/./UtilityTests/StringListTest.CopyList (1098 of 2119) PASS: lldb-unit :: Utility/./UtilityTests/BinaryStreamTest.PutSLEB128OneByte (1099 of 2119) PASS: lldb-unit :: Utility/./UtilityTests/StreamTest.PutPtr (1100 of 2119) PASS: lldb-unit :: ScriptInterpreter/Python/./ScriptInterpreterPythonTests/PythonDataObjectsTest.TestPythonStringToStructuredString (1101 of 2119) PASS: lldb-unit :: Core/./LLDBCoreTests/ModuleSpecTest.InvalidInMemoryBufferValidFile (1102 of 2119) PASS: lldb-unit :: Utility/./UtilityTests/StringListTest.JoinNonSpace (1103 of 2119) PASS: lldb-shell :: ObjectFile/PECOFF/dep-modules.yaml (1104 of 2119) PASS: lldb-api :: lang/objc/modules-app-update/TestClangModulesAppUpdate.py (1105 of 2119) PASS: lldb-api :: tools/lldb-vscode/launch/TestVSCode_launch.py (1106 of 2119) PASS: lldb-unit :: Utility/./UtilityTests/StreamTest.PutStringAsRawHex8 (1107 of 2119) PASS: lldb-api :: terminal/TestEditline.py (1108 of 2119) PASS: lldb-api :: commands/platform/basic/TestPlatformCommand.py (1109 of 2119) PASS: lldb-api :: tools/lldb-server/TestGdbRemoteExpeditedRegisters.py (1110 of 2119) PASS: lldb-unit :: Breakpoint/./LLDBBreakpointTests/BreakpointIDTest.StringIsBreakpointName (1111 of 2119) PASS: lldb-unit :: Utility/./UtilityTests/UriParserTest.BracketedHostnameWithColon (1112 of 2119) PASS: lldb-api :: lang/objc/modules/TestObjCModules.py (1113 of 2119) PASS: lldb-api :: functionalities/data-formatter/data-formatter-stl/libcxx/atomic/TestLibCxxAtomic.py (1114 of 2119) PASS: lldb-unit :: Platform/./LLDBPlatformTests/PlatformAppleSimulatorTest.TestSimHasSimEnvionament (1115 of 2119) PASS: lldb-unit :: API/./APITests/SBCommandInterpreterTest.MultiWordCommand (1116 of 2119) PASS: lldb-api :: functionalities/unwind/zeroth_frame/TestZerothFrame.py (1117 of 2119) PASS: lldb-unit :: Utility/./UtilityTests/BinaryStreamTest.PutULEB128ThreeBytes (1118 of 2119) PASS: lldb-shell :: Settings/TestSettingsWrite.test (1119 of 2119) PASS: lldb-unit :: Utility/./UtilityTests/StringExtractorTest.GetU64LittleEndian (1120 of 2119) PASS: lldb-api :: functionalities/memory/find/TestMemoryFind.py (1121 of 2119) PASS: lldb-unit :: Utility/./UtilityTests/StreamTest.PutHex16ByteOrderBig (1122 of 2119) PASS: lldb-unit :: Process/gdb-remote/./ProcessGdbRemoteTests/GDBRemoteCommunicationClientTest.GetModulesInfo_UUID20 (1123 of 2119) PASS: lldb-unit :: Utility/./UtilityTests/RangeTest.Constructor (1124 of 2119) PASS: lldb-api :: functionalities/target_var/TestTargetVar.py (1125 of 2119) PASS: lldb-unit :: Utility/./UtilityTests/OptionsWithRawTest.QuotedSuffix (1126 of 2119) PASS: lldb-api :: lang/cpp/static_methods/TestCPPStaticMethods.py (1127 of 2119) PASS: lldb-unit :: Utility/./UtilityTests/RegularExpression.Match (1128 of 2119) PASS: lldb-unit :: API/./APITests/SBCommandInterpreterTest.SingleWordCommand (1129 of 2119) PASS: lldb-unit :: Utility/./UtilityTests/UriParserTest.BadPort2 (1130 of 2119) PASS: lldb-shell :: SymbolFile/DWARF/find-qualified-variable.cpp (1131 of 2119) PASS: lldb-shell :: Quit/TestQuitExitCodeNonInt.test (1132 of 2119) PASS: lldb-shell :: SymbolFile/DWARF/debug-names-compressed.cpp (1133 of 2119) PASS: lldb-api :: commands/command/delete/TestCommandDelete.py (1134 of 2119) PASS: lldb-unit :: Host/./HostTests/NativeProcessProtocolTest.SetBreakpoint (1135 of 2119) UNSUPPORTED: lldb-api :: lang/objc/objc-dynamic-value/TestObjCDynamicValue.py (1136 of 2119) UNSUPPORTED: lldb-api :: functionalities/data-formatter/data-formatter-stl/libstdcpp/map/TestDataFormatterStdMap.py (1137 of 2119) PASS: lldb-api :: lang/c/function_types/TestFunctionTypes.py (1138 of 2119) PASS: lldb-shell :: ScriptInterpreter/Python/scripted_breakpoint.test (1139 of 2119) PASS: lldb-api :: python_api/breakpoint/TestBreakpointAPI.py (1140 of 2119) PASS: lldb-api :: functionalities/tsan/global_location/TestTsanGlobalLocation.py (1141 of 2119) PASS: lldb-unit :: Utility/./UtilityTests/ArgsTest.StringListConstructor (1142 of 2119) PASS: lldb-shell :: SymbolFile/NativePDB/ast-methods.cpp (1143 of 2119) PASS: lldb-unit :: Process/minidump/./LLDBMinidumpTests/RegisterContextMinidump.CheckRegisterContextMinidump_ARM (1144 of 2119) PASS: lldb-unit :: Language/Highlighting/./HighlighterTests/HighlighterTest.ClangPreserveNewLine (1145 of 2119) PASS: lldb-api :: lang/objc/objc-ivar-stripped/TestObjCIvarStripped.py (1146 of 2119) PASS: lldb-unit :: SymbolFile/DWARF/./SymbolFileDWARFTests/SymbolFileDWARFTests.TestAbbrevOrder1Start5 (1147 of 2119) PASS: lldb-api :: functionalities/mtc/simple/TestMTCSimple.py (1148 of 2119) PASS: lldb-unit :: Utility/./UtilityTests/StringListTest.CopyListSingle (1149 of 2119) PASS: lldb-unit :: Utility/./UtilityTests/RangeTest.EqualInvalid (1150 of 2119) PASS: lldb-unit :: Utility/./UtilityTests/RangeDataVector.FindEntryIndexesThatContain_Overlap (1151 of 2119) PASS: lldb-api :: functionalities/inferior-crashing/TestInferiorCrashingStep.py (1152 of 2119) PASS: lldb-unit :: Expression/./ExpressionTests/DiagnosticManagerTest.AppendMessageNoDiag (1153 of 2119) PASS: lldb-unit :: Interpreter/./InterpreterTests/OptionArgParserTest.toChar (1154 of 2119) PASS: lldb-unit :: Host/./HostTests/SocketTest.DomainListenConnectAccept (1155 of 2119) PASS: lldb-shell :: BuildScript/modes.test (1156 of 2119) PASS: lldb-unit :: UnwindAssembly/x86/./UnwindAssemblyx86Tests/Testx86AssemblyInspectionEngine.TestPushECX (1157 of 2119) XFAIL: lldb-shell :: Register/x86-64-ymm-write.test (1158 of 2119) UNSUPPORTED: lldb-api :: functionalities/darwin_log/basic/TestDarwinLogBasic.py (1159 of 2119) PASS: lldb-unit :: Utility/./UtilityTests/StringListTest.AppendStringStdString (1160 of 2119) UNSUPPORTED: lldb-shell :: SymbolFile/DWARF/split-dwarf-expression-eval-bug.cpp (1161 of 2119) PASS: lldb-api :: lang/objc/objc-super/TestObjCSuper.py (1162 of 2119) PASS: lldb-api :: lang/cpp/breakpoint-commands/TestCPPBreakpointCommands.py (1163 of 2119) PASS: lldb-api :: functionalities/postmortem/minidump-new/TestMiniDumpNew.py (1164 of 2119) PASS: lldb-shell :: SymbolFile/DWARF/DW_TAG_variable-invalid_location.s (1165 of 2119) PASS: lldb-api :: functionalities/breakpoint/inlined_breakpoints/TestInlinedBreakpoints.py (1166 of 2119) PASS: lldb-unit :: Utility/./UtilityTests/StringExtractorTest.InitMisc (1167 of 2119) PASS: lldb-unit :: Utility/./UtilityTests/UriParserTest.SchemeHostSeparator2 (1168 of 2119) PASS: lldb-api :: macosx/universal/TestUniversal.py (1169 of 2119) PASS: lldb-unit :: UnwindAssembly/x86/./UnwindAssemblyx86Tests/Testx86AssemblyInspectionEngine.TestPushR13 (1170 of 2119) PASS: lldb-unit :: Utility/./UtilityTests/StringListTest.AppendListCStringArrayEmpty (1171 of 2119) PASS: lldb-api :: lang/objc/foundation/TestObjCMethods2.py (1172 of 2119) PASS: lldb-unit :: Process/gdb-remote/./ProcessGdbRemoteTests/GDBRemoteClientBaseTest.SendContinueAndAsyncSignal (1173 of 2119) PASS: lldb-shell :: VSCode/TestOptions.test (1174 of 2119) PASS: lldb-api :: functionalities/data-formatter/data-formatter-categories/TestDataFormatterCategories.py (1175 of 2119) PASS: lldb-api :: commands/expression/static-initializers/TestStaticInitializers.py (1176 of 2119) PASS: lldb-shell :: Reproducer/TestVersionCheck.test (1177 of 2119) UNSUPPORTED: lldb-shell :: SymbolFile/PDB/func-symbols.test (1178 of 2119) PASS: lldb-api :: commands/settings/TestSettings.py (1179 of 2119) PASS: lldb-unit :: Utility/./UtilityTests/StringExtractorTest.GetHexU8_Extra (1180 of 2119) PASS: lldb-api :: commands/expression/context-object-objc/TestContextObjectObjc.py (1181 of 2119) PASS: lldb-api :: commands/frame/diagnose/dereference-argument/TestDiagnoseDereferenceArgument.py (1182 of 2119) PASS: lldb-api :: functionalities/data-formatter/data-formatter-stl/libcxx/iterator/TestDataFormatterLibccIterator.py (1183 of 2119) PASS: lldb-unit :: Utility/./UtilityTests/StringListTest.CopyListEmpty (1184 of 2119) UNSUPPORTED: lldb-api :: commands/register/register/intel_xtended_registers/mpx_offset_intersection/TestMPXOffsetIntersection.py (1185 of 2119) PASS: lldb-shell :: Recognizer/assert.test (1186 of 2119) PASS: lldb-unit :: Host/./HostTests/FileSystemTest.FileAndDirectoryComponents (1187 of 2119) PASS: lldb-unit :: Utility/./UtilityTests/LogTest.Unregister (1188 of 2119) PASS: lldb-unit :: Utility/./UtilityTests/ConstStringTest.CompareStringRef (1189 of 2119) PASS: lldb-shell :: SymbolFile/NativePDB/global-classes.cpp (1190 of 2119) PASS: lldb-api :: commands/platform/process/list/TestProcessList.py (1191 of 2119) PASS: lldb-unit :: Process/gdb-remote/./ProcessGdbRemoteTests/GDBRemoteCommunicationClientTest.GetModulesInfoInvalidResponse (1192 of 2119) PASS: lldb-api :: python_api/frame/TestFrames.py (1193 of 2119) PASS: lldb-api :: commands/disassemble/basic/TestDisassembleBreakpoint.py (1194 of 2119) PASS: lldb-unit :: Language/Highlighting/./HighlighterTests/HighlighterTest.ClangSquareBrackets (1195 of 2119) PASS: lldb-api :: iohandler/resize/TestIOHandlerResize.py (1196 of 2119) PASS: lldb-api :: commands/watchpoints/hello_watchpoint/TestMyFirstWatchpoint.py (1197 of 2119) PASS: lldb-unit :: Utility/./UtilityTests/RangeTest.SlideZero (1198 of 2119) PASS: lldb-api :: lang/objc/foundation/TestObjectDescriptionAPI.py (1199 of 2119) PASS: lldb-unit :: Utility/./UtilityTests/OptionsWithRawTest.ArgsButNoDelimiter (1200 of 2119) PASS: lldb-unit :: Host/./HostTests/SocketTest.TCPListen0GetPort (1201 of 2119) PASS: lldb-api :: commands/register/register/register_command/TestRegisters.py (1202 of 2119) PASS: lldb-unit :: debugserver/./debugserverTests/RNBSocket.LoopBackConnectIPv6 (1203 of 2119) PASS: lldb-unit :: Utility/./UtilityTests/StreamTest.PutSLEB128 (1204 of 2119) PASS: lldb-api :: functionalities/thread/exit_during_expression/TestExitDuringExpression.py (1205 of 2119) PASS: lldb-api :: functionalities/thread/concurrent_events/TestConcurrentCrashWithWatchpoint.py (1206 of 2119) PASS: lldb-unit :: Utility/./UtilityTests/RangeTest.ContainsRange (1207 of 2119) UNSUPPORTED: lldb-shell :: ScriptInterpreter/Lua/nested_sessions.test (1208 of 2119) PASS: lldb-unit :: ScriptInterpreter/Python/./ScriptInterpreterPythonTests/PythonDataObjectsTest.TestPythonInteger (1209 of 2119) PASS: lldb-unit :: Utility/./UtilityTests/RangeTest.Union (1210 of 2119) PASS: lldb-unit :: DataFormatter/./LLDBFormatterTests/StringPrinterTests.CxxASCII (1211 of 2119) PASS: lldb-shell :: Expr/TestMultilineExpr.test (1212 of 2119) PASS: lldb-shell :: ObjectFile/PECOFF/sections.yaml (1213 of 2119) PASS: lldb-api :: commands/frame/select/TestFrameSelect.py (1214 of 2119) PASS: lldb-api :: functionalities/thread/concurrent_events/TestConcurrentTwoWatchpointThreads.py (1215 of 2119) PASS: lldb-api :: functionalities/thread/crash_during_step/TestCrashDuringStep.py (1216 of 2119) PASS: lldb-shell :: Breakpoint/case-sensitive.test (1217 of 2119) PASS: lldb-unit :: UnwindAssembly/x86/./UnwindAssemblyx86Tests/Testx86AssemblyInspectionEngine.TestReturnDetect (1218 of 2119) PASS: lldb-unit :: ObjectFile/ELF/./ObjectFileELFTests/ObjectFileELFTest.GetModuleSpecifications_EarlySectionHeaders (1219 of 2119) PASS: lldb-api :: functionalities/set-data/TestSetData.py (1220 of 2119) PASS: lldb-shell :: ObjectFile/PECOFF/basic-info-arm64.yaml (1221 of 2119) PASS: lldb-unit :: Process/minidump/./LLDBMinidumpTests/MinidumpParserTest.GetMiscInfo_no_stream (1222 of 2119) PASS: lldb-api :: commands/expression/import-std-module/list-dbg-info-content/TestDbgInfoContentListFromStdModule.py (1223 of 2119) PASS: lldb-api :: functionalities/data-formatter/data-formatter-named-summaries/TestDataFormatterNamedSummaries.py (1224 of 2119) PASS: lldb-shell :: ObjectFile/ELF/netbsd-core-amd64.test (1225 of 2119) PASS: lldb-unit :: Utility/./UtilityTests/UUIDTest.Validity (1226 of 2119) PASS: lldb-unit :: Utility/./UtilityTests/FileSpecTest.RemoveLastPathComponent (1227 of 2119) PASS: lldb-api :: functionalities/tail_call_frames/cross_dso/TestCrossDSOTailCalls.py (1228 of 2119) PASS: lldb-unit :: Host/./HostTests/SocketTest.DomainGetConnectURI (1229 of 2119) PASS: lldb-unit :: Utility/./UtilityTests/StringListTest.ForRange (1230 of 2119) PASS: lldb-unit :: ScriptInterpreter/Python/./ScriptInterpreterPythonTests/PythonDataObjectsTest.TestPythonTupleValues (1231 of 2119) PASS: lldb-api :: lang/objc/objc-foundation-dictionary-empty/TestNSDictionary0.py (1232 of 2119) PASS: lldb-shell :: SymbolFile/DWARF/dwp-separate-debug-file.cpp (1233 of 2119) PASS: lldb-unit :: UnwindAssembly/x86/./UnwindAssemblyx86Tests/Testx86AssemblyInspectionEngine.TestSimplei386ugmented (1234 of 2119) PASS: lldb-shell :: Reproducer/Functionalities/TestExpressionEvaluation.test (1235 of 2119) UNSUPPORTED: lldb-api :: functionalities/data-formatter/data-formatter-stl/libstdcpp/vbool/TestDataFormatterStdVBool.py (1236 of 2119) PASS: lldb-api :: functionalities/signal/TestSendSignal.py (1237 of 2119) UNSUPPORTED: lldb-api :: commands/watchpoints/multi_watchpoint_slots/TestWatchpointMultipleSlots.py (1238 of 2119) PASS: lldb-shell :: SymbolFile/symbol-binding.test (1239 of 2119) PASS: lldb-shell :: SymbolFile/Breakpad/unwind-via-stack-cfi.test (1240 of 2119) PASS: lldb-unit :: Symbol/./SymbolTests/TestTypeSystemClang.TestGetEnumIntegerTypeInvalid (1241 of 2119) PASS: lldb-api :: commands/expression/namespace_local_var_same_name_cpp_and_c/TestNamespaceLocalVarSameNameCppAndC.py (1242 of 2119) PASS: lldb-api :: commands/expression/import-std-module/forward_list-dbg-info-content/TestDbgInfoContentForwardListFromStdModule.py (1243 of 2119) PASS: lldb-shell :: ObjectFile/ELF/PT_LOAD.yaml (1244 of 2119) PASS: lldb-api :: functionalities/thread_plan/TestThreadPlanCommands.py (1245 of 2119) PASS: lldb-unit :: UnwindAssembly/x86/./UnwindAssemblyx86Tests/Testx86AssemblyInspectionEngine.TestDisassemblyJunkBytes (1246 of 2119) PASS: lldb-api :: lang/mixed/TestMixedLanguages.py (1247 of 2119) PASS: lldb-shell :: Commands/command-backtrace.test (1248 of 2119) PASS: lldb-api :: types/TestCharType.py (1249 of 2119) PASS: lldb-api :: lang/objc/objc-baseclass-sbtype/TestObjCBaseClassSBType.py (1250 of 2119) PASS: lldb-unit :: Utility/./UtilityTests/XcodeSDKTest.MergeTest (1251 of 2119) PASS: lldb-unit :: Utility/./UtilityTests/StreamTest.AddressRangeSize (1252 of 2119) PASS: lldb-unit :: Utility/./UtilityTests/StringListTest.ShiftMove (1253 of 2119) PASS: lldb-unit :: Utility/./UtilityTests/ConstStringTest.FromMidOfBufferStringRef (1254 of 2119) PASS: lldb-unit :: Utility/./UtilityTests/SubsystemRAIITest.NormalSubsystem (1255 of 2119) PASS: lldb-api :: functionalities/breakpoint/breakpoint_command/TestBreakpointCommandsFromPython.py (1256 of 2119) PASS: lldb-unit :: Expression/./ExpressionTests/DiagnosticManagerTest.GetStringPreserveOrder (1257 of 2119) PASS: lldb-shell :: Settings/TestFrameFormatColor.test (1258 of 2119) PASS: lldb-unit :: Utility/./UtilityTests/FileSpecTest.FormatFileSpec (1259 of 2119) PASS: lldb-shell :: SymbolFile/Breakpad/unwind-via-raSearch.test (1260 of 2119) UNSUPPORTED: lldb-api :: functionalities/signal/handle-segv/TestHandleSegv.py (1261 of 2119) PASS: lldb-unit :: Utility/./UtilityTests/DataExtractorTest.GetULEB128_bit63 (1262 of 2119) PASS: lldb-unit :: Utility/./UtilityTests/StatusTest.Formatv (1263 of 2119) PASS: lldb-api :: functionalities/breakpoint/breakpoint_conditions/TestBreakpointConditions.py (1264 of 2119) PASS: lldb-unit :: tools/lldb-server/tests/./LLDBServerTests/StandardStartupTest.TestStopReplyContainsThreadPcs (1265 of 2119) PASS: lldb-api :: functionalities/tail_call_frames/unambiguous_sequence/TestUnambiguousTailCalls.py (1266 of 2119) PASS: lldb-unit :: Utility/./UtilityTests/StringExtractorTest.GetHexBytes_OddPair (1267 of 2119) PASS: lldb-api :: functionalities/signal/raise/TestRaise.py (1268 of 2119) PASS: lldb-unit :: Utility/./UtilityTests/StreamTest.PutNHex8 (1269 of 2119) UNSUPPORTED: lldb-api :: functionalities/darwin_log/source/info/TestDarwinLogSourceInfo.py (1270 of 2119) PASS: lldb-api :: commands/expression/multiline-completion/TestMultilineCompletion.py (1271 of 2119) PASS: lldb-shell :: Commands/CommandScriptImmediateOutput/CommandScriptImmediateOutputFile.test (1272 of 2119) PASS: lldb-api :: macosx/thread_suspend/TestInternalThreadSuspension.py (1273 of 2119) PASS: lldb-unit :: Utility/./UtilityTests/StringExtractorTest.GetHexU8_Exact_NoEof (1274 of 2119) PASS: lldb-shell :: Reproducer/TestCaptureEnvOverride.test (1275 of 2119) PASS: lldb-unit :: UnwindAssembly/x86/./UnwindAssemblyx86Tests/Testx86AssemblyInspectionEngine.TestAddESP (1276 of 2119) PASS: lldb-unit :: Utility/./UtilityTests/StatusTest.ErrorConversion (1277 of 2119) PASS: lldb-api :: python_api/file_handle/TestFileHandle.py (1278 of 2119) PASS: lldb-unit :: Utility/./UtilityTests/DataExtractorTest.GetCStrAtNullOffset (1279 of 2119) PASS: lldb-api :: lang/objc/foundation/TestFoundationDisassembly.py (1280 of 2119) PASS: lldb-shell :: Reproducer/TestRelativePath.test (1281 of 2119) PASS: lldb-api :: functionalities/history/TestHistoryRecall.py (1282 of 2119) PASS: lldb-unit :: Utility/./UtilityTests/ReproducerTest.SetCapture (1283 of 2119) UNSUPPORTED: lldb-api :: benchmarks/startup/TestStartupDelays.py (1284 of 2119) UNSUPPORTED: lldb-api :: commands/expression/call-restarts/TestCallThatRestarts.py (1285 of 2119) PASS: lldb-unit :: Utility/./UtilityTests/StringListTest.LongestCommonPrefixNoPrefix (1286 of 2119) PASS: lldb-unit :: Utility/./UtilityTests/StreamTest.PutCString (1287 of 2119) PASS: lldb-unit :: Expression/./ExpressionTests/ClangHostTest.ComputeClangResourceDirectory (1288 of 2119) PASS: lldb-unit :: Utility/./UtilityTests/ArgsTest.TestSingleArg (1289 of 2119) PASS: lldb-unit :: Utility/./UtilityTests/FileSpecTest.EqualDotsPosixRoot (1290 of 2119) PASS: lldb-unit :: Utility/./UtilityTests/StringListTest.InsertStringAtIndexEnd (1291 of 2119) PASS: lldb-api :: lang/cpp/dynamic-value/TestDynamicValue.py (1292 of 2119) PASS: lldb-unit :: Utility/./UtilityTests/RangeTest.ContainsAddr (1293 of 2119) PASS: lldb-unit :: Utility/./UtilityTests/BinaryStreamTest.PutSLEB128FiveBytes (1294 of 2119) PASS: lldb-unit :: Process/gdb-remote/./ProcessGdbRemoteTests/GDBRemoteCommunicationClientTest.GetMemoryRegionInfoInvalidResponse (1295 of 2119) PASS: lldb-unit :: Utility/./UtilityTests/SerializationRountripTest.SerializeDeserializePodReferences (1296 of 2119) PASS: lldb-unit :: Utility/./UtilityTests/SubsystemRAIITest.SubsystemWithErrorSuccess (1297 of 2119) PASS: lldb-unit :: Utility/./UtilityTests/ArchSpecTest.MergeFrom (1298 of 2119) PASS: lldb-shell :: Reproducer/TestDiscard.test (1299 of 2119) PASS: lldb-shell :: Reproducer/Functionalities/TestImageList.test (1300 of 2119) UNSUPPORTED: lldb-api :: functionalities/breakpoint/hardware_breakpoints/hardware_breakpoint_on_multiple_threads/TestHWBreakMultiThread.py (1301 of 2119) PASS: lldb-api :: lang/cpp/signed_types/TestSignedTypes.py (1302 of 2119) PASS: lldb-shell :: Reproducer/Functionalities/TestStepping.test (1303 of 2119) PASS: lldb-shell :: SymbolFile/DWARF/apple-index-is-used.cpp (1304 of 2119) PASS: lldb-unit :: Utility/./UtilityTests/VMRange.Ordering (1305 of 2119) PASS: lldb-unit :: Symbol/./SymbolTests/Type.GetTypeScopeAndBasename (1306 of 2119) UNSUPPORTED: lldb-api :: tools/lldb-server/platform-process-connect/TestPlatformProcessConnect.py (1307 of 2119) PASS: lldb-unit :: Utility/./UtilityTests/StreamTeeTest.Assignment (1308 of 2119) PASS: lldb-api :: lang/objc/objc-runtime-ivars/TestRuntimeIvars.py (1309 of 2119) PASS: lldb-api :: tools/lldb-server/commandline/TestStubSetSID.py (1310 of 2119) PASS: lldb-unit :: Utility/./UtilityTests/ArchSpecTest.TestParseMachCPUDashSubtypeTripleSimple (1311 of 2119) PASS: lldb-unit :: Symbol/./SymbolTests/TestClangASTImporter.MetadataPropagationIndirectImport (1312 of 2119) PASS: lldb-shell :: Breakpoint/implicit_const_form_support.test (1313 of 2119) PASS: lldb-api :: python_api/watchpoint/TestSetWatchpoint.py (1314 of 2119) UNSUPPORTED: lldb-api :: macosx/macCatalystAppMacOSFramework/TestMacCatalystAppWithMacOSFramework.py (1315 of 2119) PASS: lldb-unit :: Utility/./UtilityTests/UriParserTest.MinimalPort (1316 of 2119) PASS: lldb-api :: functionalities/rerun/TestRerun.py (1317 of 2119) PASS: lldb-shell :: ObjectFile/ELF/many-sections.s (1318 of 2119) UNSUPPORTED: lldb-shell :: SymbolFile/PDB/pointers.test (1319 of 2119) PASS: lldb-shell :: SymbolFile/NativePDB/disassembly.cpp (1320 of 2119) PASS: lldb-unit :: Utility/./UtilityTests/StreamTest.PutBytesAsRawHex8ToMixedEndian (1321 of 2119) PASS: lldb-unit :: Utility/./UtilityTests/FileSpecTest.AppendPathComponent (1322 of 2119) PASS: lldb-api :: commands/watchpoints/multiple_threads/TestWatchpointMultipleThreads.py (1323 of 2119) UNSUPPORTED: lldb-shell :: Register/x86-zmm-write.test (1324 of 2119) PASS: lldb-api :: lang/c/strings/TestCStrings.py (1325 of 2119) UNSUPPORTED: lldb-api :: linux/sepdebugsymlink/TestTargetSymbolsSepDebugSymlink.py (1326 of 2119) PASS: lldb-api :: commands/expression/radar_8638051/Test8638051.py (1327 of 2119) PASS: lldb-api :: functionalities/data-formatter/frameformat_smallstruct/TestFrameFormatSmallStruct.py (1328 of 2119) PASS: lldb-api :: functionalities/thread/thread_specific_break/TestThreadSpecificBreakpoint.py (1329 of 2119) PASS: lldb-shell :: Breakpoint/single-file-split-dwarf.test (1330 of 2119) PASS: lldb-unit :: Utility/./UtilityTests/RangeVector.CombineConsecutiveRanges (1331 of 2119) PASS: lldb-api :: commands/command/script_alias/TestCommandScriptAlias.py (1332 of 2119) PASS: lldb-shell :: SymbolFile/DWARF/limit-debug-info.s (1333 of 2119) PASS: lldb-unit :: Utility/./UtilityTests/ArchSpecTest.TestSetTriple (1334 of 2119) PASS: lldb-unit :: Utility/./UtilityTests/ScalarTest.CastOperations (1335 of 2119) PASS: lldb-api :: iohandler/completion/TestIOHandlerCompletion.py (1336 of 2119) PASS: lldb-unit :: Utility/./UtilityTests/Flags.AllSet (1337 of 2119) PASS: lldb-unit :: Utility/./UtilityTests/ScalarTest.ExtractBitfield (1338 of 2119) PASS: lldb-api :: functionalities/thread/concurrent_events/TestConcurrentWatchpointDelayWatchpointOneBreakpoint.py (1339 of 2119) PASS: lldb-unit :: Utility/./UtilityTests/XcodeSDKTest.FindXcodeContentsDirectoryInPath (1340 of 2119) PASS: lldb-unit :: DataFormatter/./LLDBFormatterTests/TypeMatcherTests.CreatedBySameMatchStringExactNamePrefixes (1341 of 2119) PASS: lldb-api :: functionalities/data-formatter/poarray/TestPrintObjectArray.py (1342 of 2119) PASS: lldb-unit :: Host/./HostTests/FileSystemTest.MakeAbsolute (1343 of 2119) PASS: lldb-unit :: Host/./HostTests/SocketTest.UDPConnect (1344 of 2119) PASS: lldb-api :: functionalities/data-formatter/data-formatter-disabling/TestDataFormatterDisabling.py (1345 of 2119) PASS: lldb-api :: functionalities/ubsan/basic/TestUbsanBasic.py (1346 of 2119) PASS: lldb-unit :: Utility/./UtilityTests/StreamTeeTest.GetStreamAtIndexOutOfBoundsEmpty (1347 of 2119) PASS: lldb-unit :: ObjectFile/Breakpad/./ObjectFileBreakpadTests/FuncRecord.parse (1348 of 2119) PASS: lldb-shell :: Unwind/thread-step-out-ret-addr-check.test (1349 of 2119) PASS: lldb-api :: functionalities/return-value/TestReturnValue.py (1350 of 2119) PASS: lldb-unit :: Utility/./UtilityTests/RegularExpression.Empty (1351 of 2119) PASS: lldb-unit :: Utility/./UtilityTests/StringExtractorTest.GetHexBytesAvail_FullString (1352 of 2119) XFAIL: lldb-shell :: SymbolFile/DWARF/find-type-in-function.cpp (1353 of 2119) PASS: lldb-unit :: Symbol/./SymbolTests/LineEntryTest.GetSameLineContiguousAddressRangeNestedInline (1354 of 2119) PASS: lldb-unit :: Process/gdb-remote/./ProcessGdbRemoteTests/GDBRemoteClientBaseTest.SendContinueAndLateInterrupt (1355 of 2119) PASS: lldb-unit :: Target/./TargetTests/MemoryRegionInfoTest.Formatv (1356 of 2119) PASS: lldb-shell :: SymbolFile/DWARF/DW_TAG_basic_type_DW_ATE_UTF_nonC.ll (1357 of 2119) PASS: lldb-unit :: ObjectFile/ELF/./ObjectFileELFTests/ObjectFileELFTest.SectionsResolveConsistently (1358 of 2119) PASS: lldb-api :: functionalities/gdb_remote_client/TestProcessConnect.py (1359 of 2119) PASS: lldb-api :: commands/watchpoints/watchpoint_commands/command/TestWatchpointCommandPython.py (1360 of 2119) PASS: lldb-unit :: Utility/./UtilityTests/UriParserTest.SchemeHostSeparator3 (1361 of 2119) PASS: lldb-api :: functionalities/data-formatter/data-formatter-objc/TestDataFormatterObjCNSBundle.py (1362 of 2119) PASS: lldb-api :: types/TestShortTypeExpr.py (1363 of 2119) PASS: lldb-shell :: SymbolFile/DWARF/find-method.cpp (1364 of 2119) PASS: lldb-unit :: Utility/./UtilityTests/ScalarTest.Scalar_512 (1365 of 2119) PASS: lldb-unit :: Host/./HostTests/FileActionTest.Open (1366 of 2119) PASS: lldb-unit :: Utility/./UtilityTests/StreamTest.Indent (1367 of 2119) PASS: lldb-shell :: Reproducer/TestGDBRemoteRepro.test (1368 of 2119) PASS: lldb-unit :: ScriptInterpreter/Python/./ScriptInterpreterPythonTests/PythonDataObjectsTest.TestPythonTupleSize (1369 of 2119) PASS: lldb-unit :: Utility/./UtilityTests/RecordReplayTest.InstrumentedFooSameThis (1370 of 2119) PASS: lldb-api :: functionalities/load_using_paths/TestLoadUsingPaths.py (1371 of 2119) PASS: lldb-api :: commands/expression/call-function/TestCallStopAndContinue.py (1372 of 2119) PASS: lldb-unit :: Utility/./UtilityTests/ArgsTest.TestMultipleArgs (1373 of 2119) PASS: lldb-unit :: Process/gdb-remote/./ProcessGdbRemoteTests/GDBRemoteCommunicationClientTest.ReadRegister (1374 of 2119) PASS: lldb-unit :: ScriptInterpreter/Python/./ScriptInterpreterPythonTests/PythonDataObjectsTest.TestPythonListValueEquality (1375 of 2119) PASS: lldb-shell :: SymbolFile/Breakpad/unwind-via-stack-win-no-memory-info.yaml (1376 of 2119) UNSUPPORTED: lldb-api :: linux/add-symbols/TestTargetSymbolsAddCommand.py (1377 of 2119) PASS: lldb-unit :: Expression/./ExpressionTests/DiagnosticManagerTest.GetStringSeverityLabels (1378 of 2119) UNSUPPORTED: lldb-shell :: Register/x86-gp-write.test (1379 of 2119) PASS: lldb-unit :: UnwindAssembly/x86/./UnwindAssemblyx86Tests/Testx86AssemblyInspectionEngine.Test64bitFramelessSmallStackFrame (1380 of 2119) UNSUPPORTED: lldb-api :: functionalities/thread/thread_specific_break_plus_condition/TestThreadSpecificBpPlusCondition.py (1381 of 2119) PASS: lldb-api :: functionalities/breakpoint/move_nearest/TestMoveNearest.py (1382 of 2119) PASS: lldb-api :: lang/cpp/overloaded-functions/TestOverloadedFunctions.py (1383 of 2119) PASS: lldb-api :: functionalities/thread/concurrent_events/TestConcurrentSignalNWatchNBreak.py (1384 of 2119) PASS: lldb-unit :: Symbol/./SymbolTests/Type.CompilerContextPattern (1385 of 2119) PASS: lldb-shell :: SymbolFile/Breakpad/symtab-macho.test (1386 of 2119) PASS: lldb-unit :: Symbol/./SymbolTests/TestTypeSystemClang.TestGetEnumIntegerTypeUnexpectedType (1387 of 2119) PASS: lldb-api :: python_api/sbvalue_const_addrof/TestSBValueConstAddrOf.py (1388 of 2119) PASS: lldb-shell :: ObjectFile/Breakpad/sections.test (1389 of 2119) PASS: lldb-api :: commands/expression/dont_allow_jit/TestAllowJIT.py (1390 of 2119) PASS: lldb-unit :: Utility/./UtilityTests/StatusTest.ErrorConstructor (1391 of 2119) PASS: lldb-shell :: SymbolFile/Breakpad/symtab.test (1392 of 2119) PASS: lldb-api :: commands/source/info/TestSourceInfo.py (1393 of 2119) PASS: lldb-unit :: Utility/./UtilityTests/StringExtractorTest.GetHexBytes (1394 of 2119) PASS: lldb-unit :: Utility/./UtilityTests/VASprintfTest.NoBufferResize (1395 of 2119) PASS: lldb-api :: functionalities/data-formatter/boolreference/TestFormattersBoolRefPtr.py (1396 of 2119) PASS: lldb-api :: lang/c/tls_globals/TestTlsGlobals.py (1397 of 2119) PASS: lldb-api :: driver/batch_mode/TestBatchMode.py (1398 of 2119) PASS: lldb-unit :: Target/./TargetTests/ExecutionContextTest.GetByteOrderTarget (1399 of 2119) PASS: lldb-api :: functionalities/thread/backtrace_limit/TestBacktraceLimit.py (1400 of 2119) PASS: lldb-shell :: Breakpoint/debug_rnglist_basic.test (1401 of 2119) PASS: lldb-unit :: Utility/./UtilityTests/StringListTest.GetMaxStringLengthEmpty (1402 of 2119) UNSUPPORTED: lldb-shell :: ScriptInterpreter/Lua/lua.test (1403 of 2119) PASS: lldb-shell :: SymbolFile/NativePDB/function-types-calling-conv.cpp (1404 of 2119) PASS: lldb-unit :: Utility/./UtilityTests/NameMatchesTest.Ignore (1405 of 2119) PASS: lldb-api :: functionalities/breakpoint/dummy_target_breakpoints/TestBreakpointsWithNoTargets.py (1406 of 2119) PASS: lldb-api :: lang/c/vla/TestVLA.py (1407 of 2119) PASS: lldb-unit :: Utility/./UtilityTests/TimeoutTest.Construction (1408 of 2119) PASS: lldb-api :: lang/cpp/class_static/TestStaticVariables.py (1409 of 2119) PASS: lldb-unit :: Symbol/./SymbolTests/PostfixExpression.ToDWARF (1410 of 2119) PASS: lldb-shell :: ObjectFile/MachO/subsections.yaml (1411 of 2119) PASS: lldb-shell :: SymbolFile/DWARF/split-dwarf-multiple-cu.ll (1412 of 2119) PASS: lldb-unit :: Symbol/./SymbolTests/TestClangASTImporter.CanImportInvalidType (1413 of 2119) PASS: lldb-unit :: Utility/./UtilityTests/StringListTest.Join (1414 of 2119) PASS: lldb-shell :: Reproducer/TestSynchronous.test (1415 of 2119) PASS: lldb-api :: functionalities/tail_call_frames/disambiguate_call_site/TestDisambiguateCallSite.py (1416 of 2119) PASS: lldb-unit :: Process/minidump/./LLDBMinidumpTests/MinidumpParserTest.GetArchitectureWindows (1417 of 2119) PASS: lldb-api :: python_api/disassemble-raw-data/TestDisassembleRawData.py (1418 of 2119) PASS: lldb-unit :: Symbol/./SymbolTests/TestTypeSystemClang.TestGetTypeClassTypeOf (1419 of 2119) PASS: lldb-unit :: SymbolFile/DWARF/./SymbolFileDWARFTests/SymbolFileDWARFTests.TestAbbrevOutOfOrder (1420 of 2119) PASS: lldb-api :: functionalities/unwind/sigtramp/TestSigtrampUnwind.py (1421 of 2119) PASS: lldb-unit :: Target/./TargetTests/PathMappingListTest.RelativeTests (1422 of 2119) PASS: lldb-unit :: Utility/./UtilityTests/ScalarTest.RightShiftOperator (1423 of 2119) PASS: lldb-unit :: Core/./LLDBCoreTests/SourceFileCache.FindSourceFileFound (1424 of 2119) PASS: lldb-api :: lang/cpp/gmodules/TestWithModuleDebugging.py (1425 of 2119) PASS: lldb-unit :: UnwindAssembly/x86/./UnwindAssemblyx86Tests/Testx86AssemblyInspectionEngine.TestPushExtended (1426 of 2119) PASS: lldb-api :: commands/expression/inline-namespace/TestInlineNamespace.py (1427 of 2119) PASS: lldb-unit :: Process/gdb-remote/./ProcessGdbRemoteTests/GDBRemoteCommunicationClientTest.SendStartTracePacket (1428 of 2119) PASS: lldb-unit :: Host/./HostTests/NativeProcessProtocolTest.SetBreakpointFailWrite (1429 of 2119) PASS: lldb-api :: lang/objc/bitfield_ivars/TestBitfieldIvars.py (1430 of 2119) UNSUPPORTED: lldb-api :: functionalities/thread/concurrent_events/TestConcurrentManySignals.py (1431 of 2119) PASS: lldb-api :: functionalities/ptr_refs/TestPtrRefs.py (1432 of 2119) PASS: lldb-unit :: Utility/./UtilityTests/StringExtractorTest.GetNameColonValueSuccess (1433 of 2119) PASS: lldb-api :: functionalities/data-formatter/format-propagation/TestFormatPropagation.py (1434 of 2119) PASS: lldb-unit :: Utility/./UtilityTests/OptionsWithRawTest.EmptyArgsOnlySuffix (1435 of 2119) PASS: lldb-unit :: DataFormatter/./LLDBFormatterTests/StringPrinterTests.SwiftUTF8 (1436 of 2119) PASS: lldb-shell :: SymbolFile/DWARF/DW_AT_low_pc-addrx.s (1437 of 2119) PASS: lldb-api :: lang/cpp/class-template-parameter-pack/TestClassTemplateParameterPack.py (1438 of 2119) PASS: lldb-api :: lang/c/register_variables/TestRegisterVariables.py (1439 of 2119) PASS: lldb-unit :: UnwindAssembly/x86/./UnwindAssemblyx86Tests/Testx86AssemblyInspectionEngine.TestPushEBP (1440 of 2119) PASS: lldb-api :: functionalities/data-formatter/nsarraysynth/TestNSArraySynthetic.py (1441 of 2119) PASS: lldb-unit :: Utility/./UtilityTests/ArgsTest.GetQuotedCommandString (1442 of 2119) PASS: lldb-shell :: Settings/TestSettingsSet.test (1443 of 2119) PASS: lldb-api :: functionalities/breakpoint/cpp_exception/TestCPPExceptionBreakpoint.py (1444 of 2119) PASS: lldb-unit :: Core/./LLDBCoreTests/ModuleSpecTest.TestMachOFile (1445 of 2119) PASS: lldb-unit :: tools/lldb-server/tests/./LLDBServerTests/TestBase.LaunchModePreservesEnvironment (1446 of 2119) PASS: lldb-unit :: Utility/./UtilityTests/StreamTeeTest.GetStreamAtIndexOutOfBounds (1447 of 2119) PASS: lldb-unit :: Utility/./UtilityTests/StringExtractorTest.GetHexBytesAvail_OddPair (1448 of 2119) PASS: lldb-unit :: ScriptInterpreter/Python/./ScriptInterpreterPythonTests/PythonDataObjectsTest.TestPythonIntegerToStructuredInteger (1449 of 2119) PASS: lldb-unit :: Thread/./ThreadTests/ThreadTest.SetStopInfo (1450 of 2119) PASS: lldb-api :: functionalities/plugins/command_plugin/TestPluginCommands.py (1451 of 2119) PASS: lldb-unit :: Utility/./UtilityTests/UriParserTest.PortOverflow (1452 of 2119) PASS: lldb-api :: lang/c/step_over_no_deadlock/TestStepOverDoesntBlock.py (1453 of 2119) PASS: lldb-shell :: Quit/TestQuitExitCodeHex0.test (1454 of 2119) PASS: lldb-shell :: Commands/command-disassemble.s (1455 of 2119) PASS: lldb-unit :: Utility/./UtilityTests/Predicate.WaitForValueEqualTo (1456 of 2119) PASS: lldb-shell :: ObjectFile/Breakpad/sections-trailing-func.test (1457 of 2119) PASS: lldb-unit :: Platform/./LLDBPlatformTests/PlatformDarwinTest.TestParseVersionBuildDir (1458 of 2119) PASS: lldb-api :: functionalities/data-formatter/data-formatter-stl/libcxx/map/TestDataFormatterLibccMap.py (1459 of 2119) PASS: lldb-api :: functionalities/thread/step_out/TestThreadStepOut.py (1460 of 2119) PASS: lldb-unit :: Symbol/./SymbolTests/TestTypeSystemClang.TestGetEnumIntegerTypeBasicTypes (1461 of 2119) PASS: lldb-api :: lang/objc/foundation/TestObjCMethodsString.py (1462 of 2119) PASS: lldb-api :: functionalities/data-formatter/varscript_formatting/TestDataFormatterVarScriptFormatting.py (1463 of 2119) PASS: lldb-unit :: Symbol/./SymbolTests/TestTypeSystemClang.TestFunctionTemplateInRecordConstruction (1464 of 2119) PASS: lldb-api :: functionalities/dead-strip/TestDeadStrip.py (1465 of 2119) PASS: lldb-api :: lang/c/step-target/TestStepTarget.py (1466 of 2119) PASS: lldb-unit :: UnwindAssembly/x86/./UnwindAssemblyx86Tests/Testx86AssemblyInspectionEngine.TestSimplex86_64Augmented (1467 of 2119) PASS: lldb-unit :: UnwindAssembly/x86/./UnwindAssemblyx86Tests/Testx86AssemblyInspectionEngine.TestPushR12 (1468 of 2119) PASS: lldb-api :: lang/cpp/chained-calls/TestCppChainedCalls.py (1469 of 2119) PASS: lldb-api :: lang/objc/objc-ivar-offsets/TestObjCIvarOffsets.py (1470 of 2119) PASS: lldb-api :: commands/watchpoints/watchpoint_on_vectors/TestValueOfVectorVariable.py (1471 of 2119) PASS: lldb-api :: functionalities/data-formatter/dump_dynamic/TestDumpDynamic.py (1472 of 2119) PASS: lldb-api :: commands/expression/import-std-module/deque-dbg-info-content/TestDbgInfoContentDequeFromStdModule.py (1473 of 2119) PASS: lldb-unit :: Interpreter/./InterpreterTests/OptionValueFileColonLine.setFromString (1474 of 2119) PASS: lldb-unit :: Utility/./UtilityTests/ArgsTest.ReplaceArgumentAtIndexFarOutOfRange (1475 of 2119) PASS: lldb-unit :: Expression/./ExpressionTests/CppModuleConfigurationTest.LibCppV2 (1476 of 2119) PASS: lldb-unit :: Process/minidump/./LLDBMinidumpTests/MinidumpParserTest.GetPidWow64 (1477 of 2119) PASS: lldb-api :: functionalities/optimized_code/TestNoASanExceptionAfterEvalOP_piece.py (1478 of 2119) PASS: lldb-shell :: Driver/TestPositionalArgs.test (1479 of 2119) PASS: lldb-shell :: SymbolFile/DWARF/debug_loc.s (1480 of 2119) PASS: lldb-shell :: SymbolFile/DWARF/debug_line-tombstone.s (1481 of 2119) PASS: lldb-unit :: Utility/./UtilityTests/StringExtractorTest.GetNameColonValueNoSemicolon (1482 of 2119) PASS: lldb-unit :: Utility/./UtilityTests/StateTest.Formatv (1483 of 2119) PASS: lldb-api :: functionalities/type_completion/TestTypeCompletion.py (1484 of 2119) PASS: lldb-api :: types/TestDoubleTypes.py (1485 of 2119) PASS: lldb-api :: functionalities/data-formatter/data-formatter-stl/libcxx/string/TestDataFormatterLibcxxString.py (1486 of 2119) PASS: lldb-shell :: SymbolFile/DWARF/DW_TAG_variable-DW_AT_const_value.s (1487 of 2119) PASS: lldb-api :: functionalities/postmortem/wow64_minidump/TestWow64MiniDump.py (1488 of 2119) PASS: lldb-api :: functionalities/breakpoint/breakpoint_callback_command_source/TestBreakpointCallbackCommandSource.py (1489 of 2119) PASS: lldb-unit :: Utility/./UtilityTests/StreamTest.PutMaxHex64ByteOrderLittle (1490 of 2119) UNSUPPORTED: lldb-shell :: ScriptInterpreter/Lua/persistent_state.test (1491 of 2119) PASS: lldb-api :: macosx/load-kext/TestLoadKext.py (1492 of 2119) PASS: lldb-shell :: SymbolFile/DWARF/debug_ranges_and_rnglists.test (1493 of 2119) PASS: lldb-api :: lang/objc/modules-compile-error/TestModulesCompileError.py (1494 of 2119) PASS: lldb-api :: functionalities/tsan/basic/TestTsanBasic.py (1495 of 2119) PASS: lldb-unit :: Process/gdb-remote/./ProcessGdbRemoteTests/GDBRemoteCommunicationClientTest.GetMemoryRegionInfo (1496 of 2119) PASS: lldb-unit :: Symbol/./SymbolTests/TestTypeSystemClang.TestBuiltinTypeForEncodingAndBitSize (1497 of 2119) PASS: lldb-api :: functionalities/data-formatter/var-in-aggregate-misuse/TestVarInAggregateMisuse.py (1498 of 2119) PASS: lldb-api :: functionalities/postmortem/minidump-new/TestMiniDumpUUID.py (1499 of 2119) PASS: lldb-unit :: Utility/./UtilityTests/AnsiTerminal.Incomplete (1500 of 2119) PASS: lldb-api :: lang/objc/global_ptrs/TestGlobalObjects.py (1501 of 2119) PASS: lldb-unit :: Utility/./UtilityTests/ConstStringTest.NullAndEmptyStates (1502 of 2119) PASS: lldb-unit :: UnwindAssembly/x86/./UnwindAssemblyx86Tests/Testx86AssemblyInspectionEngine.Test32bitFramelessBigStackFrame (1503 of 2119) PASS: lldb-unit :: Host/./HostTests/MainLoopTest.TerminatesImmediately (1504 of 2119) PASS: lldb-unit :: Utility/./UtilityTests/ArgsTest.DoubleQuotedItem (1505 of 2119) PASS: lldb-shell :: Expr/TestIRMemoryMap.test (1506 of 2119) PASS: lldb-unit :: UnwindAssembly/x86/./UnwindAssemblyx86Tests/Testx86AssemblyInspectionEngine.Test32bitFramelessSmallStackFrame (1507 of 2119) PASS: lldb-api :: functionalities/breakpoint/consecutive_breakpoints/TestConsecutiveBreakpoints.py (1508 of 2119) PASS: lldb-unit :: Process/gdb-remote/./ProcessGdbRemoteTests/GDBRemoteClientBaseTest.SendContinueAndInterrupt2PacketBug (1509 of 2119) PASS: lldb-unit :: Utility/./UtilityTests/TimerTest.CategoryTimes2 (1510 of 2119) PASS: lldb-shell :: ObjectFile/ELF/minidebuginfo-corrupt-xz.yaml (1511 of 2119) UNSUPPORTED: lldb-api :: tools/lldb-vscode/disconnect/TestVSCode_disconnect.py (1512 of 2119) PASS: lldb-unit :: Utility/./UtilityTests/BinaryStreamTest.PutULEB128FiveBytes (1513 of 2119) PASS: lldb-unit :: UnwindAssembly/x86/./UnwindAssemblyx86Tests/Testx86AssemblyInspectionEngine.TestPushEDI (1514 of 2119) PASS: lldb-unit :: Utility/./UtilityTests/StringExtractorTest.GetHexBytesAvail_Underflow (1515 of 2119) UNSUPPORTED: lldb-api :: tools/lldb-server/signal-filtering/TestGdbRemote_QPassSignals.py (1516 of 2119) PASS: lldb-unit :: Host/./HostTests/NativeProcessProtocolTest.SetBreakpointFailVerify (1517 of 2119) PASS: lldb-unit :: UnwindAssembly/ARM64/./Arm64InstEmulationTests/TestArm64InstEmulation.TestRegisterSavedTwice (1518 of 2119) PASS: lldb-api :: functionalities/data-formatter/data-formatter-stl/libcxx/unordered/TestDataFormatterUnordered.py (1519 of 2119) PASS: lldb-unit :: Process/gdb-remote/./ProcessGdbRemoteTests/GDBRemoteClientBaseTest.SendContinueAndInterrupt (1520 of 2119) PASS: lldb-unit :: UnwindAssembly/x86/./UnwindAssemblyx86Tests/Testx86AssemblyInspectionEngine.TestPopR12 (1521 of 2119) PASS: lldb-shell :: SymbolFile/DWARF/module-ownership.mm (1522 of 2119) PASS: lldb-unit :: Utility/./UtilityTests/DataExtractorTest.GetMaxU64 (1523 of 2119) PASS: lldb-unit :: Language/Highlighting/./HighlighterTests/HighlighterTest.ClangCursorPosAfterOtherToken (1524 of 2119) PASS: lldb-unit :: Utility/./UtilityTests/ProcessInstanceInfo.Yaml (1525 of 2119) PASS: lldb-api :: lang/objcxx/cxx-bridged-po/TestObjCXXBridgedPO.py (1526 of 2119) PASS: lldb-shell :: ObjectFile/ELF/PT_LOAD-overlap-PT_TLS.yaml (1527 of 2119) PASS: lldb-api :: commands/watchpoints/watchpoint_disable/TestWatchpointDisable.py (1528 of 2119) PASS: lldb-api :: functionalities/gdb_remote_client/TestArmRegisterDefinition.py (1529 of 2119) PASS: lldb-shell :: SymbolFile/DWARF/debug-types-signature-loop.s (1530 of 2119) PASS: lldb-unit :: Utility/./UtilityTests/UriParserTest.BracketedHostnamePort (1531 of 2119) UNSUPPORTED: lldb-shell :: Unwind/eh-frame-small-fde.test (1532 of 2119) PASS: lldb-unit :: Utility/./UtilityTests/UriParserTest.SchemeHostSeparator4 (1533 of 2119) PASS: lldb-api :: tools/lldb-vscode/breakpoint/TestVSCode_setBreakpoints.py (1534 of 2119) PASS: lldb-unit :: SymbolFile/NativePDB/./SymbolFileNativePDBTests/PDBFPOProgramToDWARFExpressionTests.MultipleIndependentAssignments (1535 of 2119) PASS: lldb-unit :: Utility/./UtilityTests/OptionsWithRawTest.SingleWordSuffix (1536 of 2119) UNSUPPORTED: lldb-shell :: Watchpoint/netbsd-nouserdbregs.test (1537 of 2119) PASS: lldb-unit :: Utility/./UtilityTests/FileSpecTest.EqualDotsWindows (1538 of 2119) PASS: lldb-unit :: Utility/./UtilityTests/StreamTeeTest.Flush (1539 of 2119) PASS: lldb-api :: lang/objc/modules-inline-functions/TestModulesInlineFunctions.py (1540 of 2119) PASS: lldb-shell :: SymbolFile/DWARF/array-sizes.s (1541 of 2119) PASS: lldb-api :: functionalities/thread/concurrent_events/TestConcurrentSignalWatch.py (1542 of 2119) PASS: lldb-api :: lang/objc/unicode-string/TestUnicodeString.py (1543 of 2119) PASS: lldb-unit :: Utility/./UtilityTests/RangeTest.LessThan (1544 of 2119) UNSUPPORTED: lldb-api :: commands/expression/macros/TestMacros.py (1545 of 2119) PASS: lldb-api :: lang/cpp/this/TestCPPThis.py (1546 of 2119) PASS: lldb-shell :: SymbolFile/DWARF/find-variable-dwo.cpp (1547 of 2119) PASS: lldb-api :: python_api/watchpoint/TestWatchpointIter.py (1548 of 2119) PASS: lldb-unit :: Host/./HostTests/FileSystemTest.Readable (1549 of 2119) PASS: lldb-api :: functionalities/postmortem/elf-core/TestLinuxCore.py (1550 of 2119) UNSUPPORTED: lldb-shell :: Register/arm-gp-read.test (1551 of 2119) PASS: lldb-api :: functionalities/thread/concurrent_events/TestConcurrentTwoWatchpointsOneBreakpoint.py (1552 of 2119) PASS: lldb-unit :: UnwindAssembly/x86/./UnwindAssemblyx86Tests/Testx86AssemblyInspectionEngine.TestDisassemblyMidFunctionEpilogues (1553 of 2119) PASS: lldb-unit :: Utility/./UtilityTests/FileSpecTest.FileAndDirectoryComponents (1554 of 2119) PASS: lldb-unit :: Language/Highlighting/./HighlighterTests/HighlighterTest.ClangStringLiterals (1555 of 2119) XFAIL: lldb-shell :: Unwind/prefer-debug-over-eh-frame.test (1556 of 2119) PASS: lldb-api :: functionalities/breakpoint/breakpoint_locations/TestBreakpointLocations.py (1557 of 2119) PASS: lldb-shell :: SymbolFile/DWARF/find-method-local-struct.cpp (1558 of 2119) PASS: lldb-api :: tools/lldb-vscode/console/TestVSCode_console.py (1559 of 2119) PASS: lldb-unit :: Utility/./UtilityTests/StreamTeeTest.DefaultConstructor (1560 of 2119) PASS: lldb-api :: commands/expression/function_template_specialization_temp_args/TestFunctionTemplateSpecializationTempArgs.py (1561 of 2119) PASS: lldb-api :: lang/cpp/wchar_t/TestCxxWCharT.py (1562 of 2119) PASS: lldb-shell :: ObjectFile/PECOFF/basic-info.yaml (1563 of 2119) UNSUPPORTED: lldb-api :: functionalities/darwin_log/filter/regex/message/TestDarwinLogFilterRegexMessage.py (1564 of 2119) PASS: lldb-api :: functionalities/postmortem/netbsd-core/TestNetBSDCore.py (1565 of 2119) PASS: lldb-shell :: SymbolFile/DWARF/debug_ranges.s (1566 of 2119) UNSUPPORTED: lldb-shell :: Register/aarch64-gp-read.test (1567 of 2119) PASS: lldb-unit :: Language/Highlighting/./HighlighterTests/HighlighterTest.Colons (1568 of 2119) UNSUPPORTED: lldb-api :: arm/breakpoint-it/TestBreakpointIt.py (1569 of 2119) PASS: lldb-unit :: Symbol/./SymbolTests/TestTypeSystemClang.TestDeletingImplicitCopyCstrDueToMoveCStr (1570 of 2119) PASS: lldb-unit :: Utility/./UtilityTests/VASprintfTest.BufferResize (1571 of 2119) UNSUPPORTED: lldb-api :: functionalities/darwin_log/filter/regex/activity-chain/TestDarwinLogFilterRegexActivityChain.py (1572 of 2119) PASS: lldb-api :: lang/cpp/const_this/TestConstThis.py (1573 of 2119) UNSUPPORTED: lldb-api :: tools/lldb-server/libraries-svr4/TestGdbRemoteLibrariesSvr4Support.py (1574 of 2119) XFAIL: lldb-shell :: Register/x86-64-write.test (1575 of 2119) PASS: lldb-api :: functionalities/data-formatter/data-formatter-stl/libcxx/bitset/TestDataFormatterLibcxxBitset.py (1576 of 2119) PASS: lldb-unit :: Expression/./ExpressionTests/CppModuleConfigurationTest.IgnoreLibStdCpp (1577 of 2119) PASS: lldb-api :: macosx/thread-names/TestInterruptThreadNames.py (1578 of 2119) PASS: lldb-unit :: Target/./TargetTests/ExecutionContextTest.GetByteOrderProcess (1579 of 2119) PASS: lldb-unit :: ScriptInterpreter/Python/./ScriptInterpreterPythonTests/PythonDataObjectsTest.TestBorrowedReferences (1580 of 2119) PASS: lldb-api :: python_api/hello_world/TestHelloWorld.py (1581 of 2119) PASS: lldb-api :: functionalities/testid/TestTestId.py (1582 of 2119) PASS: lldb-api :: functionalities/thread/concurrent_events/TestConcurrentTwoBreakpointsOneSignal.py (1583 of 2119) PASS: lldb-api :: functionalities/lazy-loading/TestLazyLoading.py (1584 of 2119) PASS: lldb-api :: lang/objc/objc-new-syntax/TestObjCNewSyntaxLiteral.py (1585 of 2119) PASS: lldb-api :: types/TestCharTypeExpr.py (1586 of 2119) PASS: lldb-unit :: Platform/Android/./AdbClientTests/AdbClientTest.CreateByDeviceId (1587 of 2119) PASS: lldb-unit :: Utility/./UtilityTests/ArgsTest.EscapeLLDBCommandArgument (1588 of 2119) PASS: lldb-unit :: Language/Highlighting/./HighlighterTests/HighlighterTest.ClangIdentifiers (1589 of 2119) PASS: lldb-api :: lang/cpp/typeof/TestTypeOfDeclTypeExpr.py (1590 of 2119) PASS: lldb-shell :: SymbolFile/NativePDB/break-by-line.cpp (1591 of 2119) UNSUPPORTED: lldb-api :: functionalities/thread/create_during_step/TestCreateDuringStep.py (1592 of 2119) PASS: lldb-unit :: Utility/./UtilityTests/EnvironmentTest.EnvpConstruction (1593 of 2119) PASS: lldb-api :: functionalities/gdb_remote_client/TestNoWatchpointSupportInfo.py (1594 of 2119) UNSUPPORTED: lldb-api :: functionalities/darwin_log/filter/exact_match/activity-chain/TestDarwinLogFilterMatchActivityChain.py (1595 of 2119) PASS: lldb-unit :: Utility/./UtilityTests/XcodeSDKTest.SDKSupportsSwift (1596 of 2119) PASS: lldb-unit :: Utility/./UtilityTests/LogChannelTest.Disable (1597 of 2119) PASS: lldb-unit :: Utility/./UtilityTests/PassiveReplayTest.InstrumentedBar (1598 of 2119) PASS: lldb-api :: lang/cpp/incomplete-types/TestCppIncompleteTypes.py (1599 of 2119) PASS: lldb-api :: functionalities/data-formatter/data-formatter-skip-summary/TestDataFormatterSkipSummary.py (1600 of 2119) PASS: lldb-api :: functionalities/dynamic_value_child_count/TestDynamicValueChildCount.py (1601 of 2119) PASS: lldb-unit :: UnwindAssembly/x86/./UnwindAssemblyx86Tests/Testx86AssemblyInspectionEngine.TestPushR14 (1602 of 2119) PASS: lldb-unit :: Utility/./UtilityTests/StringListTest.Clear (1603 of 2119) PASS: lldb-api :: lang/cpp/bool/TestCPPBool.py (1604 of 2119) PASS: lldb-unit :: Utility/./UtilityTests/StringExtractorTest.GetHexU8_Extra_NoEof (1605 of 2119) PASS: lldb-unit :: Target/./TargetTests/ExecutionContextTest.GetByteOrder (1606 of 2119) PASS: lldb-api :: commands/expression/persistent_ptr_update/TestPersistentPtrUpdate.py (1607 of 2119) PASS: lldb-unit :: ScriptInterpreter/Python/./ScriptInterpreterPythonTests/PythonDataObjectsTest.TestPythonFile (1608 of 2119) PASS: lldb-unit :: Utility/./UtilityTests/OptionsWithRawTest.TerminatedQuote (1609 of 2119) PASS: lldb-unit :: Utility/./UtilityTests/CompletionRequest.TryCompleteCurrentArgMode (1610 of 2119) PASS: lldb-unit :: UnwindAssembly/x86/./UnwindAssemblyx86Tests/Testx86AssemblyInspectionEngine.TestPushEDX (1611 of 2119) PASS: lldb-api :: sample_test/TestSampleTest.py (1612 of 2119) PASS: lldb-api :: functionalities/data-formatter/hexcaps/TestDataFormatterHexCaps.py (1613 of 2119) PASS: lldb-unit :: Utility/./UtilityTests/StreamTest.PutCharNull (1614 of 2119) PASS: lldb-api :: functionalities/gdb_remote_client/TestTargetXMLArch.py (1615 of 2119) PASS: lldb-api :: sanity/TestModuleCacheSanity.py (1616 of 2119) PASS: lldb-shell :: SymbolFile/DWARF/find-basic-variable.cpp (1617 of 2119) PASS: lldb-api :: lang/objc/foundation/TestRuntimeTypes.py (1618 of 2119) PASS: lldb-unit :: UnwindAssembly/x86/./UnwindAssemblyx86Tests/Testx86AssemblyInspectionEngine.TestSimple32bitFrameFunction (1619 of 2119) PASS: lldb-unit :: ScriptInterpreter/Python/./ScriptInterpreterPythonTests/PythonDataObjectsTest.TestPythonListToStructuredList (1620 of 2119) PASS: lldb-unit :: Host/./HostTests/SocketAddressTest.Set (1621 of 2119) PASS: lldb-unit :: Host/./HostTests/FileSystemTest.GetPermissions (1622 of 2119) PASS: lldb-api :: commands/process/launch/TestProcessLaunch.py (1623 of 2119) PASS: lldb-api :: commands/watchpoints/watchpoint_set_command/TestWatchLocationWithWatchSet.py (1624 of 2119) PASS: lldb-unit :: Utility/./UtilityTests/Flags.GetBitSize (1625 of 2119) PASS: lldb-unit :: Interpreter/./InterpreterTests/OptionArgParserTest.toScriptLanguage (1626 of 2119) PASS: lldb-shell :: ObjectFile/wasm/basic.yaml (1627 of 2119) PASS: lldb-api :: functionalities/thread/concurrent_events/TestConcurrentManyCrash.py (1628 of 2119) PASS: lldb-unit :: Utility/./UtilityTests/AnsiTerminal.Empty (1629 of 2119) PASS: lldb-shell :: Minidump/dump-all.test (1630 of 2119) PASS: lldb-api :: functionalities/data-formatter/typedef_array/TestTypedefArray.py (1631 of 2119) PASS: lldb-unit :: Utility/./UtilityTests/ArgsTest.TestInsertArg (1632 of 2119) PASS: lldb-unit :: ScriptInterpreter/Python/./ScriptInterpreterPythonTests/PythonDataObjectsTest.TestExceptions (1633 of 2119) PASS: lldb-api :: lang/cpp/operators/TestCppOperators.py (1634 of 2119) PASS: lldb-api :: macosx/DBGSourcePathRemapping/TestDSYMSourcePathRemapping.py (1635 of 2119) PASS: lldb-shell :: Driver/TestCore.test (1636 of 2119) UNSUPPORTED: lldb-shell :: ScriptInterpreter/Lua/watchpoint_callback.test (1637 of 2119) PASS: lldb-shell :: ExecControl/StopHook/stop-hook.test (1638 of 2119) PASS: lldb-api :: lang/c/anonymous/TestAnonymous.py (1639 of 2119) PASS: lldb-unit :: DataFormatter/./LLDBFormatterTests/TypeMatcherTests.RegexMatchPart (1640 of 2119) PASS: lldb-shell :: Reproducer/TestDump.test (1641 of 2119) PASS: lldb-api :: commands/expression/persistent_types/TestPersistentTypes.py (1642 of 2119) PASS: lldb-unit :: ScriptInterpreter/Python/./ScriptInterpreterPythonTests/PythonDataObjectsTest.TestTypeNameResolutionNoDot (1643 of 2119) PASS: lldb-shell :: SymbolFile/DWARF/deterministic-build.cpp (1644 of 2119) PASS: lldb-api :: functionalities/thread/num_threads/TestNumThreads.py (1645 of 2119) PASS: lldb-api :: lang/cpp/exceptions/TestCPPExceptionBreakpoints.py (1646 of 2119) PASS: lldb-unit :: Process/minidump/./LLDBMinidumpTests/MinidumpParserTest.GetMiscInfoWindows (1647 of 2119) PASS: lldb-api :: commands/help/TestHelp.py (1648 of 2119) PASS: lldb-shell :: SymbolFile/Breakpad/stack-cfi-arm.yaml (1649 of 2119) PASS: lldb-api :: commands/expression/import-std-module/weak_ptr/TestWeakPtrFromStdModule.py (1650 of 2119) PASS: lldb-shell :: SymbolFile/DWARF/win-i386-line-table.s (1651 of 2119) PASS: lldb-shell :: Commands/command-script-import.test (1652 of 2119) PASS: lldb-unit :: Platform/Android/./AdbClientTests/AdbClientTest.CreateByDeviceId_ByEnvVar (1653 of 2119) PASS: lldb-api :: functionalities/completion/TestCompletion.py (1654 of 2119) PASS: lldb-unit :: Utility/./UtilityTests/FileSpecTest.Match (1655 of 2119) PASS: lldb-unit :: Process/gdb-remote/./ProcessGdbRemoteTests/GDBRemoteCommunicationServerTest.SendErrorResponse_ErrorList (1656 of 2119) PASS: lldb-api :: commands/expression/expr-in-syscall/TestExpressionInSyscall.py (1657 of 2119) UNSUPPORTED: lldb-api :: commands/expression/completion-crash-invalid-iterator/TestInvalidIteratorCompletionCrash.py (1658 of 2119) PASS: lldb-api :: lang/cpp/lambdas/TestLambdas.py (1659 of 2119) PASS: lldb-unit :: Utility/./UtilityTests/StreamTest.AddressPrefix (1660 of 2119) PASS: lldb-api :: python_api/process/read-mem-cstring/TestReadMemCString.py (1661 of 2119) PASS: lldb-unit :: Host/./HostTests/MainLoopTest.DetectsEOF (1662 of 2119) PASS: lldb-api :: commands/process/signal/TestProcessSignal.py (1663 of 2119) PASS: lldb-api :: functionalities/gdb_remote_client/TestNoGPacketSupported.py (1664 of 2119) PASS: lldb-shell :: Reproducer/TestReuseDirectory.test (1665 of 2119) PASS: lldb-api :: functionalities/breakpoint/breakpoint_command/TestRegexpBreakCommand.py (1666 of 2119) PASS: lldb-unit :: Utility/./UtilityTests/StringExtractorTest.GetHexU8_Underflow2 (1667 of 2119) PASS: lldb-api :: lang/objc/objc-property/TestObjCProperty.py (1668 of 2119) PASS: lldb-unit :: Symbol/./SymbolTests/PostfixExpression.ParseFPOProgram (1669 of 2119) PASS: lldb-unit :: Process/minidump/./LLDBMinidumpTests/MinidumpParserTest.FindMemoryRange (1670 of 2119) PASS: lldb-api :: functionalities/postmortem/minidump/TestMiniDump.py (1671 of 2119) PASS: lldb-unit :: Utility/./UtilityTests/StringListTest.AppendList (1672 of 2119) PASS: lldb-api :: functionalities/plugins/python_os_plugin/stepping_plugin_threads/TestOSPluginStepping.py (1673 of 2119) UNSUPPORTED: lldb-shell :: ObjectFile/ELF/minidebuginfo-set-and-hit-breakpoint.test (1674 of 2119) PASS: lldb-api :: functionalities/breakpoint/comp_dir_symlink/TestCompDirSymLink.py (1675 of 2119) PASS: lldb-unit :: Utility/./UtilityTests/OptionsWithRawTest.ArgsButNoLeadingDash (1676 of 2119) UNSUPPORTED: lldb-api :: functionalities/thread/multi_break/TestMultipleBreakpoints.py (1677 of 2119) PASS: lldb-api :: functionalities/thread/backtrace_all/TestBacktraceAll.py (1678 of 2119) PASS: lldb-api :: lang/objcxx/hide-runtime-values/TestObjCXXHideRuntimeValues.py (1679 of 2119) PASS: lldb-unit :: Expression/./ExpressionTests/CppModuleConfigurationTest.AmbiguousCLib (1680 of 2119) PASS: lldb-api :: python_api/signals/TestSignalsAPI.py (1681 of 2119) PASS: lldb-api :: functionalities/tsan/multiple/TestTsanMultiple.py (1682 of 2119) PASS: lldb-unit :: Utility/./UtilityTests/StringExtractorTest.GetHexBytes_FullString (1683 of 2119) PASS: lldb-unit :: Utility/./UtilityTests/StringListTest.GetSize (1684 of 2119) PASS: lldb-unit :: Utility/./UtilityTests/RangeTest.LessThanInvalid (1685 of 2119) PASS: lldb-unit :: UnwindAssembly/x86/./UnwindAssemblyx86Tests/Testx86AssemblyInspectionEngine.TestLEAVE (1686 of 2119) PASS: lldb-shell :: ObjectFile/ELF/section-types-edgecases.yaml (1687 of 2119) PASS: lldb-unit :: Utility/./UtilityTests/RangeTest.DoesIntersect (1688 of 2119) PASS: lldb-api :: lang/cpp/modules-import/TestCXXModulesImport.py (1689 of 2119) PASS: lldb-unit :: debugserver/./debugserverTests/RNBSocket.LoopBackConnectIPv4 (1690 of 2119) PASS: lldb-unit :: Utility/./UtilityTests/StringListTest.SetSize (1691 of 2119) PASS: lldb-unit :: debugserver/./debugserverTests/RNBSocket.LoopBackListenIPv4 (1692 of 2119) PASS: lldb-unit :: Process/minidump/./LLDBMinidumpTests/MinidumpParserTest.FindMemoryRangeWithFullMemoryMinidump (1693 of 2119) PASS: lldb-api :: commands/target/modules/search-paths/insert/TestTargetModulesSearchpathsInsert.py (1694 of 2119) PASS: lldb-api :: tools/lldb-server/TestGdbRemoteRegisterState.py (1695 of 2119) UNSUPPORTED: lldb-shell :: Reproducer/TestLuaImport.test (1696 of 2119) PASS: lldb-api :: macosx/profile_vrs_detach/TestDetachVrsProfile.py (1697 of 2119) PASS: lldb-shell :: Minidump/fb-dump.test (1698 of 2119) PASS: lldb-api :: api/listeners/TestListener.py (1699 of 2119) PASS: lldb-unit :: Utility/./UtilityTests/LogChannelTest.EnableOptions (1700 of 2119) PASS: lldb-unit :: Utility/./UtilityTests/ScalarTest.LongLongAssigmentOperator (1701 of 2119) PASS: lldb-unit :: Host/./HostTests/SocketTest.TCPListen0ConnectAccept (1702 of 2119) PASS: lldb-api :: commands/breakpoint/command/list/TestBreakpointCommandList.py (1703 of 2119) PASS: lldb-api :: lang/cpp/nsimport/TestCppNsImport.py (1704 of 2119) PASS: lldb-api :: lang/c/conflicting-symbol/TestConflictingSymbol.py (1705 of 2119) PASS: lldb-unit :: Host/./HostTests/NativeProcessProtocolTest.ReadCStringFromMemory_MaxSize (1706 of 2119) PASS: lldb-api :: tools/lldb-server/TestGdbRemoteExitCode.py (1707 of 2119) PASS: lldb-api :: functionalities/breakpoint/breakpoint_ids/TestBreakpointIDs.py (1708 of 2119) PASS: lldb-unit :: SymbolFile/DWARF/./SymbolFileDWARFTests/XcodeSDKModuleTests.TestModuleGetXcodeSDK (1709 of 2119) PASS: lldb-api :: tools/lldb-vscode/module/TestVSCode_module.py (1710 of 2119) PASS: lldb-unit :: Utility/./UtilityTests/StringListTest.InsertStringAtIndexOutOfBounds (1711 of 2119) PASS: lldb-unit :: Process/gdb-remote/./ProcessGdbRemoteTests/GDBRemoteClientBaseTest.SendPacketAndReceiveResponseWithOutputSupport (1712 of 2119) PASS: lldb-api :: functionalities/breakpoint/auto_continue/TestBreakpointAutoContinue.py (1713 of 2119) PASS: lldb-api :: functionalities/thread/concurrent_events/TestConcurrentBreakpointDelayBreakpointOneSignal.py (1714 of 2119) PASS: lldb-api :: lang/objc/objc-checker/TestObjCCheckers.py (1715 of 2119) PASS: lldb-unit :: Utility/./UtilityTests/RangeTest.ContainsEndInclusive (1716 of 2119) PASS: lldb-api :: python_api/type/TestTypeList.py (1717 of 2119) PASS: lldb-unit :: ScriptInterpreter/Python/./ScriptInterpreterPythonTests/PythonDataObjectsTest.TestInstanceNameResolutionNoDot (1718 of 2119) PASS: lldb-unit :: Utility/./UtilityTests/StringExtractorTest.DecodeHexU8_Exact (1719 of 2119) PASS: lldb-unit :: ScriptInterpreter/Python/./ScriptInterpreterPythonTests/PythonDataObjectsTest.TestPythonDictionaryValueEquality (1720 of 2119) PASS: lldb-api :: functionalities/data-formatter/data-formatter-smart-array/TestDataFormatterSmartArray.py (1721 of 2119) PASS: lldb-api :: functionalities/thread/jump/TestThreadJump.py (1722 of 2119) PASS: lldb-api :: functionalities/thread/concurrent_events/TestConcurrentTwoBreakpointThreads.py (1723 of 2119) PASS: lldb-shell :: ObjectFile/ELF/section-addresses.yaml (1724 of 2119) PASS: lldb-unit :: Process/gdb-remote/./ProcessGdbRemoteTests/GDBRemoteCommunicationClientTest.SendSignalsToIgnore (1725 of 2119) PASS: lldb-api :: lang/c/shared_lib/TestSharedLib.py (1726 of 2119) PASS: lldb-unit :: Utility/./UtilityTests/UUIDTest.StringConverion (1727 of 2119) PASS: lldb-unit :: Symbol/./SymbolTests/DWARFCallFrameInfoTest.Basic_eh (1728 of 2119) PASS: lldb-unit :: Utility/./UtilityTests/StringExtractorTest.GetHexU8_Underflow (1729 of 2119) UNSUPPORTED: lldb-shell :: Unwind/eh-frame-augment-noop.test (1730 of 2119) PASS: lldb-unit :: Signals/./SignalsTests/UnixSignalsTest.Iteration (1731 of 2119) PASS: lldb-unit :: Utility/./UtilityTests/SerializationRountripTest.SerializeDeserializeObjectPointer (1732 of 2119) UNSUPPORTED: lldb-shell :: BuildScript/toolchain-msvc.test (1733 of 2119) PASS: lldb-api :: lang/objc/objc-new-syntax/TestObjCNewSyntaxArray.py (1734 of 2119) PASS: lldb-api :: lang/objcxx/objcxx-ivar-vector/TestIvarVector.py (1735 of 2119) PASS: lldb-api :: commands/expression/diagnostics/TestExprDiagnostics.py (1736 of 2119) PASS: lldb-unit :: Utility/./UtilityTests/StreamTest.AddressRangeEmptyRange (1737 of 2119) PASS: lldb-unit :: UnwindAssembly/x86/./UnwindAssemblyx86Tests/Testx86AssemblyInspectionEngine.TestPopESI (1738 of 2119) UNSUPPORTED: lldb-shell :: Register/x86-64-xmm16-write.test (1739 of 2119) PASS: lldb-api :: lang/c/complex/TestComplexC99.py (1740 of 2119) PASS: lldb-unit :: SymbolFile/NativePDB/./SymbolFileNativePDBTests/PDBFPOProgramToDWARFExpressionTests.UnresolvedCyclicRegisterAssignmentReference (1741 of 2119) PASS: lldb-unit :: Utility/./UtilityTests/AnsiTerminal.Basic (1742 of 2119) PASS: lldb-unit :: Utility/./UtilityTests/StringListTest.AppendStringMove (1743 of 2119) PASS: lldb-unit :: UnwindAssembly/x86/./UnwindAssemblyx86Tests/Testx86AssemblyInspectionEngine.TestStackRealignMSVC_i386 (1744 of 2119) PASS: lldb-unit :: Utility/./UtilityTests/StreamTest.ShiftOperatorChars (1745 of 2119) PASS: lldb-unit :: Utility/./UtilityTests/StreamTest.PutHex8 (1746 of 2119) PASS: lldb-api :: functionalities/breakpoint/serialize/TestBreakpointSerialization.py (1747 of 2119) PASS: lldb-unit :: UnwindAssembly/x86/./UnwindAssemblyx86Tests/Testx86AssemblyInspectionEngine.TestPopEBX (1748 of 2119) PASS: lldb-unit :: Editline/./EditlineTests/EditlineTestFixture.EditlineReceivesSingleLineText (1749 of 2119) PASS: lldb-unit :: Utility/./UtilityTests/StringListTest.GetMaxStringLengthDecreasingSize (1750 of 2119) PASS: lldb-unit :: Host/./HostTests/FileSystemTest.EmptyTest (1751 of 2119) PASS: lldb-unit :: Utility/./UtilityTests/ProcessInstanceInfoList.Yaml (1752 of 2119) UNSUPPORTED: lldb-api :: linux/mix-dwo-and-regular-objects/TestMixedDwarfBinary.py (1753 of 2119) PASS: lldb-unit :: Symbol/./SymbolTests/SymbolsTest.LocateExecutableSymbolFileForUnknownExecutableAndMissingSymbolFile (1754 of 2119) PASS: lldb-shell :: ObjectFile/ELF/short-build-id.yaml (1755 of 2119) PASS: lldb-api :: lang/objc/modules-hash-mismatch/TestClangModulesHashMismatch.py (1756 of 2119) UNSUPPORTED: lldb-shell :: Register/arm-fp-read.test (1757 of 2119) PASS: lldb-api :: functionalities/breakpoint/breakpoint_options/TestBreakpointOptions.py (1758 of 2119) PASS: lldb-api :: lang/cpp/type_lookup/TestCppTypeLookup.py (1759 of 2119) PASS: lldb-unit :: Process/gdb-remote/./ProcessGdbRemoteTests/GDBRemoteCommunicationServerTest.SendErrorResponse_StringError (1760 of 2119) PASS: lldb-unit :: Host/./HostTests/FileSystemTest.OpenErrno (1761 of 2119) UNSUPPORTED: lldb-shell :: SymbolFile/NativePDB/typedefs.cpp (1762 of 2119) PASS: lldb-unit :: ScriptInterpreter/Python/./ScriptInterpreterPythonTests/PythonDataObjectsTest.TestOwnedReferences (1763 of 2119) PASS: lldb-unit :: Utility/./UtilityTests/StringExtractorTest.GetHexU8_Underflow2_NoEof (1764 of 2119) PASS: lldb-api :: functionalities/data-formatter/language_category_updates/TestDataFormatterLanguageCategoryUpdates.py (1765 of 2119) UNSUPPORTED: lldb-api :: lang/cpp/printf/TestPrintf.py (1766 of 2119) PASS: lldb-api :: functionalities/thread/concurrent_events/TestConcurrentTwoBreakpointsOneWatchpoint.py (1767 of 2119) PASS: lldb-unit :: Process/gdb-remote/./ProcessGdbRemoteTests/GDBRemoteCommunicationClientTest.GetQOffsets (1768 of 2119) PASS: lldb-api :: lang/objc/objc-builtin-types/TestObjCBuiltinTypes.py (1769 of 2119) PASS: lldb-shell :: Settings/TestModuleCacheSanity.test (1770 of 2119) PASS: lldb-api :: functionalities/breakpoint/breakpoint_hit_count/TestBreakpointHitCount.py (1771 of 2119) PASS: lldb-shell :: Quit/TestQuitExitCode-30.test (1772 of 2119) PASS: lldb-unit :: Utility/./UtilityTests/RangeTest.Copy (1773 of 2119) PASS: lldb-api :: commands/settings/use_source_cache/TestUseSourceCache.py (1774 of 2119) PASS: lldb-shell :: ObjectFile/ELF/base-address.yaml (1775 of 2119) PASS: lldb-unit :: Utility/./UtilityTests/VMRange.ContainsRange (1776 of 2119) PASS: lldb-unit :: Symbol/./SymbolTests/SymbolsTest.TerminateLocateExecutableSymbolFileForUnknownExecutableAndUnknownSymbolFile (1777 of 2119) PASS: lldb-unit :: Host/./HostTests/ProcessLaunchInfoTest.Constructor (1778 of 2119) PASS: lldb-api :: functionalities/data-formatter/array_typedef/TestArrayTypedef.py (1779 of 2119) PASS: lldb-api :: commands/expression/completion-in-lambda-and-unnamed-class/TestCompletionInLambdaAndUnnamedClass.py (1780 of 2119) UNSUPPORTED: lldb-shell :: SymbolFile/PDB/function-nested-block.test (1781 of 2119) PASS: lldb-api :: functionalities/data-formatter/data-formatter-objc/TestDataFormatterObjCCF.py (1782 of 2119) PASS: lldb-unit :: Utility/./UtilityTests/BinaryStreamTest.PutSLEB128ThreeBytes (1783 of 2119) PASS: lldb-unit :: UnwindAssembly/x86/./UnwindAssemblyx86Tests/Testx86AssemblyInspectionEngine.TestPushESI (1784 of 2119) PASS: lldb-api :: commands/expression/call-function/TestCallBuiltinFunction.py (1785 of 2119) PASS: lldb-unit :: Target/./TargetTests/StackFrameRecognizerTest.NullModuleRegex (1786 of 2119) PASS: lldb-unit :: Utility/./UtilityTests/TimerTest.CategoryTimesNested (1787 of 2119) PASS: lldb-unit :: Process/gdb-remote/./ProcessGdbRemoteTests/GDBRemoteCommunicationClientTest.SyncThreadState (1788 of 2119) PASS: lldb-unit :: UnwindAssembly/x86/./UnwindAssemblyx86Tests/Testx86AssemblyInspectionEngine.TestSubRSP (1789 of 2119) PASS: lldb-shell :: SymbolFile/DWARF/debug-types-dwarf5.s (1790 of 2119) PASS: lldb-unit :: UnwindAssembly/x86/./UnwindAssemblyx86Tests/Testx86AssemblyInspectionEngine.TestPushRBX (1791 of 2119) PASS: lldb-unit :: Utility/./UtilityTests/PassiveReplayTest.InstrumentedBarPtr (1792 of 2119) PASS: lldb-api :: functionalities/data-formatter/data-formatter-objc/TestDataFormatterObjCKVO.py (1793 of 2119) PASS: lldb-api :: functionalities/inferior-crashing/recursive-inferior/TestRecursiveInferior.py (1794 of 2119) PASS: lldb-unit :: Utility/./UtilityTests/NameMatchesTest.Equals (1795 of 2119) PASS: lldb-api :: lang/cpp/template/TestTemplateArgs.py (1796 of 2119) PASS: lldb-unit :: Symbol/./SymbolTests/TestClangASTImporter.MetadataPropagationAfterCopying (1797 of 2119) PASS: lldb-api :: functionalities/multidebugger_commands/TestMultipleDebuggersCommands.py (1798 of 2119) PASS: lldb-api :: functionalities/thread/ignore_suspended/TestIgnoreSuspendedThread.py (1799 of 2119) PASS: lldb-unit :: ScriptInterpreter/Python/./ScriptInterpreterPythonTests/PythonDataObjectsTest.TestPythonDictionaryManipulation (1800 of 2119) PASS: lldb-unit :: Language/Highlighting/./HighlighterTests/HighlighterTest.ClangScalarLiterals (1801 of 2119) PASS: lldb-api :: lang/cpp/member-and-local-vars-with-same-name/TestMembersAndLocalsWithSameName.py (1802 of 2119) PASS: lldb-shell :: SymbolFile/Breakpad/line-table-edgecases.test (1803 of 2119) PASS: lldb-unit :: SymbolFile/DWARF/./SymbolFileDWARFTests/SymbolFileDWARFTests.TestAbilitiesForDWARF (1804 of 2119) PASS: lldb-shell :: ScriptInterpreter/Python/crashlog.test (1805 of 2119) PASS: lldb-unit :: Thread/./ThreadTests/ThreadTest.GetPrivateStopInfo (1806 of 2119) PASS: lldb-shell :: ScriptInterpreter/Python/sb_address_exception.test (1807 of 2119) PASS: lldb-unit :: Utility/./UtilityTests/StringExtractorTest.DecodeHexU8_Underflow (1808 of 2119) PASS: lldb-unit :: Utility/./UtilityTests/CompletionRequest.Constructor (1809 of 2119) PASS: lldb-api :: lang/objc/foundation/TestObjCMethodsNSArray.py (1810 of 2119) PASS: lldb-unit :: Utility/./UtilityTests/ConstStringTest.UpdateMangledCounterpart (1811 of 2119) PASS: lldb-api :: functionalities/breakpoint/debugbreak/TestDebugBreak.py (1812 of 2119) PASS: lldb-api :: python_api/lldbutil/TestSwigVersion.py (1813 of 2119) PASS: lldb-api :: tools/lldb-server/TestGdbRemoteAttach.py (1814 of 2119) PASS: lldb-api :: commands/expression/persist_objc_pointeetype/TestPersistObjCPointeeType.py (1815 of 2119) PASS: lldb-shell :: SymbolFile/DWARF/dwarf5-index-is-used.cpp (1816 of 2119) PASS: lldb-api :: lang/objc/foundation/TestSymbolTable.py (1817 of 2119) UNSUPPORTED: lldb-shell :: Register/x86-zmm-read.test (1818 of 2119) PASS: lldb-api :: lang/objc/conflicting-definition/TestConflictingDefinition.py (1819 of 2119) PASS: lldb-api :: commands/expression/unicode-in-variable/TestUnicodeInVariable.py (1820 of 2119) PASS: lldb-shell :: SymbolFile/Breakpad/line-table-missing-file.test (1821 of 2119) PASS: lldb-unit :: Utility/./UtilityTests/StringLexerTest.Next (1822 of 2119) PASS: lldb-unit :: Utility/./UtilityTests/ScalarTest.Promotion (1823 of 2119) PASS: lldb-api :: lang/c/find_struct_type/TestFindStructTypes.py (1824 of 2119) PASS: lldb-api :: commands/expression/vector_of_enums/TestVectorOfEnums.py (1825 of 2119) UNSUPPORTED: lldb-shell :: BuildScript/toolchain-clang-cl.test (1826 of 2119) PASS: lldb-unit :: Utility/./UtilityTests/AnsiTerminal.Twice (1827 of 2119) UNSUPPORTED: lldb-api :: tools/lldb-vscode/completions/TestVSCode_completions.py (1828 of 2119) UNSUPPORTED: lldb-shell :: ScriptInterpreter/Lua/quit.test (1829 of 2119) PASS: lldb-unit :: ScriptInterpreter/Python/./ScriptInterpreterPythonTests/PythonDataObjectsTest.TestPythonString (1830 of 2119) PASS: lldb-unit :: Process/gdb-remote/./ProcessGdbRemoteTests/GDBRemoteCommunicationClientTest.GetModulesInfo (1831 of 2119) PASS: lldb-api :: functionalities/ubsan/user-expression/TestUbsanUserExpression.py (1832 of 2119) PASS: lldb-api :: lang/objc/rdar-10967107/TestRdar10967107.py (1833 of 2119) PASS: lldb-api :: lang/cpp/global_operators/TestCppGlobalOperators.py (1834 of 2119) PASS: lldb-unit :: Expression/./ExpressionTests/ClangHostTest.MacOSX (1835 of 2119) PASS: lldb-unit :: Process/minidump/./LLDBMinidumpTests/MinidumpParserTest.GetLinuxProcStatus_no_stream (1836 of 2119) UNSUPPORTED: lldb-api :: functionalities/process_save_core/TestProcessSaveCore.py (1837 of 2119) PASS: lldb-api :: python_api/value/change_values/TestChangeValueAPI.py (1838 of 2119) PASS: lldb-unit :: Utility/./UtilityTests/StringLexerTest.GetUnlexed (1839 of 2119) PASS: lldb-unit :: Utility/./UtilityTests/Flags.AnySet (1840 of 2119) PASS: lldb-unit :: Utility/./UtilityTests/EventTest.DumpEventDataBytes (1841 of 2119) PASS: lldb-api :: functionalities/data-formatter/compactvectors/TestCompactVectors.py (1842 of 2119) PASS: lldb-unit :: Utility/./UtilityTests/StreamTest.AddressNoSuffix (1843 of 2119) PASS: lldb-unit :: Utility/./UtilityTests/FileSpecTest.PrependPathComponent (1844 of 2119) PASS: lldb-api :: tools/lldb-server/TestGdbRemoteSingleStep.py (1845 of 2119) PASS: lldb-api :: functionalities/data-formatter/nssetsynth/TestNSSetSynthetic.py (1846 of 2119) PASS: lldb-unit :: Utility/./UtilityTests/RangeTest.Slide (1847 of 2119) PASS: lldb-api :: lang/cpp/covariant-return-types/TestCovariantReturnTypes.py (1848 of 2119) PASS: lldb-api :: macosx/version_zero/TestGetVersionZeroVersion.py (1849 of 2119) PASS: lldb-api :: macosx/macCatalyst/TestMacCatalyst.py (1850 of 2119) PASS: lldb-unit :: Utility/./UtilityTests/StreamTest.AddressRangeInvalidRange (1851 of 2119) PASS: lldb-shell :: SymbolFile/DWARF/debug_loc-aslr.s (1852 of 2119) PASS: lldb-api :: functionalities/conditional_break/TestConditionalBreak.py (1853 of 2119) PASS: lldb-shell :: BuildScript/script-args.test (1854 of 2119) PASS: lldb-unit :: Utility/./UtilityTests/UserIDResolver.GetUserName (1855 of 2119) PASS: lldb-api :: lang/cpp/frame-var-anon-unions/TestFrameVariableAnonymousUnions.py (1856 of 2119) PASS: lldb-api :: commands/frame/language/TestGuessLanguage.py (1857 of 2119) PASS: lldb-shell :: Commands/command-breakpoint-col.test (1858 of 2119) UNSUPPORTED: lldb-shell :: SymbolFile/PDB/udt-layout.test (1859 of 2119) PASS: lldb-unit :: Utility/./UtilityTests/ProcessInfoTest.Constructor (1860 of 2119) PASS: lldb-unit :: Utility/./UtilityTests/ArgsTest.ReplaceArgumentAtIndexEqual (1861 of 2119) UNSUPPORTED: lldb-api :: functionalities/data-formatter/data-formatter-stl/libstdcpp/tuple/TestDataFormatterStdTuple.py (1862 of 2119) PASS: lldb-unit :: Utility/./UtilityTests/StreamTeeTest.Constructor2Streams (1863 of 2119) PASS: lldb-unit :: Utility/./UtilityTests/StructuredDataTest.ParseJSONFromFile (1864 of 2119) PASS: lldb-api :: functionalities/load_unload/TestLoadUnload.py (1865 of 2119) PASS: lldb-unit :: Utility/./UtilityTests/StringLexerTest.Peek (1866 of 2119) PASS: lldb-api :: macosx/function-starts/TestFunctionStarts.py (1867 of 2119) PASS: lldb-unit :: ScriptInterpreter/Python/./ScriptInterpreterPythonTests/PythonDataObjectsTest.TestCallable (1868 of 2119) PASS: lldb-shell :: Process/TestEnvironment.test (1869 of 2119) PASS: lldb-unit :: Language/Highlighting/./HighlighterTests/HighlighterTest.ClangTrailingBackslashWithWhitespace (1870 of 2119) PASS: lldb-api :: commands/watchpoints/watchpoint_commands/TestWatchpointCommands.py (1871 of 2119) PASS: lldb-shell :: SymbolFile/DWARF/debug_ranges-missing-section.s (1872 of 2119) PASS: lldb-unit :: Utility/./UtilityTests/ArchSpecTest.MergeFromMachOUnknown (1873 of 2119) PASS: lldb-api :: functionalities/data-formatter/data-formatter-python-synth/TestDataFormatterPythonSynth.py (1874 of 2119) PASS: lldb-unit :: Symbol/./SymbolTests/TestTypeSystemClang.TestDisplayName (1875 of 2119) PASS: lldb-unit :: SymbolFile/DWARF/./SymbolFileDWARFTests/SymbolFileDWARFTests.TestAbbrevNullAttrValidForm (1876 of 2119) PASS: lldb-api :: functionalities/gdb_remote_client/TestqOffsets.py (1877 of 2119) PASS: lldb-api :: lang/cpp/limit-debug-info/TestWithLimitDebugInfo.py (1878 of 2119) PASS: lldb-unit :: Host/./HostTests/HostInfoTest.GetAugmentedArchSpec (1879 of 2119) PASS: lldb-unit :: Utility/./UtilityTests/StringListTest.ForRangeEmpty (1880 of 2119) PASS: lldb-api :: python_api/formatters/TestFormattersSBAPI.py (1881 of 2119) PASS: lldb-api :: commands/target/dump-symtab-demangle/TestDumpSymtabDemangle.py (1882 of 2119) PASS: lldb-api :: commands/expression/ir-interpreter/TestIRInterpreter.py (1883 of 2119) PASS: lldb-unit :: UnwindAssembly/x86/./UnwindAssemblyx86Tests/Testx86AssemblyInspectionEngine.TestPopR13 (1884 of 2119) PASS: lldb-api :: macosx/simulator/TestSimulatorPlatform.py (1885 of 2119) PASS: lldb-shell :: SymbolFile/DWARF/debug-types-basic.test (1886 of 2119) PASS: lldb-api :: functionalities/thread/concurrent_events/TestConcurrentSignalDelayBreak.py (1887 of 2119) PASS: lldb-shell :: Minidump/memory-region.yaml (1888 of 2119) PASS: lldb-api :: lang/objc/modules-update/TestClangModulesUpdate.py (1889 of 2119) PASS: lldb-unit :: Utility/./UtilityTests/StringListTest.JoinMultiCharSeparator (1890 of 2119) UNSUPPORTED: lldb-api :: functionalities/data-formatter/data-formatter-stl/libstdcpp/string/TestDataFormatterStdString.py (1891 of 2119) PASS: lldb-unit :: Utility/./UtilityTests/RegisterValueTest.GetSet8 (1892 of 2119) UNSUPPORTED: lldb-shell :: SymbolFile/PDB/compilands.test (1893 of 2119) PASS: lldb-api :: lang/cpp/function_refs/TestFunctionRefs.py (1894 of 2119) PASS: lldb-unit :: Utility/./UtilityTests/RangeTest.SizeTypes (1895 of 2119) PASS: lldb-api :: functionalities/asan/TestMemoryHistory.py (1896 of 2119) PASS: lldb-api :: source-manager/TestSourceManager.py (1897 of 2119) PASS: lldb-unit :: Utility/./UtilityTests/RangeTest.Equal (1898 of 2119) UNSUPPORTED: lldb-shell :: SymbolFile/NativePDB/stack_unwinding01.cpp (1899 of 2119) PASS: lldb-unit :: ObjectFile/Breakpad/./ObjectFileBreakpadTests/PublicRecord.parse (1900 of 2119) PASS: lldb-unit :: Target/./TargetTests/ModuleCacheTest.GetAndPut (1901 of 2119) PASS: lldb-shell :: Driver/TestError.test (1902 of 2119) PASS: lldb-shell :: SymbolFile/Breakpad/line-table-discontinuous-file-ids.test (1903 of 2119) PASS: lldb-api :: lang/cpp/symbols/TestSymbols.py (1904 of 2119) PASS: lldb-api :: lang/cpp/scope/TestCppScope.py (1905 of 2119) PASS: lldb-api :: lang/c/bitfields/TestBitfields.py (1906 of 2119) PASS: lldb-unit :: Utility/./UtilityTests/StreamTeeTest.Constructor1Stream (1907 of 2119) PASS: lldb-api :: types/TestDoubleTypesExpr.py (1908 of 2119) PASS: lldb-unit :: Symbol/./SymbolTests/TestClangASTImporter.DeportDeclTagDecl (1909 of 2119) PASS: lldb-api :: commands/statistics/basic/TestStats.py (1910 of 2119) PASS: lldb-unit :: Utility/./UtilityTests/VASprintfTest.EncodingError (1911 of 2119) PASS: lldb-shell :: Settings/TestStopCommandSourceOnError.test (1912 of 2119) PASS: lldb-unit :: Utility/./UtilityTests/BinaryStreamTest.PutULEB128OneByte (1913 of 2119) PASS: lldb-unit :: UnwindAssembly/x86/./UnwindAssemblyx86Tests/Testx86AssemblyInspectionEngine.TestPopR15 (1914 of 2119) PASS: lldb-api :: functionalities/tail_call_frames/inlining_and_tail_calls/TestInliningAndTailCalls.py (1915 of 2119) PASS: lldb-api :: lang/cpp/diamond/TestDiamond.py (1916 of 2119) PASS: lldb-shell :: ObjectFile/ELF/gnu-debuglink.yaml (1917 of 2119) PASS: lldb-unit :: Utility/./UtilityTests/LogChannelEnabledTest.LogThread (1918 of 2119) PASS: lldb-shell :: SymbolFile/DWARF/dwarf5-partial-index.cpp (1919 of 2119) PASS: lldb-unit :: Process/gdb-remote/./ProcessGdbRemoteTests/GDBRemoteCommunicationServerTest.SendErrorResponse_ErrorNumber (1920 of 2119) PASS: lldb-unit :: Process/gdb-remote/./ProcessGdbRemoteTests/GDBRemoteClientBaseTest.SendContinueDelegateStructuredDataReceipt (1921 of 2119) PASS: lldb-api :: functionalities/data-formatter/vector-types/TestVectorTypesFormatting.py (1922 of 2119) PASS: lldb-api :: types/TestLongTypes.py (1923 of 2119) PASS: lldb-unit :: Utility/./UtilityTests/ListenerTest.GetEventWait (1924 of 2119) PASS: lldb-api :: commands/expression/call-throws/TestCallThatThrows.py (1925 of 2119) PASS: lldb-api :: api/multithreaded/TestMultithreaded.py (1926 of 2119) PASS: lldb-unit :: Utility/./UtilityTests/StringListTest.JoinEmpty (1927 of 2119) PASS: lldb-api :: lang/cpp/breakpoint_in_member_func_w_non_primitive_params/TestBreakpointInMemberFuncWNonPrimitiveParams.py (1928 of 2119) PASS: lldb-api :: commands/gui/viewlarge/TestGuiViewLarge.py (1929 of 2119) PASS: lldb-unit :: Utility/./UtilityTests/OptionsWithRawTest.EmptySuffix (1930 of 2119) PASS: lldb-unit :: Utility/./UtilityTests/ScalarTest.Comparison (1931 of 2119) PASS: lldb-api :: commands/expression/persistent_types/TestNestedPersistentTypes.py (1932 of 2119) UNSUPPORTED: lldb-api :: functionalities/darwin_log/filter/regex/activity/TestDarwinLogFilterRegexActivity.py (1933 of 2119) UNSUPPORTED: lldb-shell :: ScriptInterpreter/Lua/breakpoint_callback.test (1934 of 2119) PASS: lldb-unit :: Utility/./UtilityTests/StreamTest.AddressRange (1935 of 2119) PASS: lldb-api :: functionalities/data-formatter/refpointer-recursion/TestDataFormatterRefPtrRecursion.py (1936 of 2119) PASS: lldb-api :: functionalities/paths/TestPaths.py (1937 of 2119) PASS: lldb-unit :: UnwindAssembly/x86/./UnwindAssemblyx86Tests/Testx86AssemblyInspectionEngine.TestPopRBP (1938 of 2119) PASS: lldb-api :: functionalities/gdb_remote_client/TestStopPCs.py (1939 of 2119) PASS: lldb-api :: commands/target/stop-hook/disable/TestTargetStopHookDisable.py (1940 of 2119) PASS: lldb-unit :: SymbolFile/NativePDB/./SymbolFileNativePDBTests/PDBFPOProgramToDWARFExpressionTests.MissingTargetRegister (1941 of 2119) PASS: lldb-api :: functionalities/data-formatter/data-formatter-cpp/TestDataFormatterCpp.py (1942 of 2119) PASS: lldb-unit :: UnwindAssembly/x86/./UnwindAssemblyx86Tests/Testx86AssemblyInspectionEngine.TestPushImm (1943 of 2119) PASS: lldb-unit :: UnwindAssembly/x86/./UnwindAssemblyx86Tests/Testx86AssemblyInspectionEngine.TestPushR15 (1944 of 2119) PASS: lldb-shell :: SymbolFile/NativePDB/bitfields.cpp (1945 of 2119) PASS: lldb-api :: tools/lldb-server/TestLldbGdbServer.py (1946 of 2119) PASS: lldb-unit :: Utility/./UtilityTests/BinaryStreamTest.PutULEB128EightBytes (1947 of 2119) PASS: lldb-api :: functionalities/thread/concurrent_events/TestConcurrentSignalDelayWatch.py (1948 of 2119) PASS: lldb-api :: lang/cpp/constructors/TestCppConstructors.py (1949 of 2119) PASS: lldb-api :: functionalities/data-formatter/data-formatter-stl/libstdcpp/unique_ptr/invalid/TestDataFormatterInvalidStdUniquePtr.py (1950 of 2119) PASS: lldb-unit :: SymbolFile/DWARF/./SymbolFileDWARFTests/SymbolFileDWARFTests.TestAbbrevValidAttrNullForm (1951 of 2119) PASS: lldb-api :: lang/objc/foundation/TestObjCMethodsNSError.py (1952 of 2119) PASS: lldb-api :: python_api/get-value-32bit-int/TestGetValue32BitInt.py (1953 of 2119) PASS: lldb-api :: lang/objc/radar-9691614/TestObjCMethodReturningBOOL.py (1954 of 2119) PASS: lldb-shell :: ObjectFile/MachO/lc_version_min.yaml (1955 of 2119) PASS: lldb-unit :: Utility/./UtilityTests/FileSpecTest.EqualDotsPosix (1956 of 2119) PASS: lldb-shell :: Minidump/Windows/arm-fp-unwind.test (1957 of 2119) PASS: lldb-api :: functionalities/data-formatter/data-formatter-stl/libcxx/set/TestDataFormatterLibcxxSet.py (1958 of 2119) PASS: lldb-unit :: Symbol/./SymbolTests/TestClangASTImporter.CopyDeclTagDecl (1959 of 2119) PASS: lldb-unit :: Utility/./UtilityTests/FileSpecTest.OperatorBool (1960 of 2119) PASS: lldb-api :: functionalities/data-formatter/data-formatter-stl/libcxx/vector/TestDataFormatterLibcxxVector.py (1961 of 2119) PASS: lldb-unit :: Host/./HostTests/FileSystemTest.GetByteSize (1962 of 2119) PASS: lldb-shell :: ObjectFile/ELF/PT_LOAD-empty.yaml (1963 of 2119) PASS: lldb-unit :: Platform/./LLDBPlatformTests/PlatformDarwinTest.FindComponentInPath (1964 of 2119) PASS: lldb-unit :: Utility/./UtilityTests/StringListTest.Assignment (1965 of 2119) PASS: lldb-unit :: Signals/./SignalsTests/UnixSignalsTest.VersionChange (1966 of 2119) PASS: lldb-unit :: UnwindAssembly/x86/./UnwindAssemblyx86Tests/Testx86AssemblyInspectionEngine.TestMovRSPtoRBP (1967 of 2119) PASS: lldb-unit :: Utility/./UtilityTests/StreamTeeTest.Write (1968 of 2119) PASS: lldb-api :: functionalities/postmortem/elf-core/gcore/TestGCore.py (1969 of 2119) PASS: lldb-api :: lang/cpp/std-function-step-into-callable/TestStdFunctionStepIntoCallable.py (1970 of 2119) PASS: lldb-shell :: ObjectFile/ELF/compressed-sections.yaml (1971 of 2119) PASS: lldb-unit :: Utility/./UtilityTests/PassiveReplayTest.InstrumentedFoo (1972 of 2119) PASS: lldb-unit :: Utility/./UtilityTests/PassiveReplayTest.InstrumentedBarRef (1973 of 2119) PASS: lldb-unit :: Utility/./UtilityTests/StringListTest.JoinThree (1974 of 2119) PASS: lldb-shell :: ObjectFile/ELF/aarch64-relocations.yaml (1975 of 2119) PASS: lldb-api :: functionalities/data-formatter/data-formatter-globals/TestDataFormatterGlobals.py (1976 of 2119) PASS: lldb-unit :: Utility/./UtilityTests/SerializationRountripTest.SerializeDeserializeCString (1977 of 2119) PASS: lldb-api :: functionalities/deleted-executable/TestDeletedExecutable.py (1978 of 2119) PASS: lldb-unit :: Utility/./UtilityTests/RangeTest.ClearWithStarAddress (1979 of 2119) PASS: lldb-unit :: Utility/./UtilityTests/StreamTest.AddressSize (1980 of 2119) PASS: lldb-shell :: ScriptInterpreter/None/import_module.test (1981 of 2119) UNSUPPORTED: lldb-api :: functionalities/thread/break_after_join/TestBreakAfterJoin.py (1982 of 2119) PASS: lldb-unit :: Utility/./UtilityTests/DataExtractorTest.UncommonAddressSize (1983 of 2119) PASS: lldb-unit :: Expression/./ExpressionTests/DiagnosticManagerTest.PutString (1984 of 2119) PASS: lldb-unit :: Process/gdb-remote/./ProcessGdbRemoteTests/GDBRemoteCommunicationTest.ReadPacket_checksum (1985 of 2119) PASS: lldb-api :: lang/cpp/operator-overload/TestOperatorOverload.py (1986 of 2119) PASS: lldb-unit :: Utility/./UtilityTests/StringExtractorTest.GetU64BigEndian (1987 of 2119) PASS: lldb-api :: commands/expression/namespace_local_var_same_name_obj_c/TestNamespaceLocalVarSameNameObjC.py (1988 of 2119) PASS: lldb-unit :: Symbol/./SymbolTests/TestTypeSystemClang.TestGetBasicTypeFromName (1989 of 2119) PASS: lldb-api :: functionalities/gdb_remote_client/TestWasm.py (1990 of 2119) PASS: lldb-unit :: Utility/./UtilityTests/StringExtractorTest.GetHexU8_Underflow_NoEof (1991 of 2119) PASS: lldb-api :: functionalities/thread/concurrent_events/TestConcurrentDelaySignalBreak.py (1992 of 2119) PASS: lldb-unit :: Symbol/./SymbolTests/TestTypeSystemClang.TestDisplayNameEmpty (1993 of 2119) PASS: lldb-unit :: Process/minidump/./LLDBMinidumpTests/MinidumpParserTest.GetPid (1994 of 2119) PASS: lldb-api :: lang/cpp/namespace/TestNamespaceLookup.py (1995 of 2119) PASS: lldb-api :: tools/lldb-vscode/variables/TestVSCode_variables.py (1996 of 2119) PASS: lldb-shell :: SymbolFile/Breakpad/line-table-mixed-path-styles.test (1997 of 2119) UNSUPPORTED: lldb-shell :: Register/x86-64-ymm16-read.test (1998 of 2119) UNSUPPORTED: lldb-api :: functionalities/breakpoint/breakpoint_in_delayslot/TestAvoidBreakpointInDelaySlot.py (1999 of 2119) PASS: lldb-api :: functionalities/data-formatter/data-formatter-stl/libcxx/function/TestLibCxxFunction.py (2000 of 2119) PASS: lldb-api :: tools/lldb-server/inferior-crash/TestGdbRemoteAbort.py (2001 of 2119) PASS: lldb-shell :: Register/x86-64-ymm-read.test (2002 of 2119) PASS: lldb-unit :: Process/minidump/./LLDBMinidumpTests/MinidumpParserTest.GetMemoryRegionInfoLinuxMaps (2003 of 2119) PASS: lldb-shell :: Minidump/memory-region-from-module.yaml (2004 of 2119) PASS: lldb-api :: commands/command/script/import/rdar-12586188/TestRdar12586188.py (2005 of 2119) PASS: lldb-unit :: Utility/./UtilityTests/StringLexerTest.HasAtLeast (2006 of 2119) PASS: lldb-shell :: ObjectFile/Breakpad/discontiguous-sections.test (2007 of 2119) PASS: lldb-unit :: ObjectFile/Breakpad/./ObjectFileBreakpadTests/ModuleRecord.parse (2008 of 2119) PASS: lldb-unit :: ObjectFile/Breakpad/./ObjectFileBreakpadTests/StackCFIRecord.parse (2009 of 2119) PASS: lldb-api :: commands/frame/var-scope/TestFrameVariableScope.py (2010 of 2119) PASS: lldb-api :: commands/gui/basicdebug/TestGuiBasicDebug.py (2011 of 2119) PASS: lldb-shell :: ScriptInterpreter/Python/eof.test (2012 of 2119) PASS: lldb-unit :: SymbolFile/DWARF/./SymbolFileDWARFTests/SymbolFileDWARFTests.ParseArangesNonzeroSegmentSize (2013 of 2119) UNSUPPORTED: lldb-api :: lang/objc/rdar-12408181/TestRdar12408181.py (2014 of 2119) PASS: lldb-unit :: Process/minidump/./LLDBMinidumpTests/MinidumpParserTest.GetFilteredModuleList (2015 of 2119) PASS: lldb-api :: commands/expression/weak_symbols/TestWeakSymbols.py (2016 of 2119) PASS: lldb-unit :: Host/./HostTests/HostInfoTest.GetHostname (2017 of 2119) PASS: lldb-api :: commands/process/attach/attach_denied/TestAttachDenied.py (2018 of 2119) PASS: lldb-api :: functionalities/thread/concurrent_events/TestConcurrentTwoBreakpointsOneDelaySignal.py (2019 of 2119) UNSUPPORTED: lldb-shell :: ScriptInterpreter/Lua/convenience_variables.test (2020 of 2119) PASS: lldb-unit :: Utility/./UtilityTests/CompletionRequest.DuplicateFiltering (2021 of 2119) PASS: lldb-shell :: SymbolFile/DWARF/childless-compile-unit.s (2022 of 2119) PASS: lldb-api :: tools/lldb-server/TestGdbRemoteHostInfo.py (2023 of 2119) PASS: lldb-api :: macosx/dyld-trie-symbols/TestDyldTrieSymbols.py (2024 of 2119) PASS: lldb-api :: tools/lldb-server/inferior-crash/TestGdbRemoteSegFault.py (2025 of 2119) PASS: lldb-api :: functionalities/data-formatter/data-formatter-objc/TestDataFormatterObjCNSError.py (2026 of 2119) PASS: lldb-api :: python_api/sbstructureddata/TestStructuredDataAPI.py (2027 of 2119) PASS: lldb-api :: commands/command/invalid-args/TestInvalidArgsCommand.py (2028 of 2119) PASS: lldb-unit :: Utility/./UtilityTests/OptionsWithRawTest.EmptyInput (2029 of 2119) PASS: lldb-unit :: Host/./HostTests/MainLoopTest.UnmonitoredSignal (2030 of 2119) PASS: lldb-unit :: Utility/./UtilityTests/Flags.Clear (2031 of 2119) PASS: lldb-unit :: Host/./HostTests/ConnectionFileDescriptorTest.TCPGetURIv6 (2032 of 2119) PASS: lldb-api :: commands/process/attach-resume/TestAttachResume.py (2033 of 2119) PASS: lldb-api :: lang/objc/forward-decl/TestForwardDecl.py (2034 of 2119) PASS: lldb-unit :: Target/./TargetTests/ModuleCacheTest.GetAndPutUuidExists (2035 of 2119) PASS: lldb-unit :: UnwindAssembly/x86/./UnwindAssemblyx86Tests/Testx86AssemblyInspectionEngine.TestStackRealign8BitDisp_i386 (2036 of 2119) PASS: lldb-unit :: Utility/./UtilityTests/StringListTest.LongestCommonPrefixEmpty (2037 of 2119) PASS: lldb-api :: api/command-return-object/TestSBCommandReturnObject.py (2038 of 2119) PASS: lldb-unit :: Utility/./UtilityTests/ArgsTest.ReplaceArgumentAtIndexOutOfRange (2039 of 2119) PASS: lldb-api :: functionalities/thread/concurrent_events/TestConcurrentWatchBreakDelay.py (2040 of 2119) PASS: lldb-unit :: Utility/./UtilityTests/AnsiTerminal.AtStart (2041 of 2119) PASS: lldb-unit :: UnwindAssembly/x86/./UnwindAssemblyx86Tests/Testx86AssemblyInspectionEngine.TestPopRBX (2042 of 2119) PASS: lldb-api :: commands/expression/unwind_expression/TestUnwindExpression.py (2043 of 2119) PASS: lldb-unit :: Utility/./UtilityTests/LogChannelEnabledTest.log_options (2044 of 2119) PASS: lldb-api :: lang/objc/ivar-IMP/TestObjCiVarIMP.py (2045 of 2119) PASS: lldb-unit :: Utility/./UtilityTests/StringLexerTest.NextIfList (2046 of 2119) PASS: lldb-shell :: SymbolFile/NativePDB/ast-functions.cpp (2047 of 2119) PASS: lldb-unit :: SymbolFile/NativePDB/./SymbolFileNativePDBTests/PDBFPOProgramToDWARFExpressionTests.UnresolvedRegisterReference (2048 of 2119) PASS: lldb-api :: commands/command/source/TestCommandSource.py (2049 of 2119) PASS: lldb-unit :: Utility/./UtilityTests/RangeTest.SetRangeBase (2050 of 2119) UNSUPPORTED: lldb-api :: python_api/event/TestEvents.py (2051 of 2119) PASS: lldb-unit :: Utility/./UtilityTests/StringListTest.RemoveBlankLines (2052 of 2119) PASS: lldb-unit :: Utility/./UtilityTests/ArgsTest.ReplaceArgumentAtIndexLonger (2053 of 2119) PASS: lldb-api :: commands/expression/rdar44436068/Test128BitsInteger.py (2054 of 2119) PASS: lldb-api :: commands/expression/completion/TestExprCompletion.py (2055 of 2119) PASS: lldb-unit :: Utility/./UtilityTests/IndexToObjectTest.ObjectForIndex (2056 of 2119) PASS: lldb-unit :: Utility/./UtilityTests/UriParserTest.BracketedHostname (2057 of 2119) PASS: lldb-unit :: Utility/./UtilityTests/SharedCluster.ClusterManager (2058 of 2119) PASS: lldb-shell :: Watchpoint/SetErrorCases.test (2059 of 2119) PASS: lldb-shell :: SymbolFile/DWARF/dwarf5_locations.s (2060 of 2119) PASS: lldb-unit :: UnwindAssembly/x86/./UnwindAssemblyx86Tests/Testx86AssemblyInspectionEngine.TestPushRBP (2061 of 2119) PASS: lldb-api :: functionalities/gdb_remote_client/TestRecognizeBreakpoint.py (2062 of 2119) PASS: lldb-api :: functionalities/abbreviation/TestAbbreviations.py (2063 of 2119) PASS: lldb-shell :: Register/x86-64-gp-read.test (2064 of 2119) PASS: lldb-shell :: Process/Optimization.test (2065 of 2119) PASS: lldb-api :: python_api/disassemble-raw-data/TestDisassemble_VST1_64.py (2066 of 2119) PASS: lldb-api :: functionalities/tail_call_frames/sbapi_support/TestTailCallFrameSBAPI.py (2067 of 2119) PASS: lldb-unit :: Expression/./ExpressionTests/DWARFExpression.DW_OP_piece (2068 of 2119) PASS: lldb-api :: commands/gui/breakpoints/TestGuiBreakpoints.py (2069 of 2119) PASS: lldb-unit :: Utility/./UtilityTests/LogChannelEnabledTest.LogGetLogThread (2070 of 2119) UNSUPPORTED: lldb-api :: tools/intel-features/intel-pt/test/TestIntelPTSimpleBinary.py (2071 of 2119) PASS: lldb-api :: functionalities/thread/concurrent_events/TestConcurrentManyWatchpoints.py (2072 of 2119) PASS: lldb-unit :: Host/./HostTests/NativeProcessProtocolTest.ReadCStringFromMemory (2073 of 2119) PASS: lldb-api :: lang/objc/objc++/TestObjCXX.py (2074 of 2119) PASS: lldb-api :: commands/watchpoints/step_over_watchpoint/TestStepOverWatchpoint.py (2075 of 2119) PASS: lldb-api :: lang/cpp/virtual-overload/TestVirtualOverload.py (2076 of 2119) PASS: lldb-unit :: ScriptInterpreter/Python/./ScriptInterpreterPythonTests/PythonDataObjectsTest.TestPythonTupleInitializerList2 (2077 of 2119) PASS: lldb-shell :: SymbolFile/DWARF/debug_rnglists-dwo.s (2078 of 2119) PASS: lldb-unit :: Symbol/./SymbolTests/TestTypeSystemClang.TemplateArguments (2079 of 2119) PASS: lldb-api :: functionalities/gdb_remote_client/TestRegDefinitionInParts.py (2080 of 2119) PASS: lldb-unit :: Utility/./UtilityTests/OptionsWithRawTest.LeadingSpaceArgs (2081 of 2119) UNSUPPORTED: lldb-shell :: SymbolFile/PDB/ast-restore.test (2082 of 2119) UNSUPPORTED: lldb-shell :: ScriptInterpreter/Lua/io.test (2083 of 2119) PASS: lldb-unit :: Utility/./UtilityTests/GeneratorTest.Create (2084 of 2119) PASS: lldb-unit :: Core/./LLDBCoreTests/RichManglingContextTest.IPDRealloc (2085 of 2119) PASS: lldb-unit :: Utility/./UtilityTests/CompletionRequest.TryCompleteCurrentArgBad (2086 of 2119) PASS: lldb-unit :: Language/Highlighting/./HighlighterTests/HighlighterTest.ClangPPDirectives (2087 of 2119) PASS: lldb-api :: commands/expression/result_numbering/TestResultNumbering.py (2088 of 2119) PASS: lldb-unit :: Process/minidump/./LLDBMinidumpTests/MinidumpParserTest.GetThreadContext_x86_32 (2089 of 2119) PASS: lldb-api :: functionalities/data-formatter/data-formatter-stl/libcxx/optional/TestDataFormatterLibcxxOptional.py (2090 of 2119) PASS: lldb-unit :: Utility/./UtilityTests/FileSpecTest.Yaml (2091 of 2119) PASS: lldb-unit :: Utility/./UtilityTests/NameMatchesTest.Contains (2092 of 2119) PASS: lldb-unit :: Language/Highlighting/./HighlighterTests/HighlighterTest.ClangCommas (2093 of 2119) UNSUPPORTED: lldb-shell :: SymbolFile/PDB/class-layout.test (2094 of 2119) PASS: lldb-api :: tools/lldb-vscode/breakpoint/TestVSCode_setExceptionBreakpoints.py (2095 of 2119) PASS: lldb-api :: lang/objc/variadic_methods/TestVariadicMethods.py (2096 of 2119) PASS: lldb-unit :: Utility/./UtilityTests/OptionsWithRawTest.SingleWhitespaceInput (2097 of 2119) PASS: lldb-api :: functionalities/thread/concurrent_events/TestConcurrentManyBreakpoints.py (2098 of 2119) PASS: lldb-api :: functionalities/gdb_remote_client/TestNestedRegDefinitions.py (2099 of 2119) PASS: lldb-shell :: Commands/command-thread-select.test (2100 of 2119) PASS: lldb-unit :: Editline/./EditlineTests/EditlineTestFixture.EditlineReceivesMultiLineText (2101 of 2119) PASS: lldb-api :: functionalities/process_group/TestChangeProcessGroup.py (2102 of 2119) UNSUPPORTED: lldb-api :: lang/c/typedef/Testtypedef.py (2103 of 2119) PASS: lldb-api :: functionalities/data-formatter/data-formatter-proper-plurals/TestFormattersOneIsSingular.py (2104 of 2119) PASS: lldb-api :: python_api/sbenvironment/TestSBEnvironment.py (2105 of 2119) UNSUPPORTED: lldb-shell :: SymbolFile/PDB/type-quals.test (2106 of 2119) PASS: lldb-unit :: ScriptInterpreter/Python/./ScriptInterpreterPythonTests/PythonDataObjectsTest.TestPythonTupleInitializerList (2107 of 2119) PASS: lldb-api :: python_api/name_lookup/TestNameLookup.py (2108 of 2119) PASS: lldb-unit :: Utility/./UtilityTests/StreamTest.PutRawBytesToLittleEndian (2109 of 2119) PASS: lldb-unit :: Interpreter/./InterpreterTests/OptionArgParserTest.toBoolean (2110 of 2119) PASS: lldb-api :: functionalities/data-formatter/setvaluefromcstring/TestSetValueFromCString.py (2111 of 2119) PASS: lldb-unit :: Process/minidump/./LLDBMinidumpTests/MinidumpParserTest.GetThreadsAndGetThreadContext (2112 of 2119) PASS: lldb-api :: python_api/thread/TestThreadAPI.py (2113 of 2119) PASS: lldb-api :: lang/objc/objc_direct-methods/TestObjCDirectMethods.py (2114 of 2119) PASS: lldb-api :: commands/expression/import-std-module/vector-dbg-info-content/TestDbgInfoContentVectorFromStdModule.py (2115 of 2119) PASS: lldb-api :: commands/expression/import-std-module/deque-basic/TestDequeFromStdModule.py (2116 of 2119) PASS: lldb-api :: lang/objc/modules-auto-import/TestModulesAutoImport.py (2117 of 2119) PASS: lldb-api :: python_api/objc_type/TestObjCType.py (2118 of 2119) PASS: lldb-api :: functionalities/inferior-assert/TestInferiorAssert.py (2119 of 2119) Slowest Tests: -------------------------------------------------------------------------- 251.79s: lldb-api :: macosx/simulator/TestSimulatorPlatform.py 203.74s: lldb-api :: functionalities/postmortem/mach-core/TestMachCore.py 181.82s: lldb-api :: lang/objc/hidden-ivars/TestHiddenIvars.py 158.40s: lldb-api :: lang/objc/foundation/TestObjCMethods.py 156.75s: lldb-api :: tools/lldb-server/TestLldbGdbServer.py 132.10s: lldb-api :: lang/objc/exceptions/TestObjCExceptions.py 125.71s: lldb-api :: lang/cpp/enum_types/TestCPP11EnumTypes.py 124.50s: lldb-api :: lang/objc/objc-new-syntax/TestObjCNewSyntaxLiteral.py 118.71s: lldb-api :: functionalities/gdb_remote_client/TestThreadSelectionBug.py 116.37s: lldb-api :: functionalities/gdb_remote_client/TestRestartBug.py 114.30s: lldb-api :: lang/objc/real-definition/TestRealDefinition.py 99.96s: lldb-api :: api/multithreaded/TestMultithreaded.py 91.91s: lldb-api :: types/TestShortTypeExpr.py 89.47s: lldb-api :: types/TestLongTypesExpr.py 86.76s: lldb-api :: commands/expression/two-files/TestObjCTypeQueryFromOtherCompileUnit.py 84.35s: lldb-api :: functionalities/data-formatter/poarray/TestPrintObjectArray.py 80.34s: lldb-api :: lang/objc/foundation/TestFoundationDisassembly.py 79.95s: lldb-api :: lang/objc/foundation/TestObjCMethodsString.py 78.50s: lldb-api :: lang/objc/modules/TestObjCModules.py 78.14s: lldb-api :: functionalities/data-formatter/data-formatter-objc/TestDataFormatterObjCNSBundle.py

Hide Details

Tests Times: -------------------------------------------------------------------------- [ Range ] :: [ Percentage ] :: [ Count ] -------------------------------------------------------------------------- [240s,260s) :: [ ] :: [ 1/2119] [220s,240s) :: [ ] :: [ 0/2119] [200s,220s) :: [ ] :: [ 1/2119] [180s,200s) :: [ ] :: [ 1/2119] [160s,180s) :: [ ] :: [ 2/2119] [140s,160s) :: [ ] :: [ 0/2119] [120s,140s) :: [ ] :: [ 5/2119] [100s,120s) :: [ ] :: [ 2/2119] [ 80s,100s) :: [ ] :: [ 8/2119] [ 60s, 80s) :: [ ] :: [ 18/2119] [ 40s, 60s) :: [ ] :: [ 48/2119] [ 20s, 40s) :: [** ] :: [ 126/2119] [ 0s, 20s) :: [*********************************** ] :: [1907/2119] -------------------------------------------------------------------------- ******************** Failed Tests (1): lldb-api :: functionalities/gdb_remote_client/TestThreadSelectionBug.py

Hide Details

Hide Details

Testing Time: 1910.96s Unsupported : 150 Passed : 1962 Expectedly Failed: 6 Failed : 1 FAILED: tools/lldb/test/CMakeFiles/check-lldb-lit cd /Users/buildslave/jenkins/workspace/lldb-cmake/lldb-build/tools/lldb/test && /usr/local/Frameworks/Python.framework/Versions/3.7/bin/python3.7 /Users/buildslave/jenkins/workspace/lldb-cmake/lldb-build/./bin/llvm-lit -v --time-tests --shuffle --xunit-xml-output=/Users/buildslave/jenkins/workspace/lldb-cmake/test/results.xml -v /Users/buildslave/jenkins/workspace/lldb-cmake/lldb-build/tools/lldb/test ninja: build stopped: subcommand failed. Command failed: Command '['/usr/bin/env', 'TERM=vt100', '/usr/local/bin/ninja', '-v', 'check-lldb']' returned non-zero exit status 1 Command: ['/usr/bin/env', 'TERM=vt100', '/usr/local/bin/ninja', '-v', 'check-lldb'] [Pipeline] } [Pipeline] // timeout [Pipeline] } [Pipeline] // stage [Pipeline] stage [Pipeline] { (Declarative: Post Actions) [Pipeline] scanForIssues [Clang (LLVM based)] Sleeping for 5 seconds due to JENKINS-32191... [Clang (LLVM based)] Parsing console log (workspace: '/Users/buildslave/jenkins/workspace/lldb-cmake') [Clang (LLVM based)] Successfully parsed console log [Clang (LLVM based)] -> found 29 issues (skipped 59 duplicates) [Clang (LLVM based)] Post processing issues on 'green-dragon-10' with source code encoding 'UTF-8' [Clang (LLVM based)] Creating SCM blamer to obtain author and commit information for affected files [Clang (LLVM based)] Creating SCM miner to obtain statistics for affected repository files [Clang (LLVM based)] Resolving file names for all issues in source directory '/Users/buildslave/jenkins/workspace/lldb-cmake' [Clang (LLVM based)] -> resolved paths in source directory (16 found, 0 not found) [Clang (LLVM based)] Resolving module names from module definitions (build.xml, pom.xml, or Manifest.mf files) [Clang (LLVM based)] -> resolved module names for 29 issues [Clang (LLVM based)] Resolving package names (or namespaces) by parsing the affected files [Clang (LLVM based)] -> resolved package names of 13 affected files [Clang (LLVM based)] No filter has been set, publishing all 25 issues [Clang (LLVM based)] Creating fingerprints for all affected code blocks to track issues over different builds [Clang (LLVM based)] -> created fingerprints for 25 issues (skipped 0 issues) [Clang (LLVM based)] Copying affected files to Jenkins' build folder '/Users/Shared/Jenkins/Home/jobs/lldb-cmake/builds/23304/files-with-issues' [Clang (LLVM based)] -> 11 copied, 2 not in workspace, 0 not-found, 0 with I/O error [Pipeline] junit Recording test results [Pipeline] } [Pipeline] // stage [Pipeline] } [Pipeline] // withEnv [Pipeline] } [Pipeline] // node [Pipeline] End of Pipeline ERROR: script returned exit code 1 Finished: FAILURE