FailedConsole Output

Skipping 8,770 KB.. Full Log
_CONSTANT_MACROS -D__STDC_FORMAT_MACROS -D__STDC_LIMIT_MACROS -Itools/lldb/source/Interpreter -I/Users/buildslave/jenkins/workspace/lldb-cmake/llvm-project/lldb/source/Interpreter -Itools/lldb/source -I/Users/buildslave/jenkins/workspace/lldb-cmake/llvm-project/lldb/include -Itools/lldb/include -I/Applications/Xcode.app/Contents/Developer/Platforms/MacOSX.platform/Developer/SDKs/MacOSX10.15.sdk/usr/include/libxml2 -Iinclude -I/Users/buildslave/jenkins/workspace/lldb-cmake/llvm-project/llvm/include -I/usr/local/Cellar/python/3.7.1/Frameworks/Python.framework/Versions/3.7/include/python3.7m -I/Users/buildslave/jenkins/workspace/lldb-cmake/llvm-project/llvm/../clang/include -Itools/lldb/../clang/include -I/usr/local/include -I/Users/buildslave/jenkins/workspace/lldb-cmake/llvm-project/lldb/source/. -Wdocumentation -fPIC -fvisibility-inlines-hidden -Werror=date-time -Werror=unguarded-availability-new -fmodules -fmodules-cache-path=/Users/buildslave/jenkins/workspace/lldb-cmake/lldb-build/module.cache -fcxx-modules -Xclang -fmodules-local-submodule-visibility -Wall -Wextra -Wno-unused-parameter -Wwrite-strings -Wcast-qual -Wmissing-field-initializers -pedantic -Wno-long-long -Wimplicit-fallthrough -Wcovered-switch-default -Wno-noexcept-type -Wnon-virtual-dtor -Wdelete-non-virtual-dtor -Wsuggest-override -Wstring-conversion -fdiagnostics-color -Wno-deprecated-declarations -Wno-unknown-pragmas -Wno-strict-aliasing -Wno-deprecated-register -Wno-vla-extension -O3  -isysroot /Applications/Xcode.app/Contents/Developer/Platforms/MacOSX.platform/Developer/SDKs/MacOSX10.15.sdk    -fno-exceptions -fno-rtti -UNDEBUG -std=c++14 -MD -MT tools/lldb/source/Interpreter/CMakeFiles/lldbInterpreter.dir/OptionValueFileSpec.cpp.o -MF tools/lldb/source/Interpreter/CMakeFiles/lldbInterpreter.dir/OptionValueFileSpec.cpp.o.d -o tools/lldb/source/Interpreter/CMakeFiles/lldbInterpreter.dir/OptionValueFileSpec.cpp.o -c /Users/buildslave/jenkins/workspace/lldb-cmake/llvm-project/lldb/source/Interpreter/OptionValueFileSpec.cpp
[5064/5149] /Users/buildslave/jenkins/workspace/lldb-cmake/host-compiler/bin/clang++  -DGTEST_HAS_RTTI=0 -DHAVE_ROUND -DLLDB_CONFIGURATION_RELEASE -DLLDB_USE_OS_LOG -D_DEBUG -D__STDC_CONSTANT_MACROS -D__STDC_FORMAT_MACROS -D__STDC_LIMIT_MACROS -Itools/lldb/source/Interpreter -I/Users/buildslave/jenkins/workspace/lldb-cmake/llvm-project/lldb/source/Interpreter -Itools/lldb/source -I/Users/buildslave/jenkins/workspace/lldb-cmake/llvm-project/lldb/include -Itools/lldb/include -I/Applications/Xcode.app/Contents/Developer/Platforms/MacOSX.platform/Developer/SDKs/MacOSX10.15.sdk/usr/include/libxml2 -Iinclude -I/Users/buildslave/jenkins/workspace/lldb-cmake/llvm-project/llvm/include -I/usr/local/Cellar/python/3.7.1/Frameworks/Python.framework/Versions/3.7/include/python3.7m -I/Users/buildslave/jenkins/workspace/lldb-cmake/llvm-project/llvm/../clang/include -Itools/lldb/../clang/include -I/usr/local/include -I/Users/buildslave/jenkins/workspace/lldb-cmake/llvm-project/lldb/source/. -Wdocumentation -fPIC -fvisibility-inlines-hidden -Werror=date-time -Werror=unguarded-availability-new -fmodules -fmodules-cache-path=/Users/buildslave/jenkins/workspace/lldb-cmake/lldb-build/module.cache -fcxx-modules -Xclang -fmodules-local-submodule-visibility -Wall -Wextra -Wno-unused-parameter -Wwrite-strings -Wcast-qual -Wmissing-field-initializers -pedantic -Wno-long-long -Wimplicit-fallthrough -Wcovered-switch-default -Wno-noexcept-type -Wnon-virtual-dtor -Wdelete-non-virtual-dtor -Wsuggest-override -Wstring-conversion -fdiagnostics-color -Wno-deprecated-declarations -Wno-unknown-pragmas -Wno-strict-aliasing -Wno-deprecated-register -Wno-vla-extension -O3  -isysroot /Applications/Xcode.app/Contents/Developer/Platforms/MacOSX.platform/Developer/SDKs/MacOSX10.15.sdk    -fno-exceptions -fno-rtti -UNDEBUG -std=c++14 -MD -MT tools/lldb/source/Interpreter/CMakeFiles/lldbInterpreter.dir/OptionValueFormat.cpp.o -MF tools/lldb/source/Interpreter/CMakeFiles/lldbInterpreter.dir/OptionValueFormat.cpp.o.d -o tools/lldb/source/Interpreter/CMakeFiles/lldbInterpreter.dir/OptionValueFormat.cpp.o -c /Users/buildslave/jenkins/workspace/lldb-cmake/llvm-project/lldb/source/Interpreter/OptionValueFormat.cpp
[5065/5149] /Users/buildslave/jenkins/workspace/lldb-cmake/host-compiler/bin/clang++  -DGTEST_HAS_RTTI=0 -DHAVE_ROUND -DLLDB_CONFIGURATION_RELEASE -DLLDB_USE_OS_LOG -D_DEBUG -D__STDC_CONSTANT_MACROS -D__STDC_FORMAT_MACROS -D__STDC_LIMIT_MACROS -Itools/lldb/source/Interpreter -I/Users/buildslave/jenkins/workspace/lldb-cmake/llvm-project/lldb/source/Interpreter -Itools/lldb/source -I/Users/buildslave/jenkins/workspace/lldb-cmake/llvm-project/lldb/include -Itools/lldb/include -I/Applications/Xcode.app/Contents/Developer/Platforms/MacOSX.platform/Developer/SDKs/MacOSX10.15.sdk/usr/include/libxml2 -Iinclude -I/Users/buildslave/jenkins/workspace/lldb-cmake/llvm-project/llvm/include -I/usr/local/Cellar/python/3.7.1/Frameworks/Python.framework/Versions/3.7/include/python3.7m -I/Users/buildslave/jenkins/workspace/lldb-cmake/llvm-project/llvm/../clang/include -Itools/lldb/../clang/include -I/usr/local/include -I/Users/buildslave/jenkins/workspace/lldb-cmake/llvm-project/lldb/source/. -Wdocumentation -fPIC -fvisibility-inlines-hidden -Werror=date-time -Werror=unguarded-availability-new -fmodules -fmodules-cache-path=/Users/buildslave/jenkins/workspace/lldb-cmake/lldb-build/module.cache -fcxx-modules -Xclang -fmodules-local-submodule-visibility -Wall -Wextra -Wno-unused-parameter -Wwrite-strings -Wcast-qual -Wmissing-field-initializers -pedantic -Wno-long-long -Wimplicit-fallthrough -Wcovered-switch-default -Wno-noexcept-type -Wnon-virtual-dtor -Wdelete-non-virtual-dtor -Wsuggest-override -Wstring-conversion -fdiagnostics-color -Wno-deprecated-declarations -Wno-unknown-pragmas -Wno-strict-aliasing -Wno-deprecated-register -Wno-vla-extension -O3  -isysroot /Applications/Xcode.app/Contents/Developer/Platforms/MacOSX.platform/Developer/SDKs/MacOSX10.15.sdk    -fno-exceptions -fno-rtti -UNDEBUG -std=c++14 -MD -MT tools/lldb/source/Interpreter/CMakeFiles/lldbInterpreter.dir/OptionValueFileSpecList.cpp.o -MF tools/lldb/source/Interpreter/CMakeFiles/lldbInterpreter.dir/OptionValueFileSpecList.cpp.o.d -o tools/lldb/source/Interpreter/CMakeFiles/lldbInterpreter.dir/OptionValueFileSpecList.cpp.o -c /Users/buildslave/jenkins/workspace/lldb-cmake/llvm-project/lldb/source/Interpreter/OptionValueFileSpecList.cpp
[5066/5149] /Users/buildslave/jenkins/workspace/lldb-cmake/host-compiler/bin/clang++  -DGTEST_HAS_RTTI=0 -DHAVE_ROUND -DLLDB_CONFIGURATION_RELEASE -DLLDB_USE_OS_LOG -D_DEBUG -D__STDC_CONSTANT_MACROS -D__STDC_FORMAT_MACROS -D__STDC_LIMIT_MACROS -Itools/lldb/source/Interpreter -I/Users/buildslave/jenkins/workspace/lldb-cmake/llvm-project/lldb/source/Interpreter -Itools/lldb/source -I/Users/buildslave/jenkins/workspace/lldb-cmake/llvm-project/lldb/include -Itools/lldb/include -I/Applications/Xcode.app/Contents/Developer/Platforms/MacOSX.platform/Developer/SDKs/MacOSX10.15.sdk/usr/include/libxml2 -Iinclude -I/Users/buildslave/jenkins/workspace/lldb-cmake/llvm-project/llvm/include -I/usr/local/Cellar/python/3.7.1/Frameworks/Python.framework/Versions/3.7/include/python3.7m -I/Users/buildslave/jenkins/workspace/lldb-cmake/llvm-project/llvm/../clang/include -Itools/lldb/../clang/include -I/usr/local/include -I/Users/buildslave/jenkins/workspace/lldb-cmake/llvm-project/lldb/source/. -Wdocumentation -fPIC -fvisibility-inlines-hidden -Werror=date-time -Werror=unguarded-availability-new -fmodules -fmodules-cache-path=/Users/buildslave/jenkins/workspace/lldb-cmake/lldb-build/module.cache -fcxx-modules -Xclang -fmodules-local-submodule-visibility -Wall -Wextra -Wno-unused-parameter -Wwrite-strings -Wcast-qual -Wmissing-field-initializers -pedantic -Wno-long-long -Wimplicit-fallthrough -Wcovered-switch-default -Wno-noexcept-type -Wnon-virtual-dtor -Wdelete-non-virtual-dtor -Wsuggest-override -Wstring-conversion -fdiagnostics-color -Wno-deprecated-declarations -Wno-unknown-pragmas -Wno-strict-aliasing -Wno-deprecated-register -Wno-vla-extension -O3  -isysroot /Applications/Xcode.app/Contents/Developer/Platforms/MacOSX.platform/Developer/SDKs/MacOSX10.15.sdk    -fno-exceptions -fno-rtti -UNDEBUG -std=c++14 -MD -MT tools/lldb/source/Interpreter/CMakeFiles/lldbInterpreter.dir/OptionValueFormatEntity.cpp.o -MF tools/lldb/source/Interpreter/CMakeFiles/lldbInterpreter.dir/OptionValueFormatEntity.cpp.o.d -o tools/lldb/source/Interpreter/CMakeFiles/lldbInterpreter.dir/OptionValueFormatEntity.cpp.o -c /Users/buildslave/jenkins/workspace/lldb-cmake/llvm-project/lldb/source/Interpreter/OptionValueFormatEntity.cpp
[5067/5149] /Users/buildslave/jenkins/workspace/lldb-cmake/host-compiler/bin/clang++  -DGTEST_HAS_RTTI=0 -DHAVE_ROUND -DLLDB_CONFIGURATION_RELEASE -DLLDB_USE_OS_LOG -D_DEBUG -D__STDC_CONSTANT_MACROS -D__STDC_FORMAT_MACROS -D__STDC_LIMIT_MACROS -Itools/lldb/source/Interpreter -I/Users/buildslave/jenkins/workspace/lldb-cmake/llvm-project/lldb/source/Interpreter -Itools/lldb/source -I/Users/buildslave/jenkins/workspace/lldb-cmake/llvm-project/lldb/include -Itools/lldb/include -I/Applications/Xcode.app/Contents/Developer/Platforms/MacOSX.platform/Developer/SDKs/MacOSX10.15.sdk/usr/include/libxml2 -Iinclude -I/Users/buildslave/jenkins/workspace/lldb-cmake/llvm-project/llvm/include -I/usr/local/Cellar/python/3.7.1/Frameworks/Python.framework/Versions/3.7/include/python3.7m -I/Users/buildslave/jenkins/workspace/lldb-cmake/llvm-project/llvm/../clang/include -Itools/lldb/../clang/include -I/usr/local/include -I/Users/buildslave/jenkins/workspace/lldb-cmake/llvm-project/lldb/source/. -Wdocumentation -fPIC -fvisibility-inlines-hidden -Werror=date-time -Werror=unguarded-availability-new -fmodules -fmodules-cache-path=/Users/buildslave/jenkins/workspace/lldb-cmake/lldb-build/module.cache -fcxx-modules -Xclang -fmodules-local-submodule-visibility -Wall -Wextra -Wno-unused-parameter -Wwrite-strings -Wcast-qual -Wmissing-field-initializers -pedantic -Wno-long-long -Wimplicit-fallthrough -Wcovered-switch-default -Wno-noexcept-type -Wnon-virtual-dtor -Wdelete-non-virtual-dtor -Wsuggest-override -Wstring-conversion -fdiagnostics-color -Wno-deprecated-declarations -Wno-unknown-pragmas -Wno-strict-aliasing -Wno-deprecated-register -Wno-vla-extension -O3  -isysroot /Applications/Xcode.app/Contents/Developer/Platforms/MacOSX.platform/Developer/SDKs/MacOSX10.15.sdk    -fno-exceptions -fno-rtti -UNDEBUG -std=c++14 -MD -MT tools/lldb/source/Interpreter/CMakeFiles/lldbInterpreter.dir/OptionValueLanguage.cpp.o -MF tools/lldb/source/Interpreter/CMakeFiles/lldbInterpreter.dir/OptionValueLanguage.cpp.o.d -o tools/lldb/source/Interpreter/CMakeFiles/lldbInterpreter.dir/OptionValueLanguage.cpp.o -c /Users/buildslave/jenkins/workspace/lldb-cmake/llvm-project/lldb/source/Interpreter/OptionValueLanguage.cpp
[5068/5149] /Users/buildslave/jenkins/workspace/lldb-cmake/host-compiler/bin/clang++  -DGTEST_HAS_RTTI=0 -DHAVE_ROUND -DLLDB_CONFIGURATION_RELEASE -DLLDB_USE_OS_LOG -D_DEBUG -D__STDC_CONSTANT_MACROS -D__STDC_FORMAT_MACROS -D__STDC_LIMIT_MACROS -Itools/lldb/source/Interpreter -I/Users/buildslave/jenkins/workspace/lldb-cmake/llvm-project/lldb/source/Interpreter -Itools/lldb/source -I/Users/buildslave/jenkins/workspace/lldb-cmake/llvm-project/lldb/include -Itools/lldb/include -I/Applications/Xcode.app/Contents/Developer/Platforms/MacOSX.platform/Developer/SDKs/MacOSX10.15.sdk/usr/include/libxml2 -Iinclude -I/Users/buildslave/jenkins/workspace/lldb-cmake/llvm-project/llvm/include -I/usr/local/Cellar/python/3.7.1/Frameworks/Python.framework/Versions/3.7/include/python3.7m -I/Users/buildslave/jenkins/workspace/lldb-cmake/llvm-project/llvm/../clang/include -Itools/lldb/../clang/include -I/usr/local/include -I/Users/buildslave/jenkins/workspace/lldb-cmake/llvm-project/lldb/source/. -Wdocumentation -fPIC -fvisibility-inlines-hidden -Werror=date-time -Werror=unguarded-availability-new -fmodules -fmodules-cache-path=/Users/buildslave/jenkins/workspace/lldb-cmake/lldb-build/module.cache -fcxx-modules -Xclang -fmodules-local-submodule-visibility -Wall -Wextra -Wno-unused-parameter -Wwrite-strings -Wcast-qual -Wmissing-field-initializers -pedantic -Wno-long-long -Wimplicit-fallthrough -Wcovered-switch-default -Wno-noexcept-type -Wnon-virtual-dtor -Wdelete-non-virtual-dtor -Wsuggest-override -Wstring-conversion -fdiagnostics-color -Wno-deprecated-declarations -Wno-unknown-pragmas -Wno-strict-aliasing -Wno-deprecated-register -Wno-vla-extension -O3  -isysroot /Applications/Xcode.app/Contents/Developer/Platforms/MacOSX.platform/Developer/SDKs/MacOSX10.15.sdk    -fno-exceptions -fno-rtti -UNDEBUG -std=c++14 -MD -MT tools/lldb/source/Interpreter/CMakeFiles/lldbInterpreter.dir/CommandInterpreter.cpp.o -MF tools/lldb/source/Interpreter/CMakeFiles/lldbInterpreter.dir/CommandInterpreter.cpp.o.d -o tools/lldb/source/Interpreter/CMakeFiles/lldbInterpreter.dir/CommandInterpreter.cpp.o -c /Users/buildslave/jenkins/workspace/lldb-cmake/llvm-project/lldb/source/Interpreter/CommandInterpreter.cpp
[5069/5149] : && "/Applications/Xcode.app/Contents/Developer/Toolchains/XcodeDefault.xctoolchain/usr/bin/libtool" -static -no_warning_for_no_symbols -o lib/liblldbInterpreter.a  tools/lldb/source/Interpreter/CMakeFiles/lldbInterpreter.dir/CommandAlias.cpp.o tools/lldb/source/Interpreter/CMakeFiles/lldbInterpreter.dir/CommandHistory.cpp.o tools/lldb/source/Interpreter/CMakeFiles/lldbInterpreter.dir/CommandInterpreter.cpp.o tools/lldb/source/Interpreter/CMakeFiles/lldbInterpreter.dir/CommandObject.cpp.o tools/lldb/source/Interpreter/CMakeFiles/lldbInterpreter.dir/CommandObjectRegexCommand.cpp.o tools/lldb/source/Interpreter/CMakeFiles/lldbInterpreter.dir/CommandObjectScript.cpp.o tools/lldb/source/Interpreter/CMakeFiles/lldbInterpreter.dir/CommandOptionValidators.cpp.o tools/lldb/source/Interpreter/CMakeFiles/lldbInterpreter.dir/CommandReturnObject.cpp.o tools/lldb/source/Interpreter/CMakeFiles/lldbInterpreter.dir/OptionArgParser.cpp.o tools/lldb/source/Interpreter/CMakeFiles/lldbInterpreter.dir/OptionGroupArchitecture.cpp.o tools/lldb/source/Interpreter/CMakeFiles/lldbInterpreter.dir/OptionGroupBoolean.cpp.o tools/lldb/source/Interpreter/CMakeFiles/lldbInterpreter.dir/OptionGroupFile.cpp.o tools/lldb/source/Interpreter/CMakeFiles/lldbInterpreter.dir/OptionGroupFormat.cpp.o tools/lldb/source/Interpreter/CMakeFiles/lldbInterpreter.dir/OptionGroupPythonClassWithDict.cpp.o tools/lldb/source/Interpreter/CMakeFiles/lldbInterpreter.dir/OptionGroupOutputFile.cpp.o tools/lldb/source/Interpreter/CMakeFiles/lldbInterpreter.dir/OptionGroupPlatform.cpp.o tools/lldb/source/Interpreter/CMakeFiles/lldbInterpreter.dir/OptionGroupString.cpp.o tools/lldb/source/Interpreter/CMakeFiles/lldbInterpreter.dir/OptionGroupUInt64.cpp.o tools/lldb/source/Interpreter/CMakeFiles/lldbInterpreter.dir/OptionGroupUUID.cpp.o tools/lldb/source/Interpreter/CMakeFiles/lldbInterpreter.dir/OptionGroupValueObjectDisplay.cpp.o tools/lldb/source/Interpreter/CMakeFiles/lldbInterpreter.dir/OptionValue.cpp.o tools/lldb/source/Interpreter/CMakeFiles/lldbInterpreter.dir/OptionValueArch.cpp.o tools/lldb/source/Interpreter/CMakeFiles/lldbInterpreter.dir/OptionValueArgs.cpp.o tools/lldb/source/Interpreter/CMakeFiles/lldbInterpreter.dir/OptionValueArray.cpp.o tools/lldb/source/Interpreter/CMakeFiles/lldbInterpreter.dir/OptionValueBoolean.cpp.o tools/lldb/source/Interpreter/CMakeFiles/lldbInterpreter.dir/OptionValueChar.cpp.o tools/lldb/source/Interpreter/CMakeFiles/lldbInterpreter.dir/OptionValueDictionary.cpp.o tools/lldb/source/Interpreter/CMakeFiles/lldbInterpreter.dir/OptionValueEnumeration.cpp.o tools/lldb/source/Interpreter/CMakeFiles/lldbInterpreter.dir/OptionValueFileColonLine.cpp.o tools/lldb/source/Interpreter/CMakeFiles/lldbInterpreter.dir/OptionValueFileSpec.cpp.o tools/lldb/source/Interpreter/CMakeFiles/lldbInterpreter.dir/OptionValueFileSpecList.cpp.o tools/lldb/source/Interpreter/CMakeFiles/lldbInterpreter.dir/OptionValueFormat.cpp.o tools/lldb/source/Interpreter/CMakeFiles/lldbInterpreter.dir/OptionValueFormatEntity.cpp.o tools/lldb/source/Interpreter/CMakeFiles/lldbInterpreter.dir/OptionValueLanguage.cpp.o tools/lldb/source/Interpreter/CMakeFiles/lldbInterpreter.dir/OptionValuePathMappings.cpp.o tools/lldb/source/Interpreter/CMakeFiles/lldbInterpreter.dir/OptionValueProperties.cpp.o tools/lldb/source/Interpreter/CMakeFiles/lldbInterpreter.dir/OptionValueRegex.cpp.o tools/lldb/source/Interpreter/CMakeFiles/lldbInterpreter.dir/OptionValueSInt64.cpp.o tools/lldb/source/Interpreter/CMakeFiles/lldbInterpreter.dir/OptionValueString.cpp.o tools/lldb/source/Interpreter/CMakeFiles/lldbInterpreter.dir/OptionValueUInt64.cpp.o tools/lldb/source/Interpreter/CMakeFiles/lldbInterpreter.dir/OptionValueUUID.cpp.o tools/lldb/source/Interpreter/CMakeFiles/lldbInterpreter.dir/OptionGroupVariable.cpp.o tools/lldb/source/Interpreter/CMakeFiles/lldbInterpreter.dir/OptionGroupWatchpoint.cpp.o tools/lldb/source/Interpreter/CMakeFiles/lldbInterpreter.dir/Options.cpp.o tools/lldb/source/Interpreter/CMakeFiles/lldbInterpreter.dir/Property.cpp.o tools/lldb/source/Interpreter/CMakeFiles/lldbInterpreter.dir/ScriptInterpreter.cpp.o && :
[5070/5149] : && "/Applications/Xcode.app/Contents/Developer/Toolchains/XcodeDefault.xctoolchain/usr/bin/libtool" -static -no_warning_for_no_symbols -o lib/liblldbExpression.a  tools/lldb/source/Expression/CMakeFiles/lldbExpression.dir/DiagnosticManager.cpp.o tools/lldb/source/Expression/CMakeFiles/lldbExpression.dir/DWARFExpression.cpp.o tools/lldb/source/Expression/CMakeFiles/lldbExpression.dir/Expression.cpp.o tools/lldb/source/Expression/CMakeFiles/lldbExpression.dir/ExpressionVariable.cpp.o tools/lldb/source/Expression/CMakeFiles/lldbExpression.dir/FunctionCaller.cpp.o tools/lldb/source/Expression/CMakeFiles/lldbExpression.dir/IRExecutionUnit.cpp.o tools/lldb/source/Expression/CMakeFiles/lldbExpression.dir/IRInterpreter.cpp.o tools/lldb/source/Expression/CMakeFiles/lldbExpression.dir/IRMemoryMap.cpp.o tools/lldb/source/Expression/CMakeFiles/lldbExpression.dir/LLVMUserExpression.cpp.o tools/lldb/source/Expression/CMakeFiles/lldbExpression.dir/Materializer.cpp.o tools/lldb/source/Expression/CMakeFiles/lldbExpression.dir/REPL.cpp.o tools/lldb/source/Expression/CMakeFiles/lldbExpression.dir/UserExpression.cpp.o tools/lldb/source/Expression/CMakeFiles/lldbExpression.dir/UtilityFunction.cpp.o && :
[5071/5149] : && "/Applications/Xcode.app/Contents/Developer/Toolchains/XcodeDefault.xctoolchain/usr/bin/libtool" -static -no_warning_for_no_symbols -o lib/liblldbDataFormatters.a  tools/lldb/source/DataFormatters/CMakeFiles/lldbDataFormatters.dir/CXXFunctionPointer.cpp.o tools/lldb/source/DataFormatters/CMakeFiles/lldbDataFormatters.dir/DataVisualization.cpp.o tools/lldb/source/DataFormatters/CMakeFiles/lldbDataFormatters.dir/DumpValueObjectOptions.cpp.o tools/lldb/source/DataFormatters/CMakeFiles/lldbDataFormatters.dir/FormatCache.cpp.o tools/lldb/source/DataFormatters/CMakeFiles/lldbDataFormatters.dir/FormatClasses.cpp.o tools/lldb/source/DataFormatters/CMakeFiles/lldbDataFormatters.dir/FormatManager.cpp.o tools/lldb/source/DataFormatters/CMakeFiles/lldbDataFormatters.dir/FormattersHelpers.cpp.o tools/lldb/source/DataFormatters/CMakeFiles/lldbDataFormatters.dir/LanguageCategory.cpp.o tools/lldb/source/DataFormatters/CMakeFiles/lldbDataFormatters.dir/StringPrinter.cpp.o tools/lldb/source/DataFormatters/CMakeFiles/lldbDataFormatters.dir/TypeCategory.cpp.o tools/lldb/source/DataFormatters/CMakeFiles/lldbDataFormatters.dir/TypeCategoryMap.cpp.o tools/lldb/source/DataFormatters/CMakeFiles/lldbDataFormatters.dir/TypeFormat.cpp.o tools/lldb/source/DataFormatters/CMakeFiles/lldbDataFormatters.dir/TypeSummary.cpp.o tools/lldb/source/DataFormatters/CMakeFiles/lldbDataFormatters.dir/TypeSynthetic.cpp.o tools/lldb/source/DataFormatters/CMakeFiles/lldbDataFormatters.dir/ValueObjectPrinter.cpp.o tools/lldb/source/DataFormatters/CMakeFiles/lldbDataFormatters.dir/VectorType.cpp.o && :
[5072/5149] : && "/Applications/Xcode.app/Contents/Developer/Toolchains/XcodeDefault.xctoolchain/usr/bin/libtool" -static -no_warning_for_no_symbols -o lib/liblldbCore.a  tools/lldb/source/Core/CMakeFiles/lldbCore.dir/Address.cpp.o tools/lldb/source/Core/CMakeFiles/lldbCore.dir/AddressRange.cpp.o tools/lldb/source/Core/CMakeFiles/lldbCore.dir/AddressResolver.cpp.o tools/lldb/source/Core/CMakeFiles/lldbCore.dir/AddressResolverFileLine.cpp.o tools/lldb/source/Core/CMakeFiles/lldbCore.dir/AddressResolverName.cpp.o tools/lldb/source/Core/CMakeFiles/lldbCore.dir/Communication.cpp.o tools/lldb/source/Core/CMakeFiles/lldbCore.dir/Debugger.cpp.o tools/lldb/source/Core/CMakeFiles/lldbCore.dir/Disassembler.cpp.o tools/lldb/source/Core/CMakeFiles/lldbCore.dir/DumpDataExtractor.cpp.o tools/lldb/source/Core/CMakeFiles/lldbCore.dir/DumpRegisterValue.cpp.o tools/lldb/source/Core/CMakeFiles/lldbCore.dir/DynamicLoader.cpp.o tools/lldb/source/Core/CMakeFiles/lldbCore.dir/EmulateInstruction.cpp.o tools/lldb/source/Core/CMakeFiles/lldbCore.dir/FileLineResolver.cpp.o tools/lldb/source/Core/CMakeFiles/lldbCore.dir/FileSpecList.cpp.o tools/lldb/source/Core/CMakeFiles/lldbCore.dir/FormatEntity.cpp.o tools/lldb/source/Core/CMakeFiles/lldbCore.dir/Highlighter.cpp.o tools/lldb/source/Core/CMakeFiles/lldbCore.dir/IOHandler.cpp.o tools/lldb/source/Core/CMakeFiles/lldbCore.dir/IOHandlerCursesGUI.cpp.o tools/lldb/source/Core/CMakeFiles/lldbCore.dir/Mangled.cpp.o tools/lldb/source/Core/CMakeFiles/lldbCore.dir/Module.cpp.o tools/lldb/source/Core/CMakeFiles/lldbCore.dir/ModuleChild.cpp.o tools/lldb/source/Core/CMakeFiles/lldbCore.dir/ModuleList.cpp.o tools/lldb/source/Core/CMakeFiles/lldbCore.dir/Opcode.cpp.o tools/lldb/source/Core/CMakeFiles/lldbCore.dir/PluginManager.cpp.o tools/lldb/source/Core/CMakeFiles/lldbCore.dir/RichManglingContext.cpp.o tools/lldb/source/Core/CMakeFiles/lldbCore.dir/SearchFilter.cpp.o tools/lldb/source/Core/CMakeFiles/lldbCore.dir/Section.cpp.o tools/lldb/source/Core/CMakeFiles/lldbCore.dir/SourceManager.cpp.o tools/lldb/source/Core/CMakeFiles/lldbCore.dir/StreamAsynchronousIO.cpp.o tools/lldb/source/Core/CMakeFiles/lldbCore.dir/StreamFile.cpp.o tools/lldb/source/Core/CMakeFiles/lldbCore.dir/UserSettingsController.cpp.o tools/lldb/source/Core/CMakeFiles/lldbCore.dir/Value.cpp.o tools/lldb/source/Core/CMakeFiles/lldbCore.dir/ValueObject.cpp.o tools/lldb/source/Core/CMakeFiles/lldbCore.dir/ValueObjectCast.cpp.o tools/lldb/source/Core/CMakeFiles/lldbCore.dir/ValueObjectChild.cpp.o tools/lldb/source/Core/CMakeFiles/lldbCore.dir/ValueObjectConstResult.cpp.o tools/lldb/source/Core/CMakeFiles/lldbCore.dir/ValueObjectConstResultCast.cpp.o tools/lldb/source/Core/CMakeFiles/lldbCore.dir/ValueObjectConstResultChild.cpp.o tools/lldb/source/Core/CMakeFiles/lldbCore.dir/ValueObjectConstResultImpl.cpp.o tools/lldb/source/Core/CMakeFiles/lldbCore.dir/ValueObjectDynamicValue.cpp.o tools/lldb/source/Core/CMakeFiles/lldbCore.dir/ValueObjectList.cpp.o tools/lldb/source/Core/CMakeFiles/lldbCore.dir/ValueObjectMemory.cpp.o tools/lldb/source/Core/CMakeFiles/lldbCore.dir/ValueObjectRegister.cpp.o tools/lldb/source/Core/CMakeFiles/lldbCore.dir/ValueObjectSyntheticFilter.cpp.o tools/lldb/source/Core/CMakeFiles/lldbCore.dir/ValueObjectVariable.cpp.o && :
[5073/5149] : && "/Applications/Xcode.app/Contents/Developer/Toolchains/XcodeDefault.xctoolchain/usr/bin/libtool" -static -no_warning_for_no_symbols -o lib/liblldbCommands.a  tools/lldb/source/Commands/CMakeFiles/lldbCommands.dir/CommandCompletions.cpp.o tools/lldb/source/Commands/CMakeFiles/lldbCommands.dir/CommandObjectApropos.cpp.o tools/lldb/source/Commands/CMakeFiles/lldbCommands.dir/CommandObjectBreakpoint.cpp.o tools/lldb/source/Commands/CMakeFiles/lldbCommands.dir/CommandObjectBreakpointCommand.cpp.o tools/lldb/source/Commands/CMakeFiles/lldbCommands.dir/CommandObjectCommands.cpp.o tools/lldb/source/Commands/CMakeFiles/lldbCommands.dir/CommandObjectDisassemble.cpp.o tools/lldb/source/Commands/CMakeFiles/lldbCommands.dir/CommandObjectExpression.cpp.o tools/lldb/source/Commands/CMakeFiles/lldbCommands.dir/CommandObjectFrame.cpp.o tools/lldb/source/Commands/CMakeFiles/lldbCommands.dir/CommandObjectGUI.cpp.o tools/lldb/source/Commands/CMakeFiles/lldbCommands.dir/CommandObjectHelp.cpp.o tools/lldb/source/Commands/CMakeFiles/lldbCommands.dir/CommandObjectLanguage.cpp.o tools/lldb/source/Commands/CMakeFiles/lldbCommands.dir/CommandObjectLog.cpp.o tools/lldb/source/Commands/CMakeFiles/lldbCommands.dir/CommandObjectMemory.cpp.o tools/lldb/source/Commands/CMakeFiles/lldbCommands.dir/CommandObjectMultiword.cpp.o tools/lldb/source/Commands/CMakeFiles/lldbCommands.dir/CommandObjectPlatform.cpp.o tools/lldb/source/Commands/CMakeFiles/lldbCommands.dir/CommandObjectPlugin.cpp.o tools/lldb/source/Commands/CMakeFiles/lldbCommands.dir/CommandObjectProcess.cpp.o tools/lldb/source/Commands/CMakeFiles/lldbCommands.dir/CommandObjectQuit.cpp.o tools/lldb/source/Commands/CMakeFiles/lldbCommands.dir/CommandObjectRegister.cpp.o tools/lldb/source/Commands/CMakeFiles/lldbCommands.dir/CommandObjectReproducer.cpp.o tools/lldb/source/Commands/CMakeFiles/lldbCommands.dir/CommandObjectSession.cpp.o tools/lldb/source/Commands/CMakeFiles/lldbCommands.dir/CommandObjectSettings.cpp.o tools/lldb/source/Commands/CMakeFiles/lldbCommands.dir/CommandObjectSource.cpp.o tools/lldb/source/Commands/CMakeFiles/lldbCommands.dir/CommandObjectStats.cpp.o tools/lldb/source/Commands/CMakeFiles/lldbCommands.dir/CommandObjectTarget.cpp.o tools/lldb/source/Commands/CMakeFiles/lldbCommands.dir/CommandObjectThread.cpp.o tools/lldb/source/Commands/CMakeFiles/lldbCommands.dir/CommandObjectType.cpp.o tools/lldb/source/Commands/CMakeFiles/lldbCommands.dir/CommandObjectVersion.cpp.o tools/lldb/source/Commands/CMakeFiles/lldbCommands.dir/CommandObjectWatchpoint.cpp.o tools/lldb/source/Commands/CMakeFiles/lldbCommands.dir/CommandObjectWatchpointCommand.cpp.o && :
[5074/5149] : && "/Applications/Xcode.app/Contents/Developer/Toolchains/XcodeDefault.xctoolchain/usr/bin/libtool" -static -no_warning_for_no_symbols -o lib/liblldbBreakpoint.a  tools/lldb/source/Breakpoint/CMakeFiles/lldbBreakpoint.dir/Breakpoint.cpp.o tools/lldb/source/Breakpoint/CMakeFiles/lldbBreakpoint.dir/BreakpointID.cpp.o tools/lldb/source/Breakpoint/CMakeFiles/lldbBreakpoint.dir/BreakpointIDList.cpp.o tools/lldb/source/Breakpoint/CMakeFiles/lldbBreakpoint.dir/BreakpointList.cpp.o tools/lldb/source/Breakpoint/CMakeFiles/lldbBreakpoint.dir/BreakpointLocation.cpp.o tools/lldb/source/Breakpoint/CMakeFiles/lldbBreakpoint.dir/BreakpointLocationCollection.cpp.o tools/lldb/source/Breakpoint/CMakeFiles/lldbBreakpoint.dir/BreakpointLocationList.cpp.o tools/lldb/source/Breakpoint/CMakeFiles/lldbBreakpoint.dir/BreakpointName.cpp.o tools/lldb/source/Breakpoint/CMakeFiles/lldbBreakpoint.dir/BreakpointOptions.cpp.o tools/lldb/source/Breakpoint/CMakeFiles/lldbBreakpoint.dir/BreakpointPrecondition.cpp.o tools/lldb/source/Breakpoint/CMakeFiles/lldbBreakpoint.dir/BreakpointResolver.cpp.o tools/lldb/source/Breakpoint/CMakeFiles/lldbBreakpoint.dir/BreakpointResolverAddress.cpp.o tools/lldb/source/Breakpoint/CMakeFiles/lldbBreakpoint.dir/BreakpointResolverFileLine.cpp.o tools/lldb/source/Breakpoint/CMakeFiles/lldbBreakpoint.dir/BreakpointResolverFileRegex.cpp.o tools/lldb/source/Breakpoint/CMakeFiles/lldbBreakpoint.dir/BreakpointResolverName.cpp.o tools/lldb/source/Breakpoint/CMakeFiles/lldbBreakpoint.dir/BreakpointResolverScripted.cpp.o tools/lldb/source/Breakpoint/CMakeFiles/lldbBreakpoint.dir/BreakpointSite.cpp.o tools/lldb/source/Breakpoint/CMakeFiles/lldbBreakpoint.dir/BreakpointSiteList.cpp.o tools/lldb/source/Breakpoint/CMakeFiles/lldbBreakpoint.dir/Stoppoint.cpp.o tools/lldb/source/Breakpoint/CMakeFiles/lldbBreakpoint.dir/StoppointCallbackContext.cpp.o tools/lldb/source/Breakpoint/CMakeFiles/lldbBreakpoint.dir/StoppointSite.cpp.o tools/lldb/source/Breakpoint/CMakeFiles/lldbBreakpoint.dir/Watchpoint.cpp.o tools/lldb/source/Breakpoint/CMakeFiles/lldbBreakpoint.dir/WatchpointList.cpp.o tools/lldb/source/Breakpoint/CMakeFiles/lldbBreakpoint.dir/WatchpointOptions.cpp.o && :
[5075/5149] : && "/Applications/Xcode.app/Contents/Developer/Toolchains/XcodeDefault.xctoolchain/usr/bin/libtool" -static -no_warning_for_no_symbols -o lib/liblldbPluginABIHexagon.a  tools/lldb/source/Plugins/ABI/Hexagon/CMakeFiles/lldbPluginABIHexagon.dir/ABISysV_hexagon.cpp.o && :
[5076/5149] : && "/Applications/Xcode.app/Contents/Developer/Toolchains/XcodeDefault.xctoolchain/usr/bin/libtool" -static -no_warning_for_no_symbols -o lib/liblldbPluginUnwindAssemblyInstEmulation.a  tools/lldb/source/Plugins/UnwindAssembly/InstEmulation/CMakeFiles/lldbPluginUnwindAssemblyInstEmulation.dir/UnwindAssemblyInstEmulation.cpp.o && :
[5077/5149] : && "/Applications/Xcode.app/Contents/Developer/Toolchains/XcodeDefault.xctoolchain/usr/bin/libtool" -static -no_warning_for_no_symbols -o lib/liblldbPluginUnwindAssemblyX86.a  tools/lldb/source/Plugins/UnwindAssembly/x86/CMakeFiles/lldbPluginUnwindAssemblyX86.dir/UnwindAssembly-x86.cpp.o tools/lldb/source/Plugins/UnwindAssembly/x86/CMakeFiles/lldbPluginUnwindAssemblyX86.dir/x86AssemblyInspectionEngine.cpp.o && :
[5078/5149] : && "/Applications/Xcode.app/Contents/Developer/Toolchains/XcodeDefault.xctoolchain/usr/bin/libtool" -static -no_warning_for_no_symbols -o lib/liblldbPluginArchitectureArm.a  tools/lldb/source/Plugins/Architecture/Arm/CMakeFiles/lldbPluginArchitectureArm.dir/ArchitectureArm.cpp.o && :
[5079/5149] /Users/buildslave/jenkins/workspace/lldb-cmake/host-compiler/bin/clang++  -DGTEST_HAS_RTTI=0 -DHAVE_ROUND -DLLDB_CONFIGURATION_RELEASE -DLLDB_PYTHON_RELATIVE_LIBDIR=\"lib/python3.7/site-packages\" -DLLDB_USE_OS_LOG -D_DEBUG -D__STDC_CONSTANT_MACROS -D__STDC_FORMAT_MACROS -D__STDC_LIMIT_MACROS -Itools/lldb/source/Plugins/ScriptInterpreter/Python -I/Users/buildslave/jenkins/workspace/lldb-cmake/llvm-project/lldb/source/Plugins/ScriptInterpreter/Python -Itools/lldb/source -I/Users/buildslave/jenkins/workspace/lldb-cmake/llvm-project/lldb/include -Itools/lldb/include -I/Applications/Xcode.app/Contents/Developer/Platforms/MacOSX.platform/Developer/SDKs/MacOSX10.15.sdk/usr/include/libxml2 -Iinclude -I/Users/buildslave/jenkins/workspace/lldb-cmake/llvm-project/llvm/include -I/usr/local/Cellar/python/3.7.1/Frameworks/Python.framework/Versions/3.7/include/python3.7m -I/Users/buildslave/jenkins/workspace/lldb-cmake/llvm-project/llvm/../clang/include -Itools/lldb/../clang/include -I/usr/local/include -I/Users/buildslave/jenkins/workspace/lldb-cmake/llvm-project/lldb/source/. -Wdocumentation -fPIC -fvisibility-inlines-hidden -Werror=date-time -Werror=unguarded-availability-new -fmodules -fmodules-cache-path=/Users/buildslave/jenkins/workspace/lldb-cmake/lldb-build/module.cache -fcxx-modules -Xclang -fmodules-local-submodule-visibility -Wall -Wextra -Wno-unused-parameter -Wwrite-strings -Wcast-qual -Wmissing-field-initializers -pedantic -Wno-long-long -Wimplicit-fallthrough -Wcovered-switch-default -Wno-noexcept-type -Wnon-virtual-dtor -Wdelete-non-virtual-dtor -Wsuggest-override -Wstring-conversion -fdiagnostics-color -Wno-deprecated-declarations -Wno-unknown-pragmas -Wno-strict-aliasing -Wno-deprecated-register -Wno-vla-extension -O3  -isysroot /Applications/Xcode.app/Contents/Developer/Platforms/MacOSX.platform/Developer/SDKs/MacOSX10.15.sdk    -fno-exceptions -fno-rtti -UNDEBUG -std=c++14 -MD -MT tools/lldb/source/Plugins/ScriptInterpreter/Python/CMakeFiles/lldbPluginScriptInterpreterPython.dir/PythonDataObjects.cpp.o -MF tools/lldb/source/Plugins/ScriptInterpreter/Python/CMakeFiles/lldbPluginScriptInterpreterPython.dir/PythonDataObjects.cpp.o.d -o tools/lldb/source/Plugins/ScriptInterpreter/Python/CMakeFiles/lldbPluginScriptInterpreterPython.dir/PythonDataObjects.cpp.o -c /Users/buildslave/jenkins/workspace/lldb-cmake/llvm-project/lldb/source/Plugins/ScriptInterpreter/Python/PythonDataObjects.cpp
While building module 'lldb_Wrapper' imported from /Users/buildslave/jenkins/workspace/lldb-cmake/llvm-project/lldb/source/Plugins/ScriptInterpreter/Python/ScriptInterpreterPython.h:16:
In file included from <module-includes>:12:
In file included from /Users/buildslave/jenkins/workspace/lldb-cmake/llvm-project/lldb/include/lldb/Breakpoint/BreakpointResolverAddress.h:13:
/Users/buildslave/jenkins/workspace/lldb-cmake/llvm-project/lldb/include/lldb/Core/ModuleSpec.h:35:23: warning: empty paragraph passed to '\param' command [-Wdocumentation]
  /// \param file_spec.
      ~~~~~~~~~~~~~~~~^
/Users/buildslave/jenkins/workspace/lldb-cmake/llvm-project/lldb/include/lldb/Core/ModuleSpec.h:35:14: warning: parameter 'file_spec.' not found in the function declaration [-Wdocumentation]
  /// \param file_spec.
             ^~~~~~~~~~
/Users/buildslave/jenkins/workspace/lldb-cmake/llvm-project/lldb/include/lldb/Core/ModuleSpec.h:35:14: note: did you mean 'file_spec'?
  /// \param file_spec.
             ^~~~~~~~~~
             file_spec
While building module 'lldb_Wrapper' imported from /Users/buildslave/jenkins/workspace/lldb-cmake/llvm-project/lldb/source/Plugins/ScriptInterpreter/Python/ScriptInterpreterPython.h:16:
In file included from <module-includes>:69:
In file included from /Users/buildslave/jenkins/workspace/lldb-cmake/llvm-project/lldb/include/lldb/Core/ValueObject.h:16:
/Users/buildslave/jenkins/workspace/lldb-cmake/llvm-project/lldb/include/lldb/Target/Process.h:731:18: warning: parameter 'strm' not found in the function declaration [-Wdocumentation]
  /// \param[in] strm
                 ^~~~
/Users/buildslave/jenkins/workspace/lldb-cmake/llvm-project/lldb/include/lldb/Target/Process.h:2242:13: warning: unrecognized parameter passing direction, valid directions are '[in]', '[out]' and '[in,out]' [-Wdocumentation]
  /// \param[in/out] strm
            ^~~~~~~~
/Users/buildslave/jenkins/workspace/lldb-cmake/llvm-project/lldb/include/lldb/Target/Process.h:2269:13: warning: unrecognized parameter passing direction, valid directions are '[in]', '[out]' and '[in,out]' [-Wdocumentation]
  /// \param[in/out] strm
            ^~~~~~~~
/Users/buildslave/jenkins/workspace/lldb-cmake/llvm-project/lldb/include/lldb/Target/Process.h:919:18: warning: parameter 'strm' not found in the function declaration [-Wdocumentation]
  /// \param[in] strm
                 ^~~~
While building module 'lldb_Wrapper' imported from /Users/buildslave/jenkins/workspace/lldb-cmake/llvm-project/lldb/source/Plugins/ScriptInterpreter/Python/ScriptInterpreterPython.h:16:
While building module 'LLVM_ExecutionEngine' imported from /Users/buildslave/jenkins/workspace/lldb-cmake/llvm-project/lldb/include/lldb/Expression/IRExecutionUnit.h:17:
While building module 'LLVM_Transforms' imported from /Users/buildslave/jenkins/workspace/lldb-cmake/llvm-project/llvm/include/llvm/ExecutionEngine/Orc/IndirectionUtils.h:24:
In file included from <module-includes>:11:
/Users/buildslave/jenkins/workspace/lldb-cmake/llvm-project/llvm/include/llvm/Transforms/IPO/Attributor.h:3370:8: warning: 'isValidState' overrides a member function but is not marked 'override' [-Wsuggest-override]
  bool isValidState() const { return IsValidState.isValidState(); }
       ^
/Users/buildslave/jenkins/workspace/lldb-cmake/llvm-project/llvm/include/llvm/Transforms/IPO/Attributor.h:2005:47: note: in instantiation of template class 'llvm::PotentialValuesState<llvm::APInt, llvm::DenseMapInfo<llvm::APInt>>' requested here
struct StateWrapper : public BaseType, public StateTy {
                                              ^
/Users/buildslave/jenkins/workspace/lldb-cmake/llvm-project/llvm/include/llvm/Transforms/IPO/Attributor.h:3516:14: note: in instantiation of template class 'llvm::StateWrapper<llvm::PotentialValuesState<llvm::APInt, llvm::DenseMapInfo<llvm::APInt>>, llvm::AbstractAttribute>' requested here
    : public StateWrapper<PotentialConstantIntValuesState, AbstractAttribute> {
             ^
/Users/buildslave/jenkins/workspace/lldb-cmake/llvm-project/llvm/include/llvm/Transforms/IPO/Attributor.h:1562:16: note: overridden virtual function is here
  virtual bool isValidState() const = 0;
               ^
/Users/buildslave/jenkins/workspace/lldb-cmake/llvm-project/llvm/include/llvm/Transforms/IPO/Attributor.h:3373:8: warning: 'isAtFixpoint' overrides a member function but is not marked 'override' [-Wsuggest-override]
  bool isAtFixpoint() const { return IsValidState.isAtFixpoint(); }
       ^
/Users/buildslave/jenkins/workspace/lldb-cmake/llvm-project/llvm/include/llvm/Transforms/IPO/Attributor.h:1566:16: note: overridden virtual function is here
  virtual bool isAtFixpoint() const = 0;
               ^
/Users/buildslave/jenkins/workspace/lldb-cmake/llvm-project/llvm/include/llvm/Transforms/IPO/Attributor.h:3376:16: warning: 'indicatePessimisticFixpoint' overrides a member function but is not marked 'override' [-Wsuggest-override]
  ChangeStatus indicatePessimisticFixpoint() {
               ^
/Users/buildslave/jenkins/workspace/lldb-cmake/llvm-project/llvm/include/llvm/Transforms/IPO/Attributor.h:1582:24: note: overridden virtual function is here
  virtual ChangeStatus indicatePessimisticFixpoint() = 0;
                       ^
/Users/buildslave/jenkins/workspace/lldb-cmake/llvm-project/llvm/include/llvm/Transforms/IPO/Attributor.h:3381:16: warning: 'indicateOptimisticFixpoint' overrides a member function but is not marked 'override' [-Wsuggest-override]
  ChangeStatus indicateOptimisticFixpoint() {
               ^
/Users/buildslave/jenkins/workspace/lldb-cmake/llvm-project/llvm/include/llvm/Transforms/IPO/Attributor.h:1574:24: note: overridden virtual function is here
  virtual ChangeStatus indicateOptimisticFixpoint() = 0;
                       ^
While building module 'lldb_Wrapper' imported from /Users/buildslave/jenkins/workspace/lldb-cmake/llvm-project/lldb/source/Plugins/ScriptInterpreter/Python/ScriptInterpreterPython.h:16:
In file included from <module-includes>:250:
/Users/buildslave/jenkins/workspace/lldb-cmake/llvm-project/lldb/include/lldb/Target/ThreadPlanPython.h:50:8: warning: 'SetStopOthers' overrides a member function but is not marked 'override' [-Winconsistent-missing-override]
  void SetStopOthers(bool new_value) { m_stop_others = new_value; }
       ^
/Users/buildslave/jenkins/workspace/lldb-cmake/llvm-project/lldb/include/lldb/Target/ThreadPlan.h:424:16: note: overridden virtual function is here
  virtual void SetStopOthers(bool new_value);
               ^
11 warnings generated.
[5080/5149] : && "/Applications/Xcode.app/Contents/Developer/Toolchains/XcodeDefault.xctoolchain/usr/bin/libtool" -static -no_warning_for_no_symbols -o lib/liblldbPluginABISystemZ.a  tools/lldb/source/Plugins/ABI/SystemZ/CMakeFiles/lldbPluginABISystemZ.dir/ABISysV_s390x.cpp.o && :
[5081/5149] : && "/Applications/Xcode.app/Contents/Developer/Toolchains/XcodeDefault.xctoolchain/usr/bin/libtool" -static -no_warning_for_no_symbols -o lib/liblldbPluginArchitectureMips.a  tools/lldb/source/Plugins/Architecture/Mips/CMakeFiles/lldbPluginArchitectureMips.dir/ArchitectureMips.cpp.o && :
[5082/5149] : && "/Applications/Xcode.app/Contents/Developer/Toolchains/XcodeDefault.xctoolchain/usr/bin/libtool" -static -no_warning_for_no_symbols -o lib/liblldbPluginArchitecturePPC64.a  tools/lldb/source/Plugins/Architecture/PPC64/CMakeFiles/lldbPluginArchitecturePPC64.dir/ArchitecturePPC64.cpp.o && :
[5083/5149] : && "/Applications/Xcode.app/Contents/Developer/Toolchains/XcodeDefault.xctoolchain/usr/bin/libtool" -static -no_warning_for_no_symbols -o lib/liblldbPluginABIMips.a  tools/lldb/source/Plugins/ABI/Mips/CMakeFiles/lldbPluginABIMips.dir/ABIMips.cpp.o tools/lldb/source/Plugins/ABI/Mips/CMakeFiles/lldbPluginABIMips.dir/ABISysV_mips.cpp.o tools/lldb/source/Plugins/ABI/Mips/CMakeFiles/lldbPluginABIMips.dir/ABISysV_mips64.cpp.o && :
[5084/5149] : && "/Applications/Xcode.app/Contents/Developer/Toolchains/XcodeDefault.xctoolchain/usr/bin/libtool" -static -no_warning_for_no_symbols -o lib/liblldbPluginABIAArch64.a  tools/lldb/source/Plugins/ABI/AArch64/CMakeFiles/lldbPluginABIAArch64.dir/ABIAArch64.cpp.o tools/lldb/source/Plugins/ABI/AArch64/CMakeFiles/lldbPluginABIAArch64.dir/ABIMacOSX_arm64.cpp.o tools/lldb/source/Plugins/ABI/AArch64/CMakeFiles/lldbPluginABIAArch64.dir/ABISysV_arm64.cpp.o && :
[5085/5149] : && "/Applications/Xcode.app/Contents/Developer/Toolchains/XcodeDefault.xctoolchain/usr/bin/libtool" -static -no_warning_for_no_symbols -o lib/liblldbPluginABIARM.a  tools/lldb/source/Plugins/ABI/ARM/CMakeFiles/lldbPluginABIARM.dir/ABIARM.cpp.o tools/lldb/source/Plugins/ABI/ARM/CMakeFiles/lldbPluginABIARM.dir/ABIMacOSX_arm.cpp.o tools/lldb/source/Plugins/ABI/ARM/CMakeFiles/lldbPluginABIARM.dir/ABISysV_arm.cpp.o && :
[5086/5149] : && "/Applications/Xcode.app/Contents/Developer/Toolchains/XcodeDefault.xctoolchain/usr/bin/libtool" -static -no_warning_for_no_symbols -o lib/liblldbPluginABIPowerPC.a  tools/lldb/source/Plugins/ABI/PowerPC/CMakeFiles/lldbPluginABIPowerPC.dir/ABIPowerPC.cpp.o tools/lldb/source/Plugins/ABI/PowerPC/CMakeFiles/lldbPluginABIPowerPC.dir/ABISysV_ppc.cpp.o tools/lldb/source/Plugins/ABI/PowerPC/CMakeFiles/lldbPluginABIPowerPC.dir/ABISysV_ppc64.cpp.o && :
[5087/5149] : && "/Applications/Xcode.app/Contents/Developer/Toolchains/XcodeDefault.xctoolchain/usr/bin/libtool" -static -no_warning_for_no_symbols -o lib/liblldbPluginDynamicLoaderStatic.a  tools/lldb/source/Plugins/DynamicLoader/Static/CMakeFiles/lldbPluginDynamicLoaderStatic.dir/DynamicLoaderStatic.cpp.o && :
[5088/5149] : && "/Applications/Xcode.app/Contents/Developer/Toolchains/XcodeDefault.xctoolchain/usr/bin/libtool" -static -no_warning_for_no_symbols -o lib/liblldbPluginDisassemblerLLVMC.a  tools/lldb/source/Plugins/Disassembler/LLVMC/CMakeFiles/lldbPluginDisassemblerLLVMC.dir/DisassemblerLLVMC.cpp.o && :
[5089/5149] : && "/Applications/Xcode.app/Contents/Developer/Toolchains/XcodeDefault.xctoolchain/usr/bin/libtool" -static -no_warning_for_no_symbols -o lib/liblldbPluginDynamicLoaderWindowsDYLD.a  tools/lldb/source/Plugins/DynamicLoader/Windows-DYLD/CMakeFiles/lldbPluginDynamicLoaderWindowsDYLD.dir/DynamicLoaderWindowsDYLD.cpp.o && :
[5090/5149] : && "/Applications/Xcode.app/Contents/Developer/Toolchains/XcodeDefault.xctoolchain/usr/bin/libtool" -static -no_warning_for_no_symbols -o lib/liblldbPluginDynamicLoaderWasmDYLD.a  tools/lldb/source/Plugins/DynamicLoader/wasm-DYLD/CMakeFiles/lldbPluginDynamicLoaderWasmDYLD.dir/DynamicLoaderWasmDYLD.cpp.o && :
[5091/5149] : && "/Applications/Xcode.app/Contents/Developer/Toolchains/XcodeDefault.xctoolchain/usr/bin/libtool" -static -no_warning_for_no_symbols -o lib/liblldbPluginABIX86.a  tools/lldb/source/Plugins/ABI/X86/CMakeFiles/lldbPluginABIX86.dir/ABIX86.cpp.o tools/lldb/source/Plugins/ABI/X86/CMakeFiles/lldbPluginABIX86.dir/ABIMacOSX_i386.cpp.o tools/lldb/source/Plugins/ABI/X86/CMakeFiles/lldbPluginABIX86.dir/ABISysV_i386.cpp.o tools/lldb/source/Plugins/ABI/X86/CMakeFiles/lldbPluginABIX86.dir/ABISysV_x86_64.cpp.o tools/lldb/source/Plugins/ABI/X86/CMakeFiles/lldbPluginABIX86.dir/ABIWindows_x86_64.cpp.o && :
[5092/5149] : && "/Applications/Xcode.app/Contents/Developer/Toolchains/XcodeDefault.xctoolchain/usr/bin/libtool" -static -no_warning_for_no_symbols -o lib/liblldbPluginInstructionMIPS64.a  tools/lldb/source/Plugins/Instruction/MIPS64/CMakeFiles/lldbPluginInstructionMIPS64.dir/EmulateInstructionMIPS64.cpp.o && :
[5093/5149] : && "/Applications/Xcode.app/Contents/Developer/Toolchains/XcodeDefault.xctoolchain/usr/bin/libtool" -static -no_warning_for_no_symbols -o lib/liblldbPluginInstructionARM64.a  tools/lldb/source/Plugins/Instruction/ARM64/CMakeFiles/lldbPluginInstructionARM64.dir/EmulateInstructionARM64.cpp.o && :
[5094/5149] : && "/Applications/Xcode.app/Contents/Developer/Toolchains/XcodeDefault.xctoolchain/usr/bin/libtool" -static -no_warning_for_no_symbols -o lib/liblldbPluginInstructionPPC64.a  tools/lldb/source/Plugins/Instruction/PPC64/CMakeFiles/lldbPluginInstructionPPC64.dir/EmulateInstructionPPC64.cpp.o && :
[5095/5149] : && "/Applications/Xcode.app/Contents/Developer/Toolchains/XcodeDefault.xctoolchain/usr/bin/libtool" -static -no_warning_for_no_symbols -o lib/liblldbPluginInstructionMIPS.a  tools/lldb/source/Plugins/Instruction/MIPS/CMakeFiles/lldbPluginInstructionMIPS.dir/EmulateInstructionMIPS.cpp.o && :
[5096/5149] : && "/Applications/Xcode.app/Contents/Developer/Toolchains/XcodeDefault.xctoolchain/usr/bin/libtool" -static -no_warning_for_no_symbols -o lib/liblldbPluginInstrumentationRuntimeASan.a  tools/lldb/source/Plugins/InstrumentationRuntime/ASan/CMakeFiles/lldbPluginInstrumentationRuntimeASan.dir/InstrumentationRuntimeASan.cpp.o && :
[5097/5149] : && "/Applications/Xcode.app/Contents/Developer/Toolchains/XcodeDefault.xctoolchain/usr/bin/libtool" -static -no_warning_for_no_symbols -o lib/liblldbPluginSystemRuntimeMacOSX.a  tools/lldb/source/Plugins/SystemRuntime/MacOSX/CMakeFiles/lldbPluginSystemRuntimeMacOSX.dir/AppleGetItemInfoHandler.cpp.o tools/lldb/source/Plugins/SystemRuntime/MacOSX/CMakeFiles/lldbPluginSystemRuntimeMacOSX.dir/AppleGetPendingItemsHandler.cpp.o tools/lldb/source/Plugins/SystemRuntime/MacOSX/CMakeFiles/lldbPluginSystemRuntimeMacOSX.dir/AppleGetQueuesHandler.cpp.o tools/lldb/source/Plugins/SystemRuntime/MacOSX/CMakeFiles/lldbPluginSystemRuntimeMacOSX.dir/AppleGetThreadItemInfoHandler.cpp.o tools/lldb/source/Plugins/SystemRuntime/MacOSX/CMakeFiles/lldbPluginSystemRuntimeMacOSX.dir/SystemRuntimeMacOSX.cpp.o && :
[5098/5149] : && "/Applications/Xcode.app/Contents/Developer/Toolchains/XcodeDefault.xctoolchain/usr/bin/libtool" -static -no_warning_for_no_symbols -o lib/liblldbPluginDynamicLoaderMacOSXDYLD.a  tools/lldb/source/Plugins/DynamicLoader/MacOSX-DYLD/CMakeFiles/lldbPluginDynamicLoaderMacOSXDYLD.dir/DynamicLoaderMacOSXDYLD.cpp.o tools/lldb/source/Plugins/DynamicLoader/MacOSX-DYLD/CMakeFiles/lldbPluginDynamicLoaderMacOSXDYLD.dir/DynamicLoaderMacOS.cpp.o tools/lldb/source/Plugins/DynamicLoader/MacOSX-DYLD/CMakeFiles/lldbPluginDynamicLoaderMacOSXDYLD.dir/DynamicLoaderDarwin.cpp.o && :
[5099/5149] : && "/Applications/Xcode.app/Contents/Developer/Toolchains/XcodeDefault.xctoolchain/usr/bin/libtool" -static -no_warning_for_no_symbols -o lib/liblldbPluginDynamicLoaderHexagonDYLD.a  tools/lldb/source/Plugins/DynamicLoader/Hexagon-DYLD/CMakeFiles/lldbPluginDynamicLoaderHexagonDYLD.dir/HexagonDYLDRendezvous.cpp.o tools/lldb/source/Plugins/DynamicLoader/Hexagon-DYLD/CMakeFiles/lldbPluginDynamicLoaderHexagonDYLD.dir/DynamicLoaderHexagonDYLD.cpp.o && :
[5100/5149] : && "/Applications/Xcode.app/Contents/Developer/Toolchains/XcodeDefault.xctoolchain/usr/bin/libtool" -static -no_warning_for_no_symbols -o lib/liblldbPluginInstructionARM.a  tools/lldb/source/Plugins/Instruction/ARM/CMakeFiles/lldbPluginInstructionARM.dir/EmulateInstructionARM.cpp.o tools/lldb/source/Plugins/Instruction/ARM/CMakeFiles/lldbPluginInstructionARM.dir/EmulationStateARM.cpp.o && :
[5101/5149] : && "/Applications/Xcode.app/Contents/Developer/Toolchains/XcodeDefault.xctoolchain/usr/bin/libtool" -static -no_warning_for_no_symbols -o lib/liblldbPluginInstrumentationRuntimeMainThreadChecker.a  tools/lldb/source/Plugins/InstrumentationRuntime/MainThreadChecker/CMakeFiles/lldbPluginInstrumentationRuntimeMainThreadChecker.dir/InstrumentationRuntimeMainThreadChecker.cpp.o && :
[5102/5149] : && "/Applications/Xcode.app/Contents/Developer/Toolchains/XcodeDefault.xctoolchain/usr/bin/libtool" -static -no_warning_for_no_symbols -o lib/liblldbPluginObjCPlusPlusLanguage.a  tools/lldb/source/Plugins/Language/ObjCPlusPlus/CMakeFiles/lldbPluginObjCPlusPlusLanguage.dir/ObjCPlusPlusLanguage.cpp.o && :
[5103/5149] : && "/Applications/Xcode.app/Contents/Developer/Toolchains/XcodeDefault.xctoolchain/usr/bin/libtool" -static -no_warning_for_no_symbols -o lib/liblldbPluginInstrumentationRuntimeTSan.a  tools/lldb/source/Plugins/InstrumentationRuntime/TSan/CMakeFiles/lldbPluginInstrumentationRuntimeTSan.dir/InstrumentationRuntimeTSan.cpp.o && :
[5104/5149] : && "/Applications/Xcode.app/Contents/Developer/Toolchains/XcodeDefault.xctoolchain/usr/bin/libtool" -static -no_warning_for_no_symbols -o lib/liblldbPluginInstrumentationRuntimeUBSan.a  tools/lldb/source/Plugins/InstrumentationRuntime/UBSan/CMakeFiles/lldbPluginInstrumentationRuntimeUBSan.dir/InstrumentationRuntimeUBSan.cpp.o && :
[5105/5149] : && "/Applications/Xcode.app/Contents/Developer/Toolchains/XcodeDefault.xctoolchain/usr/bin/libtool" -static -no_warning_for_no_symbols -o lib/liblldbPluginMemoryHistoryASan.a  tools/lldb/source/Plugins/MemoryHistory/asan/CMakeFiles/lldbPluginMemoryHistoryASan.dir/MemoryHistoryASan.cpp.o && :
[5106/5149] : && "/Applications/Xcode.app/Contents/Developer/Toolchains/XcodeDefault.xctoolchain/usr/bin/libtool" -static -no_warning_for_no_symbols -o lib/liblldbPluginCXXItaniumABI.a  tools/lldb/source/Plugins/LanguageRuntime/CPlusPlus/ItaniumABI/CMakeFiles/lldbPluginCXXItaniumABI.dir/ItaniumABILanguageRuntime.cpp.o && :
[5107/5149] : && "/Applications/Xcode.app/Contents/Developer/Toolchains/XcodeDefault.xctoolchain/usr/bin/libtool" -static -no_warning_for_no_symbols -o lib/liblldbPluginObjectContainerBSDArchive.a  tools/lldb/source/Plugins/ObjectContainer/BSD-Archive/CMakeFiles/lldbPluginObjectContainerBSDArchive.dir/ObjectContainerBSDArchive.cpp.o && :
[5108/5149] : && "/Applications/Xcode.app/Contents/Developer/Toolchains/XcodeDefault.xctoolchain/usr/bin/libtool" -static -no_warning_for_no_symbols -o lib/liblldbPluginObjectContainerMachOArchive.a  tools/lldb/source/Plugins/ObjectContainer/Universal-Mach-O/CMakeFiles/lldbPluginObjectContainerMachOArchive.dir/ObjectContainerUniversalMachO.cpp.o && :
[5109/5149] : && "/Applications/Xcode.app/Contents/Developer/Toolchains/XcodeDefault.xctoolchain/usr/bin/libtool" -static -no_warning_for_no_symbols -o lib/liblldbPluginObjectFileWasm.a  tools/lldb/source/Plugins/ObjectFile/wasm/CMakeFiles/lldbPluginObjectFileWasm.dir/ObjectFileWasm.cpp.o && :
[5110/5149] : && "/Applications/Xcode.app/Contents/Developer/Toolchains/XcodeDefault.xctoolchain/usr/bin/libtool" -static -no_warning_for_no_symbols -o lib/liblldbPluginObjectFileBreakpad.a  tools/lldb/source/Plugins/ObjectFile/Breakpad/CMakeFiles/lldbPluginObjectFileBreakpad.dir/BreakpadRecords.cpp.o tools/lldb/source/Plugins/ObjectFile/Breakpad/CMakeFiles/lldbPluginObjectFileBreakpad.dir/ObjectFileBreakpad.cpp.o && :
[5111/5149] : && "/Applications/Xcode.app/Contents/Developer/Toolchains/XcodeDefault.xctoolchain/usr/bin/libtool" -static -no_warning_for_no_symbols -o lib/liblldbPluginObjectFileMachO.a  tools/lldb/source/Plugins/ObjectFile/Mach-O/CMakeFiles/lldbPluginObjectFileMachO.dir/ObjectFileMachO.cpp.o && :
[5112/5149] : && "/Applications/Xcode.app/Contents/Developer/Toolchains/XcodeDefault.xctoolchain/usr/bin/libtool" -static -no_warning_for_no_symbols -o lib/liblldbPluginObjectFileELF.a  tools/lldb/source/Plugins/ObjectFile/ELF/CMakeFiles/lldbPluginObjectFileELF.dir/ELFHeader.cpp.o tools/lldb/source/Plugins/ObjectFile/ELF/CMakeFiles/lldbPluginObjectFileELF.dir/ObjectFileELF.cpp.o && :
[5113/5149] : && "/Applications/Xcode.app/Contents/Developer/Toolchains/XcodeDefault.xctoolchain/usr/bin/libtool" -static -no_warning_for_no_symbols -o lib/liblldbPluginOperatingSystemPython.a  tools/lldb/source/Plugins/OperatingSystem/Python/CMakeFiles/lldbPluginOperatingSystemPython.dir/OperatingSystemPython.cpp.o && :
[5114/5149] : && "/Applications/Xcode.app/Contents/Developer/Toolchains/XcodeDefault.xctoolchain/usr/bin/libtool" -static -no_warning_for_no_symbols -o lib/liblldbPluginSymbolVendorWasm.a  tools/lldb/source/Plugins/SymbolVendor/wasm/CMakeFiles/lldbPluginSymbolVendorWasm.dir/SymbolVendorWasm.cpp.o && :
[5115/5149] : && "/Applications/Xcode.app/Contents/Developer/Toolchains/XcodeDefault.xctoolchain/usr/bin/libtool" -static -no_warning_for_no_symbols -o lib/liblldbPluginSymbolVendorELF.a  tools/lldb/source/Plugins/SymbolVendor/ELF/CMakeFiles/lldbPluginSymbolVendorELF.dir/SymbolVendorELF.cpp.o && :
[5116/5149] : && "/Applications/Xcode.app/Contents/Developer/Toolchains/XcodeDefault.xctoolchain/usr/bin/libtool" -static -no_warning_for_no_symbols -o lib/liblldbPluginPlatformOpenBSD.a  tools/lldb/source/Plugins/Platform/OpenBSD/CMakeFiles/lldbPluginPlatformOpenBSD.dir/PlatformOpenBSD.cpp.o && :
[5117/5149] : && "/Applications/Xcode.app/Contents/Developer/Toolchains/XcodeDefault.xctoolchain/usr/bin/libtool" -static -no_warning_for_no_symbols -o lib/liblldbPluginObjectFilePECOFF.a  tools/lldb/source/Plugins/ObjectFile/PECOFF/CMakeFiles/lldbPluginObjectFilePECOFF.dir/ObjectFilePECOFF.cpp.o tools/lldb/source/Plugins/ObjectFile/PECOFF/CMakeFiles/lldbPluginObjectFilePECOFF.dir/PECallFrameInfo.cpp.o tools/lldb/source/Plugins/ObjectFile/PECOFF/CMakeFiles/lldbPluginObjectFilePECOFF.dir/WindowsMiniDump.cpp.o && :
[5118/5149] : && "/Applications/Xcode.app/Contents/Developer/Toolchains/XcodeDefault.xctoolchain/usr/bin/libtool" -static -no_warning_for_no_symbols -o lib/liblldbPluginPlatformFreeBSD.a  tools/lldb/source/Plugins/Platform/FreeBSD/CMakeFiles/lldbPluginPlatformFreeBSD.dir/PlatformFreeBSD.cpp.o && :
[5119/5149] : && "/Applications/Xcode.app/Contents/Developer/Toolchains/XcodeDefault.xctoolchain/usr/bin/libtool" -static -no_warning_for_no_symbols -o lib/liblldbPluginPlatformNetBSD.a  tools/lldb/source/Plugins/Platform/NetBSD/CMakeFiles/lldbPluginPlatformNetBSD.dir/PlatformNetBSD.cpp.o && :
[5120/5149] : && "/Applications/Xcode.app/Contents/Developer/Toolchains/XcodeDefault.xctoolchain/usr/bin/libtool" -static -no_warning_for_no_symbols -o lib/liblldbPluginPlatformMacOSXObjCXX.a  tools/lldb/source/Plugins/Platform/MacOSX/objcxx/CMakeFiles/lldbPluginPlatformMacOSXObjCXX.dir/PlatformiOSSimulatorCoreSimulatorSupport.mm.o && :
[5121/5149] : && "/Applications/Xcode.app/Contents/Developer/Toolchains/XcodeDefault.xctoolchain/usr/bin/libtool" -static -no_warning_for_no_symbols -o lib/liblldbPluginJITLoaderGDB.a  tools/lldb/source/Plugins/JITLoader/GDB/CMakeFiles/lldbPluginJITLoaderGDB.dir/JITLoaderGDB.cpp.o && :
[5122/5149] : && "/Applications/Xcode.app/Contents/Developer/Toolchains/XcodeDefault.xctoolchain/usr/bin/libtool" -static -no_warning_for_no_symbols -o lib/liblldbPluginSymbolVendorMacOSX.a  tools/lldb/source/Plugins/SymbolVendor/MacOSX/CMakeFiles/lldbPluginSymbolVendorMacOSX.dir/SymbolVendorMacOSX.cpp.o && :
[5123/5149] : && "/Applications/Xcode.app/Contents/Developer/Toolchains/XcodeDefault.xctoolchain/usr/bin/libtool" -static -no_warning_for_no_symbols -o lib/liblldbPluginPlatformWindows.a  tools/lldb/source/Plugins/Platform/Windows/CMakeFiles/lldbPluginPlatformWindows.dir/PlatformWindows.cpp.o && :
[5124/5149] : && "/Applications/Xcode.app/Contents/Developer/Toolchains/XcodeDefault.xctoolchain/usr/bin/libtool" -static -no_warning_for_no_symbols -o lib/liblldbPluginPlatformPOSIX.a  tools/lldb/source/Plugins/Platform/POSIX/CMakeFiles/lldbPluginPlatformPOSIX.dir/PlatformPOSIX.cpp.o && :
[5125/5149] : && "/Applications/Xcode.app/Contents/Developer/Toolchains/XcodeDefault.xctoolchain/usr/bin/libtool" -static -no_warning_for_no_symbols -o lib/liblldbPluginSymbolFileSymtab.a  tools/lldb/source/Plugins/SymbolFile/Symtab/CMakeFiles/lldbPluginSymbolFileSymtab.dir/SymbolFileSymtab.cpp.o && :
[5126/5149] : && "/Applications/Xcode.app/Contents/Developer/Toolchains/XcodeDefault.xctoolchain/usr/bin/libtool" -static -no_warning_for_no_symbols -o lib/liblldbPluginPlatformGDB.a  tools/lldb/source/Plugins/Platform/gdb-server/CMakeFiles/lldbPluginPlatformGDB.dir/PlatformRemoteGDBServer.cpp.o && :
[5127/5149] : && "/Applications/Xcode.app/Contents/Developer/Toolchains/XcodeDefault.xctoolchain/usr/bin/libtool" -static -no_warning_for_no_symbols -o lib/liblldbPluginScriptInterpreterNone.a  tools/lldb/source/Plugins/ScriptInterpreter/None/CMakeFiles/lldbPluginScriptInterpreterNone.dir/ScriptInterpreterNone.cpp.o && :
[5128/5149] : && "/Applications/Xcode.app/Contents/Developer/Toolchains/XcodeDefault.xctoolchain/usr/bin/libtool" -static -no_warning_for_no_symbols -o lib/liblldbPluginSymbolFileBreakpad.a  tools/lldb/source/Plugins/SymbolFile/Breakpad/CMakeFiles/lldbPluginSymbolFileBreakpad.dir/SymbolFileBreakpad.cpp.o && :
[5129/5149] : && "/Applications/Xcode.app/Contents/Developer/Toolchains/XcodeDefault.xctoolchain/usr/bin/libtool" -static -no_warning_for_no_symbols -o lib/liblldbPluginPlatformLinux.a  tools/lldb/source/Plugins/Platform/Linux/CMakeFiles/lldbPluginPlatformLinux.dir/PlatformLinux.cpp.o && :
[5130/5149] : && "/Applications/Xcode.app/Contents/Developer/Toolchains/XcodeDefault.xctoolchain/usr/bin/libtool" -static -no_warning_for_no_symbols -o lib/liblldbPluginStructuredDataDarwinLog.a  tools/lldb/source/Plugins/StructuredData/DarwinLog/CMakeFiles/lldbPluginStructuredDataDarwinLog.dir/StructuredDataDarwinLog.cpp.o && :
[5131/5149] : && "/Applications/Xcode.app/Contents/Developer/Toolchains/XcodeDefault.xctoolchain/usr/bin/libtool" -static -no_warning_for_no_symbols -o lib/liblldbPluginPlatformAndroid.a  tools/lldb/source/Plugins/Platform/Android/CMakeFiles/lldbPluginPlatformAndroid.dir/AdbClient.cpp.o tools/lldb/source/Plugins/Platform/Android/CMakeFiles/lldbPluginPlatformAndroid.dir/PlatformAndroid.cpp.o tools/lldb/source/Plugins/Platform/Android/CMakeFiles/lldbPluginPlatformAndroid.dir/PlatformAndroidRemoteGDBServer.cpp.o && :
[5132/5149] : && "/Applications/Xcode.app/Contents/Developer/Toolchains/XcodeDefault.xctoolchain/usr/bin/libtool" -static -no_warning_for_no_symbols -o lib/liblldbPluginProcessElfCore.a  tools/lldb/source/Plugins/Process/elf-core/CMakeFiles/lldbPluginProcessElfCore.dir/ProcessElfCore.cpp.o tools/lldb/source/Plugins/Process/elf-core/CMakeFiles/lldbPluginProcessElfCore.dir/ThreadElfCore.cpp.o tools/lldb/source/Plugins/Process/elf-core/CMakeFiles/lldbPluginProcessElfCore.dir/RegisterContextPOSIXCore_arm.cpp.o tools/lldb/source/Plugins/Process/elf-core/CMakeFiles/lldbPluginProcessElfCore.dir/RegisterContextPOSIXCore_arm64.cpp.o tools/lldb/source/Plugins/Process/elf-core/CMakeFiles/lldbPluginProcessElfCore.dir/RegisterContextPOSIXCore_mips64.cpp.o tools/lldb/source/Plugins/Process/elf-core/CMakeFiles/lldbPluginProcessElfCore.dir/RegisterContextPOSIXCore_powerpc.cpp.o tools/lldb/source/Plugins/Process/elf-core/CMakeFiles/lldbPluginProcessElfCore.dir/RegisterContextPOSIXCore_ppc64le.cpp.o tools/lldb/source/Plugins/Process/elf-core/CMakeFiles/lldbPluginProcessElfCore.dir/RegisterContextPOSIXCore_s390x.cpp.o tools/lldb/source/Plugins/Process/elf-core/CMakeFiles/lldbPluginProcessElfCore.dir/RegisterContextPOSIXCore_x86_64.cpp.o tools/lldb/source/Plugins/Process/elf-core/CMakeFiles/lldbPluginProcessElfCore.dir/RegisterUtilities.cpp.o && :
[5133/5149] : && "/Applications/Xcode.app/Contents/Developer/Toolchains/XcodeDefault.xctoolchain/usr/bin/libtool" -static -no_warning_for_no_symbols -o lib/liblldbPluginPlatformMacOSX.a  tools/lldb/source/Plugins/Platform/MacOSX/CMakeFiles/lldbPluginPlatformMacOSX.dir/PlatformDarwin.cpp.o tools/lldb/source/Plugins/Platform/MacOSX/CMakeFiles/lldbPluginPlatformMacOSX.dir/PlatformDarwinKernel.cpp.o tools/lldb/source/Plugins/Platform/MacOSX/CMakeFiles/lldbPluginPlatformMacOSX.dir/PlatformMacOSX.cpp.o tools/lldb/source/Plugins/Platform/MacOSX/CMakeFiles/lldbPluginPlatformMacOSX.dir/PlatformRemoteiOS.cpp.o tools/lldb/source/Plugins/Platform/MacOSX/CMakeFiles/lldbPluginPlatformMacOSX.dir/PlatformRemoteAppleTV.cpp.o tools/lldb/source/Plugins/Platform/MacOSX/CMakeFiles/lldbPluginPlatformMacOSX.dir/PlatformRemoteAppleWatch.cpp.o tools/lldb/source/Plugins/Platform/MacOSX/CMakeFiles/lldbPluginPlatformMacOSX.dir/PlatformRemoteDarwinDevice.cpp.o tools/lldb/source/Plugins/Platform/MacOSX/CMakeFiles/lldbPluginPlatformMacOSX.dir/PlatformRemoteAppleBridge.cpp.o tools/lldb/source/Plugins/Platform/MacOSX/CMakeFiles/lldbPluginPlatformMacOSX.dir/PlatformAppleSimulator.cpp.o && :
[5134/5149] : && "/Applications/Xcode.app/Contents/Developer/Toolchains/XcodeDefault.xctoolchain/usr/bin/libtool" -static -no_warning_for_no_symbols -o lib/liblldbPluginDynamicLoaderPosixDYLD.a  tools/lldb/source/Plugins/DynamicLoader/POSIX-DYLD/CMakeFiles/lldbPluginDynamicLoaderPosixDYLD.dir/DYLDRendezvous.cpp.o tools/lldb/source/Plugins/DynamicLoader/POSIX-DYLD/CMakeFiles/lldbPluginDynamicLoaderPosixDYLD.dir/DynamicLoaderPOSIXDYLD.cpp.o && :
[5135/5149] : && "/Applications/Xcode.app/Contents/Developer/Toolchains/XcodeDefault.xctoolchain/usr/bin/libtool" -static -no_warning_for_no_symbols -o lib/liblldbPluginDynamicLoaderDarwinKernel.a  tools/lldb/source/Plugins/DynamicLoader/Darwin-Kernel/CMakeFiles/lldbPluginDynamicLoaderDarwinKernel.dir/DynamicLoaderDarwinKernel.cpp.o && :
[5136/5149] : && "/Applications/Xcode.app/Contents/Developer/Toolchains/XcodeDefault.xctoolchain/usr/bin/libtool" -static -no_warning_for_no_symbols -o lib/liblldbPluginProcessMachCore.a  tools/lldb/source/Plugins/Process/mach-core/CMakeFiles/lldbPluginProcessMachCore.dir/ProcessMachCore.cpp.o tools/lldb/source/Plugins/Process/mach-core/CMakeFiles/lldbPluginProcessMachCore.dir/ThreadMachCore.cpp.o && :
[5137/5149] : && "/Applications/Xcode.app/Contents/Developer/Toolchains/XcodeDefault.xctoolchain/usr/bin/libtool" -static -no_warning_for_no_symbols -o lib/liblldbPluginProcessMacOSXKernel.a  tools/lldb/source/Plugins/Process/MacOSX-Kernel/CMakeFiles/lldbPluginProcessMacOSXKernel.dir/CommunicationKDP.cpp.o tools/lldb/source/Plugins/Process/MacOSX-Kernel/CMakeFiles/lldbPluginProcessMacOSXKernel.dir/ProcessKDP.cpp.o tools/lldb/source/Plugins/Process/MacOSX-Kernel/CMakeFiles/lldbPluginProcessMacOSXKernel.dir/ProcessKDPLog.cpp.o tools/lldb/source/Plugins/Process/MacOSX-Kernel/CMakeFiles/lldbPluginProcessMacOSXKernel.dir/RegisterContextKDP_arm.cpp.o tools/lldb/source/Plugins/Process/MacOSX-Kernel/CMakeFiles/lldbPluginProcessMacOSXKernel.dir/RegisterContextKDP_arm64.cpp.o tools/lldb/source/Plugins/Process/MacOSX-Kernel/CMakeFiles/lldbPluginProcessMacOSXKernel.dir/RegisterContextKDP_i386.cpp.o tools/lldb/source/Plugins/Process/MacOSX-Kernel/CMakeFiles/lldbPluginProcessMacOSXKernel.dir/RegisterContextKDP_x86_64.cpp.o tools/lldb/source/Plugins/Process/MacOSX-Kernel/CMakeFiles/lldbPluginProcessMacOSXKernel.dir/ThreadKDP.cpp.o && :
[5138/5149] : && "/Applications/Xcode.app/Contents/Developer/Toolchains/XcodeDefault.xctoolchain/usr/bin/libtool" -static -no_warning_for_no_symbols -o lib/liblldbPluginProcessMinidump.a  tools/lldb/source/Plugins/Process/minidump/CMakeFiles/lldbPluginProcessMinidump.dir/MinidumpTypes.cpp.o tools/lldb/source/Plugins/Process/minidump/CMakeFiles/lldbPluginProcessMinidump.dir/MinidumpParser.cpp.o tools/lldb/source/Plugins/Process/minidump/CMakeFiles/lldbPluginProcessMinidump.dir/RegisterContextMinidump_ARM.cpp.o tools/lldb/source/Plugins/Process/minidump/CMakeFiles/lldbPluginProcessMinidump.dir/RegisterContextMinidump_ARM64.cpp.o tools/lldb/source/Plugins/Process/minidump/CMakeFiles/lldbPluginProcessMinidump.dir/RegisterContextMinidump_x86_32.cpp.o tools/lldb/source/Plugins/Process/minidump/CMakeFiles/lldbPluginProcessMinidump.dir/RegisterContextMinidump_x86_64.cpp.o tools/lldb/source/Plugins/Process/minidump/CMakeFiles/lldbPluginProcessMinidump.dir/ProcessMinidump.cpp.o tools/lldb/source/Plugins/Process/minidump/CMakeFiles/lldbPluginProcessMinidump.dir/ThreadMinidump.cpp.o && :
[5139/5149] : && "/Applications/Xcode.app/Contents/Developer/Toolchains/XcodeDefault.xctoolchain/usr/bin/libtool" -static -no_warning_for_no_symbols -o lib/liblldbPluginProcessGDBRemote.a  tools/lldb/source/Plugins/Process/gdb-remote/CMakeFiles/lldbPluginProcessGDBRemote.dir/GDBRemoteClientBase.cpp.o tools/lldb/source/Plugins/Process/gdb-remote/CMakeFiles/lldbPluginProcessGDBRemote.dir/GDBRemoteCommunication.cpp.o tools/lldb/source/Plugins/Process/gdb-remote/CMakeFiles/lldbPluginProcessGDBRemote.dir/GDBRemoteCommunicationClient.cpp.o tools/lldb/source/Plugins/Process/gdb-remote/CMakeFiles/lldbPluginProcessGDBRemote.dir/GDBRemoteCommunicationHistory.cpp.o tools/lldb/source/Plugins/Process/gdb-remote/CMakeFiles/lldbPluginProcessGDBRemote.dir/GDBRemoteCommunicationReplayServer.cpp.o tools/lldb/source/Plugins/Process/gdb-remote/CMakeFiles/lldbPluginProcessGDBRemote.dir/GDBRemoteCommunicationServer.cpp.o tools/lldb/source/Plugins/Process/gdb-remote/CMakeFiles/lldbPluginProcessGDBRemote.dir/GDBRemoteCommunicationServerCommon.cpp.o tools/lldb/source/Plugins/Process/gdb-remote/CMakeFiles/lldbPluginProcessGDBRemote.dir/GDBRemoteCommunicationServerLLGS.cpp.o tools/lldb/source/Plugins/Process/gdb-remote/CMakeFiles/lldbPluginProcessGDBRemote.dir/GDBRemoteCommunicationServerPlatform.cpp.o tools/lldb/source/Plugins/Process/gdb-remote/CMakeFiles/lldbPluginProcessGDBRemote.dir/GDBRemoteRegisterContext.cpp.o tools/lldb/source/Plugins/Process/gdb-remote/CMakeFiles/lldbPluginProcessGDBRemote.dir/ProcessGDBRemote.cpp.o tools/lldb/source/Plugins/Process/gdb-remote/CMakeFiles/lldbPluginProcessGDBRemote.dir/ProcessGDBRemoteLog.cpp.o tools/lldb/source/Plugins/Process/gdb-remote/CMakeFiles/lldbPluginProcessGDBRemote.dir/ThreadGDBRemote.cpp.o && :
[5140/5149] : && "/Applications/Xcode.app/Contents/Developer/Toolchains/XcodeDefault.xctoolchain/usr/bin/libtool" -static -no_warning_for_no_symbols -o lib/liblldbInitialization.a  tools/lldb/source/Initialization/CMakeFiles/lldbInitialization.dir/SystemInitializerCommon.cpp.o tools/lldb/source/Initialization/CMakeFiles/lldbInitialization.dir/SystemInitializer.cpp.o tools/lldb/source/Initialization/CMakeFiles/lldbInitialization.dir/SystemLifetimeManager.cpp.o && :
[5141/5149] : && /Users/buildslave/jenkins/workspace/lldb-cmake/host-compiler/bin/clang++  -Wdocumentation -fPIC -fvisibility-inlines-hidden -Werror=date-time -Werror=unguarded-availability-new -fmodules -fmodules-cache-path=/Users/buildslave/jenkins/workspace/lldb-cmake/lldb-build/module.cache -fcxx-modules -Xclang -fmodules-local-submodule-visibility -Wall -Wextra -Wno-unused-parameter -Wwrite-strings -Wcast-qual -Wmissing-field-initializers -pedantic -Wno-long-long -Wimplicit-fallthrough -Wcovered-switch-default -Wno-noexcept-type -Wnon-virtual-dtor -Wdelete-non-virtual-dtor -Wsuggest-override -Wstring-conversion -fdiagnostics-color -Wno-deprecated-declarations -Wno-unknown-pragmas -Wno-strict-aliasing -Wno-deprecated-register -Wno-vla-extension -O3  -isysroot /Applications/Xcode.app/Contents/Developer/Platforms/MacOSX.platform/Developer/SDKs/MacOSX10.15.sdk -Wl,-search_paths_first -Wl,-headerpad_max_install_names -Wl,-dead_strip tools/lldb/tools/lldb-server/CMakeFiles/lldb-server.dir/Acceptor.cpp.o tools/lldb/tools/lldb-server/CMakeFiles/lldb-server.dir/lldb-gdbserver.cpp.o tools/lldb/tools/lldb-server/CMakeFiles/lldb-server.dir/lldb-platform.cpp.o tools/lldb/tools/lldb-server/CMakeFiles/lldb-server.dir/lldb-server.cpp.o tools/lldb/tools/lldb-server/CMakeFiles/lldb-server.dir/LLDBServerUtilities.cpp.o tools/lldb/tools/lldb-server/CMakeFiles/lldb-server.dir/SystemInitializerLLGS.cpp.o  -o bin/lldb-server  -Wl,-rpath,@loader_path/../lib  lib/libLLVMSupport.a  lib/liblldbBase.a  lib/liblldbHost.a  lib/liblldbInitialization.a  lib/liblldbPluginObjectFileMachO.a  lib/liblldbPluginInstructionARM.a  lib/liblldbPluginInstructionMIPS.a  lib/liblldbPluginInstructionMIPS64.a  lib/liblldbPluginProcessGDBRemote.a  lib/liblldbPluginPlatformMacOSX.a  lib/liblldbPluginPlatformPOSIX.a  lib/liblldbPluginPlatformMacOSXObjCXX.a  -lcompression  lib/liblldbCore.a  lib/liblldbSymbol.a  lib/liblldbTarget.a  lib/liblldbPluginProcessUtility.a  lib/liblldbInterpreter.a  lib/liblldbBreakpoint.a  lib/liblldbDataFormatters.a  lib/liblldbExpression.a  lib/liblldbPluginCPlusPlusLanguage.a  lib/liblldbPluginObjCLanguage.a  lib/liblldbPluginExpressionParserClang.a  lib/liblldbCommands.a  lib/liblldbPluginObjectFileJIT.a  lib/liblldbPluginClangCommon.a  lib/liblldbPluginCPPRuntime.a  lib/liblldbPluginTypeSystemClang.a  lib/liblldbPluginAppleObjCRuntime.a  lib/liblldbPluginObjCRuntime.a  lib/liblldbPluginRenderScriptRuntime.a  lib/liblldbPluginSymbolFileDWARF.a  lib/liblldbPluginSymbolFilePDB.a  lib/liblldbPluginSymbolFileNativePDB.a  lib/liblldbCore.a  lib/liblldbSymbol.a  lib/liblldbTarget.a  lib/liblldbPluginProcessUtility.a  lib/liblldbInterpreter.a  lib/liblldbBreakpoint.a  lib/liblldbDataFormatters.a  lib/liblldbExpression.a  lib/liblldbPluginCPlusPlusLanguage.a  lib/liblldbPluginObjCLanguage.a  lib/liblldbPluginExpressionParserClang.a  lib/liblldbCommands.a  lib/liblldbPluginObjectFileJIT.a  lib/liblldbPluginClangCommon.a  lib/liblldbPluginCPPRuntime.a  lib/liblldbPluginTypeSystemClang.a  lib/liblldbPluginAppleObjCRuntime.a  lib/liblldbPluginObjCRuntime.a  lib/liblldbPluginRenderScriptRuntime.a  lib/liblldbPluginSymbolFileDWARF.a  lib/liblldbPluginSymbolFilePDB.a  lib/liblldbPluginSymbolFileNativePDB.a  lib/liblldbCore.a  lib/liblldbSymbol.a  lib/liblldbTarget.a  lib/liblldbPluginProcessUtility.a  lib/liblldbInterpreter.a  lib/liblldbBreakpoint.a  lib/liblldbDataFormatters.a  lib/liblldbExpression.a  lib/liblldbPluginCPlusPlusLanguage.a  lib/liblldbPluginObjCLanguage.a  lib/liblldbPluginExpressionParserClang.a  lib/liblldbCommands.a  lib/liblldbPluginObjectFileJIT.a  lib/liblldbPluginClangCommon.a  lib/liblldbPluginCPPRuntime.a  lib/liblldbPluginTypeSystemClang.a  lib/liblldbPluginAppleObjCRuntime.a  lib/liblldbPluginObjCRuntime.a  lib/liblldbPluginRenderScriptRuntime.a  lib/liblldbPluginSymbolFileDWARF.a  lib/liblldbPluginSymbolFilePDB.a  lib/liblldbPluginSymbolFileNativePDB.a  lib/liblldbCore.a  lib/liblldbSymbol.a  lib/liblldbTarget.a  lib/liblldbPluginProcessUtility.a  lib/liblldbInterpreter.a  lib/liblldbBreakpoint.a  lib/liblldbDataFormatters.a  lib/liblldbExpression.a  lib/liblldbPluginCPlusPlusLanguage.a  lib/liblldbPluginObjCLanguage.a  lib/liblldbPluginExpressionParserClang.a  lib/liblldbCommands.a  lib/liblldbPluginObjectFileJIT.a  lib/liblldbPluginClangCommon.a  lib/liblldbPluginCPPRuntime.a  lib/liblldbPluginTypeSystemClang.a  lib/liblldbPluginAppleObjCRuntime.a  lib/liblldbPluginObjCRuntime.a  lib/liblldbPluginRenderScriptRuntime.a  lib/liblldbPluginSymbolFileDWARF.a  lib/liblldbPluginSymbolFilePDB.a  lib/liblldbPluginSymbolFileNativePDB.a  lib/liblldbCore.a  lib/liblldbSymbol.a  lib/liblldbTarget.a  lib/liblldbPluginProcessUtility.a  lib/liblldbInterpreter.a  lib/liblldbBreakpoint.a  lib/liblldbDataFormatters.a  lib/liblldbExpression.a  lib/liblldbPluginCPlusPlusLanguage.a  lib/liblldbPluginObjCLanguage.a  lib/liblldbPluginExpressionParserClang.a  lib/liblldbCommands.a  lib/liblldbPluginObjectFileJIT.a  lib/liblldbPluginClangCommon.a  lib/liblldbPluginCPPRuntime.a  lib/liblldbPluginTypeSystemClang.a  lib/liblldbPluginAppleObjCRuntime.a  lib/liblldbPluginObjCRuntime.a  lib/liblldbPluginRenderScriptRuntime.a  lib/liblldbPluginSymbolFileDWARF.a  lib/liblldbPluginSymbolFilePDB.a  lib/liblldbPluginSymbolFileNativePDB.a  /usr/lib/libcurses.dylib  /usr/lib/libform.dylib  /usr/lib/libpanel.dylib  lib/libLLVMMCJIT.a  lib/libLLVMExecutionEngine.a  lib/libLLVMRuntimeDyld.a  lib/libclangCodeGen.a  lib/libLLVMCoverage.a  lib/libLLVMLTO.a  lib/libLLVMExtensions.a  lib/libLLVMObjCARCOpts.a  lib/libLLVMPasses.a  lib/libLLVMCoroutines.a  lib/libLLVMipo.a  lib/libLLVMInstrumentation.a  lib/libLLVMLinker.a  lib/libLLVMVectorize.a  lib/libclangRewriteFrontend.a  lib/libclangRewrite.a  lib/liblldbBase.a  lib/libclangFrontend.a  lib/libclangDriver.a  lib/libLLVMOption.a  lib/libclangParse.a  lib/libclangSerialization.a  lib/libclangSema.a  lib/libclangEdit.a  lib/libclangAnalysis.a  lib/libclangASTMatchers.a  lib/libLLVMIRReader.a  lib/libLLVMAsmParser.a  lib/liblldbHost.a  /usr/lib/libxml2.dylib  /usr/lib/libedit.dylib  /usr/local/lib/liblzma.dylib  /usr/lib/libedit.dylib  /usr/local/lib/liblzma.dylib  lib/liblldbHostMacOSXObjCXX.a  lib/liblldbUtility.a  -framework  Foundation  -framework  CoreFoundation  -framework  CoreServices  -framework  Security  lib/libclangAST.a  lib/libLLVMFrontendOpenMP.a  lib/libclangLex.a  lib/libclangBasic.a  lib/libLLVMDebugInfoPDB.a  lib/libLLVMMipsCodeGen.a  lib/libLLVMAsmPrinter.a  lib/libLLVMDebugInfoDWARF.a  lib/libLLVMGlobalISel.a  lib/libLLVMSelectionDAG.a  lib/libLLVMCodeGen.a  lib/libLLVMBitWriter.a  lib/libLLVMScalarOpts.a  lib/libLLVMAggressiveInstCombine.a  lib/libLLVMInstCombine.a  lib/libLLVMTransformUtils.a  lib/libLLVMTarget.a  lib/libLLVMAnalysis.a  lib/libLLVMObject.a  lib/libLLVMBitReader.a  lib/libLLVMTextAPI.a  lib/libLLVMProfileData.a  lib/libLLVMCore.a  lib/libLLVMRemarks.a  lib/libLLVMBitstreamReader.a  lib/libLLVMMipsAsmParser.a  lib/libLLVMMCParser.a  lib/libLLVMMipsDesc.a  lib/libLLVMMipsDisassembler.a  lib/libLLVMMCDisassembler.a  lib/libLLVMMC.a  lib/libLLVMBinaryFormat.a  lib/libLLVMDebugInfoCodeView.a  lib/libLLVMDebugInfoMSF.a  lib/libLLVMMipsInfo.a  lib/libLLVMSupport.a  -lz  -lcurses  -lm  lib/libLLVMDemangle.a && :
[5142/5149] /Users/buildslave/jenkins/workspace/lldb-cmake/host-compiler/bin/clang++  -DGTEST_HAS_RTTI=0 -DHAVE_ROUND -DLLDB_CONFIGURATION_RELEASE -DLLDB_PYTHON_RELATIVE_LIBDIR=\"lib/python3.7/site-packages\" -DLLDB_USE_OS_LOG -D_DEBUG -D__STDC_CONSTANT_MACROS -D__STDC_FORMAT_MACROS -D__STDC_LIMIT_MACROS -Itools/lldb/source/Plugins/ScriptInterpreter/Python -I/Users/buildslave/jenkins/workspace/lldb-cmake/llvm-project/lldb/source/Plugins/ScriptInterpreter/Python -Itools/lldb/source -I/Users/buildslave/jenkins/workspace/lldb-cmake/llvm-project/lldb/include -Itools/lldb/include -I/Applications/Xcode.app/Contents/Developer/Platforms/MacOSX.platform/Developer/SDKs/MacOSX10.15.sdk/usr/include/libxml2 -Iinclude -I/Users/buildslave/jenkins/workspace/lldb-cmake/llvm-project/llvm/include -I/usr/local/Cellar/python/3.7.1/Frameworks/Python.framework/Versions/3.7/include/python3.7m -I/Users/buildslave/jenkins/workspace/lldb-cmake/llvm-project/llvm/../clang/include -Itools/lldb/../clang/include -I/usr/local/include -I/Users/buildslave/jenkins/workspace/lldb-cmake/llvm-project/lldb/source/. -Wdocumentation -fPIC -fvisibility-inlines-hidden -Werror=date-time -Werror=unguarded-availability-new -fmodules -fmodules-cache-path=/Users/buildslave/jenkins/workspace/lldb-cmake/lldb-build/module.cache -fcxx-modules -Xclang -fmodules-local-submodule-visibility -Wall -Wextra -Wno-unused-parameter -Wwrite-strings -Wcast-qual -Wmissing-field-initializers -pedantic -Wno-long-long -Wimplicit-fallthrough -Wcovered-switch-default -Wno-noexcept-type -Wnon-virtual-dtor -Wdelete-non-virtual-dtor -Wsuggest-override -Wstring-conversion -fdiagnostics-color -Wno-deprecated-declarations -Wno-unknown-pragmas -Wno-strict-aliasing -Wno-deprecated-register -Wno-vla-extension -O3  -isysroot /Applications/Xcode.app/Contents/Developer/Platforms/MacOSX.platform/Developer/SDKs/MacOSX10.15.sdk    -fno-exceptions -fno-rtti -UNDEBUG -std=c++14 -MD -MT tools/lldb/source/Plugins/ScriptInterpreter/Python/CMakeFiles/lldbPluginScriptInterpreterPython.dir/ScriptInterpreterPython.cpp.o -MF tools/lldb/source/Plugins/ScriptInterpreter/Python/CMakeFiles/lldbPluginScriptInterpreterPython.dir/ScriptInterpreterPython.cpp.o.d -o tools/lldb/source/Plugins/ScriptInterpreter/Python/CMakeFiles/lldbPluginScriptInterpreterPython.dir/ScriptInterpreterPython.cpp.o -c /Users/buildslave/jenkins/workspace/lldb-cmake/llvm-project/lldb/source/Plugins/ScriptInterpreter/Python/ScriptInterpreterPython.cpp
While building module 'lldb_Wrapper' imported from /Users/buildslave/jenkins/workspace/lldb-cmake/llvm-project/lldb/source/Plugins/ScriptInterpreter/Python/ScriptInterpreterPython.h:16:
In file included from <module-includes>:12:
In file included from /Users/buildslave/jenkins/workspace/lldb-cmake/llvm-project/lldb/include/lldb/Breakpoint/BreakpointResolverAddress.h:13:
/Users/buildslave/jenkins/workspace/lldb-cmake/llvm-project/lldb/include/lldb/Core/ModuleSpec.h:35:23: warning: empty paragraph passed to '\param' command [-Wdocumentation]
  /// \param file_spec.
      ~~~~~~~~~~~~~~~~^
/Users/buildslave/jenkins/workspace/lldb-cmake/llvm-project/lldb/include/lldb/Core/ModuleSpec.h:35:14: warning: parameter 'file_spec.' not found in the function declaration [-Wdocumentation]
  /// \param file_spec.
             ^~~~~~~~~~
/Users/buildslave/jenkins/workspace/lldb-cmake/llvm-project/lldb/include/lldb/Core/ModuleSpec.h:35:14: note: did you mean 'file_spec'?
  /// \param file_spec.
             ^~~~~~~~~~
             file_spec
While building module 'lldb_Wrapper' imported from /Users/buildslave/jenkins/workspace/lldb-cmake/llvm-project/lldb/source/Plugins/ScriptInterpreter/Python/ScriptInterpreterPython.h:16:
In file included from <module-includes>:69:
In file included from /Users/buildslave/jenkins/workspace/lldb-cmake/llvm-project/lldb/include/lldb/Core/ValueObject.h:16:
/Users/buildslave/jenkins/workspace/lldb-cmake/llvm-project/lldb/include/lldb/Target/Process.h:731:18: warning: parameter 'strm' not found in the function declaration [-Wdocumentation]
  /// \param[in] strm
                 ^~~~
/Users/buildslave/jenkins/workspace/lldb-cmake/llvm-project/lldb/include/lldb/Target/Process.h:2242:13: warning: unrecognized parameter passing direction, valid directions are '[in]', '[out]' and '[in,out]' [-Wdocumentation]
  /// \param[in/out] strm
            ^~~~~~~~
/Users/buildslave/jenkins/workspace/lldb-cmake/llvm-project/lldb/include/lldb/Target/Process.h:2269:13: warning: unrecognized parameter passing direction, valid directions are '[in]', '[out]' and '[in,out]' [-Wdocumentation]
  /// \param[in/out] strm
            ^~~~~~~~
/Users/buildslave/jenkins/workspace/lldb-cmake/llvm-project/lldb/include/lldb/Target/Process.h:919:18: warning: parameter 'strm' not found in the function declaration [-Wdocumentation]
  /// \param[in] strm
                 ^~~~
While building module 'lldb_Wrapper' imported from /Users/buildslave/jenkins/workspace/lldb-cmake/llvm-project/lldb/source/Plugins/ScriptInterpreter/Python/ScriptInterpreterPython.h:16:
In file included from <module-includes>:250:
/Users/buildslave/jenkins/workspace/lldb-cmake/llvm-project/lldb/include/lldb/Target/ThreadPlanPython.h:50:8: warning: 'SetStopOthers' overrides a member function but is not marked 'override' [-Winconsistent-missing-override]
  void SetStopOthers(bool new_value) { m_stop_others = new_value; }
       ^
/Users/buildslave/jenkins/workspace/lldb-cmake/llvm-project/lldb/include/lldb/Target/ThreadPlan.h:424:16: note: overridden virtual function is here
  virtual void SetStopOthers(bool new_value);
               ^
7 warnings generated.
[5143/5149] : && "/Applications/Xcode.app/Contents/Developer/Toolchains/XcodeDefault.xctoolchain/usr/bin/libtool" -static -no_warning_for_no_symbols -o lib/liblldbPluginScriptInterpreterPython.a  tools/lldb/source/Plugins/ScriptInterpreter/Python/CMakeFiles/lldbPluginScriptInterpreterPython.dir/PythonDataObjects.cpp.o tools/lldb/source/Plugins/ScriptInterpreter/Python/CMakeFiles/lldbPluginScriptInterpreterPython.dir/PythonReadline.cpp.o tools/lldb/source/Plugins/ScriptInterpreter/Python/CMakeFiles/lldbPluginScriptInterpreterPython.dir/ScriptInterpreterPython.cpp.o && :
[5144/5149] : && /Users/buildslave/jenkins/workspace/lldb-cmake/host-compiler/bin/clang++ -Wdocumentation -fPIC -fvisibility-inlines-hidden -Werror=date-time -Werror=unguarded-availability-new -fmodules -fmodules-cache-path=/Users/buildslave/jenkins/workspace/lldb-cmake/lldb-build/module.cache -fcxx-modules -Xclang -fmodules-local-submodule-visibility -Wall -Wextra -Wno-unused-parameter -Wwrite-strings -Wcast-qual -Wmissing-field-initializers -pedantic -Wno-long-long -Wimplicit-fallthrough -Wcovered-switch-default -Wno-noexcept-type -Wnon-virtual-dtor -Wdelete-non-virtual-dtor -Wsuggest-override -Wstring-conversion -fdiagnostics-color -Wno-deprecated-declarations -Wno-unknown-pragmas -Wno-strict-aliasing -Wno-deprecated-register -Wno-vla-extension -O3 -isysroot /Applications/Xcode.app/Contents/Developer/Platforms/MacOSX.platform/Developer/SDKs/MacOSX10.15.sdk -dynamiclib -Wl,-headerpad_max_install_names -Wl,-dead_strip -Wl,-exported_symbols_list,"/Users/buildslave/jenkins/workspace/lldb-cmake/lldb-build/tools/lldb/source/API/liblldb.exports"  -current_version 12.0.99 -o lib/liblldb.12.0.99git.dylib -install_name @rpath/liblldb.12.0.99git.dylib tools/lldb/source/API/CMakeFiles/liblldb.dir/SBAddress.cpp.o tools/lldb/source/API/CMakeFiles/liblldb.dir/SBAttachInfo.cpp.o tools/lldb/source/API/CMakeFiles/liblldb.dir/SBBlock.cpp.o tools/lldb/source/API/CMakeFiles/liblldb.dir/SBBreakpoint.cpp.o tools/lldb/source/API/CMakeFiles/liblldb.dir/SBBreakpointLocation.cpp.o tools/lldb/source/API/CMakeFiles/liblldb.dir/SBBreakpointName.cpp.o tools/lldb/source/API/CMakeFiles/liblldb.dir/SBBreakpointOptionCommon.cpp.o tools/lldb/source/API/CMakeFiles/liblldb.dir/SBBroadcaster.cpp.o tools/lldb/source/API/CMakeFiles/liblldb.dir/SBCommandInterpreter.cpp.o tools/lldb/source/API/CMakeFiles/liblldb.dir/SBCommandInterpreterRunOptions.cpp.o tools/lldb/source/API/CMakeFiles/liblldb.dir/SBCommandReturnObject.cpp.o tools/lldb/source/API/CMakeFiles/liblldb.dir/SBCommunication.cpp.o tools/lldb/source/API/CMakeFiles/liblldb.dir/SBCompileUnit.cpp.o tools/lldb/source/API/CMakeFiles/liblldb.dir/SBData.cpp.o tools/lldb/source/API/CMakeFiles/liblldb.dir/SBDebugger.cpp.o tools/lldb/source/API/CMakeFiles/liblldb.dir/SBDeclaration.cpp.o tools/lldb/source/API/CMakeFiles/liblldb.dir/SBEnvironment.cpp.o tools/lldb/source/API/CMakeFiles/liblldb.dir/SBError.cpp.o tools/lldb/source/API/CMakeFiles/liblldb.dir/SBEvent.cpp.o tools/lldb/source/API/CMakeFiles/liblldb.dir/SBExecutionContext.cpp.o tools/lldb/source/API/CMakeFiles/liblldb.dir/SBExpressionOptions.cpp.o tools/lldb/source/API/CMakeFiles/liblldb.dir/SBFileSpec.cpp.o tools/lldb/source/API/CMakeFiles/liblldb.dir/SBFile.cpp.o tools/lldb/source/API/CMakeFiles/liblldb.dir/SBFileSpecList.cpp.o tools/lldb/source/API/CMakeFiles/liblldb.dir/SBFrame.cpp.o tools/lldb/source/API/CMakeFiles/liblldb.dir/SBFunction.cpp.o tools/lldb/source/API/CMakeFiles/liblldb.dir/SBHostOS.cpp.o tools/lldb/source/API/CMakeFiles/liblldb.dir/SBInstruction.cpp.o tools/lldb/source/API/CMakeFiles/liblldb.dir/SBInstructionList.cpp.o tools/lldb/source/API/CMakeFiles/liblldb.dir/SBLanguageRuntime.cpp.o tools/lldb/source/API/CMakeFiles/liblldb.dir/SBLaunchInfo.cpp.o tools/lldb/source/API/CMakeFiles/liblldb.dir/SBLineEntry.cpp.o tools/lldb/source/API/CMakeFiles/liblldb.dir/SBListener.cpp.o tools/lldb/source/API/CMakeFiles/liblldb.dir/SBMemoryRegionInfo.cpp.o tools/lldb/source/API/CMakeFiles/liblldb.dir/SBMemoryRegionInfoList.cpp.o tools/lldb/source/API/CMakeFiles/liblldb.dir/SBModule.cpp.o tools/lldb/source/API/CMakeFiles/liblldb.dir/SBModuleSpec.cpp.o tools/lldb/source/API/CMakeFiles/liblldb.dir/SBPlatform.cpp.o tools/lldb/source/API/CMakeFiles/liblldb.dir/SBProcess.cpp.o tools/lldb/source/API/CMakeFiles/liblldb.dir/SBProcessInfo.cpp.o tools/lldb/source/API/CMakeFiles/liblldb.dir/SBQueue.cpp.o tools/lldb/source/API/CMakeFiles/liblldb.dir/SBQueueItem.cpp.o tools/lldb/source/API/CMakeFiles/liblldb.dir/SBReproducer.cpp.o tools/lldb/source/API/CMakeFiles/liblldb.dir/SBSection.cpp.o tools/lldb/source/API/CMakeFiles/liblldb.dir/SBSourceManager.cpp.o tools/lldb/source/API/CMakeFiles/liblldb.dir/SBStream.cpp.o tools/lldb/source/API/CMakeFiles/liblldb.dir/SBStringList.cpp.o tools/lldb/source/API/CMakeFiles/liblldb.dir/SBStructuredData.cpp.o tools/lldb/source/API/CMakeFiles/liblldb.dir/SBSymbol.cpp.o tools/lldb/source/API/CMakeFiles/liblldb.dir/SBSymbolContext.cpp.o tools/lldb/source/API/CMakeFiles/liblldb.dir/SBSymbolContextList.cpp.o tools/lldb/source/API/CMakeFiles/liblldb.dir/SBTarget.cpp.o tools/lldb/source/API/CMakeFiles/liblldb.dir/SBThread.cpp.o tools/lldb/source/API/CMakeFiles/liblldb.dir/SBThreadCollection.cpp.o tools/lldb/source/API/CMakeFiles/liblldb.dir/SBThreadPlan.cpp.o tools/lldb/source/API/CMakeFiles/liblldb.dir/SBTrace.cpp.o tools/lldb/source/API/CMakeFiles/liblldb.dir/SBTraceOptions.cpp.o tools/lldb/source/API/CMakeFiles/liblldb.dir/SBType.cpp.o tools/lldb/source/API/CMakeFiles/liblldb.dir/SBTypeCategory.cpp.o tools/lldb/source/API/CMakeFiles/liblldb.dir/SBTypeEnumMember.cpp.o tools/lldb/source/API/CMakeFiles/liblldb.dir/SBTypeFilter.cpp.o tools/lldb/source/API/CMakeFiles/liblldb.dir/SBTypeFormat.cpp.o tools/lldb/source/API/CMakeFiles/liblldb.dir/SBTypeNameSpecifier.cpp.o tools/lldb/source/API/CMakeFiles/liblldb.dir/SBTypeSummary.cpp.o tools/lldb/source/API/CMakeFiles/liblldb.dir/SBTypeSynthetic.cpp.o tools/lldb/source/API/CMakeFiles/liblldb.dir/SBValue.cpp.o tools/lldb/source/API/CMakeFiles/liblldb.dir/SBValueList.cpp.o tools/lldb/source/API/CMakeFiles/liblldb.dir/SBVariablesOptions.cpp.o tools/lldb/source/API/CMakeFiles/liblldb.dir/SBWatchpoint.cpp.o tools/lldb/source/API/CMakeFiles/liblldb.dir/SBUnixSignals.cpp.o tools/lldb/source/API/CMakeFiles/liblldb.dir/SystemInitializerFull.cpp.o tools/lldb/source/API/CMakeFiles/liblldb.dir/__/__/bindings/LLDBWrapPython.cpp.o  -Wl,-rpath,@loader_path/../lib  lib/liblldbBase.a  lib/liblldbBreakpoint.a  lib/liblldbCore.a  lib/liblldbDataFormatters.a  lib/liblldbExpression.a  lib/liblldbHost.a  lib/liblldbInitialization.a  lib/liblldbInterpreter.a  lib/liblldbSymbol.a  lib/liblldbTarget.a  lib/liblldbUtility.a  lib/liblldbPluginABIAArch64.a  lib/liblldbPluginABIARM.a  lib/liblldbPluginABIHexagon.a  lib/liblldbPluginABIMips.a  lib/liblldbPluginABIPowerPC.a  lib/liblldbPluginABISystemZ.a  lib/liblldbPluginABIX86.a  lib/liblldbPluginArchitectureArm.a  lib/liblldbPluginArchitectureMips.a  lib/liblldbPluginArchitecturePPC64.a  lib/liblldbPluginDisassemblerLLVMC.a  lib/liblldbPluginDynamicLoaderDarwinKernel.a  lib/liblldbPluginDynamicLoaderMacOSXDYLD.a  lib/liblldbPluginDynamicLoaderPosixDYLD.a  lib/liblldbPluginDynamicLoaderStatic.a  lib/liblldbPluginDynamicLoaderHexagonDYLD.a  lib/liblldbPluginDynamicLoaderWindowsDYLD.a  lib/liblldbPluginDynamicLoaderWasmDYLD.a  lib/liblldbPluginInstructionARM.a  lib/liblldbPluginInstructionARM64.a  lib/liblldbPluginInstructionMIPS.a  lib/liblldbPluginInstructionMIPS64.a  lib/liblldbPluginInstructionPPC64.a  lib/liblldbPluginInstrumentationRuntimeASan.a  lib/liblldbPluginInstrumentationRuntimeMainThreadChecker.a  lib/liblldbPluginInstrumentationRuntimeTSan.a  lib/liblldbPluginInstrumentationRuntimeUBSan.a  lib/liblldbPluginJITLoaderGDB.a  lib/liblldbPluginCPlusPlusLanguage.a  lib/liblldbPluginObjCLanguage.a  lib/liblldbPluginObjCPlusPlusLanguage.a  lib/liblldbPluginCXXItaniumABI.a  lib/liblldbPluginAppleObjCRuntime.a  lib/liblldbPluginRenderScriptRuntime.a  lib/liblldbPluginMemoryHistoryASan.a  lib/liblldbPluginObjectContainerBSDArchive.a  lib/liblldbPluginObjectContainerMachOArchive.a  lib/liblldbPluginObjectFileBreakpad.a  lib/liblldbPluginObjectFileELF.a  lib/liblldbPluginObjectFileMachO.a  lib/liblldbPluginObjectFilePECOFF.a  lib/liblldbPluginObjectFileJIT.a  lib/liblldbPluginObjectFileWasm.a  lib/liblldbPluginOperatingSystemPython.a  lib/liblldbPluginPlatformLinux.a  lib/liblldbPluginPlatformFreeBSD.a  lib/liblldbPluginPlatformNetBSD.a  lib/liblldbPluginPlatformOpenBSD.a  lib/liblldbPluginPlatformMacOSX.a  lib/liblldbPluginPlatformWindows.a  lib/liblldbPluginPlatformGDB.a  lib/liblldbPluginPlatformAndroid.a  lib/liblldbPluginProcessMacOSXKernel.a  lib/liblldbPluginProcessGDBRemote.a  lib/liblldbPluginProcessElfCore.a  lib/liblldbPluginProcessMachCore.a  lib/liblldbPluginProcessMinidump.a  lib/liblldbPluginScriptInterpreterNone.a  lib/liblldbPluginScriptInterpreterPython.a  lib/liblldbPluginStructuredDataDarwinLog.a  lib/liblldbPluginSymbolFileBreakpad.a  lib/liblldbPluginSymbolFileDWARF.a  lib/liblldbPluginSymbolFileSymtab.a  lib/liblldbPluginSymbolFilePDB.a  lib/liblldbPluginSystemRuntimeMacOSX.a  lib/liblldbPluginSymbolVendorMacOSX.a  lib/liblldbPluginSymbolVendorELF.a  lib/liblldbPluginSymbolVendorWasm.a  lib/liblldbPluginTypeSystemClang.a  lib/liblldbPluginUnwindAssemblyInstEmulation.a  lib/liblldbPluginUnwindAssemblyX86.a  lib/libLLVMSupport.a  -lcompression  lib/libLLVMAArch64CodeGen.a  lib/libLLVMAArch64AsmParser.a  lib/libLLVMAArch64Disassembler.a  lib/libLLVMAArch64Desc.a  lib/libLLVMAArch64Info.a  lib/libLLVMAArch64Utils.a  lib/libLLVMAMDGPUCodeGen.a  lib/libLLVMMIRParser.a  lib/libLLVMAMDGPUAsmParser.a  lib/libLLVMAMDGPUDisassembler.a  lib/libLLVMAMDGPUDesc.a  lib/libLLVMAMDGPUInfo.a  lib/libLLVMAMDGPUUtils.a  lib/libLLVMARMCodeGen.a  lib/libLLVMARMAsmParser.a  lib/libLLVMARMDisassembler.a  lib/libLLVMARMDesc.a  lib/libLLVMARMInfo.a  lib/libLLVMARMUtils.a  lib/libLLVMAVRCodeGen.a  lib/libLLVMAVRAsmParser.a  lib/libLLVMAVRDesc.a  lib/libLLVMAVRDisassembler.a  lib/libLLVMAVRInfo.a  lib/libLLVMBPFCodeGen.a  lib/libLLVMBPFAsmParser.a  lib/libLLVMBPFDesc.a  lib/libLLVMBPFDisassembler.a  lib/libLLVMBPFInfo.a  lib/libLLVMHexagonCodeGen.a  lib/libLLVMHexagonAsmParser.a  lib/libLLVMHexagonDisassembler.a  lib/libLLVMHexagonDesc.a  lib/libLLVMHexagonInfo.a  lib/libLLVMLanaiCodeGen.a  lib/libLLVMLanaiAsmParser.a  lib/libLLVMLanaiDisassembler.a  lib/libLLVMLanaiDesc.a  lib/libLLVMLanaiInfo.a  lib/libLLVMMSP430CodeGen.a  lib/libLLVMMSP430AsmParser.a  lib/libLLVMMSP430Desc.a  lib/libLLVMMSP430Disassembler.a  lib/libLLVMMSP430Info.a  lib/libLLVMNVPTXCodeGen.a  lib/libLLVMNVPTXDesc.a  lib/libLLVMNVPTXInfo.a  lib/libLLVMPowerPCCodeGen.a  lib/libLLVMPowerPCAsmParser.a  lib/libLLVMPowerPCDesc.a  lib/libLLVMPowerPCDisassembler.a  lib/libLLVMPowerPCInfo.a  lib/libLLVMRISCVCodeGen.a  lib/libLLVMRISCVAsmParser.a  lib/libLLVMRISCVDesc.a  lib/libLLVMRISCVDisassembler.a  lib/libLLVMRISCVInfo.a  lib/libLLVMRISCVUtils.a  lib/libLLVMSparcCodeGen.a  lib/libLLVMSparcAsmParser.a  lib/libLLVMSparcDesc.a  lib/libLLVMSparcDisassembler.a  lib/libLLVMSparcInfo.a  lib/libLLVMSystemZCodeGen.a  lib/libLLVMSystemZAsmParser.a  lib/libLLVMSystemZDisassembler.a  lib/libLLVMSystemZDesc.a  lib/libLLVMSystemZInfo.a  lib/libLLVMWebAssemblyCodeGen.a  lib/libLLVMWebAssemblyAsmParser.a  lib/libLLVMWebAssemblyDisassembler.a  lib/libLLVMWebAssemblyDesc.a  lib/libLLVMWebAssemblyInfo.a  lib/libLLVMX86CodeGen.a  lib/libLLVMCFGuard.a  lib/libLLVMX86AsmParser.a  lib/libLLVMX86Desc.a  lib/libLLVMX86Disassembler.a  lib/libLLVMX86Info.a  lib/libLLVMXCoreCodeGen.a  lib/libLLVMXCoreDesc.a  lib/libLLVMXCoreDisassembler.a  lib/libLLVMXCoreInfo.a  lib/libLLVMMipsCodeGen.a  lib/libLLVMAsmPrinter.a  lib/libLLVMGlobalISel.a  lib/libLLVMSelectionDAG.a  lib/libLLVMMipsAsmParser.a  lib/libLLVMMipsDesc.a  lib/libLLVMMipsDisassembler.a  lib/libLLVMMipsInfo.a  lib/liblldbPluginPlatformLinux.a  lib/liblldbPluginPlatformGDB.a  lib/liblldbPluginDynamicLoaderStatic.a  lib/liblldbPluginDynamicLoaderDarwinKernel.a  lib/liblldbPluginPlatformMacOSX.a  lib/liblldbPluginPlatformPOSIX.a  lib/liblldbPluginPlatformMacOSXObjCXX.a  lib/liblldbPluginDynamicLoaderMacOSXDYLD.a  lib/liblldbPluginDynamicLoaderPosixDYLD.a  lib/liblldbPluginProcessElfCore.a  lib/liblldbPluginDynamicLoaderPosixDYLD.a  lib/liblldbPluginProcessElfCore.a  /usr/local/Cellar/python/3.7.1/Frameworks/Python.framework/Versions/3.7/lib/libpython3.7m.dylib  lib/liblldbPluginObjectFileBreakpad.a  lib/liblldbPluginObjectFileMachO.a  lib/liblldbPluginObjectFileELF.a  lib/liblldbPluginObjectFileWasm.a  lib/liblldbBreakpoint.a  lib/liblldbCore.a  lib/liblldbDataFormatters.a  lib/liblldbExpression.a  lib/liblldbInterpreter.a  lib/liblldbSymbol.a  lib/liblldbTarget.a  lib/liblldbPluginCPlusPlusLanguage.a  lib/liblldbPluginObjCLanguage.a  lib/liblldbPluginAppleObjCRuntime.a  lib/liblldbPluginRenderScriptRuntime.a  lib/liblldbPluginObjectFileJIT.a  lib/liblldbPluginSymbolFileDWARF.a  lib/liblldbPluginSymbolFilePDB.a  lib/liblldbPluginTypeSystemClang.a  lib/liblldbCommands.a  lib/liblldbPluginExpressionParserClang.a  lib/liblldbPluginProcessUtility.a  lib/liblldbPluginClangCommon.a  lib/liblldbPluginCPPRuntime.a  lib/liblldbPluginSymbolFileNativePDB.a  lib/liblldbPluginObjCRuntime.a  lib/liblldbBreakpoint.a  lib/liblldbCore.a  lib/liblldbDataFormatters.a  lib/liblldbExpression.a  lib/liblldbInterpreter.a  lib/liblldbSymbol.a  lib/liblldbTarget.a  lib/liblldbPluginCPlusPlusLanguage.a  lib/liblldbPluginObjCLanguage.a  lib/liblldbPluginAppleObjCRuntime.a  lib/liblldbPluginRenderScriptRuntime.a  lib/liblldbPluginObjectFileJIT.a  lib/liblldbPluginSymbolFileDWARF.a  lib/liblldbPluginSymbolFilePDB.a  lib/liblldbPluginTypeSystemClang.a  lib/liblldbCommands.a  lib/liblldbPluginExpressionParserClang.a  lib/liblldbPluginProcessUtility.a  lib/liblldbPluginClangCommon.a  lib/liblldbPluginCPPRuntime.a  lib/liblldbPluginSymbolFileNativePDB.a  lib/liblldbPluginObjCRuntime.a  lib/liblldbBreakpoint.a  lib/liblldbCore.a  lib/liblldbDataFormatters.a  lib/liblldbExpression.a  lib/liblldbInterpreter.a  lib/liblldbSymbol.a  lib/liblldbTarget.a  lib/liblldbPluginCPlusPlusLanguage.a  lib/liblldbPluginObjCLanguage.a  lib/liblldbPluginAppleObjCRuntime.a  lib/liblldbPluginRenderScriptRuntime.a  lib/liblldbPluginObjectFileJIT.a  lib/liblldbPluginSymbolFileDWARF.a  lib/liblldbPluginSymbolFilePDB.a  lib/liblldbPluginTypeSystemClang.a  lib/liblldbCommands.a  lib/liblldbPluginExpressionParserClang.a  lib/liblldbPluginProcessUtility.a  lib/liblldbPluginClangCommon.a  lib/liblldbPluginCPPRuntime.a  lib/liblldbPluginSymbolFileNativePDB.a  lib/liblldbPluginObjCRuntime.a  lib/liblldbBreakpoint.a  lib/liblldbCore.a  lib/liblldbDataFormatters.a  lib/liblldbExpression.a  lib/liblldbInterpreter.a  lib/liblldbSymbol.a  lib/liblldbTarget.a  lib/liblldbPluginCPlusPlusLanguage.a  lib/liblldbPluginObjCLanguage.a  lib/liblldbPluginAppleObjCRuntime.a  lib/liblldbPluginRenderScriptRuntime.a  lib/liblldbPluginObjectFileJIT.a  lib/liblldbPluginSymbolFileDWARF.a  lib/liblldbPluginSymbolFilePDB.a  lib/liblldbPluginTypeSystemClang.a  lib/liblldbCommands.a  lib/liblldbPluginExpressionParserClang.a  lib/liblldbPluginProcessUtility.a  lib/liblldbPluginClangCommon.a  lib/liblldbPluginCPPRuntime.a  lib/liblldbPluginSymbolFileNativePDB.a  lib/liblldbPluginObjCRuntime.a  lib/liblldbBreakpoint.a  lib/liblldbCore.a  lib/liblldbDataFormatters.a  lib/liblldbExpression.a  lib/liblldbInterpreter.a  lib/liblldbSymbol.a  lib/liblldbTarget.a  lib/liblldbPluginCPlusPlusLanguage.a  lib/liblldbPluginObjCLanguage.a  lib/liblldbPluginAppleObjCRuntime.a  lib/liblldbPluginRenderScriptRuntime.a  lib/liblldbPluginObjectFileJIT.a  lib/liblldbPluginSymbolFileDWARF.a  lib/liblldbPluginSymbolFilePDB.a  lib/liblldbPluginTypeSystemClang.a  lib/liblldbCommands.a  lib/liblldbPluginExpressionParserClang.a  lib/liblldbPluginProcessUtility.a  lib/liblldbPluginClangCommon.a  lib/liblldbPluginCPPRuntime.a  lib/liblldbPluginSymbolFileNativePDB.a  lib/liblldbPluginObjCRuntime.a  /usr/lib/libcurses.dylib  /usr/lib/libform.dylib  /usr/lib/libpanel.dylib  lib/libLLVMDebugInfoDWARF.a  lib/liblldbBase.a  lib/libLLVMMCJIT.a  lib/libLLVMExecutionEngine.a  lib/libLLVMRuntimeDyld.a  lib/libclangCodeGen.a  lib/libLLVMCoverage.a  lib/libLLVMLTO.a  lib/libLLVMCodeGen.a  lib/libLLVMExtensions.a  lib/libLLVMObjCARCOpts.a  lib/libLLVMPasses.a  lib/libLLVMTarget.a  lib/libLLVMCoroutines.a  lib/libLLVMipo.a  lib/libLLVMIRReader.a  lib/libLLVMAsmParser.a  lib/libLLVMVectorize.a  lib/libLLVMBitWriter.a  lib/libLLVMInstrumentation.a  lib/libLLVMLinker.a  lib/libLLVMScalarOpts.a  lib/libLLVMAggressiveInstCombine.a  lib/libLLVMInstCombine.a  lib/libclangRewriteFrontend.a  lib/libclangFrontend.a  lib/libclangDriver.a  lib/libLLVMOption.a  lib/libclangParse.a  lib/libclangRewrite.a  lib/libclangSerialization.a  lib/libclangSema.a  lib/libclangEdit.a  lib/libclangAnalysis.a  lib/libclangASTMatchers.a  lib/liblldbHost.a  /usr/lib/libxml2.dylib  /usr/local/lib/liblzma.dylib  /usr/lib/libedit.dylib  lib/liblldbHostMacOSXObjCXX.a  lib/libclangAST.a  lib/libLLVMFrontendOpenMP.a  lib/libLLVMTransformUtils.a  lib/libLLVMAnalysis.a  lib/libLLVMProfileData.a  lib/libLLVMDebugInfoPDB.a  lib/libLLVMObject.a  lib/libLLVMBitReader.a  lib/libLLVMMCParser.a  lib/libLLVMTextAPI.a  lib/libclangLex.a  lib/libclangBasic.a  lib/libLLVMCore.a  lib/libLLVMRemarks.a  lib/libLLVMBitstreamReader.a  lib/liblldbUtility.a  -framework  Foundation  -framework  CoreFoundation  -framework  CoreServices  -framework  Security  lib/libLLVMMCDisassembler.a  lib/libLLVMMC.a  lib/libLLVMBinaryFormat.a  lib/libLLVMDebugInfoCodeView.a  lib/libLLVMDebugInfoMSF.a  lib/libLLVMSupport.a  lib/libLLVMDemangle.a  -lz  -lcurses  -lm && :
[5145/5149] /usr/local/Cellar/cmake/3.17.2/bin/cmake -E cmake_symlink_library lib/liblldb.12.0.99git.dylib lib/liblldb.12.0.99git.dylib lib/liblldb.dylib && :
[5146/5149] cd /Users/buildslave/jenkins/workspace/lldb-cmake/lldb-build/tools/lldb && /usr/local/Cellar/cmake/3.17.2/bin/cmake -E make_directory /Users/buildslave/jenkins/workspace/lldb-cmake/lldb-build/./lib/python3.7/site-packages/lldb
[5147/5149] : && /Users/buildslave/jenkins/workspace/lldb-cmake/host-compiler/bin/clang++  -Wdocumentation -fPIC -fvisibility-inlines-hidden -Werror=date-time -Werror=unguarded-availability-new -fmodules -fmodules-cache-path=/Users/buildslave/jenkins/workspace/lldb-cmake/lldb-build/module.cache -fcxx-modules -Xclang -fmodules-local-submodule-visibility -Wall -Wextra -Wno-unused-parameter -Wwrite-strings -Wcast-qual -Wmissing-field-initializers -pedantic -Wno-long-long -Wimplicit-fallthrough -Wcovered-switch-default -Wno-noexcept-type -Wnon-virtual-dtor -Wdelete-non-virtual-dtor -Wsuggest-override -Wstring-conversion -fdiagnostics-color -Wno-deprecated-declarations -Wno-unknown-pragmas -Wno-strict-aliasing -Wno-deprecated-register -Wno-vla-extension -O3  -isysroot /Applications/Xcode.app/Contents/Developer/Platforms/MacOSX.platform/Developer/SDKs/MacOSX10.15.sdk -Wl,-search_paths_first -Wl,-headerpad_max_install_names -Wl,-sectcreate,__TEXT,__info_plist,/Users/buildslave/jenkins/workspace/lldb-cmake/lldb-build/tools/lldb/tools/lldb-vscode/lldb-vscode-Info.plist    -Wl,-dead_strip tools/lldb/tools/lldb-vscode/CMakeFiles/lldb-vscode.dir/lldb-vscode.cpp.o tools/lldb/tools/lldb-vscode/CMakeFiles/lldb-vscode.dir/BreakpointBase.cpp.o tools/lldb/tools/lldb-vscode/CMakeFiles/lldb-vscode.dir/ExceptionBreakpoint.cpp.o tools/lldb/tools/lldb-vscode/CMakeFiles/lldb-vscode.dir/FunctionBreakpoint.cpp.o tools/lldb/tools/lldb-vscode/CMakeFiles/lldb-vscode.dir/IOStream.cpp.o tools/lldb/tools/lldb-vscode/CMakeFiles/lldb-vscode.dir/JSONUtils.cpp.o tools/lldb/tools/lldb-vscode/CMakeFiles/lldb-vscode.dir/LLDBUtils.cpp.o tools/lldb/tools/lldb-vscode/CMakeFiles/lldb-vscode.dir/SourceBreakpoint.cpp.o tools/lldb/tools/lldb-vscode/CMakeFiles/lldb-vscode.dir/VSCode.cpp.o  -o bin/lldb-vscode  -Wl,-rpath,@loader_path/../lib  lib/libLLVMSupport.a  lib/libLLVMOption.a  lib/libLLVMSupport.a  lib/liblldb.12.0.99git.dylib  -lpthread  -lz  -lcurses  -lm  lib/libLLVMDemangle.a && :
[5148/5149] cd /Users/buildslave/jenkins/workspace/lldb-cmake/lldb-build/tools/lldb && /usr/local/Cellar/cmake/3.17.2/bin/cmake -E copy /Users/buildslave/jenkins/workspace/lldb-cmake/llvm-project/lldb/third_party/Python/module/six/six.py /Users/buildslave/jenkins/workspace/lldb-cmake/lldb-build/./lib/python3.7/site-packages/lldb/../six.py && cd /Users/buildslave/jenkins/workspace/lldb-cmake/lldb-build/tools/lldb && /usr/local/Cellar/cmake/3.17.2/bin/cmake -E copy /Users/buildslave/jenkins/workspace/lldb-cmake/lldb-build/tools/lldb/bindings/lldb.py /Users/buildslave/jenkins/workspace/lldb-cmake/lldb-build/./lib/python3.7/site-packages/lldb/__init__.py && cd /Users/buildslave/jenkins/workspace/lldb-cmake/lldb-build/tools/lldb && /usr/local/Cellar/cmake/3.17.2/bin/cmake -E copy /Users/buildslave/jenkins/workspace/lldb-cmake/llvm-project/lldb/source/Interpreter/embedded_interpreter.py /Users/buildslave/jenkins/workspace/lldb-cmake/lldb-build/./lib/python3.7/site-packages/lldb && cd /Users/buildslave/jenkins/workspace/lldb-cmake/lldb-build/lib/python3.7/site-packages/lldb && /usr/local/Cellar/cmake/3.17.2/bin/cmake -E make_directory formatters/cpp && /usr/local/Cellar/cmake/3.17.2/bin/cmake -E copy /Users/buildslave/jenkins/workspace/lldb-cmake/llvm-project/lldb/examples/synthetic/gnu_libstdcpp.py /Users/buildslave/jenkins/workspace/lldb-cmake/llvm-project/lldb/examples/synthetic/libcxx.py formatters/cpp && /usr/local/Frameworks/Python.framework/Versions/3.7/bin/python3.7 /Users/buildslave/jenkins/workspace/lldb-cmake/llvm-project/lldb/bindings/python/createPythonInit.py formatters/cpp /Users/buildslave/jenkins/workspace/lldb-cmake/llvm-project/lldb/examples/synthetic/gnu_libstdcpp.py /Users/buildslave/jenkins/workspace/lldb-cmake/llvm-project/lldb/examples/synthetic/libcxx.py && cd /Users/buildslave/jenkins/workspace/lldb-cmake/lldb-build/lib/python3.7/site-packages/lldb && /usr/local/Cellar/cmake/3.17.2/bin/cmake -E make_directory formatters && /usr/local/Cellar/cmake/3.17.2/bin/cmake -E copy /Users/buildslave/jenkins/workspace/lldb-cmake/llvm-project/lldb/examples/summaries/cocoa/cache.py /Users/buildslave/jenkins/workspace/lldb-cmake/llvm-project/lldb/examples/summaries/synth.py /Users/buildslave/jenkins/workspace/lldb-cmake/llvm-project/lldb/examples/summaries/cocoa/metrics.py /Users/buildslave/jenkins/workspace/lldb-cmake/llvm-project/lldb/examples/summaries/cocoa/attrib_fromdict.py /Users/buildslave/jenkins/workspace/lldb-cmake/llvm-project/lldb/examples/summaries/cocoa/Logger.py formatters && /usr/local/Frameworks/Python.framework/Versions/3.7/bin/python3.7 /Users/buildslave/jenkins/workspace/lldb-cmake/llvm-project/lldb/bindings/python/createPythonInit.py formatters /Users/buildslave/jenkins/workspace/lldb-cmake/llvm-project/lldb/examples/summaries/cocoa/cache.py /Users/buildslave/jenkins/workspace/lldb-cmake/llvm-project/lldb/examples/summaries/synth.py /Users/buildslave/jenkins/workspace/lldb-cmake/llvm-project/lldb/examples/summaries/cocoa/metrics.py /Users/buildslave/jenkins/workspace/lldb-cmake/llvm-project/lldb/examples/summaries/cocoa/attrib_fromdict.py /Users/buildslave/jenkins/workspace/lldb-cmake/llvm-project/lldb/examples/summaries/cocoa/Logger.py && cd /Users/buildslave/jenkins/workspace/lldb-cmake/lldb-build/lib/python3.7/site-packages/lldb && /usr/local/Cellar/cmake/3.17.2/bin/cmake -E make_directory utils && /usr/local/Cellar/cmake/3.17.2/bin/cmake -E copy /Users/buildslave/jenkins/workspace/lldb-cmake/llvm-project/lldb/examples/python/in_call_stack.py /Users/buildslave/jenkins/workspace/lldb-cmake/llvm-project/lldb/examples/python/symbolication.py utils && /usr/local/Frameworks/Python.framework/Versions/3.7/bin/python3.7 /Users/buildslave/jenkins/workspace/lldb-cmake/llvm-project/lldb/bindings/python/createPythonInit.py utils /Users/buildslave/jenkins/workspace/lldb-cmake/llvm-project/lldb/examples/python/in_call_stack.py /Users/buildslave/jenkins/workspace/lldb-cmake/llvm-project/lldb/examples/python/symbolication.py && cd /Users/buildslave/jenkins/workspace/lldb-cmake/lldb-build/lib/python3.7/site-packages/lldb && /usr/local/Cellar/cmake/3.17.2/bin/cmake -E make_directory macosx && /usr/local/Cellar/cmake/3.17.2/bin/cmake -E copy /Users/buildslave/jenkins/workspace/lldb-cmake/llvm-project/lldb/examples/python/crashlog.py /Users/buildslave/jenkins/workspace/lldb-cmake/llvm-project/lldb/examples/darwin/heap_find/heap.py macosx && /usr/local/Frameworks/Python.framework/Versions/3.7/bin/python3.7 /Users/buildslave/jenkins/workspace/lldb-cmake/llvm-project/lldb/bindings/python/createPythonInit.py macosx /Users/buildslave/jenkins/workspace/lldb-cmake/llvm-project/lldb/examples/python/crashlog.py /Users/buildslave/jenkins/workspace/lldb-cmake/llvm-project/lldb/examples/darwin/heap_find/heap.py && cd /Users/buildslave/jenkins/workspace/lldb-cmake/lldb-build/lib/python3.7/site-packages/lldb && /usr/local/Cellar/cmake/3.17.2/bin/cmake -E make_directory macosx/heap && /usr/local/Cellar/cmake/3.17.2/bin/cmake -E copy /Users/buildslave/jenkins/workspace/lldb-cmake/llvm-project/lldb/examples/darwin/heap_find/heap/heap_find.cpp /Users/buildslave/jenkins/workspace/lldb-cmake/llvm-project/lldb/examples/darwin/heap_find/heap/Makefile macosx/heap && cd /Users/buildslave/jenkins/workspace/lldb-cmake/lldb-build/lib/python3.7/site-packages/lldb && /usr/local/Cellar/cmake/3.17.2/bin/cmake -E make_directory diagnose && /usr/local/Cellar/cmake/3.17.2/bin/cmake -E copy /Users/buildslave/jenkins/workspace/lldb-cmake/llvm-project/lldb/examples/python/diagnose_unwind.py /Users/buildslave/jenkins/workspace/lldb-cmake/llvm-project/lldb/examples/python/diagnose_nsstring.py diagnose && /usr/local/Frameworks/Python.framework/Versions/3.7/bin/python3.7 /Users/buildslave/jenkins/workspace/lldb-cmake/llvm-project/lldb/bindings/python/createPythonInit.py diagnose /Users/buildslave/jenkins/workspace/lldb-cmake/llvm-project/lldb/examples/python/diagnose_unwind.py /Users/buildslave/jenkins/workspace/lldb-cmake/llvm-project/lldb/examples/python/diagnose_nsstring.py && cd /Users/buildslave/jenkins/workspace/lldb-cmake/lldb-build/lib/python3.7/site-packages/lldb && /usr/local/Cellar/cmake/3.17.2/bin/cmake -E create_symlink ../../../liblldb.dylib _lldb.so && cd /Users/buildslave/jenkins/workspace/lldb-cmake/lldb-build/lib/python3.7/site-packages/lldb && /usr/local/Cellar/cmake/3.17.2/bin/cmake -E create_symlink ../../../../bin/lldb-argdumper lldb-argdumper
[5149/5149] : && /Users/buildslave/jenkins/workspace/lldb-cmake/host-compiler/bin/clang++  -Wdocumentation -fPIC -fvisibility-inlines-hidden -Werror=date-time -Werror=unguarded-availability-new -fmodules -fmodules-cache-path=/Users/buildslave/jenkins/workspace/lldb-cmake/lldb-build/module.cache -fcxx-modules -Xclang -fmodules-local-submodule-visibility -Wall -Wextra -Wno-unused-parameter -Wwrite-strings -Wcast-qual -Wmissing-field-initializers -pedantic -Wno-long-long -Wimplicit-fallthrough -Wcovered-switch-default -Wno-noexcept-type -Wnon-virtual-dtor -Wdelete-non-virtual-dtor -Wsuggest-override -Wstring-conversion -fdiagnostics-color -Wno-deprecated-declarations -Wno-unknown-pragmas -Wno-strict-aliasing -Wno-deprecated-register -Wno-vla-extension -O3  -isysroot /Applications/Xcode.app/Contents/Developer/Platforms/MacOSX.platform/Developer/SDKs/MacOSX10.15.sdk -Wl,-search_paths_first -Wl,-headerpad_max_install_names -Wl,-sectcreate,__TEXT,__info_plist,/Users/buildslave/jenkins/workspace/lldb-cmake/lldb-build/tools/lldb/tools/driver/lldb-Info.plist    -Wl,-dead_strip tools/lldb/tools/driver/CMakeFiles/lldb.dir/Driver.cpp.o tools/lldb/tools/driver/CMakeFiles/lldb.dir/Platform.cpp.o  -o bin/lldb  -Wl,-rpath,@loader_path/../lib  lib/libLLVMOption.a  lib/libLLVMSupport.a  lib/liblldb.12.0.99git.dylib  -lz  -lcurses  -lm  lib/libLLVMDemangle.a && :
Completed at: 2020-08-09T22:35:08
@@@@@@
[Pipeline] }
[Pipeline] // timeout
[Pipeline] }
[Pipeline] // stage
[Pipeline] stage
[Pipeline] { (Test)
[Pipeline] timeout
Timeout set to expire in 1 hr 0 min
[Pipeline] {
[Pipeline] sh
+ set -u
+ export PATH=/usr/local/bin:/usr/local/sbin:/usr/bin:/bin:/usr/sbin:/sbin:/usr/bin:/usr/local/bin
+ PATH=/usr/local/bin:/usr/local/sbin:/usr/bin:/bin:/usr/sbin:/sbin:/usr/bin:/usr/local/bin
+ export LLDB_CAPTURE_REPRODUCER=1
+ LLDB_CAPTURE_REPRODUCER=1
+ rm -rf test/results.xml
+ python llvm-zorg/zorg/jenkins/monorepo_build.py lldb-cmake testlong
You are using pip version 18.1, however version 20.2.1 is available.
You should consider upgrading via the 'pip install --upgrade pip' command.
You are using pip version 18.1, however version 20.2.1 is available.
You should consider upgrading via the 'pip install --upgrade pip' command.
Dependency met os_version v10.15.5
Dependency met brew cmake v3.17.2
Dependency met brew ninja v1.8.2
Dependency met pip psutil v5.4.5
Dependency met pip six v1.11.0
Dependency met xcode v11.5
Clean

Hide Details

@@@ Clean @@@ Removing module cache: /Users/buildslave/jenkins/workspace/lldb-cmake/lldb-build/module.cache Completed at: 2020-08-09T22:36:45 @@@@@@
Run Debug Info Tests

Hide Details

@@@ Run Debug Info Tests @@@ cd /Users/buildslave/jenkins/workspace/lldb-cmake/lldb-build '/usr/local/bin/ninja' '-v' 'check-debuginfo' [1/3] cd /Users/buildslave/jenkins/workspace/lldb-cmake/lldb-build/tools/lldb && /usr/local/Cellar/cmake/3.17.2/bin/cmake -E make_directory /Users/buildslave/jenkins/workspace/lldb-cmake/lldb-build/./lib/python3.7/site-packages/lldb [2/3] cd /Users/buildslave/jenkins/workspace/lldb-cmake/lldb-build/tools/lldb && /usr/local/Cellar/cmake/3.17.2/bin/cmake -E copy /Users/buildslave/jenkins/workspace/lldb-cmake/llvm-project/lldb/third_party/Python/module/six/six.py /Users/buildslave/jenkins/workspace/lldb-cmake/lldb-build/./lib/python3.7/site-packages/lldb/../six.py && cd /Users/buildslave/jenkins/workspace/lldb-cmake/lldb-build/tools/lldb && /usr/local/Cellar/cmake/3.17.2/bin/cmake -E copy /Users/buildslave/jenkins/workspace/lldb-cmake/lldb-build/tools/lldb/bindings/lldb.py /Users/buildslave/jenkins/workspace/lldb-cmake/lldb-build/./lib/python3.7/site-packages/lldb/__init__.py && cd /Users/buildslave/jenkins/workspace/lldb-cmake/lldb-build/tools/lldb && /usr/local/Cellar/cmake/3.17.2/bin/cmake -E copy /Users/buildslave/jenkins/workspace/lldb-cmake/llvm-project/lldb/source/Interpreter/embedded_interpreter.py /Users/buildslave/jenkins/workspace/lldb-cmake/lldb-build/./lib/python3.7/site-packages/lldb && cd /Users/buildslave/jenkins/workspace/lldb-cmake/lldb-build/lib/python3.7/site-packages/lldb && /usr/local/Cellar/cmake/3.17.2/bin/cmake -E make_directory formatters/cpp && /usr/local/Cellar/cmake/3.17.2/bin/cmake -E copy /Users/buildslave/jenkins/workspace/lldb-cmake/llvm-project/lldb/examples/synthetic/gnu_libstdcpp.py /Users/buildslave/jenkins/workspace/lldb-cmake/llvm-project/lldb/examples/synthetic/libcxx.py formatters/cpp && /usr/local/Frameworks/Python.framework/Versions/3.7/bin/python3.7 /Users/buildslave/jenkins/workspace/lldb-cmake/llvm-project/lldb/bindings/python/createPythonInit.py formatters/cpp /Users/buildslave/jenkins/workspace/lldb-cmake/llvm-project/lldb/examples/synthetic/gnu_libstdcpp.py /Users/buildslave/jenkins/workspace/lldb-cmake/llvm-project/lldb/examples/synthetic/libcxx.py && cd /Users/buildslave/jenkins/workspace/lldb-cmake/lldb-build/lib/python3.7/site-packages/lldb && /usr/local/Cellar/cmake/3.17.2/bin/cmake -E make_directory formatters && /usr/local/Cellar/cmake/3.17.2/bin/cmake -E copy /Users/buildslave/jenkins/workspace/lldb-cmake/llvm-project/lldb/examples/summaries/cocoa/cache.py /Users/buildslave/jenkins/workspace/lldb-cmake/llvm-project/lldb/examples/summaries/synth.py /Users/buildslave/jenkins/workspace/lldb-cmake/llvm-project/lldb/examples/summaries/cocoa/metrics.py /Users/buildslave/jenkins/workspace/lldb-cmake/llvm-project/lldb/examples/summaries/cocoa/attrib_fromdict.py /Users/buildslave/jenkins/workspace/lldb-cmake/llvm-project/lldb/examples/summaries/cocoa/Logger.py formatters && /usr/local/Frameworks/Python.framework/Versions/3.7/bin/python3.7 /Users/buildslave/jenkins/workspace/lldb-cmake/llvm-project/lldb/bindings/python/createPythonInit.py formatters /Users/buildslave/jenkins/workspace/lldb-cmake/llvm-project/lldb/examples/summaries/cocoa/cache.py /Users/buildslave/jenkins/workspace/lldb-cmake/llvm-project/lldb/examples/summaries/synth.py /Users/buildslave/jenkins/workspace/lldb-cmake/llvm-project/lldb/examples/summaries/cocoa/metrics.py /Users/buildslave/jenkins/workspace/lldb-cmake/llvm-project/lldb/examples/summaries/cocoa/attrib_fromdict.py /Users/buildslave/jenkins/workspace/lldb-cmake/llvm-project/lldb/examples/summaries/cocoa/Logger.py && cd /Users/buildslave/jenkins/workspace/lldb-cmake/lldb-build/lib/python3.7/site-packages/lldb && /usr/local/Cellar/cmake/3.17.2/bin/cmake -E make_directory utils && /usr/local/Cellar/cmake/3.17.2/bin/cmake -E copy /Users/buildslave/jenkins/workspace/lldb-cmake/llvm-project/lldb/examples/python/in_call_stack.py /Users/buildslave/jenkins/workspace/lldb-cmake/llvm-project/lldb/examples/python/symbolication.py utils && /usr/local/Frameworks/Python.framework/Versions/3.7/bin/python3.7 /Users/buildslave/jenkins/workspace/lldb-cmake/llvm-project/lldb/bindings/python/createPythonInit.py utils /Users/buildslave/jenkins/workspace/lldb-cmake/llvm-project/lldb/examples/python/in_call_stack.py /Users/buildslave/jenkins/workspace/lldb-cmake/llvm-project/lldb/examples/python/symbolication.py && cd /Users/buildslave/jenkins/workspace/lldb-cmake/lldb-build/lib/python3.7/site-packages/lldb && /usr/local/Cellar/cmake/3.17.2/bin/cmake -E make_directory macosx && /usr/local/Cellar/cmake/3.17.2/bin/cmake -E copy /Users/buildslave/jenkins/workspace/lldb-cmake/llvm-project/lldb/examples/python/crashlog.py /Users/buildslave/jenkins/workspace/lldb-cmake/llvm-project/lldb/examples/darwin/heap_find/heap.py macosx && /usr/local/Frameworks/Python.framework/Versions/3.7/bin/python3.7 /Users/buildslave/jenkins/workspace/lldb-cmake/llvm-project/lldb/bindings/python/createPythonInit.py macosx /Users/buildslave/jenkins/workspace/lldb-cmake/llvm-project/lldb/examples/python/crashlog.py /Users/buildslave/jenkins/workspace/lldb-cmake/llvm-project/lldb/examples/darwin/heap_find/heap.py && cd /Users/buildslave/jenkins/workspace/lldb-cmake/lldb-build/lib/python3.7/site-packages/lldb && /usr/local/Cellar/cmake/3.17.2/bin/cmake -E make_directory macosx/heap && /usr/local/Cellar/cmake/3.17.2/bin/cmake -E copy /Users/buildslave/jenkins/workspace/lldb-cmake/llvm-project/lldb/examples/darwin/heap_find/heap/heap_find.cpp /Users/buildslave/jenkins/workspace/lldb-cmake/llvm-project/lldb/examples/darwin/heap_find/heap/Makefile macosx/heap && cd /Users/buildslave/jenkins/workspace/lldb-cmake/lldb-build/lib/python3.7/site-packages/lldb && /usr/local/Cellar/cmake/3.17.2/bin/cmake -E make_directory diagnose && /usr/local/Cellar/cmake/3.17.2/bin/cmake -E copy /Users/buildslave/jenkins/workspace/lldb-cmake/llvm-project/lldb/examples/python/diagnose_unwind.py /Users/buildslave/jenkins/workspace/lldb-cmake/llvm-project/lldb/examples/python/diagnose_nsstring.py diagnose && /usr/local/Frameworks/Python.framework/Versions/3.7/bin/python3.7 /Users/buildslave/jenkins/workspace/lldb-cmake/llvm-project/lldb/bindings/python/createPythonInit.py diagnose /Users/buildslave/jenkins/workspace/lldb-cmake/llvm-project/lldb/examples/python/diagnose_unwind.py /Users/buildslave/jenkins/workspace/lldb-cmake/llvm-project/lldb/examples/python/diagnose_nsstring.py && cd /Users/buildslave/jenkins/workspace/lldb-cmake/lldb-build/lib/python3.7/site-packages/lldb && /usr/local/Cellar/cmake/3.17.2/bin/cmake -E create_symlink ../../../liblldb.dylib _lldb.so && cd /Users/buildslave/jenkins/workspace/lldb-cmake/lldb-build/lib/python3.7/site-packages/lldb && /usr/local/Cellar/cmake/3.17.2/bin/cmake -E create_symlink ../../../../bin/lldb-argdumper lldb-argdumper [2/3] cd /Users/buildslave/jenkins/workspace/lldb-cmake/lldb-build/projects/debuginfo-tests && /usr/local/Frameworks/Python.framework/Versions/3.7/bin/python3.7 /Users/buildslave/jenkins/workspace/lldb-cmake/lldb-build/./bin/llvm-lit -v --time-tests --shuffle --xunit-xml-output=/Users/buildslave/jenkins/workspace/lldb-cmake/test/results.xml -v /Users/buildslave/jenkins/workspace/lldb-cmake/lldb-build/projects/debuginfo-tests -- Testing: 60 tests, 8 workers -- llvm-lit: /Users/buildslave/jenkins/workspace/lldb-cmake/lldb-build/bin/../../llvm-project/llvm/utils/lit/lit/llvm/config.py:345: note: using clang: /Users/buildslave/jenkins/workspace/lldb-cmake/lldb-build/bin/clang llvm-lit: /Users/buildslave/jenkins/workspace/lldb-cmake/lldb-build/bin/../../llvm-project/llvm/utils/lit/lit/llvm/config.py:345: note: using clang++: /Users/buildslave/jenkins/workspace/lldb-cmake/lldb-build/bin/clang++ llvm-lit: /Users/buildslave/jenkins/workspace/lldb-cmake/lldb-build/bin/../../llvm-project/llvm/utils/lit/lit/llvm/config.py:345: note: using clang-cl: /Users/buildslave/jenkins/workspace/lldb-cmake/lldb-build/bin/clang-cl llvm-lit: /Users/buildslave/jenkins/workspace/lldb-cmake/lldb-build/bin/../../llvm-project/llvm/utils/lit/lit/llvm/config.py:345: note: using lldb: /Users/buildslave/jenkins/workspace/lldb-cmake/lldb-build/bin/lldb llvm-lit: /Users/buildslave/jenkins/workspace/lldb-cmake/lldb-build/bin/../../llvm-project/llvm/utils/lit/lit/util.py:408: note: using SDKROOT: '/Applications/Xcode.app/Contents/Developer/Platforms/MacOSX.platform/Developer/SDKs/MacOSX10.15.sdk' UNSUPPORTED: debuginfo-tests :: dexter/feature_tests/commands/penalty/expect_watch_type.cpp (1 of 60) UNSUPPORTED: debuginfo-tests :: dexter/feature_tests/commands/penalty/unreachable.cpp (2 of 60) UNSUPPORTED: debuginfo-tests :: dexter/feature_tests/commands/perfect/expect_step_kind/recursive.cpp (3 of 60) UNSUPPORTED: debuginfo-tests :: dexter/feature_tests/commands/perfect/expect_step_kind/small_loop.cpp (4 of 60) UNSUPPORTED: debuginfo-tests :: dexter/feature_tests/commands/perfect/expect_program_state.cpp (5 of 60) UNSUPPORTED: debuginfo-tests :: dexter/feature_tests/commands/perfect/limit_steps/limit_steps_same_line_conditional.cpp (6 of 60) UNSUPPORTED: debuginfo-tests :: dexter/feature_tests/commands/perfect/limit_steps/limit_steps_expect_loop.cpp (7 of 60) UNSUPPORTED: debuginfo-tests :: dexter/feature_tests/subtools/clang-opt-bisect/clang-opt-bisect.cpp (8 of 60) PASS: debuginfo-tests :: llgdb-tests/apple-accel.cpp (9 of 60) UNSUPPORTED: debuginfo-tests :: dexter/feature_tests/commands/perfect/expect_step_kind/func.cpp (10 of 60) PASS: debuginfo-tests :: dexter/feature_tests/subtools/test/err_syntax.cpp (11 of 60) PASS: debuginfo-tests :: dexter/feature_tests/subtools/test/err_paren_mline.cpp (12 of 60) UNSUPPORTED: debuginfo-tests :: llvm-prettyprinters/gdb/llvm-support.gdb (13 of 60) PASS: debuginfo-tests :: llgdb-tests/forward-declare-class.cpp (14 of 60) PASS: debuginfo-tests :: dexter/feature_tests/subtools/test/err_paren.cpp (15 of 60) PASS: debuginfo-tests :: llgdb-tests/nested-struct.cpp (16 of 60) UNSUPPORTED: debuginfo-tests :: dexter/feature_tests/commands/penalty/expect_program_state.cpp (17 of 60) UNSUPPORTED: debuginfo-tests :: dexter/feature_tests/commands/perfect/expect_watch_value.cpp (18 of 60) PASS: debuginfo-tests :: llgdb-tests/static-member.cpp (19 of 60) UNSUPPORTED: debuginfo-tests :: dexter-tests/inline-line-gap.cpp (20 of 60) UNSUPPORTED: debuginfo-tests :: dexter-tests/nrvo.cpp (21 of 60) PASS: debuginfo-tests :: dexter/feature_tests/subtools/list-debuggers/list-debuggers.test (22 of 60) PASS: debuginfo-tests :: dexter-tests/ctor.cpp (23 of 60) PASS: debuginfo-tests :: dexter/feature_tests/subtools/test/source-root-dir.cpp (24 of 60) UNSUPPORTED: debuginfo-tests :: dexter/feature_tests/commands/perfect/expect_step_kind/direction.cpp (25 of 60) PASS: debuginfo-tests :: llgdb-tests/asan.c (26 of 60) PASS: debuginfo-tests :: dexter-tests/aggregate-indirect-arg.cpp (27 of 60) UNSUPPORTED: debuginfo-tests :: dexter-tests/hello.c (28 of 60) PASS: debuginfo-tests :: dexter/feature_tests/subtools/test/err_type.cpp (29 of 60) XFAIL: debuginfo-tests :: dexter-tests/asan-deque.cpp (30 of 60) PASS: debuginfo-tests :: llgdb-tests/asan-blocks.c (31 of 60) PASS: debuginfo-tests :: dexter/feature_tests/subtools/view.cpp (32 of 60) UNSUPPORTED: debuginfo-tests :: dexter/feature_tests/commands/perfect/expect_watch_type.cpp (33 of 60) UNSUPPORTED: debuginfo-tests :: llgdb-tests/safestack.c (34 of 60) UNSUPPORTED: debuginfo-tests :: dexter/feature_tests/commands/penalty/expect_step_order.cpp (35 of 60) PASS: debuginfo-tests :: llgdb-tests/asan-deque.cpp (36 of 60) XFAIL: debuginfo-tests :: llgdb-tests/static-member-2.cpp (37 of 60) PASS: debuginfo-tests :: dexter-tests/asan.c (38 of 60) UNSUPPORTED: debuginfo-tests :: dexter/feature_tests/commands/perfect/unreachable.cpp (39 of 60) PASS: debuginfo-tests :: dexter/feature_tests/subtools/test/err_syntax_mline.cpp (40 of 60) UNSUPPORTED: debuginfo-tests :: dexter/feature_tests/commands/perfect/expect_step_kind/func_external.cpp (41 of 60) UNSUPPORTED: debuginfo-tests :: dexter/feature_tests/commands/penalty/expect_step_kinds.cpp (42 of 60) UNSUPPORTED: debuginfo-tests :: dexter/feature_tests/commands/penalty/expect_watch_value.cpp (43 of 60) PASS: debuginfo-tests :: dexter/feature_tests/unittests/run.test (44 of 60) PASS: debuginfo-tests :: dexter/feature_tests/subtools/test/err_type_mline.cpp (45 of 60) PASS: debuginfo-tests :: llgdb-tests/nrvo-string.cpp (46 of 60) UNSUPPORTED: debuginfo-tests :: dexter-tests/realigned-frame.cpp (47 of 60) UNSUPPORTED: debuginfo-tests :: dexter/feature_tests/commands/perfect/limit_steps/limit_steps_check_json_step_count.cpp (48 of 60) UNSUPPORTED: debuginfo-tests :: dexter-tests/global-constant.cpp (49 of 60) PASS: debuginfo-tests :: dexter/feature_tests/subtools/help/help.test (50 of 60) UNSUPPORTED: debuginfo-tests :: dexter/feature_tests/commands/perfect/limit_steps/limit_steps_expect_value.cpp (51 of 60) UNSUPPORTED: debuginfo-tests :: dexter/feature_tests/commands/perfect/expect_step_order.cpp (52 of 60) UNSUPPORTED: debuginfo-tests :: dexter/feature_tests/commands/perfect/limit_steps/limit_steps_overlapping_ranges.cpp (53 of 60) PASS: debuginfo-tests :: llgdb-tests/block_var.m (54 of 60) PASS: debuginfo-tests :: llgdb-tests/foreach.m (55 of 60) PASS: debuginfo-tests :: llgdb-tests/blocks.m (56 of 60) FAIL: debuginfo-tests :: dexter-tests/stack-var.c (57 of 60) ******************** TEST 'debuginfo-tests :: dexter-tests/stack-var.c' FAILED ******************** Script: -- : 'RUN: at line 4'; "/usr/local/Frameworks/Python.framework/Versions/3.7/bin/python3.7" "/Users/buildslave/jenkins/workspace/lldb-cmake/llvm-project/debuginfo-tests/dexter/dexter.py" test --lldb-executable "/Users/buildslave/jenkins/workspace/lldb-cmake/lldb-build/bin/lldb" --fail-lt 1.0 -w --builder clang-c --debugger 'lldb' --cflags "-O -glldb" -- /Users/buildslave/jenkins/workspace/lldb-cmake/llvm-project/debuginfo-tests/dexter-tests/stack-var.c -- Exit Code: 2

Hide Details

Command Output (stdout): -- tmp.exe was compiled with optimization - stepping may behave oddly; variables may not be available. warning: could not execute support code to read Objective-C class data in the process. This may reduce the quality of type information available. stack-var.c: nan/nan (nan) [Command '['/usr/local/opt/python/bin/python3.7', '/Users/buildslave/jenkins/workspace/lldb-cmake/llvm-project/debuginfo-tests/dexter/dex/../dexter.py', 'run-debugger-internal-', '/var/folders/09/r4vw4v8n5kb67jl66zvlbljw0000gn/T/dexter/tmp8hgp435c/tmpy_t6k14v', '--working-directory=/var/folders/09/r4vw4v8n5kb67jl66zvlbljw0000gn/T/dexter/tmp8hgp435c', '--unittest=off', '--indent-timer-level=3']' returned non-zero exit status 1.]

Hide Details

Hide Details

-- Command Output (stderr): --

Hide Details

Hide Details

**************************************** **************************************** **************************************** ** ** ** This is a bug in DExTer. ** ** ** ** Please report it. ** ** ** **************************************** **************************************** ****************************************

Hide Details

system: darwin

Hide Details

version: DExTer 1.0.0 [HEAD 1675f8a2516d0a6f90744aef1066482ee072bbc8] (http://labmaster3.local/git/llvm-project.git) using Python 3.7.1 (default, Nov 28 2018, 11:51:47) [Clang 10.0.0 (clang-1000.11.45.5)]

Hide Details

args: ['/usr/local/opt/python/bin/python3.7', '/Users/buildslave/jenkins/workspace/lldb-cmake/llvm-project/debuginfo-tests/dexter/dex/../dexter.py', 'run-debugger-internal-', '/var/folders/09/r4vw4v8n5kb67jl66zvlbljw0000gn/T/dexter/tmp8hgp435c/tmpy_t6k14v', '--working-directory=/var/folders/09/r4vw4v8n5kb67jl66zvlbljw0000gn/T/dexter/tmp8hgp435c', '--unittest=off', '--indent-timer-level=3']

Hide Details

Traceback (most recent call last): File "/Users/buildslave/jenkins/workspace/lldb-cmake/llvm-project/debuginfo-tests/dexter/dex/../dexter.py", line 20, in <module> return_code = main() File "/Users/buildslave/jenkins/workspace/lldb-cmake/llvm-project/debuginfo-tests/dexter/dex/tools/Main.py", line 193, in main return tool_main(context, module.Tool(context), args) File "/Users/buildslave/jenkins/workspace/lldb-cmake/llvm-project/debuginfo-tests/dexter/dex/tools/Main.py", line 162, in tool_main return_code = tool.go() File "/Users/buildslave/jenkins/workspace/lldb-cmake/llvm-project/debuginfo-tests/dexter/dex/tools/run_debugger_internal_/Tool.py", line 58, in go self.debugger_controller.run_debugger(debugger) File "/Users/buildslave/jenkins/workspace/lldb-cmake/llvm-project/debuginfo-tests/dexter/dex/debugger/DebuggerControllers/DebuggerControllerBase.py", line 24, in run_debugger self._run_debugger_custom() File "/Users/buildslave/jenkins/workspace/lldb-cmake/llvm-project/debuginfo-tests/dexter/dex/debugger/DebuggerControllers/DefaultController.py", line 52, in _run_debugger_custom step_info = self.debugger.get_step_info(self.watches, self.step_index) File "/Users/buildslave/jenkins/workspace/lldb-cmake/llvm-project/debuginfo-tests/dexter/dex/debugger/DebuggerBase.py", line 163, in get_step_info step_info = self._get_step_info(watches, step_index) File "/Users/buildslave/jenkins/workspace/lldb-cmake/llvm-project/debuginfo-tests/dexter/dex/debugger/lldb/LLDB.py", line 206, in _get_step_info watches): File "/Users/buildslave/jenkins/workspace/lldb-cmake/llvm-project/debuginfo-tests/dexter/dex/debugger/lldb/LLDB.py", line 205, in <lambda> lambda watch, idx=i: self.evaluate_expression(watch, idx), File "/Users/buildslave/jenkins/workspace/lldb-cmake/llvm-project/debuginfo-tests/dexter/dex/debugger/lldb/LLDB.py", line 261, in evaluate_expression assert error_string == 'success', (error_string, expression, value) AssertionError: ("error: error: Couldn't materialize: couldn't get the value of test: extracting data from value failed\nerror: errored out in DoExecute, couldn't PrepareToExecuteJITExpression", 'test', None)

Hide Details

--

Hide Details

******************** FAIL: debuginfo-tests :: dexter-tests/dbg-arg.c (58 of 60) ******************** TEST 'debuginfo-tests :: dexter-tests/dbg-arg.c' FAILED ******************** Script: -- : 'RUN: at line 5'; "/usr/local/Frameworks/Python.framework/Versions/3.7/bin/python3.7" "/Users/buildslave/jenkins/workspace/lldb-cmake/llvm-project/debuginfo-tests/dexter/dexter.py" test --lldb-executable "/Users/buildslave/jenkins/workspace/lldb-cmake/lldb-build/bin/lldb" --fail-lt 1.0 -w --builder clang-c --debugger 'lldb' --cflags "-m64 -mllvm -fast-isel=false -g" -- /Users/buildslave/jenkins/workspace/lldb-cmake/llvm-project/debuginfo-tests/dexter-tests/dbg-arg.c -- Exit Code: 2

Hide Details

Command Output (stdout): -- warning: could not execute support code to read Objective-C class data in the process. This may reduce the quality of type information available. dbg-arg.c: nan/nan (nan) [Command '['/usr/local/opt/python/bin/python3.7', '/Users/buildslave/jenkins/workspace/lldb-cmake/llvm-project/debuginfo-tests/dexter/dex/../dexter.py', 'run-debugger-internal-', '/var/folders/09/r4vw4v8n5kb67jl66zvlbljw0000gn/T/dexter/tmpqw3o3nw9/tmpa8sw2yj4', '--working-directory=/var/folders/09/r4vw4v8n5kb67jl66zvlbljw0000gn/T/dexter/tmpqw3o3nw9', '--unittest=off', '--indent-timer-level=3']' returned non-zero exit status 1.]

Hide Details

Hide Details

-- Command Output (stderr): --

Hide Details

Hide Details

**************************************** **************************************** **************************************** ** ** ** This is a bug in DExTer. ** ** ** ** Please report it. ** ** ** **************************************** **************************************** ****************************************

Hide Details

system: darwin

Hide Details

version: DExTer 1.0.0 [HEAD 1675f8a2516d0a6f90744aef1066482ee072bbc8] (http://labmaster3.local/git/llvm-project.git) using Python 3.7.1 (default, Nov 28 2018, 11:51:47) [Clang 10.0.0 (clang-1000.11.45.5)]

Hide Details

args: ['/usr/local/opt/python/bin/python3.7', '/Users/buildslave/jenkins/workspace/lldb-cmake/llvm-project/debuginfo-tests/dexter/dex/../dexter.py', 'run-debugger-internal-', '/var/folders/09/r4vw4v8n5kb67jl66zvlbljw0000gn/T/dexter/tmpqw3o3nw9/tmpa8sw2yj4', '--working-directory=/var/folders/09/r4vw4v8n5kb67jl66zvlbljw0000gn/T/dexter/tmpqw3o3nw9', '--unittest=off', '--indent-timer-level=3']

Hide Details

Traceback (most recent call last): File "/Users/buildslave/jenkins/workspace/lldb-cmake/llvm-project/debuginfo-tests/dexter/dex/../dexter.py", line 20, in <module> return_code = main() File "/Users/buildslave/jenkins/workspace/lldb-cmake/llvm-project/debuginfo-tests/dexter/dex/tools/Main.py", line 193, in main return tool_main(context, module.Tool(context), args) File "/Users/buildslave/jenkins/workspace/lldb-cmake/llvm-project/debuginfo-tests/dexter/dex/tools/Main.py", line 162, in tool_main return_code = tool.go() File "/Users/buildslave/jenkins/workspace/lldb-cmake/llvm-project/debuginfo-tests/dexter/dex/tools/run_debugger_internal_/Tool.py", line 58, in go self.debugger_controller.run_debugger(debugger) File "/Users/buildslave/jenkins/workspace/lldb-cmake/llvm-project/debuginfo-tests/dexter/dex/debugger/DebuggerControllers/DebuggerControllerBase.py", line 24, in run_debugger self._run_debugger_custom() File "/Users/buildslave/jenkins/workspace/lldb-cmake/llvm-project/debuginfo-tests/dexter/dex/debugger/DebuggerControllers/DefaultController.py", line 52, in _run_debugger_custom step_info = self.debugger.get_step_info(self.watches, self.step_index) File "/Users/buildslave/jenkins/workspace/lldb-cmake/llvm-project/debuginfo-tests/dexter/dex/debugger/DebuggerBase.py", line 163, in get_step_info step_info = self._get_step_info(watches, step_index) File "/Users/buildslave/jenkins/workspace/lldb-cmake/llvm-project/debuginfo-tests/dexter/dex/debugger/lldb/LLDB.py", line 206, in _get_step_info watches): File "/Users/buildslave/jenkins/workspace/lldb-cmake/llvm-project/debuginfo-tests/dexter/dex/debugger/lldb/LLDB.py", line 205, in <lambda> lambda watch, idx=i: self.evaluate_expression(watch, idx), File "/Users/buildslave/jenkins/workspace/lldb-cmake/llvm-project/debuginfo-tests/dexter/dex/debugger/lldb/LLDB.py", line 261, in evaluate_expression assert error_string == 'success', (error_string, expression, value) AssertionError: ('error: error: No value', '*mutex', None)

Hide Details

--

Hide Details

******************** FAIL: debuginfo-tests :: dexter-tests/nrvo-string.cpp (59 of 60) ******************** TEST 'debuginfo-tests :: dexter-tests/nrvo-string.cpp' FAILED ******************** Script: -- : 'RUN: at line 10'; "/usr/local/Frameworks/Python.framework/Versions/3.7/bin/python3.7" "/Users/buildslave/jenkins/workspace/lldb-cmake/llvm-project/debuginfo-tests/dexter/dexter.py" test --lldb-executable "/Users/buildslave/jenkins/workspace/lldb-cmake/lldb-build/bin/lldb" --fail-lt 1.0 -w --builder 'clang' --debugger 'lldb' --cflags "-O0 -glldb -fno-exceptions" -- /Users/buildslave/jenkins/workspace/lldb-cmake/llvm-project/debuginfo-tests/dexter-tests/nrvo-string.cpp : 'RUN: at line 14'; "/usr/local/Frameworks/Python.framework/Versions/3.7/bin/python3.7" "/Users/buildslave/jenkins/workspace/lldb-cmake/llvm-project/debuginfo-tests/dexter/dexter.py" test --lldb-executable "/Users/buildslave/jenkins/workspace/lldb-cmake/lldb-build/bin/lldb" --fail-lt 1.0 -w --builder 'clang' --debugger 'lldb' --cflags "-O1 -glldb -fno-exceptions" -- /Users/buildslave/jenkins/workspace/lldb-cmake/llvm-project/debuginfo-tests/dexter-tests/nrvo-string.cpp -- Exit Code: 2

Hide Details

Command Output (stdout): -- warning: could not execute support code to read Objective-C class data in the process. This may reduce the quality of type information available. nrvo-string.cpp: nan/nan (nan) [Command '['/usr/local/opt/python/bin/python3.7', '/Users/buildslave/jenkins/workspace/lldb-cmake/llvm-project/debuginfo-tests/dexter/dex/../dexter.py', 'run-debugger-internal-', '/var/folders/09/r4vw4v8n5kb67jl66zvlbljw0000gn/T/dexter/tmp1mznqhb_/tmpmjezkxqc', '--working-directory=/var/folders/09/r4vw4v8n5kb67jl66zvlbljw0000gn/T/dexter/tmp1mznqhb_', '--unittest=off', '--indent-timer-level=3']' returned non-zero exit status 1.]

Hide Details

Hide Details

-- Command Output (stderr): --

Hide Details

Hide Details

**************************************** **************************************** **************************************** ** ** ** This is a bug in DExTer. ** ** ** ** Please report it. ** ** ** **************************************** **************************************** ****************************************

Hide Details

system: darwin

Hide Details

version: DExTer 1.0.0 [HEAD 1675f8a2516d0a6f90744aef1066482ee072bbc8] (http://labmaster3.local/git/llvm-project.git) using Python 3.7.1 (default, Nov 28 2018, 11:51:47) [Clang 10.0.0 (clang-1000.11.45.5)]

Hide Details

args: ['/usr/local/opt/python/bin/python3.7', '/Users/buildslave/jenkins/workspace/lldb-cmake/llvm-project/debuginfo-tests/dexter/dex/../dexter.py', 'run-debugger-internal-', '/var/folders/09/r4vw4v8n5kb67jl66zvlbljw0000gn/T/dexter/tmp1mznqhb_/tmpmjezkxqc', '--working-directory=/var/folders/09/r4vw4v8n5kb67jl66zvlbljw0000gn/T/dexter/tmp1mznqhb_', '--unittest=off', '--indent-timer-level=3']

Hide Details

Traceback (most recent call last): File "/Users/buildslave/jenkins/workspace/lldb-cmake/llvm-project/debuginfo-tests/dexter/dex/../dexter.py", line 20, in <module> return_code = main() File "/Users/buildslave/jenkins/workspace/lldb-cmake/llvm-project/debuginfo-tests/dexter/dex/tools/Main.py", line 193, in main return tool_main(context, module.Tool(context), args) File "/Users/buildslave/jenkins/workspace/lldb-cmake/llvm-project/debuginfo-tests/dexter/dex/tools/Main.py", line 162, in tool_main return_code = tool.go() File "/Users/buildslave/jenkins/workspace/lldb-cmake/llvm-project/debuginfo-tests/dexter/dex/tools/run_debugger_internal_/Tool.py", line 58, in go self.debugger_controller.run_debugger(debugger) File "/Users/buildslave/jenkins/workspace/lldb-cmake/llvm-project/debuginfo-tests/dexter/dex/debugger/DebuggerControllers/DebuggerControllerBase.py", line 24, in run_debugger self._run_debugger_custom() File "/Users/buildslave/jenkins/workspace/lldb-cmake/llvm-project/debuginfo-tests/dexter/dex/debugger/DebuggerControllers/DefaultController.py", line 52, in _run_debugger_custom step_info = self.debugger.get_step_info(self.watches, self.step_index) File "/Users/buildslave/jenkins/workspace/lldb-cmake/llvm-project/debuginfo-tests/dexter/dex/debugger/DebuggerBase.py", line 163, in get_step_info step_info = self._get_step_info(watches, step_index) File "/Users/buildslave/jenkins/workspace/lldb-cmake/llvm-project/debuginfo-tests/dexter/dex/debugger/lldb/LLDB.py", line 206, in _get_step_info watches): File "/Users/buildslave/jenkins/workspace/lldb-cmake/llvm-project/debuginfo-tests/dexter/dex/debugger/lldb/LLDB.py", line 205, in <lambda> lambda watch, idx=i: self.evaluate_expression(watch, idx), File "/Users/buildslave/jenkins/workspace/lldb-cmake/llvm-project/debuginfo-tests/dexter/dex/debugger/lldb/LLDB.py", line 261, in evaluate_expression assert error_string == 'success', (error_string, expression, value) AssertionError: ('error: error: No value', 'output.i', None)

Hide Details

--

Hide Details

******************** FAIL: debuginfo-tests :: dexter-tests/vla.c (60 of 60) ******************** TEST 'debuginfo-tests :: dexter-tests/vla.c' FAILED ******************** Script: -- : 'RUN: at line 5'; "/usr/local/Frameworks/Python.framework/Versions/3.7/bin/python3.7" "/Users/buildslave/jenkins/workspace/lldb-cmake/llvm-project/debuginfo-tests/dexter/dexter.py" test --lldb-executable "/Users/buildslave/jenkins/workspace/lldb-cmake/lldb-build/bin/lldb" --fail-lt 1.0 -w --builder clang-c --debugger 'lldb' --cflags "-O0 -glldb" -- /Users/buildslave/jenkins/workspace/lldb-cmake/llvm-project/debuginfo-tests/dexter-tests/vla.c -- Exit Code: 2

Hide Details

Command Output (stdout): -- warning: could not execute support code to read Objective-C class data in the process. This may reduce the quality of type information available. vla.c: nan/nan (nan) [Command '['/usr/local/opt/python/bin/python3.7', '/Users/buildslave/jenkins/workspace/lldb-cmake/llvm-project/debuginfo-tests/dexter/dex/../dexter.py', 'run-debugger-internal-', '/var/folders/09/r4vw4v8n5kb67jl66zvlbljw0000gn/T/dexter/tmpdykqqtpq/tmp56n2irl7', '--working-directory=/var/folders/09/r4vw4v8n5kb67jl66zvlbljw0000gn/T/dexter/tmpdykqqtpq', '--unittest=off', '--indent-timer-level=3']' returned non-zero exit status 1.]

Hide Details

Hide Details

-- Command Output (stderr): --

Hide Details

Hide Details

**************************************** **************************************** **************************************** ** ** ** This is a bug in DExTer. ** ** ** ** Please report it. ** ** ** **************************************** **************************************** ****************************************

Hide Details

system: darwin

Hide Details

version: DExTer 1.0.0 [HEAD 1675f8a2516d0a6f90744aef1066482ee072bbc8] (http://labmaster3.local/git/llvm-project.git) using Python 3.7.1 (default, Nov 28 2018, 11:51:47) [Clang 10.0.0 (clang-1000.11.45.5)]

Hide Details

args: ['/usr/local/opt/python/bin/python3.7', '/Users/buildslave/jenkins/workspace/lldb-cmake/llvm-project/debuginfo-tests/dexter/dex/../dexter.py', 'run-debugger-internal-', '/var/folders/09/r4vw4v8n5kb67jl66zvlbljw0000gn/T/dexter/tmpdykqqtpq/tmp56n2irl7', '--working-directory=/var/folders/09/r4vw4v8n5kb67jl66zvlbljw0000gn/T/dexter/tmpdykqqtpq', '--unittest=off', '--indent-timer-level=3']

Hide Details

Traceback (most recent call last): File "/Users/buildslave/jenkins/workspace/lldb-cmake/llvm-project/debuginfo-tests/dexter/dex/../dexter.py", line 20, in <module> return_code = main() File "/Users/buildslave/jenkins/workspace/lldb-cmake/llvm-project/debuginfo-tests/dexter/dex/tools/Main.py", line 193, in main return tool_main(context, module.Tool(context), args) File "/Users/buildslave/jenkins/workspace/lldb-cmake/llvm-project/debuginfo-tests/dexter/dex/tools/Main.py", line 162, in tool_main return_code = tool.go() File "/Users/buildslave/jenkins/workspace/lldb-cmake/llvm-project/debuginfo-tests/dexter/dex/tools/run_debugger_internal_/Tool.py", line 58, in go self.debugger_controller.run_debugger(debugger) File "/Users/buildslave/jenkins/workspace/lldb-cmake/llvm-project/debuginfo-tests/dexter/dex/debugger/DebuggerControllers/DebuggerControllerBase.py", line 24, in run_debugger self._run_debugger_custom() File "/Users/buildslave/jenkins/workspace/lldb-cmake/llvm-project/debuginfo-tests/dexter/dex/debugger/DebuggerControllers/DefaultController.py", line 52, in _run_debugger_custom step_info = self.debugger.get_step_info(self.watches, self.step_index) File "/Users/buildslave/jenkins/workspace/lldb-cmake/llvm-project/debuginfo-tests/dexter/dex/debugger/DebuggerBase.py", line 163, in get_step_info step_info = self._get_step_info(watches, step_index) File "/Users/buildslave/jenkins/workspace/lldb-cmake/llvm-project/debuginfo-tests/dexter/dex/debugger/lldb/LLDB.py", line 206, in _get_step_info watches): File "/Users/buildslave/jenkins/workspace/lldb-cmake/llvm-project/debuginfo-tests/dexter/dex/debugger/lldb/LLDB.py", line 205, in <lambda> lambda watch, idx=i: self.evaluate_expression(watch, idx), File "/Users/buildslave/jenkins/workspace/lldb-cmake/llvm-project/debuginfo-tests/dexter/dex/debugger/lldb/LLDB.py", line 261, in evaluate_expression assert error_string == 'success', (error_string, expression, value) AssertionError: ('error: error: No value', 'vla[0]', None)

Hide Details

--

Hide Details

******************** Slowest Tests: -------------------------------------------------------------------------- 43.64s: debuginfo-tests :: dexter-tests/vla.c 40.74s: debuginfo-tests :: dexter-tests/stack-var.c 40.28s: debuginfo-tests :: dexter-tests/nrvo-string.cpp 40.27s: debuginfo-tests :: dexter-tests/dbg-arg.c 28.16s: debuginfo-tests :: dexter/feature_tests/subtools/test/source-root-dir.cpp 18.93s: debuginfo-tests :: dexter-tests/asan-deque.cpp 15.87s: debuginfo-tests :: llgdb-tests/asan.c 15.81s: debuginfo-tests :: dexter-tests/aggregate-indirect-arg.cpp 13.32s: debuginfo-tests :: dexter-tests/ctor.cpp 12.35s: debuginfo-tests :: llgdb-tests/static-member.cpp 9.77s: debuginfo-tests :: llgdb-tests/blocks.m 8.84s: debuginfo-tests :: llgdb-tests/forward-declare-class.cpp 7.90s: debuginfo-tests :: llgdb-tests/foreach.m 6.62s: debuginfo-tests :: llgdb-tests/block_var.m 3.33s: debuginfo-tests :: dexter/feature_tests/subtools/test/err_paren_mline.cpp 3.33s: debuginfo-tests :: dexter/feature_tests/subtools/test/err_syntax.cpp 3.21s: debuginfo-tests :: llgdb-tests/nrvo-string.cpp 3.20s: debuginfo-tests :: llgdb-tests/asan-deque.cpp 2.86s: debuginfo-tests :: llgdb-tests/apple-accel.cpp 2.12s: debuginfo-tests :: dexter-tests/asan.c

Hide Details

Tests Times: -------------------------------------------------------------------------- [ Range ] :: [ Percentage ] :: [Count] -------------------------------------------------------------------------- [42.0s,44.0s) :: [ ] :: [ 1/60] [40.0s,42.0s) :: [** ] :: [ 3/60] [38.0s,40.0s) :: [ ] :: [ 0/60] [36.0s,38.0s) :: [ ] :: [ 0/60] [34.0s,36.0s) :: [ ] :: [ 0/60] [32.0s,34.0s) :: [ ] :: [ 0/60] [30.0s,32.0s) :: [ ] :: [ 0/60] [28.0s,30.0s) :: [ ] :: [ 1/60] [26.0s,28.0s) :: [ ] :: [ 0/60] [24.0s,26.0s) :: [ ] :: [ 0/60] [22.0s,24.0s) :: [ ] :: [ 0/60] [20.0s,22.0s) :: [ ] :: [ 0/60] [18.0s,20.0s) :: [ ] :: [ 1/60] [16.0s,18.0s) :: [ ] :: [ 1/60] [14.0s,16.0s) :: [ ] :: [ 1/60] [12.0s,14.0s) :: [* ] :: [ 2/60] [10.0s,12.0s) :: [ ] :: [ 0/60] [ 8.0s,10.0s) :: [* ] :: [ 2/60] [ 6.0s, 8.0s) :: [* ] :: [ 2/60] [ 4.0s, 6.0s) :: [ ] :: [ 0/60] [ 2.0s, 4.0s) :: [**** ] :: [ 6/60] [ 0.0s, 2.0s) :: [************************** ] :: [40/60] -------------------------------------------------------------------------- ******************** Failed Tests (4): debuginfo-tests :: dexter-tests/vla.c debuginfo-tests :: dexter-tests/stack-var.c debuginfo-tests :: dexter-tests/nrvo-string.cpp debuginfo-tests :: dexter-tests/dbg-arg.c

Hide Details

Hide Details

Testing Time: 44.00s Unsupported : 29 Passed : 25 Expectedly Failed: 2 Failed : 4 FAILED: projects/debuginfo-tests/CMakeFiles/check-debuginfo cd /Users/buildslave/jenkins/workspace/lldb-cmake/lldb-build/projects/debuginfo-tests && /usr/local/Frameworks/Python.framework/Versions/3.7/bin/python3.7 /Users/buildslave/jenkins/workspace/lldb-cmake/lldb-build/./bin/llvm-lit -v --time-tests --shuffle --xunit-xml-output=/Users/buildslave/jenkins/workspace/lldb-cmake/test/results.xml -v /Users/buildslave/jenkins/workspace/lldb-cmake/lldb-build/projects/debuginfo-tests ninja: build stopped: subcommand failed. Command failed: Command '['/usr/local/bin/ninja', '-v', 'check-debuginfo']' returned non-zero exit status 1 Command: ['/usr/local/bin/ninja', '-v', 'check-debuginfo'] [Pipeline] } [Pipeline] // timeout [Pipeline] } [Pipeline] // stage [Pipeline] stage [Pipeline] { (Declarative: Post Actions) [Pipeline] scanForIssues [Clang (LLVM based)] Sleeping for 5 seconds due to JENKINS-32191... [Clang (LLVM based)] Parsing console log (workspace: '/Users/buildslave/jenkins/workspace/lldb-cmake') [Clang (LLVM based)] Successfully parsed console log [Clang (LLVM based)] -> found 26 issues (skipped 98 duplicates) [Clang (LLVM based)] Post processing issues on 'green-dragon-10' with source code encoding 'UTF-8' [Clang (LLVM based)] Creating SCM blamer to obtain author and commit information for affected files [Clang (LLVM based)] Creating SCM miner to obtain statistics for affected repository files [Clang (LLVM based)] Resolving file names for all issues in source directory '/Users/buildslave/jenkins/workspace/lldb-cmake' [Clang (LLVM based)] -> resolved paths in source directory (15 found, 0 not found) [Clang (LLVM based)] Resolving module names from module definitions (build.xml, pom.xml, or Manifest.mf files) [Clang (LLVM based)] -> resolved module names for 26 issues [Clang (LLVM based)] Resolving package names (or namespaces) by parsing the affected files [Clang (LLVM based)] -> resolved package names of 12 affected files [Clang (LLVM based)] No filter has been set, publishing all 22 issues [Clang (LLVM based)] Creating fingerprints for all affected code blocks to track issues over different builds [Clang (LLVM based)] -> created fingerprints for 22 issues (skipped 0 issues) [Clang (LLVM based)] Copying affected files to Jenkins' build folder '/Users/Shared/Jenkins/Home/jobs/lldb-cmake/builds/23306/files-with-issues' [Clang (LLVM based)] -> 10 copied, 2 not in workspace, 0 not-found, 0 with I/O error [Pipeline] junit Recording test results [Pipeline] emailext Warning: kazu@google.com is not a recognized user, but sending mail anyway Warning: aqjune@gmail.com is not a recognized user, but sending mail anyway Warning: craig.topper@intel.com is not a recognized user, but sending mail anyway Warning: kazu@google.com is not a recognized user, but sending mail anyway Warning: aqjune@gmail.com is not a recognized user, but sending mail anyway Warning: craig.topper@intel.com is not a recognized user, but sending mail anyway

Hide Details

Begin Pre-Send Script... Sending email to: mschifer@apple.com kazu@google.com aqjune@gmail.com craig.topper@intel.com Erik Pilkington <epilkington@apple.com> Azhar Mohammed <azhar@apple.com>
[Pipeline] } [Pipeline] // stage [Pipeline] } [Pipeline] // withEnv [Pipeline] } [Pipeline] // node [Pipeline] End of Pipeline ERROR: script returned exit code 1 Finished: FAILURE