AbortedConsole Output

Skipping 8,582 KB.. Full Log
   sock.close()
                except:
                    logger.warning(
                        "failed to close socket to debug monitor: {}; ignoring".format(
                            sys.exc_info()[0]))

Hide Details

Hide Details

2020-08-10 11:06:46,540 WARNING failed to send kill packet to debug monitor: <class 'TypeError'>; ignoring Executing tearDown hook: def shutdown_named_pipe(): # Close the pipe. try: named_pipe.close() except: print("failed to close named pipe") None

Hide Details

# Delete the pipe. try: os.remove(named_pipe_path) except: print("failed to delete named pipe: {}".format(named_pipe_path)) None

Hide Details

# Delete the temp directory. try: os.rmdir(temp_dir) except: print( "failed to delete temp dir: {}, directory contents: '{}'".format( temp_dir, os.listdir(temp_dir))) None

Hide Details

Hide Details

PASS: LLDB (/Users/buildslave/jenkins/workspace/lldb-cmake/lldb-build/bin/clang-x86_64) :: test_qSupported_returns_known_stub_features_debugserver (TestLldbGdbServer.LldbGdbServerTestCase) runCmd: settings clear -all output:

Hide Details

runCmd: settings set symbols.enable-external-lookup false output:

Hide Details

runCmd: settings set target.inherit-tcc true output:

Hide Details

runCmd: settings set target.auto-apply-fixits false output:

Hide Details

runCmd: settings set plugin.process.gdb-remote.packet-timeout 60 output:

Hide Details

runCmd: settings set symbols.clang-modules-cache-path "/Users/buildslave/jenkins/workspace/lldb-cmake/lldb-build/lldb-test-build.noindex/module-cache-lldb/lldb-api" output:

Hide Details

runCmd: settings set use-color false output:

Hide Details

runCmd: setting set target.prefer-dynamic-value no-dynamic-values output:

Hide Details

UNSUPPORTED: LLDB (/Users/buildslave/jenkins/workspace/lldb-cmake/lldb-build/bin/clang-x86_64) :: test_qSupported_returns_known_stub_features_llgs (TestLldbGdbServer.LldbGdbServerTestCase) (llgs tests) runCmd: settings clear -all output:

Hide Details

runCmd: settings set symbols.enable-external-lookup false output:

Hide Details

runCmd: settings set target.inherit-tcc true output:

Hide Details

runCmd: settings set target.auto-apply-fixits false output:

Hide Details

runCmd: settings set plugin.process.gdb-remote.packet-timeout 60 output:

Hide Details

runCmd: settings set symbols.clang-modules-cache-path "/Users/buildslave/jenkins/workspace/lldb-cmake/lldb-build/lldb-test-build.noindex/module-cache-lldb/lldb-api" output:

Hide Details

runCmd: settings set use-color false output:

Hide Details

runCmd: setting set target.prefer-dynamic-value no-dynamic-values output:

Hide Details

Adding tearDown hook: def shutdown_named_pipe(): # Close the pipe. try: named_pipe.close() except: print("failed to close named pipe") None

Hide Details

# Delete the pipe. try: os.remove(named_pipe_path) except: print("failed to delete named pipe: {}".format(named_pipe_path)) None

Hide Details

# Delete the temp directory. try: os.rmdir(temp_dir) except: print( "failed to delete temp dir: {}, directory contents: '{}'".format( temp_dir, os.listdir(temp_dir))) None

Hide Details

Hide Details

Adding tearDown hook: def shutdown_socket(): if sock: try: # send the kill packet so lldb-server shuts down gracefully sock.sendall(GdbRemoteTestCaseBase._GDBREMOTE_KILL_PACKET) except: logger.warning( "failed to send kill packet to debug monitor: {}; ignoring".format( sys.exc_info()[0]))

Hide Details

try: sock.close() except: logger.warning( "failed to close socket to debug monitor: {}; ignoring".format( sys.exc_info()[0]))

Hide Details

Hide Details

Executing tearDown hook: def shutdown_socket(): if sock: try: # send the kill packet so lldb-server shuts down gracefully sock.sendall(GdbRemoteTestCaseBase._GDBREMOTE_KILL_PACKET) except: logger.warning( "failed to send kill packet to debug monitor: {}; ignoring".format( sys.exc_info()[0]))

Hide Details

try: sock.close() except: logger.warning( "failed to close socket to debug monitor: {}; ignoring".format( sys.exc_info()[0]))

Hide Details

Hide Details

2020-08-10 11:06:49,943 WARNING failed to send kill packet to debug monitor: <class 'TypeError'>; ignoring Executing tearDown hook: def shutdown_named_pipe(): # Close the pipe. try: named_pipe.close() except: print("failed to close named pipe") None

Hide Details

# Delete the pipe. try: os.remove(named_pipe_path) except: print("failed to delete named pipe: {}".format(named_pipe_path)) None

Hide Details

# Delete the temp directory. try: os.rmdir(temp_dir) except: print( "failed to delete temp dir: {}, directory contents: '{}'".format( temp_dir, os.listdir(temp_dir))) None

Hide Details

Hide Details

PASS: LLDB (/Users/buildslave/jenkins/workspace/lldb-cmake/lldb-build/bin/clang-x86_64) :: test_qThreadInfo_contains_thread_attach_debugserver (TestLldbGdbServer.LldbGdbServerTestCase) runCmd: settings clear -all output:

Hide Details

runCmd: settings set symbols.enable-external-lookup false output:

Hide Details

runCmd: settings set target.inherit-tcc true output:

Hide Details

runCmd: settings set target.auto-apply-fixits false output:

Hide Details

runCmd: settings set plugin.process.gdb-remote.packet-timeout 60 output:

Hide Details

runCmd: settings set symbols.clang-modules-cache-path "/Users/buildslave/jenkins/workspace/lldb-cmake/lldb-build/lldb-test-build.noindex/module-cache-lldb/lldb-api" output:

Hide Details

runCmd: settings set use-color false output:

Hide Details

runCmd: setting set target.prefer-dynamic-value no-dynamic-values output:

Hide Details

UNSUPPORTED: LLDB (/Users/buildslave/jenkins/workspace/lldb-cmake/lldb-build/bin/clang-x86_64) :: test_qThreadInfo_contains_thread_attach_llgs (TestLldbGdbServer.LldbGdbServerTestCase) (llgs tests) runCmd: settings clear -all output:

Hide Details

runCmd: settings set symbols.enable-external-lookup false output:

Hide Details

runCmd: settings set target.inherit-tcc true output:

Hide Details

runCmd: settings set target.auto-apply-fixits false output:

Hide Details

runCmd: settings set plugin.process.gdb-remote.packet-timeout 60 output:

Hide Details

runCmd: settings set symbols.clang-modules-cache-path "/Users/buildslave/jenkins/workspace/lldb-cmake/lldb-build/lldb-test-build.noindex/module-cache-lldb/lldb-api" output:

Hide Details

runCmd: settings set use-color false output:

Hide Details

runCmd: setting set target.prefer-dynamic-value no-dynamic-values output:

Hide Details

Adding tearDown hook: def shutdown_named_pipe(): # Close the pipe. try: named_pipe.close() except: print("failed to close named pipe") None

Hide Details

# Delete the pipe. try: os.remove(named_pipe_path) except: print("failed to delete named pipe: {}".format(named_pipe_path)) None

Hide Details

# Delete the temp directory. try: os.rmdir(temp_dir) except: print( "failed to delete temp dir: {}, directory contents: '{}'".format( temp_dir, os.listdir(temp_dir))) None

Hide Details

Hide Details

Adding tearDown hook: def shutdown_socket(): if sock: try: # send the kill packet so lldb-server shuts down gracefully sock.sendall(GdbRemoteTestCaseBase._GDBREMOTE_KILL_PACKET) except: logger.warning( "failed to send kill packet to debug monitor: {}; ignoring".format( sys.exc_info()[0]))

Hide Details

try: sock.close() except: logger.warning( "failed to close socket to debug monitor: {}; ignoring".format( sys.exc_info()[0]))

Hide Details

Hide Details

Executing tearDown hook: def shutdown_socket(): if sock: try: # send the kill packet so lldb-server shuts down gracefully sock.sendall(GdbRemoteTestCaseBase._GDBREMOTE_KILL_PACKET) except: logger.warning( "failed to send kill packet to debug monitor: {}; ignoring".format( sys.exc_info()[0]))

Hide Details

try: sock.close() except: logger.warning( "failed to close socket to debug monitor: {}; ignoring".format( sys.exc_info()[0]))

Hide Details

Hide Details

2020-08-10 11:07:03,306 WARNING failed to send kill packet to debug monitor: <class 'TypeError'>; ignoring Executing tearDown hook: def shutdown_named_pipe(): # Close the pipe. try: named_pipe.close() except: print("failed to close named pipe") None

Hide Details

# Delete the pipe. try: os.remove(named_pipe_path) except: print("failed to delete named pipe: {}".format(named_pipe_path)) None

Hide Details

# Delete the temp directory. try: os.rmdir(temp_dir) except: print( "failed to delete temp dir: {}, directory contents: '{}'".format( temp_dir, os.listdir(temp_dir))) None

Hide Details

Hide Details

PASS: LLDB (/Users/buildslave/jenkins/workspace/lldb-cmake/lldb-build/bin/clang-x86_64) :: test_qThreadInfo_contains_thread_launch_debugserver (TestLldbGdbServer.LldbGdbServerTestCase) runCmd: settings clear -all output:

Hide Details

runCmd: settings set symbols.enable-external-lookup false output:

Hide Details

runCmd: settings set target.inherit-tcc true output:

Hide Details

runCmd: settings set target.auto-apply-fixits false output:

Hide Details

runCmd: settings set plugin.process.gdb-remote.packet-timeout 60 output:

Hide Details

runCmd: settings set symbols.clang-modules-cache-path "/Users/buildslave/jenkins/workspace/lldb-cmake/lldb-build/lldb-test-build.noindex/module-cache-lldb/lldb-api" output:

Hide Details

runCmd: settings set use-color false output:

Hide Details

runCmd: setting set target.prefer-dynamic-value no-dynamic-values output:

Hide Details

UNSUPPORTED: LLDB (/Users/buildslave/jenkins/workspace/lldb-cmake/lldb-build/bin/clang-x86_64) :: test_qThreadInfo_contains_thread_launch_llgs (TestLldbGdbServer.LldbGdbServerTestCase) (llgs tests) runCmd: settings clear -all output:

Hide Details

runCmd: settings set symbols.enable-external-lookup false output:

Hide Details

runCmd: settings set target.inherit-tcc true output:

Hide Details

runCmd: settings set target.auto-apply-fixits false output:

Hide Details

runCmd: settings set plugin.process.gdb-remote.packet-timeout 60 output:

Hide Details

runCmd: settings set symbols.clang-modules-cache-path "/Users/buildslave/jenkins/workspace/lldb-cmake/lldb-build/lldb-test-build.noindex/module-cache-lldb/lldb-api" output:

Hide Details

runCmd: settings set use-color false output:

Hide Details

runCmd: setting set target.prefer-dynamic-value no-dynamic-values output:

Hide Details

Adding tearDown hook: def shutdown_named_pipe(): # Close the pipe. try: named_pipe.close() except: print("failed to close named pipe") None

Hide Details

# Delete the pipe. try: os.remove(named_pipe_path) except: print("failed to delete named pipe: {}".format(named_pipe_path)) None

Hide Details

# Delete the temp directory. try: os.rmdir(temp_dir) except: print( "failed to delete temp dir: {}, directory contents: '{}'".format( temp_dir, os.listdir(temp_dir))) None

Hide Details

Hide Details

Adding tearDown hook: def shutdown_socket(): if sock: try: # send the kill packet so lldb-server shuts down gracefully sock.sendall(GdbRemoteTestCaseBase._GDBREMOTE_KILL_PACKET) except: logger.warning( "failed to send kill packet to debug monitor: {}; ignoring".format( sys.exc_info()[0]))

Hide Details

try: sock.close() except: logger.warning( "failed to close socket to debug monitor: {}; ignoring".format( sys.exc_info()[0]))

Hide Details

Hide Details

Executing tearDown hook: def shutdown_socket(): if sock: try: # send the kill packet so lldb-server shuts down gracefully sock.sendall(GdbRemoteTestCaseBase._GDBREMOTE_KILL_PACKET) except: logger.warning( "failed to send kill packet to debug monitor: {}; ignoring".format( sys.exc_info()[0]))

Hide Details

try: sock.close() except: logger.warning( "failed to close socket to debug monitor: {}; ignoring".format( sys.exc_info()[0]))

Hide Details

Hide Details

2020-08-10 11:07:09,678 WARNING failed to send kill packet to debug monitor: <class 'TypeError'>; ignoring Executing tearDown hook: def shutdown_named_pipe(): # Close the pipe. try: named_pipe.close() except: print("failed to close named pipe") None

Hide Details

# Delete the pipe. try: os.remove(named_pipe_path) except: print("failed to delete named pipe: {}".format(named_pipe_path)) None

Hide Details

# Delete the temp directory. try: os.rmdir(temp_dir) except: print( "failed to delete temp dir: {}, directory contents: '{}'".format( temp_dir, os.listdir(temp_dir))) None

Hide Details

Hide Details

PASS: LLDB (/Users/buildslave/jenkins/workspace/lldb-cmake/lldb-build/bin/clang-x86_64) :: test_qThreadInfo_matches_qC_attach_debugserver (TestLldbGdbServer.LldbGdbServerTestCase) runCmd: settings clear -all output:

Hide Details

runCmd: settings set symbols.enable-external-lookup false output:

Hide Details

runCmd: settings set target.inherit-tcc true output:

Hide Details

runCmd: settings set target.auto-apply-fixits false output:

Hide Details

runCmd: settings set plugin.process.gdb-remote.packet-timeout 60 output:

Hide Details

runCmd: settings set symbols.clang-modules-cache-path "/Users/buildslave/jenkins/workspace/lldb-cmake/lldb-build/lldb-test-build.noindex/module-cache-lldb/lldb-api" output:

Hide Details

runCmd: settings set use-color false output:

Hide Details

runCmd: setting set target.prefer-dynamic-value no-dynamic-values output:

Hide Details

UNSUPPORTED: LLDB (/Users/buildslave/jenkins/workspace/lldb-cmake/lldb-build/bin/clang-x86_64) :: test_qThreadInfo_matches_qC_attach_llgs (TestLldbGdbServer.LldbGdbServerTestCase) (llgs tests) runCmd: settings clear -all output:

Hide Details

runCmd: settings set symbols.enable-external-lookup false output:

Hide Details

runCmd: settings set target.inherit-tcc true output:

Hide Details

runCmd: settings set target.auto-apply-fixits false output:

Hide Details

runCmd: settings set plugin.process.gdb-remote.packet-timeout 60 output:

Hide Details

runCmd: settings set symbols.clang-modules-cache-path "/Users/buildslave/jenkins/workspace/lldb-cmake/lldb-build/lldb-test-build.noindex/module-cache-lldb/lldb-api" output:

Hide Details

runCmd: settings set use-color false output:

Hide Details

runCmd: setting set target.prefer-dynamic-value no-dynamic-values output:

Hide Details

Adding tearDown hook: def shutdown_named_pipe(): # Close the pipe. try: named_pipe.close() except: print("failed to close named pipe") None

Hide Details

# Delete the pipe. try: os.remove(named_pipe_path) except: print("failed to delete named pipe: {}".format(named_pipe_path)) None

Hide Details

# Delete the temp directory. try: os.rmdir(temp_dir) except: print( "failed to delete temp dir: {}, directory contents: '{}'".format( temp_dir, os.listdir(temp_dir))) None

Hide Details

Hide Details

Adding tearDown hook: def shutdown_socket(): if sock: try: # send the kill packet so lldb-server shuts down gracefully sock.sendall(GdbRemoteTestCaseBase._GDBREMOTE_KILL_PACKET) except: logger.warning( "failed to send kill packet to debug monitor: {}; ignoring".format( sys.exc_info()[0]))

Hide Details

try: sock.close() except: logger.warning( "failed to close socket to debug monitor: {}; ignoring".format( sys.exc_info()[0]))

Hide Details

Hide Details

Executing tearDown hook: def shutdown_socket(): if sock: try: # send the kill packet so lldb-server shuts down gracefully sock.sendall(GdbRemoteTestCaseBase._GDBREMOTE_KILL_PACKET) except: logger.warning( "failed to send kill packet to debug monitor: {}; ignoring".format( sys.exc_info()[0]))

Hide Details

try: sock.close() except: logger.warning( "failed to close socket to debug monitor: {}; ignoring".format( sys.exc_info()[0]))

Hide Details

Hide Details

2020-08-10 11:07:18,702 WARNING failed to send kill packet to debug monitor: <class 'TypeError'>; ignoring Executing tearDown hook: def shutdown_named_pipe(): # Close the pipe. try: named_pipe.close() except: print("failed to close named pipe") None

Hide Details

# Delete the pipe. try: os.remove(named_pipe_path) except: print("failed to delete named pipe: {}".format(named_pipe_path)) None

Hide Details

# Delete the temp directory. try: os.rmdir(temp_dir) except: print( "failed to delete temp dir: {}, directory contents: '{}'".format( temp_dir, os.listdir(temp_dir))) None

Hide Details

Hide Details

PASS: LLDB (/Users/buildslave/jenkins/workspace/lldb-cmake/lldb-build/bin/clang-x86_64) :: test_qThreadInfo_matches_qC_launch_debugserver (TestLldbGdbServer.LldbGdbServerTestCase) runCmd: settings clear -all output:

Hide Details

runCmd: settings set symbols.enable-external-lookup false output:

Hide Details

runCmd: settings set target.inherit-tcc true output:

Hide Details

runCmd: settings set target.auto-apply-fixits false output:

Hide Details

runCmd: settings set plugin.process.gdb-remote.packet-timeout 60 output:

Hide Details

runCmd: settings set symbols.clang-modules-cache-path "/Users/buildslave/jenkins/workspace/lldb-cmake/lldb-build/lldb-test-build.noindex/module-cache-lldb/lldb-api" output:

Hide Details

runCmd: settings set use-color false output:

Hide Details

runCmd: setting set target.prefer-dynamic-value no-dynamic-values output:

Hide Details

UNSUPPORTED: LLDB (/Users/buildslave/jenkins/workspace/lldb-cmake/lldb-build/bin/clang-x86_64) :: test_qThreadInfo_matches_qC_launch_llgs (TestLldbGdbServer.LldbGdbServerTestCase) (llgs tests) runCmd: settings clear -all output:

Hide Details

runCmd: settings set symbols.enable-external-lookup false output:

Hide Details

runCmd: settings set target.inherit-tcc true output:

Hide Details

runCmd: settings set target.auto-apply-fixits false output:

Hide Details

runCmd: settings set plugin.process.gdb-remote.packet-timeout 60 output:

Hide Details

runCmd: settings set symbols.clang-modules-cache-path "/Users/buildslave/jenkins/workspace/lldb-cmake/lldb-build/lldb-test-build.noindex/module-cache-lldb/lldb-api" output:

Hide Details

runCmd: settings set use-color false output:

Hide Details

runCmd: setting set target.prefer-dynamic-value no-dynamic-values output:

Hide Details

Adding tearDown hook: def shutdown_named_pipe(): # Close the pipe. try: named_pipe.close() except: print("failed to close named pipe") None

Hide Details

# Delete the pipe. try: os.remove(named_pipe_path) except: print("failed to delete named pipe: {}".format(named_pipe_path)) None

Hide Details

# Delete the temp directory. try: os.rmdir(temp_dir) except: print( "failed to delete temp dir: {}, directory contents: '{}'".format( temp_dir, os.listdir(temp_dir))) None

Hide Details

Hide Details

Adding tearDown hook: def shutdown_socket(): if sock: try: # send the kill packet so lldb-server shuts down gracefully sock.sendall(GdbRemoteTestCaseBase._GDBREMOTE_KILL_PACKET) except: logger.warning( "failed to send kill packet to debug monitor: {}; ignoring".format( sys.exc_info()[0]))

Hide Details

try: sock.close() except: logger.warning( "failed to close socket to debug monitor: {}; ignoring".format( sys.exc_info()[0]))

Hide Details

Hide Details

Executing tearDown hook: def shutdown_socket(): if sock: try: # send the kill packet so lldb-server shuts down gracefully sock.sendall(GdbRemoteTestCaseBase._GDBREMOTE_KILL_PACKET) except: logger.warning( "failed to send kill packet to debug monitor: {}; ignoring".format( sys.exc_info()[0]))

Hide Details

try: sock.close() except: logger.warning( "failed to close socket to debug monitor: {}; ignoring".format( sys.exc_info()[0]))

Hide Details

Hide Details

2020-08-10 11:07:24,655 WARNING failed to send kill packet to debug monitor: <class 'TypeError'>; ignoring Executing tearDown hook: def shutdown_named_pipe(): # Close the pipe. try: named_pipe.close() except: print("failed to close named pipe") None

Hide Details

# Delete the pipe. try: os.remove(named_pipe_path) except: print("failed to delete named pipe: {}".format(named_pipe_path)) None

Hide Details

# Delete the temp directory. try: os.rmdir(temp_dir) except: print( "failed to delete temp dir: {}, directory contents: '{}'".format( temp_dir, os.listdir(temp_dir))) None

Hide Details

Hide Details

PASS: LLDB (/Users/buildslave/jenkins/workspace/lldb-cmake/lldb-build/bin/clang-x86_64) :: test_software_breakpoint_set_and_remove_work_debugserver (TestLldbGdbServer.LldbGdbServerTestCase) runCmd: settings clear -all output:

Hide Details

runCmd: settings set symbols.enable-external-lookup false output:

Hide Details

runCmd: settings set target.inherit-tcc true output:

Hide Details

runCmd: settings set target.auto-apply-fixits false output:

Hide Details

runCmd: settings set plugin.process.gdb-remote.packet-timeout 60 output:

Hide Details

runCmd: settings set symbols.clang-modules-cache-path "/Users/buildslave/jenkins/workspace/lldb-cmake/lldb-build/lldb-test-build.noindex/module-cache-lldb/lldb-api" output:

Hide Details

runCmd: settings set use-color false output:

Hide Details

runCmd: setting set target.prefer-dynamic-value no-dynamic-values output:

Hide Details

UNSUPPORTED: LLDB (/Users/buildslave/jenkins/workspace/lldb-cmake/lldb-build/bin/clang-x86_64) :: test_software_breakpoint_set_and_remove_work_llgs (TestLldbGdbServer.LldbGdbServerTestCase) (llgs tests) runCmd: settings clear -all output:

Hide Details

runCmd: settings set symbols.enable-external-lookup false output:

Hide Details

runCmd: settings set target.inherit-tcc true output:

Hide Details

runCmd: settings set target.auto-apply-fixits false output:

Hide Details

runCmd: settings set plugin.process.gdb-remote.packet-timeout 60 output:

Hide Details

runCmd: settings set symbols.clang-modules-cache-path "/Users/buildslave/jenkins/workspace/lldb-cmake/lldb-build/lldb-test-build.noindex/module-cache-lldb/lldb-api" output:

Hide Details

runCmd: settings set use-color false output:

Hide Details

runCmd: setting set target.prefer-dynamic-value no-dynamic-values output:

Hide Details

Adding tearDown hook: def shutdown_named_pipe(): # Close the pipe. try: named_pipe.close() except: print("failed to close named pipe") None

Hide Details

# Delete the pipe. try: os.remove(named_pipe_path) except: print("failed to delete named pipe: {}".format(named_pipe_path)) None

Hide Details

# Delete the temp directory. try: os.rmdir(temp_dir) except: print( "failed to delete temp dir: {}, directory contents: '{}'".format( temp_dir, os.listdir(temp_dir))) None

Hide Details

Hide Details

Adding tearDown hook: def shutdown_socket(): if sock: try: # send the kill packet so lldb-server shuts down gracefully sock.sendall(GdbRemoteTestCaseBase._GDBREMOTE_KILL_PACKET) except: logger.warning( "failed to send kill packet to debug monitor: {}; ignoring".format( sys.exc_info()[0]))

Hide Details

try: sock.close() except: logger.warning( "failed to close socket to debug monitor: {}; ignoring".format( sys.exc_info()[0]))

Hide Details

Hide Details

Executing tearDown hook: def shutdown_socket(): if sock: try: # send the kill packet so lldb-server shuts down gracefully sock.sendall(GdbRemoteTestCaseBase._GDBREMOTE_KILL_PACKET) except: logger.warning( "failed to send kill packet to debug monitor: {}; ignoring".format( sys.exc_info()[0]))

Hide Details

try: sock.close() except: logger.warning( "failed to close socket to debug monitor: {}; ignoring".format( sys.exc_info()[0]))

Hide Details

Hide Details

2020-08-10 11:07:25,422 WARNING failed to send kill packet to debug monitor: <class 'TypeError'>; ignoring Executing tearDown hook: def shutdown_named_pipe(): # Close the pipe. try: named_pipe.close() except: print("failed to close named pipe") None

Hide Details

# Delete the pipe. try: os.remove(named_pipe_path) except: print("failed to delete named pipe: {}".format(named_pipe_path)) None

Hide Details

# Delete the temp directory. try: os.rmdir(temp_dir) except: print( "failed to delete temp dir: {}, directory contents: '{}'".format( temp_dir, os.listdir(temp_dir))) None

Hide Details

Hide Details

PASS: LLDB (/Users/buildslave/jenkins/workspace/lldb-cmake/lldb-build/bin/clang-x86_64) :: test_start_no_ack_mode_debugserver (TestLldbGdbServer.LldbGdbServerTestCase) runCmd: settings clear -all output:

Hide Details

runCmd: settings set symbols.enable-external-lookup false output:

Hide Details

runCmd: settings set target.inherit-tcc true output:

Hide Details

runCmd: settings set target.auto-apply-fixits false output:

Hide Details

runCmd: settings set plugin.process.gdb-remote.packet-timeout 60 output:

Hide Details

runCmd: settings set symbols.clang-modules-cache-path "/Users/buildslave/jenkins/workspace/lldb-cmake/lldb-build/lldb-test-build.noindex/module-cache-lldb/lldb-api" output:

Hide Details

runCmd: settings set use-color false output:

Hide Details

runCmd: setting set target.prefer-dynamic-value no-dynamic-values output:

Hide Details

UNSUPPORTED: LLDB (/Users/buildslave/jenkins/workspace/lldb-cmake/lldb-build/bin/clang-x86_64) :: test_start_no_ack_mode_llgs (TestLldbGdbServer.LldbGdbServerTestCase) (llgs tests) runCmd: settings clear -all output:

Hide Details

runCmd: settings set symbols.enable-external-lookup false output:

Hide Details

runCmd: settings set target.inherit-tcc true output:

Hide Details

runCmd: settings set target.auto-apply-fixits false output:

Hide Details

runCmd: settings set plugin.process.gdb-remote.packet-timeout 60 output:

Hide Details

runCmd: settings set symbols.clang-modules-cache-path "/Users/buildslave/jenkins/workspace/lldb-cmake/lldb-build/lldb-test-build.noindex/module-cache-lldb/lldb-api" output:

Hide Details

runCmd: settings set use-color false output:

Hide Details

runCmd: setting set target.prefer-dynamic-value no-dynamic-values output:

Hide Details

Adding tearDown hook: def shutdown_named_pipe(): # Close the pipe. try: named_pipe.close() except: print("failed to close named pipe") None

Hide Details

# Delete the pipe. try: os.remove(named_pipe_path) except: print("failed to delete named pipe: {}".format(named_pipe_path)) None

Hide Details

# Delete the temp directory. try: os.rmdir(temp_dir) except: print( "failed to delete temp dir: {}, directory contents: '{}'".format( temp_dir, os.listdir(temp_dir))) None

Hide Details

Hide Details

Adding tearDown hook: def shutdown_socket(): if sock: try: # send the kill packet so lldb-server shuts down gracefully sock.sendall(GdbRemoteTestCaseBase._GDBREMOTE_KILL_PACKET) except: logger.warning( "failed to send kill packet to debug monitor: {}; ignoring".format( sys.exc_info()[0]))

Hide Details

try: sock.close() except: logger.warning( "failed to close socket to debug monitor: {}; ignoring".format( sys.exc_info()[0]))

Hide Details

Hide Details

Executing tearDown hook: def shutdown_socket(): if sock: try: # send the kill packet so lldb-server shuts down gracefully sock.sendall(GdbRemoteTestCaseBase._GDBREMOTE_KILL_PACKET) except: logger.warning( "failed to send kill packet to debug monitor: {}; ignoring".format( sys.exc_info()[0]))

Hide Details

try: sock.close() except: logger.warning( "failed to close socket to debug monitor: {}; ignoring".format( sys.exc_info()[0]))

Hide Details

Hide Details

2020-08-10 11:07:26,276 WARNING failed to send kill packet to debug monitor: <class 'TypeError'>; ignoring Executing tearDown hook: def shutdown_named_pipe(): # Close the pipe. try: named_pipe.close() except: print("failed to close named pipe") None

Hide Details

# Delete the pipe. try: os.remove(named_pipe_path) except: print("failed to delete named pipe: {}".format(named_pipe_path)) None

Hide Details

# Delete the temp directory. try: os.rmdir(temp_dir) except: print( "failed to delete temp dir: {}, directory contents: '{}'".format( temp_dir, os.listdir(temp_dir))) None

Hide Details

Hide Details

PASS: LLDB (/Users/buildslave/jenkins/workspace/lldb-cmake/lldb-build/bin/clang-x86_64) :: test_thread_suffix_supported_debugserver (TestLldbGdbServer.LldbGdbServerTestCase) runCmd: settings clear -all output:

Hide Details

runCmd: settings set symbols.enable-external-lookup false output:

Hide Details

runCmd: settings set target.inherit-tcc true output:

Hide Details

runCmd: settings set target.auto-apply-fixits false output:

Hide Details

runCmd: settings set plugin.process.gdb-remote.packet-timeout 60 output:

Hide Details

runCmd: settings set symbols.clang-modules-cache-path "/Users/buildslave/jenkins/workspace/lldb-cmake/lldb-build/lldb-test-build.noindex/module-cache-lldb/lldb-api" output:

Hide Details

runCmd: settings set use-color false output:

Hide Details

runCmd: setting set target.prefer-dynamic-value no-dynamic-values output:

Hide Details

UNSUPPORTED: LLDB (/Users/buildslave/jenkins/workspace/lldb-cmake/lldb-build/bin/clang-x86_64) :: test_thread_suffix_supported_llgs (TestLldbGdbServer.LldbGdbServerTestCase) (llgs tests) runCmd: settings clear -all output:

Hide Details

runCmd: settings set symbols.enable-external-lookup false output:

Hide Details

runCmd: settings set target.inherit-tcc true output:

Hide Details

runCmd: settings set target.auto-apply-fixits false output:

Hide Details

runCmd: settings set plugin.process.gdb-remote.packet-timeout 60 output:

Hide Details

runCmd: settings set symbols.clang-modules-cache-path "/Users/buildslave/jenkins/workspace/lldb-cmake/lldb-build/lldb-test-build.noindex/module-cache-lldb/lldb-api" output:

Hide Details

runCmd: settings set use-color false output:

Hide Details

runCmd: setting set target.prefer-dynamic-value no-dynamic-values output:

Hide Details

Adding tearDown hook: def shutdown_named_pipe(): # Close the pipe. try: named_pipe.close() except: print("failed to close named pipe") None

Hide Details

# Delete the pipe. try: os.remove(named_pipe_path) except: print("failed to delete named pipe: {}".format(named_pipe_path)) None

Hide Details

# Delete the temp directory. try: os.rmdir(temp_dir) except: print( "failed to delete temp dir: {}, directory contents: '{}'".format( temp_dir, os.listdir(temp_dir))) None

Hide Details

Hide Details

Adding tearDown hook: def shutdown_socket(): if sock: try: # send the kill packet so lldb-server shuts down gracefully sock.sendall(GdbRemoteTestCaseBase._GDBREMOTE_KILL_PACKET) except: logger.warning( "failed to send kill packet to debug monitor: {}; ignoring".format( sys.exc_info()[0]))

Hide Details

try: sock.close() except: logger.warning( "failed to close socket to debug monitor: {}; ignoring".format( sys.exc_info()[0]))

Hide Details

Hide Details

Executing tearDown hook: def shutdown_socket(): if sock: try: # send the kill packet so lldb-server shuts down gracefully sock.sendall(GdbRemoteTestCaseBase._GDBREMOTE_KILL_PACKET) except: logger.warning( "failed to send kill packet to debug monitor: {}; ignoring".format( sys.exc_info()[0]))

Hide Details

try: sock.close() except: logger.warning( "failed to close socket to debug monitor: {}; ignoring".format( sys.exc_info()[0]))

Hide Details

Hide Details

2020-08-10 11:07:34,045 WARNING failed to send kill packet to debug monitor: <class 'TypeError'>; ignoring Executing tearDown hook: def shutdown_named_pipe(): # Close the pipe. try: named_pipe.close() except: print("failed to close named pipe") None

Hide Details

# Delete the pipe. try: os.remove(named_pipe_path) except: print("failed to delete named pipe: {}".format(named_pipe_path)) None

Hide Details

# Delete the temp directory. try: os.rmdir(temp_dir) except: print( "failed to delete temp dir: {}, directory contents: '{}'".format( temp_dir, os.listdir(temp_dir))) None

Hide Details

Hide Details

PASS: LLDB (/Users/buildslave/jenkins/workspace/lldb-cmake/lldb-build/bin/clang-x86_64) :: test_written_M_content_reads_back_correctly_debugserver (TestLldbGdbServer.LldbGdbServerTestCase) runCmd: settings clear -all output:

Hide Details

runCmd: settings set symbols.enable-external-lookup false output:

Hide Details

runCmd: settings set target.inherit-tcc true output:

Hide Details

runCmd: settings set target.auto-apply-fixits false output:

Hide Details

runCmd: settings set plugin.process.gdb-remote.packet-timeout 60 output:

Hide Details

runCmd: settings set symbols.clang-modules-cache-path "/Users/buildslave/jenkins/workspace/lldb-cmake/lldb-build/lldb-test-build.noindex/module-cache-lldb/lldb-api" output:

Hide Details

runCmd: settings set use-color false output:

Hide Details

runCmd: setting set target.prefer-dynamic-value no-dynamic-values output:

Hide Details

UNSUPPORTED: LLDB (/Users/buildslave/jenkins/workspace/lldb-cmake/lldb-build/bin/clang-x86_64) :: test_written_M_content_reads_back_correctly_llgs (TestLldbGdbServer.LldbGdbServerTestCase) (llgs tests) Restore dir to: /Users/buildslave/jenkins/workspace/lldb-cmake/lldb-build/tools/lldb/test ====================================================================== ERROR: test_Hg_switches_to_3_threads_launch_debugserver (TestLldbGdbServer.LldbGdbServerTestCase) ---------------------------------------------------------------------- Traceback (most recent call last): File "/Users/buildslave/jenkins/workspace/lldb-cmake/llvm-project/lldb/packages/Python/lldbsuite/test/decorators.py", line 135, in wrapper return func(*args, **kwargs) File "/Users/buildslave/jenkins/workspace/lldb-cmake/llvm-project/lldb/test/API/tools/lldb-server/TestLldbGdbServer.py", line 672, in test_Hg_switches_to_3_threads_launch_debugserver self.Hg_switches_to_3_threads() File "/Users/buildslave/jenkins/workspace/lldb-cmake/llvm-project/lldb/test/API/tools/lldb-server/TestLldbGdbServer.py", line 645, in Hg_switches_to_3_threads threads = self.wait_for_thread_count(3) File "/Users/buildslave/jenkins/workspace/lldb-cmake/llvm-project/lldb/packages/Python/lldbsuite/test/tools/lldb-server/gdbremote_testcase.py", line 874, in wait_for_thread_count self.DEFAULT_TIMEOUT, thread_count, actual_thread_count)) Exception: timed out after 10 seconds while waiting for theads: waiting for at least 3 threads, found 1 Config=x86_64-/Users/buildslave/jenkins/workspace/lldb-cmake/lldb-build/bin/clang ---------------------------------------------------------------------- Ran 65 tests in 172.135s

Hide Details

RESULT: FAILED (29 passes, 0 failures, 1 errors, 34 skipped, 1 expected failures, 0 unexpected successes)

Hide Details

--

Hide Details

******************** PASS: lldb-unit :: Signals/./SignalsTests/UnixSignalsTest.Iteration (870 of 2119) PASS: lldb-unit :: UnwindAssembly/x86/./UnwindAssemblyx86Tests/Testx86AssemblyInspectionEngine.TestPopEBP (871 of 2119) PASS: lldb-unit :: Utility/./UtilityTests/FileSpecTest.OperatorBool (872 of 2119) PASS: lldb-unit :: SymbolFile/DWARF/./SymbolFileDWARFTests/SymbolFileDWARFTests.TestAbbrevInvalidNULLTag (873 of 2119) PASS: lldb-api :: lang/cpp/wchar_t/TestCxxWCharT.py (874 of 2119) PASS: lldb-unit :: Language/Highlighting/./HighlighterTests/HighlighterTest.Keywords (875 of 2119) PASS: lldb-unit :: ObjectFile/Breakpad/./ObjectFileBreakpadTests/StackCFIRecord.parse (876 of 2119) PASS: lldb-unit :: debugserver/./debugserverTests/RNBSocket.LoopBackConnectIPv6 (877 of 2119) PASS: lldb-unit :: Process/minidump/./LLDBMinidumpTests/MinidumpParserTest.GetMemoryRegionInfoLinuxMaps (878 of 2119) PASS: lldb-shell :: Minidump/disassemble-no-module.yaml (879 of 2119) PASS: lldb-unit :: Utility/./UtilityTests/RangeTest.DoesIntersect (880 of 2119) PASS: lldb-unit :: Utility/./UtilityTests/BinaryStreamTest.PutULEB128SevenBytes (881 of 2119) PASS: lldb-unit :: Utility/./UtilityTests/XcodeSDKTest.SDKSupportsModules (882 of 2119) XFAIL: lldb-shell :: Unwind/prefer-debug-over-eh-frame.test (883 of 2119) PASS: lldb-api :: functionalities/breakpoint/breakpoint_callback_command_source/TestBreakpointCallbackCommandSource.py (884 of 2119) PASS: lldb-unit :: Utility/./UtilityTests/StringExtractorTest.GetHexBytes_Partial (885 of 2119) PASS: lldb-api :: types/TestDoubleTypesExpr.py (886 of 2119) PASS: lldb-shell :: Commands/command-source.test (887 of 2119) PASS: lldb-shell :: SymbolFile/DWARF/anon_class_w_and_wo_export_symbols.ll (888 of 2119) PASS: lldb-unit :: Utility/./UtilityTests/UriParserTest.BracketedHostname (889 of 2119) PASS: lldb-unit :: Core/./LLDBCoreTests/StreamCallbackTest.Callback (890 of 2119) PASS: lldb-api :: python_api/watchpoint/condition/TestWatchpointConditionAPI.py (891 of 2119) PASS: lldb-api :: functionalities/optimized_code/TestNoASanExceptionAfterEvalOP_piece.py (892 of 2119) PASS: lldb-api :: functionalities/data-formatter/data-formatter-named-summaries/TestDataFormatterNamedSummaries.py (893 of 2119) PASS: lldb-api :: lang/cpp/call-function/TestCallCPPFunction.py (894 of 2119) PASS: lldb-api :: commands/expression/import-std-module/unique_ptr/TestUniquePtrFromStdModule.py (895 of 2119) PASS: lldb-shell :: ObjectFile/ELF/compressed-sections.yaml (896 of 2119) PASS: lldb-api :: functionalities/gdb_remote_client/TestqOffsets.py (897 of 2119) PASS: lldb-unit :: Utility/./UtilityTests/StateTest.Formatv (898 of 2119) PASS: lldb-api :: tools/lldb-server/inferior-crash/TestGdbRemoteSegFault.py (899 of 2119) PASS: lldb-shell :: Reproducer/Functionalities/TestStepping.test (900 of 2119) PASS: lldb-api :: lang/objc/foundation/TestSymbolTable.py (901 of 2119) UNSUPPORTED: lldb-shell :: SymbolFile/PDB/udt-layout.test (902 of 2119) PASS: lldb-unit :: ScriptInterpreter/Python/./ScriptInterpreterPythonTests/PythonDataObjectsTest.TestInstanceNameResolutionNoDot (903 of 2119) PASS: lldb-unit :: Utility/./UtilityTests/StreamTeeTest.Flush (904 of 2119) PASS: lldb-unit :: DataFormatter/./LLDBFormatterTests/TypeMatcherTests.GetMatchStringRegex (905 of 2119) PASS: lldb-unit :: UnwindAssembly/ARM64/./Arm64InstEmulationTests/TestArm64InstEmulation.TestFramelessThreeEpilogueFunction (906 of 2119) PASS: lldb-api :: python_api/file_handle/TestFileHandle.py (907 of 2119) PASS: lldb-unit :: Utility/./UtilityTests/UriParserTest.BracketedHostnameWithPortIPv4 (908 of 2119) PASS: lldb-shell :: SymbolFile/DWARF/debug-types-line-tables.s (909 of 2119) PASS: lldb-api :: commands/expression/calculator_mode/TestCalculatorMode.py (910 of 2119) PASS: lldb-unit :: Utility/./UtilityTests/RangeTest.LessThan (911 of 2119) PASS: lldb-unit :: Utility/./UtilityTests/RangeTest.ContainsRangeStartingFromZero (912 of 2119) PASS: lldb-api :: tools/lldb-server/commandline/TestStubReverseConnect.py (913 of 2119) PASS: lldb-unit :: DataFormatter/./LLDBFormatterTests/StringPrinterTests.SwiftUTF8 (914 of 2119) PASS: lldb-shell :: ObjectFile/Breakpad/sections-trailing-func.test (915 of 2119) PASS: lldb-shell :: ObjectFile/ELF/PT_LOAD-overlap-section.yaml (916 of 2119) PASS: lldb-unit :: Utility/./UtilityTests/VMRange.IsValid (917 of 2119) PASS: lldb-api :: commands/disassemble/basic/TestDisassembleBreakpoint.py (918 of 2119) PASS: lldb-api :: functionalities/data-formatter/data-formatter-objc/nsindexpath/TestDataFormatterNSIndexPath.py (919 of 2119) PASS: lldb-api :: lang/c/forward/TestForwardDeclaration.py (920 of 2119) PASS: lldb-unit :: Utility/./UtilityTests/DeserializerTest.HasData (921 of 2119) PASS: lldb-api :: tools/lldb-vscode/attach/TestVSCode_attach.py (922 of 2119) PASS: lldb-unit :: Process/minidump/./LLDBMinidumpTests/MinidumpParserTest.GetMemoryRegionInfoFromMemoryList (923 of 2119) PASS: lldb-unit :: ScriptInterpreter/Python/./ScriptInterpreterPythonTests/PythonDataObjectsTest.TestPythonListValueEquality (924 of 2119) PASS: lldb-api :: commands/expression/invalid-args/TestInvalidArgsExpression.py (925 of 2119) PASS: lldb-unit :: Core/./LLDBCoreTests/RichManglingContextTest.Basic (926 of 2119) PASS: lldb-unit :: Process/minidump/./LLDBMinidumpTests/RegisterContextMinidump.CheckRegisterContextMinidump_ARM (927 of 2119) UNSUPPORTED: lldb-shell :: ScriptInterpreter/Lua/lua.test (928 of 2119) PASS: lldb-api :: lang/c/function_types/TestFunctionTypes.py (929 of 2119) PASS: lldb-api :: commands/command/nested_alias/TestNestedAlias.py (930 of 2119) PASS: lldb-api :: python_api/value_var_update/TestValueVarUpdate.py (931 of 2119) PASS: lldb-shell :: SymbolFile/NativePDB/function-types-calling-conv.cpp (932 of 2119) PASS: lldb-unit :: Utility/./UtilityTests/RangeTest.DoesAdjoinOrIntersect (933 of 2119) PASS: lldb-unit :: Utility/./UtilityTests/Flags.AllSet (934 of 2119) PASS: lldb-unit :: ScriptInterpreter/Python/./ScriptInterpreterPythonTests/PythonDataObjectsTest.TestPythonInteger (935 of 2119) PASS: lldb-shell :: Process/Optimization.test (936 of 2119) PASS: lldb-api :: commands/expression/top-level/TestTopLevelExprs.py (937 of 2119) PASS: lldb-unit :: Utility/./UtilityTests/RangeTest.NotEqualInvalid (938 of 2119) PASS: lldb-unit :: Utility/./UtilityTests/StreamTest.PutSLEB128 (939 of 2119) PASS: lldb-api :: functionalities/show_location/TestShowLocationDwarf5.py (940 of 2119) PASS: lldb-unit :: Utility/./UtilityTests/UriParserTest.Minimal (941 of 2119) PASS: lldb-shell :: Driver/TestNoUseColor.test (942 of 2119) PASS: lldb-api :: functionalities/jitloader_gdb/TestJITLoaderGDB.py (943 of 2119) PASS: lldb-unit :: Utility/./UtilityTests/ConstStringTest.CompareConstString (944 of 2119) PASS: lldb-unit :: Utility/./UtilityTests/FileSpecTest.RemoveLastPathComponent (945 of 2119) PASS: lldb-shell :: SymbolFile/DWARF/debug_line-tombstone.s (946 of 2119) PASS: lldb-unit :: Host/./HostTests/SocketTest.DecodeHostAndPort (947 of 2119) PASS: lldb-unit :: Utility/./UtilityTests/SerializationRountripTest.SerializeDeserializeCStringNull (948 of 2119) PASS: lldb-unit :: UnwindAssembly/x86/./UnwindAssemblyx86Tests/Testx86AssemblyInspectionEngine.TestPopR15 (949 of 2119) PASS: lldb-unit :: Utility/./UtilityTests/RangeTest.SetRangeBase (950 of 2119) PASS: lldb-api :: functionalities/thread/concurrent_events/TestConcurrentDelayWatchBreak.py (951 of 2119) PASS: lldb-unit :: Utility/./UtilityTests/StringExtractorTest.GetNameColonValueSuccess (952 of 2119) PASS: lldb-unit :: Expression/./ExpressionTests/ClangExpressionDeclMapTest.TestUnknownIdentifierLookup (953 of 2119) UNSUPPORTED: lldb-api :: benchmarks/startup/TestStartupDelays.py (954 of 2119) PASS: lldb-unit :: Utility/./UtilityTests/DataExtractorTest.GetCStrAtNullOffset (955 of 2119) UNSUPPORTED: lldb-shell :: ObjectFile/ELF/minidebuginfo-no-lzma.yaml (956 of 2119) PASS: lldb-unit :: Expression/./ExpressionTests/CppModuleConfigurationTest.AmbiguousLibCpp (957 of 2119) PASS: lldb-api :: commands/target/modules/search-paths/insert/TestTargetModulesSearchpathsInsert.py (958 of 2119) PASS: lldb-unit :: Utility/./UtilityTests/FileSpecTest.AppendPathComponent (959 of 2119) PASS: lldb-unit :: Expression/./ExpressionTests/DWARFExpression.DW_OP_stack_value (960 of 2119) UNSUPPORTED: lldb-shell :: SymbolFile/DWARF/split-dwarf-expression-eval-bug.cpp (961 of 2119) UNSUPPORTED: lldb-shell :: Register/x86-gp-write.test (962 of 2119) PASS: lldb-unit :: Host/./HostTests/MainLoopTest.DetectsEOF (963 of 2119) TIMEOUT: lldb-api :: macosx/simulator/TestSimulatorPlatform.py (964 of 2119) ******************** TEST 'lldb-api :: macosx/simulator/TestSimulatorPlatform.py' FAILED ******************** Script: -- /usr/local/Frameworks/Python.framework/Versions/3.7/bin/python3.7 /Users/buildslave/jenkins/workspace/lldb-cmake/llvm-project/lldb/test/API/dotest.py --arch x86_64 -s /Users/buildslave/jenkins/workspace/lldb-cmake/lldb-build/lldb-test-traces -S nm -u CXXFLAGS -u CFLAGS --codesign-identity - --server /Users/buildslave/jenkins/workspace/lldb-cmake/lldb-build/./bin/debugserver --arch x86_64 --build-dir /Users/buildslave/jenkins/workspace/lldb-cmake/lldb-build/lldb-test-build.noindex -s=/Users/buildslave/jenkins/workspace/lldb-cmake/test/logs -t --env TERM=vt100 --env LLVM_LIBS_DIR=/Users/buildslave/jenkins/workspace/lldb-cmake/lldb-build/./lib --build-dir /Users/buildslave/jenkins/workspace/lldb-cmake/lldb-build/lldb-test-build.noindex --lldb-module-cache-dir /Users/buildslave/jenkins/workspace/lldb-cmake/lldb-build/lldb-test-build.noindex/module-cache-lldb/lldb-api --clang-module-cache-dir /Users/buildslave/jenkins/workspace/lldb-cmake/lldb-build/lldb-test-build.noindex/module-cache-clang/lldb-api --executable /Users/buildslave/jenkins/workspace/lldb-cmake/lldb-build/./bin/lldb --compiler /Users/buildslave/jenkins/workspace/lldb-cmake/lldb-build/./bin/clang --dsymutil /Users/buildslave/jenkins/workspace/lldb-cmake/lldb-build/./bin/dsymutil --filecheck /Users/buildslave/jenkins/workspace/lldb-cmake/lldb-build/./bin/FileCheck --yaml2obj /Users/buildslave/jenkins/workspace/lldb-cmake/lldb-build/./bin/yaml2obj --lldb-libs-dir /Users/buildslave/jenkins/workspace/lldb-cmake/lldb-build/./lib /Users/buildslave/jenkins/workspace/lldb-cmake/llvm-project/lldb/test/API/macosx/simulator -p TestSimulatorPlatform.py -- Exit Code: -9 Timeout: Reached timeout of 600 seconds

Hide Details

Command Output (stdout): -- lldb version 12.0.99 clang revision d5c81be3ca2504e32a99b57711ae101e02d810fa llvm revision d5c81be3ca2504e32a99b57711ae101e02d810fa

Hide Details

-- Command Output (stderr): --

Hide Details

Session logs for test failures/errors/unexpected successes will go into directory '/Users/buildslave/jenkins/workspace/lldb-cmake/test/logs' Change dir to: /Users/buildslave/jenkins/workspace/lldb-cmake/llvm-project/lldb/test/API/macosx/simulator runCmd: settings clear -all output:

Hide Details

runCmd: settings set symbols.enable-external-lookup false output:

Hide Details

runCmd: settings set target.inherit-tcc true output:

Hide Details

runCmd: settings set target.auto-apply-fixits false output:

Hide Details

runCmd: settings set plugin.process.gdb-remote.packet-timeout 60 output:

Hide Details

runCmd: settings set symbols.clang-modules-cache-path "/Users/buildslave/jenkins/workspace/lldb-cmake/lldb-build/lldb-test-build.noindex/module-cache-lldb/lldb-api" output:

Hide Details

runCmd: settings set use-color false output:

Hide Details

runCmd: setting set target.prefer-dynamic-value no-dynamic-values output:

Hide Details

runCmd: log enable gdb-remote packets -f /Users/buildslave/jenkins/workspace/lldb-cmake/lldb-build/lldb-test-build.noindex/macosx/simulator/TestSimulatorPlatform.test_ios/packets.log output:

Hide Details

runCmd: image list -b -t output: [ 0] a.out x86_64-apple-ios13.5.0-simulator [ 1] dyld x86_64-apple-macosx10.15.0 [ 2] dyld_sim x86_64-apple-ios13.5.0-simulator [ 3] libc++.1.dylib x86_64-apple-ios13.5.0-simulator [ 4] libSystem.B.dylib x86_64-apple-ios13.5.0-simulator [ 5] libc++abi.dylib x86_64-apple-ios13.5.0-simulator [ 6] libcache.dylib x86_64-apple-ios13.5.0-simulator [ 7] libcommonCrypto.dylib x86_64-apple-ios13.5.0-simulator [ 8] libcompiler_rt.dylib x86_64-apple-ios13.5.0-simulator [ 9] libcopyfile.dylib x86_64-apple-ios13.5.0-simulator [ 10] libcorecrypto.dylib x86_64-apple-ios13.5.0-simulator [ 11] libdispatch.dylib x86_64-apple-ios13.5.0-simulator [ 12] libdyld.dylib x86_64-apple-ios13.5.0-simulator [ 13] liblaunch.dylib x86_64-apple-ios13.5.0-simulator [ 14] libmacho.dylib x86_64-apple-ios13.5.0-simulator [ 15] libremovefile.dylib x86_64-apple-ios13.5.0-simulator [ 16] libsystem_asl.dylib x86_64-apple-ios13.5.0-simulator [ 17] libsystem_blocks.dylib x86_64-apple-ios13.5.0-simulator [ 18] libsystem_c.dylib x86_64-apple-ios13.5.0-simulator [ 19] libsystem_configuration.dylib x86_64-apple-ios13.5.0-simulator [ 20] libsystem_containermanager.dylib x86_64-apple-ios13.5.0-simulator [ 21] libsystem_coreservices.dylib x86_64-apple-ios13.5.0-simulator [ 22] libsystem_darwin.dylib x86_64-apple-ios13.5.0-simulator [ 23] libsystem_dnssd.dylib x86_64-apple-ios13.5.0-simulator [ 24] libsystem_featureflags.dylib x86_64-apple-ios13.5.0-simulator [ 25] libsystem_info.dylib x86_64-apple-ios13.5.0-simulator [ 26] libsystem_m.dylib x86_64-apple-ios13.5.0-simulator [ 27] libsystem_malloc.dylib x86_64-apple-ios13.5.0-simulator [ 28] libsystem_notify.dylib x86_64-apple-ios13.5.0-simulator [ 29] libsystem_sandbox.dylib x86_64-apple-ios13.5.0-simulator [ 30] libsystem_sim_kernel.dylib x86_64-apple-ios13.5.0-simulator [ 31] libsystem_sim_platform.dylib x86_64-apple-ios13.5.0-simulator [ 32] libsystem_sim_pthread.dylib x86_64-apple-ios13.5.0-simulator [ 33] libsystem_trace.dylib x86_64-apple-ios13.5.0-simulator [ 34] libunwind.dylib x86_64-apple-ios13.5.0-simulator [ 35] libxpc.dylib x86_64-apple-ios13.5.0-simulator [ 36] libsystem_sim_pthread_host.dylib x86_64-apple-ios13.5.0-simulator [ 37] libsystem_sim_platform_host.dylib x86_64-apple-ios13.5.0-simulator [ 38] libsystem_sim_kernel_host.dylib x86_64-apple-ios13.5.0-simulator [ 39] libsystem_kernel.dylib x86_64-apple-macosx10.15.0-simulator(0x00007fff51b5a000) [ 40] libobjc.A.dylib x86_64-apple-ios13.5.0-simulator [ 41] libsystem_platform.dylib x86_64-apple-macosx10.15.0-simulator(0x00007fff51bfd000) [ 42] libsystem_pthread.dylib x86_64-apple-macosx10.15.0-simulator(0x00007fff51c06000)

Hide Details

Hide Details

Expecting pattern: a\.out x86_64-apple-ios.*-simulator Matched

Hide Details

<bound method SBProcess.Kill of <lldb.SBProcess; proxy of <Swig Object of type 'lldb::SBProcess *' at 0x1101f9de0> >>: success

Hide Details

PASS: LLDB (/Users/buildslave/jenkins/workspace/lldb-cmake/lldb-build/bin/clang-x86_64) :: test_ios (TestSimulatorPlatform.TestSimulatorPlatformLaunching) runCmd: settings clear -all output:

Hide Details

runCmd: settings set symbols.enable-external-lookup false output:

Hide Details

runCmd: settings set target.inherit-tcc true output:

Hide Details

runCmd: settings set target.auto-apply-fixits false output:

Hide Details

runCmd: settings set plugin.process.gdb-remote.packet-timeout 60 output:

Hide Details

runCmd: settings set symbols.clang-modules-cache-path "/Users/buildslave/jenkins/workspace/lldb-cmake/lldb-build/lldb-test-build.noindex/module-cache-lldb/lldb-api" output:

Hide Details

runCmd: settings set use-color false output:

Hide Details

runCmd: setting set target.prefer-dynamic-value no-dynamic-values output:

Hide Details

UNSUPPORTED: LLDB (/Users/buildslave/jenkins/workspace/lldb-cmake/lldb-build/bin/clang-x86_64) :: test_ios_backdeploy_apple_silicon (TestSimulatorPlatform.TestSimulatorPlatformLaunching) (skipping due to the following parameter(s): architecture) runCmd: settings clear -all output:

Hide Details

runCmd: settings set symbols.enable-external-lookup false output:

Hide Details

runCmd: settings set target.inherit-tcc true output:

Hide Details

runCmd: settings set target.auto-apply-fixits false output:

Hide Details

runCmd: settings set plugin.process.gdb-remote.packet-timeout 60 output:

Hide Details

runCmd: settings set symbols.clang-modules-cache-path "/Users/buildslave/jenkins/workspace/lldb-cmake/lldb-build/lldb-test-build.noindex/module-cache-lldb/lldb-api" output:

Hide Details

runCmd: settings set use-color false output:

Hide Details

runCmd: setting set target.prefer-dynamic-value no-dynamic-values output:

Hide Details

runCmd: log enable gdb-remote packets -f /Users/buildslave/jenkins/workspace/lldb-cmake/lldb-build/lldb-test-build.noindex/macosx/simulator/TestSimulatorPlatform.test_ios_backdeploy_x86/packets.log output:

Hide Details

runCmd: image list -b -t output: [ 0] a.out x86_64-apple-ios13.0.0-simulator [ 1] dyld x86_64-apple-macosx10.15.0 [ 2] dyld_sim x86_64-apple-ios13.5.0-simulator [ 3] libc++.1.dylib x86_64-apple-ios13.5.0-simulator [ 4] libSystem.B.dylib x86_64-apple-ios13.5.0-simulator [ 5] libc++abi.dylib x86_64-apple-ios13.5.0-simulator [ 6] libcache.dylib x86_64-apple-ios13.5.0-simulator [ 7] libcommonCrypto.dylib x86_64-apple-ios13.5.0-simulator [ 8] libcompiler_rt.dylib x86_64-apple-ios13.5.0-simulator [ 9] libcopyfile.dylib x86_64-apple-ios13.5.0-simulator [ 10] libcorecrypto.dylib x86_64-apple-ios13.5.0-simulator [ 11] libdispatch.dylib x86_64-apple-ios13.5.0-simulator [ 12] libdyld.dylib x86_64-apple-ios13.5.0-simulator [ 13] liblaunch.dylib x86_64-apple-ios13.5.0-simulator [ 14] libmacho.dylib x86_64-apple-ios13.5.0-simulator [ 15] libremovefile.dylib x86_64-apple-ios13.5.0-simulator [ 16] libsystem_asl.dylib x86_64-apple-ios13.5.0-simulator [ 17] libsystem_blocks.dylib x86_64-apple-ios13.5.0-simulator [ 18] libsystem_c.dylib x86_64-apple-ios13.5.0-simulator [ 19] libsystem_configuration.dylib x86_64-apple-ios13.5.0-simulator [ 20] libsystem_containermanager.dylib x86_64-apple-ios13.5.0-simulator [ 21] libsystem_coreservices.dylib x86_64-apple-ios13.5.0-simulator [ 22] libsystem_darwin.dylib x86_64-apple-ios13.5.0-simulator [ 23] libsystem_dnssd.dylib x86_64-apple-ios13.5.0-simulator [ 24] libsystem_featureflags.dylib x86_64-apple-ios13.5.0-simulator [ 25] libsystem_info.dylib x86_64-apple-ios13.5.0-simulator [ 26] libsystem_m.dylib x86_64-apple-ios13.5.0-simulator [ 27] libsystem_malloc.dylib x86_64-apple-ios13.5.0-simulator [ 28] libsystem_notify.dylib x86_64-apple-ios13.5.0-simulator [ 29] libsystem_sandbox.dylib x86_64-apple-ios13.5.0-simulator [ 30] libsystem_sim_kernel.dylib x86_64-apple-ios13.5.0-simulator [ 31] libsystem_sim_platform.dylib x86_64-apple-ios13.5.0-simulator [ 32] libsystem_sim_pthread.dylib x86_64-apple-ios13.5.0-simulator [ 33] libsystem_trace.dylib x86_64-apple-ios13.5.0-simulator [ 34] libunwind.dylib x86_64-apple-ios13.5.0-simulator [ 35] libxpc.dylib x86_64-apple-ios13.5.0-simulator [ 36] libsystem_sim_pthread_host.dylib x86_64-apple-ios13.5.0-simulator [ 37] libsystem_sim_platform_host.dylib x86_64-apple-ios13.5.0-simulator [ 38] libsystem_sim_kernel_host.dylib x86_64-apple-ios13.5.0-simulator [ 39] libsystem_kernel.dylib x86_64-apple-macosx10.15.0-simulator(0x00007fff51b5a000) [ 40] libobjc.A.dylib x86_64-apple-ios13.5.0-simulator [ 41] libsystem_platform.dylib x86_64-apple-macosx10.15.0-simulator(0x00007fff51bfd000) [ 42] libsystem_pthread.dylib x86_64-apple-macosx10.15.0-simulator(0x00007fff51c06000)

Hide Details

Hide Details

--

Hide Details

******************** PASS: lldb-api :: commands/expression/scoped_enums/TestScopedEnumType.py (965 of 2119) PASS: lldb-unit :: Host/./HostTests/HostInfoTest.GetAugmentedArchSpec (966 of 2119) PASS: lldb-api :: tools/lldb-server/TestGdbRemote_qThreadStopInfo.py (967 of 2119) PASS: lldb-shell :: Breakpoint/split-dwarf-5-addrbase.test (968 of 2119) PASS: lldb-unit :: Utility/./UtilityTests/CompletionRequest.TestCompletionOwnership (969 of 2119) PASS: lldb-unit :: Symbol/./SymbolTests/TestTypeSystemClang.TestFunctionTemplateConstruction (970 of 2119) PASS: lldb-shell :: Driver/TestPositionalArgs.test (971 of 2119) PASS: lldb-api :: functionalities/lazy-loading/TestLazyLoading.py (972 of 2119) PASS: lldb-unit :: Utility/./UtilityTests/SerializationRountripTest.SerializeDeserializeObjectPointer (973 of 2119) PASS: lldb-unit :: Core/./LLDBCoreTests/SourceFileCache.FindSourceFileFound (974 of 2119) PASS: lldb-shell :: Minidump/no-process-id.yaml (975 of 2119) PASS: lldb-api :: tools/lldb-server/TestGdbRemoteHostInfo.py (976 of 2119) PASS: lldb-shell :: Driver/TestConvenienceVariables.test (977 of 2119) PASS: lldb-shell :: Settings/TestSettingsSet.test (978 of 2119) PASS: lldb-unit :: Utility/./UtilityTests/StringListTest.LongestCommonPrefix (979 of 2119) PASS: lldb-unit :: Utility/./UtilityTests/StringListTest.AppendListCStringArrayEmpty (980 of 2119) PASS: lldb-unit :: Utility/./UtilityTests/UriParserTest.MinimalPath (981 of 2119) PASS: lldb-unit :: Utility/./UtilityTests/ScalarTest.Getters (982 of 2119) PASS: lldb-api :: lang/objc/single-entry-dictionary/TestObjCSingleEntryDictionary.py (983 of 2119) PASS: lldb-unit :: Utility/./UtilityTests/StringExtractorTest.InitEmpty (984 of 2119) PASS: lldb-unit :: Utility/./UtilityTests/RangeTest.ContainsEndInclusive (985 of 2119) PASS: lldb-unit :: Process/minidump/./LLDBMinidumpTests/MinidumpParserTest.GetPid (986 of 2119) PASS: lldb-shell :: Commands/command-target-modules-dump-sections.yaml (987 of 2119) PASS: lldb-api :: functionalities/data-formatter/data-formatter-skip-summary/TestDataFormatterSkipSummary.py (988 of 2119) PASS: lldb-unit :: Utility/./UtilityTests/StringListTest.InsertStringAtIndexStart (989 of 2119) UNSUPPORTED: lldb-api :: functionalities/thread/thread_specific_break_plus_condition/TestThreadSpecificBpPlusCondition.py (990 of 2119) PASS: lldb-api :: commands/expression/vector_of_enums/TestVectorOfEnums.py (991 of 2119) PASS: lldb-unit :: UnwindAssembly/x86/./UnwindAssemblyx86Tests/Testx86AssemblyInspectionEngine.Test64bitFramelessSmallStackFrame (992 of 2119) PASS: lldb-unit :: Platform/./LLDBPlatformTests/PlatformDarwinTest.TestParseVersionBuildDir (993 of 2119) PASS: lldb-unit :: Core/./LLDBCoreTests/ModuleSpecTest.TestCOFFFile (994 of 2119) PASS: lldb-unit :: Utility/./UtilityTests/StreamTest.PutRawBytesToMixedEndian (995 of 2119) PASS: lldb-unit :: Expression/./ExpressionTests/CppModuleConfigurationTest.UnrelatedLibrary (996 of 2119) PASS: lldb-api :: iohandler/resize/TestIOHandlerResizeNoEditline.py (997 of 2119) PASS: lldb-api :: functionalities/inferior-crashing/TestInferiorCrashing.py (998 of 2119) PASS: lldb-api :: commands/expression/ir-interpreter-phi-nodes/TestIRInterpreterPHINodes.py (999 of 2119) PASS: lldb-unit :: Utility/./UtilityTests/RangeTest.Copy (1000 of 2119) PASS: lldb-unit :: Process/minidump/./LLDBMinidumpTests/MinidumpParserTest.GetArchitecture (1001 of 2119) PASS: lldb-unit :: Utility/./UtilityTests/StringExtractorTest.GetHexU8_Underflow (1002 of 2119) PASS: lldb-api :: commands/command/script/TestCommandScript.py (1003 of 2119) PASS: lldb-api :: macosx/nslog/TestDarwinNSLogOutput.py (1004 of 2119) PASS: lldb-api :: lang/cpp/covariant-return-types/TestCovariantReturnTypes.py (1005 of 2119) PASS: lldb-shell :: Driver/LocalLLDBInit.test (1006 of 2119) PASS: lldb-unit :: Utility/./UtilityTests/StringListTest.JoinNonSpace (1007 of 2119) PASS: lldb-api :: functionalities/thread/crash_during_step/TestCrashDuringStep.py (1008 of 2119) PASS: lldb-unit :: Host/./HostTests/NativeProcessProtocolTest.ReadMemoryWithoutTrap (1009 of 2119) PASS: lldb-unit :: SymbolFile/NativePDB/./SymbolFileNativePDBTests/PDBFPOProgramToDWARFExpressionTests.MultipleIndependentAssignments (1010 of 2119) PASS: lldb-api :: lang/c/unions/TestUnionMembers.py (1011 of 2119) PASS: lldb-unit :: Utility/./UtilityTests/DataExtractorTest.UncommonAddressSize (1012 of 2119) PASS: lldb-unit :: ScriptInterpreter/Python/./ScriptInterpreterPythonTests/PythonDataObjectsTest.TestPythonString (1013 of 2119) PASS: lldb-unit :: Utility/./UtilityTests/StreamTest.AddressPrefix (1014 of 2119) PASS: lldb-shell :: SymbolFile/Breakpad/unwind-via-stack-win.test (1015 of 2119) PASS: lldb-unit :: Utility/./UtilityTests/FileSpecTest.FormatFileSpec (1016 of 2119) PASS: lldb-unit :: Utility/./UtilityTests/RegisterValueTest.GetSet8 (1017 of 2119) PASS: lldb-api :: lang/objc/bitfield_ivars/TestBitfieldIvars.py (1018 of 2119) PASS: lldb-shell :: SymbolFile/DWARF/debug-types-address-ranges.s (1019 of 2119) PASS: lldb-shell :: ScriptInterpreter/Python/scripted_breakpoint.test (1020 of 2119) PASS: lldb-api :: functionalities/breakpoint/objc/TestObjCBreakpoints.py (1021 of 2119) PASS: lldb-unit :: Process/gdb-remote/./ProcessGdbRemoteTests/GDBRemoteCommunicationClientTest.SaveRestoreRegistersNoSuffix (1022 of 2119) PASS: lldb-api :: lang/objc/direct-dispatch-step/TestObjCDirectDispatchStepping.py (1023 of 2119) PASS: lldb-unit :: Core/./LLDBCoreTests/ModuleSpecTest.TestMachOFile (1024 of 2119) PASS: lldb-api :: functionalities/postmortem/elf-core/TestLinuxCore.py (1025 of 2119) UNSUPPORTED: lldb-shell :: Reproducer/TestLuaImport.test (1026 of 2119) PASS: lldb-shell :: SymbolFile/DWARF/debug_ranges.s (1027 of 2119) PASS: lldb-shell :: ObjectFile/wasm/unified-debug-sections.yaml (1028 of 2119) PASS: lldb-unit :: Utility/./UtilityTests/RangeDataVector.CustomSort (1029 of 2119) PASS: lldb-api :: functionalities/data-formatter/data-formatter-stl/libcxx/vector/TestDataFormatterLibcxxVector.py (1030 of 2119) PASS: lldb-api :: commands/expression/call-function/TestCallBuiltinFunction.py (1031 of 2119) PASS: lldb-unit :: Utility/./UtilityTests/TimeoutTest.Format (1032 of 2119) PASS: lldb-unit :: API/./APITests/SBCommandInterpreterTest.MultiWordCommand (1033 of 2119) PASS: lldb-shell :: Quit/TestQuitExitCode-30.test (1034 of 2119) PASS: lldb-api :: python_api/disassemble-raw-data/TestDisassembleRawData.py (1035 of 2119) PASS: lldb-api :: lang/cpp/char8_t/TestCxxChar8_t.py (1036 of 2119) PASS: lldb-unit :: Symbol/./SymbolTests/LineEntryTest.GetSameLineContiguousAddressRangeOneInline (1037 of 2119) PASS: lldb-api :: commands/platform/file/read/TestPlatformFileRead.py (1038 of 2119) PASS: lldb-api :: functionalities/data-formatter/data-formatter-synthtype/TestDataFormatterSynthType.py (1039 of 2119) PASS: lldb-shell :: Settings/TestStopCommandSourceOnError.test (1040 of 2119) PASS: lldb-unit :: Symbol/./SymbolTests/TestTypeSystemClang.TestIsClangType (1041 of 2119) PASS: lldb-api :: tools/lldb-vscode/module/TestVSCode_module.py (1042 of 2119) PASS: lldb-unit :: Editline/./EditlineTests/EditlineTestFixture.EditlineReceivesSingleLineText (1043 of 2119) PASS: lldb-shell :: SymbolFile/DWARF/split-dwarf-inlining.cpp (1044 of 2119) PASS: lldb-unit :: ScriptInterpreter/Python/./ScriptInterpreterPythonTests/PythonDataObjectsTest.TestDictionaryResolutionWithDot (1045 of 2119) PASS: lldb-api :: functionalities/tsan/thread_numbers/TestTsanThreadNumbers.py (1046 of 2119) PASS: lldb-unit :: ObjectFile/ELF/./ObjectFileELFTests/ObjectFileELFTest.GetModuleSpecifications_EarlySectionHeaders (1047 of 2119) PASS: lldb-shell :: ObjectFile/ELF/PT_LOAD-overlap.yaml (1048 of 2119) PASS: lldb-api :: functionalities/wrong_commands/TestWrongCommands.py (1049 of 2119) PASS: lldb-shell :: Quit/TestQuitExitCodeTooManyArgs.test (1050 of 2119) UNSUPPORTED: lldb-api :: functionalities/darwin_log/filter/exact_match/message/TestDarwinLogFilterMatchMessage.py (1051 of 2119) PASS: lldb-shell :: Driver/TestTarget.test (1052 of 2119) UNSUPPORTED: lldb-api :: functionalities/darwin_log/filter/regex/category/TestDarwinLogFilterRegexCategory.py (1053 of 2119) PASS: lldb-shell :: Recognizer/assert.test (1054 of 2119) PASS: lldb-api :: functionalities/data-formatter/data-formatter-caching/TestDataFormatterCaching.py (1055 of 2119) UNSUPPORTED: lldb-api :: arm/breakpoint-it/TestBreakpointIt.py (1056 of 2119) UNSUPPORTED: lldb-api :: functionalities/breakpoint/breakpoint_in_delayslot/TestAvoidBreakpointInDelaySlot.py (1057 of 2119) UNSUPPORTED: lldb-api :: lang/objc/objc-dynamic-value/TestObjCDynamicValue.py (1058 of 2119) PASS: lldb-unit :: ObjectFile/Breakpad/./ObjectFileBreakpadTests/StackWinRecord.parse (1059 of 2119) PASS: lldb-unit :: UnwindAssembly/x86/./UnwindAssemblyx86Tests/Testx86AssemblyInspectionEngine.Test32bitFramelessSmallStackFrame (1060 of 2119) PASS: lldb-unit :: UnwindAssembly/x86/./UnwindAssemblyx86Tests/Testx86AssemblyInspectionEngine.Test64bitFramelessBigStackFrame (1061 of 2119) PASS: lldb-unit :: Host/./HostTests/SocketAddressTest.Set (1062 of 2119) PASS: lldb-api :: lang/cpp/stl/TestStdCXXDisassembly.py (1063 of 2119) PASS: lldb-unit :: Utility/./UtilityTests/StringListTest.SetSize (1064 of 2119) PASS: lldb-unit :: Core/./LLDBCoreTests/MangledTest.NameIndexes_FindFunctionSymbols (1065 of 2119) PASS: lldb-unit :: Utility/./UtilityTests/ArgsTest.TestMultipleArgs (1066 of 2119) PASS: lldb-unit :: Utility/./UtilityTests/OptionsWithRawTest.EmptyInput (1067 of 2119) PASS: lldb-shell :: ObjectFile/PECOFF/section-types.yaml (1068 of 2119) PASS: lldb-shell :: Expr/TestIRMemoryMap.test (1069 of 2119) PASS: lldb-unit :: Process/gdb-remote/./ProcessGdbRemoteTests/GDBRemoteCommunicationClientTest.SendStartTracePacket (1070 of 2119) PASS: lldb-unit :: Process/minidump/./LLDBMinidumpTests/MinidumpParserTest.FindMemoryRangeWithFullMemoryMinidump (1071 of 2119) PASS: lldb-api :: macosx/save_crashlog/TestSaveCrashlog.py (1072 of 2119) PASS: lldb-unit :: Utility/./UtilityTests/FileSpecTest.GuessPathStyle (1073 of 2119) UNSUPPORTED: lldb-api :: functionalities/darwin_log/filter/exact_match/activity-chain/TestDarwinLogFilterMatchActivityChain.py (1074 of 2119) PASS: lldb-unit :: Language/Highlighting/./HighlighterTests/HighlighterTest.ClangUnterminatedString (1075 of 2119) PASS: lldb-unit :: Utility/./UtilityTests/FileSpecTest.PrependPathComponent (1076 of 2119) PASS: lldb-api :: lang/cpp/overloaded-functions/TestOverloadedFunctions.py (1077 of 2119) PASS: lldb-api :: lang/c/conflicting-symbol/TestConflictingSymbol.py (1078 of 2119) PASS: lldb-api :: commands/expression/save_jit_objects/TestSaveJITObjects.py (1079 of 2119) PASS: lldb-shell :: ObjectFile/MachO/lc_build_version.yaml (1080 of 2119) PASS: lldb-api :: commands/watchpoints/watchpoint_commands/command/TestWatchpointCommandLLDB.py (1081 of 2119) PASS: lldb-unit :: Symbol/./SymbolTests/TestClangASTImporter.CanImportInvalidType (1082 of 2119) PASS: lldb-unit :: Process/minidump/./LLDBMinidumpTests/MinidumpParserTest.GetThreadsAndGetThreadContext (1083 of 2119) PASS: lldb-unit :: Language/Highlighting/./HighlighterTests/HighlighterTest.ClangCursorOutOfBounds (1084 of 2119) PASS: lldb-api :: functionalities/data-formatter/data-formatter-stl/libcxx/list/loop/TestDataFormatterLibcxxListLoop.py (1085 of 2119) PASS: lldb-unit :: Utility/./UtilityTests/StringLexerTest.AdvanceIf (1086 of 2119) PASS: lldb-unit :: ScriptInterpreter/Python/./ScriptInterpreterPythonTests/PythonDataObjectsTest.TestPythonTupleSize (1087 of 2119) PASS: lldb-api :: commands/frame/recognizer/TestFrameRecognizer.py (1088 of 2119) PASS: lldb-api :: tools/lldb-vscode/coreFile/TestVSCode_coreFile.py (1089 of 2119) PASS: lldb-unit :: Utility/./UtilityTests/ArgsTest.ReplaceArgumentAtIndexShort (1090 of 2119) PASS: lldb-shell :: ObjectFile/PECOFF/invalid-export-table.yaml (1091 of 2119) PASS: lldb-api :: lang/cpp/global_variables/TestCPPGlobalVariables.py (1092 of 2119) PASS: lldb-unit :: Interpreter/./InterpreterTests/OptionValueFileColonLine.setFromString (1093 of 2119) PASS: lldb-unit :: ScriptInterpreter/Python/./ScriptInterpreterPythonTests/PythonDataObjectsTest.TestPythonTupleInitializerList (1094 of 2119) UNSUPPORTED: lldb-shell :: SymbolFile/NativePDB/typedefs.cpp (1095 of 2119) PASS: lldb-api :: commands/expression/weak_symbols/TestWeakSymbols.py (1096 of 2119) UNSUPPORTED: lldb-shell :: SymbolFile/PDB/class-layout.test (1097 of 2119) PASS: lldb-unit :: debugserver/./debugserverTests/RNBSocket.LoopBackListenIPv4 (1098 of 2119) PASS: lldb-unit :: Utility/./UtilityTests/BinaryStreamTest.PutULEB128OneByte (1099 of 2119) PASS: lldb-api :: functionalities/data-formatter/data-formatter-objc/TestDataFormatterObjCKVO.py (1100 of 2119) PASS: lldb-api :: lang/objc/foundation/TestObjectDescriptionAPI.py (1101 of 2119) PASS: lldb-unit :: Utility/./UtilityTests/StreamTest.PutCharWhitespace (1102 of 2119) UNSUPPORTED: lldb-shell :: Register/x86-ymm-read.test (1103 of 2119) PASS: lldb-api :: macosx/add-dsym/TestAddDsymMidExecutionCommand.py (1104 of 2119) PASS: lldb-api :: types/TestShortType.py (1105 of 2119) PASS: lldb-api :: lang/cpp/char1632_t/TestChar1632T.py (1106 of 2119) PASS: lldb-shell :: ObjectFile/PECOFF/sections.yaml (1107 of 2119) PASS: lldb-unit :: Utility/./UtilityTests/UUIDTest.RelationalOperators (1108 of 2119) PASS: lldb-api :: functionalities/gdb_remote_client/TestRegDefinitionInParts.py (1109 of 2119) PASS: lldb-shell :: SymbolFile/DWARF/compilercontext.ll (1110 of 2119) PASS: lldb-unit :: Expression/./ExpressionTests/DiagnosticManagerTest.HasFixits (1111 of 2119) PASS: lldb-unit :: Expression/./ExpressionTests/DWARFExpression.DW_OP_unknown (1112 of 2119) PASS: lldb-api :: commands/expression/class_template_specialization_empty_pack/TestClassTemplateSpecializationParametersHandling.py (1113 of 2119) PASS: lldb-api :: lang/objc/variadic_methods/TestVariadicMethods.py (1114 of 2119) PASS: lldb-api :: commands/watchpoints/step_over_watchpoint/TestStepOverWatchpoint.py (1115 of 2119) PASS: lldb-api :: commands/frame/diagnose/local-variable/TestLocalVariable.py (1116 of 2119) PASS: lldb-unit :: Utility/./UtilityTests/StreamTest.PutHex16ByteOrderBig (1117 of 2119) PASS: lldb-api :: python_api/exprpath_synthetic/TestExprPathSynthetic.py (1118 of 2119) PASS: lldb-api :: functionalities/tail_call_frames/ambiguous_tail_call_seq1/TestAmbiguousTailCallSeq1.py (1119 of 2119) UNSUPPORTED: lldb-api :: commands/target/auto-install-main-executable/TestAutoInstallMainExecutable.py (1120 of 2119) PASS: lldb-unit :: Process/minidump/./LLDBMinidumpTests/MinidumpParserTest.GetMiscInfoWindows (1121 of 2119) PASS: lldb-api :: lang/objc/foundation/TestObjCMethodsNSError.py (1122 of 2119) PASS: lldb-api :: lang/cpp/typedef/TestCppTypedef.py (1123 of 2119) PASS: lldb-unit :: Language/Highlighting/./HighlighterTests/HighlighterTest.ClangEmptyInput (1124 of 2119) PASS: lldb-api :: commands/register/register/register_command/TestRegisters.py (1125 of 2119) PASS: lldb-unit :: Utility/./UtilityTests/StringListTest.GetMaxStringLengthDecreasingSize (1126 of 2119) PASS: lldb-api :: lang/cpp/modules-import/TestCXXModulesImport.py (1127 of 2119) UNSUPPORTED: lldb-api :: python_api/event/TestEvents.py (1128 of 2119) PASS: lldb-unit :: Utility/./UtilityTests/RecordReplayTest.InstrumentedFoo (1129 of 2119) PASS: lldb-shell :: BuildScript/compiler-full-path.test (1130 of 2119) PASS: lldb-unit :: UnwindAssembly/x86/./UnwindAssemblyx86Tests/Testx86AssemblyInspectionEngine.TestPushImm (1131 of 2119) PASS: lldb-unit :: Utility/./UtilityTests/EnvironmentTest.EnvpConversion (1132 of 2119) PASS: lldb-unit :: DataFormatter/./LLDBFormatterTests/StringPrinterTests.CxxASCII (1133 of 2119) PASS: lldb-shell :: SymbolFile/DWARF/dwarf5_locations.s (1134 of 2119) PASS: lldb-unit :: Process/gdb-remote/./ProcessGdbRemoteTests/GDBRemoteClientBaseTest.InterruptNoResponse (1135 of 2119) UNSUPPORTED: lldb-api :: commands/register/register/intel_xtended_registers/mpx_offset_intersection/TestMPXOffsetIntersection.py (1136 of 2119) PASS: lldb-unit :: tools/lldb-server/tests/./LLDBServerTests/TestBase.LaunchModePreservesEnvironment (1137 of 2119) PASS: lldb-api :: lang/c/find_struct_type/TestFindStructTypes.py (1138 of 2119) PASS: lldb-shell :: Breakpoint/debug_rnglistx_rlex.test (1139 of 2119) PASS: lldb-shell :: ObjectFile/ELF/PT_LOAD-overlap-PT_INTERP.yaml (1140 of 2119) PASS: lldb-api :: commands/watchpoints/watchpoint_events/TestWatchpointEvents.py (1141 of 2119) PASS: lldb-unit :: Utility/./UtilityTests/GeneratorTest.GetOrCreate (1142 of 2119) PASS: lldb-unit :: Process/minidump/./LLDBMinidumpTests/MinidumpParserTest.InvalidMinidump (1143 of 2119) PASS: lldb-api :: functionalities/tsan/global_location/TestTsanGlobalLocation.py (1144 of 2119) PASS: lldb-shell :: Reproducer/Functionalities/TestImageList.test (1145 of 2119) PASS: lldb-unit :: ObjectFile/PECOFF/./ObjectFilePECOFFTests/PECallFrameInfoTest.Chained_eh (1146 of 2119) PASS: lldb-unit :: Expression/./ExpressionTests/CppModuleConfigurationTest.IgnoreLibStdCpp (1147 of 2119) PASS: lldb-unit :: Platform/./LLDBPlatformTests/PlatformAppleSimulatorTest.TestSimHasSimEnvionament (1148 of 2119) PASS: lldb-api :: api/command-return-object/TestSBCommandReturnObject.py (1149 of 2119) PASS: lldb-unit :: Utility/./UtilityTests/DataExtractorTest.GetULEB128_bit63 (1150 of 2119) PASS: lldb-unit :: Utility/./UtilityTests/ScalarTest.ExtractBitfield (1151 of 2119) PASS: lldb-api :: commands/expression/import-std-module/forward_list/TestForwardListFromStdModule.py (1152 of 2119) PASS: lldb-api :: commands/command/invalid-args/TestInvalidArgsCommand.py (1153 of 2119) UNSUPPORTED: lldb-shell :: SymbolFile/PDB/vbases.test (1154 of 2119) PASS: lldb-api :: python_api/objc_type/TestObjCType.py (1155 of 2119) UNSUPPORTED: lldb-shell :: ScriptInterpreter/Lua/command_script_import.test (1156 of 2119) PASS: lldb-api :: terminal/TestEditline.py (1157 of 2119) PASS: lldb-shell :: Reproducer/TestCaptureEnvOverride.test (1158 of 2119) UNSUPPORTED: lldb-api :: lang/objc/rdar-12408181/TestRdar12408181.py (1159 of 2119) PASS: lldb-shell :: SymbolFile/Breakpad/unwind-via-stack-cfi.test (1160 of 2119) PASS: lldb-unit :: Utility/./UtilityTests/StreamTest.PutRawBytesToLittleEndian (1161 of 2119) PASS: lldb-api :: commands/expression/anonymous-struct/TestCallUserAnonTypedef.py (1162 of 2119) PASS: lldb-shell :: ObjectFile/PECOFF/uuid.yaml (1163 of 2119) PASS: lldb-unit :: SymbolFile/NativePDB/./SymbolFileNativePDBTests/PDBFPOProgramToDWARFExpressionTests.SingleAssignmentRegisterRef (1164 of 2119) PASS: lldb-unit :: Utility/./UtilityTests/UriParserTest.BracketedHostnameWithColon (1165 of 2119) PASS: lldb-shell :: Reproducer/TestDriverOptions.test (1166 of 2119) PASS: lldb-unit :: Utility/./UtilityTests/XcodeSDKTest.MergeTest (1167 of 2119) PASS: lldb-unit :: UnwindAssembly/x86/./UnwindAssemblyx86Tests/Testx86AssemblyInspectionEngine.TestPopR12 (1168 of 2119) PASS: lldb-api :: functionalities/data-formatter/refpointer-recursion/TestDataFormatterRefPtrRecursion.py (1169 of 2119) PASS: lldb-api :: lang/cpp/member-and-local-vars-with-same-name/TestMembersAndLocalsWithSameName.py (1170 of 2119) UNSUPPORTED: lldb-shell :: Watchpoint/netbsd-nouserdbregs.test (1171 of 2119) PASS: lldb-unit :: Utility/./UtilityTests/StreamTest.PutCStringWithStringRef (1172 of 2119) PASS: lldb-api :: commands/disassemble/basic/TestFrameDisassemble.py (1173 of 2119) PASS: lldb-api :: lang/cpp/template/TestTemplateArgs.py (1174 of 2119) PASS: lldb-unit :: UnwindAssembly/x86/./UnwindAssemblyx86Tests/Testx86AssemblyInspectionEngine.TestSpArithx86_64Augmented (1175 of 2119) PASS: lldb-api :: functionalities/data-formatter/data-formatter-stl/libcxx/unique_ptr/TestDataFormatterLibcxxUniquePtr.py (1176 of 2119) PASS: lldb-api :: functionalities/reproducers/attach/TestReproducerAttach.py (1177 of 2119) PASS: lldb-api :: lang/objcxx/hide-runtime-values/TestObjCXXHideRuntimeValues.py (1178 of 2119) PASS: lldb-api :: commands/quit/TestQuit.py (1179 of 2119) PASS: lldb-api :: tools/lldb-server/TestGdbRemote_vCont.py (1180 of 2119) UNSUPPORTED: lldb-api :: functionalities/data-formatter/data-formatter-stl/libstdcpp/string/TestDataFormatterStdString.py (1181 of 2119) PASS: lldb-api :: functionalities/inferior-assert/TestInferiorAssert.py (1182 of 2119) PASS: lldb-shell :: SymbolFile/Breakpad/line-table-edgecases.test (1183 of 2119) PASS: lldb-shell :: SymbolFile/DWARF/find-method.cpp (1184 of 2119) PASS: lldb-unit :: Utility/./UtilityTests/StringListTest.JoinEmpty (1185 of 2119) UNSUPPORTED: lldb-api :: lang/c/typedef/Testtypedef.py (1186 of 2119) PASS: lldb-unit :: Utility/./UtilityTests/FileSpecTest.EqualDotsPosixRoot (1187 of 2119) PASS: lldb-unit :: Host/./HostTests/ConnectionFileDescriptorTest.TCPGetURIv4 (1188 of 2119) PASS: lldb-shell :: SymbolFile/DWARF/dwarf5-partial-index.cpp (1189 of 2119) PASS: lldb-unit :: ObjectFile/Breakpad/./ObjectFileBreakpadTests/Record.classify (1190 of 2119) PASS: lldb-api :: python_api/watchpoint/watchlocation/TestTargetWatchAddress.py (1191 of 2119) PASS: lldb-unit :: Utility/./UtilityTests/AnsiTerminal.AtStart (1192 of 2119) PASS: lldb-api :: functionalities/breakpoint/address_breakpoints/TestBadAddressBreakpoints.py (1193 of 2119) PASS: lldb-unit :: Host/./HostTests/NativeProcessProtocolTest.ReadCStringFromMemory (1194 of 2119) PASS: lldb-api :: functionalities/thread/concurrent_events/TestConcurrentTwoBreakpointsOneSignal.py (1195 of 2119) PASS: lldb-api :: lang/objc/conflicting-definition/TestConflictingDefinition.py (1196 of 2119) PASS: lldb-unit :: UnwindAssembly/x86/./UnwindAssemblyx86Tests/Testx86AssemblyInspectionEngine.TestPushR15 (1197 of 2119) PASS: lldb-unit :: Process/gdb-remote/./ProcessGdbRemoteTests/GDBRemoteClientBaseTest.SendPacketAndReceiveResponseWithOutputSupport (1198 of 2119) PASS: lldb-unit :: Utility/./UtilityTests/ProcessInstanceInfo.Yaml (1199 of 2119) PASS: lldb-api :: lang/objc/foundation/TestObjCMethods2.py (1200 of 2119) PASS: lldb-api :: lang/cpp/class_types/TestClassTypes.py (1201 of 2119) PASS: lldb-unit :: Symbol/./SymbolTests/SymbolsTest.LocateExecutableSymbolFileForUnknownExecutableAndMissingSymbolFile (1202 of 2119) PASS: lldb-unit :: Symbol/./SymbolTests/PostfixExpression.ParseOneExpression (1203 of 2119) PASS: lldb-unit :: Language/Highlighting/./HighlighterTests/HighlighterTest.ClangTrailingBackslashWithWhitespace (1204 of 2119) PASS: lldb-api :: commands/command/source/TestCommandSource.py (1205 of 2119) PASS: lldb-unit :: Utility/./UtilityTests/LogChannelEnabledTest.log_options (1206 of 2119) PASS: lldb-unit :: Process/minidump/./LLDBMinidumpTests/MinidumpParserTest.GetMemory (1207 of 2119) PASS: lldb-unit :: UnwindAssembly/x86/./UnwindAssemblyx86Tests/Testx86AssemblyInspectionEngine.TestPushR12 (1208 of 2119) PASS: lldb-unit :: Process/gdb-remote/./ProcessGdbRemoteTests/GDBRemoteCommunicationClientTest.WriteRegister (1209 of 2119) UNSUPPORTED: lldb-shell :: ExecControl/StopHook/stop-hook-threads.test (1210 of 2119) PASS: lldb-api :: commands/process/signal/TestProcessSignal.py (1211 of 2119) PASS: lldb-api :: functionalities/data-formatter/data-formatter-objc/nsstring/TestDataFormatterNSString.py (1212 of 2119) PASS: lldb-api :: python_api/type/TestTypeList.py (1213 of 2119) PASS: lldb-shell :: ObjectFile/ELF/avr-basic-info.yaml (1214 of 2119) PASS: lldb-unit :: Utility/./UtilityTests/RangeTest.ClearWithStarAddress (1215 of 2119) PASS: lldb-unit :: Utility/./UtilityTests/StringListTest.GetMaxStringLengthEqualSize (1216 of 2119) PASS: lldb-unit :: Symbol/./SymbolTests/Type.CompilerContextPattern (1217 of 2119) PASS: lldb-api :: lang/cpp/auto/TestCPPAuto.py (1218 of 2119) PASS: lldb-unit :: Utility/./UtilityTests/UriParserTest.MinimalPortPath (1219 of 2119) PASS: lldb-shell :: Reproducer/TestMultipleTargets.test (1220 of 2119) PASS: lldb-api :: commands/expression/import-std-module/vector/TestVectorFromStdModule.py (1221 of 2119) UNSUPPORTED: lldb-api :: functionalities/thread/concurrent_events/TestConcurrentManySignals.py (1222 of 2119) PASS: lldb-shell :: Reproducer/TestReuseDirectory.test (1223 of 2119) PASS: lldb-api :: lang/cpp/signed_types/TestSignedTypes.py (1224 of 2119) PASS: lldb-unit :: Interpreter/./InterpreterTests/CompletionTest.DirCompletionAbsolute (1225 of 2119) PASS: lldb-api :: functionalities/memory/find/TestMemoryFind.py (1226 of 2119) PASS: lldb-api :: tools/lldb-vscode/stackTrace/TestVSCode_stackTrace.py (1227 of 2119) PASS: lldb-api :: tools/lldb-server/TestAppleSimulatorOSType.py (1228 of 2119) PASS: lldb-shell :: SymbolFile/DWARF/dwp.s (1229 of 2119) PASS: lldb-unit :: Utility/./UtilityTests/ConstStringTest.MangledCounterpart (1230 of 2119) PASS: lldb-api :: functionalities/data-formatter/frameformat_smallstruct/TestFrameFormatSmallStruct.py (1231 of 2119) PASS: lldb-api :: lang/c/set_values/TestSetValues.py (1232 of 2119) PASS: lldb-unit :: UnwindAssembly/x86/./UnwindAssemblyx86Tests/Testx86AssemblyInspectionEngine.TestLEAVE (1233 of 2119) PASS: lldb-shell :: SymbolFile/NativePDB/s_constant.cpp (1234 of 2119) PASS: lldb-unit :: Utility/./UtilityTests/OptionsWithRawTest.EmptySuffixSingleWhitespace (1235 of 2119) PASS: lldb-unit :: ScriptInterpreter/Python/./ScriptInterpreterPythonTests/PythonDataObjectsTest.TestPythonCallableInvoke (1236 of 2119) PASS: lldb-api :: commands/expression/radar_9531204/TestPrintfAfterUp.py (1237 of 2119) PASS: lldb-api :: tools/lldb-vscode/step/TestVSCode_step.py (1238 of 2119) PASS: lldb-api :: functionalities/data-formatter/data-formatter-python-synth/TestDataFormatterPythonSynth.py (1239 of 2119) PASS: lldb-unit :: Utility/./UtilityTests/LogChannelTest.Enable (1240 of 2119) UNSUPPORTED: lldb-api :: functionalities/darwin_log/filter/exact_match/activity/TestDarwinLogFilterMatchActivity.py (1241 of 2119) PASS: lldb-unit :: Utility/./UtilityTests/AnsiTerminal.Twice (1242 of 2119) PASS: lldb-unit :: Utility/./UtilityTests/TimerTest.CategoryTimesStats (1243 of 2119) UNSUPPORTED: lldb-api :: linux/sepdebugsymlink/TestTargetSymbolsSepDebugSymlink.py (1244 of 2119) PASS: lldb-api :: lang/cpp/dynamic-value/TestCppValueCast.py (1245 of 2119) PASS: lldb-unit :: Symbol/./SymbolTests/TestTypeSystemClang.TestGetTypeClassTypeOf (1246 of 2119) PASS: lldb-api :: lang/objc/objc-ivar-stripped/TestObjCIvarStripped.py (1247 of 2119) PASS: lldb-shell :: Reproducer/TestProcessList.test (1248 of 2119) PASS: lldb-unit :: ScriptInterpreter/Python/./ScriptInterpreterPythonTests/PythonDataObjectsTest.TestPythonListManipulation (1249 of 2119) PASS: lldb-api :: functionalities/thread/concurrent_events/TestConcurrentDelaySignalWatch.py (1250 of 2119) PASS: lldb-api :: types/TestCharTypeExpr.py (1251 of 2119) PASS: lldb-api :: functionalities/inline-stepping/TestInlineStepping.py (1252 of 2119) PASS: lldb-api :: python_api/value/empty_class/TestValueAPIEmptyClass.py (1253 of 2119) PASS: lldb-api :: python_api/sbvalue_const_addrof/TestSBValueConstAddrOf.py (1254 of 2119) PASS: lldb-unit :: ScriptInterpreter/Python/./ScriptInterpreterPythonTests/PythonDataObjectsTest.TestPythonByteArray (1255 of 2119) PASS: lldb-unit :: Process/minidump/./LLDBMinidumpTests/MinidumpParserTest.GetArchitectureWindows (1256 of 2119) PASS: lldb-api :: lang/c/shared_lib/TestSharedLib.py (1257 of 2119) PASS: lldb-unit :: Utility/./UtilityTests/RangeTest.EqualInvalid (1258 of 2119) PASS: lldb-api :: functionalities/data-formatter/boolreference/TestFormattersBoolRefPtr.py (1259 of 2119) PASS: lldb-unit :: UnwindAssembly/x86/./UnwindAssemblyx86Tests/Testx86AssemblyInspectionEngine.Test32bitFramelessBigStackFrame (1260 of 2119) PASS: lldb-unit :: Host/./HostTests/SocketTest.DomainGetConnectURI (1261 of 2119) PASS: lldb-shell :: SymbolFile/DWARF/dir-separator-windows.s (1262 of 2119) PASS: lldb-unit :: ObjectFile/Breakpad/./ObjectFileBreakpadTests/ModuleRecord.parse (1263 of 2119) PASS: lldb-unit :: Expression/./ExpressionTests/CppModuleConfigurationTest.LibCppV2 (1264 of 2119) PASS: lldb-api :: python_api/process/read-mem-cstring/TestReadMemCString.py (1265 of 2119) PASS: lldb-unit :: Language/Highlighting/./HighlighterTests/HighlighterTest.DefaultHighlighter (1266 of 2119) PASS: lldb-api :: commands/expression/inline-namespace/TestInlineNamespace.py (1267 of 2119) PASS: lldb-unit :: Utility/./UtilityTests/Flags.AnySet (1268 of 2119) PASS: lldb-shell :: SymbolFile/NativePDB/globals-bss.cpp (1269 of 2119) UNSUPPORTED: lldb-api :: benchmarks/continue/TestBenchmarkContinue.py (1270 of 2119) PASS: lldb-api :: functionalities/plugins/command_plugin/TestPluginCommands.py (1271 of 2119) PASS: lldb-api :: commands/platform/basic/TestPlatformPython.py (1272 of 2119) PASS: lldb-api :: arm/emulation/TestEmulations.py (1273 of 2119) PASS: lldb-api :: functionalities/data-formatter/pyobjsynthprovider/TestPyObjSynthProvider.py (1274 of 2119) PASS: lldb-shell :: ScriptInterpreter/Python/sb_address_exception.test (1275 of 2119) PASS: lldb-unit :: Utility/./UtilityTests/ConstStringTest.UpdateMangledCounterpart (1276 of 2119) PASS: lldb-unit :: tools/lldb-server/tests/./LLDBServerTests/TestBase.DebugserverEnv (1277 of 2119) PASS: lldb-shell :: Quit/TestQuitExitCodeImplicit0.test (1278 of 2119) PASS: lldb-unit :: Utility/./UtilityTests/ArgsTest.TestQuotedTrailingBackslash (1279 of 2119) PASS: lldb-unit :: Utility/./UtilityTests/StringLexerTest.HasAtLeast (1280 of 2119) PASS: lldb-unit :: Utility/./UtilityTests/LogChannelEnabledTest.LogGetLogThread (1281 of 2119) PASS: lldb-api :: functionalities/deleted-executable/TestDeletedExecutable.py (1282 of 2119) PASS: lldb-shell :: Reproducer/TestSynchronous.test (1283 of 2119) PASS: lldb-shell :: ObjectFile/PECOFF/symbol.yaml (1284 of 2119) PASS: lldb-unit :: Symbol/./SymbolTests/TestTypeSystemClang.AddMethodToObjCObjectType (1285 of 2119) PASS: lldb-api :: commands/gui/viewlarge/TestGuiViewLarge.py (1286 of 2119) PASS: lldb-api :: python_api/module_section/TestModuleAndSection.py (1287 of 2119) PASS: lldb-unit :: Process/gdb-remote/./ProcessGdbRemoteTests/GDBRemoteCommunicationClientTest.GetModulesInfoInvalidResponse (1288 of 2119) PASS: lldb-shell :: Minidump/dump-all.test (1289 of 2119) PASS: lldb-shell :: SymbolFile/DWARF/find-variable-dwo.cpp (1290 of 2119) PASS: lldb-api :: lang/cpp/gmodules/TestWithModuleDebugging.py (1291 of 2119) PASS: lldb-api :: macosx/function-starts/TestFunctionStarts.py (1292 of 2119) PASS: lldb-api :: functionalities/mtc/simple/TestMTCSimple.py (1293 of 2119) PASS: lldb-unit :: Utility/./UtilityTests/ArgsTest.BareSingleQuote (1294 of 2119) PASS: lldb-api :: lang/cpp/class_static/TestStaticVariables.py (1295 of 2119) PASS: lldb-shell :: Quit/TestQuitExitCode30.test (1296 of 2119) PASS: lldb-unit :: ScriptInterpreter/Python/./ScriptInterpreterPythonTests/PythonDataObjectsTest.TestScript (1297 of 2119) PASS: lldb-unit :: Utility/./UtilityTests/RegularExpression.Valid (1298 of 2119) PASS: lldb-api :: commands/process/attach/TestProcessAttach.py (1299 of 2119) PASS: lldb-api :: lang/cpp/unique-types/TestUniqueTypes.py (1300 of 2119) PASS: lldb-api :: python_api/section/TestSectionAPI.py (1301 of 2119) PASS: lldb-api :: functionalities/gdb_remote_client/TestArmRegisterDefinition.py (1302 of 2119) PASS: lldb-api :: commands/expression/timeout/TestCallWithTimeout.py (1303 of 2119) PASS: lldb-unit :: Utility/./UtilityTests/OptionsWithRawTest.LeadingSpaceArgs (1304 of 2119) PASS: lldb-api :: functionalities/thread/concurrent_events/TestConcurrentNWatchNBreak.py (1305 of 2119) PASS: lldb-api :: commands/log/basic/TestLogging.py (1306 of 2119) PASS: lldb-unit :: Utility/./UtilityTests/GeneratorTest.Create (1307 of 2119) PASS: lldb-unit :: Process/minidump/./LLDBMinidumpTests/MinidumpParserTest.GetPidWow64 (1308 of 2119) PASS: lldb-api :: tools/lldb-vscode/breakpoint/TestVSCode_setBreakpoints.py (1309 of 2119) PASS: lldb-api :: commands/watchpoints/watchpoint_commands/condition/TestWatchpointConditionCmd.py (1310 of 2119) PASS: lldb-unit :: Utility/./UtilityTests/ArgsTest.GetQuotedCommandString (1311 of 2119) UNSUPPORTED: lldb-shell :: SymbolFile/NativePDB/stack_unwinding01.cpp (1312 of 2119) PASS: lldb-shell :: Unwind/thread-step-out-ret-addr-check.test (1313 of 2119) PASS: lldb-shell :: SymbolFile/DWARF/split-dwarf-multiple-cu.ll (1314 of 2119) PASS: lldb-unit :: Expression/./ExpressionTests/CppModuleConfigurationTest.MissingUsrInclude (1315 of 2119) PASS: lldb-unit :: Utility/./UtilityTests/ArgsTest.DoubleQuotedItem (1316 of 2119) PASS: lldb-unit :: SymbolFile/DWARF/./SymbolFileDWARFTests/XcodeSDKModuleTests.TestModuleGetXcodeSDK (1317 of 2119) PASS: lldb-unit :: Utility/./UtilityTests/StreamTest.PutStringAsRawHex8 (1318 of 2119) PASS: lldb-unit :: Symbol/./SymbolTests/DWARFCallFrameInfoTest.Basic_dwarf4 (1319 of 2119) PASS: lldb-api :: commands/watchpoints/watchpoint_size/TestWatchpointSizes.py (1320 of 2119) PASS: lldb-api :: functionalities/tsan/basic/TestTsanBasic.py (1321 of 2119) PASS: lldb-unit :: Utility/./UtilityTests/StringExtractorTest.DecodeHexU8_InvalidHex2 (1322 of 2119) PASS: lldb-api :: commands/expression/import-std-module/list/TestListFromStdModule.py (1323 of 2119) PASS: lldb-unit :: Utility/./UtilityTests/ScalarTest.Equality (1324 of 2119) PASS: lldb-unit :: Utility/./UtilityTests/AnsiTerminal.AtEnd (1325 of 2119) PASS: lldb-api :: functionalities/data-formatter/varscript_formatting/TestDataFormatterVarScriptFormatting.py (1326 of 2119) PASS: lldb-api :: lang/c/enum_types/TestEnumTypes.py (1327 of 2119) PASS: lldb-api :: functionalities/thread/concurrent_events/TestConcurrentManyBreakpoints.py (1328 of 2119) PASS: lldb-api :: functionalities/type_completion/TestTypeCompletion.py (1329 of 2119) UNSUPPORTED: lldb-api :: linux/mix-dwo-and-regular-objects/TestMixedDwarfBinary.py (1330 of 2119) PASS: lldb-unit :: Symbol/./SymbolTests/TestTypeSystemClang.TestGetBasicTypeFromName (1331 of 2119) PASS: lldb-shell :: SymbolFile/DWARF/debug_ranges-missing-section.s (1332 of 2119) PASS: lldb-unit :: Host/./HostTests/NativeProcessProtocolTest.SetBreakpoint (1333 of 2119) PASS: lldb-api :: functionalities/gdb_remote_client/TestWasm.py (1334 of 2119) PASS: lldb-unit :: Utility/./UtilityTests/ListenerTest.GetEventWait (1335 of 2119) UNSUPPORTED: lldb-shell :: Register/x86-64-gp-write.test (1336 of 2119) PASS: lldb-unit :: Host/./HostTests/Host.GetEnvironment (1337 of 2119) PASS: lldb-api :: functionalities/data-formatter/data-formatter-stl/libstdcpp/unique_ptr/invalid/TestDataFormatterInvalidStdUniquePtr.py (1338 of 2119) PASS: lldb-api :: functionalities/postmortem/elf-core/thread_crash/TestLinuxCoreThreads.py (1339 of 2119) PASS: lldb-api :: commands/expression/import_builtin_fileid/TestImportBuiltinFileID.py (1340 of 2119) PASS: lldb-api :: commands/command/script/import/TestImport.py (1341 of 2119) PASS: lldb-unit :: Utility/./UtilityTests/StreamTest.AddressRangeInvalidRange (1342 of 2119) PASS: lldb-unit :: Process/gdb-remote/./ProcessGdbRemoteTests/GDBRemoteCommunicationServerTest.SendErrorResponse_ErrorList (1343 of 2119) PASS: lldb-unit :: ScriptInterpreter/Python/./ScriptInterpreterPythonTests/PythonDataObjectsTest.TestPythonIntegerToStructuredInteger (1344 of 2119) PASS: lldb-shell :: SymbolFile/DWARF/dwo-type-in-main-file.s (1345 of 2119) PASS: lldb-unit :: UnwindAssembly/x86/./UnwindAssemblyx86Tests/Testx86AssemblyInspectionEngine.TestSubESP (1346 of 2119) PASS: lldb-shell :: ObjectFile/ELF/section-overlap.yaml (1347 of 2119) PASS: lldb-api :: functionalities/non-overlapping-index-variable-i/TestIndexVariable.py (1348 of 2119) PASS: lldb-unit :: ObjectFile/ELF/./ObjectFileELFTests/ObjectFileELFTest.GetSymtab_NoSymEntryPointArmAddressClass (1349 of 2119) PASS: lldb-unit :: Utility/./UtilityTests/ConstStringTest.FromMidOfBufferStringRef (1350 of 2119) PASS: lldb-api :: python_api/class_members/TestSBTypeClassMembers.py (1351 of 2119) UNSUPPORTED: lldb-api :: tools/lldb-server/registers-target-xml-reading/TestGdbRemoteTargetXmlPacket.py (1352 of 2119) PASS: lldb-unit :: DataFormatter/./LLDBFormatterTests/TypeMatcherTests.CreatedBySameMatchString (1353 of 2119) PASS: lldb-api :: lang/objc/self/TestObjCSelf.py (1354 of 2119) PASS: lldb-api :: commands/expression/persistent_types/TestNestedPersistentTypes.py (1355 of 2119) PASS: lldb-api :: python_api/value/linked_list/TestValueAPILinkedList.py (1356 of 2119) PASS: lldb-unit :: Utility/./UtilityTests/StringExtractorTest.GetHexU8_Extra (1357 of 2119) PASS: lldb-api :: functionalities/breakpoint/breakpoint_options/TestBreakpointOptions.py (1358 of 2119) PASS: lldb-unit :: Expression/./ExpressionTests/DiagnosticManagerTest.GetStringBasic (1359 of 2119) PASS: lldb-api :: lang/cpp/multiple-inheritance/TestCppMultipleInheritance.py (1360 of 2119) PASS: lldb-unit :: UnwindAssembly/ARM64/./Arm64InstEmulationTests/TestArm64InstEmulation.TestRegisterSavedTwice (1361 of 2119) PASS: lldb-api :: sample_test/TestSampleTest.py (1362 of 2119) PASS: lldb-unit :: Utility/./UtilityTests/BinaryStreamTest.PutULEB128MaxValue (1363 of 2119) PASS: lldb-api :: macosx/duplicate-archive-members/TestDuplicateMembers.py (1364 of 2119) PASS: lldb-api :: lang/c/complex_int/TestComplexInt.py (1365 of 2119) PASS: lldb-unit :: Utility/./UtilityTests/StringListTest.PopBack (1366 of 2119) PASS: lldb-unit :: Host/./HostTests/MainLoopTest.TerminatesImmediately (1367 of 2119) PASS: lldb-unit :: Expression/./ExpressionTests/DiagnosticManagerTest.FixedExpression (1368 of 2119) PASS: lldb-unit :: Utility/./UtilityTests/VMRange.Clear (1369 of 2119) PASS: lldb-api :: commands/expression/persistent_ptr_update/TestPersistentPtrUpdate.py (1370 of 2119) PASS: lldb-api :: macosx/lc-note/kern-ver-str/TestKernVerStrLCNOTE.py (1371 of 2119) PASS: lldb-shell :: SymbolFile/DWARF/find-variable-file.cpp (1372 of 2119) PASS: lldb-shell :: ObjectFile/MachO/lc_build_version_notools.yaml (1373 of 2119) PASS: lldb-api :: functionalities/breakpoint/cpp/TestCPPBreakpointLocations.py (1374 of 2119) PASS: lldb-unit :: UnwindAssembly/x86/./UnwindAssemblyx86Tests/Testx86AssemblyInspectionEngine.TestPopR14 (1375 of 2119) PASS: lldb-unit :: ObjectFile/Breakpad/./ObjectFileBreakpadTests/LineRecord.parse (1376 of 2119) PASS: lldb-shell :: SymbolFile/DWARF/debug-types-dwo-cross-reference.cpp (1377 of 2119) PASS: lldb-shell :: SymbolFile/DWARF/dwp-debug-types.s (1378 of 2119) PASS: lldb-unit :: Language/Highlighting/./HighlighterTests/HighlighterTest.ClangCommas (1379 of 2119) PASS: lldb-unit :: Process/gdb-remote/./ProcessGdbRemoteTests/GDBRemoteCommunicationClientTest.GetMemoryRegionInfo (1380 of 2119) PASS: lldb-unit :: Core/./LLDBCoreTests/ModuleSpecTest.TestELFFile (1381 of 2119) PASS: lldb-unit :: Utility/./UtilityTests/BinaryStreamTest.PutSLEB128SixBytes (1382 of 2119) PASS: lldb-unit :: Thread/./ThreadTests/ThreadTest.GetPrivateStopInfo (1383 of 2119) PASS: lldb-api :: functionalities/thread_plan/TestThreadPlanCommands.py (1384 of 2119) PASS: lldb-api :: lang/objc/rdar-11355592/TestRdar11355592.py (1385 of 2119) PASS: lldb-shell :: SymbolFile/DWARF/gnu-style-compression.cpp (1386 of 2119) PASS: lldb-unit :: Utility/./UtilityTests/Flags.IsClear (1387 of 2119) PASS: lldb-unit :: Instruction/./EmulatorTests/TestAArch64Emulator.TestOverflow (1388 of 2119) PASS: lldb-unit :: Utility/./UtilityTests/ScalarTest.SetValueFromCString (1389 of 2119) PASS: lldb-api :: commands/watchpoints/watchpoint_on_vectors/TestValueOfVectorVariable.py (1390 of 2119) PASS: lldb-shell :: Breakpoint/implicit_const_form_support.test (1391 of 2119) PASS: lldb-api :: lang/c/struct_types/TestStructTypes.py (1392 of 2119) PASS: lldb-api :: functionalities/data-formatter/data-formatter-stl/libcxx/unordered/TestDataFormatterUnordered.py (1393 of 2119) PASS: lldb-shell :: Minidump/memory-region-from-module.yaml (1394 of 2119) PASS: lldb-unit :: Disassembler/./DisassemblerTests/TestArmv7Disassembly.TestCortexFPDisass (1395 of 2119) PASS: lldb-unit :: SymbolFile/DWARF/./SymbolFileDWARFTests/SymbolFileDWARFTests.TestAbbrevMissingTerminator (1396 of 2119) PASS: lldb-unit :: Utility/./UtilityTests/StringListTest.Assignment (1397 of 2119) PASS: lldb-unit :: Utility/./UtilityTests/ScalarTest.Promotion (1398 of 2119) PASS: lldb-unit :: Utility/./UtilityTests/StringLexerTest.Peek (1399 of 2119) PASS: lldb-api :: lang/objc/orderedset/TestOrderedSet.py (1400 of 2119) PASS: lldb-unit :: Utility/./UtilityTests/StringExtractorTest.GetU64BigEndian (1401 of 2119) PASS: lldb-api :: macosx/load-kext/TestLoadKext.py (1402 of 2119) PASS: lldb-unit :: Symbol/./SymbolTests/TestClangASTImporter.DeportTypeTagDecl (1403 of 2119) PASS: lldb-unit :: Utility/./UtilityTests/UriParserTest.BadPort2 (1404 of 2119) PASS: lldb-api :: functionalities/postmortem/wow64_minidump/TestWow64MiniDump.py (1405 of 2119) PASS: lldb-unit :: Utility/./UtilityTests/Flags.Reset (1406 of 2119) PASS: lldb-api :: functionalities/thread/concurrent_events/TestConcurrentSignalDelayWatch.py (1407 of 2119) PASS: lldb-api :: functionalities/data-formatter/data-formatter-synth/TestDataFormatterSynth.py (1408 of 2119) UNSUPPORTED: lldb-shell :: SymbolFile/target-symbols-add-unwind.test (1409 of 2119) PASS: lldb-unit :: Utility/./UtilityTests/ArgsTest.ReplaceArgumentAtIndexLonger (1410 of 2119) PASS: lldb-unit :: Utility/./UtilityTests/StringListTest.CopyList (1411 of 2119) PASS: lldb-unit :: UnwindAssembly/x86/./UnwindAssemblyx86Tests/Testx86AssemblyInspectionEngine.TestSimple32bitFrameFunction (1412 of 2119) UNSUPPORTED: lldb-api :: commands/watchpoints/variable_out_of_scope/TestWatchedVarHitWhenInScope.py (1413 of 2119) PASS: lldb-api :: functionalities/tail_call_frames/sbapi_support/TestTailCallFrameSBAPI.py (1414 of 2119) PASS: lldb-shell :: SymbolFile/DWARF/inline-function-address-shared.test (1415 of 2119) PASS: lldb-api :: commands/expression/char/TestExprsChar.py (1416 of 2119) PASS: lldb-api :: functionalities/unwind/zeroth_frame/TestZerothFrame.py (1417 of 2119) PASS: lldb-api :: lang/objc/objc-static-method-stripped/TestObjCStaticMethodStripped.py (1418 of 2119) PASS: lldb-unit :: Utility/./UtilityTests/ScalarTest.SetValueFromData (1419 of 2119) PASS: lldb-api :: functionalities/data-formatter/hexcaps/TestDataFormatterHexCaps.py (1420 of 2119) PASS: lldb-api :: python_api/signals/TestSignalsAPI.py (1421 of 2119) PASS: lldb-unit :: ObjectFile/Breakpad/./ObjectFileBreakpadTests/PublicRecord.parse (1422 of 2119) UNSUPPORTED: lldb-api :: functionalities/thread/state/TestThreadStates.py (1423 of 2119) PASS: lldb-api :: commands/frame/language/TestGuessLanguage.py (1424 of 2119) PASS: lldb-api :: commands/platform/file/close/TestPlatformFileClose.py (1425 of 2119) PASS: lldb-shell :: SymbolFile/DWARF/DW_TAG_basic_type_DW_ATE_UTF_nonC.ll (1426 of 2119) UNSUPPORTED: lldb-shell :: Register/x86-zmm-write.test (1427 of 2119) PASS: lldb-shell :: Reproducer/TestPythonImport.test (1428 of 2119) UNSUPPORTED: lldb-api :: functionalities/longjmp/TestLongjmp.py (1429 of 2119) PASS: lldb-api :: lang/cpp/gmodules-templates/TestGModules.py (1430 of 2119) PASS: lldb-unit :: Utility/./UtilityTests/BroadcasterTest.BroadcastEvent (1431 of 2119) PASS: lldb-api :: functionalities/stats_api/TestStatisticsAPI.py (1432 of 2119) PASS: lldb-unit :: Utility/./UtilityTests/GeneratorTest.Get (1433 of 2119) UNSUPPORTED: lldb-shell :: Unwind/eh-frame-augment-noop.test (1434 of 2119) XFAIL: lldb-shell :: Register/x86-64-write.test (1435 of 2119) PASS: lldb-unit :: Utility/./UtilityTests/StreamTest.PutBytesAsRawHex8ToMixedEndian (1436 of 2119) PASS: lldb-unit :: Process/gdb-remote/./ProcessGdbRemoteTests/GDBRemoteCommunicationClientTest.GetModulesInfo_UUID20 (1437 of 2119) PASS: lldb-api :: macosx/DBGSourcePathRemapping/TestDSYMSourcePathRemapping.py (1438 of 2119) PASS: lldb-shell :: Driver/TestCore.test (1439 of 2119) PASS: lldb-unit :: SymbolFile/NativePDB/./SymbolFileNativePDBTests/PDBFPOProgramToDWARFExpressionTests.InvalidAssignmentMultiple (1440 of 2119) PASS: lldb-api :: functionalities/step_scripted/TestStepScripted.py (1441 of 2119) PASS: lldb-api :: python_api/sbdata/TestSBData.py (1442 of 2119) PASS: lldb-api :: functionalities/data-formatter/vector-types/TestVectorTypesFormatting.py (1443 of 2119) PASS: lldb-unit :: Core/./LLDBCoreTests/RichManglingContextTest.SwitchProvider (1444 of 2119) PASS: lldb-api :: functionalities/thread/concurrent_events/TestConcurrentSignalWatchBreak.py (1445 of 2119) PASS: lldb-api :: functionalities/data-formatter/data-formatter-objc/TestDataFormatterObjCCF.py (1446 of 2119) PASS: lldb-unit :: Utility/./UtilityTests/StringListTest.SplitIntoLines (1447 of 2119) PASS: lldb-api :: commands/target/stop-hook/enable/TestTargetStopHookEnable.py (1448 of 2119) PASS: lldb-shell :: SymbolFile/DWARF/apple-index-is-used.cpp (1449 of 2119) PASS: lldb-api :: commands/watchpoints/hello_watchpoint/TestMyFirstWatchpoint.py (1450 of 2119) PASS: lldb-api :: commands/expression/po_verbosity/TestPoVerbosity.py (1451 of 2119) PASS: lldb-unit :: Symbol/./SymbolTests/TestClangASTImporter.DeportDeclTagDecl (1452 of 2119) UNSUPPORTED: lldb-api :: functionalities/tty/TestTerminal.py (1453 of 2119) UNSUPPORTED: lldb-shell :: ScriptInterpreter/Lua/watchpoint_callback.test (1454 of 2119) PASS: lldb-shell :: SymbolFile/DWARF/childless-compile-unit.s (1455 of 2119) PASS: lldb-unit :: Utility/./UtilityTests/Flags.Test (1456 of 2119) PASS: lldb-unit :: Process/minidump/./LLDBMinidumpTests/MinidumpParserTest.GetMiscInfo_no_stream (1457 of 2119) PASS: lldb-shell :: SymbolFile/Breakpad/line-table-mixed-path-styles.test (1458 of 2119) UNSUPPORTED: lldb-api :: functionalities/data-formatter/data-formatter-stl/libstdcpp/smart_ptr/TestDataFormatterStdSmartPtr.py (1459 of 2119) PASS: lldb-shell :: Breakpoint/debug_rnglist_rlestartend.test (1460 of 2119) PASS: lldb-shell :: SymbolFile/DWARF/DW_TAG_variable-DW_AT_const_value.s (1461 of 2119) PASS: lldb-api :: commands/platform/basic/TestPlatformCommand.py (1462 of 2119) UNSUPPORTED: lldb-shell :: SymbolFile/NativePDB/ast-functions-msvc.cpp (1463 of 2119) PASS: lldb-api :: functionalities/asan/TestMemoryHistory.py (1464 of 2119) PASS: lldb-api :: functionalities/data-formatter/builtin-formats/TestBuiltinFormats.py (1465 of 2119) UNSUPPORTED: lldb-shell :: SymbolFile/PDB/pointers.test (1466 of 2119) PASS: lldb-shell :: SymbolFile/Breakpad/stack-cfi-parsing.test (1467 of 2119) PASS: lldb-unit :: Disassembler/./DisassemblerTests/TestArm64Disassembly.TestArmv81Instruction (1468 of 2119) PASS: lldb-api :: functionalities/data-formatter/data-formatter-stl/libcxx/iterator/TestDataFormatterLibccIterator.py (1469 of 2119) UNSUPPORTED: lldb-api :: functionalities/process_save_core/TestProcessSaveCore.py (1470 of 2119) PASS: lldb-shell :: SymbolFile/DWARF/dwp-separate-debug-file.cpp (1471 of 2119) PASS: lldb-unit :: Utility/./UtilityTests/VMRange.Reset (1472 of 2119) PASS: lldb-shell :: SymbolFile/NativePDB/bitfields.cpp (1473 of 2119) PASS: lldb-unit :: Language/Highlighting/./HighlighterTests/HighlighterTest.ClangOperators (1474 of 2119) PASS: lldb-unit :: Utility/./UtilityTests/PassiveReplayTest.InstrumentedFooInvalid (1475 of 2119) PASS: lldb-api :: lang/objc/objc-optimized/TestObjcOptimized.py (1476 of 2119) PASS: lldb-unit :: Utility/./UtilityTests/XcodeSDKTest.ParseTest (1477 of 2119) PASS: lldb-unit :: Utility/./UtilityTests/ArgsTest.TestSingleArgWithQuotedSpace (1478 of 2119) PASS: lldb-shell :: Settings/TestSettingsWrite.test (1479 of 2119) PASS: lldb-api :: source-manager/TestSourceManager.py (1480 of 2119) PASS: lldb-api :: commands/expression/import-std-module/unique_ptr-dbg-info-content/TestUniquePtrDbgInfoContent.py (1481 of 2119) UNSUPPORTED: lldb-api :: commands/register/register/intel_xtended_registers/mpx_bound_violation/TestBoundViolation.py (1482 of 2119) PASS: lldb-shell :: SymbolFile/DWARF/dir-separator-no-comp-dir-relative-name.s (1483 of 2119) UNSUPPORTED: lldb-api :: functionalities/data-formatter/data-formatter-stl/libstdcpp/vbool/TestDataFormatterStdVBool.py (1484 of 2119) PASS: lldb-unit :: Utility/./UtilityTests/OptionsWithRawTest.TerminatedQuote (1485 of 2119) PASS: lldb-unit :: SymbolFile/NativePDB/./SymbolFileNativePDBTests/PDBFPOProgramToDWARFExpressionTests.InvalidOpUnary (1486 of 2119) PASS: lldb-unit :: Utility/./UtilityTests/ArgsTest.TestUnknownEscape (1487 of 2119) PASS: lldb-api :: functionalities/breakpoint/breakpoint_command/TestBreakpointCommandsFromPython.py (1488 of 2119) PASS: lldb-api :: functionalities/breakpoint/debugbreak/TestDebugBreak.py (1489 of 2119) PASS: lldb-shell :: Minidump/Windows/find-module.test (1490 of 2119) PASS: lldb-unit :: Utility/./UtilityTests/UUIDTest.StringConverion (1491 of 2119) PASS: lldb-unit :: Utility/./UtilityTests/BinaryStreamTest.PutSLEB128Zero (1492 of 2119) PASS: lldb-api :: macosx/profile_vrs_detach/TestDetachVrsProfile.py (1493 of 2119) PASS: lldb-api :: python_api/lldbutil/iter/TestLLDBIterator.py (1494 of 2119) UNSUPPORTED: lldb-api :: lang/cpp/printf/TestPrintf.py (1495 of 2119) PASS: lldb-unit :: ScriptInterpreter/Python/./ScriptInterpreterPythonTests/PythonDataObjectsTest.TestExtractingUInt64ThroughStructuredData (1496 of 2119) UNSUPPORTED: lldb-api :: functionalities/signal/handle-segv/TestHandleSegv.py (1497 of 2119) PASS: lldb-unit :: Utility/./UtilityTests/StringLexerTest.NextIf (1498 of 2119) PASS: lldb-api :: commands/expression/radar_8638051/Test8638051.py (1499 of 2119) PASS: lldb-unit :: Language/Highlighting/./HighlighterTests/HighlighterTest.DefaultHighlighterWithCursorOutOfBounds (1500 of 2119) PASS: lldb-unit :: ScriptInterpreter/Python/./ScriptInterpreterPythonTests/PythonDataObjectsTest.TestPythonStringToStr (1501 of 2119) PASS: lldb-unit :: SymbolFile/DWARF/./SymbolFileDWARFTests/SymbolFileDWARFTests.TestAbilitiesForDWARF (1502 of 2119) PASS: lldb-api :: commands/help/TestHelp.py (1503 of 2119) PASS: lldb-unit :: Host/./HostTests/ProcessLaunchInfoTest.Constructor (1504 of 2119) PASS: lldb-unit :: UnwindAssembly/x86/./UnwindAssemblyx86Tests/Testx86AssemblyInspectionEngine.TestSpillRegToStackViaMOVx86_64 (1505 of 2119) PASS: lldb-api :: commands/watchpoints/watchpoint_disable/TestWatchpointDisable.py (1506 of 2119) UNSUPPORTED: lldb-shell :: Register/aarch64-fp-read.test (1507 of 2119) PASS: lldb-unit :: Utility/./UtilityTests/ProcessInfoTest.Constructor (1508 of 2119) PASS: lldb-shell :: Watchpoint/SetErrorCases.test (1509 of 2119) PASS: lldb-api :: functionalities/tail_call_frames/cross_dso/TestCrossDSOTailCalls.py (1510 of 2119) PASS: lldb-unit :: Utility/./UtilityTests/StringExtractorTest.GetNameColonValueNoSemicolon (1511 of 2119) UNSUPPORTED: lldb-shell :: Register/x86-zmm-read.test (1512 of 2119) UNSUPPORTED: lldb-api :: tools/lldb-server/TestGdbRemoteAuxvSupport.py (1513 of 2119) PASS: lldb-unit :: Utility/./UtilityTests/StreamTest.PutMaxHex64ByteOrderLittle (1514 of 2119) PASS: lldb-api :: functionalities/tsan/multiple/TestTsanMultiple.py (1515 of 2119) PASS: lldb-shell :: SymbolFile/DWARF/clang-ast-from-dwarf-objc-property.m (1516 of 2119) PASS: lldb-unit :: Utility/./UtilityTests/CompletionRequest.FakeLastArg (1517 of 2119) PASS: lldb-api :: macosx/find-app-in-bundle/TestFindAppInBundle.py (1518 of 2119) PASS: lldb-unit :: debugserver/./debugserverTests/RNBSocket.LoopBackListenIPv6 (1519 of 2119) PASS: lldb-shell :: BuildScript/toolchain-clang.test (1520 of 2119) PASS: lldb-unit :: Language/Highlighting/./HighlighterTests/HighlighterTest.FallbackHighlighter (1521 of 2119) PASS: lldb-shell :: Settings/TestEchoCommands.test (1522 of 2119) PASS: lldb-api :: driver/batch_mode/TestBatchMode.py (1523 of 2119) PASS: lldb-shell :: Breakpoint/single-file-split-dwarf.test (1524 of 2119) PASS: lldb-api :: iohandler/resize/TestIOHandlerResize.py (1525 of 2119) PASS: lldb-unit :: Expression/./ExpressionTests/DiagnosticManagerTest.PutString (1526 of 2119) PASS: lldb-unit :: Utility/./UtilityTests/ArgsTest.TestQuotedUnknownEscape (1527 of 2119) PASS: lldb-unit :: Utility/./UtilityTests/ProcessInstanceInfo.DumpTable_invalidUID (1528 of 2119) PASS: lldb-api :: lang/c/inlines/TestRedefinitionsInInlines.py (1529 of 2119) PASS: lldb-api :: functionalities/breakpoint/breakpoint_command/TestBreakpointCommand.py (1530 of 2119) PASS: lldb-unit :: Utility/./UtilityTests/StreamTeeTest.Constructor1Stream (1531 of 2119) PASS: lldb-shell :: Quit/TestQuitExitCodeHexA.test (1532 of 2119) PASS: lldb-unit :: Utility/./UtilityTests/VMRange.ContainsRange (1533 of 2119) PASS: lldb-api :: functionalities/tail_call_frames/cross_object/TestCrossObjectTailCalls.py (1534 of 2119) PASS: lldb-shell :: ObjectFile/Breakpad/uuid-matching-mac.test (1535 of 2119) PASS: lldb-unit :: Symbol/./SymbolTests/TestClangASTImporter.MetadataPropagationIndirectImport (1536 of 2119) PASS: lldb-unit :: Utility/./UtilityTests/StreamTeeTest.GetStreamAtIndexOutOfBounds (1537 of 2119) PASS: lldb-unit :: ObjectFile/ELF/./ObjectFileELFTests/ObjectFileELFTest.SectionsResolveConsistently (1538 of 2119) UNSUPPORTED: lldb-shell :: ObjectFile/ELF/minidebuginfo-set-and-hit-breakpoint.test (1539 of 2119) UNSUPPORTED: lldb-api :: functionalities/darwin_log/filter/regex/activity-chain/TestDarwinLogFilterRegexActivityChain.py (1540 of 2119) PASS: lldb-api :: sanity/TestModuleCacheSanity.py (1541 of 2119) PASS: lldb-unit :: Process/./ProcessEventDataTests/ProcessEventDataTest.DoOnRemoval (1542 of 2119) PASS: lldb-unit :: UnwindAssembly/x86/./UnwindAssemblyx86Tests/Testx86AssemblyInspectionEngine.TestCALLNextInsn (1543 of 2119) PASS: lldb-api :: lang/objc/objc-super/TestObjCSuper.py (1544 of 2119) PASS: lldb-api :: commands/target/create-deps/TestTargetCreateDeps.py (1545 of 2119) PASS: lldb-unit :: Symbol/./SymbolTests/TestClangASTImporter.MetadataPropagationAfterCopying (1546 of 2119) PASS: lldb-unit :: Utility/./UtilityTests/Predicate.WaitForValueNotEqualTo (1547 of 2119) PASS: lldb-api :: lang/cpp/breakpoint_in_member_func_w_non_primitive_params/TestBreakpointInMemberFuncWNonPrimitiveParams.py (1548 of 2119) PASS: lldb-shell :: SymbolFile/NativePDB/tag-types.cpp (1549 of 2119) PASS: lldb-api :: commands/frame/diagnose/array/TestArray.py (1550 of 2119) PASS: lldb-api :: commands/expression/unicode-in-variable/TestUnicodeInVariable.py (1551 of 2119) PASS: lldb-unit :: Utility/./UtilityTests/StringExtractorTest.GetHexU8_Extra_NoEof (1552 of 2119) UNSUPPORTED: lldb-api :: commands/expression/call-restarts/TestCallThatRestarts.py (1553 of 2119) PASS: lldb-unit :: Utility/./UtilityTests/ArgsTest.AppendArguments (1554 of 2119) PASS: lldb-unit :: Utility/./UtilityTests/RangeDataVector.FindEntryThatContains (1555 of 2119) PASS: lldb-shell :: SymbolFile/NativePDB/function-types-classes.cpp (1556 of 2119) PASS: lldb-api :: functionalities/breakpoint/breakpoint_conditions/TestBreakpointConditions.py (1557 of 2119) PASS: lldb-api :: lang/c/register_variables/TestRegisterVariables.py (1558 of 2119) PASS: lldb-api :: types/TestLongTypes.py (1559 of 2119) PASS: lldb-unit :: Host/./HostTests/FileSystemTest.OpenErrno (1560 of 2119) PASS: lldb-unit :: Utility/./UtilityTests/ArchSpecTest.TestSetTriple (1561 of 2119) PASS: lldb-api :: python_api/frame/TestFrames.py (1562 of 2119) PASS: lldb-unit :: UnwindAssembly/x86/./UnwindAssemblyx86Tests/Testx86AssemblyInspectionEngine.TestPushRBPWithREX (1563 of 2119) PASS: lldb-unit :: Utility/./UtilityTests/StringExtractorTest.GetHexU8_InvalidHex_NoEof (1564 of 2119) PASS: lldb-api :: commands/statistics/basic/TestStats.py (1565 of 2119) PASS: lldb-unit :: UnwindAssembly/ARM64/./Arm64InstEmulationTests/TestArm64InstEmulation.TestRegisterDoubleSpills (1566 of 2119) PASS: lldb-api :: lang/cpp/const_this/TestConstThis.py (1567 of 2119) PASS: lldb-api :: functionalities/data-formatter/language_category_updates/TestDataFormatterLanguageCategoryUpdates.py (1568 of 2119) PASS: lldb-api :: lang/cpp/trivial_abi/TestTrivialABI.py (1569 of 2119) PASS: lldb-unit :: Utility/./UtilityTests/ScalarTest.RightShiftOperator (1570 of 2119) PASS: lldb-unit :: Utility/./UtilityTests/StreamTeeTest.Write (1571 of 2119) PASS: lldb-unit :: Process/gdb-remote/./ProcessGdbRemoteTests/GDBRemoteCommunicationClientTest.SendSignalsToIgnore (1572 of 2119) PASS: lldb-api :: functionalities/history/TestHistoryRecall.py (1573 of 2119) PASS: lldb-unit :: Utility/./UtilityTests/SerializationRountripTest.SerializeDeserializePodReferences (1574 of 2119) PASS: lldb-unit :: Target/./TargetTests/ModuleCacheTest.GetAndPutStrangeHostname (1575 of 2119) PASS: lldb-unit :: Utility/./UtilityTests/StringExtractorTest.DecodeHexU8_Underflow (1576 of 2119) PASS: lldb-api :: python_api/value/TestValueAPI.py (1577 of 2119) PASS: lldb-api :: functionalities/set-data/TestSetData.py (1578 of 2119) PASS: lldb-unit :: Language/CPlusPlus/./LanguageCPlusPlusTests/CPlusPlusLanguage.FindAlternateFunctionManglings (1579 of 2119) PASS: lldb-api :: commands/expression/unwind_expression/TestUnwindExpression.py (1580 of 2119) PASS: lldb-shell :: Settings/TestLineMarkerColor.test (1581 of 2119) PASS: lldb-api :: lang/c/step-target/TestStepTarget.py (1582 of 2119) PASS: lldb-api :: functionalities/ubsan/basic/TestUbsanBasic.py (1583 of 2119) PASS: lldb-unit :: Utility/./UtilityTests/VASprintfTest.BufferResize (1584 of 2119) PASS: lldb-api :: lang/objc/modules-hash-mismatch/TestClangModulesHashMismatch.py (1585 of 2119) PASS: lldb-api :: commands/expression/entry-bp/TestExprEntryBP.py (1586 of 2119) PASS: lldb-api :: functionalities/limit-debug-info/TestLimitDebugInfo.py (1587 of 2119) PASS: lldb-unit :: Expression/./ExpressionTests/DiagnosticManagerTest.PutStringMultiple (1588 of 2119) PASS: lldb-unit :: ObjectFile/Breakpad/./ObjectFileBreakpadTests/InfoRecord.parse (1589 of 2119) PASS: lldb-unit :: Symbol/./SymbolTests/TestClangASTImporter.ImportInvalidType (1590 of 2119) UNSUPPORTED: lldb-api :: functionalities/data-formatter/data-formatter-stl/libstdcpp/tuple/TestDataFormatterStdTuple.py (1591 of 2119) PASS: lldb-unit :: Utility/./UtilityTests/ScalarTest.LongLongAssigmentOperator (1592 of 2119) PASS: lldb-unit :: Utility/./UtilityTests/StringExtractorTest.DecodeHexU8_Underflow2 (1593 of 2119) PASS: lldb-api :: commands/expression/expr-in-syscall/TestExpressionInSyscall.py (1594 of 2119) UNSUPPORTED: lldb-api :: benchmarks/expression/TestExpressionCmd.py (1595 of 2119) PASS: lldb-unit :: Utility/./UtilityTests/RecordReplayTest.InstrumentedBar (1596 of 2119) PASS: lldb-unit :: Utility/./UtilityTests/UriParserTest.BracketedHostnameWithPortIPv6 (1597 of 2119) PASS: lldb-shell :: Quit/TestQuitExitCodeHex0.test (1598 of 2119) PASS: lldb-shell :: ObjectFile/wasm/embedded-debug-sections.yaml (1599 of 2119) PASS: lldb-api :: functionalities/thread/concurrent_events/TestConcurrentWatchBreak.py (1600 of 2119) PASS: lldb-api :: functionalities/thread/step_until/TestStepUntil.py (1601 of 2119) UNSUPPORTED: lldb-api :: functionalities/darwin_log/filter/exact_match/subsystem/TestDarwinLogFilterMatchSubsystem.py (1602 of 2119) PASS: lldb-unit :: Process/gdb-remote/./ProcessGdbRemoteTests/GDBRemoteClientBaseTest.SendContinueAndAsyncSignal (1603 of 2119) PASS: lldb-api :: commands/platform/process/list/TestProcessList.py (1604 of 2119) PASS: lldb-unit :: SymbolFile/DWARF/./SymbolFileDWARFTests/SymbolFileDWARFTests.TestAbbrevOrder1Start1 (1605 of 2119) PASS: lldb-unit :: Expression/./ExpressionTests/CppModuleConfigurationTest.UnknownLibCppFile (1606 of 2119) PASS: lldb-shell :: ObjectFile/Breakpad/discontiguous-sections.test (1607 of 2119) PASS: lldb-shell :: ObjectFile/ELF/many-sections.s (1608 of 2119) PASS: lldb-unit :: Symbol/./SymbolTests/TestTypeSystemClang.TestDeletingImplicitCopyCstrDueToMoveCStr (1609 of 2119) PASS: lldb-unit :: Process/gdb-remote/./ProcessGdbRemoteTests/GDBRemoteClientBaseTest.SendContinueAndInterrupt2PacketBug (1610 of 2119) PASS: lldb-unit :: Utility/./UtilityTests/BinaryStreamTest.PutULEB128FourBytes (1611 of 2119) PASS: lldb-unit :: Symbol/./SymbolTests/TestTypeSystemClang.TestGetTypeClassTypeOfExpr (1612 of 2119) PASS: lldb-unit :: debugserver/./debugserverTests/JSON.Parse (1613 of 2119) UNSUPPORTED: lldb-shell :: Register/x86-64-zmm-write.test (1614 of 2119) PASS: lldb-unit :: SymbolFile/NativePDB/./SymbolFileNativePDBTests/PDBFPOProgramToDWARFExpressionTests.MissingTargetRegister (1615 of 2119) PASS: lldb-unit :: Utility/./UtilityTests/AnsiTerminal.Basic (1616 of 2119) UNSUPPORTED: lldb-api :: macosx/macCatalystAppMacOSFramework/TestMacCatalystAppWithMacOSFramework.py (1617 of 2119) PASS: lldb-api :: python_api/debugger/TestDebuggerAPI.py (1618 of 2119) PASS: lldb-api :: functionalities/data-formatter/data-formatter-stl/libcxx/tuple/TestDataFormatterLibcxxTuple.py (1619 of 2119) PASS: lldb-unit :: Utility/./UtilityTests/TimerTest.CategoryTimes2 (1620 of 2119) PASS: lldb-api :: lang/cpp/llvm-style/TestLLVMStyle.py (1621 of 2119) PASS: lldb-unit :: Utility/./UtilityTests/StringListTest.GetSize (1622 of 2119) PASS: lldb-unit :: Utility/./UtilityTests/StringListTest.GetMaxStringLengthIncreasingSize (1623 of 2119) PASS: lldb-unit :: ScriptInterpreter/Python/./ScriptInterpreterPythonTests/PythonDataObjectsTest.TestTypeNameResolutionNoDot (1624 of 2119) PASS: lldb-api :: functionalities/gdb_remote_client/TestNoWatchpointSupportInfo.py (1625 of 2119) PASS: lldb-unit :: Host/./HostTests/SocketTest.TCPListen0ConnectAccept (1626 of 2119) PASS: lldb-unit :: Utility/./UtilityTests/VASprintfTest.EncodingError (1627 of 2119) PASS: lldb-api :: python_api/watchpoint/TestWatchpointIter.py (1628 of 2119) PASS: lldb-shell :: Minidump/breakpad-symbols.test (1629 of 2119) PASS: lldb-api :: lang/cpp/inlines/TestInlines.py (1630 of 2119) PASS: lldb-api :: functionalities/data-formatter/data-formatter-ptr-to-array/TestPtrToArrayFormatting.py (1631 of 2119) PASS: lldb-unit :: Utility/./UtilityTests/StreamTeeTest.SetStreamAtIndexOverwrite (1632 of 2119) PASS: lldb-shell :: Reproducer/Functionalities/TestExpressionEvaluation.test (1633 of 2119) PASS: lldb-unit :: Host/./HostTests/FileSystemTest.Readable (1634 of 2119) UNSUPPORTED: lldb-shell :: Register/arm-fp-read.test (1635 of 2119) PASS: lldb-api :: commands/frame/select/TestFrameSelect.py (1636 of 2119) PASS: lldb-unit :: Symbol/./SymbolTests/TestClangASTImporter.CopyTypeTagDecl (1637 of 2119) PASS: lldb-shell :: ObjectFile/MachO/symtab.yaml (1638 of 2119) PASS: lldb-unit :: Utility/./UtilityTests/VMRange.CollectionContains (1639 of 2119) PASS: lldb-unit :: Utility/./UtilityTests/StreamTest.PutNHex8 (1640 of 2119) PASS: lldb-unit :: Expression/./ExpressionTests/CppModuleConfigurationTest.Sysroot (1641 of 2119) PASS: lldb-unit :: Utility/./UtilityTests/ArchSpecTest.MergeFrom (1642 of 2119) UNSUPPORTED: lldb-api :: arm/breakpoint-thumb-codesection/TestBreakpointThumbCodesection.py (1643 of 2119) PASS: lldb-api :: tools/lldb-server/TestGdbRemoteThreadsInStopReply.py (1644 of 2119) PASS: lldb-shell :: ObjectFile/wasm/basic.yaml (1645 of 2119) PASS: lldb-api :: lang/cpp/static_methods/TestCPPStaticMethods.py (1646 of 2119) PASS: lldb-api :: types/TestRecursiveTypes.py (1647 of 2119) PASS: lldb-shell :: SymbolFile/DWARF/limit-debug-info.s (1648 of 2119) PASS: lldb-unit :: Utility/./UtilityTests/NameMatchesTest.Ignore (1649 of 2119) PASS: lldb-api :: commands/gui/basicdebug/TestGuiBasicDebug.py (1650 of 2119) PASS: lldb-api :: functionalities/fat_archives/TestFatArchives.py (1651 of 2119) PASS: lldb-unit :: Utility/./UtilityTests/CompletionRequest.ShiftArguments (1652 of 2119) PASS: lldb-unit :: Expression/./ExpressionTests/CppModuleConfigurationTest.LinuxLocalLibCpp (1653 of 2119) PASS: lldb-api :: functionalities/paths/TestPaths.py (1654 of 2119) PASS: lldb-unit :: Utility/./UtilityTests/RangeVector.CombineConsecutiveRanges (1655 of 2119) PASS: lldb-unit :: UnwindAssembly/x86/./UnwindAssemblyx86Tests/Testx86AssemblyInspectionEngine.TestSpillRegToStackViaMOVi386 (1656 of 2119) PASS: lldb-shell :: SymbolFile/DWARF/DW_TAG_variable-invalid_location.s (1657 of 2119) PASS: lldb-unit :: Utility/./UtilityTests/StringListTest.ForRange (1658 of 2119) PASS: lldb-unit :: Target/./TargetTests/ModuleCacheTest.GetAndPut (1659 of 2119) PASS: lldb-api :: functionalities/pre_run_dylibs/TestPreRunDylibs.py (1660 of 2119) PASS: lldb-unit :: Utility/./UtilityTests/UUIDTest.Validity (1661 of 2119) PASS: lldb-api :: functionalities/tail_call_frames/thread_step_out_or_return/TestSteppingOutWithArtificialFrames.py (1662 of 2119) PASS: lldb-shell :: SymbolFile/DWARF/DW_OP_piece-struct.s (1663 of 2119) PASS: lldb-api :: commands/expression/import-std-module/vector-of-vectors/TestVectorOfVectorsFromStdModule.py (1664 of 2119) PASS: lldb-shell :: Settings/TestFrameFormatColor.test (1665 of 2119) PASS: lldb-unit :: UnwindAssembly/x86/./UnwindAssemblyx86Tests/Testx86AssemblyInspectionEngine.TestSimplex86_64Augmented (1666 of 2119) PASS: lldb-unit :: Utility/./UtilityTests/UriParserTest.SchemeHostSeparator3 (1667 of 2119) PASS: lldb-shell :: Commands/command-regex-delete.test (1668 of 2119) PASS: lldb-unit :: DataFormatter/./LLDBFormatterTests/FormatManagerTests.CompatibleLangs (1669 of 2119) PASS: lldb-unit :: Host/./HostTests/SocketTest.TCPGetAddress (1670 of 2119) PASS: lldb-api :: commands/expression/diagnostics/TestExprDiagnostics.py (1671 of 2119) PASS: lldb-api :: lang/cpp/operators/TestCppOperators.py (1672 of 2119) PASS: lldb-unit :: Language/Highlighting/./HighlighterTests/HighlighterTest.Colons (1673 of 2119) PASS: lldb-api :: commands/expression/dont_allow_jit/TestAllowJIT.py (1674 of 2119) PASS: lldb-shell :: Minidump/Windows/arm-fp-unwind.test (1675 of 2119) PASS: lldb-unit :: Utility/./UtilityTests/Predicate.WaitForValueEqualTo (1676 of 2119) PASS: lldb-api :: macosx/thread_suspend/TestInternalThreadSuspension.py (1677 of 2119) PASS: lldb-api :: functionalities/breakpoint/breakpoint_ids/TestBreakpointIDs.py (1678 of 2119) PASS: lldb-unit :: Utility/./UtilityTests/FileSpecTest.CopyByAppendingPathComponent (1679 of 2119) PASS: lldb-unit :: Utility/./UtilityTests/StreamTest.PutMaxHex64ByteOrderBig (1680 of 2119) PASS: lldb-unit :: Utility/./UtilityTests/PassiveReplayTest.InstrumentedBarRef (1681 of 2119) PASS: lldb-unit :: UnwindAssembly/PPC64/./PPC64InstEmulationTests/TestPPC64InstEmulation.TestMediumFunction (1682 of 2119) PASS: lldb-api :: lang/cpp/template-specialization-type/TestTemplateSpecializationType.py (1683 of 2119) PASS: lldb-unit :: Utility/./UtilityTests/StringExtractorTest.GetHexBytes_Underflow (1684 of 2119) PASS: lldb-shell :: SymbolFile/dissassemble-entry-point.s (1685 of 2119) PASS: lldb-unit :: Process/gdb-remote/./ProcessGdbRemoteTests/GDBRemoteCommunicationClientTest.GetMemoryRegionInfoInvalidResponse (1686 of 2119) PASS: lldb-unit :: UnwindAssembly/x86/./UnwindAssemblyx86Tests/Testx86AssemblyInspectionEngine.TestDisassemblyMidFunctionEpilogues (1687 of 2119) PASS: lldb-unit :: Utility/./UtilityTests/GeneratorTest.YamlMultiProvider (1688 of 2119) PASS: lldb-api :: python_api/function_symbol/TestDisasmAPI.py (1689 of 2119) PASS: lldb-api :: commands/expression/import-std-module/queue/TestQueueFromStdModule.py (1690 of 2119) PASS: lldb-api :: commands/expression/completion-crash-incomplete-record/TestCompletionCrashIncompleteRecord.py (1691 of 2119) UNSUPPORTED: lldb-api :: functionalities/unwind/standard/TestStandardUnwind.py (1692 of 2119) PASS: lldb-shell :: Reproducer/Functionalities/TestDataFormatter.test (1693 of 2119) PASS: lldb-unit :: Target/./TargetTests/ExecutionContextTest.GetByteOrderProcess (1694 of 2119) PASS: lldb-api :: python_api/sbenvironment/TestSBEnvironment.py (1695 of 2119) PASS: lldb-unit :: Core/./LLDBCoreTests/UniqueCStringMap.NoDefaultConstructor (1696 of 2119) PASS: lldb-api :: commands/expression/two-files/TestObjCTypeQueryFromOtherCompileUnit.py (1697 of 2119) PASS: lldb-api :: lang/c/bitfields/TestBitfields.py (1698 of 2119) PASS: lldb-api :: functionalities/data-formatter/type_summary_list_script/TestTypeSummaryListScript.py (1699 of 2119) PASS: lldb-api :: functionalities/data-formatter/data-formatter-categories/TestDataFormatterCategories.py (1700 of 2119) UNSUPPORTED: lldb-api :: functionalities/data-formatter/data-formatter-stl/libstdcpp/vector/TestDataFormatterStdVector.py (1701 of 2119) PASS: lldb-shell :: SymbolFile/NativePDB/ast-methods.cpp (1702 of 2119) PASS: lldb-unit :: Utility/./UtilityTests/AnsiTerminal.Incomplete (1703 of 2119) PASS: lldb-api :: functionalities/thread/ignore_suspended/TestIgnoreSuspendedThread.py (1704 of 2119) PASS: lldb-unit :: Utility/./UtilityTests/StreamTest.AddressRange (1705 of 2119) PASS: lldb-api :: functionalities/data-formatter/data-formatter-script/TestDataFormatterScript.py (1706 of 2119) PASS: lldb-unit :: debugserver/./debugserverTests/RNBSocket.AnyListen (1707 of 2119) PASS: lldb-unit :: Language/Highlighting/./HighlighterTests/HighlighterTest.ClangIdentifiers (1708 of 2119) PASS: lldb-unit :: Utility/./UtilityTests/ArgsTest.StringListConstructor (1709 of 2119) PASS: lldb-api :: lang/objc/objc-runtime-ivars/TestRuntimeIvars.py (1710 of 2119) PASS: lldb-api :: functionalities/data-formatter/synthupdate/TestSyntheticFilterRecompute.py (1711 of 2119) PASS: lldb-unit :: ObjectFile/Breakpad/./ObjectFileBreakpadTests/FileRecord.parse (1712 of 2119) PASS: lldb-unit :: UnwindAssembly/x86/./UnwindAssemblyx86Tests/Testx86AssemblyInspectionEngine.TestSimplei386ugmented (1713 of 2119) PASS: lldb-api :: lang/cpp/symbols/TestSymbols.py (1714 of 2119) PASS: lldb-api :: functionalities/target-new-solib-notifications/TestModuleLoadedNotifys.py (1715 of 2119) PASS: lldb-api :: functionalities/memory-region/TestMemoryRegion.py (1716 of 2119) PASS: lldb-unit :: Utility/./UtilityTests/DataExtractorTest.GetCStrUnterminated (1717 of 2119) PASS: lldb-api :: commands/expression/call-function/TestCallUserDefinedFunction.py (1718 of 2119) PASS: lldb-api :: lang/objc/objc-struct-argument/TestObjCStructArgument.py (1719 of 2119) PASS: lldb-unit :: Utility/./UtilityTests/StringListTest.RemoveBlankLines (1720 of 2119) PASS: lldb-unit :: Utility/./UtilityTests/StreamTest.AddressRangeSize (1721 of 2119) PASS: lldb-api :: python_api/name_lookup/TestNameLookup.py (1722 of 2119) PASS: lldb-api :: tools/lldb-vscode/breakpoint/TestVSCode_setExceptionBreakpoints.py (1723 of 2119) PASS: lldb-unit :: Utility/./UtilityTests/BinaryStreamTest.PutSLEB128TwoBytes (1724 of 2119) UNSUPPORTED: lldb-api :: lang/c/unicode/TestUnicodeSymbols.py (1725 of 2119) PASS: lldb-api :: api/check_public_api_headers/TestPublicAPIHeaders.py (1726 of 2119) PASS: lldb-api :: functionalities/var_path/TestVarPath.py (1727 of 2119) PASS: lldb-unit :: Utility/./UtilityTests/BinaryStreamTest.PutSLEB128ThreeBytes (1728 of 2119) PASS: lldb-unit :: Host/./HostTests/File.GetWaitableHandleFileno (1729 of 2119) PASS: lldb-api :: functionalities/data-formatter/poarray/TestPrintObjectArray.py (1730 of 2119) PASS: lldb-unit :: UnwindAssembly/x86/./UnwindAssemblyx86Tests/Testx86AssemblyInspectionEngine.TestPushR14 (1731 of 2119) PASS: lldb-api :: macosx/safe-to-func-call/TestSafeFuncCalls.py (1732 of 2119) PASS: lldb-unit :: UnwindAssembly/x86/./UnwindAssemblyx86Tests/Testx86AssemblyInspectionEngine.TestPushECX (1733 of 2119) PASS: lldb-api :: functionalities/step-avoids-no-debug/TestStepNoDebug.py (1734 of 2119) PASS: lldb-api :: commands/frame/diagnose/inheritance/TestDiagnoseInheritance.py (1735 of 2119) PASS: lldb-api :: functionalities/thread/create_after_attach/TestCreateAfterAttach.py (1736 of 2119) PASS: lldb-api :: commands/breakpoint/set/func-regex/TestBreakpointRegexError.py (1737 of 2119) PASS: lldb-unit :: Utility/./UtilityTests/CompletionRequest.DuplicateFilteringWithComments (1738 of 2119) PASS: lldb-unit :: ScriptInterpreter/Python/./ScriptInterpreterPythonTests/PythonDataObjectsTest.TestPythonFile (1739 of 2119) UNSUPPORTED: lldb-api :: functionalities/unwind/ehframe/TestEhFrameUnwind.py (1740 of 2119) PASS: lldb-api :: commands/target/dump-symtab-demangle/TestDumpSymtabDemangle.py (1741 of 2119) PASS: lldb-api :: commands/expression/rdar42038760/TestScalarURem.py (1742 of 2119) PASS: lldb-shell :: Commands/CommandScriptImmediateOutput/CommandScriptImmediateOutputFile.test (1743 of 2119) UNSUPPORTED: lldb-api :: commands/watchpoints/hello_watchlocation/TestWatchLocation.py (1744 of 2119) PASS: lldb-unit :: Utility/./UtilityTests/StringExtractorTest.GetHexU8_Exact_NoEof (1745 of 2119) PASS: lldb-api :: python_api/findvalue_duplist/TestSBFrameFindValue.py (1746 of 2119) PASS: lldb-api :: lang/cpp/bitfields/TestCppBitfields.py (1747 of 2119) PASS: lldb-api :: lang/cpp/virtual-overload/TestVirtualOverload.py (1748 of 2119) PASS: lldb-shell :: SymbolFile/Breakpad/line-table-missing-file.test (1749 of 2119) PASS: lldb-api :: commands/watchpoints/multiple_hits/TestMultipleHits.py (1750 of 2119) PASS: lldb-api :: functionalities/gdb_remote_client/TestIOSSimulator.py (1751 of 2119) PASS: lldb-api :: lang/objc/objc-new-syntax/TestObjCNewSyntaxLiteral.py (1752 of 2119) PASS: lldb-shell :: SymbolFile/DWARF/debug-types-basic.test (1753 of 2119) PASS: lldb-api :: functionalities/breakpoint/comp_dir_symlink/TestCompDirSymLink.py (1754 of 2119) PASS: lldb-api :: lang/objc/modules-non-objc-target/TestObjCModulesNonObjCTarget.py (1755 of 2119) PASS: lldb-unit :: Symbol/./SymbolTests/TestClangASTImporter.CopyDeclTagDecl (1756 of 2119) UNSUPPORTED: lldb-shell :: ScriptInterpreter/Lua/quit.test (1757 of 2119) PASS: lldb-unit :: Utility/./UtilityTests/ConstStringTest.NullAndEmptyStates (1758 of 2119) PASS: lldb-api :: lang/c/shared_lib_stripped_symbols/TestSharedLibStrippedSymbols.py (1759 of 2119) PASS: lldb-api :: lang/objc/modules-update/TestClangModulesUpdate.py (1760 of 2119) PASS: lldb-unit :: Utility/./UtilityTests/RangeTest.ContainsAddr (1761 of 2119) PASS: lldb-unit :: SymbolFile/DWARF/./SymbolFileDWARFTests/SymbolFileDWARFTests.TestAbbrevOutOfOrder (1762 of 2119) PASS: lldb-api :: functionalities/data-formatter/typedef_array/TestTypedefArray.py (1763 of 2119) PASS: lldb-api :: lang/c/complex/TestComplexC99.py (1764 of 2119) PASS: lldb-unit :: Utility/./UtilityTests/LogChannelTest.Disable (1765 of 2119) PASS: lldb-unit :: Utility/./UtilityTests/SerializationRountripTest.SerializeDeserializeObjectReference (1766 of 2119) PASS: lldb-unit :: API/./APITests/SBCommandInterpreterTest.SingleWordCommand (1767 of 2119) UNSUPPORTED: lldb-shell :: SymbolFile/DWARF/debug-types-expressions.test (1768 of 2119) PASS: lldb-api :: functionalities/data-formatter/data-formatter-enum-format/TestDataFormatterEnumFormat.py (1769 of 2119) PASS: lldb-unit :: Utility/./UtilityTests/ArgsTest.ReplaceArgumentAtIndexOutOfRange (1770 of 2119) PASS: lldb-api :: commands/expression/namespace_local_var_same_name_cpp_and_c/TestNamespaceLocalVarSameNameCppAndC.py (1771 of 2119) PASS: lldb-api :: functionalities/data-formatter/data-formatter-proper-plurals/TestFormattersOneIsSingular.py (1772 of 2119) PASS: lldb-api :: functionalities/data-formatter/synthcapping/TestSyntheticCapping.py (1773 of 2119) PASS: lldb-unit :: Utility/./UtilityTests/OptionsWithRawTest.ArgsButNoLeadingDash (1774 of 2119) PASS: lldb-unit :: Utility/./UtilityTests/StreamTest.ShiftOperatorChars (1775 of 2119) PASS: lldb-unit :: Language/Highlighting/./HighlighterTests/HighlighterTest.ClangBraces (1776 of 2119) PASS: lldb-unit :: Utility/./UtilityTests/BinaryStreamTest.PutSLEB128SevenBytes (1777 of 2119) PASS: lldb-unit :: Host/./HostTests/MainLoopTest.Signal (1778 of 2119) PASS: lldb-shell :: VSCode/TestOptions.test (1779 of 2119) PASS: lldb-api :: lang/objc/objc-foundation-dictionary-empty/TestNSDictionary0.py (1780 of 2119) PASS: lldb-api :: lang/cpp/class_types/TestClassTypesDisassembly.py (1781 of 2119) PASS: lldb-unit :: ScriptInterpreter/Python/./ScriptInterpreterPythonTests/PythonDataObjectsTest.TestPythonDictionaryToStructuredDictionary (1782 of 2119) PASS: lldb-unit :: Language/Highlighting/./HighlighterTests/HighlighterTest.ClangCursorPosEndOfLine (1783 of 2119) PASS: lldb-unit :: SymbolFile/DWARF/./SymbolFileDWARFTests/DWARFASTParserClangTests.EnsureAllDIEsInDeclContextHaveBeenParsedParsesOnlyMatchingEntries (1784 of 2119) PASS: lldb-api :: functionalities/signal/handle-abrt/TestHandleAbort.py (1785 of 2119) PASS: lldb-shell :: Unwind/trap_frame_sym_ctx.test (1786 of 2119) PASS: lldb-unit :: Language/Highlighting/./HighlighterTests/HighlighterTest.DefaultHighlighterWithCursor (1787 of 2119) PASS: lldb-unit :: Utility/./UtilityTests/StringExtractorTest.GetHexBytesAvail_OddPair2 (1788 of 2119) PASS: lldb-unit :: Utility/./UtilityTests/StringListTest.ForRangeEmpty (1789 of 2119) PASS: lldb-unit :: Utility/./UtilityTests/BinaryStreamTest.PutULEB128SixBytes (1790 of 2119) PASS: lldb-unit :: Utility/./UtilityTests/OptionsWithRawTest.EmptyArgsOnlySuffix (1791 of 2119) PASS: lldb-shell :: ScriptInterpreter/Python/crashlog.test (1792 of 2119) XFAIL: lldb-shell :: SymbolFile/DWARF/find-type-in-function.cpp (1793 of 2119) PASS: lldb-api :: functionalities/thread/concurrent_events/TestConcurrentSignalNWatchNBreak.py (1794 of 2119) PASS: lldb-unit :: Utility/./UtilityTests/FileSpecTest.Yaml (1795 of 2119) PASS: lldb-api :: functionalities/breakpoint/breakpoint_locations/TestBreakpointLocations.py (1796 of 2119) PASS: lldb-api :: functionalities/data-formatter/data-formatter-objc/TestDataFormatterObjCNSError.py (1797 of 2119) PASS: lldb-unit :: DataFormatter/./LLDBFormatterTests/TypeMatcherTests.RegexMatchPart (1798 of 2119) PASS: lldb-api :: functionalities/data-formatter/parray/TestPrintArray.py (1799 of 2119) PASS: lldb-api :: functionalities/thread/step_out/TestThreadStepOut.py (1800 of 2119) PASS: lldb-unit :: UnwindAssembly/x86/./UnwindAssemblyx86Tests/Testx86AssemblyInspectionEngine.TestPushEDX (1801 of 2119) PASS: lldb-unit :: Language/CPlusPlus/./LanguageCPlusPlusTests/CPlusPlusLanguage.ExtractContextAndIdentifier (1802 of 2119) PASS: lldb-api :: commands/breakpoint/command/list/TestBreakpointCommandList.py (1803 of 2119) PASS: lldb-api :: commands/expression/persistent_variables/TestPersistentVariables.py (1804 of 2119) PASS: lldb-unit :: ScriptInterpreter/Python/./ScriptInterpreterPythonTests/PythonDataObjectsTest.TestGlobalNameResolutionWithDot (1805 of 2119) PASS: lldb-api :: commands/expression/multiline-completion/TestMultilineCompletion.py (1806 of 2119) UNSUPPORTED: lldb-shell :: SymbolFile/PDB/variables.test (1807 of 2119) PASS: lldb-unit :: Utility/./UtilityTests/RangeTest.ContainsRange (1808 of 2119) PASS: lldb-api :: lang/objc/radar-9691614/TestObjCMethodReturningBOOL.py (1809 of 2119) PASS: lldb-api :: commands/expression/ignore-artificial-constructors/TestIgnoreArtificialConstructors.py (1810 of 2119) PASS: lldb-api :: commands/process/attach-resume/TestAttachResume.py (1811 of 2119) PASS: lldb-unit :: ScriptInterpreter/Python/./ScriptInterpreterPythonTests/PythonDataObjectsTest.TestRun (1812 of 2119) PASS: lldb-api :: tools/lldb-vscode/console/TestVSCode_console.py (1813 of 2119) PASS: lldb-api :: functionalities/thread/concurrent_events/TestConcurrentBreakpointsDelayedBreakpointOneWatchpoint.py (1814 of 2119) PASS: lldb-api :: commands/expression/cast_int_to_anonymous_enum/TestCastIntToAnonymousEnum.py (1815 of 2119) PASS: lldb-api :: commands/frame/var-scope/TestFrameVariableScope.py (1816 of 2119) PASS: lldb-api :: lang/c/tls_globals/TestTlsGlobals.py (1817 of 2119) PASS: lldb-api :: functionalities/process_crash_info/TestProcessCrashInfo.py (1818 of 2119) PASS: lldb-unit :: ObjectFile/PECOFF/./ObjectFilePECOFFTests/PECallFrameInfoTest.Basic_eh (1819 of 2119) PASS: lldb-unit :: Utility/./UtilityTests/StructuredDataTest.StringDump (1820 of 2119) PASS: lldb-shell :: Process/UnsupportedLanguage.test (1821 of 2119) PASS: lldb-api :: lang/cpp/virtual-functions/TestCppVirtualFunctions.py (1822 of 2119) UNSUPPORTED: lldb-api :: commands/expression/macros/TestMacros.py (1823 of 2119) PASS: lldb-unit :: Target/./TargetTests/ModuleCacheTest.GetAndPutUuidExists (1824 of 2119) PASS: lldb-unit :: Utility/./UtilityTests/ArgsTest.TestInsertArg (1825 of 2119) PASS: lldb-unit :: UnwindAssembly/x86/./UnwindAssemblyx86Tests/Testx86AssemblyInspectionEngine.TestPopEDI (1826 of 2119) PASS: lldb-api :: python_api/thread/TestThreadAPI.py (1827 of 2119) PASS: lldb-unit :: Utility/./UtilityTests/LogTest.Unregister (1828 of 2119) PASS: lldb-api :: lang/c/local_types/TestUseClosestType.py (1829 of 2119) Cannot contact green-dragon-10: hudson.remoting.RequestAbortedException: java.io.IOException: Unexpected termination of the channel Could not connect to green-dragon-10 to send interrupt signal to process [Pipeline] } [Pipeline] // timeout [Pipeline] } [Pipeline] // stage [Pipeline] stage [Pipeline] { (Declarative: Post Actions) [Pipeline] scanForIssues Error when executing always post condition: java.io.IOException: Unable to create live FilePath for green-dragon-10 at org.jenkinsci.plugins.workflow.support.steps.FilePathDynamicContext.get(FilePathDynamicContext.java:64) at org.jenkinsci.plugins.workflow.support.steps.FilePathDynamicContext.get(FilePathDynamicContext.java:47) at org.jenkinsci.plugins.workflow.steps.DynamicContext$Typed.get(DynamicContext.java:94) at org.jenkinsci.plugins.workflow.cps.ContextVariableSet.get(ContextVariableSet.java:138) at org.jenkinsci.plugins.workflow.cps.CpsThread.getContextVariable(CpsThread.java:135) at org.jenkinsci.plugins.workflow.cps.CpsStepContext.doGet(CpsStepContext.java:297) at org.jenkinsci.plugins.workflow.support.DefaultStepContext.get(DefaultStepContext.java:67) at org.jenkinsci.plugins.workflow.steps.StepDescriptor.checkContextAvailability(StepDescriptor.java:264) at org.jenkinsci.plugins.workflow.cps.DSL.invokeStep(DSL.java:263) at org.jenkinsci.plugins.workflow.cps.DSL.invokeMethod(DSL.java:179) at org.jenkinsci.plugins.workflow.cps.CpsScript.invokeMethod(CpsScript.java:122) at sun.reflect.GeneratedMethodAccessor552.invoke(Unknown Source) at sun.reflect.DelegatingMethodAccessorImpl.invoke(DelegatingMethodAccessorImpl.java:43) at java.lang.reflect.Method.invoke(Method.java:498) at org.codehaus.groovy.reflection.CachedMethod.invoke(CachedMethod.java:93) at groovy.lang.MetaMethod.doMethodInvoke(MetaMethod.java:325) at groovy.lang.MetaClassImpl.invokeMethod(MetaClassImpl.java:1213) at groovy.lang.MetaClassImpl.invokeMethod(MetaClassImpl.java:1022) at org.codehaus.groovy.runtime.callsite.PogoMetaClassSite.call(PogoMetaClassSite.java:42) at org.codehaus.groovy.runtime.callsite.CallSiteArray.defaultCall(CallSiteArray.java:48) at org.codehaus.groovy.runtime.callsite.AbstractCallSite.call(AbstractCallSite.java:113) at org.kohsuke.groovy.sandbox.impl.Checker$1.call(Checker.java:163) at org.kohsuke.groovy.sandbox.GroovyInterceptor.onMethodCall(GroovyInterceptor.java:23) at org.jenkinsci.plugins.scriptsecurity.sandbox.groovy.SandboxInterceptor.onMethodCall(SandboxInterceptor.java:157) at org.kohsuke.groovy.sandbox.impl.Checker$1.call(Checker.java:161) at org.kohsuke.groovy.sandbox.impl.Checker.checkedCall(Checker.java:165) at org.kohsuke.groovy.sandbox.impl.Checker.checkedCall(Checker.java:135) at com.cloudbees.groovy.cps.sandbox.SandboxInvoker.methodCall(SandboxInvoker.java:17) at WorkflowScript.run(WorkflowScript:78) at org.jenkinsci.plugins.pipeline.modeldefinition.ModelInterpreter.delegateAndExecute(ModelInterpreter.groovy:137) at org.jenkinsci.plugins.pipeline.modeldefinition.ModelInterpreter.runPostConditions(ModelInterpreter.groovy:756) at org.jenkinsci.plugins.pipeline.modeldefinition.ModelInterpreter.catchRequiredContextForNode(ModelInterpreter.groovy:395) at org.jenkinsci.plugins.pipeline.modeldefinition.ModelInterpreter.catchRequiredContextForNode(ModelInterpreter.groovy:393) at org.jenkinsci.plugins.pipeline.modeldefinition.ModelInterpreter.runPostConditions(ModelInterpreter.groovy:755) at com.cloudbees.groovy.cps.CpsDefaultGroovyMethods.each(CpsDefaultGroovyMethods:2030) at com.cloudbees.groovy.cps.CpsDefaultGroovyMethods.each(CpsDefaultGroovyMethods:2015) at com.cloudbees.groovy.cps.CpsDefaultGroovyMethods.each(CpsDefaultGroovyMethods:2056) at org.jenkinsci.plugins.pipeline.modeldefinition.ModelInterpreter.runPostConditions(ModelInterpreter.groovy:745) at org.jenkinsci.plugins.pipeline.modeldefinition.ModelInterpreter.runPostConditions(ModelInterpreter.groovy) at org.jenkinsci.plugins.pipeline.modeldefinition.ModelInterpreter.executePostBuild(ModelInterpreter.groovy:723) at ___cps.transform___(Native Method) at com.cloudbees.groovy.cps.impl.ContinuationGroup.methodCall(ContinuationGroup.java:86) at com.cloudbees.groovy.cps.impl.FunctionCallBlock$ContinuationImpl.dispatchOrArg(FunctionCallBlock.java:113) at com.cloudbees.groovy.cps.impl.FunctionCallBlock$ContinuationImpl.fixArg(FunctionCallBlock.java:83) at sun.reflect.GeneratedMethodAccessor511.invoke(Unknown Source) at sun.reflect.DelegatingMethodAccessorImpl.invoke(DelegatingMethodAccessorImpl.java:43) at java.lang.reflect.Method.invoke(Method.java:498) at com.cloudbees.groovy.cps.impl.ContinuationPtr$ContinuationImpl.receive(ContinuationPtr.java:72) at com.cloudbees.groovy.cps.impl.CollectionLiteralBlock$ContinuationImpl.dispatch(CollectionLiteralBlock.java:55) at com.cloudbees.groovy.cps.impl.CollectionLiteralBlock$ContinuationImpl.item(CollectionLiteralBlock.java:45) at sun.reflect.GeneratedMethodAccessor525.invoke(Unknown Source) at sun.reflect.DelegatingMethodAccessorImpl.invoke(DelegatingMethodAccessorImpl.java:43) at java.lang.reflect.Method.invoke(Method.java:498) at com.cloudbees.groovy.cps.impl.ContinuationPtr$ContinuationImpl.receive(ContinuationPtr.java:72) at com.cloudbees.groovy.cps.impl.ContinuationGroup.methodCall(ContinuationGroup.java:89) at com.cloudbees.groovy.cps.impl.FunctionCallBlock$ContinuationImpl.dispatchOrArg(FunctionCallBlock.java:113) at com.cloudbees.groovy.cps.impl.FunctionCallBlock$ContinuationImpl.fixName(FunctionCallBlock.java:78) at sun.reflect.GeneratedMethodAccessor513.invoke(Unknown Source) at sun.reflect.DelegatingMethodAccessorImpl.invoke(DelegatingMethodAccessorImpl.java:43) at java.lang.reflect.Method.invoke(Method.java:498) at com.cloudbees.groovy.cps.impl.ContinuationPtr$ContinuationImpl.receive(ContinuationPtr.java:72) at com.cloudbees.groovy.cps.impl.ConstantBlock.eval(ConstantBlock.java:21) at com.cloudbees.groovy.cps.Next.step(Next.java:83) at com.cloudbees.groovy.cps.Continuable$1.call(Continuable.java:174) at com.cloudbees.groovy.cps.Continuable$1.call(Continuable.java:163) at org.codehaus.groovy.runtime.GroovyCategorySupport$ThreadCategoryInfo.use(GroovyCategorySupport.java:129) at org.codehaus.groovy.runtime.GroovyCategorySupport.use(GroovyCategorySupport.java:268) at com.cloudbees.groovy.cps.Continuable.run0(Continuable.java:163) at org.jenkinsci.plugins.workflow.cps.SandboxContinuable.access$001(SandboxContinuable.java:18) at org.jenkinsci.plugins.workflow.cps.SandboxContinuable.run0(SandboxContinuable.java:51) at org.jenkinsci.plugins.workflow.cps.CpsThread.runNextChunk(CpsThread.java:185) at org.jenkinsci.plugins.workflow.cps.CpsThreadGroup.run(CpsThreadGroup.java:400) at org.jenkinsci.plugins.workflow.cps.CpsThreadGroup.access$400(CpsThreadGroup.java:96) at org.jenkinsci.plugins.workflow.cps.CpsThreadGroup$2.call(CpsThreadGroup.java:312) at org.jenkinsci.plugins.workflow.cps.CpsThreadGroup$2.call(CpsThreadGroup.java:276) at org.jenkinsci.plugins.workflow.cps.CpsVmExecutorService$2.call(CpsVmExecutorService.java:67) at java.util.concurrent.FutureTask.run(FutureTask.java:266) at hudson.remoting.SingleLaneExecutorService$1.run(SingleLaneExecutorService.java:131) at jenkins.util.ContextResettingExecutorService$1.run(ContextResettingExecutorService.java:28) at jenkins.security.ImpersonatingExecutorService$1.run(ImpersonatingExecutorService.java:59) at java.util.concurrent.Executors$RunnableAdapter.call(Executors.java:511) at java.util.concurrent.FutureTask.run(FutureTask.java:266) at java.util.concurrent.ThreadPoolExecutor.runWorker(ThreadPoolExecutor.java:1149) at java.util.concurrent.ThreadPoolExecutor$Worker.run(ThreadPoolExecutor.java:624) at java.lang.Thread.run(Thread.java:748)

Hide Details

[Pipeline] emailext Error when executing changed post condition: java.io.IOException: Unable to create live FilePath for green-dragon-10 at org.jenkinsci.plugins.workflow.support.steps.FilePathDynamicContext.get(FilePathDynamicContext.java:64) at org.jenkinsci.plugins.workflow.support.steps.FilePathDynamicContext.get(FilePathDynamicContext.java:47) at org.jenkinsci.plugins.workflow.steps.DynamicContext$Typed.get(DynamicContext.java:94) at org.jenkinsci.plugins.workflow.cps.ContextVariableSet.get(ContextVariableSet.java:138) at org.jenkinsci.plugins.workflow.cps.CpsThread.getContextVariable(CpsThread.java:135) at org.jenkinsci.plugins.workflow.cps.CpsStepContext.doGet(CpsStepContext.java:297) at org.jenkinsci.plugins.workflow.support.DefaultStepContext.get(DefaultStepContext.java:67) at hudson.plugins.emailext.EmailExtStep$EmailExtStepExecution.run(EmailExtStep.java:231) at hudson.plugins.emailext.EmailExtStep$EmailExtStepExecution.run(EmailExtStep.java:174) at org.jenkinsci.plugins.workflow.steps.AbstractSynchronousNonBlockingStepExecution$1$1.call(AbstractSynchronousNonBlockingStepExecution.java:47) at hudson.security.ACL.impersonate(ACL.java:367) at org.jenkinsci.plugins.workflow.steps.AbstractSynchronousNonBlockingStepExecution$1.run(AbstractSynchronousNonBlockingStepExecution.java:44) at java.util.concurrent.Executors$RunnableAdapter.call(Executors.java:511) at java.util.concurrent.FutureTask.run(FutureTask.java:266) at java.util.concurrent.ThreadPoolExecutor.runWorker(ThreadPoolExecutor.java:1149) at java.util.concurrent.ThreadPoolExecutor$Worker.run(ThreadPoolExecutor.java:624) at java.lang.Thread.run(Thread.java:748)

Hide Details

[Pipeline] } [Pipeline] // stage [Pipeline] } [Pipeline] // withEnv [Pipeline] } [Pipeline] // node [Pipeline] End of Pipeline Finished: ABORTED