FailedConsole Output

Skipping 16,559 KB.. Full Log
pplications/Xcode.app/Contents/Developer/Platforms/MacOSX.platform/Developer/SDKs/MacOSX10.15.sdk    -isysroot /Applications/Xcode.app/Contents/Developer/Platforms/iPhoneOS.platform/Developer/SDKs/iPhoneOS13.5.sdk -miphoneos-version-min=6.0 -fPIC -O3 -fvisibility=hidden -DVISIBILITY_HIDDEN -Wall  -arch armv7 -mkernel -UNDEBUG -MD -MT projects/compiler-rt/lib/builtins/CMakeFiles/clang_rt.cc_kext_armv7_ios.dir/mulsc3.c.o -MF projects/compiler-rt/lib/builtins/CMakeFiles/clang_rt.cc_kext_armv7_ios.dir/mulsc3.c.o.d -o projects/compiler-rt/lib/builtins/CMakeFiles/clang_rt.cc_kext_armv7_ios.dir/mulsc3.c.o   -c /Users/buildslave/jenkins/workspace/lldb-cmake/llvm-project/compiler-rt/lib/builtins/mulsc3.c
[10349/10424] /Users/buildslave/jenkins/workspace/lldb-cmake/host-compiler/bin/clang -DKERNEL_USE -D_DEBUG -D__STDC_CONSTANT_MACROS -D__STDC_FORMAT_MACROS -D__STDC_LIMIT_MACROS -Iprojects/compiler-rt/lib/builtins -I/Users/buildslave/jenkins/workspace/lldb-cmake/llvm-project/compiler-rt/lib/builtins -I/Applications/Xcode.app/Contents/Developer/Platforms/MacOSX.platform/Developer/SDKs/MacOSX10.15.sdk/usr/include/libxml2 -Iinclude -I/Users/buildslave/jenkins/workspace/lldb-cmake/llvm-project/llvm/include -I/Users/buildslave/jenkins/workspace/lldb-cmake/llvm-project/compiler-rt/lib/builtins/../../include -O3  -arch armv7 -isysroot /Applications/Xcode.app/Contents/Developer/Platforms/MacOSX.platform/Developer/SDKs/MacOSX10.15.sdk    -isysroot /Applications/Xcode.app/Contents/Developer/Platforms/iPhoneOS.platform/Developer/SDKs/iPhoneOS13.5.sdk -miphoneos-version-min=6.0 -fPIC -O3 -fvisibility=hidden -DVISIBILITY_HIDDEN -Wall  -arch armv7 -mkernel -UNDEBUG -MD -MT projects/compiler-rt/lib/builtins/CMakeFiles/clang_rt.cc_kext_armv7_ios.dir/mulvsi3.c.o -MF projects/compiler-rt/lib/builtins/CMakeFiles/clang_rt.cc_kext_armv7_ios.dir/mulvsi3.c.o.d -o projects/compiler-rt/lib/builtins/CMakeFiles/clang_rt.cc_kext_armv7_ios.dir/mulvsi3.c.o   -c /Users/buildslave/jenkins/workspace/lldb-cmake/llvm-project/compiler-rt/lib/builtins/mulvsi3.c
[10350/10424] /Users/buildslave/jenkins/workspace/lldb-cmake/host-compiler/bin/clang -DKERNEL_USE -D_DEBUG -D__STDC_CONSTANT_MACROS -D__STDC_FORMAT_MACROS -D__STDC_LIMIT_MACROS -Iprojects/compiler-rt/lib/builtins -I/Users/buildslave/jenkins/workspace/lldb-cmake/llvm-project/compiler-rt/lib/builtins -I/Applications/Xcode.app/Contents/Developer/Platforms/MacOSX.platform/Developer/SDKs/MacOSX10.15.sdk/usr/include/libxml2 -Iinclude -I/Users/buildslave/jenkins/workspace/lldb-cmake/llvm-project/llvm/include -I/Users/buildslave/jenkins/workspace/lldb-cmake/llvm-project/compiler-rt/lib/builtins/../../include -O3  -arch armv7 -isysroot /Applications/Xcode.app/Contents/Developer/Platforms/MacOSX.platform/Developer/SDKs/MacOSX10.15.sdk    -isysroot /Applications/Xcode.app/Contents/Developer/Platforms/iPhoneOS.platform/Developer/SDKs/iPhoneOS13.5.sdk -miphoneos-version-min=6.0 -fPIC -O3 -fvisibility=hidden -DVISIBILITY_HIDDEN -Wall  -arch armv7 -mkernel -UNDEBUG -MD -MT projects/compiler-rt/lib/builtins/CMakeFiles/clang_rt.cc_kext_armv7_ios.dir/mulvdi3.c.o -MF projects/compiler-rt/lib/builtins/CMakeFiles/clang_rt.cc_kext_armv7_ios.dir/mulvdi3.c.o.d -o projects/compiler-rt/lib/builtins/CMakeFiles/clang_rt.cc_kext_armv7_ios.dir/mulvdi3.c.o   -c /Users/buildslave/jenkins/workspace/lldb-cmake/llvm-project/compiler-rt/lib/builtins/mulvdi3.c
[10351/10424] /Users/buildslave/jenkins/workspace/lldb-cmake/host-compiler/bin/clang -DKERNEL_USE -D_DEBUG -D__STDC_CONSTANT_MACROS -D__STDC_FORMAT_MACROS -D__STDC_LIMIT_MACROS -Iprojects/compiler-rt/lib/builtins -I/Users/buildslave/jenkins/workspace/lldb-cmake/llvm-project/compiler-rt/lib/builtins -I/Applications/Xcode.app/Contents/Developer/Platforms/MacOSX.platform/Developer/SDKs/MacOSX10.15.sdk/usr/include/libxml2 -Iinclude -I/Users/buildslave/jenkins/workspace/lldb-cmake/llvm-project/llvm/include -I/Users/buildslave/jenkins/workspace/lldb-cmake/llvm-project/compiler-rt/lib/builtins/../../include -O3  -arch armv7 -isysroot /Applications/Xcode.app/Contents/Developer/Platforms/MacOSX.platform/Developer/SDKs/MacOSX10.15.sdk    -isysroot /Applications/Xcode.app/Contents/Developer/Platforms/iPhoneOS.platform/Developer/SDKs/iPhoneOS13.5.sdk -miphoneos-version-min=6.0 -fPIC -O3 -fvisibility=hidden -DVISIBILITY_HIDDEN -Wall  -arch armv7 -mkernel -UNDEBUG -MD -MT projects/compiler-rt/lib/builtins/CMakeFiles/clang_rt.cc_kext_armv7_ios.dir/muldf3.c.o -MF projects/compiler-rt/lib/builtins/CMakeFiles/clang_rt.cc_kext_armv7_ios.dir/muldf3.c.o.d -o projects/compiler-rt/lib/builtins/CMakeFiles/clang_rt.cc_kext_armv7_ios.dir/muldf3.c.o   -c /Users/buildslave/jenkins/workspace/lldb-cmake/llvm-project/compiler-rt/lib/builtins/muldf3.c
[10352/10424] /Users/buildslave/jenkins/workspace/lldb-cmake/host-compiler/bin/clang -DKERNEL_USE -D_DEBUG -D__STDC_CONSTANT_MACROS -D__STDC_FORMAT_MACROS -D__STDC_LIMIT_MACROS -Iprojects/compiler-rt/lib/builtins -I/Users/buildslave/jenkins/workspace/lldb-cmake/llvm-project/compiler-rt/lib/builtins -I/Applications/Xcode.app/Contents/Developer/Platforms/MacOSX.platform/Developer/SDKs/MacOSX10.15.sdk/usr/include/libxml2 -Iinclude -I/Users/buildslave/jenkins/workspace/lldb-cmake/llvm-project/llvm/include -I/Users/buildslave/jenkins/workspace/lldb-cmake/llvm-project/compiler-rt/lib/builtins/../../include -O3  -arch armv7 -isysroot /Applications/Xcode.app/Contents/Developer/Platforms/MacOSX.platform/Developer/SDKs/MacOSX10.15.sdk    -isysroot /Applications/Xcode.app/Contents/Developer/Platforms/iPhoneOS.platform/Developer/SDKs/iPhoneOS13.5.sdk -miphoneos-version-min=6.0 -fPIC -O3 -fvisibility=hidden -DVISIBILITY_HIDDEN -Wall  -arch armv7 -mkernel -UNDEBUG -MD -MT projects/compiler-rt/lib/builtins/CMakeFiles/clang_rt.cc_kext_armv7_ios.dir/negdi2.c.o -MF projects/compiler-rt/lib/builtins/CMakeFiles/clang_rt.cc_kext_armv7_ios.dir/negdi2.c.o.d -o projects/compiler-rt/lib/builtins/CMakeFiles/clang_rt.cc_kext_armv7_ios.dir/negdi2.c.o   -c /Users/buildslave/jenkins/workspace/lldb-cmake/llvm-project/compiler-rt/lib/builtins/negdi2.c
[10353/10424] /Users/buildslave/jenkins/workspace/lldb-cmake/host-compiler/bin/clang -DKERNEL_USE -D_DEBUG -D__STDC_CONSTANT_MACROS -D__STDC_FORMAT_MACROS -D__STDC_LIMIT_MACROS -Iprojects/compiler-rt/lib/builtins -I/Users/buildslave/jenkins/workspace/lldb-cmake/llvm-project/compiler-rt/lib/builtins -I/Applications/Xcode.app/Contents/Developer/Platforms/MacOSX.platform/Developer/SDKs/MacOSX10.15.sdk/usr/include/libxml2 -Iinclude -I/Users/buildslave/jenkins/workspace/lldb-cmake/llvm-project/llvm/include -I/Users/buildslave/jenkins/workspace/lldb-cmake/llvm-project/compiler-rt/lib/builtins/../../include -O3  -arch armv7 -isysroot /Applications/Xcode.app/Contents/Developer/Platforms/MacOSX.platform/Developer/SDKs/MacOSX10.15.sdk    -isysroot /Applications/Xcode.app/Contents/Developer/Platforms/iPhoneOS.platform/Developer/SDKs/iPhoneOS13.5.sdk -miphoneos-version-min=6.0 -fPIC -O3 -fvisibility=hidden -DVISIBILITY_HIDDEN -Wall  -arch armv7 -mkernel -UNDEBUG -MD -MT projects/compiler-rt/lib/builtins/CMakeFiles/clang_rt.cc_kext_armv7_ios.dir/negdf2.c.o -MF projects/compiler-rt/lib/builtins/CMakeFiles/clang_rt.cc_kext_armv7_ios.dir/negdf2.c.o.d -o projects/compiler-rt/lib/builtins/CMakeFiles/clang_rt.cc_kext_armv7_ios.dir/negdf2.c.o   -c /Users/buildslave/jenkins/workspace/lldb-cmake/llvm-project/compiler-rt/lib/builtins/negdf2.c
[10354/10424] /Users/buildslave/jenkins/workspace/lldb-cmake/host-compiler/bin/clang -DKERNEL_USE -D_DEBUG -D__STDC_CONSTANT_MACROS -D__STDC_FORMAT_MACROS -D__STDC_LIMIT_MACROS -Iprojects/compiler-rt/lib/builtins -I/Users/buildslave/jenkins/workspace/lldb-cmake/llvm-project/compiler-rt/lib/builtins -I/Applications/Xcode.app/Contents/Developer/Platforms/MacOSX.platform/Developer/SDKs/MacOSX10.15.sdk/usr/include/libxml2 -Iinclude -I/Users/buildslave/jenkins/workspace/lldb-cmake/llvm-project/llvm/include -I/Users/buildslave/jenkins/workspace/lldb-cmake/llvm-project/compiler-rt/lib/builtins/../../include -O3  -arch armv7 -isysroot /Applications/Xcode.app/Contents/Developer/Platforms/MacOSX.platform/Developer/SDKs/MacOSX10.15.sdk    -isysroot /Applications/Xcode.app/Contents/Developer/Platforms/iPhoneOS.platform/Developer/SDKs/iPhoneOS13.5.sdk -miphoneos-version-min=6.0 -fPIC -O3 -fvisibility=hidden -DVISIBILITY_HIDDEN -Wall  -arch armv7 -mkernel -UNDEBUG -MD -MT projects/compiler-rt/lib/builtins/CMakeFiles/clang_rt.cc_kext_armv7_ios.dir/mulsf3.c.o -MF projects/compiler-rt/lib/builtins/CMakeFiles/clang_rt.cc_kext_armv7_ios.dir/mulsf3.c.o.d -o projects/compiler-rt/lib/builtins/CMakeFiles/clang_rt.cc_kext_armv7_ios.dir/mulsf3.c.o   -c /Users/buildslave/jenkins/workspace/lldb-cmake/llvm-project/compiler-rt/lib/builtins/mulsf3.c
[10355/10424] /Users/buildslave/jenkins/workspace/lldb-cmake/host-compiler/bin/clang -DKERNEL_USE -D_DEBUG -D__STDC_CONSTANT_MACROS -D__STDC_FORMAT_MACROS -D__STDC_LIMIT_MACROS -Iprojects/compiler-rt/lib/builtins -I/Users/buildslave/jenkins/workspace/lldb-cmake/llvm-project/compiler-rt/lib/builtins -I/Applications/Xcode.app/Contents/Developer/Platforms/MacOSX.platform/Developer/SDKs/MacOSX10.15.sdk/usr/include/libxml2 -Iinclude -I/Users/buildslave/jenkins/workspace/lldb-cmake/llvm-project/llvm/include -I/Users/buildslave/jenkins/workspace/lldb-cmake/llvm-project/compiler-rt/lib/builtins/../../include -O3  -arch armv7 -isysroot /Applications/Xcode.app/Contents/Developer/Platforms/MacOSX.platform/Developer/SDKs/MacOSX10.15.sdk    -isysroot /Applications/Xcode.app/Contents/Developer/Platforms/iPhoneOS.platform/Developer/SDKs/iPhoneOS13.5.sdk -miphoneos-version-min=6.0 -fPIC -O3 -fvisibility=hidden -DVISIBILITY_HIDDEN -Wall  -arch armv7 -mkernel -UNDEBUG -MD -MT projects/compiler-rt/lib/builtins/CMakeFiles/clang_rt.cc_kext_armv7_ios.dir/negsf2.c.o -MF projects/compiler-rt/lib/builtins/CMakeFiles/clang_rt.cc_kext_armv7_ios.dir/negsf2.c.o.d -o projects/compiler-rt/lib/builtins/CMakeFiles/clang_rt.cc_kext_armv7_ios.dir/negsf2.c.o   -c /Users/buildslave/jenkins/workspace/lldb-cmake/llvm-project/compiler-rt/lib/builtins/negsf2.c
[10356/10424] /Users/buildslave/jenkins/workspace/lldb-cmake/host-compiler/bin/clang -DKERNEL_USE -D_DEBUG -D__STDC_CONSTANT_MACROS -D__STDC_FORMAT_MACROS -D__STDC_LIMIT_MACROS -Iprojects/compiler-rt/lib/builtins -I/Users/buildslave/jenkins/workspace/lldb-cmake/llvm-project/compiler-rt/lib/builtins -I/Applications/Xcode.app/Contents/Developer/Platforms/MacOSX.platform/Developer/SDKs/MacOSX10.15.sdk/usr/include/libxml2 -Iinclude -I/Users/buildslave/jenkins/workspace/lldb-cmake/llvm-project/llvm/include -I/Users/buildslave/jenkins/workspace/lldb-cmake/llvm-project/compiler-rt/lib/builtins/../../include -O3  -arch armv7 -isysroot /Applications/Xcode.app/Contents/Developer/Platforms/MacOSX.platform/Developer/SDKs/MacOSX10.15.sdk    -isysroot /Applications/Xcode.app/Contents/Developer/Platforms/iPhoneOS.platform/Developer/SDKs/iPhoneOS13.5.sdk -miphoneos-version-min=6.0 -fPIC -O3 -fvisibility=hidden -DVISIBILITY_HIDDEN -Wall  -arch armv7 -mkernel -UNDEBUG -MD -MT projects/compiler-rt/lib/builtins/CMakeFiles/clang_rt.cc_kext_armv7_ios.dir/negvdi2.c.o -MF projects/compiler-rt/lib/builtins/CMakeFiles/clang_rt.cc_kext_armv7_ios.dir/negvdi2.c.o.d -o projects/compiler-rt/lib/builtins/CMakeFiles/clang_rt.cc_kext_armv7_ios.dir/negvdi2.c.o   -c /Users/buildslave/jenkins/workspace/lldb-cmake/llvm-project/compiler-rt/lib/builtins/negvdi2.c
[10357/10424] /Users/buildslave/jenkins/workspace/lldb-cmake/host-compiler/bin/clang -DKERNEL_USE -D_DEBUG -D__STDC_CONSTANT_MACROS -D__STDC_FORMAT_MACROS -D__STDC_LIMIT_MACROS -Iprojects/compiler-rt/lib/builtins -I/Users/buildslave/jenkins/workspace/lldb-cmake/llvm-project/compiler-rt/lib/builtins -I/Applications/Xcode.app/Contents/Developer/Platforms/MacOSX.platform/Developer/SDKs/MacOSX10.15.sdk/usr/include/libxml2 -Iinclude -I/Users/buildslave/jenkins/workspace/lldb-cmake/llvm-project/llvm/include -I/Users/buildslave/jenkins/workspace/lldb-cmake/llvm-project/compiler-rt/lib/builtins/../../include -O3  -arch armv7 -isysroot /Applications/Xcode.app/Contents/Developer/Platforms/MacOSX.platform/Developer/SDKs/MacOSX10.15.sdk    -isysroot /Applications/Xcode.app/Contents/Developer/Platforms/iPhoneOS.platform/Developer/SDKs/iPhoneOS13.5.sdk -miphoneos-version-min=6.0 -fPIC -O3 -fvisibility=hidden -DVISIBILITY_HIDDEN -Wall  -arch armv7 -mkernel -UNDEBUG -MD -MT projects/compiler-rt/lib/builtins/CMakeFiles/clang_rt.cc_kext_armv7_ios.dir/negvsi2.c.o -MF projects/compiler-rt/lib/builtins/CMakeFiles/clang_rt.cc_kext_armv7_ios.dir/negvsi2.c.o.d -o projects/compiler-rt/lib/builtins/CMakeFiles/clang_rt.cc_kext_armv7_ios.dir/negvsi2.c.o   -c /Users/buildslave/jenkins/workspace/lldb-cmake/llvm-project/compiler-rt/lib/builtins/negvsi2.c
[10358/10424] /Users/buildslave/jenkins/workspace/lldb-cmake/host-compiler/bin/clang -DKERNEL_USE -D_DEBUG -D__STDC_CONSTANT_MACROS -D__STDC_FORMAT_MACROS -D__STDC_LIMIT_MACROS -Iprojects/compiler-rt/lib/builtins -I/Users/buildslave/jenkins/workspace/lldb-cmake/llvm-project/compiler-rt/lib/builtins -I/Applications/Xcode.app/Contents/Developer/Platforms/MacOSX.platform/Developer/SDKs/MacOSX10.15.sdk/usr/include/libxml2 -Iinclude -I/Users/buildslave/jenkins/workspace/lldb-cmake/llvm-project/llvm/include -I/Users/buildslave/jenkins/workspace/lldb-cmake/llvm-project/compiler-rt/lib/builtins/../../include -O3  -arch armv7 -isysroot /Applications/Xcode.app/Contents/Developer/Platforms/MacOSX.platform/Developer/SDKs/MacOSX10.15.sdk    -isysroot /Applications/Xcode.app/Contents/Developer/Platforms/iPhoneOS.platform/Developer/SDKs/iPhoneOS13.5.sdk -miphoneos-version-min=6.0 -fPIC -O3 -fvisibility=hidden -DVISIBILITY_HIDDEN -Wall  -arch armv7 -mkernel -UNDEBUG -MD -MT projects/compiler-rt/lib/builtins/CMakeFiles/clang_rt.cc_kext_armv7_ios.dir/paritydi2.c.o -MF projects/compiler-rt/lib/builtins/CMakeFiles/clang_rt.cc_kext_armv7_ios.dir/paritydi2.c.o.d -o projects/compiler-rt/lib/builtins/CMakeFiles/clang_rt.cc_kext_armv7_ios.dir/paritydi2.c.o   -c /Users/buildslave/jenkins/workspace/lldb-cmake/llvm-project/compiler-rt/lib/builtins/paritydi2.c
[10359/10424] /Users/buildslave/jenkins/workspace/lldb-cmake/host-compiler/bin/clang -DKERNEL_USE -D_DEBUG -D__STDC_CONSTANT_MACROS -D__STDC_FORMAT_MACROS -D__STDC_LIMIT_MACROS -Iprojects/compiler-rt/lib/builtins -I/Users/buildslave/jenkins/workspace/lldb-cmake/llvm-project/compiler-rt/lib/builtins -I/Applications/Xcode.app/Contents/Developer/Platforms/MacOSX.platform/Developer/SDKs/MacOSX10.15.sdk/usr/include/libxml2 -Iinclude -I/Users/buildslave/jenkins/workspace/lldb-cmake/llvm-project/llvm/include -I/Users/buildslave/jenkins/workspace/lldb-cmake/llvm-project/compiler-rt/lib/builtins/../../include -O3  -arch armv7 -isysroot /Applications/Xcode.app/Contents/Developer/Platforms/MacOSX.platform/Developer/SDKs/MacOSX10.15.sdk    -isysroot /Applications/Xcode.app/Contents/Developer/Platforms/iPhoneOS.platform/Developer/SDKs/iPhoneOS13.5.sdk -miphoneos-version-min=6.0 -fPIC -O3 -fvisibility=hidden -DVISIBILITY_HIDDEN -Wall  -arch armv7 -mkernel -UNDEBUG -MD -MT projects/compiler-rt/lib/builtins/CMakeFiles/clang_rt.cc_kext_armv7_ios.dir/paritysi2.c.o -MF projects/compiler-rt/lib/builtins/CMakeFiles/clang_rt.cc_kext_armv7_ios.dir/paritysi2.c.o.d -o projects/compiler-rt/lib/builtins/CMakeFiles/clang_rt.cc_kext_armv7_ios.dir/paritysi2.c.o   -c /Users/buildslave/jenkins/workspace/lldb-cmake/llvm-project/compiler-rt/lib/builtins/paritysi2.c
[10360/10424] /Users/buildslave/jenkins/workspace/lldb-cmake/host-compiler/bin/clang -DKERNEL_USE -D_DEBUG -D__STDC_CONSTANT_MACROS -D__STDC_FORMAT_MACROS -D__STDC_LIMIT_MACROS -Iprojects/compiler-rt/lib/builtins -I/Users/buildslave/jenkins/workspace/lldb-cmake/llvm-project/compiler-rt/lib/builtins -I/Applications/Xcode.app/Contents/Developer/Platforms/MacOSX.platform/Developer/SDKs/MacOSX10.15.sdk/usr/include/libxml2 -Iinclude -I/Users/buildslave/jenkins/workspace/lldb-cmake/llvm-project/llvm/include -I/Users/buildslave/jenkins/workspace/lldb-cmake/llvm-project/compiler-rt/lib/builtins/../../include -O3  -arch armv7 -isysroot /Applications/Xcode.app/Contents/Developer/Platforms/MacOSX.platform/Developer/SDKs/MacOSX10.15.sdk    -isysroot /Applications/Xcode.app/Contents/Developer/Platforms/iPhoneOS.platform/Developer/SDKs/iPhoneOS13.5.sdk -miphoneos-version-min=6.0 -fPIC -O3 -fvisibility=hidden -DVISIBILITY_HIDDEN -Wall  -arch armv7 -mkernel -UNDEBUG -MD -MT projects/compiler-rt/lib/builtins/CMakeFiles/clang_rt.cc_kext_armv7_ios.dir/popcountdi2.c.o -MF projects/compiler-rt/lib/builtins/CMakeFiles/clang_rt.cc_kext_armv7_ios.dir/popcountdi2.c.o.d -o projects/compiler-rt/lib/builtins/CMakeFiles/clang_rt.cc_kext_armv7_ios.dir/popcountdi2.c.o   -c /Users/buildslave/jenkins/workspace/lldb-cmake/llvm-project/compiler-rt/lib/builtins/popcountdi2.c
[10361/10424] /Users/buildslave/jenkins/workspace/lldb-cmake/host-compiler/bin/clang -DKERNEL_USE -D_DEBUG -D__STDC_CONSTANT_MACROS -D__STDC_FORMAT_MACROS -D__STDC_LIMIT_MACROS -Iprojects/compiler-rt/lib/builtins -I/Users/buildslave/jenkins/workspace/lldb-cmake/llvm-project/compiler-rt/lib/builtins -I/Applications/Xcode.app/Contents/Developer/Platforms/MacOSX.platform/Developer/SDKs/MacOSX10.15.sdk/usr/include/libxml2 -Iinclude -I/Users/buildslave/jenkins/workspace/lldb-cmake/llvm-project/llvm/include -I/Users/buildslave/jenkins/workspace/lldb-cmake/llvm-project/compiler-rt/lib/builtins/../../include -O3  -arch armv7 -isysroot /Applications/Xcode.app/Contents/Developer/Platforms/MacOSX.platform/Developer/SDKs/MacOSX10.15.sdk    -isysroot /Applications/Xcode.app/Contents/Developer/Platforms/iPhoneOS.platform/Developer/SDKs/iPhoneOS13.5.sdk -miphoneos-version-min=6.0 -fPIC -O3 -fvisibility=hidden -DVISIBILITY_HIDDEN -Wall  -arch armv7 -mkernel -UNDEBUG -MD -MT projects/compiler-rt/lib/builtins/CMakeFiles/clang_rt.cc_kext_armv7_ios.dir/popcountsi2.c.o -MF projects/compiler-rt/lib/builtins/CMakeFiles/clang_rt.cc_kext_armv7_ios.dir/popcountsi2.c.o.d -o projects/compiler-rt/lib/builtins/CMakeFiles/clang_rt.cc_kext_armv7_ios.dir/popcountsi2.c.o   -c /Users/buildslave/jenkins/workspace/lldb-cmake/llvm-project/compiler-rt/lib/builtins/popcountsi2.c
[10362/10424] /Users/buildslave/jenkins/workspace/lldb-cmake/host-compiler/bin/clang -DKERNEL_USE -D_DEBUG -D__STDC_CONSTANT_MACROS -D__STDC_FORMAT_MACROS -D__STDC_LIMIT_MACROS -Iprojects/compiler-rt/lib/builtins -I/Users/buildslave/jenkins/workspace/lldb-cmake/llvm-project/compiler-rt/lib/builtins -I/Applications/Xcode.app/Contents/Developer/Platforms/MacOSX.platform/Developer/SDKs/MacOSX10.15.sdk/usr/include/libxml2 -Iinclude -I/Users/buildslave/jenkins/workspace/lldb-cmake/llvm-project/llvm/include -I/Users/buildslave/jenkins/workspace/lldb-cmake/llvm-project/compiler-rt/lib/builtins/../../include -O3  -arch armv7 -isysroot /Applications/Xcode.app/Contents/Developer/Platforms/MacOSX.platform/Developer/SDKs/MacOSX10.15.sdk    -isysroot /Applications/Xcode.app/Contents/Developer/Platforms/iPhoneOS.platform/Developer/SDKs/iPhoneOS13.5.sdk -miphoneos-version-min=6.0 -fPIC -O3 -fvisibility=hidden -DVISIBILITY_HIDDEN -Wall  -arch armv7 -mkernel -UNDEBUG -MD -MT projects/compiler-rt/lib/builtins/CMakeFiles/clang_rt.cc_kext_armv7_ios.dir/powisf2.c.o -MF projects/compiler-rt/lib/builtins/CMakeFiles/clang_rt.cc_kext_armv7_ios.dir/powisf2.c.o.d -o projects/compiler-rt/lib/builtins/CMakeFiles/clang_rt.cc_kext_armv7_ios.dir/powisf2.c.o   -c /Users/buildslave/jenkins/workspace/lldb-cmake/llvm-project/compiler-rt/lib/builtins/powisf2.c
[10363/10424] /Users/buildslave/jenkins/workspace/lldb-cmake/host-compiler/bin/clang -DKERNEL_USE -D_DEBUG -D__STDC_CONSTANT_MACROS -D__STDC_FORMAT_MACROS -D__STDC_LIMIT_MACROS -Iprojects/compiler-rt/lib/builtins -I/Users/buildslave/jenkins/workspace/lldb-cmake/llvm-project/compiler-rt/lib/builtins -I/Applications/Xcode.app/Contents/Developer/Platforms/MacOSX.platform/Developer/SDKs/MacOSX10.15.sdk/usr/include/libxml2 -Iinclude -I/Users/buildslave/jenkins/workspace/lldb-cmake/llvm-project/llvm/include -I/Users/buildslave/jenkins/workspace/lldb-cmake/llvm-project/compiler-rt/lib/builtins/../../include -O3  -arch armv7 -isysroot /Applications/Xcode.app/Contents/Developer/Platforms/MacOSX.platform/Developer/SDKs/MacOSX10.15.sdk    -isysroot /Applications/Xcode.app/Contents/Developer/Platforms/iPhoneOS.platform/Developer/SDKs/iPhoneOS13.5.sdk -miphoneos-version-min=6.0 -fPIC -O3 -fvisibility=hidden -DVISIBILITY_HIDDEN -Wall  -arch armv7 -mkernel -UNDEBUG -MD -MT projects/compiler-rt/lib/builtins/CMakeFiles/clang_rt.cc_kext_armv7_ios.dir/powidf2.c.o -MF projects/compiler-rt/lib/builtins/CMakeFiles/clang_rt.cc_kext_armv7_ios.dir/powidf2.c.o.d -o projects/compiler-rt/lib/builtins/CMakeFiles/clang_rt.cc_kext_armv7_ios.dir/powidf2.c.o   -c /Users/buildslave/jenkins/workspace/lldb-cmake/llvm-project/compiler-rt/lib/builtins/powidf2.c
[10364/10424] /Users/buildslave/jenkins/workspace/lldb-cmake/host-compiler/bin/clang -DKERNEL_USE -D_DEBUG -D__STDC_CONSTANT_MACROS -D__STDC_FORMAT_MACROS -D__STDC_LIMIT_MACROS -Iprojects/compiler-rt/lib/builtins -I/Users/buildslave/jenkins/workspace/lldb-cmake/llvm-project/compiler-rt/lib/builtins -I/Applications/Xcode.app/Contents/Developer/Platforms/MacOSX.platform/Developer/SDKs/MacOSX10.15.sdk/usr/include/libxml2 -Iinclude -I/Users/buildslave/jenkins/workspace/lldb-cmake/llvm-project/llvm/include -I/Users/buildslave/jenkins/workspace/lldb-cmake/llvm-project/compiler-rt/lib/builtins/../../include -O3  -arch armv7 -isysroot /Applications/Xcode.app/Contents/Developer/Platforms/MacOSX.platform/Developer/SDKs/MacOSX10.15.sdk    -isysroot /Applications/Xcode.app/Contents/Developer/Platforms/iPhoneOS.platform/Developer/SDKs/iPhoneOS13.5.sdk -miphoneos-version-min=6.0 -fPIC -O3 -fvisibility=hidden -DVISIBILITY_HIDDEN -Wall  -arch armv7 -mkernel -UNDEBUG -MD -MT projects/compiler-rt/lib/builtins/CMakeFiles/clang_rt.cc_kext_armv7_ios.dir/subdf3.c.o -MF projects/compiler-rt/lib/builtins/CMakeFiles/clang_rt.cc_kext_armv7_ios.dir/subdf3.c.o.d -o projects/compiler-rt/lib/builtins/CMakeFiles/clang_rt.cc_kext_armv7_ios.dir/subdf3.c.o   -c /Users/buildslave/jenkins/workspace/lldb-cmake/llvm-project/compiler-rt/lib/builtins/subdf3.c
[10365/10424] /Users/buildslave/jenkins/workspace/lldb-cmake/host-compiler/bin/clang -DKERNEL_USE -D_DEBUG -D__STDC_CONSTANT_MACROS -D__STDC_FORMAT_MACROS -D__STDC_LIMIT_MACROS -Iprojects/compiler-rt/lib/builtins -I/Users/buildslave/jenkins/workspace/lldb-cmake/llvm-project/compiler-rt/lib/builtins -I/Applications/Xcode.app/Contents/Developer/Platforms/MacOSX.platform/Developer/SDKs/MacOSX10.15.sdk/usr/include/libxml2 -Iinclude -I/Users/buildslave/jenkins/workspace/lldb-cmake/llvm-project/llvm/include -I/Users/buildslave/jenkins/workspace/lldb-cmake/llvm-project/compiler-rt/lib/builtins/../../include -O3  -arch armv7 -isysroot /Applications/Xcode.app/Contents/Developer/Platforms/MacOSX.platform/Developer/SDKs/MacOSX10.15.sdk    -isysroot /Applications/Xcode.app/Contents/Developer/Platforms/iPhoneOS.platform/Developer/SDKs/iPhoneOS13.5.sdk -miphoneos-version-min=6.0 -fPIC -O3 -fvisibility=hidden -DVISIBILITY_HIDDEN -Wall  -arch armv7 -mkernel -UNDEBUG -MD -MT projects/compiler-rt/lib/builtins/CMakeFiles/clang_rt.cc_kext_armv7_ios.dir/subsf3.c.o -MF projects/compiler-rt/lib/builtins/CMakeFiles/clang_rt.cc_kext_armv7_ios.dir/subsf3.c.o.d -o projects/compiler-rt/lib/builtins/CMakeFiles/clang_rt.cc_kext_armv7_ios.dir/subsf3.c.o   -c /Users/buildslave/jenkins/workspace/lldb-cmake/llvm-project/compiler-rt/lib/builtins/subsf3.c
[10366/10424] /Users/buildslave/jenkins/workspace/lldb-cmake/host-compiler/bin/clang -DKERNEL_USE -D_DEBUG -D__STDC_CONSTANT_MACROS -D__STDC_FORMAT_MACROS -D__STDC_LIMIT_MACROS -Iprojects/compiler-rt/lib/builtins -I/Users/buildslave/jenkins/workspace/lldb-cmake/llvm-project/compiler-rt/lib/builtins -I/Applications/Xcode.app/Contents/Developer/Platforms/MacOSX.platform/Developer/SDKs/MacOSX10.15.sdk/usr/include/libxml2 -Iinclude -I/Users/buildslave/jenkins/workspace/lldb-cmake/llvm-project/llvm/include -I/Users/buildslave/jenkins/workspace/lldb-cmake/llvm-project/compiler-rt/lib/builtins/../../include -O3  -arch armv7 -isysroot /Applications/Xcode.app/Contents/Developer/Platforms/MacOSX.platform/Developer/SDKs/MacOSX10.15.sdk    -isysroot /Applications/Xcode.app/Contents/Developer/Platforms/iPhoneOS.platform/Developer/SDKs/iPhoneOS13.5.sdk -miphoneos-version-min=6.0 -fPIC -O3 -fvisibility=hidden -DVISIBILITY_HIDDEN -Wall  -arch armv7 -mkernel -UNDEBUG -MD -MT projects/compiler-rt/lib/builtins/CMakeFiles/clang_rt.cc_kext_armv7_ios.dir/subvdi3.c.o -MF projects/compiler-rt/lib/builtins/CMakeFiles/clang_rt.cc_kext_armv7_ios.dir/subvdi3.c.o.d -o projects/compiler-rt/lib/builtins/CMakeFiles/clang_rt.cc_kext_armv7_ios.dir/subvdi3.c.o   -c /Users/buildslave/jenkins/workspace/lldb-cmake/llvm-project/compiler-rt/lib/builtins/subvdi3.c
[10367/10424] /Users/buildslave/jenkins/workspace/lldb-cmake/host-compiler/bin/clang -DKERNEL_USE -D_DEBUG -D__STDC_CONSTANT_MACROS -D__STDC_FORMAT_MACROS -D__STDC_LIMIT_MACROS -Iprojects/compiler-rt/lib/builtins -I/Users/buildslave/jenkins/workspace/lldb-cmake/llvm-project/compiler-rt/lib/builtins -I/Applications/Xcode.app/Contents/Developer/Platforms/MacOSX.platform/Developer/SDKs/MacOSX10.15.sdk/usr/include/libxml2 -Iinclude -I/Users/buildslave/jenkins/workspace/lldb-cmake/llvm-project/llvm/include -I/Users/buildslave/jenkins/workspace/lldb-cmake/llvm-project/compiler-rt/lib/builtins/../../include -O3  -arch armv7 -isysroot /Applications/Xcode.app/Contents/Developer/Platforms/MacOSX.platform/Developer/SDKs/MacOSX10.15.sdk    -isysroot /Applications/Xcode.app/Contents/Developer/Platforms/iPhoneOS.platform/Developer/SDKs/iPhoneOS13.5.sdk -miphoneos-version-min=6.0 -fPIC -O3 -fvisibility=hidden -DVISIBILITY_HIDDEN -Wall  -arch armv7 -mkernel -UNDEBUG -MD -MT projects/compiler-rt/lib/builtins/CMakeFiles/clang_rt.cc_kext_armv7_ios.dir/subvsi3.c.o -MF projects/compiler-rt/lib/builtins/CMakeFiles/clang_rt.cc_kext_armv7_ios.dir/subvsi3.c.o.d -o projects/compiler-rt/lib/builtins/CMakeFiles/clang_rt.cc_kext_armv7_ios.dir/subvsi3.c.o   -c /Users/buildslave/jenkins/workspace/lldb-cmake/llvm-project/compiler-rt/lib/builtins/subvsi3.c
[10368/10424] /Users/buildslave/jenkins/workspace/lldb-cmake/host-compiler/bin/clang -DKERNEL_USE -D_DEBUG -D__STDC_CONSTANT_MACROS -D__STDC_FORMAT_MACROS -D__STDC_LIMIT_MACROS -Iprojects/compiler-rt/lib/builtins -I/Users/buildslave/jenkins/workspace/lldb-cmake/llvm-project/compiler-rt/lib/builtins -I/Applications/Xcode.app/Contents/Developer/Platforms/MacOSX.platform/Developer/SDKs/MacOSX10.15.sdk/usr/include/libxml2 -Iinclude -I/Users/buildslave/jenkins/workspace/lldb-cmake/llvm-project/llvm/include -I/Users/buildslave/jenkins/workspace/lldb-cmake/llvm-project/compiler-rt/lib/builtins/../../include -O3  -arch armv7 -isysroot /Applications/Xcode.app/Contents/Developer/Platforms/MacOSX.platform/Developer/SDKs/MacOSX10.15.sdk    -isysroot /Applications/Xcode.app/Contents/Developer/Platforms/iPhoneOS.platform/Developer/SDKs/iPhoneOS13.5.sdk -miphoneos-version-min=6.0 -fPIC -O3 -fvisibility=hidden -DVISIBILITY_HIDDEN -Wall  -arch armv7 -mkernel -UNDEBUG -MD -MT projects/compiler-rt/lib/builtins/CMakeFiles/clang_rt.cc_kext_armv7_ios.dir/truncdfhf2.c.o -MF projects/compiler-rt/lib/builtins/CMakeFiles/clang_rt.cc_kext_armv7_ios.dir/truncdfhf2.c.o.d -o projects/compiler-rt/lib/builtins/CMakeFiles/clang_rt.cc_kext_armv7_ios.dir/truncdfhf2.c.o   -c /Users/buildslave/jenkins/workspace/lldb-cmake/llvm-project/compiler-rt/lib/builtins/truncdfhf2.c
[10369/10424] /Users/buildslave/jenkins/workspace/lldb-cmake/host-compiler/bin/clang -DKERNEL_USE -D_DEBUG -D__STDC_CONSTANT_MACROS -D__STDC_FORMAT_MACROS -D__STDC_LIMIT_MACROS -Iprojects/compiler-rt/lib/builtins -I/Users/buildslave/jenkins/workspace/lldb-cmake/llvm-project/compiler-rt/lib/builtins -I/Applications/Xcode.app/Contents/Developer/Platforms/MacOSX.platform/Developer/SDKs/MacOSX10.15.sdk/usr/include/libxml2 -Iinclude -I/Users/buildslave/jenkins/workspace/lldb-cmake/llvm-project/llvm/include -I/Users/buildslave/jenkins/workspace/lldb-cmake/llvm-project/compiler-rt/lib/builtins/../../include -O3  -arch armv7 -isysroot /Applications/Xcode.app/Contents/Developer/Platforms/MacOSX.platform/Developer/SDKs/MacOSX10.15.sdk    -isysroot /Applications/Xcode.app/Contents/Developer/Platforms/iPhoneOS.platform/Developer/SDKs/iPhoneOS13.5.sdk -miphoneos-version-min=6.0 -fPIC -O3 -fvisibility=hidden -DVISIBILITY_HIDDEN -Wall  -arch armv7 -mkernel -UNDEBUG -MD -MT projects/compiler-rt/lib/builtins/CMakeFiles/clang_rt.cc_kext_armv7_ios.dir/truncdfsf2.c.o -MF projects/compiler-rt/lib/builtins/CMakeFiles/clang_rt.cc_kext_armv7_ios.dir/truncdfsf2.c.o.d -o projects/compiler-rt/lib/builtins/CMakeFiles/clang_rt.cc_kext_armv7_ios.dir/truncdfsf2.c.o   -c /Users/buildslave/jenkins/workspace/lldb-cmake/llvm-project/compiler-rt/lib/builtins/truncdfsf2.c
[10370/10424] /Users/buildslave/jenkins/workspace/lldb-cmake/host-compiler/bin/clang -DKERNEL_USE -D_DEBUG -D__STDC_CONSTANT_MACROS -D__STDC_FORMAT_MACROS -D__STDC_LIMIT_MACROS -Iprojects/compiler-rt/lib/builtins -I/Users/buildslave/jenkins/workspace/lldb-cmake/llvm-project/compiler-rt/lib/builtins -I/Applications/Xcode.app/Contents/Developer/Platforms/MacOSX.platform/Developer/SDKs/MacOSX10.15.sdk/usr/include/libxml2 -Iinclude -I/Users/buildslave/jenkins/workspace/lldb-cmake/llvm-project/llvm/include -I/Users/buildslave/jenkins/workspace/lldb-cmake/llvm-project/compiler-rt/lib/builtins/../../include -O3  -arch armv7 -isysroot /Applications/Xcode.app/Contents/Developer/Platforms/MacOSX.platform/Developer/SDKs/MacOSX10.15.sdk    -isysroot /Applications/Xcode.app/Contents/Developer/Platforms/iPhoneOS.platform/Developer/SDKs/iPhoneOS13.5.sdk -miphoneos-version-min=6.0 -fPIC -O3 -fvisibility=hidden -DVISIBILITY_HIDDEN -Wall  -arch armv7 -mkernel -UNDEBUG -MD -MT projects/compiler-rt/lib/builtins/CMakeFiles/clang_rt.cc_kext_armv7_ios.dir/truncsfhf2.c.o -MF projects/compiler-rt/lib/builtins/CMakeFiles/clang_rt.cc_kext_armv7_ios.dir/truncsfhf2.c.o.d -o projects/compiler-rt/lib/builtins/CMakeFiles/clang_rt.cc_kext_armv7_ios.dir/truncsfhf2.c.o   -c /Users/buildslave/jenkins/workspace/lldb-cmake/llvm-project/compiler-rt/lib/builtins/truncsfhf2.c
[10371/10424] /Users/buildslave/jenkins/workspace/lldb-cmake/host-compiler/bin/clang -DKERNEL_USE -D_DEBUG -D__STDC_CONSTANT_MACROS -D__STDC_FORMAT_MACROS -D__STDC_LIMIT_MACROS -Iprojects/compiler-rt/lib/builtins -I/Users/buildslave/jenkins/workspace/lldb-cmake/llvm-project/compiler-rt/lib/builtins -I/Applications/Xcode.app/Contents/Developer/Platforms/MacOSX.platform/Developer/SDKs/MacOSX10.15.sdk/usr/include/libxml2 -Iinclude -I/Users/buildslave/jenkins/workspace/lldb-cmake/llvm-project/llvm/include -I/Users/buildslave/jenkins/workspace/lldb-cmake/llvm-project/compiler-rt/lib/builtins/../../include -O3  -arch armv7 -isysroot /Applications/Xcode.app/Contents/Developer/Platforms/MacOSX.platform/Developer/SDKs/MacOSX10.15.sdk    -isysroot /Applications/Xcode.app/Contents/Developer/Platforms/iPhoneOS.platform/Developer/SDKs/iPhoneOS13.5.sdk -miphoneos-version-min=6.0 -fPIC -O3 -fvisibility=hidden -DVISIBILITY_HIDDEN -Wall  -arch armv7 -mkernel -UNDEBUG -MD -MT projects/compiler-rt/lib/builtins/CMakeFiles/clang_rt.cc_kext_armv7_ios.dir/ucmpdi2.c.o -MF projects/compiler-rt/lib/builtins/CMakeFiles/clang_rt.cc_kext_armv7_ios.dir/ucmpdi2.c.o.d -o projects/compiler-rt/lib/builtins/CMakeFiles/clang_rt.cc_kext_armv7_ios.dir/ucmpdi2.c.o   -c /Users/buildslave/jenkins/workspace/lldb-cmake/llvm-project/compiler-rt/lib/builtins/ucmpdi2.c
[10372/10424] /Users/buildslave/jenkins/workspace/lldb-cmake/host-compiler/bin/clang -DKERNEL_USE -D_DEBUG -D__STDC_CONSTANT_MACROS -D__STDC_FORMAT_MACROS -D__STDC_LIMIT_MACROS -Iprojects/compiler-rt/lib/builtins -I/Users/buildslave/jenkins/workspace/lldb-cmake/llvm-project/compiler-rt/lib/builtins -I/Applications/Xcode.app/Contents/Developer/Platforms/MacOSX.platform/Developer/SDKs/MacOSX10.15.sdk/usr/include/libxml2 -Iinclude -I/Users/buildslave/jenkins/workspace/lldb-cmake/llvm-project/llvm/include -I/Users/buildslave/jenkins/workspace/lldb-cmake/llvm-project/compiler-rt/lib/builtins/../../include -O3  -arch armv7 -isysroot /Applications/Xcode.app/Contents/Developer/Platforms/MacOSX.platform/Developer/SDKs/MacOSX10.15.sdk    -isysroot /Applications/Xcode.app/Contents/Developer/Platforms/iPhoneOS.platform/Developer/SDKs/iPhoneOS13.5.sdk -miphoneos-version-min=6.0 -fPIC -O3 -fvisibility=hidden -DVISIBILITY_HIDDEN -Wall  -arch armv7 -mkernel -UNDEBUG -MD -MT projects/compiler-rt/lib/builtins/CMakeFiles/clang_rt.cc_kext_armv7_ios.dir/udivdi3.c.o -MF projects/compiler-rt/lib/builtins/CMakeFiles/clang_rt.cc_kext_armv7_ios.dir/udivdi3.c.o.d -o projects/compiler-rt/lib/builtins/CMakeFiles/clang_rt.cc_kext_armv7_ios.dir/udivdi3.c.o   -c /Users/buildslave/jenkins/workspace/lldb-cmake/llvm-project/compiler-rt/lib/builtins/udivdi3.c
[10373/10424] /Users/buildslave/jenkins/workspace/lldb-cmake/host-compiler/bin/clang -DKERNEL_USE -D_DEBUG -D__STDC_CONSTANT_MACROS -D__STDC_FORMAT_MACROS -D__STDC_LIMIT_MACROS -Iprojects/compiler-rt/lib/builtins -I/Users/buildslave/jenkins/workspace/lldb-cmake/llvm-project/compiler-rt/lib/builtins -I/Applications/Xcode.app/Contents/Developer/Platforms/MacOSX.platform/Developer/SDKs/MacOSX10.15.sdk/usr/include/libxml2 -Iinclude -I/Users/buildslave/jenkins/workspace/lldb-cmake/llvm-project/llvm/include -I/Users/buildslave/jenkins/workspace/lldb-cmake/llvm-project/compiler-rt/lib/builtins/../../include -O3  -arch armv7 -isysroot /Applications/Xcode.app/Contents/Developer/Platforms/MacOSX.platform/Developer/SDKs/MacOSX10.15.sdk    -isysroot /Applications/Xcode.app/Contents/Developer/Platforms/iPhoneOS.platform/Developer/SDKs/iPhoneOS13.5.sdk -miphoneos-version-min=6.0 -fPIC -O3 -fvisibility=hidden -DVISIBILITY_HIDDEN -Wall  -arch armv7 -mkernel -UNDEBUG -MD -MT projects/compiler-rt/lib/builtins/CMakeFiles/clang_rt.cc_kext_armv7_ios.dir/enable_execute_stack.c.o -MF projects/compiler-rt/lib/builtins/CMakeFiles/clang_rt.cc_kext_armv7_ios.dir/enable_execute_stack.c.o.d -o projects/compiler-rt/lib/builtins/CMakeFiles/clang_rt.cc_kext_armv7_ios.dir/enable_execute_stack.c.o   -c /Users/buildslave/jenkins/workspace/lldb-cmake/llvm-project/compiler-rt/lib/builtins/enable_execute_stack.c
[10374/10424] /Users/buildslave/jenkins/workspace/lldb-cmake/host-compiler/bin/clang -DKERNEL_USE -D_DEBUG -D__STDC_CONSTANT_MACROS -D__STDC_FORMAT_MACROS -D__STDC_LIMIT_MACROS -Iprojects/compiler-rt/lib/builtins -I/Users/buildslave/jenkins/workspace/lldb-cmake/llvm-project/compiler-rt/lib/builtins -I/Applications/Xcode.app/Contents/Developer/Platforms/MacOSX.platform/Developer/SDKs/MacOSX10.15.sdk/usr/include/libxml2 -Iinclude -I/Users/buildslave/jenkins/workspace/lldb-cmake/llvm-project/llvm/include -I/Users/buildslave/jenkins/workspace/lldb-cmake/llvm-project/compiler-rt/lib/builtins/../../include -O3  -arch armv7 -isysroot /Applications/Xcode.app/Contents/Developer/Platforms/MacOSX.platform/Developer/SDKs/MacOSX10.15.sdk    -isysroot /Applications/Xcode.app/Contents/Developer/Platforms/iPhoneOS.platform/Developer/SDKs/iPhoneOS13.5.sdk -miphoneos-version-min=6.0 -fPIC -O3 -fvisibility=hidden -DVISIBILITY_HIDDEN -Wall  -arch armv7 -mkernel -UNDEBUG -MD -MT projects/compiler-rt/lib/builtins/CMakeFiles/clang_rt.cc_kext_armv7_ios.dir/udivmoddi4.c.o -MF projects/compiler-rt/lib/builtins/CMakeFiles/clang_rt.cc_kext_armv7_ios.dir/udivmoddi4.c.o.d -o projects/compiler-rt/lib/builtins/CMakeFiles/clang_rt.cc_kext_armv7_ios.dir/udivmoddi4.c.o   -c /Users/buildslave/jenkins/workspace/lldb-cmake/llvm-project/compiler-rt/lib/builtins/udivmoddi4.c
[10375/10424] /Users/buildslave/jenkins/workspace/lldb-cmake/host-compiler/bin/clang -DKERNEL_USE -D_DEBUG -D__STDC_CONSTANT_MACROS -D__STDC_FORMAT_MACROS -D__STDC_LIMIT_MACROS -Iprojects/compiler-rt/lib/builtins -I/Users/buildslave/jenkins/workspace/lldb-cmake/llvm-project/compiler-rt/lib/builtins -I/Applications/Xcode.app/Contents/Developer/Platforms/MacOSX.platform/Developer/SDKs/MacOSX10.15.sdk/usr/include/libxml2 -Iinclude -I/Users/buildslave/jenkins/workspace/lldb-cmake/llvm-project/llvm/include -I/Users/buildslave/jenkins/workspace/lldb-cmake/llvm-project/compiler-rt/lib/builtins/../../include -O3  -arch armv7 -isysroot /Applications/Xcode.app/Contents/Developer/Platforms/MacOSX.platform/Developer/SDKs/MacOSX10.15.sdk    -isysroot /Applications/Xcode.app/Contents/Developer/Platforms/iPhoneOS.platform/Developer/SDKs/iPhoneOS13.5.sdk -miphoneos-version-min=6.0 -fPIC -O3 -fvisibility=hidden -DVISIBILITY_HIDDEN -Wall  -arch armv7 -mkernel -UNDEBUG -MD -MT projects/compiler-rt/lib/builtins/CMakeFiles/clang_rt.cc_kext_armv7_ios.dir/umoddi3.c.o -MF projects/compiler-rt/lib/builtins/CMakeFiles/clang_rt.cc_kext_armv7_ios.dir/umoddi3.c.o.d -o projects/compiler-rt/lib/builtins/CMakeFiles/clang_rt.cc_kext_armv7_ios.dir/umoddi3.c.o   -c /Users/buildslave/jenkins/workspace/lldb-cmake/llvm-project/compiler-rt/lib/builtins/umoddi3.c
[10376/10424] /Users/buildslave/jenkins/workspace/lldb-cmake/host-compiler/bin/clang -DKERNEL_USE -D_DEBUG -D__STDC_CONSTANT_MACROS -D__STDC_FORMAT_MACROS -D__STDC_LIMIT_MACROS -Iprojects/compiler-rt/lib/builtins -I/Users/buildslave/jenkins/workspace/lldb-cmake/llvm-project/compiler-rt/lib/builtins -I/Applications/Xcode.app/Contents/Developer/Platforms/MacOSX.platform/Developer/SDKs/MacOSX10.15.sdk/usr/include/libxml2 -Iinclude -I/Users/buildslave/jenkins/workspace/lldb-cmake/llvm-project/llvm/include -I/Users/buildslave/jenkins/workspace/lldb-cmake/llvm-project/compiler-rt/lib/builtins/../../include -O3  -arch armv7 -isysroot /Applications/Xcode.app/Contents/Developer/Platforms/MacOSX.platform/Developer/SDKs/MacOSX10.15.sdk    -isysroot /Applications/Xcode.app/Contents/Developer/Platforms/iPhoneOS.platform/Developer/SDKs/iPhoneOS13.5.sdk -miphoneos-version-min=6.0 -fPIC -O3 -fvisibility=hidden -DVISIBILITY_HIDDEN -Wall  -arch armv7 -mkernel -UNDEBUG -MD -MT projects/compiler-rt/lib/builtins/CMakeFiles/clang_rt.cc_kext_armv7_ios.dir/atomic_flag_clear.c.o -MF projects/compiler-rt/lib/builtins/CMakeFiles/clang_rt.cc_kext_armv7_ios.dir/atomic_flag_clear.c.o.d -o projects/compiler-rt/lib/builtins/CMakeFiles/clang_rt.cc_kext_armv7_ios.dir/atomic_flag_clear.c.o   -c /Users/buildslave/jenkins/workspace/lldb-cmake/llvm-project/compiler-rt/lib/builtins/atomic_flag_clear.c
[10377/10424] /Users/buildslave/jenkins/workspace/lldb-cmake/host-compiler/bin/clang -DKERNEL_USE -D_DEBUG -D__STDC_CONSTANT_MACROS -D__STDC_FORMAT_MACROS -D__STDC_LIMIT_MACROS -Iprojects/compiler-rt/lib/builtins -I/Users/buildslave/jenkins/workspace/lldb-cmake/llvm-project/compiler-rt/lib/builtins -I/Applications/Xcode.app/Contents/Developer/Platforms/MacOSX.platform/Developer/SDKs/MacOSX10.15.sdk/usr/include/libxml2 -Iinclude -I/Users/buildslave/jenkins/workspace/lldb-cmake/llvm-project/llvm/include -I/Users/buildslave/jenkins/workspace/lldb-cmake/llvm-project/compiler-rt/lib/builtins/../../include -O3  -arch armv7 -isysroot /Applications/Xcode.app/Contents/Developer/Platforms/MacOSX.platform/Developer/SDKs/MacOSX10.15.sdk    -isysroot /Applications/Xcode.app/Contents/Developer/Platforms/iPhoneOS.platform/Developer/SDKs/iPhoneOS13.5.sdk -miphoneos-version-min=6.0 -fPIC -O3 -fvisibility=hidden -DVISIBILITY_HIDDEN -Wall  -arch armv7 -mkernel -UNDEBUG -MD -MT projects/compiler-rt/lib/builtins/CMakeFiles/clang_rt.cc_kext_armv7_ios.dir/eprintf.c.o -MF projects/compiler-rt/lib/builtins/CMakeFiles/clang_rt.cc_kext_armv7_ios.dir/eprintf.c.o.d -o projects/compiler-rt/lib/builtins/CMakeFiles/clang_rt.cc_kext_armv7_ios.dir/eprintf.c.o   -c /Users/buildslave/jenkins/workspace/lldb-cmake/llvm-project/compiler-rt/lib/builtins/eprintf.c
[10378/10424] /Users/buildslave/jenkins/workspace/lldb-cmake/host-compiler/bin/clang -DKERNEL_USE -D_DEBUG -D__STDC_CONSTANT_MACROS -D__STDC_FORMAT_MACROS -D__STDC_LIMIT_MACROS -Iprojects/compiler-rt/lib/builtins -I/Users/buildslave/jenkins/workspace/lldb-cmake/llvm-project/compiler-rt/lib/builtins -I/Applications/Xcode.app/Contents/Developer/Platforms/MacOSX.platform/Developer/SDKs/MacOSX10.15.sdk/usr/include/libxml2 -Iinclude -I/Users/buildslave/jenkins/workspace/lldb-cmake/llvm-project/llvm/include -I/Users/buildslave/jenkins/workspace/lldb-cmake/llvm-project/compiler-rt/lib/builtins/../../include -O3  -arch armv7 -isysroot /Applications/Xcode.app/Contents/Developer/Platforms/MacOSX.platform/Developer/SDKs/MacOSX10.15.sdk    -isysroot /Applications/Xcode.app/Contents/Developer/Platforms/iPhoneOS.platform/Developer/SDKs/iPhoneOS13.5.sdk -miphoneos-version-min=6.0 -fPIC -O3 -fvisibility=hidden -DVISIBILITY_HIDDEN -Wall  -arch armv7 -mkernel -UNDEBUG -MD -MT projects/compiler-rt/lib/builtins/CMakeFiles/clang_rt.cc_kext_armv7_ios.dir/atomic_flag_clear_explicit.c.o -MF projects/compiler-rt/lib/builtins/CMakeFiles/clang_rt.cc_kext_armv7_ios.dir/atomic_flag_clear_explicit.c.o.d -o projects/compiler-rt/lib/builtins/CMakeFiles/clang_rt.cc_kext_armv7_ios.dir/atomic_flag_clear_explicit.c.o   -c /Users/buildslave/jenkins/workspace/lldb-cmake/llvm-project/compiler-rt/lib/builtins/atomic_flag_clear_explicit.c
[10379/10424] /Users/buildslave/jenkins/workspace/lldb-cmake/host-compiler/bin/clang -DKERNEL_USE -D_DEBUG -D__STDC_CONSTANT_MACROS -D__STDC_FORMAT_MACROS -D__STDC_LIMIT_MACROS -Iprojects/compiler-rt/lib/builtins -I/Users/buildslave/jenkins/workspace/lldb-cmake/llvm-project/compiler-rt/lib/builtins -I/Applications/Xcode.app/Contents/Developer/Platforms/MacOSX.platform/Developer/SDKs/MacOSX10.15.sdk/usr/include/libxml2 -Iinclude -I/Users/buildslave/jenkins/workspace/lldb-cmake/llvm-project/llvm/include -I/Users/buildslave/jenkins/workspace/lldb-cmake/llvm-project/compiler-rt/lib/builtins/../../include -O3  -arch armv7 -isysroot /Applications/Xcode.app/Contents/Developer/Platforms/MacOSX.platform/Developer/SDKs/MacOSX10.15.sdk    -isysroot /Applications/Xcode.app/Contents/Developer/Platforms/iPhoneOS.platform/Developer/SDKs/iPhoneOS13.5.sdk -miphoneos-version-min=6.0 -fPIC -O3 -fvisibility=hidden -DVISIBILITY_HIDDEN -Wall  -arch armv7 -mkernel -UNDEBUG -MD -MT projects/compiler-rt/lib/builtins/CMakeFiles/clang_rt.cc_kext_armv7_ios.dir/atomic_flag_test_and_set.c.o -MF projects/compiler-rt/lib/builtins/CMakeFiles/clang_rt.cc_kext_armv7_ios.dir/atomic_flag_test_and_set.c.o.d -o projects/compiler-rt/lib/builtins/CMakeFiles/clang_rt.cc_kext_armv7_ios.dir/atomic_flag_test_and_set.c.o   -c /Users/buildslave/jenkins/workspace/lldb-cmake/llvm-project/compiler-rt/lib/builtins/atomic_flag_test_and_set.c
[10380/10424] /Users/buildslave/jenkins/workspace/lldb-cmake/host-compiler/bin/clang -DKERNEL_USE -D_DEBUG -D__STDC_CONSTANT_MACROS -D__STDC_FORMAT_MACROS -D__STDC_LIMIT_MACROS -Iprojects/compiler-rt/lib/builtins -I/Users/buildslave/jenkins/workspace/lldb-cmake/llvm-project/compiler-rt/lib/builtins -I/Applications/Xcode.app/Contents/Developer/Platforms/MacOSX.platform/Developer/SDKs/MacOSX10.15.sdk/usr/include/libxml2 -Iinclude -I/Users/buildslave/jenkins/workspace/lldb-cmake/llvm-project/llvm/include -I/Users/buildslave/jenkins/workspace/lldb-cmake/llvm-project/compiler-rt/lib/builtins/../../include -O3  -arch armv7 -isysroot /Applications/Xcode.app/Contents/Developer/Platforms/MacOSX.platform/Developer/SDKs/MacOSX10.15.sdk    -isysroot /Applications/Xcode.app/Contents/Developer/Platforms/iPhoneOS.platform/Developer/SDKs/iPhoneOS13.5.sdk -miphoneos-version-min=6.0 -fPIC -O3 -fvisibility=hidden -DVISIBILITY_HIDDEN -Wall  -arch armv7 -mkernel -UNDEBUG -MD -MT projects/compiler-rt/lib/builtins/CMakeFiles/clang_rt.cc_kext_armv7_ios.dir/atomic_flag_test_and_set_explicit.c.o -MF projects/compiler-rt/lib/builtins/CMakeFiles/clang_rt.cc_kext_armv7_ios.dir/atomic_flag_test_and_set_explicit.c.o.d -o projects/compiler-rt/lib/builtins/CMakeFiles/clang_rt.cc_kext_armv7_ios.dir/atomic_flag_test_and_set_explicit.c.o   -c /Users/buildslave/jenkins/workspace/lldb-cmake/llvm-project/compiler-rt/lib/builtins/atomic_flag_test_and_set_explicit.c
[10381/10424] /Users/buildslave/jenkins/workspace/lldb-cmake/host-compiler/bin/clang -DKERNEL_USE -D_DEBUG -D__STDC_CONSTANT_MACROS -D__STDC_FORMAT_MACROS -D__STDC_LIMIT_MACROS -Iprojects/compiler-rt/lib/builtins -I/Users/buildslave/jenkins/workspace/lldb-cmake/llvm-project/compiler-rt/lib/builtins -I/Applications/Xcode.app/Contents/Developer/Platforms/MacOSX.platform/Developer/SDKs/MacOSX10.15.sdk/usr/include/libxml2 -Iinclude -I/Users/buildslave/jenkins/workspace/lldb-cmake/llvm-project/llvm/include -I/Users/buildslave/jenkins/workspace/lldb-cmake/llvm-project/compiler-rt/lib/builtins/../../include -O3  -arch armv7 -isysroot /Applications/Xcode.app/Contents/Developer/Platforms/MacOSX.platform/Developer/SDKs/MacOSX10.15.sdk    -isysroot /Applications/Xcode.app/Contents/Developer/Platforms/iPhoneOS.platform/Developer/SDKs/iPhoneOS13.5.sdk -miphoneos-version-min=6.0 -fPIC -O3 -fvisibility=hidden -DVISIBILITY_HIDDEN -Wall  -arch armv7 -mkernel -UNDEBUG -MD -MT projects/compiler-rt/lib/builtins/CMakeFiles/clang_rt.cc_kext_armv7_ios.dir/atomic_signal_fence.c.o -MF projects/compiler-rt/lib/builtins/CMakeFiles/clang_rt.cc_kext_armv7_ios.dir/atomic_signal_fence.c.o.d -o projects/compiler-rt/lib/builtins/CMakeFiles/clang_rt.cc_kext_armv7_ios.dir/atomic_signal_fence.c.o   -c /Users/buildslave/jenkins/workspace/lldb-cmake/llvm-project/compiler-rt/lib/builtins/atomic_signal_fence.c
[10382/10424] /Users/buildslave/jenkins/workspace/lldb-cmake/host-compiler/bin/clang -DKERNEL_USE -D_DEBUG -D__STDC_CONSTANT_MACROS -D__STDC_FORMAT_MACROS -D__STDC_LIMIT_MACROS -Iprojects/compiler-rt/lib/builtins -I/Users/buildslave/jenkins/workspace/lldb-cmake/llvm-project/compiler-rt/lib/builtins -I/Applications/Xcode.app/Contents/Developer/Platforms/MacOSX.platform/Developer/SDKs/MacOSX10.15.sdk/usr/include/libxml2 -Iinclude -I/Users/buildslave/jenkins/workspace/lldb-cmake/llvm-project/llvm/include -I/Users/buildslave/jenkins/workspace/lldb-cmake/llvm-project/compiler-rt/lib/builtins/../../include -O3  -arch armv7 -isysroot /Applications/Xcode.app/Contents/Developer/Platforms/MacOSX.platform/Developer/SDKs/MacOSX10.15.sdk    -isysroot /Applications/Xcode.app/Contents/Developer/Platforms/iPhoneOS.platform/Developer/SDKs/iPhoneOS13.5.sdk -miphoneos-version-min=6.0 -fPIC -O3 -fvisibility=hidden -DVISIBILITY_HIDDEN -Wall  -arch armv7 -mkernel -UNDEBUG -MD -MT projects/compiler-rt/lib/builtins/CMakeFiles/clang_rt.cc_kext_armv7_ios.dir/atomic_thread_fence.c.o -MF projects/compiler-rt/lib/builtins/CMakeFiles/clang_rt.cc_kext_armv7_ios.dir/atomic_thread_fence.c.o.d -o projects/compiler-rt/lib/builtins/CMakeFiles/clang_rt.cc_kext_armv7_ios.dir/atomic_thread_fence.c.o   -c /Users/buildslave/jenkins/workspace/lldb-cmake/llvm-project/compiler-rt/lib/builtins/atomic_thread_fence.c
[10383/10424] /Users/buildslave/jenkins/workspace/lldb-cmake/host-compiler/bin/clang -DKERNEL_USE -D_DEBUG -D__STDC_CONSTANT_MACROS -D__STDC_FORMAT_MACROS -D__STDC_LIMIT_MACROS -Iprojects/compiler-rt/lib/builtins -I/Users/buildslave/jenkins/workspace/lldb-cmake/llvm-project/compiler-rt/lib/builtins -I/Applications/Xcode.app/Contents/Developer/Platforms/MacOSX.platform/Developer/SDKs/MacOSX10.15.sdk/usr/include/libxml2 -Iinclude -I/Users/buildslave/jenkins/workspace/lldb-cmake/llvm-project/llvm/include -I/Users/buildslave/jenkins/workspace/lldb-cmake/llvm-project/compiler-rt/lib/builtins/../../include -O3  -arch armv7 -isysroot /Applications/Xcode.app/Contents/Developer/Platforms/MacOSX.platform/Developer/SDKs/MacOSX10.15.sdk    -isysroot /Applications/Xcode.app/Contents/Developer/Platforms/iPhoneOS.platform/Developer/SDKs/iPhoneOS13.5.sdk -miphoneos-version-min=6.0 -fPIC -O3 -fvisibility=hidden -DVISIBILITY_HIDDEN -Wall  -arch armv7 -mkernel -UNDEBUG -MD -MT projects/compiler-rt/lib/builtins/CMakeFiles/clang_rt.cc_kext_armv7_ios.dir/os_version_check.c.o -MF projects/compiler-rt/lib/builtins/CMakeFiles/clang_rt.cc_kext_armv7_ios.dir/os_version_check.c.o.d -o projects/compiler-rt/lib/builtins/CMakeFiles/clang_rt.cc_kext_armv7_ios.dir/os_version_check.c.o   -c /Users/buildslave/jenkins/workspace/lldb-cmake/llvm-project/compiler-rt/lib/builtins/os_version_check.c
[10384/10424] /Users/buildslave/jenkins/workspace/lldb-cmake/host-compiler/bin/clang -DKERNEL_USE -D_DEBUG -D__STDC_CONSTANT_MACROS -D__STDC_FORMAT_MACROS -D__STDC_LIMIT_MACROS -Iprojects/compiler-rt/lib/builtins -I/Users/buildslave/jenkins/workspace/lldb-cmake/llvm-project/compiler-rt/lib/builtins -I/Applications/Xcode.app/Contents/Developer/Platforms/MacOSX.platform/Developer/SDKs/MacOSX10.15.sdk/usr/include/libxml2 -Iinclude -I/Users/buildslave/jenkins/workspace/lldb-cmake/llvm-project/llvm/include -I/Users/buildslave/jenkins/workspace/lldb-cmake/llvm-project/compiler-rt/lib/builtins/../../include -O3  -arch armv7 -isysroot /Applications/Xcode.app/Contents/Developer/Platforms/MacOSX.platform/Developer/SDKs/MacOSX10.15.sdk    -isysroot /Applications/Xcode.app/Contents/Developer/Platforms/iPhoneOS.platform/Developer/SDKs/iPhoneOS13.5.sdk -miphoneos-version-min=6.0 -fPIC -O3 -fvisibility=hidden -DVISIBILITY_HIDDEN -Wall  -arch armv7 -mkernel -UNDEBUG -MD -MT projects/compiler-rt/lib/builtins/CMakeFiles/clang_rt.cc_kext_armv7_ios.dir/clear_cache.c.o -MF projects/compiler-rt/lib/builtins/CMakeFiles/clang_rt.cc_kext_armv7_ios.dir/clear_cache.c.o.d -o projects/compiler-rt/lib/builtins/CMakeFiles/clang_rt.cc_kext_armv7_ios.dir/clear_cache.c.o   -c /Users/buildslave/jenkins/workspace/lldb-cmake/llvm-project/compiler-rt/lib/builtins/clear_cache.c
[10385/10424] /Users/buildslave/jenkins/workspace/lldb-cmake/host-compiler/bin/clang -DKERNEL_USE -D_DEBUG -D__STDC_CONSTANT_MACROS -D__STDC_FORMAT_MACROS -D__STDC_LIMIT_MACROS -Iprojects/compiler-rt/lib/builtins -I/Users/buildslave/jenkins/workspace/lldb-cmake/llvm-project/compiler-rt/lib/builtins -I/Applications/Xcode.app/Contents/Developer/Platforms/MacOSX.platform/Developer/SDKs/MacOSX10.15.sdk/usr/include/libxml2 -Iinclude -I/Users/buildslave/jenkins/workspace/lldb-cmake/llvm-project/llvm/include -I/Users/buildslave/jenkins/workspace/lldb-cmake/llvm-project/compiler-rt/lib/builtins/../../include -O3  -arch armv7 -isysroot /Applications/Xcode.app/Contents/Developer/Platforms/MacOSX.platform/Developer/SDKs/MacOSX10.15.sdk    -isysroot /Applications/Xcode.app/Contents/Developer/Platforms/iPhoneOS.platform/Developer/SDKs/iPhoneOS13.5.sdk -miphoneos-version-min=6.0 -fPIC -O3 -fvisibility=hidden -DVISIBILITY_HIDDEN -Wall  -arch armv7 -mkernel -UNDEBUG -MD -MT projects/compiler-rt/lib/builtins/CMakeFiles/clang_rt.cc_kext_armv7_ios.dir/emutls.c.o -MF projects/compiler-rt/lib/builtins/CMakeFiles/clang_rt.cc_kext_armv7_ios.dir/emutls.c.o.d -o projects/compiler-rt/lib/builtins/CMakeFiles/clang_rt.cc_kext_armv7_ios.dir/emutls.c.o   -c /Users/buildslave/jenkins/workspace/lldb-cmake/llvm-project/compiler-rt/lib/builtins/emutls.c
[10386/10424] /Users/buildslave/jenkins/workspace/lldb-cmake/host-compiler/bin/clang -DKERNEL_USE -D_DEBUG -D__STDC_CONSTANT_MACROS -D__STDC_FORMAT_MACROS -D__STDC_LIMIT_MACROS -Iprojects/compiler-rt/lib/builtins -I/Users/buildslave/jenkins/workspace/lldb-cmake/llvm-project/compiler-rt/lib/builtins -I/Applications/Xcode.app/Contents/Developer/Platforms/MacOSX.platform/Developer/SDKs/MacOSX10.15.sdk/usr/include/libxml2 -Iinclude -I/Users/buildslave/jenkins/workspace/lldb-cmake/llvm-project/llvm/include -I/Users/buildslave/jenkins/workspace/lldb-cmake/llvm-project/compiler-rt/lib/builtins/../../include -O3 -DNDEBUG -isysroot /Applications/Xcode.app/Contents/Developer/Platforms/MacOSX.platform/Developer/SDKs/MacOSX10.15.sdk    -isysroot /Applications/Xcode.app/Contents/Developer/Platforms/iPhoneOS.platform/Developer/SDKs/iPhoneOS13.5.sdk -miphoneos-version-min=6.0 -fPIC -O3 -fvisibility=hidden -DVISIBILITY_HIDDEN -Wall  -arch armv7 -mkernel -MD -MT projects/compiler-rt/lib/builtins/CMakeFiles/clang_rt.cc_kext_armv7_ios.dir/arm/switch16.S.o -MF projects/compiler-rt/lib/builtins/CMakeFiles/clang_rt.cc_kext_armv7_ios.dir/arm/switch16.S.o.d -o projects/compiler-rt/lib/builtins/CMakeFiles/clang_rt.cc_kext_armv7_ios.dir/arm/switch16.S.o -c /Users/buildslave/jenkins/workspace/lldb-cmake/llvm-project/compiler-rt/lib/builtins/arm/switch16.S
[10387/10424] /Users/buildslave/jenkins/workspace/lldb-cmake/host-compiler/bin/clang -DKERNEL_USE -D_DEBUG -D__STDC_CONSTANT_MACROS -D__STDC_FORMAT_MACROS -D__STDC_LIMIT_MACROS -Iprojects/compiler-rt/lib/builtins -I/Users/buildslave/jenkins/workspace/lldb-cmake/llvm-project/compiler-rt/lib/builtins -I/Applications/Xcode.app/Contents/Developer/Platforms/MacOSX.platform/Developer/SDKs/MacOSX10.15.sdk/usr/include/libxml2 -Iinclude -I/Users/buildslave/jenkins/workspace/lldb-cmake/llvm-project/llvm/include -I/Users/buildslave/jenkins/workspace/lldb-cmake/llvm-project/compiler-rt/lib/builtins/../../include -O3 -DNDEBUG -isysroot /Applications/Xcode.app/Contents/Developer/Platforms/MacOSX.platform/Developer/SDKs/MacOSX10.15.sdk    -isysroot /Applications/Xcode.app/Contents/Developer/Platforms/iPhoneOS.platform/Developer/SDKs/iPhoneOS13.5.sdk -miphoneos-version-min=6.0 -fPIC -O3 -fvisibility=hidden -DVISIBILITY_HIDDEN -Wall  -arch armv7 -mkernel -MD -MT projects/compiler-rt/lib/builtins/CMakeFiles/clang_rt.cc_kext_armv7_ios.dir/arm/switch32.S.o -MF projects/compiler-rt/lib/builtins/CMakeFiles/clang_rt.cc_kext_armv7_ios.dir/arm/switch32.S.o.d -o projects/compiler-rt/lib/builtins/CMakeFiles/clang_rt.cc_kext_armv7_ios.dir/arm/switch32.S.o -c /Users/buildslave/jenkins/workspace/lldb-cmake/llvm-project/compiler-rt/lib/builtins/arm/switch32.S
[10388/10424] /Users/buildslave/jenkins/workspace/lldb-cmake/host-compiler/bin/clang -DKERNEL_USE -D_DEBUG -D__STDC_CONSTANT_MACROS -D__STDC_FORMAT_MACROS -D__STDC_LIMIT_MACROS -Iprojects/compiler-rt/lib/builtins -I/Users/buildslave/jenkins/workspace/lldb-cmake/llvm-project/compiler-rt/lib/builtins -I/Applications/Xcode.app/Contents/Developer/Platforms/MacOSX.platform/Developer/SDKs/MacOSX10.15.sdk/usr/include/libxml2 -Iinclude -I/Users/buildslave/jenkins/workspace/lldb-cmake/llvm-project/llvm/include -I/Users/buildslave/jenkins/workspace/lldb-cmake/llvm-project/compiler-rt/lib/builtins/../../include -O3 -DNDEBUG -isysroot /Applications/Xcode.app/Contents/Developer/Platforms/MacOSX.platform/Developer/SDKs/MacOSX10.15.sdk    -isysroot /Applications/Xcode.app/Contents/Developer/Platforms/iPhoneOS.platform/Developer/SDKs/iPhoneOS13.5.sdk -miphoneos-version-min=6.0 -fPIC -O3 -fvisibility=hidden -DVISIBILITY_HIDDEN -Wall  -arch armv7 -mkernel -MD -MT projects/compiler-rt/lib/builtins/CMakeFiles/clang_rt.cc_kext_armv7_ios.dir/arm/switch8.S.o -MF projects/compiler-rt/lib/builtins/CMakeFiles/clang_rt.cc_kext_armv7_ios.dir/arm/switch8.S.o.d -o projects/compiler-rt/lib/builtins/CMakeFiles/clang_rt.cc_kext_armv7_ios.dir/arm/switch8.S.o -c /Users/buildslave/jenkins/workspace/lldb-cmake/llvm-project/compiler-rt/lib/builtins/arm/switch8.S
[10389/10424] /Users/buildslave/jenkins/workspace/lldb-cmake/host-compiler/bin/clang -DKERNEL_USE -D_DEBUG -D__STDC_CONSTANT_MACROS -D__STDC_FORMAT_MACROS -D__STDC_LIMIT_MACROS -Iprojects/compiler-rt/lib/builtins -I/Users/buildslave/jenkins/workspace/lldb-cmake/llvm-project/compiler-rt/lib/builtins -I/Applications/Xcode.app/Contents/Developer/Platforms/MacOSX.platform/Developer/SDKs/MacOSX10.15.sdk/usr/include/libxml2 -Iinclude -I/Users/buildslave/jenkins/workspace/lldb-cmake/llvm-project/llvm/include -I/Users/buildslave/jenkins/workspace/lldb-cmake/llvm-project/compiler-rt/lib/builtins/../../include -O3 -DNDEBUG -isysroot /Applications/Xcode.app/Contents/Developer/Platforms/MacOSX.platform/Developer/SDKs/MacOSX10.15.sdk    -isysroot /Applications/Xcode.app/Contents/Developer/Platforms/iPhoneOS.platform/Developer/SDKs/iPhoneOS13.5.sdk -miphoneos-version-min=6.0 -fPIC -O3 -fvisibility=hidden -DVISIBILITY_HIDDEN -Wall  -arch armv7 -mkernel -MD -MT projects/compiler-rt/lib/builtins/CMakeFiles/clang_rt.cc_kext_armv7_ios.dir/arm/switchu8.S.o -MF projects/compiler-rt/lib/builtins/CMakeFiles/clang_rt.cc_kext_armv7_ios.dir/arm/switchu8.S.o.d -o projects/compiler-rt/lib/builtins/CMakeFiles/clang_rt.cc_kext_armv7_ios.dir/arm/switchu8.S.o -c /Users/buildslave/jenkins/workspace/lldb-cmake/llvm-project/compiler-rt/lib/builtins/arm/switchu8.S
[10390/10424] /Users/buildslave/jenkins/workspace/lldb-cmake/host-compiler/bin/clang -DKERNEL_USE -D_DEBUG -D__STDC_CONSTANT_MACROS -D__STDC_FORMAT_MACROS -D__STDC_LIMIT_MACROS -Iprojects/compiler-rt/lib/builtins -I/Users/buildslave/jenkins/workspace/lldb-cmake/llvm-project/compiler-rt/lib/builtins -I/Applications/Xcode.app/Contents/Developer/Platforms/MacOSX.platform/Developer/SDKs/MacOSX10.15.sdk/usr/include/libxml2 -Iinclude -I/Users/buildslave/jenkins/workspace/lldb-cmake/llvm-project/llvm/include -I/Users/buildslave/jenkins/workspace/lldb-cmake/llvm-project/compiler-rt/lib/builtins/../../include -O3  -arch armv7 -isysroot /Applications/Xcode.app/Contents/Developer/Platforms/MacOSX.platform/Developer/SDKs/MacOSX10.15.sdk    -isysroot /Applications/Xcode.app/Contents/Developer/Platforms/iPhoneOS.platform/Developer/SDKs/iPhoneOS13.5.sdk -miphoneos-version-min=6.0 -fPIC -O3 -fvisibility=hidden -DVISIBILITY_HIDDEN -Wall  -arch armv7 -mkernel -UNDEBUG -MD -MT projects/compiler-rt/lib/builtins/CMakeFiles/clang_rt.cc_kext_armv7_ios.dir/gcc_personality_v0.c.o -MF projects/compiler-rt/lib/builtins/CMakeFiles/clang_rt.cc_kext_armv7_ios.dir/gcc_personality_v0.c.o.d -o projects/compiler-rt/lib/builtins/CMakeFiles/clang_rt.cc_kext_armv7_ios.dir/gcc_personality_v0.c.o   -c /Users/buildslave/jenkins/workspace/lldb-cmake/llvm-project/compiler-rt/lib/builtins/gcc_personality_v0.c
[10391/10424] /Users/buildslave/jenkins/workspace/lldb-cmake/host-compiler/bin/clang -DKERNEL_USE -D_DEBUG -D__STDC_CONSTANT_MACROS -D__STDC_FORMAT_MACROS -D__STDC_LIMIT_MACROS -Iprojects/compiler-rt/lib/builtins -I/Users/buildslave/jenkins/workspace/lldb-cmake/llvm-project/compiler-rt/lib/builtins -I/Applications/Xcode.app/Contents/Developer/Platforms/MacOSX.platform/Developer/SDKs/MacOSX10.15.sdk/usr/include/libxml2 -Iinclude -I/Users/buildslave/jenkins/workspace/lldb-cmake/llvm-project/llvm/include -I/Users/buildslave/jenkins/workspace/lldb-cmake/llvm-project/compiler-rt/lib/builtins/../../include -O3 -DNDEBUG -isysroot /Applications/Xcode.app/Contents/Developer/Platforms/MacOSX.platform/Developer/SDKs/MacOSX10.15.sdk    -isysroot /Applications/Xcode.app/Contents/Developer/Platforms/iPhoneOS.platform/Developer/SDKs/iPhoneOS13.5.sdk -miphoneos-version-min=6.0 -fPIC -O3 -fvisibility=hidden -DVISIBILITY_HIDDEN -Wall  -arch armv7 -mkernel -MD -MT projects/compiler-rt/lib/builtins/CMakeFiles/clang_rt.cc_kext_armv7_ios.dir/arm/save_vfp_d8_d15_regs.S.o -MF projects/compiler-rt/lib/builtins/CMakeFiles/clang_rt.cc_kext_armv7_ios.dir/arm/save_vfp_d8_d15_regs.S.o.d -o projects/compiler-rt/lib/builtins/CMakeFiles/clang_rt.cc_kext_armv7_ios.dir/arm/save_vfp_d8_d15_regs.S.o -c /Users/buildslave/jenkins/workspace/lldb-cmake/llvm-project/compiler-rt/lib/builtins/arm/save_vfp_d8_d15_regs.S
[10392/10424] /Users/buildslave/jenkins/workspace/lldb-cmake/host-compiler/bin/clang -DKERNEL_USE -D_DEBUG -D__STDC_CONSTANT_MACROS -D__STDC_FORMAT_MACROS -D__STDC_LIMIT_MACROS -Iprojects/compiler-rt/lib/builtins -I/Users/buildslave/jenkins/workspace/lldb-cmake/llvm-project/compiler-rt/lib/builtins -I/Applications/Xcode.app/Contents/Developer/Platforms/MacOSX.platform/Developer/SDKs/MacOSX10.15.sdk/usr/include/libxml2 -Iinclude -I/Users/buildslave/jenkins/workspace/lldb-cmake/llvm-project/llvm/include -I/Users/buildslave/jenkins/workspace/lldb-cmake/llvm-project/compiler-rt/lib/builtins/../../include -O3 -DNDEBUG -isysroot /Applications/Xcode.app/Contents/Developer/Platforms/MacOSX.platform/Developer/SDKs/MacOSX10.15.sdk    -isysroot /Applications/Xcode.app/Contents/Developer/Platforms/iPhoneOS.platform/Developer/SDKs/iPhoneOS13.5.sdk -miphoneos-version-min=6.0 -fPIC -O3 -fvisibility=hidden -DVISIBILITY_HIDDEN -Wall  -arch armv7 -mkernel -MD -MT projects/compiler-rt/lib/builtins/CMakeFiles/clang_rt.cc_kext_armv7_ios.dir/arm/restore_vfp_d8_d15_regs.S.o -MF projects/compiler-rt/lib/builtins/CMakeFiles/clang_rt.cc_kext_armv7_ios.dir/arm/restore_vfp_d8_d15_regs.S.o.d -o projects/compiler-rt/lib/builtins/CMakeFiles/clang_rt.cc_kext_armv7_ios.dir/arm/restore_vfp_d8_d15_regs.S.o -c /Users/buildslave/jenkins/workspace/lldb-cmake/llvm-project/compiler-rt/lib/builtins/arm/restore_vfp_d8_d15_regs.S
[10393/10424] /Users/buildslave/jenkins/workspace/lldb-cmake/host-compiler/bin/clang -DKERNEL_USE -D_DEBUG -D__STDC_CONSTANT_MACROS -D__STDC_FORMAT_MACROS -D__STDC_LIMIT_MACROS -Iprojects/compiler-rt/lib/builtins -I/Users/buildslave/jenkins/workspace/lldb-cmake/llvm-project/compiler-rt/lib/builtins -I/Applications/Xcode.app/Contents/Developer/Platforms/MacOSX.platform/Developer/SDKs/MacOSX10.15.sdk/usr/include/libxml2 -Iinclude -I/Users/buildslave/jenkins/workspace/lldb-cmake/llvm-project/llvm/include -I/Users/buildslave/jenkins/workspace/lldb-cmake/llvm-project/compiler-rt/lib/builtins/../../include -O3 -DNDEBUG -isysroot /Applications/Xcode.app/Contents/Developer/Platforms/MacOSX.platform/Developer/SDKs/MacOSX10.15.sdk    -isysroot /Applications/Xcode.app/Contents/Developer/Platforms/iPhoneOS.platform/Developer/SDKs/iPhoneOS13.5.sdk -miphoneos-version-min=6.0 -fPIC -O3 -fvisibility=hidden -DVISIBILITY_HIDDEN -Wall  -arch armv7 -mkernel -MD -MT projects/compiler-rt/lib/builtins/CMakeFiles/clang_rt.cc_kext_armv7_ios.dir/arm/adddf3vfp.S.o -MF projects/compiler-rt/lib/builtins/CMakeFiles/clang_rt.cc_kext_armv7_ios.dir/arm/adddf3vfp.S.o.d -o projects/compiler-rt/lib/builtins/CMakeFiles/clang_rt.cc_kext_armv7_ios.dir/arm/adddf3vfp.S.o -c /Users/buildslave/jenkins/workspace/lldb-cmake/llvm-project/compiler-rt/lib/builtins/arm/adddf3vfp.S
[10394/10424] /Users/buildslave/jenkins/workspace/lldb-cmake/host-compiler/bin/clang -DKERNEL_USE -D_DEBUG -D__STDC_CONSTANT_MACROS -D__STDC_FORMAT_MACROS -D__STDC_LIMIT_MACROS -Iprojects/compiler-rt/lib/builtins -I/Users/buildslave/jenkins/workspace/lldb-cmake/llvm-project/compiler-rt/lib/builtins -I/Applications/Xcode.app/Contents/Developer/Platforms/MacOSX.platform/Developer/SDKs/MacOSX10.15.sdk/usr/include/libxml2 -Iinclude -I/Users/buildslave/jenkins/workspace/lldb-cmake/llvm-project/llvm/include -I/Users/buildslave/jenkins/workspace/lldb-cmake/llvm-project/compiler-rt/lib/builtins/../../include -O3 -DNDEBUG -isysroot /Applications/Xcode.app/Contents/Developer/Platforms/MacOSX.platform/Developer/SDKs/MacOSX10.15.sdk    -isysroot /Applications/Xcode.app/Contents/Developer/Platforms/iPhoneOS.platform/Developer/SDKs/iPhoneOS13.5.sdk -miphoneos-version-min=6.0 -fPIC -O3 -fvisibility=hidden -DVISIBILITY_HIDDEN -Wall  -arch armv7 -mkernel -MD -MT projects/compiler-rt/lib/builtins/CMakeFiles/clang_rt.cc_kext_armv7_ios.dir/arm/addsf3vfp.S.o -MF projects/compiler-rt/lib/builtins/CMakeFiles/clang_rt.cc_kext_armv7_ios.dir/arm/addsf3vfp.S.o.d -o projects/compiler-rt/lib/builtins/CMakeFiles/clang_rt.cc_kext_armv7_ios.dir/arm/addsf3vfp.S.o -c /Users/buildslave/jenkins/workspace/lldb-cmake/llvm-project/compiler-rt/lib/builtins/arm/addsf3vfp.S
[10395/10424] /Users/buildslave/jenkins/workspace/lldb-cmake/host-compiler/bin/clang -DKERNEL_USE -D_DEBUG -D__STDC_CONSTANT_MACROS -D__STDC_FORMAT_MACROS -D__STDC_LIMIT_MACROS -Iprojects/compiler-rt/lib/builtins -I/Users/buildslave/jenkins/workspace/lldb-cmake/llvm-project/compiler-rt/lib/builtins -I/Applications/Xcode.app/Contents/Developer/Platforms/MacOSX.platform/Developer/SDKs/MacOSX10.15.sdk/usr/include/libxml2 -Iinclude -I/Users/buildslave/jenkins/workspace/lldb-cmake/llvm-project/llvm/include -I/Users/buildslave/jenkins/workspace/lldb-cmake/llvm-project/compiler-rt/lib/builtins/../../include -O3 -DNDEBUG -isysroot /Applications/Xcode.app/Contents/Developer/Platforms/MacOSX.platform/Developer/SDKs/MacOSX10.15.sdk    -isysroot /Applications/Xcode.app/Contents/Developer/Platforms/iPhoneOS.platform/Developer/SDKs/iPhoneOS13.5.sdk -miphoneos-version-min=6.0 -fPIC -O3 -fvisibility=hidden -DVISIBILITY_HIDDEN -Wall  -arch armv7 -mkernel -MD -MT projects/compiler-rt/lib/builtins/CMakeFiles/clang_rt.cc_kext_armv7_ios.dir/arm/divdf3vfp.S.o -MF projects/compiler-rt/lib/builtins/CMakeFiles/clang_rt.cc_kext_armv7_ios.dir/arm/divdf3vfp.S.o.d -o projects/compiler-rt/lib/builtins/CMakeFiles/clang_rt.cc_kext_armv7_ios.dir/arm/divdf3vfp.S.o -c /Users/buildslave/jenkins/workspace/lldb-cmake/llvm-project/compiler-rt/lib/builtins/arm/divdf3vfp.S
[10396/10424] /Users/buildslave/jenkins/workspace/lldb-cmake/host-compiler/bin/clang -DKERNEL_USE -D_DEBUG -D__STDC_CONSTANT_MACROS -D__STDC_FORMAT_MACROS -D__STDC_LIMIT_MACROS -Iprojects/compiler-rt/lib/builtins -I/Users/buildslave/jenkins/workspace/lldb-cmake/llvm-project/compiler-rt/lib/builtins -I/Applications/Xcode.app/Contents/Developer/Platforms/MacOSX.platform/Developer/SDKs/MacOSX10.15.sdk/usr/include/libxml2 -Iinclude -I/Users/buildslave/jenkins/workspace/lldb-cmake/llvm-project/llvm/include -I/Users/buildslave/jenkins/workspace/lldb-cmake/llvm-project/compiler-rt/lib/builtins/../../include -O3 -DNDEBUG -isysroot /Applications/Xcode.app/Contents/Developer/Platforms/MacOSX.platform/Developer/SDKs/MacOSX10.15.sdk    -isysroot /Applications/Xcode.app/Contents/Developer/Platforms/iPhoneOS.platform/Developer/SDKs/iPhoneOS13.5.sdk -miphoneos-version-min=6.0 -fPIC -O3 -fvisibility=hidden -DVISIBILITY_HIDDEN -Wall  -arch armv7 -mkernel -MD -MT projects/compiler-rt/lib/builtins/CMakeFiles/clang_rt.cc_kext_armv7_ios.dir/arm/divsf3vfp.S.o -MF projects/compiler-rt/lib/builtins/CMakeFiles/clang_rt.cc_kext_armv7_ios.dir/arm/divsf3vfp.S.o.d -o projects/compiler-rt/lib/builtins/CMakeFiles/clang_rt.cc_kext_armv7_ios.dir/arm/divsf3vfp.S.o -c /Users/buildslave/jenkins/workspace/lldb-cmake/llvm-project/compiler-rt/lib/builtins/arm/divsf3vfp.S
[10397/10424] /Users/buildslave/jenkins/workspace/lldb-cmake/host-compiler/bin/clang -DKERNEL_USE -D_DEBUG -D__STDC_CONSTANT_MACROS -D__STDC_FORMAT_MACROS -D__STDC_LIMIT_MACROS -Iprojects/compiler-rt/lib/builtins -I/Users/buildslave/jenkins/workspace/lldb-cmake/llvm-project/compiler-rt/lib/builtins -I/Applications/Xcode.app/Contents/Developer/Platforms/MacOSX.platform/Developer/SDKs/MacOSX10.15.sdk/usr/include/libxml2 -Iinclude -I/Users/buildslave/jenkins/workspace/lldb-cmake/llvm-project/llvm/include -I/Users/buildslave/jenkins/workspace/lldb-cmake/llvm-project/compiler-rt/lib/builtins/../../include -O3 -DNDEBUG -isysroot /Applications/Xcode.app/Contents/Developer/Platforms/MacOSX.platform/Developer/SDKs/MacOSX10.15.sdk    -isysroot /Applications/Xcode.app/Contents/Developer/Platforms/iPhoneOS.platform/Developer/SDKs/iPhoneOS13.5.sdk -miphoneos-version-min=6.0 -fPIC -O3 -fvisibility=hidden -DVISIBILITY_HIDDEN -Wall  -arch armv7 -mkernel -MD -MT projects/compiler-rt/lib/builtins/CMakeFiles/clang_rt.cc_kext_armv7_ios.dir/arm/eqdf2vfp.S.o -MF projects/compiler-rt/lib/builtins/CMakeFiles/clang_rt.cc_kext_armv7_ios.dir/arm/eqdf2vfp.S.o.d -o projects/compiler-rt/lib/builtins/CMakeFiles/clang_rt.cc_kext_armv7_ios.dir/arm/eqdf2vfp.S.o -c /Users/buildslave/jenkins/workspace/lldb-cmake/llvm-project/compiler-rt/lib/builtins/arm/eqdf2vfp.S
[10398/10424] /Users/buildslave/jenkins/workspace/lldb-cmake/host-compiler/bin/clang -DKERNEL_USE -D_DEBUG -D__STDC_CONSTANT_MACROS -D__STDC_FORMAT_MACROS -D__STDC_LIMIT_MACROS -Iprojects/compiler-rt/lib/builtins -I/Users/buildslave/jenkins/workspace/lldb-cmake/llvm-project/compiler-rt/lib/builtins -I/Applications/Xcode.app/Contents/Developer/Platforms/MacOSX.platform/Developer/SDKs/MacOSX10.15.sdk/usr/include/libxml2 -Iinclude -I/Users/buildslave/jenkins/workspace/lldb-cmake/llvm-project/llvm/include -I/Users/buildslave/jenkins/workspace/lldb-cmake/llvm-project/compiler-rt/lib/builtins/../../include -O3 -DNDEBUG -isysroot /Applications/Xcode.app/Contents/Developer/Platforms/MacOSX.platform/Developer/SDKs/MacOSX10.15.sdk    -isysroot /Applications/Xcode.app/Contents/Developer/Platforms/iPhoneOS.platform/Developer/SDKs/iPhoneOS13.5.sdk -miphoneos-version-min=6.0 -fPIC -O3 -fvisibility=hidden -DVISIBILITY_HIDDEN -Wall  -arch armv7 -mkernel -MD -MT projects/compiler-rt/lib/builtins/CMakeFiles/clang_rt.cc_kext_armv7_ios.dir/arm/eqsf2vfp.S.o -MF projects/compiler-rt/lib/builtins/CMakeFiles/clang_rt.cc_kext_armv7_ios.dir/arm/eqsf2vfp.S.o.d -o projects/compiler-rt/lib/builtins/CMakeFiles/clang_rt.cc_kext_armv7_ios.dir/arm/eqsf2vfp.S.o -c /Users/buildslave/jenkins/workspace/lldb-cmake/llvm-project/compiler-rt/lib/builtins/arm/eqsf2vfp.S
[10399/10424] /Users/buildslave/jenkins/workspace/lldb-cmake/host-compiler/bin/clang -DKERNEL_USE -D_DEBUG -D__STDC_CONSTANT_MACROS -D__STDC_FORMAT_MACROS -D__STDC_LIMIT_MACROS -Iprojects/compiler-rt/lib/builtins -I/Users/buildslave/jenkins/workspace/lldb-cmake/llvm-project/compiler-rt/lib/builtins -I/Applications/Xcode.app/Contents/Developer/Platforms/MacOSX.platform/Developer/SDKs/MacOSX10.15.sdk/usr/include/libxml2 -Iinclude -I/Users/buildslave/jenkins/workspace/lldb-cmake/llvm-project/llvm/include -I/Users/buildslave/jenkins/workspace/lldb-cmake/llvm-project/compiler-rt/lib/builtins/../../include -O3 -DNDEBUG -isysroot /Applications/Xcode.app/Contents/Developer/Platforms/MacOSX.platform/Developer/SDKs/MacOSX10.15.sdk    -isysroot /Applications/Xcode.app/Contents/Developer/Platforms/iPhoneOS.platform/Developer/SDKs/iPhoneOS13.5.sdk -miphoneos-version-min=6.0 -fPIC -O3 -fvisibility=hidden -DVISIBILITY_HIDDEN -Wall  -arch armv7 -mkernel -MD -MT projects/compiler-rt/lib/builtins/CMakeFiles/clang_rt.cc_kext_armv7_ios.dir/arm/extendsfdf2vfp.S.o -MF projects/compiler-rt/lib/builtins/CMakeFiles/clang_rt.cc_kext_armv7_ios.dir/arm/extendsfdf2vfp.S.o.d -o projects/compiler-rt/lib/builtins/CMakeFiles/clang_rt.cc_kext_armv7_ios.dir/arm/extendsfdf2vfp.S.o -c /Users/buildslave/jenkins/workspace/lldb-cmake/llvm-project/compiler-rt/lib/builtins/arm/extendsfdf2vfp.S
[10400/10424] /Users/buildslave/jenkins/workspace/lldb-cmake/host-compiler/bin/clang -DKERNEL_USE -D_DEBUG -D__STDC_CONSTANT_MACROS -D__STDC_FORMAT_MACROS -D__STDC_LIMIT_MACROS -Iprojects/compiler-rt/lib/builtins -I/Users/buildslave/jenkins/workspace/lldb-cmake/llvm-project/compiler-rt/lib/builtins -I/Applications/Xcode.app/Contents/Developer/Platforms/MacOSX.platform/Developer/SDKs/MacOSX10.15.sdk/usr/include/libxml2 -Iinclude -I/Users/buildslave/jenkins/workspace/lldb-cmake/llvm-project/llvm/include -I/Users/buildslave/jenkins/workspace/lldb-cmake/llvm-project/compiler-rt/lib/builtins/../../include -O3 -DNDEBUG -isysroot /Applications/Xcode.app/Contents/Developer/Platforms/MacOSX.platform/Developer/SDKs/MacOSX10.15.sdk    -isysroot /Applications/Xcode.app/Contents/Developer/Platforms/iPhoneOS.platform/Developer/SDKs/iPhoneOS13.5.sdk -miphoneos-version-min=6.0 -fPIC -O3 -fvisibility=hidden -DVISIBILITY_HIDDEN -Wall  -arch armv7 -mkernel -MD -MT projects/compiler-rt/lib/builtins/CMakeFiles/clang_rt.cc_kext_armv7_ios.dir/arm/fixdfsivfp.S.o -MF projects/compiler-rt/lib/builtins/CMakeFiles/clang_rt.cc_kext_armv7_ios.dir/arm/fixdfsivfp.S.o.d -o projects/compiler-rt/lib/builtins/CMakeFiles/clang_rt.cc_kext_armv7_ios.dir/arm/fixdfsivfp.S.o -c /Users/buildslave/jenkins/workspace/lldb-cmake/llvm-project/compiler-rt/lib/builtins/arm/fixdfsivfp.S
[10401/10424] /Users/buildslave/jenkins/workspace/lldb-cmake/host-compiler/bin/clang -DKERNEL_USE -D_DEBUG -D__STDC_CONSTANT_MACROS -D__STDC_FORMAT_MACROS -D__STDC_LIMIT_MACROS -Iprojects/compiler-rt/lib/builtins -I/Users/buildslave/jenkins/workspace/lldb-cmake/llvm-project/compiler-rt/lib/builtins -I/Applications/Xcode.app/Contents/Developer/Platforms/MacOSX.platform/Developer/SDKs/MacOSX10.15.sdk/usr/include/libxml2 -Iinclude -I/Users/buildslave/jenkins/workspace/lldb-cmake/llvm-project/llvm/include -I/Users/buildslave/jenkins/workspace/lldb-cmake/llvm-project/compiler-rt/lib/builtins/../../include -O3 -DNDEBUG -isysroot /Applications/Xcode.app/Contents/Developer/Platforms/MacOSX.platform/Developer/SDKs/MacOSX10.15.sdk    -isysroot /Applications/Xcode.app/Contents/Developer/Platforms/iPhoneOS.platform/Developer/SDKs/iPhoneOS13.5.sdk -miphoneos-version-min=6.0 -fPIC -O3 -fvisibility=hidden -DVISIBILITY_HIDDEN -Wall  -arch armv7 -mkernel -MD -MT projects/compiler-rt/lib/builtins/CMakeFiles/clang_rt.cc_kext_armv7_ios.dir/arm/fixsfsivfp.S.o -MF projects/compiler-rt/lib/builtins/CMakeFiles/clang_rt.cc_kext_armv7_ios.dir/arm/fixsfsivfp.S.o.d -o projects/compiler-rt/lib/builtins/CMakeFiles/clang_rt.cc_kext_armv7_ios.dir/arm/fixsfsivfp.S.o -c /Users/buildslave/jenkins/workspace/lldb-cmake/llvm-project/compiler-rt/lib/builtins/arm/fixsfsivfp.S
[10402/10424] /Users/buildslave/jenkins/workspace/lldb-cmake/host-compiler/bin/clang -DKERNEL_USE -D_DEBUG -D__STDC_CONSTANT_MACROS -D__STDC_FORMAT_MACROS -D__STDC_LIMIT_MACROS -Iprojects/compiler-rt/lib/builtins -I/Users/buildslave/jenkins/workspace/lldb-cmake/llvm-project/compiler-rt/lib/builtins -I/Applications/Xcode.app/Contents/Developer/Platforms/MacOSX.platform/Developer/SDKs/MacOSX10.15.sdk/usr/include/libxml2 -Iinclude -I/Users/buildslave/jenkins/workspace/lldb-cmake/llvm-project/llvm/include -I/Users/buildslave/jenkins/workspace/lldb-cmake/llvm-project/compiler-rt/lib/builtins/../../include -O3 -DNDEBUG -isysroot /Applications/Xcode.app/Contents/Developer/Platforms/MacOSX.platform/Developer/SDKs/MacOSX10.15.sdk    -isysroot /Applications/Xcode.app/Contents/Developer/Platforms/iPhoneOS.platform/Developer/SDKs/iPhoneOS13.5.sdk -miphoneos-version-min=6.0 -fPIC -O3 -fvisibility=hidden -DVISIBILITY_HIDDEN -Wall  -arch armv7 -mkernel -MD -MT projects/compiler-rt/lib/builtins/CMakeFiles/clang_rt.cc_kext_armv7_ios.dir/arm/fixunsdfsivfp.S.o -MF projects/compiler-rt/lib/builtins/CMakeFiles/clang_rt.cc_kext_armv7_ios.dir/arm/fixunsdfsivfp.S.o.d -o projects/compiler-rt/lib/builtins/CMakeFiles/clang_rt.cc_kext_armv7_ios.dir/arm/fixunsdfsivfp.S.o -c /Users/buildslave/jenkins/workspace/lldb-cmake/llvm-project/compiler-rt/lib/builtins/arm/fixunsdfsivfp.S
[10403/10424] /Users/buildslave/jenkins/workspace/lldb-cmake/host-compiler/bin/clang -DKERNEL_USE -D_DEBUG -D__STDC_CONSTANT_MACROS -D__STDC_FORMAT_MACROS -D__STDC_LIMIT_MACROS -Iprojects/compiler-rt/lib/builtins -I/Users/buildslave/jenkins/workspace/lldb-cmake/llvm-project/compiler-rt/lib/builtins -I/Applications/Xcode.app/Contents/Developer/Platforms/MacOSX.platform/Developer/SDKs/MacOSX10.15.sdk/usr/include/libxml2 -Iinclude -I/Users/buildslave/jenkins/workspace/lldb-cmake/llvm-project/llvm/include -I/Users/buildslave/jenkins/workspace/lldb-cmake/llvm-project/compiler-rt/lib/builtins/../../include -O3 -DNDEBUG -isysroot /Applications/Xcode.app/Contents/Developer/Platforms/MacOSX.platform/Developer/SDKs/MacOSX10.15.sdk    -isysroot /Applications/Xcode.app/Contents/Developer/Platforms/iPhoneOS.platform/Developer/SDKs/iPhoneOS13.5.sdk -miphoneos-version-min=6.0 -fPIC -O3 -fvisibility=hidden -DVISIBILITY_HIDDEN -Wall  -arch armv7 -mkernel -MD -MT projects/compiler-rt/lib/builtins/CMakeFiles/clang_rt.cc_kext_armv7_ios.dir/arm/fixunssfsivfp.S.o -MF projects/compiler-rt/lib/builtins/CMakeFiles/clang_rt.cc_kext_armv7_ios.dir/arm/fixunssfsivfp.S.o.d -o projects/compiler-rt/lib/builtins/CMakeFiles/clang_rt.cc_kext_armv7_ios.dir/arm/fixunssfsivfp.S.o -c /Users/buildslave/jenkins/workspace/lldb-cmake/llvm-project/compiler-rt/lib/builtins/arm/fixunssfsivfp.S
[10404/10424] /Users/buildslave/jenkins/workspace/lldb-cmake/host-compiler/bin/clang -DKERNEL_USE -D_DEBUG -D__STDC_CONSTANT_MACROS -D__STDC_FORMAT_MACROS -D__STDC_LIMIT_MACROS -Iprojects/compiler-rt/lib/builtins -I/Users/buildslave/jenkins/workspace/lldb-cmake/llvm-project/compiler-rt/lib/builtins -I/Applications/Xcode.app/Contents/Developer/Platforms/MacOSX.platform/Developer/SDKs/MacOSX10.15.sdk/usr/include/libxml2 -Iinclude -I/Users/buildslave/jenkins/workspace/lldb-cmake/llvm-project/llvm/include -I/Users/buildslave/jenkins/workspace/lldb-cmake/llvm-project/compiler-rt/lib/builtins/../../include -O3 -DNDEBUG -isysroot /Applications/Xcode.app/Contents/Developer/Platforms/MacOSX.platform/Developer/SDKs/MacOSX10.15.sdk    -isysroot /Applications/Xcode.app/Contents/Developer/Platforms/iPhoneOS.platform/Developer/SDKs/iPhoneOS13.5.sdk -miphoneos-version-min=6.0 -fPIC -O3 -fvisibility=hidden -DVISIBILITY_HIDDEN -Wall  -arch armv7 -mkernel -MD -MT projects/compiler-rt/lib/builtins/CMakeFiles/clang_rt.cc_kext_armv7_ios.dir/arm/floatsidfvfp.S.o -MF projects/compiler-rt/lib/builtins/CMakeFiles/clang_rt.cc_kext_armv7_ios.dir/arm/floatsidfvfp.S.o.d -o projects/compiler-rt/lib/builtins/CMakeFiles/clang_rt.cc_kext_armv7_ios.dir/arm/floatsidfvfp.S.o -c /Users/buildslave/jenkins/workspace/lldb-cmake/llvm-project/compiler-rt/lib/builtins/arm/floatsidfvfp.S
[10405/10424] /Users/buildslave/jenkins/workspace/lldb-cmake/host-compiler/bin/clang -DKERNEL_USE -D_DEBUG -D__STDC_CONSTANT_MACROS -D__STDC_FORMAT_MACROS -D__STDC_LIMIT_MACROS -Iprojects/compiler-rt/lib/builtins -I/Users/buildslave/jenkins/workspace/lldb-cmake/llvm-project/compiler-rt/lib/builtins -I/Applications/Xcode.app/Contents/Developer/Platforms/MacOSX.platform/Developer/SDKs/MacOSX10.15.sdk/usr/include/libxml2 -Iinclude -I/Users/buildslave/jenkins/workspace/lldb-cmake/llvm-project/llvm/include -I/Users/buildslave/jenkins/workspace/lldb-cmake/llvm-project/compiler-rt/lib/builtins/../../include -O3 -DNDEBUG -isysroot /Applications/Xcode.app/Contents/Developer/Platforms/MacOSX.platform/Developer/SDKs/MacOSX10.15.sdk    -isysroot /Applications/Xcode.app/Contents/Developer/Platforms/iPhoneOS.platform/Developer/SDKs/iPhoneOS13.5.sdk -miphoneos-version-min=6.0 -fPIC -O3 -fvisibility=hidden -DVISIBILITY_HIDDEN -Wall  -arch armv7 -mkernel -MD -MT projects/compiler-rt/lib/builtins/CMakeFiles/clang_rt.cc_kext_armv7_ios.dir/arm/floatunssidfvfp.S.o -MF projects/compiler-rt/lib/builtins/CMakeFiles/clang_rt.cc_kext_armv7_ios.dir/arm/floatunssidfvfp.S.o.d -o projects/compiler-rt/lib/builtins/CMakeFiles/clang_rt.cc_kext_armv7_ios.dir/arm/floatunssidfvfp.S.o -c /Users/buildslave/jenkins/workspace/lldb-cmake/llvm-project/compiler-rt/lib/builtins/arm/floatunssidfvfp.S
[10406/10424] /Users/buildslave/jenkins/workspace/lldb-cmake/host-compiler/bin/clang -DKERNEL_USE -D_DEBUG -D__STDC_CONSTANT_MACROS -D__STDC_FORMAT_MACROS -D__STDC_LIMIT_MACROS -Iprojects/compiler-rt/lib/builtins -I/Users/buildslave/jenkins/workspace/lldb-cmake/llvm-project/compiler-rt/lib/builtins -I/Applications/Xcode.app/Contents/Developer/Platforms/MacOSX.platform/Developer/SDKs/MacOSX10.15.sdk/usr/include/libxml2 -Iinclude -I/Users/buildslave/jenkins/workspace/lldb-cmake/llvm-project/llvm/include -I/Users/buildslave/jenkins/workspace/lldb-cmake/llvm-project/compiler-rt/lib/builtins/../../include -O3 -DNDEBUG -isysroot /Applications/Xcode.app/Contents/Developer/Platforms/MacOSX.platform/Developer/SDKs/MacOSX10.15.sdk    -isysroot /Applications/Xcode.app/Contents/Developer/Platforms/iPhoneOS.platform/Developer/SDKs/iPhoneOS13.5.sdk -miphoneos-version-min=6.0 -fPIC -O3 -fvisibility=hidden -DVISIBILITY_HIDDEN -Wall  -arch armv7 -mkernel -MD -MT projects/compiler-rt/lib/builtins/CMakeFiles/clang_rt.cc_kext_armv7_ios.dir/arm/floatsisfvfp.S.o -MF projects/compiler-rt/lib/builtins/CMakeFiles/clang_rt.cc_kext_armv7_ios.dir/arm/floatsisfvfp.S.o.d -o projects/compiler-rt/lib/builtins/CMakeFiles/clang_rt.cc_kext_armv7_ios.dir/arm/floatsisfvfp.S.o -c /Users/buildslave/jenkins/workspace/lldb-cmake/llvm-project/compiler-rt/lib/builtins/arm/floatsisfvfp.S
[10407/10424] /Users/buildslave/jenkins/workspace/lldb-cmake/host-compiler/bin/clang -DKERNEL_USE -D_DEBUG -D__STDC_CONSTANT_MACROS -D__STDC_FORMAT_MACROS -D__STDC_LIMIT_MACROS -Iprojects/compiler-rt/lib/builtins -I/Users/buildslave/jenkins/workspace/lldb-cmake/llvm-project/compiler-rt/lib/builtins -I/Applications/Xcode.app/Contents/Developer/Platforms/MacOSX.platform/Developer/SDKs/MacOSX10.15.sdk/usr/include/libxml2 -Iinclude -I/Users/buildslave/jenkins/workspace/lldb-cmake/llvm-project/llvm/include -I/Users/buildslave/jenkins/workspace/lldb-cmake/llvm-project/compiler-rt/lib/builtins/../../include -O3 -DNDEBUG -isysroot /Applications/Xcode.app/Contents/Developer/Platforms/MacOSX.platform/Developer/SDKs/MacOSX10.15.sdk    -isysroot /Applications/Xcode.app/Contents/Developer/Platforms/iPhoneOS.platform/Developer/SDKs/iPhoneOS13.5.sdk -miphoneos-version-min=6.0 -fPIC -O3 -fvisibility=hidden -DVISIBILITY_HIDDEN -Wall  -arch armv7 -mkernel -MD -MT projects/compiler-rt/lib/builtins/CMakeFiles/clang_rt.cc_kext_armv7_ios.dir/arm/floatunssisfvfp.S.o -MF projects/compiler-rt/lib/builtins/CMakeFiles/clang_rt.cc_kext_armv7_ios.dir/arm/floatunssisfvfp.S.o.d -o projects/compiler-rt/lib/builtins/CMakeFiles/clang_rt.cc_kext_armv7_ios.dir/arm/floatunssisfvfp.S.o -c /Users/buildslave/jenkins/workspace/lldb-cmake/llvm-project/compiler-rt/lib/builtins/arm/floatunssisfvfp.S
[10408/10424] /Users/buildslave/jenkins/workspace/lldb-cmake/host-compiler/bin/clang -DKERNEL_USE -D_DEBUG -D__STDC_CONSTANT_MACROS -D__STDC_FORMAT_MACROS -D__STDC_LIMIT_MACROS -Iprojects/compiler-rt/lib/builtins -I/Users/buildslave/jenkins/workspace/lldb-cmake/llvm-project/compiler-rt/lib/builtins -I/Applications/Xcode.app/Contents/Developer/Platforms/MacOSX.platform/Developer/SDKs/MacOSX10.15.sdk/usr/include/libxml2 -Iinclude -I/Users/buildslave/jenkins/workspace/lldb-cmake/llvm-project/llvm/include -I/Users/buildslave/jenkins/workspace/lldb-cmake/llvm-project/compiler-rt/lib/builtins/../../include -O3 -DNDEBUG -isysroot /Applications/Xcode.app/Contents/Developer/Platforms/MacOSX.platform/Developer/SDKs/MacOSX10.15.sdk    -isysroot /Applications/Xcode.app/Contents/Developer/Platforms/iPhoneOS.platform/Developer/SDKs/iPhoneOS13.5.sdk -miphoneos-version-min=6.0 -fPIC -O3 -fvisibility=hidden -DVISIBILITY_HIDDEN -Wall  -arch armv7 -mkernel -MD -MT projects/compiler-rt/lib/builtins/CMakeFiles/clang_rt.cc_kext_armv7_ios.dir/arm/gedf2vfp.S.o -MF projects/compiler-rt/lib/builtins/CMakeFiles/clang_rt.cc_kext_armv7_ios.dir/arm/gedf2vfp.S.o.d -o projects/compiler-rt/lib/builtins/CMakeFiles/clang_rt.cc_kext_armv7_ios.dir/arm/gedf2vfp.S.o -c /Users/buildslave/jenkins/workspace/lldb-cmake/llvm-project/compiler-rt/lib/builtins/arm/gedf2vfp.S
[10409/10424] /Users/buildslave/jenkins/workspace/lldb-cmake/host-compiler/bin/clang -DKERNEL_USE -D_DEBUG -D__STDC_CONSTANT_MACROS -D__STDC_FORMAT_MACROS -D__STDC_LIMIT_MACROS -Iprojects/compiler-rt/lib/builtins -I/Users/buildslave/jenkins/workspace/lldb-cmake/llvm-project/compiler-rt/lib/builtins -I/Applications/Xcode.app/Contents/Developer/Platforms/MacOSX.platform/Developer/SDKs/MacOSX10.15.sdk/usr/include/libxml2 -Iinclude -I/Users/buildslave/jenkins/workspace/lldb-cmake/llvm-project/llvm/include -I/Users/buildslave/jenkins/workspace/lldb-cmake/llvm-project/compiler-rt/lib/builtins/../../include -O3 -DNDEBUG -isysroot /Applications/Xcode.app/Contents/Developer/Platforms/MacOSX.platform/Developer/SDKs/MacOSX10.15.sdk    -isysroot /Applications/Xcode.app/Contents/Developer/Platforms/iPhoneOS.platform/Developer/SDKs/iPhoneOS13.5.sdk -miphoneos-version-min=6.0 -fPIC -O3 -fvisibility=hidden -DVISIBILITY_HIDDEN -Wall  -arch armv7 -mkernel -MD -MT projects/compiler-rt/lib/builtins/CMakeFiles/clang_rt.cc_kext_armv7_ios.dir/arm/gesf2vfp.S.o -MF projects/compiler-rt/lib/builtins/CMakeFiles/clang_rt.cc_kext_armv7_ios.dir/arm/gesf2vfp.S.o.d -o projects/compiler-rt/lib/builtins/CMakeFiles/clang_rt.cc_kext_armv7_ios.dir/arm/gesf2vfp.S.o -c /Users/buildslave/jenkins/workspace/lldb-cmake/llvm-project/compiler-rt/lib/builtins/arm/gesf2vfp.S
[10410/10424] /Users/buildslave/jenkins/workspace/lldb-cmake/host-compiler/bin/clang -DKERNEL_USE -D_DEBUG -D__STDC_CONSTANT_MACROS -D__STDC_FORMAT_MACROS -D__STDC_LIMIT_MACROS -Iprojects/compiler-rt/lib/builtins -I/Users/buildslave/jenkins/workspace/lldb-cmake/llvm-project/compiler-rt/lib/builtins -I/Applications/Xcode.app/Contents/Developer/Platforms/MacOSX.platform/Developer/SDKs/MacOSX10.15.sdk/usr/include/libxml2 -Iinclude -I/Users/buildslave/jenkins/workspace/lldb-cmake/llvm-project/llvm/include -I/Users/buildslave/jenkins/workspace/lldb-cmake/llvm-project/compiler-rt/lib/builtins/../../include -O3 -DNDEBUG -isysroot /Applications/Xcode.app/Contents/Developer/Platforms/MacOSX.platform/Developer/SDKs/MacOSX10.15.sdk    -isysroot /Applications/Xcode.app/Contents/Developer/Platforms/iPhoneOS.platform/Developer/SDKs/iPhoneOS13.5.sdk -miphoneos-version-min=6.0 -fPIC -O3 -fvisibility=hidden -DVISIBILITY_HIDDEN -Wall  -arch armv7 -mkernel -MD -MT projects/compiler-rt/lib/builtins/CMakeFiles/clang_rt.cc_kext_armv7_ios.dir/arm/gtdf2vfp.S.o -MF projects/compiler-rt/lib/builtins/CMakeFiles/clang_rt.cc_kext_armv7_ios.dir/arm/gtdf2vfp.S.o.d -o projects/compiler-rt/lib/builtins/CMakeFiles/clang_rt.cc_kext_armv7_ios.dir/arm/gtdf2vfp.S.o -c /Users/buildslave/jenkins/workspace/lldb-cmake/llvm-project/compiler-rt/lib/builtins/arm/gtdf2vfp.S
[10411/10424] /Users/buildslave/jenkins/workspace/lldb-cmake/host-compiler/bin/clang -DKERNEL_USE -D_DEBUG -D__STDC_CONSTANT_MACROS -D__STDC_FORMAT_MACROS -D__STDC_LIMIT_MACROS -Iprojects/compiler-rt/lib/builtins -I/Users/buildslave/jenkins/workspace/lldb-cmake/llvm-project/compiler-rt/lib/builtins -I/Applications/Xcode.app/Contents/Developer/Platforms/MacOSX.platform/Developer/SDKs/MacOSX10.15.sdk/usr/include/libxml2 -Iinclude -I/Users/buildslave/jenkins/workspace/lldb-cmake/llvm-project/llvm/include -I/Users/buildslave/jenkins/workspace/lldb-cmake/llvm-project/compiler-rt/lib/builtins/../../include -O3 -DNDEBUG -isysroot /Applications/Xcode.app/Contents/Developer/Platforms/MacOSX.platform/Developer/SDKs/MacOSX10.15.sdk    -isysroot /Applications/Xcode.app/Contents/Developer/Platforms/iPhoneOS.platform/Developer/SDKs/iPhoneOS13.5.sdk -miphoneos-version-min=6.0 -fPIC -O3 -fvisibility=hidden -DVISIBILITY_HIDDEN -Wall  -arch armv7 -mkernel -MD -MT projects/compiler-rt/lib/builtins/CMakeFiles/clang_rt.cc_kext_armv7_ios.dir/arm/gtsf2vfp.S.o -MF projects/compiler-rt/lib/builtins/CMakeFiles/clang_rt.cc_kext_armv7_ios.dir/arm/gtsf2vfp.S.o.d -o projects/compiler-rt/lib/builtins/CMakeFiles/clang_rt.cc_kext_armv7_ios.dir/arm/gtsf2vfp.S.o -c /Users/buildslave/jenkins/workspace/lldb-cmake/llvm-project/compiler-rt/lib/builtins/arm/gtsf2vfp.S
[10412/10424] /Users/buildslave/jenkins/workspace/lldb-cmake/host-compiler/bin/clang -DKERNEL_USE -D_DEBUG -D__STDC_CONSTANT_MACROS -D__STDC_FORMAT_MACROS -D__STDC_LIMIT_MACROS -Iprojects/compiler-rt/lib/builtins -I/Users/buildslave/jenkins/workspace/lldb-cmake/llvm-project/compiler-rt/lib/builtins -I/Applications/Xcode.app/Contents/Developer/Platforms/MacOSX.platform/Developer/SDKs/MacOSX10.15.sdk/usr/include/libxml2 -Iinclude -I/Users/buildslave/jenkins/workspace/lldb-cmake/llvm-project/llvm/include -I/Users/buildslave/jenkins/workspace/lldb-cmake/llvm-project/compiler-rt/lib/builtins/../../include -O3 -DNDEBUG -isysroot /Applications/Xcode.app/Contents/Developer/Platforms/MacOSX.platform/Developer/SDKs/MacOSX10.15.sdk    -isysroot /Applications/Xcode.app/Contents/Developer/Platforms/iPhoneOS.platform/Developer/SDKs/iPhoneOS13.5.sdk -miphoneos-version-min=6.0 -fPIC -O3 -fvisibility=hidden -DVISIBILITY_HIDDEN -Wall  -arch armv7 -mkernel -MD -MT projects/compiler-rt/lib/builtins/CMakeFiles/clang_rt.cc_kext_armv7_ios.dir/arm/ledf2vfp.S.o -MF projects/compiler-rt/lib/builtins/CMakeFiles/clang_rt.cc_kext_armv7_ios.dir/arm/ledf2vfp.S.o.d -o projects/compiler-rt/lib/builtins/CMakeFiles/clang_rt.cc_kext_armv7_ios.dir/arm/ledf2vfp.S.o -c /Users/buildslave/jenkins/workspace/lldb-cmake/llvm-project/compiler-rt/lib/builtins/arm/ledf2vfp.S
[10413/10424] /Users/buildslave/jenkins/workspace/lldb-cmake/host-compiler/bin/clang -DKERNEL_USE -D_DEBUG -D__STDC_CONSTANT_MACROS -D__STDC_FORMAT_MACROS -D__STDC_LIMIT_MACROS -Iprojects/compiler-rt/lib/builtins -I/Users/buildslave/jenkins/workspace/lldb-cmake/llvm-project/compiler-rt/lib/builtins -I/Applications/Xcode.app/Contents/Developer/Platforms/MacOSX.platform/Developer/SDKs/MacOSX10.15.sdk/usr/include/libxml2 -Iinclude -I/Users/buildslave/jenkins/workspace/lldb-cmake/llvm-project/llvm/include -I/Users/buildslave/jenkins/workspace/lldb-cmake/llvm-project/compiler-rt/lib/builtins/../../include -O3 -DNDEBUG -isysroot /Applications/Xcode.app/Contents/Developer/Platforms/MacOSX.platform/Developer/SDKs/MacOSX10.15.sdk    -isysroot /Applications/Xcode.app/Contents/Developer/Platforms/iPhoneOS.platform/Developer/SDKs/iPhoneOS13.5.sdk -miphoneos-version-min=6.0 -fPIC -O3 -fvisibility=hidden -DVISIBILITY_HIDDEN -Wall  -arch armv7 -mkernel -MD -MT projects/compiler-rt/lib/builtins/CMakeFiles/clang_rt.cc_kext_armv7_ios.dir/arm/lesf2vfp.S.o -MF projects/compiler-rt/lib/builtins/CMakeFiles/clang_rt.cc_kext_armv7_ios.dir/arm/lesf2vfp.S.o.d -o projects/compiler-rt/lib/builtins/CMakeFiles/clang_rt.cc_kext_armv7_ios.dir/arm/lesf2vfp.S.o -c /Users/buildslave/jenkins/workspace/lldb-cmake/llvm-project/compiler-rt/lib/builtins/arm/lesf2vfp.S
[10414/10424] /Users/buildslave/jenkins/workspace/lldb-cmake/host-compiler/bin/clang -DKERNEL_USE -D_DEBUG -D__STDC_CONSTANT_MACROS -D__STDC_FORMAT_MACROS -D__STDC_LIMIT_MACROS -Iprojects/compiler-rt/lib/builtins -I/Users/buildslave/jenkins/workspace/lldb-cmake/llvm-project/compiler-rt/lib/builtins -I/Applications/Xcode.app/Contents/Developer/Platforms/MacOSX.platform/Developer/SDKs/MacOSX10.15.sdk/usr/include/libxml2 -Iinclude -I/Users/buildslave/jenkins/workspace/lldb-cmake/llvm-project/llvm/include -I/Users/buildslave/jenkins/workspace/lldb-cmake/llvm-project/compiler-rt/lib/builtins/../../include -O3 -DNDEBUG -isysroot /Applications/Xcode.app/Contents/Developer/Platforms/MacOSX.platform/Developer/SDKs/MacOSX10.15.sdk    -isysroot /Applications/Xcode.app/Contents/Developer/Platforms/iPhoneOS.platform/Developer/SDKs/iPhoneOS13.5.sdk -miphoneos-version-min=6.0 -fPIC -O3 -fvisibility=hidden -DVISIBILITY_HIDDEN -Wall  -arch armv7 -mkernel -MD -MT projects/compiler-rt/lib/builtins/CMakeFiles/clang_rt.cc_kext_armv7_ios.dir/arm/ltdf2vfp.S.o -MF projects/compiler-rt/lib/builtins/CMakeFiles/clang_rt.cc_kext_armv7_ios.dir/arm/ltdf2vfp.S.o.d -o projects/compiler-rt/lib/builtins/CMakeFiles/clang_rt.cc_kext_armv7_ios.dir/arm/ltdf2vfp.S.o -c /Users/buildslave/jenkins/workspace/lldb-cmake/llvm-project/compiler-rt/lib/builtins/arm/ltdf2vfp.S
[10415/10424] /Users/buildslave/jenkins/workspace/lldb-cmake/host-compiler/bin/clang -DKERNEL_USE -D_DEBUG -D__STDC_CONSTANT_MACROS -D__STDC_FORMAT_MACROS -D__STDC_LIMIT_MACROS -Iprojects/compiler-rt/lib/builtins -I/Users/buildslave/jenkins/workspace/lldb-cmake/llvm-project/compiler-rt/lib/builtins -I/Applications/Xcode.app/Contents/Developer/Platforms/MacOSX.platform/Developer/SDKs/MacOSX10.15.sdk/usr/include/libxml2 -Iinclude -I/Users/buildslave/jenkins/workspace/lldb-cmake/llvm-project/llvm/include -I/Users/buildslave/jenkins/workspace/lldb-cmake/llvm-project/compiler-rt/lib/builtins/../../include -O3 -DNDEBUG -isysroot /Applications/Xcode.app/Contents/Developer/Platforms/MacOSX.platform/Developer/SDKs/MacOSX10.15.sdk    -isysroot /Applications/Xcode.app/Contents/Developer/Platforms/iPhoneOS.platform/Developer/SDKs/iPhoneOS13.5.sdk -miphoneos-version-min=6.0 -fPIC -O3 -fvisibility=hidden -DVISIBILITY_HIDDEN -Wall  -arch armv7 -mkernel -MD -MT projects/compiler-rt/lib/builtins/CMakeFiles/clang_rt.cc_kext_armv7_ios.dir/arm/ltsf2vfp.S.o -MF projects/compiler-rt/lib/builtins/CMakeFiles/clang_rt.cc_kext_armv7_ios.dir/arm/ltsf2vfp.S.o.d -o projects/compiler-rt/lib/builtins/CMakeFiles/clang_rt.cc_kext_armv7_ios.dir/arm/ltsf2vfp.S.o -c /Users/buildslave/jenkins/workspace/lldb-cmake/llvm-project/compiler-rt/lib/builtins/arm/ltsf2vfp.S
[10416/10424] : && "/Applications/Xcode.app/Contents/Developer/Toolchains/XcodeDefault.xctoolchain/usr/bin/libtool" -static -no_warning_for_no_symbols -o lib/libclang_rt.cc_kext_armv7_ios.a  projects/compiler-rt/lib/builtins/CMakeFiles/clang_rt.cc_kext_armv7_ios.dir/arm/fp_mode.c.o projects/compiler-rt/lib/builtins/CMakeFiles/clang_rt.cc_kext_armv7_ios.dir/arm/bswapdi2.S.o projects/compiler-rt/lib/builtins/CMakeFiles/clang_rt.cc_kext_armv7_ios.dir/arm/bswapsi2.S.o projects/compiler-rt/lib/builtins/CMakeFiles/clang_rt.cc_kext_armv7_ios.dir/arm/clzdi2.S.o projects/compiler-rt/lib/builtins/CMakeFiles/clang_rt.cc_kext_armv7_ios.dir/arm/clzsi2.S.o projects/compiler-rt/lib/builtins/CMakeFiles/clang_rt.cc_kext_armv7_ios.dir/arm/comparesf2.S.o projects/compiler-rt/lib/builtins/CMakeFiles/clang_rt.cc_kext_armv7_ios.dir/arm/divmodsi4.S.o projects/compiler-rt/lib/builtins/CMakeFiles/clang_rt.cc_kext_armv7_ios.dir/arm/divsi3.S.o projects/compiler-rt/lib/builtins/CMakeFiles/clang_rt.cc_kext_armv7_ios.dir/arm/modsi3.S.o projects/compiler-rt/lib/builtins/CMakeFiles/clang_rt.cc_kext_armv7_ios.dir/arm/sync_fetch_and_add_4.S.o projects/compiler-rt/lib/builtins/CMakeFiles/clang_rt.cc_kext_armv7_ios.dir/arm/sync_fetch_and_add_8.S.o projects/compiler-rt/lib/builtins/CMakeFiles/clang_rt.cc_kext_armv7_ios.dir/arm/sync_fetch_and_and_4.S.o projects/compiler-rt/lib/builtins/CMakeFiles/clang_rt.cc_kext_armv7_ios.dir/arm/sync_fetch_and_and_8.S.o projects/compiler-rt/lib/builtins/CMakeFiles/clang_rt.cc_kext_armv7_ios.dir/arm/sync_fetch_and_max_4.S.o projects/compiler-rt/lib/builtins/CMakeFiles/clang_rt.cc_kext_armv7_ios.dir/arm/sync_fetch_and_max_8.S.o projects/compiler-rt/lib/builtins/CMakeFiles/clang_rt.cc_kext_armv7_ios.dir/arm/sync_fetch_and_min_4.S.o projects/compiler-rt/lib/builtins/CMakeFiles/clang_rt.cc_kext_armv7_ios.dir/arm/sync_fetch_and_min_8.S.o projects/compiler-rt/lib/builtins/CMakeFiles/clang_rt.cc_kext_armv7_ios.dir/arm/sync_fetch_and_nand_4.S.o projects/compiler-rt/lib/builtins/CMakeFiles/clang_rt.cc_kext_armv7_ios.dir/arm/sync_fetch_and_nand_8.S.o projects/compiler-rt/lib/builtins/CMakeFiles/clang_rt.cc_kext_armv7_ios.dir/arm/sync_fetch_and_or_4.S.o projects/compiler-rt/lib/builtins/CMakeFiles/clang_rt.cc_kext_armv7_ios.dir/arm/sync_fetch_and_or_8.S.o projects/compiler-rt/lib/builtins/CMakeFiles/clang_rt.cc_kext_armv7_ios.dir/arm/sync_fetch_and_sub_4.S.o projects/compiler-rt/lib/builtins/CMakeFiles/clang_rt.cc_kext_armv7_ios.dir/arm/sync_fetch_and_sub_8.S.o projects/compiler-rt/lib/builtins/CMakeFiles/clang_rt.cc_kext_armv7_ios.dir/arm/sync_fetch_and_umax_4.S.o projects/compiler-rt/lib/builtins/CMakeFiles/clang_rt.cc_kext_armv7_ios.dir/arm/sync_fetch_and_umax_8.S.o projects/compiler-rt/lib/builtins/CMakeFiles/clang_rt.cc_kext_armv7_ios.dir/arm/sync_fetch_and_umin_4.S.o projects/compiler-rt/lib/builtins/CMakeFiles/clang_rt.cc_kext_armv7_ios.dir/arm/sync_fetch_and_umin_8.S.o projects/compiler-rt/lib/builtins/CMakeFiles/clang_rt.cc_kext_armv7_ios.dir/arm/sync_fetch_and_xor_4.S.o projects/compiler-rt/lib/builtins/CMakeFiles/clang_rt.cc_kext_armv7_ios.dir/arm/sync_fetch_and_xor_8.S.o projects/compiler-rt/lib/builtins/CMakeFiles/clang_rt.cc_kext_armv7_ios.dir/arm/udivmodsi4.S.o projects/compiler-rt/lib/builtins/CMakeFiles/clang_rt.cc_kext_armv7_ios.dir/arm/udivsi3.S.o projects/compiler-rt/lib/builtins/CMakeFiles/clang_rt.cc_kext_armv7_ios.dir/arm/umodsi3.S.o projects/compiler-rt/lib/builtins/CMakeFiles/clang_rt.cc_kext_armv7_ios.dir/absvdi2.c.o projects/compiler-rt/lib/builtins/CMakeFiles/clang_rt.cc_kext_armv7_ios.dir/absvsi2.c.o projects/compiler-rt/lib/builtins/CMakeFiles/clang_rt.cc_kext_armv7_ios.dir/adddf3.c.o projects/compiler-rt/lib/builtins/CMakeFiles/clang_rt.cc_kext_armv7_ios.dir/addsf3.c.o projects/compiler-rt/lib/builtins/CMakeFiles/clang_rt.cc_kext_armv7_ios.dir/addvdi3.c.o projects/compiler-rt/lib/builtins/CMakeFiles/clang_rt.cc_kext_armv7_ios.dir/addvsi3.c.o projects/compiler-rt/lib/builtins/CMakeFiles/clang_rt.cc_kext_armv7_ios.dir/ashldi3.c.o projects/compiler-rt/lib/builtins/CMakeFiles/clang_rt.cc_kext_armv7_ios.dir/ashrdi3.c.o projects/compiler-rt/lib/builtins/CMakeFiles/clang_rt.cc_kext_armv7_ios.dir/cmpdi2.c.o projects/compiler-rt/lib/builtins/CMakeFiles/clang_rt.cc_kext_armv7_ios.dir/comparedf2.c.o projects/compiler-rt/lib/builtins/CMakeFiles/clang_rt.cc_kext_armv7_ios.dir/ctzdi2.c.o projects/compiler-rt/lib/builtins/CMakeFiles/clang_rt.cc_kext_armv7_ios.dir/ctzsi2.c.o projects/compiler-rt/lib/builtins/CMakeFiles/clang_rt.cc_kext_armv7_ios.dir/divdc3.c.o projects/compiler-rt/lib/builtins/CMakeFiles/clang_rt.cc_kext_armv7_ios.dir/divdf3.c.o projects/compiler-rt/lib/builtins/CMakeFiles/clang_rt.cc_kext_armv7_ios.dir/divdi3.c.o projects/compiler-rt/lib/builtins/CMakeFiles/clang_rt.cc_kext_armv7_ios.dir/divmoddi4.c.o projects/compiler-rt/lib/builtins/CMakeFiles/clang_rt.cc_kext_armv7_ios.dir/divsc3.c.o projects/compiler-rt/lib/builtins/CMakeFiles/clang_rt.cc_kext_armv7_ios.dir/divsf3.c.o projects/compiler-rt/lib/builtins/CMakeFiles/clang_rt.cc_kext_armv7_ios.dir/extendsfdf2.c.o projects/compiler-rt/lib/builtins/CMakeFiles/clang_rt.cc_kext_armv7_ios.dir/extendhfsf2.c.o projects/compiler-rt/lib/builtins/CMakeFiles/clang_rt.cc_kext_armv7_ios.dir/ffsdi2.c.o projects/compiler-rt/lib/builtins/CMakeFiles/clang_rt.cc_kext_armv7_ios.dir/ffssi2.c.o projects/compiler-rt/lib/builtins/CMakeFiles/clang_rt.cc_kext_armv7_ios.dir/fixdfdi.c.o projects/compiler-rt/lib/builtins/CMakeFiles/clang_rt.cc_kext_armv7_ios.dir/fixdfsi.c.o projects/compiler-rt/lib/builtins/CMakeFiles/clang_rt.cc_kext_armv7_ios.dir/fixsfdi.c.o projects/compiler-rt/lib/builtins/CMakeFiles/clang_rt.cc_kext_armv7_ios.dir/fixsfsi.c.o projects/compiler-rt/lib/builtins/CMakeFiles/clang_rt.cc_kext_armv7_ios.dir/fixunsdfdi.c.o projects/compiler-rt/lib/builtins/CMakeFiles/clang_rt.cc_kext_armv7_ios.dir/fixunsdfsi.c.o projects/compiler-rt/lib/builtins/CMakeFiles/clang_rt.cc_kext_armv7_ios.dir/fixunssfdi.c.o projects/compiler-rt/lib/builtins/CMakeFiles/clang_rt.cc_kext_armv7_ios.dir/fixunssfsi.c.o projects/compiler-rt/lib/builtins/CMakeFiles/clang_rt.cc_kext_armv7_ios.dir/floatdidf.c.o projects/compiler-rt/lib/builtins/CMakeFiles/clang_rt.cc_kext_armv7_ios.dir/floatdisf.c.o projects/compiler-rt/lib/builtins/CMakeFiles/clang_rt.cc_kext_armv7_ios.dir/floatsidf.c.o projects/compiler-rt/lib/builtins/CMakeFiles/clang_rt.cc_kext_armv7_ios.dir/floatsisf.c.o projects/compiler-rt/lib/builtins/CMakeFiles/clang_rt.cc_kext_armv7_ios.dir/floatundidf.c.o projects/compiler-rt/lib/builtins/CMakeFiles/clang_rt.cc_kext_armv7_ios.dir/floatundisf.c.o projects/compiler-rt/lib/builtins/CMakeFiles/clang_rt.cc_kext_armv7_ios.dir/floatunsidf.c.o projects/compiler-rt/lib/builtins/CMakeFiles/clang_rt.cc_kext_armv7_ios.dir/floatunsisf.c.o projects/compiler-rt/lib/builtins/CMakeFiles/clang_rt.cc_kext_armv7_ios.dir/int_util.c.o projects/compiler-rt/lib/builtins/CMakeFiles/clang_rt.cc_kext_armv7_ios.dir/lshrdi3.c.o projects/compiler-rt/lib/builtins/CMakeFiles/clang_rt.cc_kext_armv7_ios.dir/moddi3.c.o projects/compiler-rt/lib/builtins/CMakeFiles/clang_rt.cc_kext_armv7_ios.dir/muldc3.c.o projects/compiler-rt/lib/builtins/CMakeFiles/clang_rt.cc_kext_armv7_ios.dir/muldf3.c.o projects/compiler-rt/lib/builtins/CMakeFiles/clang_rt.cc_kext_armv7_ios.dir/muldi3.c.o projects/compiler-rt/lib/builtins/CMakeFiles/clang_rt.cc_kext_armv7_ios.dir/mulodi4.c.o projects/compiler-rt/lib/builtins/CMakeFiles/clang_rt.cc_kext_armv7_ios.dir/mulosi4.c.o projects/compiler-rt/lib/builtins/CMakeFiles/clang_rt.cc_kext_armv7_ios.dir/muloti4.c.o projects/compiler-rt/lib/builtins/CMakeFiles/clang_rt.cc_kext_armv7_ios.dir/mulsc3.c.o projects/compiler-rt/lib/builtins/CMakeFiles/clang_rt.cc_kext_armv7_ios.dir/mulsf3.c.o projects/compiler-rt/lib/builtins/CMakeFiles/clang_rt.cc_kext_armv7_ios.dir/mulvdi3.c.o projects/compiler-rt/lib/builtins/CMakeFiles/clang_rt.cc_kext_armv7_ios.dir/mulvsi3.c.o projects/compiler-rt/lib/builtins/CMakeFiles/clang_rt.cc_kext_armv7_ios.dir/negdf2.c.o projects/compiler-rt/lib/builtins/CMakeFiles/clang_rt.cc_kext_armv7_ios.dir/negdi2.c.o projects/compiler-rt/lib/builtins/CMakeFiles/clang_rt.cc_kext_armv7_ios.dir/negsf2.c.o projects/compiler-rt/lib/builtins/CMakeFiles/clang_rt.cc_kext_armv7_ios.dir/negvdi2.c.o projects/compiler-rt/lib/builtins/CMakeFiles/clang_rt.cc_kext_armv7_ios.dir/negvsi2.c.o projects/compiler-rt/lib/builtins/CMakeFiles/clang_rt.cc_kext_armv7_ios.dir/os_version_check.c.o projects/compiler-rt/lib/builtins/CMakeFiles/clang_rt.cc_kext_armv7_ios.dir/paritydi2.c.o projects/compiler-rt/lib/builtins/CMakeFiles/clang_rt.cc_kext_armv7_ios.dir/paritysi2.c.o projects/compiler-rt/lib/builtins/CMakeFiles/clang_rt.cc_kext_armv7_ios.dir/popcountdi2.c.o projects/compiler-rt/lib/builtins/CMakeFiles/clang_rt.cc_kext_armv7_ios.dir/popcountsi2.c.o projects/compiler-rt/lib/builtins/CMakeFiles/clang_rt.cc_kext_armv7_ios.dir/powidf2.c.o projects/compiler-rt/lib/builtins/CMakeFiles/clang_rt.cc_kext_armv7_ios.dir/powisf2.c.o projects/compiler-rt/lib/builtins/CMakeFiles/clang_rt.cc_kext_armv7_ios.dir/subdf3.c.o projects/compiler-rt/lib/builtins/CMakeFiles/clang_rt.cc_kext_armv7_ios.dir/subsf3.c.o projects/compiler-rt/lib/builtins/CMakeFiles/clang_rt.cc_kext_armv7_ios.dir/subvdi3.c.o projects/compiler-rt/lib/builtins/CMakeFiles/clang_rt.cc_kext_armv7_ios.dir/subvsi3.c.o projects/compiler-rt/lib/builtins/CMakeFiles/clang_rt.cc_kext_armv7_ios.dir/truncdfhf2.c.o projects/compiler-rt/lib/builtins/CMakeFiles/clang_rt.cc_kext_armv7_ios.dir/truncdfsf2.c.o projects/compiler-rt/lib/builtins/CMakeFiles/clang_rt.cc_kext_armv7_ios.dir/truncsfhf2.c.o projects/compiler-rt/lib/builtins/CMakeFiles/clang_rt.cc_kext_armv7_ios.dir/ucmpdi2.c.o projects/compiler-rt/lib/builtins/CMakeFiles/clang_rt.cc_kext_armv7_ios.dir/udivdi3.c.o projects/compiler-rt/lib/builtins/CMakeFiles/clang_rt.cc_kext_armv7_ios.dir/udivmoddi4.c.o projects/compiler-rt/lib/builtins/CMakeFiles/clang_rt.cc_kext_armv7_ios.dir/umoddi3.c.o projects/compiler-rt/lib/builtins/CMakeFiles/clang_rt.cc_kext_armv7_ios.dir/emutls.c.o projects/compiler-rt/lib/builtins/CMakeFiles/clang_rt.cc_kext_armv7_ios.dir/enable_execute_stack.c.o projects/compiler-rt/lib/builtins/CMakeFiles/clang_rt.cc_kext_armv7_ios.dir/eprintf.c.o projects/compiler-rt/lib/builtins/CMakeFiles/clang_rt.cc_kext_armv7_ios.dir/atomic_flag_clear.c.o projects/compiler-rt/lib/builtins/CMakeFiles/clang_rt.cc_kext_armv7_ios.dir/atomic_flag_clear_explicit.c.o projects/compiler-rt/lib/builtins/CMakeFiles/clang_rt.cc_kext_armv7_ios.dir/atomic_flag_test_and_set.c.o projects/compiler-rt/lib/builtins/CMakeFiles/clang_rt.cc_kext_armv7_ios.dir/atomic_flag_test_and_set_explicit.c.o projects/compiler-rt/lib/builtins/CMakeFiles/clang_rt.cc_kext_armv7_ios.dir/atomic_signal_fence.c.o projects/compiler-rt/lib/builtins/CMakeFiles/clang_rt.cc_kext_armv7_ios.dir/atomic_thread_fence.c.o projects/compiler-rt/lib/builtins/CMakeFiles/clang_rt.cc_kext_armv7_ios.dir/gcc_personality_v0.c.o projects/compiler-rt/lib/builtins/CMakeFiles/clang_rt.cc_kext_armv7_ios.dir/clear_cache.c.o projects/compiler-rt/lib/builtins/CMakeFiles/clang_rt.cc_kext_armv7_ios.dir/arm/switch16.S.o projects/compiler-rt/lib/builtins/CMakeFiles/clang_rt.cc_kext_armv7_ios.dir/arm/switch32.S.o projects/compiler-rt/lib/builtins/CMakeFiles/clang_rt.cc_kext_armv7_ios.dir/arm/switch8.S.o projects/compiler-rt/lib/builtins/CMakeFiles/clang_rt.cc_kext_armv7_ios.dir/arm/switchu8.S.o projects/compiler-rt/lib/builtins/CMakeFiles/clang_rt.cc_kext_armv7_ios.dir/arm/restore_vfp_d8_d15_regs.S.o projects/compiler-rt/lib/builtins/CMakeFiles/clang_rt.cc_kext_armv7_ios.dir/arm/save_vfp_d8_d15_regs.S.o projects/compiler-rt/lib/builtins/CMakeFiles/clang_rt.cc_kext_armv7_ios.dir/arm/adddf3vfp.S.o projects/compiler-rt/lib/builtins/CMakeFiles/clang_rt.cc_kext_armv7_ios.dir/arm/addsf3vfp.S.o projects/compiler-rt/lib/builtins/CMakeFiles/clang_rt.cc_kext_armv7_ios.dir/arm/divdf3vfp.S.o projects/compiler-rt/lib/builtins/CMakeFiles/clang_rt.cc_kext_armv7_ios.dir/arm/divsf3vfp.S.o projects/compiler-rt/lib/builtins/CMakeFiles/clang_rt.cc_kext_armv7_ios.dir/arm/eqdf2vfp.S.o projects/compiler-rt/lib/builtins/CMakeFiles/clang_rt.cc_kext_armv7_ios.dir/arm/eqsf2vfp.S.o projects/compiler-rt/lib/builtins/CMakeFiles/clang_rt.cc_kext_armv7_ios.dir/arm/extendsfdf2vfp.S.o projects/compiler-rt/lib/builtins/CMakeFiles/clang_rt.cc_kext_armv7_ios.dir/arm/fixdfsivfp.S.o projects/compiler-rt/lib/builtins/CMakeFiles/clang_rt.cc_kext_armv7_ios.dir/arm/fixsfsivfp.S.o projects/compiler-rt/lib/builtins/CMakeFiles/clang_rt.cc_kext_armv7_ios.dir/arm/fixunsdfsivfp.S.o projects/compiler-rt/lib/builtins/CMakeFiles/clang_rt.cc_kext_armv7_ios.dir/arm/fixunssfsivfp.S.o projects/compiler-rt/lib/builtins/CMakeFiles/clang_rt.cc_kext_armv7_ios.dir/arm/floatsidfvfp.S.o projects/compiler-rt/lib/builtins/CMakeFiles/clang_rt.cc_kext_armv7_ios.dir/arm/floatsisfvfp.S.o projects/compiler-rt/lib/builtins/CMakeFiles/clang_rt.cc_kext_armv7_ios.dir/arm/floatunssidfvfp.S.o projects/compiler-rt/lib/builtins/CMakeFiles/clang_rt.cc_kext_armv7_ios.dir/arm/floatunssisfvfp.S.o projects/compiler-rt/lib/builtins/CMakeFiles/clang_rt.cc_kext_armv7_ios.dir/arm/gedf2vfp.S.o projects/compiler-rt/lib/builtins/CMakeFiles/clang_rt.cc_kext_armv7_ios.dir/arm/gesf2vfp.S.o projects/compiler-rt/lib/builtins/CMakeFiles/clang_rt.cc_kext_armv7_ios.dir/arm/gtdf2vfp.S.o projects/compiler-rt/lib/builtins/CMakeFiles/clang_rt.cc_kext_armv7_ios.dir/arm/gtsf2vfp.S.o projects/compiler-rt/lib/builtins/CMakeFiles/clang_rt.cc_kext_armv7_ios.dir/arm/ledf2vfp.S.o projects/compiler-rt/lib/builtins/CMakeFiles/clang_rt.cc_kext_armv7_ios.dir/arm/lesf2vfp.S.o projects/compiler-rt/lib/builtins/CMakeFiles/clang_rt.cc_kext_armv7_ios.dir/arm/ltdf2vfp.S.o projects/compiler-rt/lib/builtins/CMakeFiles/clang_rt.cc_kext_armv7_ios.dir/arm/ltsf2vfp.S.o projects/compiler-rt/lib/builtins/CMakeFiles/clang_rt.cc_kext_armv7_ios.dir/arm/muldf3vfp.S.o projects/compiler-rt/lib/builtins/CMakeFiles/clang_rt.cc_kext_armv7_ios.dir/arm/mulsf3vfp.S.o projects/compiler-rt/lib/builtins/CMakeFiles/clang_rt.cc_kext_armv7_ios.dir/arm/nedf2vfp.S.o projects/compiler-rt/lib/builtins/CMakeFiles/clang_rt.cc_kext_armv7_ios.dir/arm/negdf2vfp.S.o projects/compiler-rt/lib/builtins/CMakeFiles/clang_rt.cc_kext_armv7_ios.dir/arm/negsf2vfp.S.o projects/compiler-rt/lib/builtins/CMakeFiles/clang_rt.cc_kext_armv7_ios.dir/arm/nesf2vfp.S.o projects/compiler-rt/lib/builtins/CMakeFiles/clang_rt.cc_kext_armv7_ios.dir/arm/subdf3vfp.S.o projects/compiler-rt/lib/builtins/CMakeFiles/clang_rt.cc_kext_armv7_ios.dir/arm/subsf3vfp.S.o projects/compiler-rt/lib/builtins/CMakeFiles/clang_rt.cc_kext_armv7_ios.dir/arm/truncdfsf2vfp.S.o projects/compiler-rt/lib/builtins/CMakeFiles/clang_rt.cc_kext_armv7_ios.dir/arm/unorddf2vfp.S.o projects/compiler-rt/lib/builtins/CMakeFiles/clang_rt.cc_kext_armv7_ios.dir/arm/unordsf2vfp.S.o projects/compiler-rt/lib/builtins/CMakeFiles/clang_rt.cc_kext_armv7_ios.dir/arm/sync_synchronize.S.o projects/compiler-rt/lib/builtins/CMakeFiles/clang_rt.cc_kext_armv7_ios.dir/__/profile/InstrProfiling.c.o projects/compiler-rt/lib/builtins/CMakeFiles/clang_rt.cc_kext_armv7_ios.dir/__/profile/InstrProfilingBuffer.c.o projects/compiler-rt/lib/builtins/CMakeFiles/clang_rt.cc_kext_armv7_ios.dir/__/profile/InstrProfilingPlatformDarwin.c.o projects/compiler-rt/lib/builtins/CMakeFiles/clang_rt.cc_kext_armv7_ios.dir/__/profile/InstrProfilingWriter.c.o projects/compiler-rt/lib/builtins/CMakeFiles/clang_rt.cc_kext_armv7_ios.dir/__/profile/InstrProfilingInternal.c.o && :
[10417/10424] cd /Users/buildslave/jenkins/workspace/lldb-cmake/lldb-build/projects/compiler-rt/lib/builtins && /usr/local/Cellar/cmake/3.17.2/bin/cmake -E make_directory /Users/buildslave/jenkins/workspace/lldb-cmake/lldb-build/./lib/clang/12.0.99/lib/darwin && lipo -output /Users/buildslave/jenkins/workspace/lldb-cmake/lldb-build/./lib/clang/12.0.99/lib/darwin/libclang_rt.cc_kext_ios.a -create -arch arm64 /Users/buildslave/jenkins/workspace/lldb-cmake/lldb-build/lib/libclang_rt.cc_kext_arm64_ios.a -arch armv7 /Users/buildslave/jenkins/workspace/lldb-cmake/lldb-build/lib/libclang_rt.cc_kext_armv7_ios.a -arch armv7k /Users/buildslave/jenkins/workspace/lldb-cmake/lldb-build/lib/libclang_rt.cc_kext_armv7k_ios.a -arch armv7s /Users/buildslave/jenkins/workspace/lldb-cmake/lldb-build/lib/libclang_rt.cc_kext_armv7s_ios.a
[10418/10424] /Users/buildslave/jenkins/workspace/lldb-cmake/host-compiler/bin/clang++  -DGTEST_HAS_RTTI=0 -DGTEST_HAS_TR1_TUPLE=0 -DLLVM_ENABLE_PLUGINS -D_DEBUG -D__STDC_CONSTANT_MACROS -D__STDC_FORMAT_MACROS -D__STDC_LIMIT_MACROS -Iunittests/Passes -I/Users/buildslave/jenkins/workspace/lldb-cmake/llvm-project/llvm/unittests/Passes -I/Applications/Xcode.app/Contents/Developer/Platforms/MacOSX.platform/Developer/SDKs/MacOSX10.15.sdk/usr/include/libxml2 -Iinclude -I/Users/buildslave/jenkins/workspace/lldb-cmake/llvm-project/llvm/include -I/Users/buildslave/jenkins/workspace/lldb-cmake/llvm-project/llvm/utils/unittest/googletest/include -I/Users/buildslave/jenkins/workspace/lldb-cmake/llvm-project/llvm/utils/unittest/googlemock/include -Wdocumentation -fPIC -fvisibility-inlines-hidden -Werror=date-time -Werror=unguarded-availability-new -fmodules -fmodules-cache-path=/Users/buildslave/jenkins/workspace/lldb-cmake/lldb-build/module.cache -fcxx-modules -Xclang -fmodules-local-submodule-visibility -Wall -Wextra -Wno-unused-parameter -Wwrite-strings -Wcast-qual -Wmissing-field-initializers -pedantic -Wno-long-long -Wimplicit-fallthrough -Wcovered-switch-default -Wno-noexcept-type -Wnon-virtual-dtor -Wdelete-non-virtual-dtor -Wsuggest-override -Wstring-conversion -fdiagnostics-color -O3  -isysroot /Applications/Xcode.app/Contents/Developer/Platforms/MacOSX.platform/Developer/SDKs/MacOSX10.15.sdk -fPIC    -fno-exceptions -fno-rtti -UNDEBUG -std=c++14 -MD -MT unittests/Passes/CMakeFiles/TestPlugin.dir/TestPlugin.cpp.o -MF unittests/Passes/CMakeFiles/TestPlugin.dir/TestPlugin.cpp.o.d -o unittests/Passes/CMakeFiles/TestPlugin.dir/TestPlugin.cpp.o -c /Users/buildslave/jenkins/workspace/lldb-cmake/llvm-project/llvm/unittests/Passes/TestPlugin.cpp
[10419/10424] : && /Users/buildslave/jenkins/workspace/lldb-cmake/host-compiler/bin/clang++ -Wdocumentation -fPIC -fvisibility-inlines-hidden -Werror=date-time -Werror=unguarded-availability-new -fmodules -fmodules-cache-path=/Users/buildslave/jenkins/workspace/lldb-cmake/lldb-build/module.cache -fcxx-modules -Xclang -fmodules-local-submodule-visibility -Wall -Wextra -Wno-unused-parameter -Wwrite-strings -Wcast-qual -Wmissing-field-initializers -pedantic -Wno-long-long -Wimplicit-fallthrough -Wcovered-switch-default -Wno-noexcept-type -Wnon-virtual-dtor -Wdelete-non-virtual-dtor -Wsuggest-override -Wstring-conversion -fdiagnostics-color -O3 -isysroot /Applications/Xcode.app/Contents/Developer/Platforms/MacOSX.platform/Developer/SDKs/MacOSX10.15.sdk -bundle -Wl,-headerpad_max_install_names -Wl,-flat_namespace -Wl,-undefined -Wl,suppress   -Wl,-dead_strip -o unittests/Passes/TestPlugin.dylib unittests/Passes/CMakeFiles/TestPlugin.dir/TestPlugin.cpp.o  -Wl,-rpath,@loader_path/../lib && :
[10420/10424] /Users/buildslave/jenkins/workspace/lldb-cmake/host-compiler/bin/clang++  -DGTEST_HAS_RTTI=0 -D_DEBUG -D__STDC_CONSTANT_MACROS -D__STDC_FORMAT_MACROS -D__STDC_LIMIT_MACROS -Itools/llvm-readobj -I/Users/buildslave/jenkins/workspace/lldb-cmake/llvm-project/llvm/tools/llvm-readobj -I/Applications/Xcode.app/Contents/Developer/Platforms/MacOSX.platform/Developer/SDKs/MacOSX10.15.sdk/usr/include/libxml2 -Iinclude -I/Users/buildslave/jenkins/workspace/lldb-cmake/llvm-project/llvm/include -Wdocumentation -fPIC -fvisibility-inlines-hidden -Werror=date-time -Werror=unguarded-availability-new -fmodules -fmodules-cache-path=/Users/buildslave/jenkins/workspace/lldb-cmake/lldb-build/module.cache -fcxx-modules -Xclang -fmodules-local-submodule-visibility -Wall -Wextra -Wno-unused-parameter -Wwrite-strings -Wcast-qual -Wmissing-field-initializers -pedantic -Wno-long-long -Wimplicit-fallthrough -Wcovered-switch-default -Wno-noexcept-type -Wnon-virtual-dtor -Wdelete-non-virtual-dtor -Wsuggest-override -Wstring-conversion -fdiagnostics-color -O3  -isysroot /Applications/Xcode.app/Contents/Developer/Platforms/MacOSX.platform/Developer/SDKs/MacOSX10.15.sdk    -fno-exceptions -fno-rtti -UNDEBUG -std=c++14 -MD -MT tools/llvm-readobj/CMakeFiles/llvm-readobj.dir/ELFDumper.cpp.o -MF tools/llvm-readobj/CMakeFiles/llvm-readobj.dir/ELFDumper.cpp.o.d -o tools/llvm-readobj/CMakeFiles/llvm-readobj.dir/ELFDumper.cpp.o -c /Users/buildslave/jenkins/workspace/lldb-cmake/llvm-project/llvm/tools/llvm-readobj/ELFDumper.cpp
[10421/10424] : && /Users/buildslave/jenkins/workspace/lldb-cmake/host-compiler/bin/clang++  -Wdocumentation -fPIC -fvisibility-inlines-hidden -Werror=date-time -Werror=unguarded-availability-new -fmodules -fmodules-cache-path=/Users/buildslave/jenkins/workspace/lldb-cmake/lldb-build/module.cache -fcxx-modules -Xclang -fmodules-local-submodule-visibility -Wall -Wextra -Wno-unused-parameter -Wwrite-strings -Wcast-qual -Wmissing-field-initializers -pedantic -Wno-long-long -Wimplicit-fallthrough -Wcovered-switch-default -Wno-noexcept-type -Wnon-virtual-dtor -Wdelete-non-virtual-dtor -Wsuggest-override -Wstring-conversion -fdiagnostics-color -O3  -isysroot /Applications/Xcode.app/Contents/Developer/Platforms/MacOSX.platform/Developer/SDKs/MacOSX10.15.sdk -Wl,-search_paths_first -Wl,-headerpad_max_install_names -Wl,-dead_strip tools/llvm-readobj/CMakeFiles/llvm-readobj.dir/ARMWinEHPrinter.cpp.o tools/llvm-readobj/CMakeFiles/llvm-readobj.dir/COFFDumper.cpp.o tools/llvm-readobj/CMakeFiles/llvm-readobj.dir/COFFImportDumper.cpp.o tools/llvm-readobj/CMakeFiles/llvm-readobj.dir/ELFDumper.cpp.o tools/llvm-readobj/CMakeFiles/llvm-readobj.dir/Error.cpp.o tools/llvm-readobj/CMakeFiles/llvm-readobj.dir/llvm-readobj.cpp.o tools/llvm-readobj/CMakeFiles/llvm-readobj.dir/MachODumper.cpp.o tools/llvm-readobj/CMakeFiles/llvm-readobj.dir/ObjDumper.cpp.o tools/llvm-readobj/CMakeFiles/llvm-readobj.dir/WasmDumper.cpp.o tools/llvm-readobj/CMakeFiles/llvm-readobj.dir/Win64EHDumper.cpp.o tools/llvm-readobj/CMakeFiles/llvm-readobj.dir/WindowsResourceDumper.cpp.o tools/llvm-readobj/CMakeFiles/llvm-readobj.dir/XCOFFDumper.cpp.o  -o bin/llvm-readobj  -Wl,-rpath,@loader_path/../lib  lib/libLLVMDebugInfoCodeView.a  lib/libLLVMDebugInfoDWARF.a  lib/libLLVMDemangle.a  lib/libLLVMObject.a  lib/libLLVMBinaryFormat.a  lib/libLLVMSupport.a  lib/libLLVMDebugInfoCodeView.a  lib/libLLVMDebugInfoMSF.a  lib/libLLVMDebugInfoPDB.a  lib/libLLVMObject.a  lib/libLLVMBitReader.a  lib/libLLVMCore.a  lib/libLLVMRemarks.a  lib/libLLVMBitstreamReader.a  lib/libLLVMMCParser.a  lib/libLLVMMC.a  lib/libLLVMDebugInfoCodeView.a  lib/libLLVMTextAPI.a  lib/libLLVMBinaryFormat.a  lib/libLLVMDebugInfoMSF.a  lib/libLLVMSupport.a  lib/libLLVMDemangle.a  -lz  -lcurses  -lm && :
[10422/10424] cd /Users/buildslave/jenkins/workspace/lldb-cmake/lldb-build/tools/llvm-readobj && /usr/local/Cellar/cmake/3.17.2/bin/cmake -E create_symlink llvm-readobj /Users/buildslave/jenkins/workspace/lldb-cmake/lldb-build/./bin/llvm-readelf
[10423/10424] /Users/buildslave/jenkins/workspace/lldb-cmake/host-compiler/bin/clang++  -DGTEST_HAS_RTTI=0 -D_DEBUG -D__STDC_CONSTANT_MACROS -D__STDC_FORMAT_MACROS -D__STDC_LIMIT_MACROS -Itools/obj2yaml -I/Users/buildslave/jenkins/workspace/lldb-cmake/llvm-project/llvm/tools/obj2yaml -I/Applications/Xcode.app/Contents/Developer/Platforms/MacOSX.platform/Developer/SDKs/MacOSX10.15.sdk/usr/include/libxml2 -Iinclude -I/Users/buildslave/jenkins/workspace/lldb-cmake/llvm-project/llvm/include -Wdocumentation -fPIC -fvisibility-inlines-hidden -Werror=date-time -Werror=unguarded-availability-new -fmodules -fmodules-cache-path=/Users/buildslave/jenkins/workspace/lldb-cmake/lldb-build/module.cache -fcxx-modules -Xclang -fmodules-local-submodule-visibility -Wall -Wextra -Wno-unused-parameter -Wwrite-strings -Wcast-qual -Wmissing-field-initializers -pedantic -Wno-long-long -Wimplicit-fallthrough -Wcovered-switch-default -Wno-noexcept-type -Wnon-virtual-dtor -Wdelete-non-virtual-dtor -Wsuggest-override -Wstring-conversion -fdiagnostics-color -O3  -isysroot /Applications/Xcode.app/Contents/Developer/Platforms/MacOSX.platform/Developer/SDKs/MacOSX10.15.sdk    -fno-exceptions -fno-rtti -UNDEBUG -std=c++14 -MD -MT tools/obj2yaml/CMakeFiles/obj2yaml.dir/elf2yaml.cpp.o -MF tools/obj2yaml/CMakeFiles/obj2yaml.dir/elf2yaml.cpp.o.d -o tools/obj2yaml/CMakeFiles/obj2yaml.dir/elf2yaml.cpp.o -c /Users/buildslave/jenkins/workspace/lldb-cmake/llvm-project/llvm/tools/obj2yaml/elf2yaml.cpp
[10424/10424] : && /Users/buildslave/jenkins/workspace/lldb-cmake/host-compiler/bin/clang++  -Wdocumentation -fPIC -fvisibility-inlines-hidden -Werror=date-time -Werror=unguarded-availability-new -fmodules -fmodules-cache-path=/Users/buildslave/jenkins/workspace/lldb-cmake/lldb-build/module.cache -fcxx-modules -Xclang -fmodules-local-submodule-visibility -Wall -Wextra -Wno-unused-parameter -Wwrite-strings -Wcast-qual -Wmissing-field-initializers -pedantic -Wno-long-long -Wimplicit-fallthrough -Wcovered-switch-default -Wno-noexcept-type -Wnon-virtual-dtor -Wdelete-non-virtual-dtor -Wsuggest-override -Wstring-conversion -fdiagnostics-color -O3  -isysroot /Applications/Xcode.app/Contents/Developer/Platforms/MacOSX.platform/Developer/SDKs/MacOSX10.15.sdk -Wl,-search_paths_first -Wl,-headerpad_max_install_names -Wl,-dead_strip tools/obj2yaml/CMakeFiles/obj2yaml.dir/obj2yaml.cpp.o tools/obj2yaml/CMakeFiles/obj2yaml.dir/coff2yaml.cpp.o tools/obj2yaml/CMakeFiles/obj2yaml.dir/dwarf2yaml.cpp.o tools/obj2yaml/CMakeFiles/obj2yaml.dir/elf2yaml.cpp.o tools/obj2yaml/CMakeFiles/obj2yaml.dir/macho2yaml.cpp.o tools/obj2yaml/CMakeFiles/obj2yaml.dir/minidump2yaml.cpp.o tools/obj2yaml/CMakeFiles/obj2yaml.dir/xcoff2yaml.cpp.o tools/obj2yaml/CMakeFiles/obj2yaml.dir/wasm2yaml.cpp.o tools/obj2yaml/CMakeFiles/obj2yaml.dir/Error.cpp.o  -o bin/obj2yaml  -Wl,-rpath,@loader_path/../lib  lib/libLLVMBinaryFormat.a  lib/libLLVMDebugInfoCodeView.a  lib/libLLVMDebugInfoDWARF.a  lib/libLLVMObject.a  lib/libLLVMObjectYAML.a  lib/libLLVMSupport.a  lib/libLLVMObject.a  lib/libLLVMBitReader.a  lib/libLLVMCore.a  lib/libLLVMRemarks.a  lib/libLLVMBitstreamReader.a  lib/libLLVMMCParser.a  lib/libLLVMTextAPI.a  lib/libLLVMMC.a  lib/libLLVMBinaryFormat.a  lib/libLLVMDebugInfoCodeView.a  lib/libLLVMDebugInfoMSF.a  lib/libLLVMSupport.a  -lz  -lcurses  -lm  lib/libLLVMDemangle.a && :
Completed at: 2020-08-10T13:18:58
@@@@@@
[Pipeline] }
[Pipeline] // timeout
[Pipeline] }
[Pipeline] // stage
[Pipeline] stage
[Pipeline] { (Test)
[Pipeline] timeout
Timeout set to expire in 1 hr 0 min
[Pipeline] {
[Pipeline] sh
+ set -u
+ export PATH=/usr/local/bin:/usr/local/sbin:/usr/bin:/bin:/usr/sbin:/sbin:/usr/bin:/usr/local/bin
+ PATH=/usr/local/bin:/usr/local/sbin:/usr/bin:/bin:/usr/sbin:/sbin:/usr/bin:/usr/local/bin
+ export LLDB_CAPTURE_REPRODUCER=1
+ LLDB_CAPTURE_REPRODUCER=1
+ rm -rf test/results.xml
++ sysctl hw.physicalcpu
++ awk '{print $2}'
+ export MAX_PARALLEL_TESTS=4
+ MAX_PARALLEL_TESTS=4
+ python llvm-zorg/zorg/jenkins/monorepo_build.py lldb-cmake testlong
You are using pip version 18.1, however version 20.2.1 is available.
You should consider upgrading via the 'pip install --upgrade pip' command.
You are using pip version 18.1, however version 20.2.1 is available.
You should consider upgrading via the 'pip install --upgrade pip' command.
Dependency met os_version v10.15.5
Dependency met brew cmake v3.17.2
Dependency met brew ninja v1.8.2
Dependency met pip psutil v5.4.5
Dependency met pip six v1.11.0
Dependency met xcode v11.5
Clean

Hide Details

@@@ Clean @@@ Removing module cache: /Users/buildslave/jenkins/workspace/lldb-cmake/lldb-build/module.cache Completed at: 2020-08-10T13:19:47 @@@@@@
Run Debug Info Tests

Hide Details

@@@ Run Debug Info Tests @@@ cd /Users/buildslave/jenkins/workspace/lldb-cmake/lldb-build '/usr/local/bin/ninja' '-v' 'check-debuginfo' [1/3] cd /Users/buildslave/jenkins/workspace/lldb-cmake/lldb-build/tools/lldb && /usr/local/Cellar/cmake/3.17.2/bin/cmake -E make_directory /Users/buildslave/jenkins/workspace/lldb-cmake/lldb-build/./lib/python3.7/site-packages/lldb [2/3] cd /Users/buildslave/jenkins/workspace/lldb-cmake/lldb-build/tools/lldb && /usr/local/Cellar/cmake/3.17.2/bin/cmake -E copy /Users/buildslave/jenkins/workspace/lldb-cmake/llvm-project/lldb/third_party/Python/module/six/six.py /Users/buildslave/jenkins/workspace/lldb-cmake/lldb-build/./lib/python3.7/site-packages/lldb/../six.py && cd /Users/buildslave/jenkins/workspace/lldb-cmake/lldb-build/tools/lldb && /usr/local/Cellar/cmake/3.17.2/bin/cmake -E copy /Users/buildslave/jenkins/workspace/lldb-cmake/lldb-build/tools/lldb/bindings/lldb.py /Users/buildslave/jenkins/workspace/lldb-cmake/lldb-build/./lib/python3.7/site-packages/lldb/__init__.py && cd /Users/buildslave/jenkins/workspace/lldb-cmake/lldb-build/tools/lldb && /usr/local/Cellar/cmake/3.17.2/bin/cmake -E copy /Users/buildslave/jenkins/workspace/lldb-cmake/llvm-project/lldb/source/Interpreter/embedded_interpreter.py /Users/buildslave/jenkins/workspace/lldb-cmake/lldb-build/./lib/python3.7/site-packages/lldb && cd /Users/buildslave/jenkins/workspace/lldb-cmake/lldb-build/lib/python3.7/site-packages/lldb && /usr/local/Cellar/cmake/3.17.2/bin/cmake -E make_directory formatters/cpp && /usr/local/Cellar/cmake/3.17.2/bin/cmake -E copy /Users/buildslave/jenkins/workspace/lldb-cmake/llvm-project/lldb/examples/synthetic/gnu_libstdcpp.py /Users/buildslave/jenkins/workspace/lldb-cmake/llvm-project/lldb/examples/synthetic/libcxx.py formatters/cpp && /usr/local/Frameworks/Python.framework/Versions/3.7/bin/python3.7 /Users/buildslave/jenkins/workspace/lldb-cmake/llvm-project/lldb/bindings/python/createPythonInit.py formatters/cpp /Users/buildslave/jenkins/workspace/lldb-cmake/llvm-project/lldb/examples/synthetic/gnu_libstdcpp.py /Users/buildslave/jenkins/workspace/lldb-cmake/llvm-project/lldb/examples/synthetic/libcxx.py && cd /Users/buildslave/jenkins/workspace/lldb-cmake/lldb-build/lib/python3.7/site-packages/lldb && /usr/local/Cellar/cmake/3.17.2/bin/cmake -E make_directory formatters && /usr/local/Cellar/cmake/3.17.2/bin/cmake -E copy /Users/buildslave/jenkins/workspace/lldb-cmake/llvm-project/lldb/examples/summaries/cocoa/cache.py /Users/buildslave/jenkins/workspace/lldb-cmake/llvm-project/lldb/examples/summaries/synth.py /Users/buildslave/jenkins/workspace/lldb-cmake/llvm-project/lldb/examples/summaries/cocoa/metrics.py /Users/buildslave/jenkins/workspace/lldb-cmake/llvm-project/lldb/examples/summaries/cocoa/attrib_fromdict.py /Users/buildslave/jenkins/workspace/lldb-cmake/llvm-project/lldb/examples/summaries/cocoa/Logger.py formatters && /usr/local/Frameworks/Python.framework/Versions/3.7/bin/python3.7 /Users/buildslave/jenkins/workspace/lldb-cmake/llvm-project/lldb/bindings/python/createPythonInit.py formatters /Users/buildslave/jenkins/workspace/lldb-cmake/llvm-project/lldb/examples/summaries/cocoa/cache.py /Users/buildslave/jenkins/workspace/lldb-cmake/llvm-project/lldb/examples/summaries/synth.py /Users/buildslave/jenkins/workspace/lldb-cmake/llvm-project/lldb/examples/summaries/cocoa/metrics.py /Users/buildslave/jenkins/workspace/lldb-cmake/llvm-project/lldb/examples/summaries/cocoa/attrib_fromdict.py /Users/buildslave/jenkins/workspace/lldb-cmake/llvm-project/lldb/examples/summaries/cocoa/Logger.py && cd /Users/buildslave/jenkins/workspace/lldb-cmake/lldb-build/lib/python3.7/site-packages/lldb && /usr/local/Cellar/cmake/3.17.2/bin/cmake -E make_directory utils && /usr/local/Cellar/cmake/3.17.2/bin/cmake -E copy /Users/buildslave/jenkins/workspace/lldb-cmake/llvm-project/lldb/examples/python/in_call_stack.py /Users/buildslave/jenkins/workspace/lldb-cmake/llvm-project/lldb/examples/python/symbolication.py utils && /usr/local/Frameworks/Python.framework/Versions/3.7/bin/python3.7 /Users/buildslave/jenkins/workspace/lldb-cmake/llvm-project/lldb/bindings/python/createPythonInit.py utils /Users/buildslave/jenkins/workspace/lldb-cmake/llvm-project/lldb/examples/python/in_call_stack.py /Users/buildslave/jenkins/workspace/lldb-cmake/llvm-project/lldb/examples/python/symbolication.py && cd /Users/buildslave/jenkins/workspace/lldb-cmake/lldb-build/lib/python3.7/site-packages/lldb && /usr/local/Cellar/cmake/3.17.2/bin/cmake -E make_directory macosx && /usr/local/Cellar/cmake/3.17.2/bin/cmake -E copy /Users/buildslave/jenkins/workspace/lldb-cmake/llvm-project/lldb/examples/python/crashlog.py /Users/buildslave/jenkins/workspace/lldb-cmake/llvm-project/lldb/examples/darwin/heap_find/heap.py macosx && /usr/local/Frameworks/Python.framework/Versions/3.7/bin/python3.7 /Users/buildslave/jenkins/workspace/lldb-cmake/llvm-project/lldb/bindings/python/createPythonInit.py macosx /Users/buildslave/jenkins/workspace/lldb-cmake/llvm-project/lldb/examples/python/crashlog.py /Users/buildslave/jenkins/workspace/lldb-cmake/llvm-project/lldb/examples/darwin/heap_find/heap.py && cd /Users/buildslave/jenkins/workspace/lldb-cmake/lldb-build/lib/python3.7/site-packages/lldb && /usr/local/Cellar/cmake/3.17.2/bin/cmake -E make_directory macosx/heap && /usr/local/Cellar/cmake/3.17.2/bin/cmake -E copy /Users/buildslave/jenkins/workspace/lldb-cmake/llvm-project/lldb/examples/darwin/heap_find/heap/heap_find.cpp /Users/buildslave/jenkins/workspace/lldb-cmake/llvm-project/lldb/examples/darwin/heap_find/heap/Makefile macosx/heap && cd /Users/buildslave/jenkins/workspace/lldb-cmake/lldb-build/lib/python3.7/site-packages/lldb && /usr/local/Cellar/cmake/3.17.2/bin/cmake -E make_directory diagnose && /usr/local/Cellar/cmake/3.17.2/bin/cmake -E copy /Users/buildslave/jenkins/workspace/lldb-cmake/llvm-project/lldb/examples/python/diagnose_unwind.py /Users/buildslave/jenkins/workspace/lldb-cmake/llvm-project/lldb/examples/python/diagnose_nsstring.py diagnose && /usr/local/Frameworks/Python.framework/Versions/3.7/bin/python3.7 /Users/buildslave/jenkins/workspace/lldb-cmake/llvm-project/lldb/bindings/python/createPythonInit.py diagnose /Users/buildslave/jenkins/workspace/lldb-cmake/llvm-project/lldb/examples/python/diagnose_unwind.py /Users/buildslave/jenkins/workspace/lldb-cmake/llvm-project/lldb/examples/python/diagnose_nsstring.py && cd /Users/buildslave/jenkins/workspace/lldb-cmake/lldb-build/lib/python3.7/site-packages/lldb && /usr/local/Cellar/cmake/3.17.2/bin/cmake -E create_symlink ../../../liblldb.dylib _lldb.so && cd /Users/buildslave/jenkins/workspace/lldb-cmake/lldb-build/lib/python3.7/site-packages/lldb && /usr/local/Cellar/cmake/3.17.2/bin/cmake -E create_symlink ../../../../bin/lldb-argdumper lldb-argdumper [2/3] cd /Users/buildslave/jenkins/workspace/lldb-cmake/lldb-build/projects/debuginfo-tests && /usr/local/Frameworks/Python.framework/Versions/3.7/bin/python3.7 /Users/buildslave/jenkins/workspace/lldb-cmake/lldb-build/./bin/llvm-lit -v --time-tests --shuffle --xunit-xml-output=/Users/buildslave/jenkins/workspace/lldb-cmake/test/results.xml -v /Users/buildslave/jenkins/workspace/lldb-cmake/lldb-build/projects/debuginfo-tests -- Testing: 60 tests, 8 workers -- llvm-lit: /Users/buildslave/jenkins/workspace/lldb-cmake/lldb-build/bin/../../llvm-project/llvm/utils/lit/lit/llvm/config.py:345: note: using clang: /Users/buildslave/jenkins/workspace/lldb-cmake/lldb-build/bin/clang llvm-lit: /Users/buildslave/jenkins/workspace/lldb-cmake/lldb-build/bin/../../llvm-project/llvm/utils/lit/lit/llvm/config.py:345: note: using clang++: /Users/buildslave/jenkins/workspace/lldb-cmake/lldb-build/bin/clang++ llvm-lit: /Users/buildslave/jenkins/workspace/lldb-cmake/lldb-build/bin/../../llvm-project/llvm/utils/lit/lit/llvm/config.py:345: note: using clang-cl: /Users/buildslave/jenkins/workspace/lldb-cmake/lldb-build/bin/clang-cl llvm-lit: /Users/buildslave/jenkins/workspace/lldb-cmake/lldb-build/bin/../../llvm-project/llvm/utils/lit/lit/llvm/config.py:345: note: using lldb: /Users/buildslave/jenkins/workspace/lldb-cmake/lldb-build/bin/lldb llvm-lit: /Users/buildslave/jenkins/workspace/lldb-cmake/lldb-build/bin/../../llvm-project/llvm/utils/lit/lit/util.py:408: note: using SDKROOT: '/Applications/Xcode.app/Contents/Developer/Platforms/MacOSX.platform/Developer/SDKs/MacOSX10.15.sdk' UNSUPPORTED: debuginfo-tests :: dexter-tests/nrvo.cpp (1 of 60) UNSUPPORTED: debuginfo-tests :: dexter-tests/inline-line-gap.cpp (2 of 60) UNSUPPORTED: debuginfo-tests :: dexter/feature_tests/commands/penalty/expect_step_order.cpp (3 of 60) UNSUPPORTED: debuginfo-tests :: dexter/feature_tests/commands/penalty/expect_step_kinds.cpp (4 of 60) PASS: debuginfo-tests :: llgdb-tests/apple-accel.cpp (5 of 60) PASS: debuginfo-tests :: dexter/feature_tests/subtools/test/err_type_mline.cpp (6 of 60) UNSUPPORTED: debuginfo-tests :: dexter/feature_tests/commands/perfect/expect_step_kind/recursive.cpp (7 of 60) PASS: debuginfo-tests :: dexter-tests/ctor.cpp (8 of 60) UNSUPPORTED: debuginfo-tests :: dexter/feature_tests/commands/perfect/expect_program_state.cpp (9 of 60) UNSUPPORTED: debuginfo-tests :: dexter/feature_tests/subtools/clang-opt-bisect/clang-opt-bisect.cpp (10 of 60) UNSUPPORTED: debuginfo-tests :: dexter/feature_tests/commands/perfect/limit_steps/limit_steps_check_json_step_count.cpp (11 of 60) UNSUPPORTED: debuginfo-tests :: dexter/feature_tests/commands/penalty/expect_watch_value.cpp (12 of 60) PASS: debuginfo-tests :: llgdb-tests/static-member.cpp (13 of 60) PASS: debuginfo-tests :: dexter/feature_tests/subtools/test/err_syntax_mline.cpp (14 of 60) PASS: debuginfo-tests :: dexter/feature_tests/subtools/help/help.test (15 of 60) PASS: debuginfo-tests :: llgdb-tests/asan-blocks.c (16 of 60) PASS: debuginfo-tests :: llgdb-tests/blocks.m (17 of 60) FAIL: debuginfo-tests :: llgdb-tests/foreach.m (18 of 60) ******************** TEST 'debuginfo-tests :: llgdb-tests/foreach.m' FAILED ******************** Script: -- : 'RUN: at line 1'; /Users/buildslave/jenkins/workspace/lldb-cmake/lldb-build/bin/clang --target=x86_64-apple-darwin19.5.0 -O0 -g /Users/buildslave/jenkins/workspace/lldb-cmake/llvm-project/debuginfo-tests/llgdb-tests/foreach.m -c -o /Users/buildslave/jenkins/workspace/lldb-cmake/lldb-build/projects/debuginfo-tests/llgdb-tests/Output/foreach.m.tmp.o : 'RUN: at line 2'; /Users/buildslave/jenkins/workspace/lldb-cmake/lldb-build/bin/clang --target=x86_64-apple-darwin19.5.0 /Users/buildslave/jenkins/workspace/lldb-cmake/lldb-build/projects/debuginfo-tests/llgdb-tests/Output/foreach.m.tmp.o -o /Users/buildslave/jenkins/workspace/lldb-cmake/lldb-build/projects/debuginfo-tests/llgdb-tests/Output/foreach.m.tmp.out -framework Foundation : 'RUN: at line 3'; /Users/buildslave/jenkins/workspace/lldb-cmake/llvm-project/debuginfo-tests/llgdb-tests/test_debuginfo.pl /Users/buildslave/jenkins/workspace/lldb-cmake/llvm-project/debuginfo-tests/llgdb-tests/foreach.m /Users/buildslave/jenkins/workspace/lldb-cmake/lldb-build/projects/debuginfo-tests/llgdb-tests/Output/foreach.m.tmp.out -- Exit Code: 1

Hide Details

Command Output (stdout): -- Debugger output was: imported lldb from: "/Applications/Xcode.app/Contents/SharedFrameworks/LLDB.framework/Versions/A/Resources/Python" > break 25 SBBreakpoint: id = 1, file = '/Users/buildslave/jenkins/workspace/lldb-cmake/llvm-project/debuginfo-tests/llgdb-tests/foreach.m', line = 25, exact_match = 0, locations = 1 > r success > po thing (NSString *) $0 = 0x00000001000010a0 > quit

Hide Details

-- Command Output (stderr): -- /Users/buildslave/jenkins/workspace/lldb-cmake/llvm-project/debuginfo-tests/llgdb-tests/foreach.m:11:11: error: CHECK: expected string not found in input // CHECK: aaa ^ /Users/buildslave/jenkins/workspace/lldb-cmake/lldb-build/projects/debuginfo-tests/llgdb-tests/Output/foreach.m.gdb.output:1:1: note: scanning from here imported lldb from: "/Applications/Xcode.app/Contents/SharedFrameworks/LLDB.framework/Versions/A/Resources/Python" ^ /Users/buildslave/jenkins/workspace/lldb-cmake/lldb-build/projects/debuginfo-tests/llgdb-tests/Output/foreach.m.gdb.output:1:27: note: possible intended match here imported lldb from: "/Applications/Xcode.app/Contents/SharedFrameworks/LLDB.framework/Versions/A/Resources/Python" ^

Hide Details

Input file: /Users/buildslave/jenkins/workspace/lldb-cmake/lldb-build/projects/debuginfo-tests/llgdb-tests/Output/foreach.m.gdb.output Check file: /Users/buildslave/jenkins/workspace/lldb-cmake/llvm-project/debuginfo-tests/llgdb-tests/foreach.m

Hide Details

-dump-input=help explains the following input dump.

Hide Details

Input was: <<<<<< 1: imported lldb from: "/Applications/Xcode.app/Contents/SharedFrameworks/LLDB.framework/Versions/A/Resources/Python" check:11'0 X~~~~~~~~~~~~~~~~~~~~~~~~~~~~~~~~~~~~~~~~~~~~~~~~~~~~~~~~~~~~~~~~~~~~~~~~~~~~~~~~~~~~~~~~~~~~~~~~~~~~~~~~~~~~~~~~~ error: no match found check:11'1 ? possible intended match 2: > break 25 check:11'0 ~~~~~~~~~~ 3: SBBreakpoint: id = 1, file = '/Users/buildslave/jenkins/workspace/lldb-cmake/llvm-project/debuginfo-tests/llgdb-tests/foreach.m', line = 25, exact_match = 0, locations = 1 check:11'0 ~~~~~~~~~~~~~~~~~~~~~~~~~~~~~~~~~~~~~~~~~~~~~~~~~~~~~~~~~~~~~~~~~~~~~~~~~~~~~~~~~~~~~~~~~~~~~~~~~~~~~~~~~~~~~~~~~~~~~~~~~~~~~~~~~~~~~~~~~~~~~~~~~~~~~~~~~~~~~~~~~~~~~~~~~~~ 4: > r check:11'0 ~~~ 5: success check:11'0 ~~~~~~~ 6: > po thing check:11'0 ~~~~~~~~~~ . . . >>>>>>

Hide Details

--

Hide Details

******************** UNSUPPORTED: debuginfo-tests :: dexter/feature_tests/commands/perfect/expect_step_kind/direction.cpp (19 of 60) UNSUPPORTED: debuginfo-tests :: dexter-tests/realigned-frame.cpp (20 of 60) PASS: debuginfo-tests :: dexter/feature_tests/subtools/test/err_paren.cpp (21 of 60) UNSUPPORTED: debuginfo-tests :: dexter/feature_tests/commands/perfect/expect_step_kind/small_loop.cpp (22 of 60) PASS: debuginfo-tests :: dexter/feature_tests/subtools/view.cpp (23 of 60) UNSUPPORTED: debuginfo-tests :: dexter/feature_tests/commands/penalty/unreachable.cpp (24 of 60) PASS: debuginfo-tests :: dexter-tests/asan.c (25 of 60) UNSUPPORTED: debuginfo-tests :: dexter/feature_tests/commands/penalty/expect_program_state.cpp (26 of 60) PASS: debuginfo-tests :: dexter/feature_tests/subtools/list-debuggers/list-debuggers.test (27 of 60) UNSUPPORTED: debuginfo-tests :: dexter/feature_tests/commands/perfect/limit_steps/limit_steps_expect_value.cpp (28 of 60) PASS: debuginfo-tests :: dexter/feature_tests/subtools/test/err_syntax.cpp (29 of 60) PASS: debuginfo-tests :: dexter-tests/stack-var.c (30 of 60) PASS: debuginfo-tests :: dexter-tests/vla.c (31 of 60) XFAIL: debuginfo-tests :: dexter-tests/asan-deque.cpp (32 of 60) UNSUPPORTED: debuginfo-tests :: dexter/feature_tests/commands/perfect/limit_steps/limit_steps_overlapping_ranges.cpp (33 of 60) UNSUPPORTED: debuginfo-tests :: dexter/feature_tests/commands/penalty/expect_watch_type.cpp (34 of 60) PASS: debuginfo-tests :: dexter/feature_tests/subtools/test/err_paren_mline.cpp (35 of 60) UNSUPPORTED: debuginfo-tests :: dexter/feature_tests/commands/perfect/expect_watch_value.cpp (36 of 60) UNSUPPORTED: debuginfo-tests :: llgdb-tests/safestack.c (37 of 60) UNSUPPORTED: debuginfo-tests :: dexter/feature_tests/commands/perfect/expect_step_order.cpp (38 of 60) PASS: debuginfo-tests :: dexter-tests/aggregate-indirect-arg.cpp (39 of 60) UNSUPPORTED: debuginfo-tests :: dexter/feature_tests/commands/perfect/unreachable.cpp (40 of 60) UNSUPPORTED: debuginfo-tests :: dexter/feature_tests/commands/perfect/expect_step_kind/func.cpp (41 of 60) UNSUPPORTED: debuginfo-tests :: dexter/feature_tests/commands/perfect/expect_watch_type.cpp (42 of 60) PASS: debuginfo-tests :: dexter/feature_tests/unittests/run.test (43 of 60) PASS: debuginfo-tests :: dexter-tests/dbg-arg.c (44 of 60) PASS: debuginfo-tests :: llgdb-tests/nested-struct.cpp (45 of 60) PASS: debuginfo-tests :: dexter/feature_tests/subtools/test/err_type.cpp (46 of 60) UNSUPPORTED: debuginfo-tests :: dexter/feature_tests/commands/perfect/limit_steps/limit_steps_expect_loop.cpp (47 of 60) UNSUPPORTED: debuginfo-tests :: dexter/feature_tests/commands/perfect/limit_steps/limit_steps_same_line_conditional.cpp (48 of 60) PASS: debuginfo-tests :: llgdb-tests/forward-declare-class.cpp (49 of 60) UNSUPPORTED: debuginfo-tests :: llvm-prettyprinters/gdb/llvm-support.gdb (50 of 60) UNSUPPORTED: debuginfo-tests :: dexter-tests/global-constant.cpp (51 of 60) UNSUPPORTED: debuginfo-tests :: dexter-tests/hello.c (52 of 60) UNSUPPORTED: debuginfo-tests :: dexter/feature_tests/commands/perfect/expect_step_kind/func_external.cpp (53 of 60) PASS: debuginfo-tests :: llgdb-tests/nrvo-string.cpp (54 of 60) PASS: debuginfo-tests :: llgdb-tests/block_var.m (55 of 60) XFAIL: debuginfo-tests :: llgdb-tests/static-member-2.cpp (56 of 60) PASS: debuginfo-tests :: dexter/feature_tests/subtools/test/source-root-dir.cpp (57 of 60) PASS: debuginfo-tests :: dexter-tests/nrvo-string.cpp (58 of 60) PASS: debuginfo-tests :: llgdb-tests/asan.c (59 of 60) PASS: debuginfo-tests :: llgdb-tests/asan-deque.cpp (60 of 60) Slowest Tests: -------------------------------------------------------------------------- 42.20s: debuginfo-tests :: dexter-tests/asan-deque.cpp 42.07s: debuginfo-tests :: dexter-tests/vla.c 40.87s: debuginfo-tests :: dexter-tests/asan.c 40.71s: debuginfo-tests :: dexter/feature_tests/subtools/view.cpp 38.94s: debuginfo-tests :: llgdb-tests/asan-blocks.c 38.09s: debuginfo-tests :: llgdb-tests/foreach.m 32.39s: debuginfo-tests :: llgdb-tests/blocks.m 25.36s: debuginfo-tests :: dexter-tests/ctor.cpp 15.30s: debuginfo-tests :: dexter-tests/aggregate-indirect-arg.cpp 6.50s: debuginfo-tests :: dexter/feature_tests/subtools/test/err_type_mline.cpp 5.62s: debuginfo-tests :: dexter-tests/nrvo-string.cpp 4.87s: debuginfo-tests :: llgdb-tests/nrvo-string.cpp 3.48s: debuginfo-tests :: llgdb-tests/asan-deque.cpp 3.08s: debuginfo-tests :: dexter-tests/stack-var.c 2.64s: debuginfo-tests :: llgdb-tests/block_var.m 2.32s: debuginfo-tests :: dexter-tests/dbg-arg.c 2.15s: debuginfo-tests :: dexter/feature_tests/subtools/test/source-root-dir.cpp 1.63s: debuginfo-tests :: llgdb-tests/asan.c 1.15s: debuginfo-tests :: llgdb-tests/static-member-2.cpp 1.15s: debuginfo-tests :: llgdb-tests/nested-struct.cpp

Hide Details

Tests Times: -------------------------------------------------------------------------- [ Range ] :: [ Percentage ] :: [Count] -------------------------------------------------------------------------- [42.0s,44.0s) :: [** ] :: [ 4/60] [40.0s,42.0s) :: [ ] :: [ 1/60] [38.0s,40.0s) :: [ ] :: [ 1/60] [36.0s,38.0s) :: [ ] :: [ 0/60] [34.0s,36.0s) :: [ ] :: [ 0/60] [32.0s,34.0s) :: [ ] :: [ 1/60] [30.0s,32.0s) :: [ ] :: [ 0/60] [28.0s,30.0s) :: [ ] :: [ 0/60] [26.0s,28.0s) :: [ ] :: [ 1/60] [24.0s,26.0s) :: [ ] :: [ 0/60] [22.0s,24.0s) :: [ ] :: [ 0/60] [20.0s,22.0s) :: [ ] :: [ 0/60] [18.0s,20.0s) :: [ ] :: [ 0/60] [16.0s,18.0s) :: [ ] :: [ 0/60] [14.0s,16.0s) :: [ ] :: [ 1/60] [12.0s,14.0s) :: [ ] :: [ 0/60] [10.0s,12.0s) :: [ ] :: [ 0/60] [ 8.0s,10.0s) :: [ ] :: [ 0/60] [ 6.0s, 8.0s) :: [ ] :: [ 1/60] [ 4.0s, 6.0s) :: [* ] :: [ 2/60] [ 2.0s, 4.0s) :: [*** ] :: [ 5/60] [ 0.0s, 2.0s) :: [**************************** ] :: [43/60] -------------------------------------------------------------------------- ******************** Failed Tests (1): debuginfo-tests :: llgdb-tests/foreach.m

Hide Details

Hide Details

Testing Time: 46.31s Unsupported : 29 Passed : 28 Expectedly Failed: 2 Failed : 1 FAILED: projects/debuginfo-tests/CMakeFiles/check-debuginfo cd /Users/buildslave/jenkins/workspace/lldb-cmake/lldb-build/projects/debuginfo-tests && /usr/local/Frameworks/Python.framework/Versions/3.7/bin/python3.7 /Users/buildslave/jenkins/workspace/lldb-cmake/lldb-build/./bin/llvm-lit -v --time-tests --shuffle --xunit-xml-output=/Users/buildslave/jenkins/workspace/lldb-cmake/test/results.xml -v /Users/buildslave/jenkins/workspace/lldb-cmake/lldb-build/projects/debuginfo-tests ninja: build stopped: subcommand failed. Command failed: Command '['/usr/local/bin/ninja', '-v', 'check-debuginfo']' returned non-zero exit status 1 Command: ['/usr/local/bin/ninja', '-v', 'check-debuginfo'] [Pipeline] } [Pipeline] // timeout [Pipeline] } [Pipeline] // stage [Pipeline] stage [Pipeline] { (Declarative: Post Actions) [Pipeline] scanForIssues [Clang (LLVM based)] Sleeping for 5 seconds due to JENKINS-32191... [Clang (LLVM based)] Parsing console log (workspace: '/Users/buildslave/jenkins/workspace/lldb-cmake') [Clang (LLVM based)] Successfully parsed console log [Clang (LLVM based)] -> found 22 issues (skipped 76 duplicates) [Clang (LLVM based)] Post processing issues on 'green-dragon-10' with source code encoding 'UTF-8' [Clang (LLVM based)] Creating SCM blamer to obtain author and commit information for affected files [Clang (LLVM based)] Creating SCM miner to obtain statistics for affected repository files [Clang (LLVM based)] Resolving file names for all issues in source directory '/Users/buildslave/jenkins/workspace/lldb-cmake' [Clang (LLVM based)] -> resolved paths in source directory (14 found, 0 not found) [Clang (LLVM based)] Resolving module names from module definitions (build.xml, pom.xml, or Manifest.mf files) [Clang (LLVM based)] -> resolved module names for 22 issues [Clang (LLVM based)] Resolving package names (or namespaces) by parsing the affected files [Clang (LLVM based)] -> resolved package names of 11 affected files [Clang (LLVM based)] No filter has been set, publishing all 18 issues [Clang (LLVM based)] Creating fingerprints for all affected code blocks to track issues over different builds [Clang (LLVM based)] -> created fingerprints for 18 issues (skipped 0 issues) [Clang (LLVM based)] Copying affected files to Jenkins' build folder '/Users/Shared/Jenkins/Home/jobs/lldb-cmake/builds/23317/files-with-issues' [Clang (LLVM based)] -> 9 copied, 2 not in workspace, 0 not-found, 0 with I/O error [Pipeline] junit Recording test results [Pipeline] emailext Warning: thakis@chromium.org is not a recognized user, but sending mail anyway Warning: i@maskray.me is not a recognized user, but sending mail anyway Warning: james.henderson@sony.com is not a recognized user, but sending mail anyway Warning: jurahul@google.com is not a recognized user, but sending mail anyway Warning: alexandre.ganea@ubisoft.com is not a recognized user, but sending mail anyway Warning: thomasraoux@google.com is not a recognized user, but sending mail anyway Warning: echristo@gmail.com is not a recognized user, but sending mail anyway Warning: zinenko@google.com is not a recognized user, but sending mail anyway Warning: aqjune@gmail.com is not a recognized user, but sending mail anyway Warning: Xiangling.Liao@ibm.com is not a recognized user, but sending mail anyway Warning: sam.parker@arm.com is not a recognized user, but sending mail anyway Warning: pklausler@nvidia.com is not a recognized user, but sending mail anyway Warning: craig.topper@intel.com is not a recognized user, but sending mail anyway Warning: Matthew.Arsenault@amd.com is not a recognized user, but sending mail anyway Warning: platonov.aleksandr@huawei.com is not a recognized user, but sending mail anyway Warning: jasonliu.development@gmail.com is not a recognized user, but sending mail anyway Warning: aardappel@gmail.com is not a recognized user, but sending mail anyway Warning: flo@fhahn.com is not a recognized user, but sending mail anyway Warning: richard@metafoo.co.uk is not a recognized user, but sending mail anyway Warning: ikudrin@accesssoftek.com is not a recognized user, but sending mail anyway Warning: zeratul976@hotmail.com is not a recognized user, but sending mail anyway Warning: qiucofan@cn.ibm.com is not a recognized user, but sending mail anyway Warning: mtrofin@google.com is not a recognized user, but sending mail anyway Warning: stefanp@kuat.aus.stglabs.ibm.com is not a recognized user, but sending mail anyway Warning: michael.hliao@gmail.com is not a recognized user, but sending mail anyway Warning: kparzysz@codeaurora.org is not a recognized user, but sending mail anyway Warning: hokein.wu@gmail.com is not a recognized user, but sending mail anyway Warning: ecaldas@google.com is not a recognized user, but sending mail anyway Warning: csigg@google.com is not a recognized user, but sending mail anyway Warning: sbc@chromium.org is not a recognized user, but sending mail anyway Warning: Petar.Avramovic@rt-rk.com is not a recognized user, but sending mail anyway Warning: spatel@rotateright.com is not a recognized user, but sending mail anyway Warning: kazu@google.com is not a recognized user, but sending mail anyway Warning: Alexander.Richardson@cl.cam.ac.uk is not a recognized user, but sending mail anyway Warning: adamcz@google.com is not a recognized user, but sending mail anyway Warning: jbcoe@google.com is not a recognized user, but sending mail anyway Warning: llvmgnsyncbot@gmail.com is not a recognized user, but sending mail anyway Warning: shuhong.liu@ibm.com is not a recognized user, but sending mail anyway Warning: richard.barton@arm.com is not a recognized user, but sending mail anyway Warning: llvm-dev@redking.me.uk is not a recognized user, but sending mail anyway

Hide Details

Begin Pre-Send Script... Sending email to: Erik Pilkington <epilkington@apple.com> Erik Pilkington <epilkington@apple.com> Azhar Mohammed <azhar@apple.com>
[Pipeline] } [Pipeline] // stage [Pipeline] } [Pipeline] // withEnv [Pipeline] } [Pipeline] // node [Pipeline] End of Pipeline ERROR: script returned exit code 1 Finished: FAILURE