FailedConsole Output

Skipping 9,607 KB.. Full Log
st.PeekData (1108 of 2129)
PASS: lldb-api :: lang/objc/modules-update/TestClangModulesUpdate.py (1109 of 2129)
UNSUPPORTED: lldb-api :: functionalities/longjmp/TestLongjmp.py (1110 of 2129)
PASS: lldb-unit :: Utility/./UtilityTests/OptionsWithRawTest.ArgsButNoDelimiter (1111 of 2129)
PASS: lldb-shell :: Reproducer/TestDebugSymbols.test (1112 of 2129)
PASS: lldb-unit :: Platform/Android/./AdbClientTests/AdbClientTest.CreateByDeviceId (1113 of 2129)
PASS: lldb-api :: commands/expression/completion-crash-incomplete-record/TestCompletionCrashIncompleteRecord.py (1114 of 2129)
PASS: lldb-api :: commands/expression/scoped_enums/TestScopedEnumType.py (1115 of 2129)
PASS: lldb-unit :: Utility/./UtilityTests/StructuredDataTest.ParseJSONFromFile (1116 of 2129)
PASS: lldb-unit :: Core/./LLDBCoreTests/RichManglingContextTest.IPDRealloc (1117 of 2129)
PASS: lldb-api :: functionalities/tsan/thread_leak/TestTsanThreadLeak.py (1118 of 2129)
PASS: lldb-api :: commands/gui/viewlarge/TestGuiViewLarge.py (1119 of 2129)
PASS: lldb-unit :: SymbolFile/NativePDB/./SymbolFileNativePDBTests/PDBFPOProgramToDWARFExpressionTests.UnknownOp (1120 of 2129)
PASS: lldb-unit :: Utility/./UtilityTests/StateTest.Formatv (1121 of 2129)
PASS: lldb-api :: lang/objc/orderedset/TestOrderedSet.py (1122 of 2129)
PASS: lldb-api :: functionalities/data-formatter/data-formatter-named-summaries/TestDataFormatterNamedSummaries.py (1123 of 2129)
PASS: lldb-api :: lang/c/register_variables/TestRegisterVariables.py (1124 of 2129)
UNSUPPORTED: lldb-shell :: Process/Windows/exception_access_violation.cpp (1125 of 2129)
PASS: lldb-unit :: Host/./HostTests/FileSystemTest.MakeAbsolute (1126 of 2129)
PASS: lldb-api :: functionalities/tail_call_frames/thread_step_out_message/TestArtificialFrameStepOutMessage.py (1127 of 2129)
PASS: lldb-unit :: Language/Highlighting/./HighlighterTests/HighlighterTest.ClangStringLiterals (1128 of 2129)
PASS: lldb-unit :: Utility/./UtilityTests/StringExtractorTest.InitMisc (1129 of 2129)
PASS: lldb-unit :: Language/Highlighting/./HighlighterTests/HighlighterTest.HighlighterSelectionType (1130 of 2129)
PASS: lldb-unit :: Host/./HostTests/Host.GetEnvironment (1131 of 2129)
UNSUPPORTED: lldb-shell :: SymbolFile/DWARF/debug-types-expressions.test (1132 of 2129)
PASS: lldb-shell :: Commands/CommandScriptImmediateOutput/CommandScriptImmediateOutputConsole.test (1133 of 2129)
PASS: lldb-shell :: SymbolFile/DWARF/find-method.cpp (1134 of 2129)
PASS: lldb-api :: macosx/nslog/TestDarwinNSLogOutput.py (1135 of 2129)
PASS: lldb-unit :: ScriptInterpreter/Python/./ScriptInterpreterPythonTests/PythonDataObjectsTest.TestPythonDictionaryManipulation (1136 of 2129)
PASS: lldb-unit :: Utility/./UtilityTests/UUIDTest.RelationalOperators (1137 of 2129)
PASS: lldb-unit :: ScriptInterpreter/Python/./ScriptInterpreterPythonTests/PythonDataObjectsTest.TestPythonTupleInitializerList2 (1138 of 2129)
PASS: lldb-api :: commands/expression/import-std-module/shared_ptr/TestSharedPtrFromStdModule.py (1139 of 2129)
PASS: lldb-api :: lang/objc/self/TestObjCSelf.py (1140 of 2129)
PASS: lldb-unit :: SymbolFile/NativePDB/./SymbolFileNativePDBTests/PDBFPOProgramToDWARFExpressionTests.InvalidAssignmentMultiple (1141 of 2129)
PASS: lldb-api :: functionalities/data-formatter/summary-string-onfail/Test-rdar-9974002.py (1142 of 2129)
PASS: lldb-api :: commands/frame/diagnose/dereference-argument/TestDiagnoseDereferenceArgument.py (1143 of 2129)
PASS: lldb-shell :: SymbolFile/DWARF/find-basic-namespace.cpp (1144 of 2129)
PASS: lldb-unit :: Utility/./UtilityTests/StreamTest.PutMaxHex64ByteOrderBig (1145 of 2129)
PASS: lldb-api :: macosx/thread-names/TestInterruptThreadNames.py (1146 of 2129)
PASS: lldb-shell :: ObjectFile/Breakpad/uuid-matching-mac.test (1147 of 2129)
PASS: lldb-unit :: Symbol/./SymbolTests/TestTypeSystemClang.TestGetTypeClassTypeOf (1148 of 2129)
PASS: lldb-unit :: Utility/./UtilityTests/FileSpecTest.GetPath (1149 of 2129)
PASS: lldb-shell :: SymbolFile/NativePDB/ast-types.cpp (1150 of 2129)
PASS: lldb-api :: commands/expression/call-function/TestCallUserDefinedFunction.py (1151 of 2129)
UNSUPPORTED: lldb-shell :: SymbolFile/PDB/calling-conventions.test (1152 of 2129)
PASS: lldb-unit :: Utility/./UtilityTests/UriParserTest.SchemeHostSeparator2 (1153 of 2129)
PASS: lldb-unit :: Process/gdb-remote/./ProcessGdbRemoteTests/GDBRemoteCommunicationServerTest.SendErrorResponse_ErrorNumber (1154 of 2129)
PASS: lldb-unit :: Host/./HostTests/FileSystemTest.Resolve (1155 of 2129)
PASS: lldb-unit :: Process/gdb-remote/./ProcessGdbRemoteTests/GDBRemoteCommunicationClientTest.GetModulesInfo_UUID20 (1156 of 2129)
PASS: lldb-unit :: Expression/./ExpressionTests/CppModuleConfigurationTest.Sysroot (1157 of 2129)
PASS: lldb-unit :: Utility/./UtilityTests/DataExtractorTest.GetULEB128_bit63 (1158 of 2129)
PASS: lldb-unit :: Utility/./UtilityTests/StringLexerTest.Peek (1159 of 2129)
PASS: lldb-api :: functionalities/thread/concurrent_events/TestConcurrentCrashWithSignal.py (1160 of 2129)
PASS: lldb-unit :: Core/./LLDBCoreTests/RichManglingContextTest.Basic (1161 of 2129)
PASS: lldb-unit :: Language/CLanguages/./LanguageCLanguagesTests/CLanguages.LookupCLanguagesByLanguageType (1162 of 2129)
PASS: lldb-unit :: Utility/./UtilityTests/UriParserTest.Minimal (1163 of 2129)
PASS: lldb-unit :: Utility/./UtilityTests/LogChannelEnabledTest.LogVerboseThread (1164 of 2129)
PASS: lldb-api :: functionalities/inferior-crashing/TestInferiorCrashingStep.py (1165 of 2129)
PASS: lldb-api :: commands/expression/import-std-module/unique_ptr/TestUniquePtrFromStdModule.py (1166 of 2129)
PASS: lldb-api :: lang/cpp/dynamic-value-same-basename/TestDynamicValueSameBase.py (1167 of 2129)
PASS: lldb-api :: sample_test/TestSampleTest.py (1168 of 2129)
PASS: lldb-api :: commands/expression/options/TestExprOptions.py (1169 of 2129)
PASS: lldb-unit :: Utility/./UtilityTests/FileSpecTest.Equal (1170 of 2129)
PASS: lldb-unit :: UnwindAssembly/x86/./UnwindAssemblyx86Tests/Testx86AssemblyInspectionEngine.TestPopEDI (1171 of 2129)
PASS: lldb-unit :: Platform/./LLDBPlatformTests/PlatformDarwinTest.TestParseVersionBuildDir (1172 of 2129)
PASS: lldb-shell :: Breakpoint/split-dwarf5-debug-stroffsets.test (1173 of 2129)
PASS: lldb-unit :: Utility/./UtilityTests/StreamTeeTest.Constructor1Stream (1174 of 2129)
PASS: lldb-api :: functionalities/breakpoint/breakpoint_command/TestBreakpointCommandsFromPython.py (1175 of 2129)
PASS: lldb-api :: functionalities/inferior-crashing/recursive-inferior/TestRecursiveInferior.py (1176 of 2129)
PASS: lldb-shell :: Quit/TestQuitExitCodeNonInt.test (1177 of 2129)
PASS: lldb-api :: functionalities/signal/raise/TestRaise.py (1178 of 2129)
PASS: lldb-unit :: Utility/./UtilityTests/StringListTest.ForRangeEmpty (1179 of 2129)
PASS: lldb-unit :: Utility/./UtilityTests/BinaryStreamTest.PutSLEB128FiveBytes (1180 of 2129)
PASS: lldb-unit :: UnwindAssembly/x86/./UnwindAssemblyx86Tests/Testx86AssemblyInspectionEngine.TestReturnDetect (1181 of 2129)
PASS: lldb-shell :: SymbolFile/DWARF/win-i386-line-table.s (1182 of 2129)
PASS: lldb-api :: lang/c/unions/TestUnionMembers.py (1183 of 2129)
PASS: lldb-unit :: UnwindAssembly/x86/./UnwindAssemblyx86Tests/Testx86AssemblyInspectionEngine.TestAddRSP (1184 of 2129)
PASS: lldb-api :: functionalities/tsan/global_location/TestTsanGlobalLocation.py (1185 of 2129)
FAIL: lldb-unit :: Symbol/./SymbolTests/SymbolsTest.LocateExecutableSymbolFileForUnknownExecutableAndMissingSymbolFile (1186 of 2129)
******************** TEST 'lldb-unit :: Symbol/./SymbolTests/SymbolsTest.LocateExecutableSymbolFileForUnknownExecutableAndMissingSymbolFile' FAILED ********************
Note: Google Test filter = SymbolsTest.LocateExecutableSymbolFileForUnknownExecutableAndMissingSymbolFile
[==========] Running 1 test from 1 test case.
[----------] Global test environment set-up.
[----------] 1 test from SymbolsTest
[ RUN      ] SymbolsTest.LocateExecutableSymbolFileForUnknownExecutableAndMissingSymbolFile
Assertion failed: (hasVal), function getValue, file /Users/buildslave/jenkins/workspace/lldb-cmake@2/llvm-project/llvm/include/llvm/ADT/Optional.h, line 73.
0  SymbolTests              0x000000010fb45675 llvm::sys::PrintStackTrace(llvm::raw_ostream&) + 37
1  SymbolTests              0x000000010fb44606 llvm::sys::RunSignalHandlers() + 198
2  SymbolTests              0x000000010fb45c56 SignalHandler(int) + 262
3  libsystem_platform.dylib 0x00007fff6d1f45fd _sigtramp + 29
4  libsystem_platform.dylib 0xaaaaaaaaaaaaaaaa _sigtramp + 12297688647448880330
5  libsystem_c.dylib        0x00007fff6d0c6808 abort + 120
6  libsystem_c.dylib        0x00007fff6d0c5ac6 err + 0
7  SymbolTests              0x0000000110ff69f5 lldb_private::repro::Reproducer::Instance() + 133
8  SymbolTests              0x000000010fbad031 LocateMacOSXFilesUsingDebugSymbols(lldb_private::ModuleSpec const&, lldb_private::ModuleSpec&) + 433
9  SymbolTests              0x000000010fb8f2ad lldb_private::Symbols::LocateExecutableSymbolFile(lldb_private::ModuleSpec const&, lldb_private::FileSpecList const&) + 5741
10 SymbolTests              0x000000010fa34fe2 SymbolsTest_LocateExecutableSymbolFileForUnknownExecutableAndMissingSymbolFile_Test::TestBody() + 274
11 SymbolTests              0x000000010fb4e46f testing::Test::Run() + 527
12 SymbolTests              0x000000010fb4f2e6 testing::TestInfo::Run() + 566
13 SymbolTests              0x000000010fb4fb17 testing::TestCase::Run() + 247
14 SymbolTests              0x000000010fb58647 testing::internal::UnitTestImpl::RunAllTests() + 1287
15 SymbolTests              0x000000010fb580cb testing::UnitTest::Run() + 171
16 SymbolTests              0x000000010fb46fd9 main + 121
17 libdyld.dylib            0x00007fff6cff7cc9 start + 1
18 libdyld.dylib            0x0000000000000002 start + 18446603338687480634

Hide Details

******************** PASS: lldb-api :: functionalities/gdb_remote_client/TestProcessConnect.py (1187 of 2129) PASS: lldb-api :: commands/expression/import-std-module/vector/TestVectorFromStdModule.py (1188 of 2129) PASS: lldb-unit :: Utility/./UtilityTests/UriParserTest.SchemeHostSeparator4 (1189 of 2129) PASS: lldb-unit :: ScriptInterpreter/Python/./ScriptInterpreterPythonTests/PythonDataObjectsTest.TestBorrowedReferences (1190 of 2129) PASS: lldb-api :: lang/cpp/class_static/TestStaticVariables.py (1191 of 2129) PASS: lldb-api :: functionalities/plugins/python_os_plugin/TestPythonOSPlugin.py (1192 of 2129) PASS: lldb-api :: commands/expression/import-std-module/empty-module/TestEmptyStdModule.py (1193 of 2129) PASS: lldb-api :: lang/cpp/overloaded-functions/TestOverloadedFunctions.py (1194 of 2129) PASS: lldb-api :: functionalities/completion/TestCompletion.py (1195 of 2129) PASS: lldb-unit :: Utility/./UtilityTests/BinaryStreamTest.PutULEB128SevenBytes (1196 of 2129) PASS: lldb-unit :: Utility/./UtilityTests/RangeTest.Clear (1197 of 2129) PASS: lldb-unit :: Expression/./ExpressionTests/DiagnosticManagerTest.PutStringMultiple (1198 of 2129) PASS: lldb-api :: api/check_public_api_headers/TestPublicAPIHeaders.py (1199 of 2129) PASS: lldb-unit :: Utility/./UtilityTests/ProcessInstanceInfo.DumpTable (1200 of 2129) PASS: lldb-unit :: UnwindAssembly/x86/./UnwindAssemblyx86Tests/Testx86AssemblyInspectionEngine.TestCALLNextInsn (1201 of 2129) PASS: lldb-unit :: Utility/./UtilityTests/StringLexerTest.NextIfList (1202 of 2129) PASS: lldb-unit :: ScriptInterpreter/Python/./ScriptInterpreterPythonTests/PythonDataObjectsTest.TestPythonStringToStructuredString (1203 of 2129) FAIL: lldb-api :: functionalities/gdb_remote_client/TestGDBRemoteLoad.py (1204 of 2129) ******************** TEST 'lldb-api :: functionalities/gdb_remote_client/TestGDBRemoteLoad.py' FAILED ******************** Script: -- /usr/local/Frameworks/Python.framework/Versions/3.7/bin/python3.7 /Users/buildslave/jenkins/workspace/lldb-cmake@2/llvm-project/lldb/test/API/dotest.py --arch x86_64 -s /Users/buildslave/jenkins/workspace/lldb-cmake@2/lldb-build/lldb-test-traces -S nm -u CXXFLAGS -u CFLAGS --codesign-identity - --server /Users/buildslave/jenkins/workspace/lldb-cmake@2/lldb-build/./bin/debugserver --arch x86_64 --build-dir /Users/buildslave/jenkins/workspace/lldb-cmake@2/lldb-build/lldb-test-build.noindex -s=/Users/buildslave/jenkins/workspace/lldb-cmake@2/test/logs -t --env TERM=vt100 --env LLVM_LIBS_DIR=/Users/buildslave/jenkins/workspace/lldb-cmake@2/lldb-build/./lib --build-dir /Users/buildslave/jenkins/workspace/lldb-cmake@2/lldb-build/lldb-test-build.noindex --lldb-module-cache-dir /Users/buildslave/jenkins/workspace/lldb-cmake@2/lldb-build/lldb-test-build.noindex/module-cache-lldb/lldb-api --clang-module-cache-dir /Users/buildslave/jenkins/workspace/lldb-cmake@2/lldb-build/lldb-test-build.noindex/module-cache-clang/lldb-api --executable /Users/buildslave/jenkins/workspace/lldb-cmake@2/lldb-build/./bin/lldb --compiler /Users/buildslave/jenkins/workspace/lldb-cmake@2/lldb-build/./bin/clang --dsymutil /Users/buildslave/jenkins/workspace/lldb-cmake@2/lldb-build/./bin/dsymutil --filecheck /Users/buildslave/jenkins/workspace/lldb-cmake@2/lldb-build/./bin/FileCheck --yaml2obj /Users/buildslave/jenkins/workspace/lldb-cmake@2/lldb-build/./bin/yaml2obj --lldb-libs-dir /Users/buildslave/jenkins/workspace/lldb-cmake@2/lldb-build/./lib /Users/buildslave/jenkins/workspace/lldb-cmake@2/llvm-project/lldb/test/API/functionalities/gdb_remote_client -p TestGDBRemoteLoad.py -- Exit Code: 1

Hide Details

Command Output (stdout): -- lldb version 12.0.99 clang revision 0d2fe90063e956716c3067322aef898822d0dc0e llvm revision 0d2fe90063e956716c3067322aef898822d0dc0e LLDB library dir: /Users/buildslave/jenkins/workspace/lldb-cmake@2/lldb-build/bin LLDB import library dir: /Users/buildslave/jenkins/workspace/lldb-cmake@2/lldb-build/./lib libstdcxx tests will not be run because: Don't know how to build with libstdcxx on macosx Skipping following debug info categories: ['dwo']

Hide Details

-- Command Output (stderr): --

Hide Details

Session logs for test failures/errors/unexpected successes will go into directory '/Users/buildslave/jenkins/workspace/lldb-cmake@2/test/logs' Change dir to: /Users/buildslave/jenkins/workspace/lldb-cmake@2/llvm-project/lldb/test/API/functionalities/gdb_remote_client runCmd: settings clear -all output:

Hide Details

runCmd: settings set symbols.enable-external-lookup false output:

Hide Details

runCmd: settings set target.inherit-tcc true output:

Hide Details

runCmd: settings set target.auto-apply-fixits false output:

Hide Details

runCmd: settings set plugin.process.gdb-remote.packet-timeout 60 output:

Hide Details

runCmd: settings set symbols.clang-modules-cache-path "/Users/buildslave/jenkins/workspace/lldb-cmake@2/lldb-build/lldb-test-build.noindex/module-cache-lldb/lldb-api" output:

Hide Details

runCmd: settings set use-color false output:

Hide Details

runCmd: setting set target.prefer-dynamic-value no-dynamic-values output:

Hide Details

FAIL: LLDB (/Users/buildslave/jenkins/workspace/lldb-cmake@2/lldb-build/bin/clang-x86_64) :: test_flash_load (TestGDBRemoteLoad.TestGDBRemoteLoad) <bound method SBProcess.Kill of <lldb.SBProcess; proxy of <Swig Object of type 'lldb::SBProcess *' at 0x116cb0540> >>: success

Hide Details

runCmd: settings clear -all output:

Hide Details

runCmd: settings set symbols.enable-external-lookup false output:

Hide Details

runCmd: settings set target.inherit-tcc true output:

Hide Details

runCmd: settings set target.auto-apply-fixits false output:

Hide Details

runCmd: settings set plugin.process.gdb-remote.packet-timeout 60 output:

Hide Details

runCmd: settings set symbols.clang-modules-cache-path "/Users/buildslave/jenkins/workspace/lldb-cmake@2/lldb-build/lldb-test-build.noindex/module-cache-lldb/lldb-api" output:

Hide Details

runCmd: settings set use-color false output:

Hide Details

runCmd: setting set target.prefer-dynamic-value no-dynamic-values output:

Hide Details

<bound method SBProcess.Kill of <lldb.SBProcess; proxy of <Swig Object of type 'lldb::SBProcess *' at 0x10f7ba600> >>: success

Hide Details

PASS: LLDB (/Users/buildslave/jenkins/workspace/lldb-cmake@2/lldb-build/bin/clang-x86_64) :: test_module_load_address (TestGDBRemoteLoad.TestGDBRemoteLoad) runCmd: settings clear -all output:

Hide Details

runCmd: settings set symbols.enable-external-lookup false output:

Hide Details

runCmd: settings set target.inherit-tcc true output:

Hide Details

runCmd: settings set target.auto-apply-fixits false output:

Hide Details

runCmd: settings set plugin.process.gdb-remote.packet-timeout 60 output:

Hide Details

runCmd: settings set symbols.clang-modules-cache-path "/Users/buildslave/jenkins/workspace/lldb-cmake@2/lldb-build/lldb-test-build.noindex/module-cache-lldb/lldb-api" output:

Hide Details

runCmd: settings set use-color false output:

Hide Details

runCmd: setting set target.prefer-dynamic-value no-dynamic-values output:

Hide Details

<bound method SBProcess.Kill of <lldb.SBProcess; proxy of <Swig Object of type 'lldb::SBProcess *' at 0x116cb05a0> >>: success

Hide Details

PASS: LLDB (/Users/buildslave/jenkins/workspace/lldb-cmake@2/lldb-build/bin/clang-x86_64) :: test_ram_load (TestGDBRemoteLoad.TestGDBRemoteLoad) Restore dir to: /Users/buildslave/jenkins/workspace/lldb-cmake@2/lldb-build/tools/lldb/test ====================================================================== FAIL: test_flash_load (TestGDBRemoteLoad.TestGDBRemoteLoad) Test loading an object file to a target's flash memory ---------------------------------------------------------------------- Traceback (most recent call last): File "/Users/buildslave/jenkins/workspace/lldb-cmake@2/llvm-project/lldb/test/API/functionalities/gdb_remote_client/TestGDBRemoteLoad.py", line 67, in test_flash_load process = self.connect(target) File "/Users/buildslave/jenkins/workspace/lldb-cmake@2/llvm-project/lldb/test/API/functionalities/gdb_remote_client/gdbclientutils.py", line 524, in connect self.assertTrue(error.Success(), error.description) AssertionError: False is not True : failed to get reply to handshake packet Config=x86_64-/Users/buildslave/jenkins/workspace/lldb-cmake@2/lldb-build/bin/clang ---------------------------------------------------------------------- Ran 3 tests in 132.898s

Hide Details

RESULT: FAILED (2 passes, 1 failures, 0 errors, 0 skipped, 0 expected failures, 0 unexpected successes)

Hide Details

--

Hide Details

******************** PASS: lldb-unit :: Symbol/./SymbolTests/TestTypeSystemClang.TestUnifyAccessSpecifiers (1205 of 2129) PASS: lldb-api :: macosx/simulator/TestSimulatorPlatform.py (1206 of 2129) PASS: lldb-unit :: Symbol/./SymbolTests/PostfixExpression.ToDWARF (1207 of 2129) PASS: lldb-unit :: Host/./HostTests/SocketTest.DomainListenConnectAccept (1208 of 2129) UNSUPPORTED: lldb-api :: functionalities/darwin_log/filter/exact_match/activity/TestDarwinLogFilterMatchActivity.py (1209 of 2129) UNSUPPORTED: lldb-shell :: ScriptInterpreter/Lua/nested_sessions.test (1210 of 2129) PASS: lldb-api :: commands/command/invalid-args/TestInvalidArgsCommand.py (1211 of 2129) PASS: lldb-api :: commands/log/basic/TestLogging.py (1212 of 2129) PASS: lldb-api :: functionalities/thread/concurrent_events/TestConcurrentCrashWithBreak.py (1213 of 2129) PASS: lldb-unit :: Process/minidump/./LLDBMinidumpTests/MinidumpParserTest.GetLinuxProcStatus_no_stream (1214 of 2129) PASS: lldb-unit :: Utility/./UtilityTests/StreamTest.PutULEB128 (1215 of 2129) PASS: lldb-api :: functionalities/breakpoint/breakpoint_hit_count/TestBreakpointHitCount.py (1216 of 2129) PASS: lldb-unit :: Thread/./ThreadTests/ThreadTest.SetStopInfo (1217 of 2129) PASS: lldb-api :: commands/expression/weak_symbols/TestWeakSymbols.py (1218 of 2129) PASS: lldb-api :: functionalities/memory/read/TestMemoryRead.py (1219 of 2129) PASS: lldb-api :: functionalities/breakpoint/breakpoint_names/TestBreakpointNames.py (1220 of 2129) PASS: lldb-unit :: Process/minidump/./LLDBMinidumpTests/MinidumpParserTest.GetThreadContext_x86_64 (1221 of 2129) PASS: lldb-api :: functionalities/data-formatter/data-formatter-skip-summary/TestDataFormatterSkipSummary.py (1222 of 2129) PASS: lldb-unit :: Symbol/./SymbolTests/DWARFCallFrameInfoTest.Basic_dwarf4 (1223 of 2129) PASS: lldb-shell :: SymbolFile/DWARF/compilercontext.ll (1224 of 2129) PASS: lldb-unit :: Utility/./UtilityTests/XcodeSDKTest.SDKSupportsSwift (1225 of 2129) PASS: lldb-shell :: Reproducer/TestDump.test (1226 of 2129) PASS: lldb-shell :: SymbolFile/DWARF/debug_line-tombstone.s (1227 of 2129) PASS: lldb-shell :: Process/TestEnvironment.test (1228 of 2129) PASS: lldb-unit :: DataFormatter/./LLDBFormatterTests/TypeMatcherTests.GetMatchStringExactName (1229 of 2129) PASS: lldb-unit :: SymbolFile/NativePDB/./SymbolFileNativePDBTests/PDBFPOProgramToDWARFExpressionTests.InvalidOpBinary (1230 of 2129) PASS: lldb-unit :: Utility/./UtilityTests/Flags.AllSet (1231 of 2129) PASS: lldb-api :: functionalities/thread/create_after_attach/TestCreateAfterAttach.py (1232 of 2129) PASS: lldb-api :: functionalities/set-data/TestSetData.py (1233 of 2129) PASS: lldb-unit :: DataFormatter/./LLDBFormatterTests/TypeMatcherTests.CreatedBySameMatchString (1234 of 2129) PASS: lldb-api :: macosx/universal/TestUniversal.py (1235 of 2129) PASS: lldb-api :: commands/expression/namespace_local_var_same_name_obj_c/TestNamespaceLocalVarSameNameObjC.py (1236 of 2129) PASS: lldb-api :: functionalities/gdb_remote_client/TestqOffsets.py (1237 of 2129) PASS: lldb-shell :: SymbolFile/Breakpad/line-table-mixed-path-styles.test (1238 of 2129) PASS: lldb-shell :: SymbolFile/DWARF/split-dwarf-inlining.cpp (1239 of 2129) PASS: lldb-unit :: Language/Highlighting/./HighlighterTests/HighlighterTest.ClangComments (1240 of 2129) PASS: lldb-unit :: Utility/./UtilityTests/RegularExpression.Match (1241 of 2129) PASS: lldb-unit :: Host/./HostTests/FileSystemTest.OpenErrno (1242 of 2129) PASS: lldb-unit :: Expression/./ExpressionTests/DiagnosticManagerTest.AppendMessageNoDiag (1243 of 2129) PASS: lldb-api :: commands/expression/timeout/TestCallWithTimeout.py (1244 of 2129) UNSUPPORTED: lldb-api :: benchmarks/continue/TestBenchmarkContinue.py (1245 of 2129) PASS: lldb-shell :: SymbolFile/DWARF/find-variable-dwo.cpp (1246 of 2129) PASS: lldb-api :: functionalities/data-formatter/vector-types/TestVectorTypesFormatting.py (1247 of 2129) PASS: lldb-api :: python_api/value_var_update/TestValueVarUpdate.py (1248 of 2129) PASS: lldb-unit :: Language/Highlighting/./HighlighterTests/HighlighterTest.Keywords (1249 of 2129) UNSUPPORTED: lldb-shell :: SymbolFile/PDB/typedefs.test (1250 of 2129) UNSUPPORTED: lldb-api :: functionalities/thread/thread_specific_break_plus_condition/TestThreadSpecificBpPlusCondition.py (1251 of 2129) PASS: lldb-unit :: Utility/./UtilityTests/ScalarTest.APIntConstructor (1252 of 2129) PASS: lldb-shell :: Driver/TestNoUseColor.test (1253 of 2129) PASS: lldb-api :: functionalities/tail_call_frames/sbapi_support/TestTailCallFrameSBAPI.py (1254 of 2129) PASS: lldb-api :: functionalities/object-file/TestImageListMultiArchitecture.py (1255 of 2129) PASS: lldb-shell :: SymbolFile/DWARF/array-sizes.s (1256 of 2129) PASS: lldb-api :: commands/expression/import-std-module/list-dbg-info-content/TestDbgInfoContentListFromStdModule.py (1257 of 2129) PASS: lldb-unit :: UnwindAssembly/x86/./UnwindAssemblyx86Tests/Testx86AssemblyInspectionEngine.TestPopR14 (1258 of 2129) PASS: lldb-unit :: Utility/./UtilityTests/StringLexerTest.NextIf (1259 of 2129) PASS: lldb-api :: functionalities/thread/concurrent_events/TestConcurrentSignalWatchBreak.py (1260 of 2129) PASS: lldb-unit :: Utility/./UtilityTests/ConstStringTest.UpdateMangledCounterpart (1261 of 2129) PASS: lldb-unit :: Utility/./UtilityTests/OptionsWithRawTest.QuotedSuffix (1262 of 2129) PASS: lldb-api :: commands/expression/completion/TestExprCompletion.py (1263 of 2129) PASS: lldb-unit :: Utility/./UtilityTests/StringListTest.JoinThree (1264 of 2129) PASS: lldb-unit :: Utility/./UtilityTests/UriParserTest.PortOverflow (1265 of 2129) PASS: lldb-unit :: Utility/./UtilityTests/AnsiTerminal.Empty (1266 of 2129) PASS: lldb-shell :: SymbolFile/DWARF/dwarf5-atomic.s (1267 of 2129) PASS: lldb-unit :: debugserver/./debugserverTests/RNBSocket.LoopBackConnectIPv6 (1268 of 2129) PASS: lldb-unit :: Utility/./UtilityTests/SerializationRountripTest.SerializeDeserializeCStringArray (1269 of 2129) PASS: lldb-unit :: Language/Highlighting/./HighlighterTests/HighlighterTest.ClangCursorPosEndOfLine (1270 of 2129) PASS: lldb-api :: commands/expression/persistent_ptr_update/TestPersistentPtrUpdate.py (1271 of 2129) PASS: lldb-unit :: Language/CPlusPlus/./LanguageCPlusPlusTests/CPlusPlusLanguage.FindAlternateFunctionManglings (1272 of 2129) PASS: lldb-shell :: VSCode/TestOptions.test (1273 of 2129) PASS: lldb-unit :: debugserver/./debugserverTests/RNBSocket.AnyListen (1274 of 2129) PASS: lldb-shell :: SymbolFile/dissassemble-entry-point.s (1275 of 2129) PASS: lldb-api :: lang/cpp/global_operators/TestCppGlobalOperators.py (1276 of 2129) UNSUPPORTED: lldb-shell :: Register/x86-zmm-write.test (1277 of 2129) PASS: lldb-api :: functionalities/limit-debug-info/TestLimitDebugInfo.py (1278 of 2129) PASS: lldb-api :: functionalities/gdb_remote_client/TestTargetXMLArch.py (1279 of 2129) PASS: lldb-unit :: Utility/./UtilityTests/StringListTest.CopyList (1280 of 2129) PASS: lldb-unit :: Signals/./SignalsTests/UnixSignalsTest.Iteration (1281 of 2129) PASS: lldb-unit :: Disassembler/./DisassemblerTests/TestArm64Disassembly.TestArmv81Instruction (1282 of 2129) PASS: lldb-api :: tools/lldb-vscode/breakpoint/TestVSCode_setBreakpoints.py (1283 of 2129) PASS: lldb-unit :: DataFormatter/./LLDBFormatterTests/TypeMatcherTests.ExactName (1284 of 2129) PASS: lldb-api :: iohandler/resize/TestIOHandlerResize.py (1285 of 2129) PASS: lldb-unit :: Utility/./UtilityTests/RangeTest.EqualInvalid (1286 of 2129) PASS: lldb-unit :: Utility/./UtilityTests/StringExtractorTest.GetHexBytesAvail_Underflow (1287 of 2129) UNSUPPORTED: lldb-api :: functionalities/darwin_log/filter/regex/activity-chain/TestDarwinLogFilterRegexActivityChain.py (1288 of 2129) PASS: lldb-api :: functionalities/breakpoint/debugbreak/TestDebugBreak.py (1289 of 2129) PASS: lldb-unit :: Host/./HostTests/MainLoopTest.DetectsEOF (1290 of 2129) PASS: lldb-api :: functionalities/gdb_remote_client/TestIOSSimulator.py (1291 of 2129) PASS: lldb-unit :: Utility/./UtilityTests/StringListTest.GetMaxStringLengthMixed (1292 of 2129) PASS: lldb-shell :: ObjectFile/PECOFF/section-types.yaml (1293 of 2129) PASS: lldb-api :: functionalities/breakpoint/breakpoint_by_line_and_column/TestBreakpointByLineAndColumn.py (1294 of 2129) PASS: lldb-unit :: ScriptInterpreter/Python/./ScriptInterpreterPythonTests/PythonDataObjectsTest.TestPythonTupleInitializerList (1295 of 2129) PASS: lldb-shell :: ObjectFile/PECOFF/disassemble-thumb.yaml (1296 of 2129) PASS: lldb-unit :: Utility/./UtilityTests/RegularExpression.Invalid (1297 of 2129) PASS: lldb-api :: functionalities/data-formatter/stringprinter/TestStringPrinter.py (1298 of 2129) PASS: lldb-shell :: ObjectFile/MachO/symtab.yaml (1299 of 2129) PASS: lldb-api :: lang/c/stepping/TestThreadStepping.py (1300 of 2129) PASS: lldb-unit :: Expression/./ExpressionTests/DiagnosticManagerTest.GetStringPreserveOrder (1301 of 2129) PASS: lldb-api :: functionalities/abbreviation/TestAbbreviations.py (1302 of 2129) PASS: lldb-shell :: Commands/command-target-modules-dump-sections.yaml (1303 of 2129) PASS: lldb-api :: functionalities/data-formatter/data-formatter-stl/libcxx/atomic/TestLibCxxAtomic.py (1304 of 2129) PASS: lldb-unit :: Process/gdb-remote/./ProcessGdbRemoteTests/GDBRemoteCommunicationTest.ReadPacket_checksum (1305 of 2129) PASS: lldb-unit :: Utility/./UtilityTests/StreamTest.PutHex64ByteOrderBig (1306 of 2129) PASS: lldb-unit :: Expression/./ExpressionTests/CppModuleConfigurationTest.AmbiguousCLib (1307 of 2129) PASS: lldb-unit :: Utility/./UtilityTests/DataExtractorTest.GetFloatUnaligned (1308 of 2129) UNSUPPORTED: lldb-api :: functionalities/signal/handle-segv/TestHandleSegv.py (1309 of 2129) PASS: lldb-unit :: ScriptInterpreter/Python/./ScriptInterpreterPythonTests/PythonDataObjectsTest.TestPythonCallableCheck (1310 of 2129) PASS: lldb-api :: commands/process/attach/TestProcessAttach.py (1311 of 2129) PASS: lldb-unit :: Utility/./UtilityTests/StringExtractorTest.GetHexBytesAvail (1312 of 2129) PASS: lldb-shell :: SymbolFile/Breakpad/stack-cfi-arm.yaml (1313 of 2129) PASS: lldb-api :: python_api/thread/TestThreadAPI.py (1314 of 2129) PASS: lldb-api :: functionalities/thread/concurrent_events/TestConcurrentTwoBreakpointsOneWatchpoint.py (1315 of 2129) UNSUPPORTED: lldb-api :: python_api/event/TestEvents.py (1316 of 2129) PASS: lldb-api :: lang/objc/objc-foundation-dictionary-empty/TestNSDictionary0.py (1317 of 2129) PASS: lldb-api :: functionalities/data-formatter/compactvectors/TestCompactVectors.py (1318 of 2129) PASS: lldb-unit :: Symbol/./SymbolTests/DWARFCallFrameInfoTest.Basic_eh (1319 of 2129) PASS: lldb-unit :: ScriptInterpreter/Python/./ScriptInterpreterPythonTests/PythonDataObjectsTest.TestOwnedReferences (1320 of 2129) PASS: lldb-api :: commands/expression/ir-interpreter/TestIRInterpreter.py (1321 of 2129) PASS: lldb-api :: types/TestIntegerType.py (1322 of 2129) PASS: lldb-unit :: Utility/./UtilityTests/FileSpecTest.EqualDotsWindows (1323 of 2129) PASS: lldb-api :: functionalities/postmortem/minidump-new/TestMiniDumpUUID.py (1324 of 2129) PASS: lldb-shell :: Driver/TestSingleQuote.test (1325 of 2129) PASS: lldb-shell :: Settings/TestLineMarkerColor.test (1326 of 2129) PASS: lldb-unit :: Utility/./UtilityTests/VMRange.IsValid (1327 of 2129) PASS: lldb-unit :: Utility/./UtilityTests/OptionsWithRawTest.SingleWhitespaceInput (1328 of 2129) PASS: lldb-api :: commands/frame/language/TestGuessLanguage.py (1329 of 2129) PASS: lldb-shell :: SymbolFile/DWARF/debug_ranges-missing-section.s (1330 of 2129) PASS: lldb-shell :: ObjectFile/ELF/aarch64-relocations.yaml (1331 of 2129) PASS: lldb-unit :: Symbol/./SymbolTests/LineEntryTest.GetSameLineContiguousAddressRangeNestedInline (1332 of 2129) PASS: lldb-unit :: Utility/./UtilityTests/DataExtractorTest.GetCStrUnterminated (1333 of 2129) UNSUPPORTED: lldb-shell :: ScriptInterpreter/Lua/quit.test (1334 of 2129) PASS: lldb-unit :: Utility/./UtilityTests/StreamTest.PutCharWhitespace (1335 of 2129) PASS: lldb-unit :: Utility/./UtilityTests/LogChannelEnabledTest.LLDB_LOG_ERROR (1336 of 2129) PASS: lldb-api :: python_api/process/TestProcessAPI.py (1337 of 2129) XFAIL: lldb-shell :: Unwind/prefer-debug-over-eh-frame.test (1338 of 2129) PASS: lldb-api :: commands/target/stop-hook/enable/TestTargetStopHookEnable.py (1339 of 2129) PASS: lldb-api :: functionalities/tail_call_frames/cross_object/TestCrossObjectTailCalls.py (1340 of 2129) PASS: lldb-api :: python_api/formatters/TestFormattersSBAPI.py (1341 of 2129) PASS: lldb-api :: tools/lldb-server/TestGdbRemoteExitCode.py (1342 of 2129) UNSUPPORTED: lldb-shell :: Register/x86-64-gp-write.test (1343 of 2129) PASS: lldb-unit :: Core/./LLDBCoreTests/SourceFileCache.FindSourceFileNotFound (1344 of 2129) PASS: lldb-shell :: SymbolFile/NativePDB/disassembly.cpp (1345 of 2129) PASS: lldb-unit :: Utility/./UtilityTests/VMRange.Reset (1346 of 2129) UNSUPPORTED: lldb-shell :: SymbolFile/PDB/func-symbols.test (1347 of 2129) PASS: lldb-unit :: Symbol/./SymbolTests/TestTypeSystemClang.AddMethodToObjCObjectType (1348 of 2129) PASS: lldb-unit :: Language/Highlighting/./HighlighterTests/HighlighterTest.ClangBraces (1349 of 2129) PASS: lldb-unit :: Core/./LLDBCoreTests/MangledTest.ResultForBlockInvocation (1350 of 2129) PASS: lldb-unit :: Symbol/./SymbolTests/TestTypeSystemClang.TestIsClangType (1351 of 2129) PASS: lldb-shell :: SymbolFile/DWARF/debug_aranges-empty-section.s (1352 of 2129) PASS: lldb-unit :: Utility/./UtilityTests/BinaryStreamTest.PutULEB128MaxValue (1353 of 2129) PASS: lldb-unit :: Target/./TargetTests/ExecutionContextTest.GetByteOrder (1354 of 2129) PASS: lldb-unit :: Utility/./UtilityTests/Flags.IsClear (1355 of 2129) PASS: lldb-api :: commands/platform/file/close/TestPlatformFileClose.py (1356 of 2129) PASS: lldb-shell :: Settings/TestFrameFormatNoColor.test (1357 of 2129) PASS: lldb-api :: types/TestShortTypeExpr.py (1358 of 2129) PASS: lldb-shell :: SymbolFile/DWARF/debug_loc_and_loclists.s (1359 of 2129) PASS: lldb-unit :: Platform/./LLDBPlatformTests/PlatformDarwinTest.FindComponentInPath (1360 of 2129) PASS: lldb-unit :: Process/gdb-remote/./ProcessGdbRemoteTests/GDBRemoteCommunicationServerTest.SendErrorResponse_Status (1361 of 2129) UNSUPPORTED: lldb-shell :: ScriptInterpreter/Lua/bindings.test (1362 of 2129) PASS: lldb-unit :: Utility/./UtilityTests/StringListTest.GetSize (1363 of 2129) PASS: lldb-unit :: Host/./HostTests/NativeProcessProtocolTest.SetBreakpointFailVerify (1364 of 2129) PASS: lldb-unit :: Target/./TargetTests/PathMappingListTest.RemapRoot (1365 of 2129) PASS: lldb-api :: python_api/watchpoint/TestWatchpointIter.py (1366 of 2129) PASS: lldb-unit :: Language/CPlusPlus/./LanguageCPlusPlusTests/CPlusPlusLanguage.MethodNameParsing (1367 of 2129) PASS: lldb-api :: functionalities/data-formatter/data-formatter-objc/TestDataFormatterObjCCF.py (1368 of 2129) PASS: lldb-unit :: Symbol/./SymbolTests/TestTypeSystemClang.TestFunctionTemplateConstruction (1369 of 2129) PASS: lldb-unit :: UnwindAssembly/ARM64/./Arm64InstEmulationTests/TestArm64InstEmulation.TestRegisterSavedTwice (1370 of 2129) PASS: lldb-shell :: ObjectFile/ELF/PT_LOAD-overlap-PT_INTERP.yaml (1371 of 2129) PASS: lldb-unit :: Utility/./UtilityTests/ArgsTest.Yaml (1372 of 2129) PASS: lldb-unit :: Language/Highlighting/./HighlighterTests/HighlighterTest.ClangEmptyInput (1373 of 2129) PASS: lldb-api :: commands/session/history/TestSessionHistory.py (1374 of 2129) PASS: lldb-unit :: DataFormatter/./LLDBFormatterTests/FormatManagerTests.CompatibleLangs (1375 of 2129) PASS: lldb-api :: lang/cpp/namespace/TestNamespace.py (1376 of 2129) PASS: lldb-unit :: Utility/./UtilityTests/XcodeSDKTest.GetSDKTypeForTriple (1377 of 2129) PASS: lldb-unit :: Utility/./UtilityTests/StringListTest.LongestCommonPrefixEmpty (1378 of 2129) PASS: lldb-api :: tools/lldb-server/TestAppleSimulatorOSType.py (1379 of 2129) UNSUPPORTED: lldb-api :: functionalities/thread/state/TestThreadStates.py (1380 of 2129) PASS: lldb-unit :: ObjectFile/Breakpad/./ObjectFileBreakpadTests/StackCFIRecord.parse (1381 of 2129) PASS: lldb-api :: functionalities/data-formatter/data-formatter-stl/libcxx/optional/TestDataFormatterLibcxxOptional.py (1382 of 2129) PASS: lldb-api :: tools/lldb-server/TestGdbRemoteThreadsInStopReply.py (1383 of 2129) PASS: lldb-unit :: Utility/./UtilityTests/RangeDataVector.FindEntryIndexesThatContain (1384 of 2129) PASS: lldb-api :: commands/target/stop-hook/disable/TestTargetStopHookDisable.py (1385 of 2129) UNSUPPORTED: lldb-api :: functionalities/data-formatter/data-formatter-stl/libstdcpp/smart_ptr/TestDataFormatterStdSmartPtr.py (1386 of 2129) PASS: lldb-unit :: Utility/./UtilityTests/ArchSpecTest.MergeFromMachOUnknown (1387 of 2129) PASS: lldb-unit :: Utility/./UtilityTests/GeneratorTest.GetOrCreate (1388 of 2129) PASS: lldb-unit :: Host/./HostTests/ConnectionFileDescriptorTest.TCPGetURIv4 (1389 of 2129) PASS: lldb-shell :: ObjectFile/Breakpad/sections.test (1390 of 2129) PASS: lldb-api :: commands/expression/function_template_specialization_temp_args/TestFunctionTemplateSpecializationTempArgs.py (1391 of 2129) PASS: lldb-unit :: Utility/./UtilityTests/ArchSpecTest.TestSetTriple (1392 of 2129) PASS: lldb-unit :: Utility/./UtilityTests/UriParserTest.BadPort2 (1393 of 2129) PASS: lldb-api :: lang/c/global_variables/TestGlobalVariables.py (1394 of 2129) PASS: lldb-shell :: SymbolFile/NativePDB/tag-types.cpp (1395 of 2129) PASS: lldb-api :: types/TestDoubleTypesExpr.py (1396 of 2129) PASS: lldb-api :: lang/objc/real-definition/TestRealDefinition.py (1397 of 2129) UNSUPPORTED: lldb-api :: commands/register/register/intel_xtended_registers/TestMPXRegisters.py (1398 of 2129) PASS: lldb-shell :: Settings/TestSettingsSet.test (1399 of 2129) PASS: lldb-api :: lang/objc/objc-ivar-offsets/TestObjCIvarOffsets.py (1400 of 2129) PASS: lldb-api :: commands/expression/radar_9531204/TestPrintfAfterUp.py (1401 of 2129) PASS: lldb-unit :: Symbol/./SymbolTests/TestTypeSystemClang.TestFunctionTemplateInRecordConstruction (1402 of 2129) PASS: lldb-unit :: Utility/./UtilityTests/ScalarTest.Scalar_512 (1403 of 2129) PASS: lldb-api :: functionalities/asan/TestMemoryHistory.py (1404 of 2129) PASS: lldb-shell :: SymbolFile/Breakpad/unwind-via-stack-win-no-memory-info.yaml (1405 of 2129) PASS: lldb-unit :: tools/lldb-server/tests/./LLDBServerTests/TestBase.LaunchModePreservesEnvironment (1406 of 2129) PASS: lldb-api :: commands/session/save/TestSessionSave.py (1407 of 2129) PASS: lldb-unit :: Utility/./UtilityTests/RangeTest.SlideZero (1408 of 2129) PASS: lldb-unit :: SymbolFile/DWARF/./SymbolFileDWARFTests/SymbolFileDWARFTests.TestAbbrevOrder1Start1 (1409 of 2129) PASS: lldb-api :: commands/expression/two-files/TestObjCTypeQueryFromOtherCompileUnit.py (1410 of 2129) PASS: lldb-api :: lang/c/enum_types/TestEnumTypes.py (1411 of 2129) PASS: lldb-unit :: Utility/./UtilityTests/StringListTest.AppendListCStringArrayEmpty (1412 of 2129) PASS: lldb-api :: commands/watchpoints/watchpoint_count/TestWatchpointCount.py (1413 of 2129) PASS: lldb-unit :: Utility/./UtilityTests/GeneratorTest.YamlMultiProvider (1414 of 2129) PASS: lldb-api :: lang/cpp/breakpoint-commands/TestCPPBreakpointCommands.py (1415 of 2129) PASS: lldb-shell :: SymbolFile/NativePDB/bitfields.cpp (1416 of 2129) PASS: lldb-api :: functionalities/load_unload/TestLoadUnload.py (1417 of 2129) PASS: lldb-api :: functionalities/data-formatter/nssetsynth/TestNSSetSynthetic.py (1418 of 2129) PASS: lldb-unit :: UnwindAssembly/x86/./UnwindAssemblyx86Tests/Testx86AssemblyInspectionEngine.Testi386IgnoredRegisters (1419 of 2129) PASS: lldb-api :: functionalities/data-formatter/data-formatter-objc/TestDataFormatterObjNSException.py (1420 of 2129) PASS: lldb-api :: commands/expression/import-std-module/forward_list/TestForwardListFromStdModule.py (1421 of 2129) PASS: lldb-unit :: Interpreter/./InterpreterTests/OptionArgParserTest.toScriptLanguage (1422 of 2129) UNSUPPORTED: lldb-shell :: Register/arm-fp-read.test (1423 of 2129) PASS: lldb-unit :: ObjectFile/Breakpad/./ObjectFileBreakpadTests/Record.classify (1424 of 2129) PASS: lldb-shell :: Unwind/thread-step-out-ret-addr-check.test (1425 of 2129) PASS: lldb-api :: tools/lldb-server/TestGdbRemoteAttach.py (1426 of 2129) PASS: lldb-api :: macosx/find-app-in-bundle/TestFindAppInBundle.py (1427 of 2129) PASS: lldb-api :: functionalities/multiword-commands/TestMultiWordCommands.py (1428 of 2129) PASS: lldb-api :: commands/platform/file/read/TestPlatformFileRead.py (1429 of 2129) PASS: lldb-shell :: SymbolFile/DWARF/debug_ranges_and_rnglists.test (1430 of 2129) PASS: lldb-api :: functionalities/data-formatter/data-formatter-objc/TestDataFormatterObjCNSDate.py (1431 of 2129) PASS: lldb-shell :: Settings/TestDisassemblyFormat.test (1432 of 2129) PASS: lldb-unit :: Utility/./UtilityTests/StreamTest.PutChar (1433 of 2129) PASS: lldb-shell :: Driver/TestTarget.test (1434 of 2129) PASS: lldb-api :: python_api/disassemble-raw-data/TestDisassemble_VST1_64.py (1435 of 2129) PASS: lldb-api :: functionalities/postmortem/wow64_minidump/TestWow64MiniDump.py (1436 of 2129) PASS: lldb-shell :: Quit/TestQuitExitCodeImplicit0.test (1437 of 2129) PASS: lldb-unit :: Utility/./UtilityTests/RangeTest.ContainsEndInclusive (1438 of 2129) PASS: lldb-unit :: ObjectFile/PECOFF/./ObjectFilePECOFFTests/PECallFrameInfoTest.Basic_eh (1439 of 2129) PASS: lldb-api :: lang/cpp/bitfields/TestCppBitfields.py (1440 of 2129) PASS: lldb-shell :: SymbolFile/Breakpad/unwind-via-stack-win.test (1441 of 2129) PASS: lldb-api :: lang/objc/modules/TestObjCModules.py (1442 of 2129) PASS: lldb-shell :: ObjectFile/PECOFF/sections.yaml (1443 of 2129) PASS: lldb-unit :: Host/./HostTests/File.GetWaitableHandleFileno (1444 of 2129) PASS: lldb-unit :: Utility/./UtilityTests/EnvironmentTest.EnvpConversion (1445 of 2129) PASS: lldb-unit :: Utility/./UtilityTests/UriParserTest.SchemeHostSeparator3 (1446 of 2129) PASS: lldb-api :: functionalities/data-formatter/builtin-formats/TestBuiltinFormats.py (1447 of 2129) UNSUPPORTED: lldb-api :: lang/cpp/function-template-parameter-pack/TestFunctionTemplateParameterPack.py (1448 of 2129) PASS: lldb-shell :: Driver/TestConvenienceVariables.test (1449 of 2129) PASS: lldb-unit :: Utility/./UtilityTests/StringListTest.JoinSingle (1450 of 2129) UNSUPPORTED: lldb-api :: commands/register/register/aarch64_sve_registers/rw_access_static_config/TestSVERegisters.py (1451 of 2129) PASS: lldb-shell :: ObjectFile/Breakpad/breakpad-identification.test (1452 of 2129) PASS: lldb-unit :: Utility/./UtilityTests/LogChannelEnabledTest.LogGetLogThread (1453 of 2129) PASS: lldb-unit :: Process/gdb-remote/./ProcessGdbRemoteTests/GDBRemoteCommunicationServerTest.SendErrorResponse_ErrorList (1454 of 2129) PASS: lldb-unit :: ObjectFile/ELF/./ObjectFileELFTests/ObjectFileELFTest.GetSymtab_NoSymEntryPointArmThumbAddressClass (1455 of 2129) PASS: lldb-unit :: ScriptInterpreter/Python/./ScriptInterpreterPythonTests/PythonDataObjectsTest.TestPythonBoolean (1456 of 2129) PASS: lldb-shell :: ObjectFile/ELF/compressed-sections.yaml (1457 of 2129) PASS: lldb-unit :: Utility/./UtilityTests/ArgsTest.TestMultipleArgs (1458 of 2129) UNSUPPORTED: lldb-shell :: SymbolFile/PDB/variables-locations.test (1459 of 2129) PASS: lldb-unit :: Utility/./UtilityTests/AnsiTerminal.Basic (1460 of 2129) PASS: lldb-unit :: Utility/./UtilityTests/FileSpecTest.Match (1461 of 2129) PASS: lldb-api :: functionalities/postmortem/elf-core/gcore/TestGCore.py (1462 of 2129) PASS: lldb-unit :: Symbol/./SymbolTests/TestClangASTImporter.ImportInvalidType (1463 of 2129) PASS: lldb-api :: lang/objcxx/class-name-clash/TestNameClash.py (1464 of 2129) PASS: lldb-unit :: Process/minidump/./LLDBMinidumpTests/MinidumpParserTest.GetThreadsAndGetThreadContext (1465 of 2129) PASS: lldb-unit :: Utility/./UtilityTests/RangeTest.Constructor (1466 of 2129) PASS: lldb-unit :: Process/gdb-remote/./ProcessGdbRemoteTests/GDBRemoteClientBaseTest.SendContinueDelegateInterface (1467 of 2129) PASS: lldb-api :: tools/lldb-server/inferior-crash/TestGdbRemoteAbort.py (1468 of 2129) PASS: lldb-unit :: Breakpoint/./LLDBBreakpointTests/BreakpointIDTest.StringIsBreakpointName (1469 of 2129) PASS: lldb-api :: commands/command/script/import/rdar-12586188/TestRdar12586188.py (1470 of 2129) PASS: lldb-api :: tools/lldb-server/TestGdbRemote_qThreadStopInfo.py (1471 of 2129) PASS: lldb-unit :: Utility/./UtilityTests/ArgsTest.EscapeLLDBCommandArgument (1472 of 2129) PASS: lldb-api :: functionalities/data-formatter/data-formatter-synth/TestDataFormatterSynth.py (1473 of 2129) PASS: lldb-api :: lang/cpp/stl/TestStdCXXDisassembly.py (1474 of 2129) PASS: lldb-api :: functionalities/gdb_remote_client/TestNestedRegDefinitions.py (1475 of 2129) PASS: lldb-unit :: Symbol/./SymbolTests/Type.GetTypeScopeAndBasename (1476 of 2129) PASS: lldb-unit :: Symbol/./SymbolTests/PostfixExpression.ParseOneExpression (1477 of 2129) PASS: lldb-unit :: Utility/./UtilityTests/SharedCluster.ClusterManager (1478 of 2129) PASS: lldb-api :: api/log/TestAPILog.py (1479 of 2129) PASS: lldb-unit :: ScriptInterpreter/Python/./ScriptInterpreterPythonTests/PythonDataObjectsTest.TestPythonFile (1480 of 2129) PASS: lldb-api :: functionalities/thread/concurrent_events/TestConcurrentBreakpointsDelayedBreakpointOneWatchpoint.py (1481 of 2129) PASS: lldb-api :: macosx/lc-note/kern-ver-str/TestKernVerStrLCNOTE.py (1482 of 2129) UNSUPPORTED: lldb-shell :: SymbolFile/PDB/type-quals.test (1483 of 2129) PASS: lldb-unit :: Utility/./UtilityTests/VMRange.ContainsRange (1484 of 2129) PASS: lldb-unit :: Utility/./UtilityTests/StreamTeeTest.GetStreamAtIndexOutOfBoundsEmpty (1485 of 2129) PASS: lldb-unit :: Utility/./UtilityTests/NameMatchesTest.EndsWith (1486 of 2129) PASS: lldb-api :: types/TestLongTypes.py (1487 of 2129) PASS: lldb-api :: functionalities/data-formatter/data-formatter-globals/TestDataFormatterGlobals.py (1488 of 2129) PASS: lldb-api :: lang/c/bitfields/TestBitfields.py (1489 of 2129) PASS: lldb-api :: lang/objc/modules-incomplete/TestIncompleteModules.py (1490 of 2129) PASS: lldb-api :: lang/objc/forward-decl/TestForwardDecl.py (1491 of 2129) PASS: lldb-shell :: Breakpoint/debug_rnglist_basic.test (1492 of 2129) PASS: lldb-unit :: Utility/./UtilityTests/StringListTest.InsertStringAtIndexOutOfBounds (1493 of 2129) PASS: lldb-unit :: Process/minidump/./LLDBMinidumpTests/MinidumpParserTest.GetExceptionStream (1494 of 2129) PASS: lldb-shell :: SymbolFile/DWARF/find-basic-variable.cpp (1495 of 2129) PASS: lldb-api :: macosx/macCatalyst/TestMacCatalyst.py (1496 of 2129) PASS: lldb-unit :: Platform/Android/./AdbClientTests/AdbClientTest.CreateByDeviceId_ByEnvVar (1497 of 2129) PASS: lldb-unit :: Utility/./UtilityTests/StringListTest.AppendList (1498 of 2129) PASS: lldb-unit :: Utility/./UtilityTests/TimerTest.CategoryTimesNested (1499 of 2129) PASS: lldb-unit :: Utility/./UtilityTests/VASprintfTest.EncodingError (1500 of 2129) PASS: lldb-api :: types/TestCharTypeExpr.py (1501 of 2129) PASS: lldb-unit :: Utility/./UtilityTests/StreamTest.AddressPrefixAndSuffix (1502 of 2129) PASS: lldb-api :: commands/command/source/TestCommandSource.py (1503 of 2129) PASS: lldb-api :: functionalities/breakpoint/consecutive_breakpoints/TestConsecutiveBreakpoints.py (1504 of 2129) PASS: lldb-api :: functionalities/data-formatter/data-formatter-stl/libcxx/iterator/TestDataFormatterLibccIterator.py (1505 of 2129) PASS: lldb-unit :: Utility/./UtilityTests/StringListTest.InsertStringAtIndexStdString (1506 of 2129) PASS: lldb-unit :: Utility/./UtilityTests/UriParserTest.MinimalPortPath (1507 of 2129) PASS: lldb-shell :: SymbolFile/DWARF/debug-types-address-ranges.s (1508 of 2129) PASS: lldb-api :: lang/c/local_variables/TestLocalVariables.py (1509 of 2129) PASS: lldb-api :: commands/process/signal/TestProcessSignal.py (1510 of 2129) PASS: lldb-unit :: Host/./HostTests/HostInfoTest.GetXcodeSDK (1511 of 2129) PASS: lldb-shell :: ObjectFile/ELF/base-address.yaml (1512 of 2129) PASS: lldb-shell :: Reproducer/Modules/TestModuleCXX.test (1513 of 2129) PASS: lldb-api :: lang/objc/objc-new-syntax/TestObjCNewSyntaxArray.py (1514 of 2129) PASS: lldb-unit :: Utility/./UtilityTests/RangeTest.LessThan (1515 of 2129) PASS: lldb-unit :: Language/Highlighting/./HighlighterTests/HighlighterTest.ClangCursorPosBeforeOtherToken (1516 of 2129) PASS: lldb-api :: lang/objc/objc-new-syntax/TestObjCNewSyntaxLiteral.py (1517 of 2129) PASS: lldb-unit :: UnwindAssembly/x86/./UnwindAssemblyx86Tests/Testx86AssemblyInspectionEngine.TestPushR13 (1518 of 2129) PASS: lldb-api :: python_api/type/TestTypeList.py (1519 of 2129) PASS: lldb-api :: functionalities/data-formatter/data-formatter-caching/TestDataFormatterCaching.py (1520 of 2129) PASS: lldb-api :: lang/c/shared_lib_stripped_symbols/TestSharedLibStrippedSymbols.py (1521 of 2129) PASS: lldb-api :: commands/expression/import-std-module/queue/TestQueueFromStdModule.py (1522 of 2129) PASS: lldb-api :: commands/expression/import_builtin_fileid/TestImportBuiltinFileID.py (1523 of 2129) UNSUPPORTED: lldb-api :: functionalities/darwin_log/filter/exact_match/message/TestDarwinLogFilterMatchMessage.py (1524 of 2129) PASS: lldb-api :: functionalities/inferior-crashing/recursive-inferior/TestRecursiveInferiorStep.py (1525 of 2129) PASS: lldb-unit :: Utility/./UtilityTests/StringListTest.LongestCommonPrefixDuplicateElement (1526 of 2129) PASS: lldb-unit :: Utility/./UtilityTests/ArchSpecTest.TestParseMachCPUDashSubtypeTripleExtra (1527 of 2129) PASS: lldb-api :: lang/objc/global_ptrs/TestGlobalObjects.py (1528 of 2129) PASS: lldb-api :: lang/c/complex_int/TestComplexInt.py (1529 of 2129) UNSUPPORTED: lldb-api :: commands/register/register/intel_xtended_registers/mpx_bound_violation/TestBoundViolation.py (1530 of 2129) PASS: lldb-unit :: Utility/./UtilityTests/StringListTest.SplitIntoLinesSingleTrailingCR (1531 of 2129) PASS: lldb-unit :: Host/./HostTests/NativeProcessProtocolTest.ReadCStringFromMemory_MaxSize (1532 of 2129) PASS: lldb-unit :: Process/gdb-remote/./ProcessGdbRemoteTests/GDBRemoteClientBaseTest.SendContinueAndAsyncSignal (1533 of 2129) PASS: lldb-unit :: Utility/./UtilityTests/FileSpecTest.EqualDotsPosixRoot (1534 of 2129) PASS: lldb-unit :: Host/./HostTests/SocketAddressTest.Set (1535 of 2129) PASS: lldb-unit :: Utility/./UtilityTests/StreamTest.PutBytesAsRawHex8ToLittleEndian (1536 of 2129) UNSUPPORTED: lldb-api :: lang/cpp/printf/TestPrintf.py (1537 of 2129) PASS: lldb-api :: lang/objc/variadic_methods/TestVariadicMethods.py (1538 of 2129) PASS: lldb-unit :: Symbol/./SymbolTests/TestTypeSystemClang.TestGetEnumIntegerTypeUnexpectedType (1539 of 2129) PASS: lldb-api :: python_api/lldbutil/iter/TestRegistersIterator.py (1540 of 2129) PASS: lldb-shell :: Breakpoint/debug_addrx.test (1541 of 2129) PASS: lldb-api :: lang/objc/modules-app-update/TestClangModulesAppUpdate.py (1542 of 2129) PASS: lldb-api :: tools/lldb-vscode/breakpoint/TestVSCode_setExceptionBreakpoints.py (1543 of 2129) UNSUPPORTED: lldb-shell :: Watchpoint/netbsd-nouserdbregs.test (1544 of 2129) PASS: lldb-api :: functionalities/target-new-solib-notifications/TestModuleLoadedNotifys.py (1545 of 2129) PASS: lldb-api :: lang/c/tls_globals/TestTlsGlobals.py (1546 of 2129) PASS: lldb-api :: lang/objc/foundation/TestConstStrings.py (1547 of 2129) PASS: lldb-api :: functionalities/wrong_commands/TestWrongCommands.py (1548 of 2129) PASS: lldb-api :: commands/expression/test/TestExprs2.py (1549 of 2129) PASS: lldb-unit :: Language/Highlighting/./HighlighterTests/HighlighterTest.DefaultHighlighterWithCursorOutOfBounds (1550 of 2129) PASS: lldb-unit :: Utility/./UtilityTests/StreamTest.PutNHex8 (1551 of 2129) PASS: lldb-shell :: SymbolFile/DWARF/debug_loclists-dwo.s (1552 of 2129) PASS: lldb-api :: functionalities/plugins/command_plugin/TestPluginCommands.py (1553 of 2129) PASS: lldb-unit :: Utility/./UtilityTests/AnsiTerminal.KnownPrefix (1554 of 2129) PASS: lldb-shell :: ObjectFile/ELF/section-addresses.yaml (1555 of 2129) PASS: lldb-shell :: ScriptInterpreter/None/import_module.test (1556 of 2129) PASS: lldb-api :: commands/frame/diagnose/complicated-expression/TestComplicatedExpression.py (1557 of 2129) PASS: lldb-unit :: Utility/./UtilityTests/UriParserTest.LongPath (1558 of 2129) PASS: lldb-unit :: Expression/./ExpressionTests/DiagnosticManagerTest.FixedExpression (1559 of 2129) PASS: lldb-api :: functionalities/thread/step_out/TestThreadStepOut.py (1560 of 2129) PASS: lldb-unit :: Expression/./ExpressionTests/ClangHostTest.ComputeClangResourceDirectory (1561 of 2129) PASS: lldb-shell :: Driver/TestHelp.test (1562 of 2129) PASS: lldb-unit :: Utility/./UtilityTests/ArgsTest.TestUnknownEscape (1563 of 2129) UNSUPPORTED: lldb-shell :: Breakpoint/case-insensitive.test (1564 of 2129) PASS: lldb-unit :: Utility/./UtilityTests/RangeTest.ContainsRangeStartingFromZero (1565 of 2129) UNSUPPORTED: lldb-api :: functionalities/unwind/standard/TestStandardUnwind.py (1566 of 2129) PASS: lldb-api :: commands/gui/breakpoints/TestGuiBreakpoints.py (1567 of 2129) PASS: lldb-unit :: Process/minidump/./LLDBMinidumpTests/MinidumpParserTest.GetLinuxProcStatus (1568 of 2129) PASS: lldb-unit :: UnwindAssembly/x86/./UnwindAssemblyx86Tests/Testx86AssemblyInspectionEngine.TestPushEDX (1569 of 2129) PASS: lldb-api :: lang/objc/direct-dispatch-step/TestObjCDirectDispatchStepping.py (1570 of 2129) UNSUPPORTED: lldb-api :: tools/lldb-server/thread-name/TestGdbRemoteThreadName.py (1571 of 2129) UNSUPPORTED: lldb-api :: commands/watchpoints/hello_watchlocation/TestWatchLocation.py (1572 of 2129) PASS: lldb-unit :: Process/minidump/./LLDBMinidumpTests/MinidumpParserTest.GetArchitectureWindows (1573 of 2129) PASS: lldb-api :: lang/objc/foundation/TestObjCMethods.py (1574 of 2129) PASS: lldb-unit :: Utility/./UtilityTests/ArgsTest.AppendArguments (1575 of 2129) PASS: lldb-api :: functionalities/data-formatter/typedef_array/TestTypedefArray.py (1576 of 2129) PASS: lldb-api :: functionalities/conditional_break/TestConditionalBreak.py (1577 of 2129) PASS: lldb-unit :: Host/./HostTests/NativeProcessProtocolTest.SetBreakpointFailRead (1578 of 2129) PASS: lldb-unit :: Target/./TargetTests/ModuleCacheTest.GetAndPutStrangeHostname (1579 of 2129) UNSUPPORTED: lldb-api :: functionalities/data-formatter/data-formatter-stl/libstdcpp/string/TestDataFormatterStdString.py (1580 of 2129) PASS: lldb-unit :: Utility/./UtilityTests/BinaryStreamTest.PutSLEB128TwoBytes (1581 of 2129) PASS: lldb-unit :: Process/gdb-remote/./ProcessGdbRemoteTests/GDBRemoteClientBaseTest.SendPacketAndReceiveResponseWithOutputSupport (1582 of 2129) UNSUPPORTED: lldb-shell :: ScriptInterpreter/Lua/breakpoint_callback.test (1583 of 2129) PASS: lldb-api :: functionalities/tsan/thread_numbers/TestTsanThreadNumbers.py (1584 of 2129) PASS: lldb-api :: commands/command/script/import/TestImport.py (1585 of 2129) PASS: lldb-api :: tools/lldb-vscode/step/TestVSCode_step.py (1586 of 2129) PASS: lldb-api :: functionalities/unwind/noreturn/TestNoreturnUnwind.py (1587 of 2129) PASS: lldb-api :: functionalities/data-formatter/data-formatter-python-synth/TestDataFormatterPythonSynth.py (1588 of 2129) PASS: lldb-unit :: Utility/./UtilityTests/StringListTest.LongestCommonPrefix (1589 of 2129) PASS: lldb-unit :: SymbolFile/DWARF/./SymbolFileDWARFTests/XcodeSDKModuleTests.TestModuleGetXcodeSDK (1590 of 2129) PASS: lldb-api :: types/TestFloatTypes.py (1591 of 2129) PASS: lldb-api :: functionalities/breakpoint/cpp/TestCPPBreakpointLocations.py (1592 of 2129) PASS: lldb-api :: functionalities/unwind/noreturn/module-end/TestNoReturnModuleEnd.py (1593 of 2129) PASS: lldb-unit :: Symbol/./SymbolTests/TestTypeSystemClang.TestDeletingImplicitCopyCstrDueToMoveCStr (1594 of 2129) PASS: lldb-api :: functionalities/gdb_remote_client/TestRecognizeBreakpoint.py (1595 of 2129) PASS: lldb-unit :: Core/./LLDBCoreTests/RichManglingContextTest.SwitchProvider (1596 of 2129) PASS: lldb-api :: python_api/process/read-mem-cstring/TestReadMemCString.py (1597 of 2129) PASS: lldb-unit :: Utility/./UtilityTests/StringExtractorTest.GetHexU8_Extra (1598 of 2129) PASS: lldb-api :: commands/target/modules/search-paths/insert/TestTargetModulesSearchpathsInsert.py (1599 of 2129) PASS: lldb-api :: terminal/TestSTTYBeforeAndAfter.py (1600 of 2129) PASS: lldb-unit :: Utility/./UtilityTests/VMRange.CollectionContains (1601 of 2129) PASS: lldb-api :: functionalities/thread/concurrent_events/TestConcurrentTwoWatchpointsOneSignal.py (1602 of 2129) PASS: lldb-unit :: Utility/./UtilityTests/RangeTest.NotEqualInvalid (1603 of 2129) PASS: lldb-api :: commands/quit/TestQuit.py (1604 of 2129) PASS: lldb-api :: tools/lldb-vscode/breakpoint-events/TestVSCode_breakpointEvents.py (1605 of 2129) PASS: lldb-api :: lang/c/anonymous/TestAnonymous.py (1606 of 2129) PASS: lldb-unit :: Host/./HostTests/SocketTest.TCPGetConnectURI (1607 of 2129) PASS: lldb-shell :: SymbolFile/DWARF/debug_rnglists-dwo.s (1608 of 2129) PASS: lldb-unit :: Utility/./UtilityTests/StreamTest.PutHex16ByteOrderLittle (1609 of 2129) PASS: lldb-unit :: Utility/./UtilityTests/UriParserTest.BracketedHostnameWithPortIPv6 (1610 of 2129) PASS: lldb-unit :: Utility/./UtilityTests/ScalarTest.Promotion (1611 of 2129) PASS: lldb-unit :: ScriptInterpreter/Python/./ScriptInterpreterPythonTests/PythonDataObjectsTest.TestPythonListToStructuredList (1612 of 2129) PASS: lldb-shell :: Reproducer/TestHomeDir.test (1613 of 2129) PASS: lldb-unit :: Utility/./UtilityTests/Flags.GetBitSize (1614 of 2129) PASS: lldb-api :: functionalities/thread/concurrent_events/TestConcurrentSignalDelayWatch.py (1615 of 2129) PASS: lldb-api :: lang/cpp/function-qualifiers/TestCppFunctionQualifiers.py (1616 of 2129) PASS: lldb-api :: functionalities/tail_call_frames/disambiguate_paths_to_common_sink/TestDisambiguatePathsToCommonSink.py (1617 of 2129) PASS: lldb-api :: commands/expression/vector_of_enums/TestVectorOfEnums.py (1618 of 2129) PASS: lldb-shell :: ObjectFile/ELF/short-build-id.yaml (1619 of 2129) PASS: lldb-api :: functionalities/data-formatter/refpointer-recursion/TestDataFormatterRefPtrRecursion.py (1620 of 2129) PASS: lldb-unit :: Utility/./UtilityTests/StringListTest.AppendStringMove (1621 of 2129) PASS: lldb-shell :: SymbolFile/NativePDB/break-by-function.cpp (1622 of 2129) PASS: lldb-api :: functionalities/gdb_remote_client/TestPlatformClient.py (1623 of 2129) PASS: lldb-api :: python_api/process/io/TestProcessIO.py (1624 of 2129) UNSUPPORTED: lldb-api :: functionalities/data-formatter/data-formatter-stl/libstdcpp/iterator/TestDataFormatterStdIterator.py (1625 of 2129) PASS: lldb-api :: lang/objc/objc-dyn-sbtype/TestObjCDynamicSBType.py (1626 of 2129) PASS: lldb-unit :: Target/./TargetTests/MCBasedABI.MapRegisterName (1627 of 2129) PASS: lldb-unit :: ObjectFile/ELF/./ObjectFileELFTests/ObjectFileELFTest.GetModuleSpecifications_EarlySectionHeaders (1628 of 2129) PASS: lldb-api :: lang/cpp/limit-debug-info/TestWithLimitDebugInfo.py (1629 of 2129) PASS: lldb-unit :: Utility/./UtilityTests/ListenerTest.GetEventWait (1630 of 2129) PASS: lldb-api :: commands/breakpoint/set/func-regex/TestBreakpointRegexError.py (1631 of 2129) PASS: lldb-api :: commands/expression/codegen-crash-typedefdecl-not-in_declcontext/TestCodegenCrashTypedefDeclNotInDeclContext.py (1632 of 2129) PASS: lldb-api :: functionalities/breakpoint/auto_continue/TestBreakpointAutoContinue.py (1633 of 2129) PASS: lldb-api :: functionalities/thread/concurrent_events/TestConcurrentSignalBreak.py (1634 of 2129) PASS: lldb-unit :: Utility/./UtilityTests/ArgsTest.TestOverwriteArgs (1635 of 2129) PASS: lldb-unit :: SymbolFile/DWARF/./SymbolFileDWARFTests/SymbolFileDWARFTests.TestAbbrevMissingTerminator (1636 of 2129) PASS: lldb-shell :: ObjectFile/ELF/PT_LOAD-empty.yaml (1637 of 2129) UNSUPPORTED: lldb-api :: tools/lldb-server/registers-target-xml-reading/TestGdbRemoteTargetXmlPacket.py (1638 of 2129) PASS: lldb-shell :: SymbolFile/DWARF/debug_ranges.s (1639 of 2129) PASS: lldb-api :: commands/expression/namespace_local_var_same_name_cpp_and_c/TestNamespaceLocalVarSameNameCppAndC.py (1640 of 2129) PASS: lldb-shell :: Minidump/memory-region-from-module.yaml (1641 of 2129) PASS: lldb-unit :: Utility/./UtilityTests/LogTest.LLDB_LOG_nullptr (1642 of 2129) PASS: lldb-api :: commands/add-dsym/uuid/TestAddDsymCommand.py (1643 of 2129) PASS: lldb-unit :: ObjectFile/ELF/./ObjectFileELFTests/ObjectFileELFTest.SectionsResolveConsistently (1644 of 2129) PASS: lldb-unit :: Utility/./UtilityTests/UUIDTest.Validity (1645 of 2129) PASS: lldb-unit :: UnwindAssembly/x86/./UnwindAssemblyx86Tests/Testx86AssemblyInspectionEngine.TestPushECX (1646 of 2129) PASS: lldb-unit :: Utility/./UtilityTests/ScalarTest.LongLongAssigmentOperator (1647 of 2129) PASS: lldb-unit :: Process/minidump/./LLDBMinidumpTests/MinidumpParserTest.GetThreadContext_x86_32 (1648 of 2129) PASS: lldb-shell :: SymbolFile/DWARF/find-inline-method.s (1649 of 2129) PASS: lldb-shell :: Commands/command-script-import.test (1650 of 2129) PASS: lldb-api :: functionalities/type_completion/TestTypeCompletion.py (1651 of 2129) UNSUPPORTED: lldb-api :: functionalities/darwin_log/source/info/TestDarwinLogSourceInfo.py (1652 of 2129) PASS: lldb-api :: types/TestCharType.py (1653 of 2129) PASS: lldb-shell :: ScriptInterpreter/Python/eof.test (1654 of 2129) PASS: lldb-api :: functionalities/postmortem/elf-core/thread_crash/TestLinuxCoreThreads.py (1655 of 2129) PASS: lldb-api :: functionalities/postmortem/minidump-new/TestMiniDumpNew.py (1656 of 2129) PASS: lldb-api :: macosx/duplicate-archive-members/TestDuplicateMembers.py (1657 of 2129) PASS: lldb-api :: lang/c/forward/TestForwardDeclaration.py (1658 of 2129) PASS: lldb-unit :: Utility/./UtilityTests/UUIDTest.SetFromStringRef (1659 of 2129) PASS: lldb-unit :: Utility/./UtilityTests/StringListTest.SetSize (1660 of 2129) PASS: lldb-api :: python_api/section/TestSectionAPI.py (1661 of 2129) PASS: lldb-shell :: Settings/TestStopCommandSourceOnError.test (1662 of 2129) PASS: lldb-unit :: Utility/./UtilityTests/CompletionRequest.ShiftArguments (1663 of 2129) UNSUPPORTED: lldb-api :: lang/cpp/static_members/TestCPPStaticMembers.py (1664 of 2129) PASS: lldb-api :: functionalities/thread/concurrent_events/TestConcurrentSignalDelayBreak.py (1665 of 2129) PASS: lldb-unit :: Utility/./UtilityTests/RangeTest.ClearWithStarAddress (1666 of 2129) PASS: lldb-unit :: tools/lldb-server/tests/./LLDBServerTests/TestBase.DebugserverEnv (1667 of 2129) PASS: lldb-unit :: UnwindAssembly/x86/./UnwindAssemblyx86Tests/Testx86AssemblyInspectionEngine.TestPopRBPWithREX (1668 of 2129) PASS: lldb-unit :: Utility/./UtilityTests/StringExtractorTest.GetHexU8_Underflow_NoEof (1669 of 2129) PASS: lldb-api :: lang/objc/modules-compile-error/TestModulesCompileError.py (1670 of 2129) PASS: lldb-shell :: SymbolFile/DWARF/debug_line-relative_path.s (1671 of 2129) PASS: lldb-unit :: ObjectFile/MachO/./ObjectFileMachOTests/ObjectFileMachOTest.ModuleFromSharedCacheInfo (1672 of 2129) PASS: lldb-unit :: SymbolFile/DWARF/./SymbolFileDWARFTests/DWARFASTParserClangTests.EnsureAllDIEsInDeclContextHaveBeenParsedParsesOnlyMatchingEntries (1673 of 2129) PASS: lldb-unit :: Utility/./UtilityTests/SerializationRountripTest.SerializeDeserializeCStringNull (1674 of 2129) PASS: lldb-api :: functionalities/data-formatter/data-formatter-stl/libcxx/string/TestDataFormatterLibcxxString.py (1675 of 2129) PASS: lldb-unit :: Utility/./UtilityTests/StatusTest.ErrorCodeConstructor (1676 of 2129) PASS: lldb-api :: commands/watchpoints/watchpoint_commands/command/TestWatchpointCommandLLDB.py (1677 of 2129) PASS: lldb-unit :: Core/./LLDBCoreTests/StreamCallbackTest.Callback (1678 of 2129) PASS: lldb-unit :: Expression/./ExpressionTests/ClangExpressionDeclMapTest.TestUnknownIdentifierLookup (1679 of 2129) PASS: lldb-shell :: SymbolFile/DWARF/dwarf5-partial-index.cpp (1680 of 2129) PASS: lldb-unit :: Utility/./UtilityTests/StreamTest.PutSLEB128 (1681 of 2129) PASS: lldb-shell :: SymbolFile/DWARF/DW_AT_data_bit_offset-DW_OP_stack_value.s (1682 of 2129) PASS: lldb-shell :: Reproducer/TestSynchronous.test (1683 of 2129) PASS: lldb-api :: functionalities/data-formatter/data-formatter-stl/libcxx/initializerlist/TestInitializerList.py (1684 of 2129) PASS: lldb-api :: functionalities/data-formatter/data-formatter-stl/libcxx/forward_list/TestDataFormatterLibcxxForwardList.py (1685 of 2129) PASS: lldb-api :: functionalities/data-formatter/data-formatter-ptr-to-array/TestPtrToArrayFormatting.py (1686 of 2129) PASS: lldb-api :: lang/c/modules/TestCModules.py (1687 of 2129) PASS: lldb-unit :: Editline/./EditlineTests/EditlineTestFixture.EditlineReceivesMultiLineText (1688 of 2129) PASS: lldb-api :: commands/watchpoints/multiple_threads/TestWatchpointMultipleThreads.py (1689 of 2129) PASS: lldb-unit :: Utility/./UtilityTests/UriParserTest.BracketedHostnameWithPortIPv4 (1690 of 2129) PASS: lldb-api :: lang/cpp/signed_types/TestSignedTypes.py (1691 of 2129) PASS: lldb-unit :: Process/minidump/./LLDBMinidumpTests/MinidumpParserTest.GetPidWow64 (1692 of 2129) PASS: lldb-unit :: Utility/./UtilityTests/PassiveReplayTest.InstrumentedBar (1693 of 2129) PASS: lldb-unit :: Utility/./UtilityTests/StreamTeeTest.Constructor2Streams (1694 of 2129) PASS: lldb-unit :: Utility/./UtilityTests/StreamTest.PutMaxHex64ByteOrderLittle (1695 of 2129) UNSUPPORTED: lldb-api :: functionalities/thread/multi_break/TestMultipleBreakpoints.py (1696 of 2129) PASS: lldb-unit :: Utility/./UtilityTests/DataExtractorTest.GetDouble (1697 of 2129) PASS: lldb-unit :: Utility/./UtilityTests/StatusTest.Formatv (1698 of 2129) PASS: lldb-unit :: Utility/./UtilityTests/LogChannelTest.List (1699 of 2129) PASS: lldb-unit :: SymbolFile/NativePDB/./SymbolFileNativePDBTests/PDBFPOProgramToDWARFExpressionTests.DependencyChain (1700 of 2129) UNSUPPORTED: lldb-api :: commands/expression/completion-crash-invalid-iterator/TestInvalidIteratorCompletionCrash.py (1701 of 2129) PASS: lldb-unit :: Utility/./UtilityTests/AnsiTerminal.WhiteSpace (1702 of 2129) PASS: lldb-unit :: Utility/./UtilityTests/StringExtractorTest.GetHexU8_Extra_NoEof (1703 of 2129) PASS: lldb-unit :: Utility/./UtilityTests/ConstStringTest.MangledCounterpart (1704 of 2129) PASS: lldb-unit :: SymbolFile/NativePDB/./SymbolFileNativePDBTests/PDBFPOProgramToDWARFExpressionTests.MultipleDependentAssignments (1705 of 2129) PASS: lldb-unit :: Expression/./ExpressionTests/CppModuleConfigurationTest.MissingLibCpp (1706 of 2129) PASS: lldb-shell :: SymbolFile/DWARF/find-qualified-variable.cpp (1707 of 2129) PASS: lldb-api :: commands/expression/import-std-module/deque-basic/TestDequeFromStdModule.py (1708 of 2129) PASS: lldb-api :: commands/expression/formatters/TestFormatters.py (1709 of 2129) PASS: lldb-api :: source-manager/TestSourceManager.py (1710 of 2129) PASS: lldb-api :: functionalities/thread/thread_exit/TestThreadExit.py (1711 of 2129) PASS: lldb-shell :: Driver/TestError.test (1712 of 2129) PASS: lldb-unit :: UnwindAssembly/x86/./UnwindAssemblyx86Tests/Testx86AssemblyInspectionEngine.TestSpArithx86_64Augmented (1713 of 2129) PASS: lldb-unit :: Utility/./UtilityTests/TimeoutTest.Construction (1714 of 2129) PASS: lldb-unit :: Utility/./UtilityTests/SubsystemRAIITest.NormalSubsystem (1715 of 2129) PASS: lldb-unit :: Process/minidump/./LLDBMinidumpTests/MinidumpParserTest.GetMiscInfoWindows (1716 of 2129) PASS: lldb-api :: lang/c/stepping/TestStepAndBreakpoints.py (1717 of 2129) PASS: lldb-api :: python_api/function_symbol/TestDisasmAPI.py (1718 of 2129) PASS: lldb-api :: commands/expression/import-std-module/vector-bool/TestVectorBoolFromStdModule.py (1719 of 2129) PASS: lldb-shell :: Recognizer/assert.test (1720 of 2129) PASS: lldb-unit :: Target/./TargetTests/PathMappingListTest.RelativeTests (1721 of 2129) UNSUPPORTED: lldb-shell :: SymbolFile/PDB/ast-restore.test (1722 of 2129) PASS: lldb-api :: lang/cpp/alignas_base_class/TestAlignAsBaseClass.py (1723 of 2129) PASS: lldb-unit :: Utility/./UtilityTests/BroadcasterTest.EventTypeHasListeners (1724 of 2129) PASS: lldb-unit :: Core/./LLDBCoreTests/ModuleSpecTest.TestELFFile (1725 of 2129) PASS: lldb-api :: functionalities/breakpoint/breakpoint_locations/TestBreakpointLocations.py (1726 of 2129) PASS: lldb-api :: python_api/function_symbol/TestSymbolAPI.py (1727 of 2129) PASS: lldb-api :: functionalities/recursion/TestValueObjectRecursion.py (1728 of 2129) PASS: lldb-api :: functionalities/plugins/python_os_plugin/stepping_plugin_threads/TestOSPluginStepping.py (1729 of 2129) PASS: lldb-api :: tools/lldb-vscode/module/TestVSCode_module.py (1730 of 2129) PASS: lldb-shell :: Settings/TestSettingsWrite.test (1731 of 2129) UNSUPPORTED: lldb-shell :: Register/aarch64-fp-read.test (1732 of 2129) PASS: lldb-api :: functionalities/thread/concurrent_events/TestConcurrentSignalWatch.py (1733 of 2129) PASS: lldb-unit :: Utility/./UtilityTests/RangeDataVector.FindEntryIndexesThatContain_Overlap (1734 of 2129) PASS: lldb-unit :: Process/gdb-remote/./ProcessGdbRemoteTests/GDBRemoteCommunicationClientTest.SyncThreadState (1735 of 2129) PASS: lldb-shell :: Minidump/breakpad-symbols.test (1736 of 2129) PASS: lldb-unit :: Process/gdb-remote/./ProcessGdbRemoteTests/GDBRemoteCommunicationClientTest.SendGetTraceConfigPacket (1737 of 2129) PASS: lldb-api :: functionalities/optimized_code/TestNoASanExceptionAfterEvalOP_piece.py (1738 of 2129) PASS: lldb-unit :: Utility/./UtilityTests/StringExtractorTest.GetNameColonValueNoSemicolon (1739 of 2129) PASS: lldb-unit :: Process/minidump/./LLDBMinidumpTests/MinidumpParserTest.GetFilteredModuleList (1740 of 2129) PASS: lldb-unit :: ObjectFile/PECOFF/./ObjectFilePECOFFTests/PECallFrameInfoTest.Frame_reg_eh (1741 of 2129) PASS: lldb-api :: lang/cpp/this/TestCPPThis.py (1742 of 2129) PASS: lldb-unit :: Utility/./UtilityTests/StringExtractorTest.GetNameColonValueSuccess (1743 of 2129) PASS: lldb-unit :: Utility/./UtilityTests/UriParserTest.SchemeHostSeparator (1744 of 2129) PASS: lldb-shell :: SymbolFile/DWARF/DW_TAG_basic_type_DW_ATE_UTF_nonC.ll (1745 of 2129) PASS: lldb-unit :: UnwindAssembly/PPC64/./PPC64InstEmulationTests/TestPPC64InstEmulation.TestMediumFunction (1746 of 2129) PASS: lldb-unit :: Utility/./UtilityTests/ScalarTest.Equality (1747 of 2129) PASS: lldb-unit :: Process/gdb-remote/./ProcessGdbRemoteTests/GDBRemoteClientBaseTest.SendContinueAndAsyncPacket (1748 of 2129) PASS: lldb-unit :: Host/./HostTests/FileSystemTest.EnumerateDirectory (1749 of 2129) PASS: lldb-shell :: Reproducer/TestCrash.test (1750 of 2129) PASS: lldb-unit :: Utility/./UtilityTests/StreamTest.AddressRangeEmptyRange (1751 of 2129) PASS: lldb-api :: functionalities/data-formatter/data-formatter-stl/libcxx/list/TestDataFormatterLibcxxList.py (1752 of 2129) PASS: lldb-unit :: Utility/./UtilityTests/StreamTest.ShiftOperatorStrings (1753 of 2129) PASS: lldb-unit :: Language/Highlighting/./HighlighterTests/HighlighterTest.ClangUnterminatedString (1754 of 2129) PASS: lldb-shell :: Commands/command-disassemble.s (1755 of 2129) PASS: lldb-unit :: Language/Highlighting/./HighlighterTests/HighlighterTest.Colons (1756 of 2129) PASS: lldb-api :: lang/objc/unicode-string/TestUnicodeString.py (1757 of 2129) PASS: lldb-api :: functionalities/data-formatter/data-formatter-synthtype/TestDataFormatterSynthType.py (1758 of 2129) PASS: lldb-api :: lang/cpp/frame-var-anon-unions/TestFrameVariableAnonymousUnions.py (1759 of 2129) PASS: lldb-api :: python_api/module_section/TestModuleAndSection.py (1760 of 2129) PASS: lldb-api :: commands/statistics/basic/TestStats.py (1761 of 2129) PASS: lldb-unit :: Utility/./UtilityTests/VMRange.Clear (1762 of 2129) PASS: lldb-shell :: ObjectFile/ELF/basic-info.yaml (1763 of 2129) UNSUPPORTED: lldb-shell :: ScriptInterpreter/Lua/command_script_import.test (1764 of 2129) PASS: lldb-unit :: UnwindAssembly/x86/./UnwindAssemblyx86Tests/Testx86AssemblyInspectionEngine.TestPopR15 (1765 of 2129) PASS: lldb-api :: lang/cpp/class_types/TestClassTypesDisassembly.py (1766 of 2129) PASS: lldb-unit :: Utility/./UtilityTests/FileSpecTest.PrependPathComponent (1767 of 2129) UNSUPPORTED: lldb-api :: functionalities/process_save_core/TestProcessSaveCore.py (1768 of 2129) PASS: lldb-api :: functionalities/float-display/TestFloatDisplay.py (1769 of 2129) PASS: lldb-unit :: SymbolFile/NativePDB/./SymbolFileNativePDBTests/PDBFPOProgramToDWARFExpressionTests.MultipleIndependentAssignments (1770 of 2129) PASS: lldb-shell :: SymbolFile/DWARF/clang-ast-from-dwarf-objc-property.m (1771 of 2129) PASS: lldb-api :: python_api/lldbutil/TestSwigVersion.py (1772 of 2129) PASS: lldb-shell :: Reproducer/TestDiscard.test (1773 of 2129) PASS: lldb-unit :: Process/gdb-remote/./ProcessGdbRemoteTests/GDBRemoteCommunicationClientTest.TestPacketSpeedJSON (1774 of 2129) PASS: lldb-api :: lang/cpp/virtual-overload/TestVirtualOverload.py (1775 of 2129) PASS: lldb-unit :: Utility/./UtilityTests/ProcessInstanceInfo.Yaml (1776 of 2129) PASS: lldb-unit :: ScriptInterpreter/Python/./ScriptInterpreterPythonTests/PythonDataObjectsTest.TestPythonTupleSize (1777 of 2129) PASS: lldb-shell :: Reproducer/Functionalities/TestImageList.test (1778 of 2129) PASS: lldb-api :: lang/cpp/breakpoint_in_member_func_w_non_primitive_params/TestBreakpointInMemberFuncWNonPrimitiveParams.py (1779 of 2129) PASS: lldb-shell :: SymbolFile/DWARF/DW_AT_loclists_base.s (1780 of 2129) PASS: lldb-unit :: Utility/./UtilityTests/StringLexerTest.Next (1781 of 2129) PASS: lldb-shell :: BuildScript/compiler-full-path.test (1782 of 2129) PASS: lldb-shell :: ObjectFile/MachO/lc_build_version_notools.yaml (1783 of 2129) PASS: lldb-unit :: Utility/./UtilityTests/StringExtractorTest.GetHexBytesAvail_OddPair (1784 of 2129) PASS: lldb-api :: lang/cpp/nsimport/TestCppNsImport.py (1785 of 2129) PASS: lldb-shell :: ObjectFile/Breakpad/discontiguous-sections.test (1786 of 2129) PASS: lldb-api :: lang/cpp/llvm-style/TestLLVMStyle.py (1787 of 2129) PASS: lldb-api :: functionalities/avoids-fd-leak/TestFdLeak.py (1788 of 2129) PASS: lldb-api :: functionalities/type_lookup/TestTypeLookup.py (1789 of 2129) PASS: lldb-unit :: Utility/./UtilityTests/RangeTest.LessThanInvalid (1790 of 2129) PASS: lldb-unit :: Utility/./UtilityTests/StringListTest.AppendStringStdString (1791 of 2129) PASS: lldb-shell :: Reproducer/TestVersionCheck.test (1792 of 2129) PASS: lldb-unit :: Utility/./UtilityTests/CompletionRequest.TryCompleteCurrentArgMode (1793 of 2129) PASS: lldb-api :: commands/command/delete/TestCommandDelete.py (1794 of 2129) PASS: lldb-unit :: Utility/./UtilityTests/BinaryStreamTest.PutULEB128One (1795 of 2129) PASS: lldb-unit :: Utility/./UtilityTests/RangeTest.ContainsAddr (1796 of 2129) PASS: lldb-shell :: SymbolFile/DWARF/split-dwarf-multiple-cu.ll (1797 of 2129) PASS: lldb-api :: functionalities/signal/TestSendSignal.py (1798 of 2129) PASS: lldb-unit :: Utility/./UtilityTests/OptionsWithRawTest.EmptySuffix (1799 of 2129) UNSUPPORTED: lldb-shell :: Register/x86-zmm-read.test (1800 of 2129) PASS: lldb-unit :: Utility/./UtilityTests/ProcessInfoTest.Constructor (1801 of 2129) PASS: lldb-api :: functionalities/data-formatter/synthcapping/TestSyntheticCapping.py (1802 of 2129) PASS: lldb-api :: python_api/sbplatform/TestSBPlatform.py (1803 of 2129) PASS: lldb-unit :: Process/gdb-remote/./ProcessGdbRemoteTests/GDBRemoteCommunicationClientTest.SendGetDataPacket (1804 of 2129) PASS: lldb-unit :: Symbol/./SymbolTests/TestClangASTImporter.RecordLayout (1805 of 2129) PASS: lldb-unit :: Utility/./UtilityTests/ScalarTest.ComparisonFloat (1806 of 2129) PASS: lldb-unit :: ScriptInterpreter/Python/./ScriptInterpreterPythonTests/PythonDataObjectsTest.TestPythonListValueEquality (1807 of 2129) PASS: lldb-api :: functionalities/breakpoint/breakpoint_ids/TestBreakpointIDs.py (1808 of 2129) PASS: lldb-api :: functionalities/inferior-crashing/TestInferiorCrashing.py (1809 of 2129) PASS: lldb-shell :: SymbolFile/DWARF/static_scope.s (1810 of 2129) PASS: lldb-api :: commands/frame/diagnose/virtual-method-call/TestDiagnoseDereferenceVirtualMethodCall.py (1811 of 2129) PASS: lldb-api :: lang/cpp/constructors/TestCppConstructors.py (1812 of 2129) PASS: lldb-api :: commands/process/launch-with-shellexpand/TestLaunchWithShellExpand.py (1813 of 2129) UNSUPPORTED: lldb-api :: commands/expression/macros/TestMacros.py (1814 of 2129) PASS: lldb-unit :: UnwindAssembly/x86/./UnwindAssemblyx86Tests/Testx86AssemblyInspectionEngine.TestPushESI (1815 of 2129) PASS: lldb-api :: functionalities/thread/concurrent_events/TestConcurrentDelayedCrashWithBreakpointSignal.py (1816 of 2129) PASS: lldb-unit :: debugserver/./debugserverTests/JSON.Parse (1817 of 2129) PASS: lldb-api :: macosx/indirect_symbol/TestIndirectSymbols.py (1818 of 2129) PASS: lldb-unit :: Utility/./UtilityTests/XcodeSDKTest.MergeTest (1819 of 2129) PASS: lldb-unit :: Utility/./UtilityTests/RegularExpression.Valid (1820 of 2129) PASS: lldb-unit :: UnwindAssembly/ARM64/./Arm64InstEmulationTests/TestArm64InstEmulation.TestFramelessThreeEpilogueFunction (1821 of 2129) PASS: lldb-api :: functionalities/tail_call_frames/cross_dso/TestCrossDSOTailCalls.py (1822 of 2129) PASS: lldb-api :: commands/frame/var-scope/TestFrameVariableScope.py (1823 of 2129) PASS: lldb-api :: functionalities/thread/concurrent_events/TestConcurrentDelayedCrashWithBreakpointWatchpoint.py (1824 of 2129) PASS: lldb-unit :: Utility/./UtilityTests/UUIDTest.StringConverion (1825 of 2129) PASS: lldb-unit :: Utility/./UtilityTests/StreamTest.PutHex64ByteOrderLittle (1826 of 2129) PASS: lldb-api :: python_api/debugger/TestDebuggerAPI.py (1827 of 2129) PASS: lldb-api :: python_api/interpreter/TestCommandInterpreterAPI.py (1828 of 2129) PASS: lldb-unit :: Utility/./UtilityTests/NameMatchesTest.Contains (1829 of 2129) PASS: lldb-unit :: Host/./HostTests/MainLoopTest.ReadObject (1830 of 2129) PASS: lldb-api :: tools/lldb-vscode/launch/TestVSCode_launch.py (1831 of 2129) PASS: lldb-api :: lang/objc/foundation/TestSymbolTable.py (1832 of 2129) PASS: lldb-shell :: SymbolFile/DWARF/DW_OP_piece-struct.s (1833 of 2129) PASS: lldb-shell :: SymbolFile/DWARF/clang-ast-from-dwarf-unamed-and-anon-structs.cpp (1834 of 2129) PASS: lldb-api :: commands/watchpoints/watchpoint_commands/command/TestWatchpointCommandPython.py (1835 of 2129) PASS: lldb-unit :: Interpreter/./InterpreterTests/CompletionTest.FileCompletionAbsolute (1836 of 2129) PASS: lldb-api :: lang/cpp/gmodules-templates/TestGModules.py (1837 of 2129) PASS: lldb-unit :: Symbol/./SymbolTests/TestTypeSystemClang.TestGetTypeClassTypeOfExpr (1838 of 2129) PASS: lldb-unit :: Utility/./UtilityTests/ArgsTest.GetQuotedCommandString (1839 of 2129) PASS: lldb-unit :: Process/minidump/./LLDBMinidumpTests/MinidumpParserTest.MinidumpDuplicateModuleMinAddress (1840 of 2129) PASS: lldb-unit :: Host/./HostTests/SocketTest.UDPGetConnectURI (1841 of 2129) PASS: lldb-shell :: Quit/TestQuitExitCodeHexA.test (1842 of 2129) UNSUPPORTED: lldb-shell :: SymbolFile/PDB/pointers.test (1843 of 2129) PASS: lldb-unit :: Utility/./UtilityTests/StringExtractorTest.GetU64BigEndian (1844 of 2129) PASS: lldb-unit :: Utility/./UtilityTests/ConstStringTest.CompareStringRef (1845 of 2129) PASS: lldb-api :: lang/cpp/multiple-inheritance/TestCppMultipleInheritance.py (1846 of 2129) PASS: lldb-unit :: SymbolFile/NativePDB/./SymbolFileNativePDBTests/PDBFPOProgramToDWARFExpressionTests.UnresolvedCyclicRegisterAssignmentReference (1847 of 2129) PASS: lldb-shell :: SymbolFile/DWARF/gnu-style-compression.cpp (1848 of 2129) PASS: lldb-shell :: Driver/TestFile.test (1849 of 2129) PASS: lldb-api :: commands/expression/diagnostics/TestExprDiagnostics.py (1850 of 2129) PASS: lldb-api :: lang/objc/ptr_refs/TestPtrRefsObjC.py (1851 of 2129) PASS: lldb-shell :: Reproducer/TestDSYM.test (1852 of 2129) PASS: lldb-unit :: Utility/./UtilityTests/StringLexerTest.AdvanceIf (1853 of 2129) PASS: lldb-shell :: SymbolFile/DWARF/debug-types-dwarf5.s (1854 of 2129) PASS: lldb-shell :: SymbolFile/DWARF/find-basic-function.cpp (1855 of 2129) PASS: lldb-unit :: Utility/./UtilityTests/ArchSpecTest.OperatorBool (1856 of 2129) PASS: lldb-api :: python_api/lldbutil/process/TestPrintStackTraces.py (1857 of 2129) PASS: lldb-api :: lang/cpp/rvalue-references/TestRvalueReferences.py (1858 of 2129) PASS: lldb-api :: functionalities/thread/concurrent_events/TestConcurrentTwoBreakpointThreads.py (1859 of 2129) PASS: lldb-api :: commands/target/stop-hooks/TestStopHooks.py (1860 of 2129) PASS: lldb-shell :: Reproducer/TestCaptureEnvOverride.test (1861 of 2129) PASS: lldb-unit :: Utility/./UtilityTests/SerializationRountripTest.SerializeDeserializePodReferences (1862 of 2129) PASS: lldb-shell :: Quit/TestQuitExitCode30.test (1863 of 2129) PASS: lldb-unit :: Utility/./UtilityTests/SerializationRountripTest.SerializeDeserializePod (1864 of 2129) PASS: lldb-shell :: SymbolFile/DWARF/dir-separator-no-comp-dir.s (1865 of 2129) PASS: lldb-api :: functionalities/thread/state_after_expression/TestStateAfterExpression.py (1866 of 2129) PASS: lldb-unit :: Symbol/./SymbolTests/TestTypeSystemClang.TestDisplayNameEmpty (1867 of 2129) PASS: lldb-unit :: Utility/./UtilityTests/DataExtractorTest.GetCStrAtNullOffset (1868 of 2129) PASS: lldb-api :: functionalities/data-formatter/data-formatter-stl/libcxx/vector/TestDataFormatterLibcxxVector.py (1869 of 2129) PASS: lldb-shell :: Commands/command-thread-select.test (1870 of 2129) UNSUPPORTED: lldb-shell :: Register/x86-64-ymm16-write.test (1871 of 2129) PASS: lldb-shell :: SymbolFile/NativePDB/function-types-calling-conv.cpp (1872 of 2129) PASS: lldb-api :: functionalities/tsan/multiple/TestTsanMultiple.py (1873 of 2129) PASS: lldb-api :: functionalities/gdb_remote_client/TestArmRegisterDefinition.py (1874 of 2129) PASS: lldb-api :: functionalities/data-formatter/data-formatter-stl/libcxx/queue/TestDataFormatterLibcxxQueue.py (1875 of 2129) PASS: lldb-unit :: Symbol/./SymbolTests/TestTypeSystemClang.TestGetTypeClassDeclType (1876 of 2129) XFAIL: lldb-shell :: SymbolFile/DWARF/find-type-in-function.cpp (1877 of 2129) PASS: lldb-unit :: Utility/./UtilityTests/StringListTest.GetMaxStringLengthIncreasingSize (1878 of 2129) PASS: lldb-unit :: Target/./TargetTests/RemoteAwarePlatformTest.TestResolveExecutabelOnClientByPlatform (1879 of 2129) PASS: lldb-shell :: Driver/LocalLLDBInit.test (1880 of 2129) PASS: lldb-unit :: Utility/./UtilityTests/LogChannelTest.Enable (1881 of 2129) PASS: lldb-api :: commands/process/launch/TestProcessLaunch.py (1882 of 2129) PASS: lldb-api :: commands/expression/deleting-implicit-copy-constructor/TestDeletingImplicitCopyConstructor.py (1883 of 2129) PASS: lldb-api :: commands/expression/no-deadlock/TestExprDoesntBlock.py (1884 of 2129) PASS: lldb-unit :: DataFormatter/./LLDBFormatterTests/StringPrinterTests.CxxASCII (1885 of 2129) PASS: lldb-unit :: Utility/./UtilityTests/VASprintfTest.NoBufferResize (1886 of 2129) PASS: lldb-unit :: Utility/./UtilityTests/ArgsTest.TestArgv (1887 of 2129) PASS: lldb-api :: driver/batch_mode/TestBatchMode.py (1888 of 2129) PASS: lldb-unit :: UnwindAssembly/x86/./UnwindAssemblyx86Tests/Testx86AssemblyInspectionEngine.TestSimplex86_64Augmented (1889 of 2129) UNSUPPORTED: lldb-shell :: ScriptInterpreter/Lua/independent_state.test (1890 of 2129) PASS: lldb-api :: functionalities/breakpoint/breakpoint_by_file_colon_line/TestBreakpointByFileColonLine.py (1891 of 2129) PASS: lldb-unit :: Utility/./UtilityTests/RangeTest.Slide (1892 of 2129) PASS: lldb-unit :: UnwindAssembly/x86/./UnwindAssemblyx86Tests/Testx86AssemblyInspectionEngine.TestMovRSPtoRBP (1893 of 2129) PASS: lldb-unit :: Expression/./ExpressionTests/DiagnosticManagerTest.GetStringBasic (1894 of 2129) PASS: lldb-unit :: Language/Highlighting/./HighlighterTests/HighlighterTest.ClangTrailingBackslashWithWhitespace (1895 of 2129) PASS: lldb-unit :: Utility/./UtilityTests/OptionsWithRawTest.LeadingSpaceArgs (1896 of 2129) PASS: lldb-unit :: Utility/./UtilityTests/PassiveReplayTest.InstrumentedBarPtr (1897 of 2129) PASS: lldb-api :: lang/cpp/accelerator-table/TestCPPAccelerator.py (1898 of 2129) PASS: lldb-unit :: Utility/./UtilityTests/UriParserTest.BracketedHostnameWithColon (1899 of 2129) PASS: lldb-unit :: Symbol/./SymbolTests/TestTypeSystemClang.TestGetBasicTypeFromEnum (1900 of 2129) PASS: lldb-unit :: SymbolFile/DWARF/./SymbolFileDWARFTests/SymbolFileDWARFTests.TestAbbrevOrder1Start5 (1901 of 2129) PASS: lldb-shell :: ScriptInterpreter/Python/scripted_breakpoint.test (1902 of 2129) PASS: lldb-unit :: UnwindAssembly/x86/./UnwindAssemblyx86Tests/Testx86AssemblyInspectionEngine.TestSimplei386ugmented (1903 of 2129) PASS: lldb-api :: macosx/version_zero/TestGetVersionZeroVersion.py (1904 of 2129) PASS: lldb-shell :: Minidump/no-process-id.yaml (1905 of 2129) PASS: lldb-api :: lang/objc/hidden-ivars/TestHiddenIvars.py (1906 of 2129) PASS: lldb-api :: functionalities/thread/concurrent_events/TestConcurrentWatchBreakDelay.py (1907 of 2129) PASS: lldb-api :: commands/expression/import-std-module/vector-dbg-info-content/TestDbgInfoContentVectorFromStdModule.py (1908 of 2129) PASS: lldb-shell :: SymbolFile/DWARF/dwp-debug-types.s (1909 of 2129) UNSUPPORTED: lldb-api :: benchmarks/stepping/TestSteppingSpeed.py (1910 of 2129) PASS: lldb-unit :: Utility/./UtilityTests/StringListTest.ForRange (1911 of 2129) PASS: lldb-api :: functionalities/data-formatter/data-formatter-objc/TestDataFormatterObjCNSContainer.py (1912 of 2129) UNSUPPORTED: lldb-shell :: ObjectFile/ELF/minidebuginfo-no-lzma.yaml (1913 of 2129) PASS: lldb-api :: lang/objc/rdar-11355592/TestRdar11355592.py (1914 of 2129) PASS: lldb-api :: python_api/watchpoint/TestSetWatchpoint.py (1915 of 2129) PASS: lldb-unit :: Utility/./UtilityTests/Flags.AnySet (1916 of 2129) PASS: lldb-unit :: ScriptInterpreter/Python/./ScriptInterpreterPythonTests/PythonDataObjectsTest.TestResetting (1917 of 2129) UNSUPPORTED: lldb-shell :: SymbolFile/NativePDB/stack_unwinding01.cpp (1918 of 2129) PASS: lldb-unit :: Symbol/./SymbolTests/TestTypeSystemClang.TestOwningModule (1919 of 2129) PASS: lldb-unit :: UnwindAssembly/x86/./UnwindAssemblyx86Tests/Testx86AssemblyInspectionEngine.TestSimple32bitFrameFunction (1920 of 2129) PASS: lldb-unit :: Utility/./UtilityTests/ArgsTest.ReplaceArgumentAtIndexShort (1921 of 2129) PASS: lldb-unit :: ScriptInterpreter/Python/./ScriptInterpreterPythonTests/PythonDataObjectsTest.TestExtractingUInt64ThroughStructuredData (1922 of 2129) PASS: lldb-unit :: Utility/./UtilityTests/VASprintfTest.BufferResize (1923 of 2129) PASS: lldb-unit :: Process/minidump/./LLDBMinidumpTests/MinidumpParserTest.GetMemoryRegionInfoFromMemoryList (1924 of 2129) PASS: lldb-unit :: Symbol/./SymbolTests/TestClangASTImporter.MetadataPropagationAfterCopying (1925 of 2129) UNSUPPORTED: lldb-shell :: SymbolFile/PDB/function-level-linking.test (1926 of 2129) PASS: lldb-unit :: Utility/./UtilityTests/OptionsWithRawTest.ArgsButNoLeadingDash (1927 of 2129) PASS: lldb-api :: functionalities/data-formatter/frameformat_smallstruct/TestFrameFormatSmallStruct.py (1928 of 2129) PASS: lldb-unit :: Host/./HostTests/MainLoopTest.TerminatesImmediately (1929 of 2129) PASS: lldb-shell :: Quit/TestQuitExitCodeHex0.test (1930 of 2129) UNSUPPORTED: lldb-api :: android/platform/TestDefaultCacheLineSize.py (1931 of 2129) PASS: lldb-unit :: Utility/./UtilityTests/RegularExpression.CopyAssignment (1932 of 2129) PASS: lldb-api :: commands/expression/persistent_types/TestPersistentTypes.py (1933 of 2129) PASS: lldb-api :: functionalities/thread/concurrent_events/TestConcurrentTwoWatchpointThreads.py (1934 of 2129) PASS: lldb-api :: lang/cpp/std-function-step-into-callable/TestStdFunctionStepIntoCallable.py (1935 of 2129) PASS: lldb-api :: functionalities/data-formatter/synthupdate/TestSyntheticFilterRecompute.py (1936 of 2129) PASS: lldb-unit :: UnwindAssembly/x86/./UnwindAssemblyx86Tests/Testx86AssemblyInspectionEngine.TestPushEBP (1937 of 2129) PASS: lldb-unit :: Process/./ProcessEventDataTests/ProcessEventDataTest.DoOnRemoval (1938 of 2129) PASS: lldb-shell :: SymbolFile/NativePDB/nested-types.cpp (1939 of 2129) PASS: lldb-unit :: UnwindAssembly/x86/./UnwindAssemblyx86Tests/Testx86AssemblyInspectionEngine.TestPopRBP (1940 of 2129) PASS: lldb-api :: commands/log/invalid-args/TestInvalidArgsLog.py (1941 of 2129) PASS: lldb-api :: functionalities/thread/concurrent_events/TestConcurrentWatchpointDelayWatchpointOneBreakpoint.py (1942 of 2129) PASS: lldb-unit :: SymbolFile/NativePDB/./SymbolFileNativePDBTests/PDBFPOProgramToDWARFExpressionTests.UnresolvedRegisterReference (1943 of 2129) PASS: lldb-api :: functionalities/gdb_remote_client/TestThreadSelectionBug.py (1944 of 2129) PASS: lldb-unit :: Utility/./UtilityTests/StreamTest.ShiftOperatorChars (1945 of 2129) PASS: lldb-unit :: Utility/./UtilityTests/StringExtractorTest.GetHexU8_Underflow (1946 of 2129) PASS: lldb-unit :: Utility/./UtilityTests/SerializationRountripTest.SerializeDeserializeObjectPointer (1947 of 2129) PASS: lldb-shell :: SymbolFile/NativePDB/global-classes.cpp (1948 of 2129) PASS: lldb-unit :: Utility/./UtilityTests/CompletionRequest.FakeLastArg (1949 of 2129) PASS: lldb-shell :: Register/x86-64-read.test (1950 of 2129) PASS: lldb-unit :: Utility/./UtilityTests/StringListTest.JoinMultiCharSeparator (1951 of 2129) PASS: lldb-api :: functionalities/breakpoint/breakpoint_callback_command_source/TestBreakpointCallbackCommandSource.py (1952 of 2129) PASS: lldb-api :: commands/target/dump-symtab-demangle/TestDumpSymtabDemangle.py (1953 of 2129) PASS: lldb-api :: lang/objc/conflicting-definition/TestConflictingDefinition.py (1954 of 2129) PASS: lldb-unit :: Utility/./UtilityTests/XcodeSDKTest.SDKSupportsModules (1955 of 2129) PASS: lldb-api :: lang/objc/objc-struct-return/TestObjCStructReturn.py (1956 of 2129) PASS: lldb-unit :: UnwindAssembly/x86/./UnwindAssemblyx86Tests/Testx86AssemblyInspectionEngine.TestPush0 (1957 of 2129) PASS: lldb-api :: functionalities/postmortem/mach-core/TestMachCore.py (1958 of 2129) PASS: lldb-api :: functionalities/inline-stepping/TestInlineStepping.py (1959 of 2129) PASS: lldb-api :: functionalities/thread/concurrent_events/TestConcurrentCrashWithWatchpointBreakpointSignal.py (1960 of 2129) PASS: lldb-api :: commands/command/nested_alias/TestNestedAlias.py (1961 of 2129) PASS: lldb-unit :: Symbol/./SymbolTests/LineEntryTest.GetSameLineContiguousAddressRangeOneInline (1962 of 2129) PASS: lldb-unit :: UnwindAssembly/x86/./UnwindAssemblyx86Tests/Testx86AssemblyInspectionEngine.TestPushEDI (1963 of 2129) PASS: lldb-api :: commands/version/TestVersion.py (1964 of 2129) UNSUPPORTED: lldb-api :: benchmarks/expression/TestRepeatedExprs.py (1965 of 2129) PASS: lldb-shell :: SymbolFile/DWARF/childless-compile-unit.s (1966 of 2129) PASS: lldb-unit :: Utility/./UtilityTests/StreamTest.PutHex8 (1967 of 2129) PASS: lldb-unit :: Expression/./ExpressionTests/CppModuleConfigurationTest.UnrelatedLibrary (1968 of 2129) PASS: lldb-api :: functionalities/rerun/TestRerun.py (1969 of 2129) PASS: lldb-api :: functionalities/data-formatter/data-formatter-cpp/TestDataFormatterCpp.py (1970 of 2129) PASS: lldb-unit :: Utility/./UtilityTests/StreamTeeTest.GetStreamAtIndexOutOfBounds (1971 of 2129) PASS: lldb-shell :: Driver/TestRepl.test (1972 of 2129) PASS: lldb-unit :: UnwindAssembly/ARM64/./Arm64InstEmulationTests/TestArm64InstEmulation.TestMediumDarwinFunction (1973 of 2129) PASS: lldb-shell :: ScriptInterpreter/Python/crashlog.test (1974 of 2129) PASS: lldb-unit :: Utility/./UtilityTests/StringExtractorTest.GetNameColonValueContainsColon (1975 of 2129) PASS: lldb-unit :: Host/./HostTests/SocketTest.UDPConnect (1976 of 2129) PASS: lldb-shell :: ObjectFile/wasm/basic.yaml (1977 of 2129) PASS: lldb-unit :: Utility/./UtilityTests/OptionsWithRawTest.EmptyArgsOnlySuffix (1978 of 2129) PASS: lldb-api :: python_api/watchpoint/TestWatchpointIgnoreCount.py (1979 of 2129) PASS: lldb-api :: lang/cpp/diamond/TestDiamond.py (1980 of 2129) PASS: lldb-unit :: Utility/./UtilityTests/ArgsTest.TestQuotedUnknownEscape (1981 of 2129) PASS: lldb-shell :: Reproducer/Functionalities/TestDataFormatter.test (1982 of 2129) PASS: lldb-api :: lang/cpp/namespace_conflicts/TestNamespaceConflicts.py (1983 of 2129) PASS: lldb-api :: commands/expression/char/TestExprsChar.py (1984 of 2129) PASS: lldb-api :: lang/c/step-target/TestStepTarget.py (1985 of 2129) PASS: lldb-unit :: Core/./LLDBCoreTests/ModuleSpecTest.InvalidInMemoryBufferValidFile (1986 of 2129) PASS: lldb-api :: lang/c/function_types/TestFunctionTypes.py (1987 of 2129) PASS: lldb-shell :: Commands/command-source.test (1988 of 2129) PASS: lldb-unit :: Symbol/./SymbolTests/LineEntryTest.GetSameLineContiguousAddressRangeNoInlines (1989 of 2129) PASS: lldb-unit :: Host/./HostTests/SocketTest.TCPGetAddress (1990 of 2129) PASS: lldb-unit :: Signals/./SignalsTests/UnixSignalsTest.GetInfo (1991 of 2129) UNSUPPORTED: lldb-api :: functionalities/darwin_log/filter/regex/message/TestDarwinLogFilterRegexMessage.py (1992 of 2129) UNSUPPORTED: lldb-shell :: SymbolFile/PDB/function-nested-block.test (1993 of 2129) PASS: lldb-api :: functionalities/breakpoint/address_breakpoints/TestBadAddressBreakpoints.py (1994 of 2129) PASS: lldb-unit :: debugserver/./debugserverTests/RNBSocket.LoopBackListenIPv6 (1995 of 2129) PASS: lldb-unit :: UnwindAssembly/x86/./UnwindAssemblyx86Tests/Testx86AssemblyInspectionEngine.TestPushR15 (1996 of 2129) PASS: lldb-unit :: SymbolFile/NativePDB/./SymbolFileNativePDBTests/PDBFPOProgramToDWARFExpressionTests.UnresolvedRegisterAssignmentReference (1997 of 2129) PASS: lldb-shell :: SymbolFile/Breakpad/line-table.test (1998 of 2129) PASS: lldb-api :: commands/platform/process/list/TestProcessList.py (1999 of 2129) PASS: lldb-unit :: Utility/./UtilityTests/ConstStringTest.NullAndEmptyStates (2000 of 2129) PASS: lldb-api :: functionalities/data-formatter/nsarraysynth/TestNSArraySynthetic.py (2001 of 2129) PASS: lldb-api :: sanity/TestSettingSkipping.py (2002 of 2129) PASS: lldb-shell :: ObjectFile/PECOFF/dep-modules.yaml (2003 of 2129) PASS: lldb-api :: functionalities/thread/concurrent_events/TestConcurrentDelaySignalBreak.py (2004 of 2129) PASS: lldb-shell :: Commands/CommandScriptImmediateOutput/CommandScriptImmediateOutputFile.test (2005 of 2129) PASS: lldb-api :: commands/expression/cast_int_to_anonymous_enum/TestCastIntToAnonymousEnum.py (2006 of 2129) PASS: lldb-api :: lang/objcxx/objcxx-ivar-vector/TestIvarVector.py (2007 of 2129) PASS: lldb-unit :: Utility/./UtilityTests/RangeTest.ContainsRange (2008 of 2129) UNSUPPORTED: lldb-shell :: SymbolFile/DWARF/split-dwarf-expression-eval-bug.cpp (2009 of 2129) PASS: lldb-api :: python_api/symbol-context/two-files/TestSymbolContextTwoFiles.py (2010 of 2129) PASS: lldb-api :: lang/cpp/stl/TestSTL.py (2011 of 2129) UNSUPPORTED: lldb-shell :: SymbolFile/NativePDB/local-variables.cpp (2012 of 2129) PASS: lldb-api :: functionalities/breakpoint/dummy_target_breakpoints/TestBreakpointsWithNoTargets.py (2013 of 2129) UNSUPPORTED: lldb-api :: functionalities/darwin_log/format/TestDarwinLogMessageFormat.py (2014 of 2129) PASS: lldb-api :: python_api/sbtype_typeclass/TestSBTypeTypeClass.py (2015 of 2129) PASS: lldb-unit :: Process/gdb-remote/./ProcessGdbRemoteTests/GDBRemoteCommunicationClientTest.GetModulesInfoInvalidResponse (2016 of 2129) PASS: lldb-shell :: SymbolFile/DWARF/DW_AT_const_value.s (2017 of 2129) PASS: lldb-api :: functionalities/thread/concurrent_events/TestConcurrentCrashWithWatchpoint.py (2018 of 2129) PASS: lldb-shell :: Expr/TestIRMemoryMap.test (2019 of 2129) PASS: lldb-shell :: ObjectFile/ELF/section-types-edgecases.yaml (2020 of 2129) PASS: lldb-api :: functionalities/data-formatter/data-formatter-objc/TestDataFormatterObjCNSData.py (2021 of 2129) PASS: lldb-unit :: Utility/./UtilityTests/XcodeSDKTest.ParseTest (2022 of 2129) PASS: lldb-api :: commands/frame/diagnose/inheritance/TestDiagnoseInheritance.py (2023 of 2129) PASS: lldb-unit :: Utility/./UtilityTests/RegisterValueTest.GetSet8 (2024 of 2129) FAIL: lldb-api :: functionalities/gdb_remote_client/TestGDBRemoteClient.py (2025 of 2129) ******************** TEST 'lldb-api :: functionalities/gdb_remote_client/TestGDBRemoteClient.py' FAILED ******************** Script: -- /usr/local/Frameworks/Python.framework/Versions/3.7/bin/python3.7 /Users/buildslave/jenkins/workspace/lldb-cmake@2/llvm-project/lldb/test/API/dotest.py --arch x86_64 -s /Users/buildslave/jenkins/workspace/lldb-cmake@2/lldb-build/lldb-test-traces -S nm -u CXXFLAGS -u CFLAGS --codesign-identity - --server /Users/buildslave/jenkins/workspace/lldb-cmake@2/lldb-build/./bin/debugserver --arch x86_64 --build-dir /Users/buildslave/jenkins/workspace/lldb-cmake@2/lldb-build/lldb-test-build.noindex -s=/Users/buildslave/jenkins/workspace/lldb-cmake@2/test/logs -t --env TERM=vt100 --env LLVM_LIBS_DIR=/Users/buildslave/jenkins/workspace/lldb-cmake@2/lldb-build/./lib --build-dir /Users/buildslave/jenkins/workspace/lldb-cmake@2/lldb-build/lldb-test-build.noindex --lldb-module-cache-dir /Users/buildslave/jenkins/workspace/lldb-cmake@2/lldb-build/lldb-test-build.noindex/module-cache-lldb/lldb-api --clang-module-cache-dir /Users/buildslave/jenkins/workspace/lldb-cmake@2/lldb-build/lldb-test-build.noindex/module-cache-clang/lldb-api --executable /Users/buildslave/jenkins/workspace/lldb-cmake@2/lldb-build/./bin/lldb --compiler /Users/buildslave/jenkins/workspace/lldb-cmake@2/lldb-build/./bin/clang --dsymutil /Users/buildslave/jenkins/workspace/lldb-cmake@2/lldb-build/./bin/dsymutil --filecheck /Users/buildslave/jenkins/workspace/lldb-cmake@2/lldb-build/./bin/FileCheck --yaml2obj /Users/buildslave/jenkins/workspace/lldb-cmake@2/lldb-build/./bin/yaml2obj --lldb-libs-dir /Users/buildslave/jenkins/workspace/lldb-cmake@2/lldb-build/./lib /Users/buildslave/jenkins/workspace/lldb-cmake@2/llvm-project/lldb/test/API/functionalities/gdb_remote_client -p TestGDBRemoteClient.py -- Exit Code: 1

Hide Details

Command Output (stdout): -- lldb version 12.0.99 clang revision 0d2fe90063e956716c3067322aef898822d0dc0e llvm revision 0d2fe90063e956716c3067322aef898822d0dc0e < 1> send packet: + history[1] tid=0x0307 < 1> send packet: + < 19> send packet: $QStartNoAckMode#b0 < 1> read packet: + < 6> read packet: $OK#9a < 1> send packet: + < 45> send packet: $qSupported:xmlRegisters=i386,arm,mips,arc#74 < 57> read packet: $qXfer:features:read+;PacketSize=3fff;QStartNoAckMode+#86 < 26> send packet: $QThreadSuffixSupported#e4 < 4> read packet: $#00 < 27> send packet: $QListThreadsInStopReply#21 < 4> read packet: $#00 < 13> send packet: $qHostInfo#9b < 28> read packet: $ptrsize:8;endian:little;#30 < 10> send packet: $vCont?#49 < 4> read packet: $#00 < 27> send packet: $qVAttachOrWaitSupported#38 < 4> read packet: $#00 < 23> send packet: $QEnableErrorStrings#8c < 6> read packet: $OK#9a < 16> send packet: $qProcessInfo#dc < 4> read packet: $#00 < 6> send packet: $qC#b4 < 7> read packet: $E42#ab < 16> send packet: $qfThreadInfo#bb < 6> read packet: $OK#9a < 38> send packet: $QSetSTDIN:2f6465762f74747973303030#84 < 4> read packet: $#00 < 39> send packet: $QSetSTDOUT:2f6465762f74747973303030#e5 < 4> read packet: $#00 < 39> send packet: $QSetSTDERR:2f6465762f74747973303030#d6 < 4> read packet: $#00 < 21> send packet: $QSetDisableASLR:0#cd < 4> read packet: $#00 < 23> send packet: $QSetDetachOnError:0#f7 < 4> read packet: $#00 < 19> send packet: $QLaunchArch:arm#a4 < 4> read packet: $#00 < 96> send packet: $QEnvironment:LLDB_SESSION_DIRNAME=/Users/buildslave/jenkins/workspace/lldb-cmake@2/test/logs#57 < 4> read packet: $#00 < 323> send packet: $A312,0,2f55736572732f6275696c64736c6176652f6a656e6b696e732f776f726b73706163652f6c6c64622d636d616b6540322f6c6c64622d6275696c642f6c6c64622d746573742d6275696c642e6e6f696e6465782f66756e6374696f6e616c69746965732f6764625f72656d6f74655f636c69656e742f5465737447444252656d6f7465436c69656e742e746573745f6c61756e63685f6661696c2f61#a8 < 7> read packet: $E47#b0 < 1> send packet: + history[1] tid=0x0307 < 1> send packet: + < 19> send packet: $QStartNoAckMode#b0 < 1> read packet: + < 6> read packet: $OK#9a < 1> send packet: + < 45> send packet: $qSupported:xmlRegisters=i386,arm,mips,arc#74 < 57> read packet: $qXfer:features:read+;PacketSize=3fff;QStartNoAckMode+#86 < 26> send packet: $QThreadSuffixSupported#e4 < 4> read packet: $#00 < 27> send packet: $QListThreadsInStopReply#21 < 4> read packet: $#00 < 13> send packet: $qHostInfo#9b < 28> read packet: $ptrsize:8;endian:little;#30 < 10> send packet: $vCont?#49 < 4> read packet: $#00 < 27> send packet: $qVAttachOrWaitSupported#38 < 4> read packet: $#00 < 23> send packet: $QEnableErrorStrings#8c < 6> read packet: $OK#9a < 16> send packet: $qProcessInfo#dc < 4> read packet: $#00 < 6> send packet: $qC#b4 < 7> read packet: $QC0#c4 < 16> send packet: $qfThreadInfo#bb < 5> read packet: $l#6c < 5> send packet: $?#3f < 7> read packet: $S02#b5 < 16> send packet: $qProcessInfo#dc < 4> read packet: $#00 < 41> send packet: $qXfer:features:read:target.xml:0,3ffe#af < 4> read packet: $#00 < 18> send packet: $qRegisterInfo0#72 < 4> read packet: $#00 < 16> send packet: $qfThreadInfo#bb < 5> read packet: $l#6c < 7> send packet: $Hg1#e0 < 6> read packet: $OK#9a < 6> send packet: $p0#a0 < 12> read packet: $00000000#80 < 16> send packet: $qProcessInfo#dc < 4> read packet: $#00 < 12> send packet: $qOffsets#4b < 4> read packet: $#00 < 26> send packet: $qStructuredDataPlugins#02 < 4> read packet: $#00 < 13> send packet: $qSymbol::#5b < 6> read packet: $OK#9a < 16> send packet: $qfThreadInfo#bb < 5> read packet: $l#6c < 16> send packet: $qfThreadInfo#bb < 5> read packet: $l#6c < 5> send packet: $g#67 < 860> read packet: $0000000000000000000000000000000000000000000000000000000000000000000000000000000000000000000000000000000000000000000000000000000000000000000000000000000000000000000000000000000000000000000000000000000000000000000000000000000000000000000000000000000000000000000000000000000000000000000000000000000000000000000000000000000000000000000000000000000000000000000000000000000000000000000000000000000000000000000000000000000000000000000000000000000000000000000000000000000000000000000000000000000000000000000000000000000000000000000000000000000000000000000000000000000000000000000000000000000000000000000000000000000000000000000000000000000000000000000000000000000000000000000000000000000000000000000000000000000000000000000000000000000000000000000000000000000000000000000000000000000000000000000000000000000000000000000000000000000000000000000000000000000000000000#80 < 5> send packet: $k#6b < 4> read packet: $#00 < 1> send packet: + history[1] tid=0x0307 < 1> send packet: + < 19> send packet: $QStartNoAckMode#b0 < 1> read packet: + < 6> read packet: $OK#9a < 1> send packet: + < 45> send packet: $qSupported:xmlRegisters=i386,arm,mips,arc#74 < 57> read packet: $qXfer:features:read+;PacketSize=3fff;QStartNoAckMode+#86 < 26> send packet: $QThreadSuffixSupported#e4 < 4> read packet: $#00 < 27> send packet: $QListThreadsInStopReply#21 < 4> read packet: $#00 < 13> send packet: $qHostInfo#9b < 28> read packet: $ptrsize:8;endian:little;#30 < 10> send packet: $vCont?#49 < 4> read packet: $#00 < 27> send packet: $qVAttachOrWaitSupported#38 < 4> read packet: $#00 < 23> send packet: $QEnableErrorStrings#8c < 6> read packet: $OK#9a < 16> send packet: $qProcessInfo#dc < 4> read packet: $#00 < 6> send packet: $qC#b4 < 7> read packet: $QC0#c4 < 16> send packet: $qfThreadInfo#bb < 5> read packet: $l#6c < 5> send packet: $?#3f < 7> read packet: $S02#b5 < 16> send packet: $qProcessInfo#dc < 4> read packet: $#00 < 41> send packet: $qXfer:features:read:target.xml:0,3ffe#af < 4> read packet: $#00 < 18> send packet: $qRegisterInfo0#72 < 4> read packet: $#00 < 16> send packet: $qfThreadInfo#bb < 5> read packet: $l#6c < 7> send packet: $Hg1#e0 < 6> read packet: $OK#9a < 6> send packet: $p0#a0 < 12> read packet: $00000000#80 < 16> send packet: $qProcessInfo#dc < 4> read packet: $#00 < 12> send packet: $qOffsets#4b < 4> read packet: $#00 < 26> send packet: $qStructuredDataPlugins#02 < 4> read packet: $#00 < 13> send packet: $qSymbol::#5b < 6> read packet: $OK#9a < 16> send packet: $qfThreadInfo#bb < 5> read packet: $l#6c < 16> send packet: $qfThreadInfo#bb < 5> read packet: $l#6c < 6> send packet: $pf#d6 < 12> read packet: $00000000#80 < 6> send packet: $pd#d4 < 12> read packet: $00000000#80 < 6> send packet: $p0#a0 < 12> read packet: $00000000#80 < 6> send packet: $p1#a1 < 12> read packet: $00000000#80 < 6> send packet: $p2#a2 < 12> read packet: $00000000#80 < 6> send packet: $p3#a3 < 12> read packet: $00000000#80 < 6> send packet: $p4#a4 < 12> read packet: $00000000#80 < 6> send packet: $p5#a5 < 12> read packet: $00000000#80 < 6> send packet: $p6#a6 < 12> read packet: $00000000#80 < 6> send packet: $p7#a7 < 12> read packet: $00000000#80 < 6> send packet: $p8#a8 < 12> read packet: $00000000#80 < 6> send packet: $p9#a9 < 12> read packet: $00000000#80 < 6> send packet: $pa#d1 < 12> read packet: $00000000#80 < 6> send packet: $pb#d2 < 12> read packet: $00000000#80 < 6> send packet: $pc#d3 < 12> read packet: $00000000#80 < 6> send packet: $pe#d5 < 12> read packet: $00000000#80 < 7> send packet: $p19#da < 12> read packet: $00000000#80 < 5> send packet: $k#6b < 4> read packet: $#00 < 1> send packet: + history[1] tid=0x0307 < 1> send packet: + < 19> send packet: $QStartNoAckMode#b0 < 1> read packet: + < 6> read packet: $OK#9a < 1> send packet: + < 45> send packet: $qSupported:xmlRegisters=i386,arm,mips,arc#74 < 57> read packet: $qXfer:features:read+;PacketSize=3fff;QStartNoAckMode+#86 < 26> send packet: $QThreadSuffixSupported#e4 < 4> read packet: $#00 < 27> send packet: $QListThreadsInStopReply#21 < 4> read packet: $#00 < 13> send packet: $qHostInfo#9b < 28> read packet: $ptrsize:8;endian:little;#30 < 10> send packet: $vCont?#49 < 4> read packet: $#00 < 27> send packet: $qVAttachOrWaitSupported#38 < 4> read packet: $#00 < 23> send packet: $QEnableErrorStrings#8c < 6> read packet: $OK#9a < 16> send packet: $qProcessInfo#dc < 4> read packet: $#00 < 6> send packet: $qC#b4 < 7> read packet: $QC0#c4 < 16> send packet: $qfThreadInfo#bb < 5> read packet: $l#6c < 5> send packet: $?#3f < 7> read packet: $S02#b5 < 16> send packet: $qProcessInfo#dc < 4> read packet: $#00 < 41> send packet: $qXfer:features:read:target.xml:0,3ffe#af < 4> read packet: $#00 < 18> send packet: $qRegisterInfo0#72 < 4> read packet: $#00 < 16> send packet: $qfThreadInfo#bb < 5> read packet: $l#6c < 7> send packet: $Hg1#e0 < 6> read packet: $OK#9a < 6> send packet: $p0#a0 < 4> read packet: $#00 < 16> send packet: $qProcessInfo#dc < 4> read packet: $#00 < 12> send packet: $qOffsets#4b < 4> read packet: $#00 < 26> send packet: $qStructuredDataPlugins#02 < 4> read packet: $#00 < 13> send packet: $qSymbol::#5b < 6> read packet: $OK#9a < 16> send packet: $qfThreadInfo#bb < 5> read packet: $l#6c < 16> send packet: $qfThreadInfo#bb < 5> read packet: $l#6c < 5> send packet: $g#67 < 860> read packet: $0000000000000000000000000000000000000000000000000000000000000000000000000000000000000000000000000000000000000000000000000000000000000000000000000000000000000000000000000000000000000000000000000000000000000000000000000000000000000000000000000000000000000000000000000000000000000000000000000000000000000000000000000000000000000000000000000000000000000000000000000000000000000000000000000000000000000000000000000000000000000000000000000000000000000000000000000000000000000000000000000000000000000000000000000000000000000000000000000000000000000000000000000000000000000000000000000000000000000000000000000000000000000000000000000000000000000000000000000000000000000000000000000000000000000000000000000000000000000000000000000000000000000000000000000000000000000000000000000000000000000000000000000000000000000000000000000000000000000000000000000000000000000000#80 < 861> send packet: $G0000000000000000000000000000000000000000000000000000000000000000000000000000000000000000000000000000000000000000000000000000000000000000000000000000000000000000000000000000000000000000000000000000000000000000000000000000000000000000000000000000000000000000000000000000000000000000000000000000000000000000000000000000000000000000000000000000000000000000000000000000000000000000000000000000000000000000000000000000000000000000000000000000000000000000000000000000000000000000000000000000000000000000000000000000000000000000000000000000000000000000000000000000000000000000000000000000000000000000000000000000000000000000000000000000000000000000000000000000000000000000000000000000000000000000000000000000000000000000000000000000000000000000000000000000000000000000000000000000000000000000000000000000000000000000000000000000000000000000000000000000000000000000#c7 < 6> read packet: $OK#9a < 861> send packet: $G0000000000000000000000000000000000000000000000000000000000000000000000000000000000000000000000000000000000000000000000000000000000000000000000000000000000000000000000000000000000000000000000000000000000000000000000000000000000000000000000000000000000000000000000000000000000000000000000000000000000000000000000000000000000000000000000000000000000000000000000000000000000000000000000000000000000000000000000000000000000000000000000000000000000000000000000000000000000000000000000000000000000000000000000000000000000000000000000000000000000000000000000000000000000000000000000000000000000000000000000000000000000000000000000000000000000000000000000000000000000000000000000000000000000000000000000000000000000000000000000000000000000000000000000000000000000000000000000000000000000000000000000000000000000000000000000000000000000000000000000000000000000000000#c7 < 6> read packet: $OK#9a < 861> send packet: $G0000000000000000000000000000000000000000000000000000000000000000000000000000000000000000000000000000000000000000000000000000000000000000000000000000000000000000000000000000000000000000000000000000000000000000000000000000000000000000000000000000000000000000000000000000000000000000000000000000000000000000000000000000000000000000000000000000000000000000000000000000000000000000000000000000000000000000000000000000000000000000000000000000000000000000000000000000000000000000000000000000000000000000000000000000000000000000000000000000000000000000000000000000000000000000000000000000000000000000000000000000000000000000000000000000000000000000000000000000000000000000000000000000000000000000000000000000000000000000000000000000000000000000000000000000000000000000000000000000000000000000000000000000000000000000000000000000000000000000000000000000000000000000#c7 < 6> read packet: $OK#9a < 861> send packet: $G0000000000000000000000000000000000000000000000000000000000000000000000000000000000000000000000000000000000000000000000000000000000000000000000000000000000000000000000000000000000000000000000000000000000000000000000000000000000000000000000000000000000000000000000000000000000000000000000000000000000000000000000000000000000000000000000000000000000000000000000000000000000000000000000000000000000000000000000000000000000000000000000000000000000000000000000000000000000000000000000000000000000000000000000000000000000000000000000000000000000000000000000000000000000000000000000000000000000000000000000000000000000000000000000000000000000000000000000000000000000000000000000000000000000000000000000000000000000000000000000000000000000000000000000000000000000000000000000000000000000000000000000000000000000000000000000000000000000000000000000000000000000000000#c7 < 6> read packet: $OK#9a < 861> send packet: $G0000000000000000000000000000000000000000000000000000000000000000000000000000000000000000000000000000000000000000000000000000000000000000000000000000000000000000000000000000000000000000000000000000000000000000000000000000000000000000000000000000000000000000000000000000000000000000000000000000000000000000000000000000000000000000000000000000000000000000000000000000000000000000000000000000000000000000000000000000000000000000000000000000000000000000000000000000000000000000000000000000000000000000000000000000000000000000000000000000000000000000000000000000000000000000000000000000000000000000000000000000000000000000000000000000000000000000000000000000000000000000000000000000000000000000000000000000000000000000000000000000000000000000000000000000000000000000000000000000000000000000000000000000000000000000000000000000000000000000000000000000000000000000#c7 < 6> read packet: $OK#9a < 861> send packet: $G0000000000000000000000000000000000000000000000000000000000000000000000000000000000000000000000000000000000000000000000000000000000000000000000000000000000000000000000000000000000000000000000000000000000000000000000000000000000000000000000000000000000000000000000000000000000000000000000000000000000000000000000000000000000000000000000000000000000000000000000000000000000000000000000000000000000000000000000000000000000000000000000000000000000000000000000000000000000000000000000000000000000000000000000000000000000000000000000000000000000000000000000000000000000000000000000000000000000000000000000000000000000000000000000000000000000000000000000000000000000000000000000000000000000000000000000000000000000000000000000000000000000000000000000000000000000000000000000000000000000000000000000000000000000000000000000000000000000000000000000000000000000000000#c7 < 6> read packet: $OK#9a < 861> send packet: $G0000000000000000000000000000000000000000000000000000000000000000000000000000000000000000000000000000000000000000000000000000000000000000000000000000000000000000000000000000000000000000000000000000000000000000000000000000000000000000000000000000000000000000000000000000000000000000000000000000000000000000000000000000000000000000000000000000000000000000000000000000000000000000000000000000000000000000000000000000000000000000000000000000000000000000000000000000000000000000000000000000000000000000000000000000000000000000000000000000000000000000000000000000000000000000000000000000000000000000000000000000000000000000000000000000000000000000000000000000000000000000000000000000000000000000000000000000000000000000000000000000000000000000000000000000000000000000000000000000000000000000000000000000000000000000000000000000000000000000000000000000000000000000#c7 < 6> read packet: $OK#9a < 861> send packet: $G0000000000000000000000000000000000000000000000000000000000000000000000000000000000000000000000000000000000000000000000000000000000000000000000000000000000000000000000000000000000000000000000000000000000000000000000000000000000000000000000000000000000000000000000000000000000000000000000000000000000000000000000000000000000000000000000000000000000000000000000000000000000000000000000000000000000000000000000000000000000000000000000000000000000000000000000000000000000000000000000000000000000000000000000000000000000000000000000000000000000000000000000000000000000000000000000000000000000000000000000000000000000000000000000000000000000000000000000000000000000000000000000000000000000000000000000000000000000000000000000000000000000000000000000000000000000000000000000000000000000000000000000000000000000000000000000000000000000000000000000000000000000000000#c7 < 6> read packet: $OK#9a < 861> send packet: $G0000000000000000000000000000000000000000000000000000000000000000000000000000000000000000000000000000000000000000000000000000000000000000000000000000000000000000000000000000000000000000000000000000000000000000000000000000000000000000000000000000000000000000000000000000000000000000000000000000000000000000000000000000000000000000000000000000000000000000000000000000000000000000000000000000000000000000000000000000000000000000000000000000000000000000000000000000000000000000000000000000000000000000000000000000000000000000000000000000000000000000000000000000000000000000000000000000000000000000000000000000000000000000000000000000000000000000000000000000000000000000000000000000000000000000000000000000000000000000000000000000000000000000000000000000000000000000000000000000000000000000000000000000000000000000000000000000000000000000000000000000000000000000#c7 < 6> read packet: $OK#9a < 861> send packet: $G0000000000000000000000000000000000000000000000000000000000000000000000000000000000000000000000000000000000000000000000000000000000000000000000000000000000000000000000000000000000000000000000000000000000000000000000000000000000000000000000000000000000000000000000000000000000000000000000000000000000000000000000000000000000000000000000000000000000000000000000000000000000000000000000000000000000000000000000000000000000000000000000000000000000000000000000000000000000000000000000000000000000000000000000000000000000000000000000000000000000000000000000000000000000000000000000000000000000000000000000000000000000000000000000000000000000000000000000000000000000000000000000000000000000000000000000000000000000000000000000000000000000000000000000000000000000000000000000000000000000000000000000000000000000000000000000000000000000000000000000000000000000000000#c7 < 6> read packet: $OK#9a < 861> send packet: $G0000000000000000000000000000000000000000000000000000000000000000000000000000000000000000000000000000000000000000000000000000000000000000000000000000000000000000000000000000000000000000000000000000000000000000000000000000000000000000000000000000000000000000000000000000000000000000000000000000000000000000000000000000000000000000000000000000000000000000000000000000000000000000000000000000000000000000000000000000000000000000000000000000000000000000000000000000000000000000000000000000000000000000000000000000000000000000000000000000000000000000000000000000000000000000000000000000000000000000000000000000000000000000000000000000000000000000000000000000000000000000000000000000000000000000000000000000000000000000000000000000000000000000000000000000000000000000000000000000000000000000000000000000000000000000000000000000000000000000000000000000000000000000#c7 < 6> read packet: $OK#9a < 861> send packet: $G0000000000000000000000000000000000000000000000000000000000000000000000000000000000000000000000000000000000000000000000000000000000000000000000000000000000000000000000000000000000000000000000000000000000000000000000000000000000000000000000000000000000000000000000000000000000000000000000000000000000000000000000000000000000000000000000000000000000000000000000000000000000000000000000000000000000000000000000000000000000000000000000000000000000000000000000000000000000000000000000000000000000000000000000000000000000000000000000000000000000000000000000000000000000000000000000000000000000000000000000000000000000000000000000000000000000000000000000000000000000000000000000000000000000000000000000000000000000000000000000000000000000000000000000000000000000000000000000000000000000000000000000000000000000000000000000000000000000000000000000000000000000000000#c7 < 6> read packet: $OK#9a < 861> send packet: $G0000000000000000000000000000000000000000000000000000000000000000000000000000000000000000000000000000000000000000000000000000000000000000000000000000000000000000000000000000000000000000000000000000000000000000000000000000000000000000000000000000000000000000000000000000000000000000000000000000000000000000000000000000000000000000000000000000000000000000000000000000000000000000000000000000000000000000000000000000000000000000000000000000000000000000000000000000000000000000000000000000000000000000000000000000000000000000000000000000000000000000000000000000000000000000000000000000000000000000000000000000000000000000000000000000000000000000000000000000000000000000000000000000000000000000000000000000000000000000000000000000000000000000000000000000000000000000000000000000000000000000000000000000000000000000000000000000000000000000000000000000000000000000#c7 < 6> read packet: $OK#9a < 861> send packet: $G0000000000000000000000000000000000000000000000000000000000000000000000000000000000000000000000000000000000000000000000000000000000000000000000000000000000000000000000000000000000000000000000000000000000000000000000000000000000000000000000000000000000000000000000000000000000000000000000000000000000000000000000000000000000000000000000000000000000000000000000000000000000000000000000000000000000000000000000000000000000000000000000000000000000000000000000000000000000000000000000000000000000000000000000000000000000000000000000000000000000000000000000000000000000000000000000000000000000000000000000000000000000000000000000000000000000000000000000000000000000000000000000000000000000000000000000000000000000000000000000000000000000000000000000000000000000000000000000000000000000000000000000000000000000000000000000000000000000000000000000000000000000000000#c7 < 6> read packet: $OK#9a < 861> send packet: $G0000000000000000000000000000000000000000000000000000000000000000000000000000000000000000000000000000000000000000000000000000000000000000000000000000000000000000000000000000000000000000000000000000000000000000000000000000000000000000000000000000000000000000000000000000000000000000000000000000000000000000000000000000000000000000000000000000000000000000000000000000000000000000000000000000000000000000000000000000000000000000000000000000000000000000000000000000000000000000000000000000000000000000000000000000000000000000000000000000000000000000000000000000000000000000000000000000000000000000000000000000000000000000000000000000000000000000000000000000000000000000000000000000000000000000000000000000000000000000000000000000000000000000000000000000000000000000000000000000000000000000000000000000000000000000000000000000000000000000000000000000000000000000#c7 < 6> read packet: $OK#9a < 861> send packet: $G0000000000000000000000000000000000000000000000000000000000000000000000000000000000000000000000000000000000000000000000000000000000000000000000000000000000000000000000000000000000000000000000000000000000000000000000000000000000000000000000000000000000000000000000000000000000000000000000000000000000000000000000000000000000000000000000000000000000000000000000000000000000000000000000000000000000000000000000000000000000000000000000000000000000000000000000000000000000000000000000000000000000000000000000000000000000000000000000000000000000000000000000000000000000000000000000000000000000000000000000000000000000000000000000000000000000000000000000000000000000000000000000000000000000000000000000000000000000000000000000000000000000000000000000000000000000000000000000000000000000000000000000000000000000000000000000000000000000000000000000000000000000000000#c7 < 6> read packet: $OK#9a < 861> send packet: $G0000000000000000000000000000000000000000000000000000000000000000000000000000000000000000000000000000000000000000000000000000000000000000000000000000000000000000000000000000000000000000000000000000000000000000000000000000000000000000000000000000000000000000000000000000000000000000000000000000000000000000000000000000000000000000000000000000000000000000000000000000000000000000000000000000000000000000000000000000000000000000000000000000000000000000000000000000000000000000000000000000000000000000000000000000000000000000000000000000000000000000000000000000000000000000000000000000000000000000000000000000000000000000000000000000000000000000000000000000000000000000000000000000000000000000000000000000000000000000000000000000000000000000000000000000000000000000000000000000000000000000000000000000000000000000000000000000000000000000000000000000000000000000#c7 < 6> read packet: $OK#9a < 5> send packet: $k#6b < 4> read packet: $#00 < 1> send packet: + history[1] tid=0x0307 < 1> send packet: + < 19> send packet: $QStartNoAckMode#b0 < 1> read packet: + < 6> read packet: $OK#9a < 1> send packet: + < 45> send packet: $qSupported:xmlRegisters=i386,arm,mips,arc#74 < 57> read packet: $qXfer:features:read+;PacketSize=3fff;QStartNoAckMode+#86 < 26> send packet: $QThreadSuffixSupported#e4 < 4> read packet: $#00 < 27> send packet: $QListThreadsInStopReply#21 < 4> read packet: $#00 < 13> send packet: $qHostInfo#9b < 28> read packet: $ptrsize:8;endian:little;#30 < 10> send packet: $vCont?#49 < 4> read packet: $#00 < 27> send packet: $qVAttachOrWaitSupported#38 < 4> read packet: $#00 < 23> send packet: $QEnableErrorStrings#8c < 6> read packet: $OK#9a < 16> send packet: $qProcessInfo#dc < 4> read packet: $#00 < 6> send packet: $qC#b4 < 7> read packet: $QC0#c4 < 16> send packet: $qfThreadInfo#bb < 5> read packet: $l#6c < 5> send packet: $?#3f < 7> read packet: $S02#b5 < 16> send packet: $qProcessInfo#dc < 4> read packet: $#00 < 41> send packet: $qXfer:features:read:target.xml:0,3ffe#af < 4> read packet: $#00 < 18> send packet: $qRegisterInfo0#72 < 4> read packet: $#00 < 16> send packet: $qfThreadInfo#bb < 5> read packet: $l#6c < 7> send packet: $Hg1#e0 < 6> read packet: $OK#9a < 6> send packet: $p0#a0 < 12> read packet: $00000000#80 < 16> send packet: $qProcessInfo#dc < 4> read packet: $#00 < 12> send packet: $qOffsets#4b < 4> read packet: $#00 < 26> send packet: $qStructuredDataPlugins#02 < 4> read packet: $#00 < 13> send packet: $qSymbol::#5b < 6> read packet: $OK#9a < 16> send packet: $qfThreadInfo#bb < 5> read packet: $l#6c < 16> send packet: $qfThreadInfo#bb < 5> read packet: $l#6c < 6> send packet: $pf#d6 < 12> read packet: $00000000#80 < 6> send packet: $pd#d4 < 12> read packet: $00000000#80 < 15> send packet: $P0=00000000#3d < 6> read packet: $OK#9a < 15> send packet: $P1=00000000#3e < 6> read packet: $OK#9a < 15> send packet: $P2=00000000#3f < 6> read packet: $OK#9a < 15> send packet: $P3=00000000#40 < 6> read packet: $OK#9a < 15> send packet: $P4=00000000#41 < 6> read packet: $OK#9a < 15> send packet: $P5=00000000#42 < 6> read packet: $OK#9a < 15> send packet: $P6=00000000#43 < 6> read packet: $OK#9a < 15> send packet: $P7=00000000#44 < 6> read packet: $OK#9a < 15> send packet: $P8=00000000#45 < 6> read packet: $OK#9a < 15> send packet: $P9=00000000#46 < 6> read packet: $OK#9a < 15> send packet: $Pa=00000000#6e < 6> read packet: $OK#9a < 15> send packet: $Pb=00000000#6f < 6> read packet: $OK#9a < 15> send packet: $Pc=00000000#70 < 6> read packet: $OK#9a < 15> send packet: $Pd=00000000#71 < 6> read packet: $OK#9a < 15> send packet: $Pe=00000000#72 < 6> read packet: $OK#9a < 15> send packet: $Pf=00000000#73 < 6> read packet: $OK#9a < 16> send packet: $P19=00000000#77 < 6> read packet: $OK#9a < 5> send packet: $k#6b < 4> read packet: $#00 LLDB library dir: /Users/buildslave/jenkins/workspace/lldb-cmake@2/lldb-build/bin LLDB import library dir: /Users/buildslave/jenkins/workspace/lldb-cmake@2/lldb-build/./lib libstdcxx tests will not be run because: Don't know how to build with libstdcxx on macosx Skipping following debug info categories: ['dwo']

Hide Details

-- Command Output (stderr): --

Hide Details

Session logs for test failures/errors/unexpected successes will go into directory '/Users/buildslave/jenkins/workspace/lldb-cmake@2/test/logs' Change dir to: /Users/buildslave/jenkins/workspace/lldb-cmake@2/llvm-project/lldb/test/API/functionalities/gdb_remote_client runCmd: settings clear -all output:

Hide Details

runCmd: settings set symbols.enable-external-lookup false output:

Hide Details

runCmd: settings set target.inherit-tcc true output:

Hide Details

runCmd: settings set target.auto-apply-fixits false output:

Hide Details

runCmd: settings set plugin.process.gdb-remote.packet-timeout 60 output:

Hide Details

runCmd: settings set symbols.clang-modules-cache-path "/Users/buildslave/jenkins/workspace/lldb-cmake@2/lldb-build/lldb-test-build.noindex/module-cache-lldb/lldb-api" output:

Hide Details

runCmd: settings set use-color false output:

Hide Details

runCmd: setting set target.prefer-dynamic-value no-dynamic-values output:

Hide Details

<bound method SBProcess.Kill of <lldb.SBProcess; proxy of <Swig Object of type 'lldb::SBProcess *' at 0x115ef44e0> >>: success

Hide Details

PASS: LLDB (/Users/buildslave/jenkins/workspace/lldb-cmake@2/lldb-build/bin/clang-x86_64) :: test_attach_fail (TestGDBRemoteClient.TestGDBRemoteClient) runCmd: settings clear -all output:

Hide Details

runCmd: settings set symbols.enable-external-lookup false output:

Hide Details

runCmd: settings set target.inherit-tcc true output:

Hide Details

runCmd: settings set target.auto-apply-fixits false output:

Hide Details

runCmd: settings set plugin.process.gdb-remote.packet-timeout 60 output:

Hide Details

runCmd: settings set symbols.clang-modules-cache-path "/Users/buildslave/jenkins/workspace/lldb-cmake@2/lldb-build/lldb-test-build.noindex/module-cache-lldb/lldb-api" output:

Hide Details

runCmd: settings set use-color false output:

Hide Details

runCmd: setting set target.prefer-dynamic-value no-dynamic-values output:

Hide Details

FAIL: LLDB (/Users/buildslave/jenkins/workspace/lldb-cmake@2/lldb-build/bin/clang-x86_64) :: test_connect (TestGDBRemoteClient.TestGDBRemoteClient) <bound method SBProcess.Kill of <lldb.SBProcess; proxy of <Swig Object of type 'lldb::SBProcess *' at 0x10e9f6600> >>: success

Hide Details

runCmd: settings clear -all output:

Hide Details

runCmd: settings set symbols.enable-external-lookup false output:

Hide Details

runCmd: settings set target.inherit-tcc true output:

Hide Details

runCmd: settings set target.auto-apply-fixits false output:

Hide Details

runCmd: settings set plugin.process.gdb-remote.packet-timeout 60 output:

Hide Details

runCmd: settings set symbols.clang-modules-cache-path "/Users/buildslave/jenkins/workspace/lldb-cmake@2/lldb-build/lldb-test-build.noindex/module-cache-lldb/lldb-api" output:

Hide Details

runCmd: settings set use-color false output:

Hide Details

runCmd: setting set target.prefer-dynamic-value no-dynamic-values output:

Hide Details

runCmd: log enable gdb-remote packets output:

Hide Details

<bound method SBProcess.Kill of <lldb.SBProcess; proxy of <Swig Object of type 'lldb::SBProcess *' at 0x115ef4540> >>: success

Hide Details

PASS: LLDB (/Users/buildslave/jenkins/workspace/lldb-cmake@2/lldb-build/bin/clang-x86_64) :: test_launch_fail (TestGDBRemoteClient.TestGDBRemoteClient) runCmd: settings clear -all output:

Hide Details

runCmd: settings set symbols.enable-external-lookup false output:

Hide Details

runCmd: settings set target.inherit-tcc true output:

Hide Details

runCmd: settings set target.auto-apply-fixits false output:

Hide Details

runCmd: settings set plugin.process.gdb-remote.packet-timeout 60 output:

Hide Details

runCmd: settings set symbols.clang-modules-cache-path "/Users/buildslave/jenkins/workspace/lldb-cmake@2/lldb-build/lldb-test-build.noindex/module-cache-lldb/lldb-api" output:

Hide Details

runCmd: settings set use-color false output:

Hide Details

runCmd: setting set target.prefer-dynamic-value no-dynamic-values output:

Hide Details

Adding tearDown hook: self.addTearDownHook(lambda: self.runCmd("settings set plugin.process.gdb-remote.use-g-packet-for-reading false"))

Hide Details

Hide Details

<bound method SBProcess.Kill of <lldb.SBProcess; proxy of <Swig Object of type 'lldb::SBProcess *' at 0x10e9f6bd0> >>: success

Hide Details

Executing tearDown hook: self.addTearDownHook(lambda: self.runCmd("settings set plugin.process.gdb-remote.use-g-packet-for-reading false"))

Hide Details

Hide Details

runCmd: settings set plugin.process.gdb-remote.use-g-packet-for-reading false output:

Hide Details

PASS: LLDB (/Users/buildslave/jenkins/workspace/lldb-cmake@2/lldb-build/bin/clang-x86_64) :: test_read_registers_using_g_packets (TestGDBRemoteClient.TestGDBRemoteClient) runCmd: settings clear -all output:

Hide Details

runCmd: settings set symbols.enable-external-lookup false output:

Hide Details

runCmd: settings set target.inherit-tcc true output:

Hide Details

runCmd: settings set target.auto-apply-fixits false output:

Hide Details

runCmd: settings set plugin.process.gdb-remote.packet-timeout 60 output:

Hide Details

runCmd: settings set symbols.clang-modules-cache-path "/Users/buildslave/jenkins/workspace/lldb-cmake@2/lldb-build/lldb-test-build.noindex/module-cache-lldb/lldb-api" output:

Hide Details

runCmd: settings set use-color false output:

Hide Details

runCmd: setting set target.prefer-dynamic-value no-dynamic-values output:

Hide Details

<bound method SBProcess.Kill of <lldb.SBProcess; proxy of <Swig Object of type 'lldb::SBProcess *' at 0x115ef4540> >>: success

Hide Details

PASS: LLDB (/Users/buildslave/jenkins/workspace/lldb-cmake@2/lldb-build/bin/clang-x86_64) :: test_read_registers_using_p_packets (TestGDBRemoteClient.TestGDBRemoteClient) runCmd: settings clear -all output:

Hide Details

runCmd: settings set symbols.enable-external-lookup false output:

Hide Details

runCmd: settings set target.inherit-tcc true output:

Hide Details

runCmd: settings set target.auto-apply-fixits false output:

Hide Details

runCmd: settings set plugin.process.gdb-remote.packet-timeout 60 output:

Hide Details

runCmd: settings set symbols.clang-modules-cache-path "/Users/buildslave/jenkins/workspace/lldb-cmake@2/lldb-build/lldb-test-build.noindex/module-cache-lldb/lldb-api" output:

Hide Details

runCmd: settings set use-color false output:

Hide Details

runCmd: setting set target.prefer-dynamic-value no-dynamic-values output:

Hide Details

<bound method SBProcess.Kill of <lldb.SBProcess; proxy of <Swig Object of type 'lldb::SBProcess *' at 0x10e9f6600> >>: success

Hide Details

PASS: LLDB (/Users/buildslave/jenkins/workspace/lldb-cmake@2/lldb-build/bin/clang-x86_64) :: test_write_registers_using_G_packets (TestGDBRemoteClient.TestGDBRemoteClient) runCmd: settings clear -all output:

Hide Details

runCmd: settings set symbols.enable-external-lookup false output:

Hide Details

runCmd: settings set target.inherit-tcc true output:

Hide Details

runCmd: settings set target.auto-apply-fixits false output:

Hide Details

runCmd: settings set plugin.process.gdb-remote.packet-timeout 60 output:

Hide Details

runCmd: settings set symbols.clang-modules-cache-path "/Users/buildslave/jenkins/workspace/lldb-cmake@2/lldb-build/lldb-test-build.noindex/module-cache-lldb/lldb-api" output:

Hide Details

runCmd: settings set use-color false output:

Hide Details

runCmd: setting set target.prefer-dynamic-value no-dynamic-values output:

Hide Details

<bound method SBProcess.Kill of <lldb.SBProcess; proxy of <Swig Object of type 'lldb::SBProcess *' at 0x115ef4540> >>: success

Hide Details

PASS: LLDB (/Users/buildslave/jenkins/workspace/lldb-cmake@2/lldb-build/bin/clang-x86_64) :: test_write_registers_using_P_packets (TestGDBRemoteClient.TestGDBRemoteClient) Restore dir to: /Users/buildslave/jenkins/workspace/lldb-cmake@2/lldb-build/tools/lldb/test ====================================================================== FAIL: test_connect (TestGDBRemoteClient.TestGDBRemoteClient) Test connecting to a remote gdb server ---------------------------------------------------------------------- Traceback (most recent call last): File "/Users/buildslave/jenkins/workspace/lldb-cmake@2/llvm-project/lldb/test/API/functionalities/gdb_remote_client/TestGDBRemoteClient.py", line 18, in test_connect process = self.connect(target) File "/Users/buildslave/jenkins/workspace/lldb-cmake@2/llvm-project/lldb/test/API/functionalities/gdb_remote_client/gdbclientutils.py", line 524, in connect self.assertTrue(error.Success(), error.description) AssertionError: False is not True : failed to get reply to handshake packet Config=x86_64-/Users/buildslave/jenkins/workspace/lldb-cmake@2/lldb-build/bin/clang ---------------------------------------------------------------------- Ran 7 tests in 109.400s

Hide Details

RESULT: FAILED (6 passes, 1 failures, 0 errors, 0 skipped, 0 expected failures, 0 unexpected successes)

Hide Details

--

Hide Details

******************** PASS: lldb-shell :: SymbolFile/NativePDB/source-list.cpp (2026 of 2129) PASS: lldb-api :: lang/cpp/this_class_type_mixing/TestThisClassTypeMixing.py (2027 of 2129) PASS: lldb-unit :: Utility/./UtilityTests/StreamTest.PutHex32ByteOrderLittle (2028 of 2129) PASS: lldb-shell :: Breakpoint/case-sensitive.test (2029 of 2129) PASS: lldb-api :: functionalities/gdb_remote_client/TestStopPCs.py (2030 of 2129) PASS: lldb-unit :: UnwindAssembly/x86/./UnwindAssemblyx86Tests/Testx86AssemblyInspectionEngine.Test64bitFramelessBigStackFrame (2031 of 2129) PASS: lldb-unit :: Utility/./UtilityTests/DataExtractorTest.GetMaxU64_unchecked (2032 of 2129) PASS: lldb-unit :: ScriptInterpreter/Python/./ScriptInterpreterPythonTests/PythonDataObjectsTest.TestPythonDictionaryValueEquality (2033 of 2129) PASS: lldb-api :: python_api/exprpath_synthetic/TestExprPathSynthetic.py (2034 of 2129) PASS: lldb-unit :: Host/./HostTests/FileSystemTest.FileAndDirectoryComponents (2035 of 2129) PASS: lldb-api :: functionalities/tail_call_frames/thread_step_out_or_return/TestSteppingOutWithArtificialFrames.py (2036 of 2129) PASS: lldb-api :: python_api/sblaunchinfo/TestSBLaunchInfo.py (2037 of 2129) PASS: lldb-unit :: Utility/./UtilityTests/StreamTest.PutPtr (2038 of 2129) PASS: lldb-api :: lang/c/unicode/TestUnicodeSymbols.py (2039 of 2129) PASS: lldb-shell :: SymbolFile/DWARF/dir-separator-posix.s (2040 of 2129) PASS: lldb-unit :: Utility/./UtilityTests/StreamTest.PutRawBytesToBigEndian (2041 of 2129) PASS: lldb-unit :: Utility/./UtilityTests/StreamTeeTest.Flush (2042 of 2129) PASS: lldb-api :: functionalities/thread/concurrent_events/TestConcurrentTwoWatchpointsOneDelayBreakpoint.py (2043 of 2129) PASS: lldb-unit :: Utility/./UtilityTests/FileSpecTest.Yaml (2044 of 2129) PASS: lldb-unit :: UnwindAssembly/x86/./UnwindAssemblyx86Tests/Testx86AssemblyInspectionEngine.TestPushRBP (2045 of 2129) PASS: lldb-api :: commands/expression/unwind_expression/TestUnwindExpression.py (2046 of 2129) PASS: lldb-shell :: ObjectFile/ELF/PT_LOAD.yaml (2047 of 2129) PASS: lldb-unit :: SymbolFile/NativePDB/./SymbolFileNativePDBTests/PDBFPOProgramToDWARFExpressionTests.UnsupportedRASearch (2048 of 2129) PASS: lldb-api :: commands/expression/import-std-module/weak_ptr/TestWeakPtrFromStdModule.py (2049 of 2129) PASS: lldb-api :: lang/objc/objc_direct-methods/TestObjCDirectMethods.py (2050 of 2129) PASS: lldb-unit :: Utility/./UtilityTests/StringListTest.JoinEmpty (2051 of 2129) PASS: lldb-api :: functionalities/data-formatter/data-formatter-stl/libcxx/bitset/TestDataFormatterLibcxxBitset.py (2052 of 2129) PASS: lldb-unit :: UnwindAssembly/x86/./UnwindAssemblyx86Tests/Testx86AssemblyInspectionEngine.TestPushExtended (2053 of 2129) PASS: lldb-shell :: SymbolFile/DWARF/debug-types-signature-loop.s (2054 of 2129) PASS: lldb-unit :: SymbolFile/NativePDB/./SymbolFileNativePDBTests/PDBFPOProgramToDWARFExpressionTests.InvalidAssignmentSingle (2055 of 2129) PASS: lldb-shell :: SymbolFile/DWARF/debug-line-basic.s (2056 of 2129) PASS: lldb-api :: commands/gui/invalid-args/TestInvalidArgsGui.py (2057 of 2129) PASS: lldb-unit :: SymbolFile/DWARF/./SymbolFileDWARFTests/SymbolFileDWARFTests.TestAbilitiesForDWARF (2058 of 2129) PASS: lldb-api :: functionalities/breakpoint/breakpoint_conditions/TestBreakpointConditions.py (2059 of 2129) PASS: lldb-unit :: Target/./TargetTests/ExecutionContextTest.GetByteOrderProcess (2060 of 2129) PASS: lldb-unit :: Utility/./UtilityTests/ScalarTest.SetValueFromCString (2061 of 2129) PASS: lldb-unit :: Host/./HostTests/ConnectionFileDescriptorTest.TCPGetURIv6 (2062 of 2129) PASS: lldb-unit :: Utility/./UtilityTests/TimerTest.CategoryTimesStats (2063 of 2129) PASS: lldb-unit :: Utility/./UtilityTests/RangeTest.SizeTypes (2064 of 2129) PASS: lldb-api :: python_api/sbvalue_persist/TestSBValuePersist.py (2065 of 2129) PASS: lldb-api :: lang/cpp/operator-overload/TestOperatorOverload.py (2066 of 2129) PASS: lldb-unit :: Utility/./UtilityTests/BinaryStreamTest.PutULEB128OneByte (2067 of 2129) PASS: lldb-shell :: SymbolFile/DWARF/debug_loc.s (2068 of 2129) PASS: lldb-api :: commands/expression/persistent_variables/TestPersistentVariables.py (2069 of 2129) PASS: lldb-api :: functionalities/tail_call_frames/unambiguous_sequence/TestUnambiguousTailCalls.py (2070 of 2129) PASS: lldb-api :: functionalities/thread/concurrent_events/TestConcurrentTwoBreakpointsOneDelaySignal.py (2071 of 2129) PASS: lldb-unit :: Utility/./UtilityTests/RegularExpression.Empty (2072 of 2129) PASS: lldb-api :: types/TestRecursiveTypes.py (2073 of 2129) PASS: lldb-unit :: Utility/./UtilityTests/PassiveReplayTest.InstrumentedBarRef (2074 of 2129) UNSUPPORTED: lldb-api :: functionalities/breakpoint/breakpoint_in_delayslot/TestAvoidBreakpointInDelaySlot.py (2075 of 2129) PASS: lldb-api :: commands/gui/basicdebug/TestGuiBasicDebug.py (2076 of 2129) PASS: lldb-api :: functionalities/source-map/TestTargetSourceMap.py (2077 of 2129) PASS: lldb-api :: lang/cpp/const_this/TestConstThis.py (2078 of 2129) PASS: lldb-unit :: Utility/./UtilityTests/ArchSpecTest.TestParseMachCPUDashSubtypeTripleSimple (2079 of 2129) PASS: lldb-unit :: Utility/./UtilityTests/StringListTest.SplitIntoLines (2080 of 2129) PASS: lldb-unit :: Utility/./UtilityTests/BinaryStreamTest.PutULEB128FiveBytes (2081 of 2129) PASS: lldb-api :: commands/watchpoints/multiple_hits/TestMultipleHits.py (2082 of 2129) PASS: lldb-api :: commands/register/register/register_command/TestRegisters.py (2083 of 2129) PASS: lldb-unit :: Signals/./SignalsTests/UnixSignalsTest.GetFilteredSignals (2084 of 2129) PASS: lldb-shell :: Driver/TestProcessAttach.test (2085 of 2129) PASS: lldb-api :: lang/objc/rdar-10967107/TestRdar10967107.py (2086 of 2129) PASS: lldb-api :: commands/apropos/with-process/TestAproposWithProcess.py (2087 of 2129) PASS: lldb-unit :: Utility/./UtilityTests/DataExtractorTest.GetSLEB128_bit63 (2088 of 2129) PASS: lldb-shell :: Commands/command-regex-delete.test (2089 of 2129) PASS: lldb-unit :: ScriptInterpreter/Python/./ScriptInterpreterPythonTests/PythonDataObjectsTest.TestGlobalNameResolutionNoDot (2090 of 2129) PASS: lldb-api :: lang/c/inlines/TestRedefinitionsInInlines.py (2091 of 2129) PASS: lldb-unit :: Symbol/./SymbolTests/TestTypeSystemClang.TestGetEnumIntegerTypeInvalid (2092 of 2129) PASS: lldb-api :: functionalities/breakpoint/breakpoint_language/TestBreakpointLanguage.py (2093 of 2129) PASS: lldb-shell :: Breakpoint/jitbp_elf.test (2094 of 2129) PASS: lldb-shell :: SymbolFile/DWARF/find-function-regex.cpp (2095 of 2129) PASS: lldb-unit :: Utility/./UtilityTests/UriParserTest.MinimalPath (2096 of 2129) PASS: lldb-unit :: Target/./TargetTests/ModuleCacheTest.GetAndPut (2097 of 2129) PASS: lldb-unit :: ObjectFile/PECOFF/./ObjectFilePECOFFTests/PECallFrameInfoTest.Chained_eh (2098 of 2129) PASS: lldb-api :: functionalities/data-formatter/data-formatter-stl/libcxx/function/TestLibCxxFunction.py (2099 of 2129) PASS: lldb-api :: functionalities/ubsan/basic/TestUbsanBasic.py (2100 of 2129) PASS: lldb-unit :: UnwindAssembly/x86/./UnwindAssemblyx86Tests/Testx86AssemblyInspectionEngine.TestStackRealign32BitDisp_x86_64 (2101 of 2129) PASS: lldb-unit :: Utility/./UtilityTests/StringListTest.GetMaxStringLengthEmpty (2102 of 2129) PASS: lldb-shell :: ObjectFile/Breakpad/sections-trailing-func.test (2103 of 2129) PASS: lldb-shell :: SymbolFile/DWARF/DW_OP_piece-smaller-than-struct.s (2104 of 2129) PASS: lldb-unit :: Utility/./UtilityTests/StringExtractorTest.GetHexU8_Underflow2 (2105 of 2129) PASS: lldb-unit :: Utility/./UtilityTests/StringListTest.GetMaxStringLengthEqualSize (2106 of 2129) PASS: lldb-unit :: Utility/./UtilityTests/StreamTest.ChangingByteOrder (2107 of 2129) UNSUPPORTED: lldb-api :: commands/watchpoints/variable_out_of_scope/TestWatchedVarHitWhenInScope.py (2108 of 2129) PASS: lldb-unit :: Interpreter/./InterpreterTests/CompletionTest.DirCompletionAbsolute (2109 of 2129) PASS: lldb-unit :: Utility/./UtilityTests/PassiveReplayTest.InstrumentedFooInvalid (2110 of 2129) UNSUPPORTED: lldb-shell :: ScriptInterpreter/Lua/lua.test (2111 of 2129) PASS: lldb-shell :: Process/UnsupportedLanguage.test (2112 of 2129) PASS: lldb-unit :: Utility/./UtilityTests/StringExtractorTest.DecodeHexU8_InvalidHex (2113 of 2129) PASS: lldb-api :: lang/cpp/dynamic-value/TestCppValueCast.py (2114 of 2129) UNSUPPORTED: lldb-api :: lang/objc/rdar-12408181/TestRdar12408181.py (2115 of 2129) PASS: lldb-api :: lang/cpp/template-specialization-type/TestTemplateSpecializationType.py (2116 of 2129) PASS: lldb-api :: python_api/findvalue_duplist/TestSBFrameFindValue.py (2117 of 2129) PASS: lldb-unit :: Utility/./UtilityTests/ArgsTest.ReplaceArgumentAtIndexOutOfRange (2118 of 2129) PASS: lldb-unit :: Process/gdb-remote/./ProcessGdbRemoteTests/GDBRemoteCommunicationClientTest.SendSignalsToIgnore (2119 of 2129) PASS: lldb-unit :: Utility/./UtilityTests/StreamTest.PutRawBytesToMixedEndian (2120 of 2129) PASS: lldb-unit :: Utility/./UtilityTests/ScalarTest.GetBytes (2121 of 2129) PASS: lldb-api :: lang/objc/bitfield_ivars/TestBitfieldIvars.py (2122 of 2129) UNSUPPORTED: lldb-shell :: Register/arm-gp-read.test (2123 of 2129) PASS: lldb-api :: functionalities/thread/exit_during_expression/TestExitDuringExpression.py (2124 of 2129) UNSUPPORTED: lldb-api :: benchmarks/startup/TestStartupDelays.py (2125 of 2129) PASS: lldb-api :: iohandler/unicode/TestUnicode.py (2126 of 2129) PASS: lldb-api :: tools/lldb-vscode/console/TestVSCode_console.py (2127 of 2129) PASS: lldb-api :: lang/objc/foundation/TestRuntimeTypes.py (2128 of 2129) PASS: lldb-api :: functionalities/memory/cache/TestMemoryCache.py (2129 of 2129) Slowest Tests: -------------------------------------------------------------------------- 322.81s: lldb-api :: macosx/simulator/TestSimulatorPlatform.py 215.70s: lldb-api :: functionalities/gdb_remote_client/TestGDBRemoteLoad.py 202.01s: lldb-api :: functionalities/completion/TestCompletion.py 182.19s: lldb-api :: api/check_public_api_headers/TestPublicAPIHeaders.py 136.43s: lldb-api :: functionalities/postmortem/mach-core/TestMachCore.py 110.05s: lldb-api :: functionalities/gdb_remote_client/TestGDBRemoteClient.py 100.95s: lldb-api :: tools/lldb-server/TestLldbGdbServer.py 72.20s: lldb-api :: lang/objcxx/objcxx-ivar-vector/TestIvarVector.py 62.28s: lldb-api :: python_api/exprpath_synthetic/TestExprPathSynthetic.py 61.58s: lldb-api :: lang/cpp/enum_types/TestCPP11EnumTypes.py 57.12s: lldb-api :: lang/objc/hidden-ivars/TestHiddenIvars.py 54.50s: lldb-api :: lang/objc/foundation/TestFoundationDisassembly.py 54.29s: lldb-api :: functionalities/thread/concurrent_events/TestConcurrentCrashWithBreak.py 54.24s: lldb-api :: lang/objc/exceptions/TestObjCExceptions.py 52.94s: lldb-api :: lang/objc/foundation/TestObjCMethods.py 50.52s: lldb-api :: api/multithreaded/TestMultithreaded.py 48.13s: lldb-api :: types/TestLongTypesExpr.py 47.73s: lldb-api :: lang/objc/foundation/TestObjCMethodsString.py 47.43s: lldb-shell :: SymbolFile/NativePDB/source-list.cpp 47.34s: lldb-api :: functionalities/data-formatter/data-formatter-objc/TestDataFormatterObjCNSContainer.py

Hide Details

Tests Times: -------------------------------------------------------------------------- [ Range ] :: [ Percentage ] :: [ Count ] -------------------------------------------------------------------------- [320s,340s) :: [ ] :: [ 1/2129] [300s,320s) :: [ ] :: [ 0/2129] [280s,300s) :: [ ] :: [ 0/2129] [260s,280s) :: [ ] :: [ 0/2129] [240s,260s) :: [ ] :: [ 0/2129] [220s,240s) :: [ ] :: [ 1/2129] [200s,220s) :: [ ] :: [ 1/2129] [180s,200s) :: [ ] :: [ 1/2129] [160s,180s) :: [ ] :: [ 0/2129] [140s,160s) :: [ ] :: [ 1/2129] [120s,140s) :: [ ] :: [ 0/2129] [100s,120s) :: [ ] :: [ 2/2129] [ 80s,100s) :: [ ] :: [ 0/2129] [ 60s, 80s) :: [ ] :: [ 4/2129] [ 40s, 60s) :: [ ] :: [ 17/2129] [ 20s, 40s) :: [ ] :: [ 44/2129] [ 0s, 20s) :: [************************************** ] :: [2057/2129] -------------------------------------------------------------------------- ******************** Failed Tests (4): lldb-unit :: Symbol/./SymbolTests/SymbolsTest.TerminateLocateExecutableSymbolFileForUnknownExecutableAndUnknownSymbolFile lldb-unit :: Symbol/./SymbolTests/SymbolsTest.LocateExecutableSymbolFileForUnknownExecutableAndMissingSymbolFile lldb-api :: functionalities/gdb_remote_client/TestGDBRemoteLoad.py lldb-api :: functionalities/gdb_remote_client/TestGDBRemoteClient.py

Hide Details

Hide Details

Testing Time: 2035.00s Unsupported : 150 Passed : 1969 Expectedly Failed: 6 Failed : 4 FAILED: tools/lldb/test/CMakeFiles/check-lldb-lit cd /Users/buildslave/jenkins/workspace/lldb-cmake@2/lldb-build/tools/lldb/test && /usr/local/Frameworks/Python.framework/Versions/3.7/bin/python3.7 /Users/buildslave/jenkins/workspace/lldb-cmake@2/lldb-build/./bin/llvm-lit -v --time-tests --shuffle --xunit-xml-output=/Users/buildslave/jenkins/workspace/lldb-cmake@2/test/results.xml -v -j 4 /Users/buildslave/jenkins/workspace/lldb-cmake@2/lldb-build/tools/lldb/test ninja: build stopped: subcommand failed. Command failed: Command '['/usr/bin/env', 'TERM=vt100', '/usr/local/bin/ninja', '-v', 'check-lldb']' returned non-zero exit status 1 Command: ['/usr/bin/env', 'TERM=vt100', '/usr/local/bin/ninja', '-v', 'check-lldb'] [Pipeline] } [Pipeline] // timeout [Pipeline] } [Pipeline] // stage [Pipeline] stage [Pipeline] { (Declarative: Post Actions) [Pipeline] scanForIssues [Clang (LLVM based)] Sleeping for 5 seconds due to JENKINS-32191... [Clang (LLVM based)] Parsing console log (workspace: '/Users/buildslave/jenkins/workspace/lldb-cmake@2') [Clang (LLVM based)] Successfully parsed console log [Clang (LLVM based)] -> found 11 issues (skipped 12 duplicates) [Clang (LLVM based)] Post processing issues on 'green-dragon-10' with source code encoding 'UTF-8' [Clang (LLVM based)] Creating SCM blamer to obtain author and commit information for affected files [Clang (LLVM based)] Creating SCM miner to obtain statistics for affected repository files [Clang (LLVM based)] Resolving file names for all issues in source directory '/Users/buildslave/jenkins/workspace/lldb-cmake@2' [Clang (LLVM based)] -> resolved paths in source directory (8 found, 0 not found) [Clang (LLVM based)] Resolving module names from module definitions (build.xml, pom.xml, or Manifest.mf files) [Clang (LLVM based)] -> resolved module names for 11 issues [Clang (LLVM based)] Resolving package names (or namespaces) by parsing the affected files [Clang (LLVM based)] -> resolved package names of 8 affected files [Clang (LLVM based)] No filter has been set, publishing all 11 issues [Clang (LLVM based)] Creating fingerprints for all affected code blocks to track issues over different builds [Clang (LLVM based)] -> created fingerprints for 11 issues (skipped 0 issues) [Clang (LLVM based)] Copying affected files to Jenkins' build folder '/Users/Shared/Jenkins/Home/jobs/lldb-cmake/builds/23482/files-with-issues' [Clang (LLVM based)] -> 6 copied, 2 not in workspace, 0 not-found, 0 with I/O error [Pipeline] junit Recording test results [Pipeline] } [Pipeline] // stage [Pipeline] } [Pipeline] // withEnv [Pipeline] } [Pipeline] // node [Pipeline] End of Pipeline ERROR: script returned exit code 1 Finished: FAILURE