FailedConsole Output

Skipping 9,569 KB.. Full Log
hread (730 of 2130)
PASS: lldb-api :: functionalities/breakpoint/breakpoint_options/TestBreakpointOptions.py (731 of 2130)
PASS: lldb-shell :: SymbolFile/DWARF/dwarf5-atomic.s (732 of 2130)
PASS: lldb-api :: functionalities/data-formatter/setvaluefromcstring/TestSetValueFromCString.py (733 of 2130)
PASS: lldb-api :: functionalities/rerun/TestRerun.py (734 of 2130)
PASS: lldb-api :: lang/objcxx/class-name-clash/TestNameClash.py (735 of 2130)
PASS: lldb-unit :: ObjectFile/ELF/./ObjectFileELFTests/ObjectFileELFTest.GetSymtab_NoSymEntryPointArmAddressClass (736 of 2130)
PASS: lldb-unit :: Utility/./UtilityTests/AnsiTerminal.Basic (737 of 2130)
PASS: lldb-api :: functionalities/stats_api/TestStatisticsAPI.py (738 of 2130)
PASS: lldb-shell :: ObjectFile/Breakpad/discontiguous-sections.test (739 of 2130)
PASS: lldb-unit :: Utility/./UtilityTests/StringExtractorTest.DecodeHexU8_Extra (740 of 2130)
PASS: lldb-unit :: Utility/./UtilityTests/ScalarTest.Equality (741 of 2130)
PASS: lldb-unit :: Utility/./UtilityTests/BinaryStreamTest.PutULEB128FourBytes (742 of 2130)
PASS: lldb-unit :: Expression/./ExpressionTests/DiagnosticManagerTest.PutStringMultiple (743 of 2130)
PASS: lldb-unit :: UnwindAssembly/x86/./UnwindAssemblyx86Tests/Testx86AssemblyInspectionEngine.TestPushRBPWithREX (744 of 2130)
UNSUPPORTED: lldb-shell :: Register/x86-64-gp-write.test (745 of 2130)
PASS: lldb-api :: functionalities/postmortem/wow64_minidump/TestWow64MiniDump.py (746 of 2130)
PASS: lldb-shell :: SymbolFile/DWARF/apple-index-is-used.cpp (747 of 2130)
PASS: lldb-unit :: SymbolFile/NativePDB/./SymbolFileNativePDBTests/PDBFPOProgramToDWARFExpressionTests.UnresolvedRegisterReference (748 of 2130)
PASS: lldb-api :: lang/objc/foundation/TestObjCMethods2.py (749 of 2130)
PASS: lldb-api :: commands/expression/import-std-module/no-std-module/TestMissingStdModule.py (750 of 2130)
PASS: lldb-shell :: SymbolFile/Breakpad/unwind-via-stack-cfi.test (751 of 2130)
PASS: lldb-unit :: Utility/./UtilityTests/FileSpecTest.Equal (752 of 2130)
PASS: lldb-unit :: Process/minidump/./LLDBMinidumpTests/MinidumpParserTest.GetThreadContext_x86_32 (753 of 2130)
PASS: lldb-shell :: SymbolFile/DWARF/DW_AT_data_bit_offset-DW_OP_stack_value.s (754 of 2130)
PASS: lldb-api :: macosx/profile_vrs_detach/TestDetachVrsProfile.py (755 of 2130)
PASS: lldb-api :: lang/objc/objc-class-method/TestObjCClassMethod.py (756 of 2130)
PASS: lldb-unit :: Utility/./UtilityTests/DeserializerTest.HasData (757 of 2130)
PASS: lldb-api :: functionalities/exec/TestExec.py (758 of 2130)
PASS: lldb-api :: tools/lldb-vscode/console/TestVSCode_console.py (759 of 2130)
PASS: lldb-api :: functionalities/load_using_paths/TestLoadUsingPaths.py (760 of 2130)
PASS: lldb-api :: functionalities/gdb_remote_client/TestRecognizeBreakpoint.py (761 of 2130)
PASS: lldb-shell :: ObjectFile/ELF/basic-info.yaml (762 of 2130)
PASS: lldb-unit :: Utility/./UtilityTests/ArgsTest.TestQuotedTrailingBackslash (763 of 2130)
PASS: lldb-unit :: Core/./LLDBCoreTests/MangledTest.ResultForValidName (764 of 2130)
PASS: lldb-unit :: ScriptInterpreter/Python/./ScriptInterpreterPythonTests/PythonDataObjectsTest.TestScript (765 of 2130)
PASS: lldb-unit :: Expression/./ExpressionTests/DiagnosticManagerTest.GetStringPreserveOrder (766 of 2130)
PASS: lldb-unit :: Utility/./UtilityTests/DataExtractorTest.GetMaxS64 (767 of 2130)
PASS: lldb-unit :: Utility/./UtilityTests/StringListTest.CopyListEmpty (768 of 2130)
PASS: lldb-api :: functionalities/thread/concurrent_events/TestConcurrentTwoBreakpointsOneDelaySignal.py (769 of 2130)
PASS: lldb-api :: lang/objc/ivar-IMP/TestObjCiVarIMP.py (770 of 2130)
PASS: lldb-api :: lang/cpp/type_lookup/TestCppTypeLookup.py (771 of 2130)
PASS: lldb-api :: types/TestIntegerType.py (772 of 2130)
PASS: lldb-unit :: Utility/./UtilityTests/RangeDataVector.CustomSort (773 of 2130)
PASS: lldb-unit :: Thread/./ThreadTests/ThreadTest.SetStopInfo (774 of 2130)
PASS: lldb-unit :: Utility/./UtilityTests/StreamTest.PutHex16ByteOrderLittle (775 of 2130)
PASS: lldb-shell :: SymbolFile/NativePDB/globals-fundamental.cpp (776 of 2130)
PASS: lldb-shell :: ObjectFile/PECOFF/disassemble-thumb.yaml (777 of 2130)
PASS: lldb-shell :: SymbolFile/Breakpad/unwind-via-stack-win.test (778 of 2130)
PASS: lldb-unit :: UnwindAssembly/x86/./UnwindAssemblyx86Tests/Testx86AssemblyInspectionEngine.Test32bitFramelessSmallStackFrame (779 of 2130)
PASS: lldb-unit :: Utility/./UtilityTests/SubsystemRAIITest.NormalSubsystem (780 of 2130)
UNSUPPORTED: lldb-shell :: SymbolFile/PDB/udt-layout.test (781 of 2130)
PASS: lldb-unit :: Utility/./UtilityTests/UriParserTest.MinimalPath (782 of 2130)
PASS: lldb-unit :: Utility/./UtilityTests/SerializationRountripTest.SerializeDeserializePod (783 of 2130)
PASS: lldb-unit :: Expression/./ExpressionTests/DWARFExpression.DW_OP_stack_value (784 of 2130)
PASS: lldb-unit :: UnwindAssembly/x86/./UnwindAssemblyx86Tests/Testx86AssemblyInspectionEngine.TestPopR14 (785 of 2130)
PASS: lldb-unit :: Utility/./UtilityTests/BinaryStreamTest.PutSLEB128One (786 of 2130)
PASS: lldb-shell :: ObjectFile/ELF/compressed-sections.yaml (787 of 2130)
PASS: lldb-api :: functionalities/memory-region/TestMemoryRegion.py (788 of 2130)
PASS: lldb-unit :: Host/./HostTests/Host.WaitStatusFormat (789 of 2130)
PASS: lldb-api :: lang/c/shared_lib/TestSharedLib.py (790 of 2130)
PASS: lldb-api :: functionalities/gdb_remote_client/TestProcessConnect.py (791 of 2130)
PASS: lldb-unit :: ScriptInterpreter/Python/./ScriptInterpreterPythonTests/PythonDataObjectsTest.TestCallable (792 of 2130)
PASS: lldb-api :: lang/objc/objc-new-syntax/TestObjCNewSyntaxDictionary.py (793 of 2130)
PASS: lldb-api :: python_api/lldbutil/frame/TestFrameUtils.py (794 of 2130)
PASS: lldb-api :: python_api/watchpoint/watchlocation/TestTargetWatchAddress.py (795 of 2130)
PASS: lldb-unit :: Utility/./UtilityTests/StreamTest.ShiftOperatorStrings (796 of 2130)
PASS: lldb-api :: lang/cpp/rvalue-references/TestRvalueReferences.py (797 of 2130)
PASS: lldb-unit :: SymbolFile/NativePDB/./SymbolFileNativePDBTests/PDBFPOProgramToDWARFExpressionTests.InvalidOpUnary (798 of 2130)
PASS: lldb-api :: functionalities/data-formatter/data-formatter-python-synth/TestDataFormatterPythonSynth.py (799 of 2130)
PASS: lldb-unit :: Host/./HostTests/Host.GetEnvironment (800 of 2130)
PASS: lldb-shell :: Breakpoint/debug_rnglist_rlestartend.test (801 of 2130)
PASS: lldb-unit :: Utility/./UtilityTests/ArgsTest.TestArgv (802 of 2130)
PASS: lldb-api :: functionalities/breakpoint/cpp/TestCPPBreakpointLocations.py (803 of 2130)
PASS: lldb-shell :: Reproducer/TestVersionCheck.test (804 of 2130)
PASS: lldb-api :: commands/expression/ignore-artificial-constructors/TestIgnoreArtificialConstructors.py (805 of 2130)
PASS: lldb-shell :: Commands/command-backtrace.test (806 of 2130)
UNSUPPORTED: lldb-shell :: ScriptInterpreter/Lua/io.test (807 of 2130)
PASS: lldb-unit :: Utility/./UtilityTests/BinaryStreamTest.PutSLEB128MaxValue (808 of 2130)
PASS: lldb-api :: lang/cpp/offsetof/TestOffsetofCpp.py (809 of 2130)
PASS: lldb-unit :: Utility/./UtilityTests/ArgsTest.TestSingleArg (810 of 2130)
UNSUPPORTED: lldb-shell :: ScriptInterpreter/Lua/persistent_state.test (811 of 2130)
PASS: lldb-api :: functionalities/thread/concurrent_events/TestConcurrentSignalWatchBreak.py (812 of 2130)
PASS: lldb-unit :: Utility/./UtilityTests/SerializationRountripTest.SerializeDeserializePodReferences (813 of 2130)
PASS: lldb-unit :: UnwindAssembly/x86/./UnwindAssemblyx86Tests/Testx86AssemblyInspectionEngine.TestStackRealign32BitDisp_x86_64 (814 of 2130)
PASS: lldb-shell :: Breakpoint/implicit_const_form_support.test (815 of 2130)
PASS: lldb-shell :: ObjectFile/MachO/lc_build_version_notools.yaml (816 of 2130)
UNSUPPORTED: lldb-shell :: BuildScript/toolchain-clang-cl.test (817 of 2130)
PASS: lldb-api :: functionalities/gdb_remote_client/TestJLink6Armv7RegisterDefinition.py (818 of 2130)
PASS: lldb-unit :: Utility/./UtilityTests/FileSpecTest.EqualDotsPosixRoot (819 of 2130)
PASS: lldb-api :: python_api/hello_world/TestHelloWorld.py (820 of 2130)
PASS: lldb-shell :: Breakpoint/debug_rnglist_basic.test (821 of 2130)
PASS: lldb-unit :: Utility/./UtilityTests/DataExtractorTest.GetULEB128_bit63 (822 of 2130)
PASS: lldb-shell :: Breakpoint/single-file-split-dwarf.test (823 of 2130)
PASS: lldb-api :: lang/cpp/bitfields/TestCppBitfields.py (824 of 2130)
PASS: lldb-unit :: SymbolFile/NativePDB/./SymbolFileNativePDBTests/PDBFPOProgramToDWARFExpressionTests.UnknownOp (825 of 2130)
PASS: lldb-unit :: ObjectFile/PECOFF/./ObjectFilePECOFFTests/PECallFrameInfoTest.Frame_reg_eh (826 of 2130)
PASS: lldb-unit :: Utility/./UtilityTests/IndexToObjectTest.ObjectForIndex (827 of 2130)
UNSUPPORTED: lldb-api :: functionalities/breakpoint/breakpoint_in_delayslot/TestAvoidBreakpointInDelaySlot.py (828 of 2130)
PASS: lldb-shell :: SymbolFile/DWARF/dir-separator-no-comp-dir.s (829 of 2130)
PASS: lldb-unit :: Utility/./UtilityTests/StreamTeeTest.Assignment (830 of 2130)
PASS: lldb-unit :: Utility/./UtilityTests/StringListTest.LongestCommonPrefixEmpty (831 of 2130)
PASS: lldb-unit :: Utility/./UtilityTests/StringExtractorTest.GetU64LittleEndian (832 of 2130)
PASS: lldb-unit :: Utility/./UtilityTests/UriParserTest.SchemeHostSeparator3 (833 of 2130)
UNSUPPORTED: lldb-api :: functionalities/darwin_log/filter/exact_match/subsystem/TestDarwinLogFilterMatchSubsystem.py (834 of 2130)
PASS: lldb-api :: commands/expression/persistent_types/TestPersistentTypes.py (835 of 2130)
PASS: lldb-api :: functionalities/data-formatter/data-formatter-stl/libcxx/multiset/TestDataFormatterLibcxxMultiSet.py (836 of 2130)
PASS: lldb-api :: commands/expression/unwind_expression/TestUnwindExpression.py (837 of 2130)
PASS: lldb-api :: functionalities/process_group/TestChangeProcessGroup.py (838 of 2130)
UNSUPPORTED: lldb-api :: tools/lldb-server/registers-target-xml-reading/TestGdbRemoteTargetXmlPacket.py (839 of 2130)
PASS: lldb-api :: functionalities/breakpoint/serialize/TestBreakpointSerialization.py (840 of 2130)
PASS: lldb-api :: functionalities/thread/state_after_expression/TestStateAfterExpression.py (841 of 2130)
PASS: lldb-unit :: UnwindAssembly/ARM64/./Arm64InstEmulationTests/TestArm64InstEmulation.TestSimpleDarwinFunction (842 of 2130)
PASS: lldb-api :: lang/c/const_variables/TestConstVariables.py (843 of 2130)
PASS: lldb-unit :: Utility/./UtilityTests/ReproducerTest.SetCapture (844 of 2130)
PASS: lldb-unit :: UnwindAssembly/x86/./UnwindAssemblyx86Tests/Testx86AssemblyInspectionEngine.TestPushEDI (845 of 2130)
PASS: lldb-unit :: Process/minidump/./LLDBMinidumpTests/MinidumpParserTest.GetFilteredModuleList (846 of 2130)
PASS: lldb-api :: lang/objc/objc-runtime-ivars/TestRuntimeIvars.py (847 of 2130)
PASS: lldb-api :: functionalities/data-formatter/data-formatter-named-summaries/TestDataFormatterNamedSummaries.py (848 of 2130)
PASS: lldb-unit :: Utility/./UtilityTests/DataExtractorTest.GetSLEB128_bit63 (849 of 2130)
PASS: lldb-unit :: Utility/./UtilityTests/OptionsWithRawTest.MultiWordSuffix (850 of 2130)
PASS: lldb-api :: functionalities/data-formatter/data-formatter-cpp/TestDataFormatterCpp.py (851 of 2130)
PASS: lldb-shell :: Commands/CommandScriptImmediateOutput/CommandScriptImmediateOutputFile.test (852 of 2130)
PASS: lldb-api :: tools/lldb-server/TestGdbRemoteSingleStep.py (853 of 2130)
PASS: lldb-api :: functionalities/step_scripted/TestStepScripted.py (854 of 2130)
PASS: lldb-api :: lang/c/modules/TestCModules.py (855 of 2130)
PASS: lldb-unit :: Utility/./UtilityTests/VASprintfTest.EncodingError (856 of 2130)
PASS: lldb-unit :: Symbol/./SymbolTests/TestTypeSystemClang.TestBuiltinTypeForEncodingAndBitSize (857 of 2130)
PASS: lldb-unit :: Utility/./UtilityTests/StreamTest.PutHex32ByteOrderLittle (858 of 2130)
PASS: lldb-api :: functionalities/breakpoint/move_nearest/TestMoveNearest.py (859 of 2130)
PASS: lldb-api :: tools/lldb-server/TestGdbRemoteThreadsInStopReply.py (860 of 2130)
PASS: lldb-unit :: Utility/./UtilityTests/StringExtractorTest.GetNameColonValueSuccess (861 of 2130)
PASS: lldb-unit :: Interpreter/./InterpreterTests/CompletionTest.DirCompletionUsername (862 of 2130)
PASS: lldb-unit :: Utility/./UtilityTests/LogChannelTest.Disable (863 of 2130)
PASS: lldb-api :: lang/c/vla/TestVLA.py (864 of 2130)
PASS: lldb-api :: commands/log/invalid-args/TestInvalidArgsLog.py (865 of 2130)
UNSUPPORTED: lldb-api :: functionalities/darwin_log/filter/exact_match/activity/TestDarwinLogFilterMatchActivity.py (866 of 2130)
PASS: lldb-unit :: Process/minidump/./LLDBMinidumpTests/RegisterContextMinidump.ConvertMinidumpContext_x86_64 (867 of 2130)
PASS: lldb-unit :: UnwindAssembly/x86/./UnwindAssemblyx86Tests/Testx86AssemblyInspectionEngine.TestSpillRegToStackViaMOVi386 (868 of 2130)
PASS: lldb-unit :: Process/gdb-remote/./ProcessGdbRemoteTests/GDBRemoteClientBaseTest.SendContinueAndAsyncPacket (869 of 2130)
PASS: lldb-api :: functionalities/abbreviation/TestAbbreviations.py (870 of 2130)
PASS: lldb-api :: commands/expression/no-deadlock/TestExprDoesntBlock.py (871 of 2130)
PASS: lldb-api :: commands/session/history/TestSessionHistory.py (872 of 2130)
PASS: lldb-shell :: Settings/TestModuleCacheSanity.test (873 of 2130)
PASS: lldb-api :: python_api/file_handle/TestFileHandle.py (874 of 2130)
UNSUPPORTED: lldb-shell :: SymbolFile/PDB/expressions.test (875 of 2130)
PASS: lldb-unit :: Utility/./UtilityTests/StringExtractorTest.GetHexBytesAvail_Partial (876 of 2130)
PASS: lldb-unit :: Process/minidump/./LLDBMinidumpTests/MinidumpParserTest.GetLinuxProcStatus (877 of 2130)
PASS: lldb-unit :: Utility/./UtilityTests/SerializationRountripTest.SerializeDeserializeObjectReference (878 of 2130)
PASS: lldb-api :: macosx/macCatalyst/TestMacCatalyst.py (879 of 2130)
PASS: lldb-unit :: Utility/./UtilityTests/StringExtractorTest.DecodeHexU8_Exact (880 of 2130)
PASS: lldb-unit :: API/./APITests/SBCommandInterpreterTest.MultiWordCommand (881 of 2130)
PASS: lldb-unit :: SymbolFile/DWARF/./SymbolFileDWARFTests/SymbolFileDWARFTests.ParseArangesNonzeroSegmentSize (882 of 2130)
UNSUPPORTED: lldb-api :: commands/register/register/aarch64_sve_registers/rw_access_static_config/TestSVERegisters.py (883 of 2130)
PASS: lldb-api :: python_api/value/TestValueAPI.py (884 of 2130)
PASS: lldb-unit :: Utility/./UtilityTests/StreamTest.AddressRangeEmptyRange (885 of 2130)
UNSUPPORTED: lldb-api :: functionalities/breakpoint/hardware_breakpoints/hardware_breakpoint_on_multiple_threads/TestHWBreakMultiThread.py (886 of 2130)
UNSUPPORTED: lldb-shell :: Register/x86-ymm-read.test (887 of 2130)
PASS: lldb-api :: python_api/objc_type/TestObjCType.py (888 of 2130)
PASS: lldb-api :: functionalities/data-formatter/data-formatter-stl/libcxx/optional/TestDataFormatterLibcxxOptional.py (889 of 2130)
PASS: lldb-shell :: SymbolFile/symbol-binding.test (890 of 2130)
PASS: lldb-api :: functionalities/data-formatter/data-formatter-objc/TestDataFormatterObjCExpr.py (891 of 2130)
PASS: lldb-api :: functionalities/ptr_refs/TestPtrRefs.py (892 of 2130)
PASS: lldb-shell :: Minidump/fb-dump.test (893 of 2130)
PASS: lldb-api :: python_api/process/TestProcessAPI.py (894 of 2130)
PASS: lldb-unit :: Symbol/./SymbolTests/TestTypeSystemClang.TestDisplayNameEmpty (895 of 2130)
PASS: lldb-api :: types/TestDoubleTypes.py (896 of 2130)
PASS: lldb-unit :: API/./APITests/SBCommandInterpreterTest.SingleWordCommand (897 of 2130)
PASS: lldb-api :: functionalities/tail_call_frames/ambiguous_tail_call_seq1/TestAmbiguousTailCallSeq1.py (898 of 2130)
PASS: lldb-api :: functionalities/inferior-assert/TestInferiorAssert.py (899 of 2130)
PASS: lldb-shell :: SymbolFile/DWARF/find-basic-variable.cpp (900 of 2130)
PASS: lldb-api :: lang/cpp/breakpoint-commands/TestCPPBreakpointCommands.py (901 of 2130)
PASS: lldb-unit :: Utility/./UtilityTests/RangeTest.DoesAdjoinOrIntersect (902 of 2130)
PASS: lldb-unit :: Utility/./UtilityTests/StringExtractorTest.GetHexU8_Underflow2 (903 of 2130)
PASS: lldb-unit :: Host/./HostTests/FileSystemTest.MakeAbsolute (904 of 2130)
PASS: lldb-unit :: Utility/./UtilityTests/StreamTest.ShiftOperatorPtr (905 of 2130)
PASS: lldb-api :: commands/watchpoints/watchpoint_on_vectors/TestValueOfVectorVariable.py (906 of 2130)
PASS: lldb-api :: python_api/disassemble-raw-data/TestDisassembleRawData.py (907 of 2130)
PASS: lldb-unit :: Utility/./UtilityTests/UUIDTest.Validity (908 of 2130)
PASS: lldb-api :: commands/expression/result_numbering/TestResultNumbering.py (909 of 2130)
PASS: lldb-unit :: SymbolFile/DWARF/./SymbolFileDWARFTests/SymbolFileDWARFTests.TestAbbrevOutOfOrder (910 of 2130)
PASS: lldb-unit :: Process/minidump/./LLDBMinidumpTests/RegisterContextMinidump.CheckRegisterContextMinidump_ARM (911 of 2130)
PASS: lldb-api :: commands/watchpoints/watchpoint_disable/TestWatchpointDisable.py (912 of 2130)
PASS: lldb-api :: commands/settings/use_source_cache/TestUseSourceCache.py (913 of 2130)
PASS: lldb-shell :: ObjectFile/PECOFF/symbol.yaml (914 of 2130)
PASS: lldb-unit :: Utility/./UtilityTests/ConstStringTest.CompareConstString (915 of 2130)
PASS: lldb-unit :: Utility/./UtilityTests/OptionsWithRawTest.EmptyInput (916 of 2130)
PASS: lldb-unit :: Utility/./UtilityTests/EventTest.DumpEventDataBytes (917 of 2130)
PASS: lldb-unit :: Utility/./UtilityTests/RecordReplayTest.InstrumentedFooSameThis (918 of 2130)
PASS: lldb-api :: commands/platform/basic/TestPlatformPython.py (919 of 2130)
PASS: lldb-api :: lang/c/bitfields/TestBitfields.py (920 of 2130)
PASS: lldb-unit :: Symbol/./SymbolTests/TestClangASTImporter.MetadataPropagationIndirectImport (921 of 2130)
PASS: lldb-api :: functionalities/tail_call_frames/cross_dso/TestCrossDSOTailCalls.py (922 of 2130)
PASS: lldb-unit :: Language/Highlighting/./HighlighterTests/HighlighterTest.DefaultHighlighterWithCursorOutOfBounds (923 of 2130)
UNSUPPORTED: lldb-api :: linux/thread/create_during_instruction_step/TestCreateDuringInstructionStep.py (924 of 2130)
PASS: lldb-api :: functionalities/breakpoint/auto_continue/TestBreakpointAutoContinue.py (925 of 2130)
PASS: lldb-api :: python_api/findvalue_duplist/TestSBFrameFindValue.py (926 of 2130)
PASS: lldb-unit :: Expression/./ExpressionTests/CppModuleConfigurationTest.Xcode (927 of 2130)
PASS: lldb-api :: lang/cpp/dynamic-value-same-basename/TestDynamicValueSameBase.py (928 of 2130)
UNSUPPORTED: lldb-shell :: Register/x86-zmm-read.test (929 of 2130)
PASS: lldb-shell :: SymbolFile/DWARF/dwp-debug-types.s (930 of 2130)
PASS: lldb-unit :: Host/./HostTests/File.GetStreamFromDescriptor (931 of 2130)
PASS: lldb-api :: functionalities/non-overlapping-index-variable-i/TestIndexVariable.py (932 of 2130)
PASS: lldb-api :: lang/cpp/template-function/TestTemplateFunctions.py (933 of 2130)
PASS: lldb-unit :: Disassembler/./DisassemblerTests/TestArm64Disassembly.TestArmv81Instruction (934 of 2130)
PASS: lldb-unit :: UnwindAssembly/PPC64/./PPC64InstEmulationTests/TestPPC64InstEmulation.TestMediumFunction (935 of 2130)
PASS: lldb-unit :: UnwindAssembly/x86/./UnwindAssemblyx86Tests/Testx86AssemblyInspectionEngine.Test32BitOnlyInstruction (936 of 2130)
PASS: lldb-shell :: SymbolFile/DWARF/dwp-separate-debug-file.cpp (937 of 2130)
PASS: lldb-api :: functionalities/gdb_remote_client/TestArmRegisterDefinition.py (938 of 2130)
PASS: lldb-unit :: Utility/./UtilityTests/StringExtractorTest.GetNameColonValueNoColon (939 of 2130)
PASS: lldb-unit :: Utility/./UtilityTests/DataExtractorTest.GetCStr (940 of 2130)
PASS: lldb-api :: commands/expression/import-std-module/vector-bool/TestVectorBoolFromStdModule.py (941 of 2130)
PASS: lldb-unit :: Target/./TargetTests/ExecutionContextTest.GetByteOrderTarget (942 of 2130)
PASS: lldb-unit :: Utility/./UtilityTests/StreamTeeTest.AppendStream (943 of 2130)
PASS: lldb-unit :: Process/gdb-remote/./ProcessGdbRemoteTests/GDBRemoteCommunicationServerTest.SendErrorResponse_StringError (944 of 2130)
PASS: lldb-api :: commands/target/stop-hooks/TestStopHooks.py (945 of 2130)
PASS: lldb-api :: commands/gui/basic/TestGuiBasic.py (946 of 2130)
PASS: lldb-unit :: UnwindAssembly/x86/./UnwindAssemblyx86Tests/Testx86AssemblyInspectionEngine.TestPushR15 (947 of 2130)
PASS: lldb-api :: functionalities/data-formatter/boolreference/TestFormattersBoolRefPtr.py (948 of 2130)
PASS: lldb-api :: functionalities/data-formatter/format-propagation/TestFormatPropagation.py (949 of 2130)
PASS: lldb-unit :: Utility/./UtilityTests/BinaryStreamTest.PutULEB128NineBytes (950 of 2130)
PASS: lldb-api :: macosx/save_crashlog/TestSaveCrashlog.py (951 of 2130)
PASS: lldb-api :: commands/expression/function_template_specialization_temp_args/TestFunctionTemplateSpecializationTempArgs.py (952 of 2130)
PASS: lldb-api :: commands/process/signal/TestProcessSignal.py (953 of 2130)
PASS: lldb-unit :: Utility/./UtilityTests/StreamTest.PutStringAsRawHex8 (954 of 2130)
PASS: lldb-unit :: Utility/./UtilityTests/RangeTest.ContainsRangeStartingFromZero (955 of 2130)
PASS: lldb-api :: lang/objc/single-entry-dictionary/TestObjCSingleEntryDictionary.py (956 of 2130)
PASS: lldb-api :: lang/cpp/std-function-step-into-callable/TestStdFunctionStepIntoCallable.py (957 of 2130)
PASS: lldb-unit :: Utility/./UtilityTests/StringExtractorTest.DecodeHexU8_InvalidHex2 (958 of 2130)
PASS: lldb-unit :: Utility/./UtilityTests/ConstStringTest.FromMidOfBufferStringRef (959 of 2130)
PASS: lldb-shell :: Breakpoint/debug_rnglist_offset_pair.test (960 of 2130)
PASS: lldb-api :: commands/expression/completion/TestExprCompletion.py (961 of 2130)
PASS: lldb-unit :: Utility/./UtilityTests/ProcessInstanceInfo.Yaml (962 of 2130)
PASS: lldb-api :: tools/lldb-server/TestGdbRemote_qThreadStopInfo.py (963 of 2130)
PASS: lldb-shell :: ObjectFile/ELF/section-overlap.yaml (964 of 2130)
PASS: lldb-unit :: Utility/./UtilityTests/LogChannelTest.Enable (965 of 2130)
PASS: lldb-unit :: ScriptInterpreter/Python/./ScriptInterpreterPythonTests/PythonDataObjectsTest.TestPythonListToStructuredList (966 of 2130)
UNSUPPORTED: lldb-shell :: ScriptInterpreter/Lua/convenience_variables.test (967 of 2130)
PASS: lldb-unit :: Utility/./UtilityTests/ListenerTest.GetEventImmediate (968 of 2130)
PASS: lldb-api :: arm/emulation/TestEmulations.py (969 of 2130)
PASS: lldb-unit :: ScriptInterpreter/Python/./ScriptInterpreterPythonTests/PythonDataObjectsTest.TestPythonString (970 of 2130)
PASS: lldb-api :: commands/platform/file/close/TestPlatformFileClose.py (971 of 2130)
PASS: lldb-api :: commands/expression/rdar42038760/TestScalarURem.py (972 of 2130)
PASS: lldb-unit :: Utility/./UtilityTests/GeneratorTest.Get (973 of 2130)
PASS: lldb-unit :: Utility/./UtilityTests/StringExtractorTest.GetHexBytesAvail_Underflow (974 of 2130)
PASS: lldb-unit :: Host/./HostTests/SocketTest.UDPGetConnectURI (975 of 2130)
PASS: lldb-shell :: SymbolFile/DWARF/find-variable-dwo.cpp (976 of 2130)
PASS: lldb-unit :: Utility/./UtilityTests/StringListTest.AppendListCStringArrayEmpty (977 of 2130)
PASS: lldb-api :: commands/expression/context-object-objc/TestContextObjectObjc.py (978 of 2130)
PASS: lldb-api :: python_api/frame/TestFrames.py (979 of 2130)
PASS: lldb-shell :: SymbolFile/DWARF/anon_class_w_and_wo_export_symbols.ll (980 of 2130)
PASS: lldb-unit :: Language/Highlighting/./HighlighterTests/HighlighterTest.ClangPreserveNewLine (981 of 2130)
PASS: lldb-unit :: Utility/./UtilityTests/RangeDataVector.FindEntryIndexesThatContain_Overlap (982 of 2130)
PASS: lldb-api :: functionalities/data-formatter/ostypeformatting/TestFormattersOsType.py (983 of 2130)
PASS: lldb-api :: commands/expression/persistent_ptr_update/TestPersistentPtrUpdate.py (984 of 2130)
PASS: lldb-unit :: Utility/./UtilityTests/StringLexerTest.NextIf (985 of 2130)
PASS: lldb-api :: commands/expression/import-std-module/list/TestListFromStdModule.py (986 of 2130)
PASS: lldb-unit :: Process/gdb-remote/./ProcessGdbRemoteTests/GDBRemoteCommunicationClientTest.GetMemoryRegionInfo (987 of 2130)
PASS: lldb-unit :: UnwindAssembly/x86/./UnwindAssemblyx86Tests/Testx86AssemblyInspectionEngine.TestDisassemblyMidFunctionEpilogues (988 of 2130)
PASS: lldb-unit :: UnwindAssembly/x86/./UnwindAssemblyx86Tests/Testx86AssemblyInspectionEngine.TestSubESP (989 of 2130)
PASS: lldb-shell :: SymbolFile/DWARF/debug-types-line-tables.s (990 of 2130)
UNSUPPORTED: lldb-api :: functionalities/data-formatter/data-formatter-stl/libstdcpp/string/TestDataFormatterStdString.py (991 of 2130)
PASS: lldb-unit :: Utility/./UtilityTests/UriParserTest.BracketedHostnamePort (992 of 2130)
PASS: lldb-unit :: Utility/./UtilityTests/FileSpecTest.Match (993 of 2130)
PASS: lldb-unit :: Utility/./UtilityTests/XcodeSDKTest.SDKSupportsModules (994 of 2130)
PASS: lldb-unit :: Utility/./UtilityTests/TimeoutTest.Format (995 of 2130)
PASS: lldb-unit :: Utility/./UtilityTests/StringListTest.LongestCommonPrefix (996 of 2130)
PASS: lldb-unit :: Utility/./UtilityTests/StreamTest.AddressEmptyPrefix (997 of 2130)
PASS: lldb-api :: lang/c/step-target/TestStepTarget.py (998 of 2130)
PASS: lldb-unit :: Utility/./UtilityTests/ProcessInstanceInfo.Dump (999 of 2130)
PASS: lldb-unit :: ScriptInterpreter/Python/./ScriptInterpreterPythonTests/PythonDataObjectsTest.TestDictionaryResolutionWithDot (1000 of 2130)
PASS: lldb-api :: lang/objc/objc-ivar-offsets/TestObjCIvarOffsets.py (1001 of 2130)
PASS: lldb-api :: functionalities/data-formatter/data-formatter-stl/libstdcpp/unique_ptr/invalid/TestDataFormatterInvalidStdUniquePtr.py (1002 of 2130)
PASS: lldb-shell :: Reproducer/TestWorkingDir.test (1003 of 2130)
PASS: lldb-api :: lang/objc/objc-dyn-sbtype/TestObjCDynamicSBType.py (1004 of 2130)
PASS: lldb-api :: commands/help/TestHelp.py (1005 of 2130)
PASS: lldb-shell :: ObjectFile/ELF/short-build-id.yaml (1006 of 2130)
PASS: lldb-api :: functionalities/postmortem/elf-core/TestLinuxCore.py (1007 of 2130)
PASS: lldb-api :: commands/expression/ir-interpreter-phi-nodes/TestIRInterpreterPHINodes.py (1008 of 2130)
PASS: lldb-api :: lang/cpp/lambdas/TestLambdas.py (1009 of 2130)
PASS: lldb-unit :: Core/./LLDBCoreTests/SourceFileCache.FindSourceFileFound (1010 of 2130)
PASS: lldb-unit :: Utility/./UtilityTests/Predicate.WaitForValueEqualTo (1011 of 2130)
PASS: lldb-unit :: UnwindAssembly/ARM64/./Arm64InstEmulationTests/TestArm64InstEmulation.TestCFARegisterTrackedAcrossJumps (1012 of 2130)
PASS: lldb-unit :: Utility/./UtilityTests/StringExtractorTest.GetU32LittleEndian (1013 of 2130)
PASS: lldb-unit :: Symbol/./SymbolTests/TestTypeSystemClang.TestDisplayName (1014 of 2130)
PASS: lldb-api :: functionalities/inferior-crashing/TestInferiorCrashingStep.py (1015 of 2130)
UNSUPPORTED: lldb-api :: lang/cpp/function-template-parameter-pack/TestFunctionTemplateParameterPack.py (1016 of 2130)
PASS: lldb-shell :: SymbolFile/DWARF/module-ownership.mm (1017 of 2130)
PASS: lldb-unit :: Utility/./UtilityTests/DataExtractorTest.GetMaxU64_unchecked (1018 of 2130)
PASS: lldb-api :: lang/cpp/unsigned_types/TestUnsignedTypes.py (1019 of 2130)
PASS: lldb-unit :: Utility/./UtilityTests/LogChannelTest.EnableOptions (1020 of 2130)
PASS: lldb-unit :: Language/Highlighting/./HighlighterTests/HighlighterTest.ClangCursorPos (1021 of 2130)
PASS: lldb-api :: commands/frame/recognizer/TestFrameRecognizer.py (1022 of 2130)
PASS: lldb-api :: commands/expression/unicode-in-variable/TestUnicodeInVariable.py (1023 of 2130)
PASS: lldb-shell :: ObjectFile/PECOFF/basic-info-arm64.yaml (1024 of 2130)
PASS: lldb-shell :: SymbolFile/NativePDB/bitfields.cpp (1025 of 2130)
PASS: lldb-api :: lang/objc/global_ptrs/TestGlobalObjects.py (1026 of 2130)
PASS: lldb-unit :: Utility/./UtilityTests/ArgsTest.TestSingleQuotedArgWithSpace (1027 of 2130)
PASS: lldb-unit :: Utility/./UtilityTests/StringExtractorTest.GetHexU8_Exact_NoEof (1028 of 2130)
PASS: lldb-unit :: Utility/./UtilityTests/OptionsWithRawTest.LeadingSpaceArgs (1029 of 2130)
PASS: lldb-api :: commands/target/select/TestTargetSelect.py (1030 of 2130)
PASS: lldb-api :: lang/objc/objc-baseclass-sbtype/TestObjCBaseClassSBType.py (1031 of 2130)
UNSUPPORTED: lldb-api :: lang/objc/rdar-12408181/TestRdar12408181.py (1032 of 2130)
PASS: lldb-unit :: Process/minidump/./LLDBMinidumpTests/MinidumpParserTest.GetMemoryRegionInfoLinuxMaps (1033 of 2130)
PASS: lldb-unit :: Utility/./UtilityTests/StructuredDataTest.StringDump (1034 of 2130)
PASS: lldb-shell :: ObjectFile/ELF/many-sections.s (1035 of 2130)
PASS: lldb-shell :: SymbolFile/DWARF/debug_ranges_and_rnglists.test (1036 of 2130)
PASS: lldb-unit :: Symbol/./SymbolTests/PostfixExpression.ToDWARF (1037 of 2130)
PASS: lldb-shell :: Reproducer/TestDSYM.test (1038 of 2130)
PASS: lldb-unit :: Utility/./UtilityTests/FileSpecTest.GuessPathStyle (1039 of 2130)
PASS: lldb-api :: lang/cpp/global_variables/TestCPPGlobalVariables.py (1040 of 2130)
PASS: lldb-api :: lang/cpp/alignas_base_class/TestAlignAsBaseClass.py (1041 of 2130)
PASS: lldb-unit :: Utility/./UtilityTests/StringListTest.Clear (1042 of 2130)
PASS: lldb-unit :: Utility/./UtilityTests/ArgsTest.TestTrailingBackslash (1043 of 2130)
PASS: lldb-shell :: ObjectFile/Breakpad/sections.test (1044 of 2130)
PASS: lldb-unit :: Utility/./UtilityTests/StringLexerTest.PutBack (1045 of 2130)
PASS: lldb-unit :: Utility/./UtilityTests/StringListTest.Join (1046 of 2130)
PASS: lldb-api :: commands/target/stop-hook/disable/TestTargetStopHookDisable.py (1047 of 2130)
PASS: lldb-unit :: ObjectFile/Breakpad/./ObjectFileBreakpadTests/InfoRecord.parse (1048 of 2130)
PASS: lldb-shell :: Reproducer/TestHomeDir.test (1049 of 2130)
PASS: lldb-unit :: Utility/./UtilityTests/StreamTest.PutHex64ByteOrderLittle (1050 of 2130)
PASS: lldb-unit :: Utility/./UtilityTests/ConstStringTest.UpdateMangledCounterpart (1051 of 2130)
UNSUPPORTED: lldb-api :: tools/lldb-server/TestGdbRemoteAuxvSupport.py (1052 of 2130)
PASS: lldb-unit :: Utility/./UtilityTests/BinaryStreamTest.PutSLEB128NineBytes (1053 of 2130)
PASS: lldb-api :: python_api/thread/TestThreadAPI.py (1054 of 2130)
PASS: lldb-unit :: Utility/./UtilityTests/PassiveReplayTest.InstrumentedFooInvalid (1055 of 2130)
PASS: lldb-api :: functionalities/thread/concurrent_events/TestConcurrentTwoWatchpointThreads.py (1056 of 2130)
PASS: lldb-api :: lang/objc/self/TestObjCSelf.py (1057 of 2130)
PASS: lldb-unit :: Host/./HostTests/SocketTest.TCPListen0GetPort (1058 of 2130)
PASS: lldb-api :: functionalities/gdb_remote_client/TestRegDefinitionInParts.py (1059 of 2130)
PASS: lldb-api :: lang/objc/modules/TestObjCModules.py (1060 of 2130)
PASS: lldb-api :: functionalities/data-formatter/data-formatter-stl/libcxx/atomic/TestLibCxxAtomic.py (1061 of 2130)
PASS: lldb-api :: api/command-return-object/TestSBCommandReturnObject.py (1062 of 2130)
UNSUPPORTED: lldb-shell :: Register/arm-fp-read.test (1063 of 2130)
PASS: lldb-api :: lang/cpp/class_types/TestClassTypesDisassembly.py (1064 of 2130)
PASS: lldb-api :: lang/cpp/trivial_abi/TestTrivialABI.py (1065 of 2130)
PASS: lldb-api :: functionalities/postmortem/netbsd-core/TestNetBSDCore.py (1066 of 2130)
PASS: lldb-api :: commands/frame/diagnose/dereference-function-return/TestDiagnoseDereferenceFunctionReturn.py (1067 of 2130)
PASS: lldb-api :: functionalities/data-formatter/synthupdate/TestSyntheticFilterRecompute.py (1068 of 2130)
PASS: lldb-api :: lang/cpp/dynamic-value/TestCppValueCast.py (1069 of 2130)
PASS: lldb-shell :: ObjectFile/PECOFF/export-dllfunc.yaml (1070 of 2130)
PASS: lldb-api :: commands/expression/regression-access-function-template-in-record/TestRegressionAccessFunctionTemplateInRecord.py (1071 of 2130)
PASS: lldb-api :: lang/cpp/this_class_type_mixing/TestThisClassTypeMixing.py (1072 of 2130)
PASS: lldb-unit :: Utility/./UtilityTests/StringListTest.InsertStringAtIndexOutOfBounds (1073 of 2130)
PASS: lldb-api :: functionalities/data-formatter/data-formatter-ptr-to-array/TestPtrToArrayFormatting.py (1074 of 2130)
PASS: lldb-unit :: Platform/Android/./AdbClientTests/AdbClientTest.CreateByDeviceId (1075 of 2130)
PASS: lldb-api :: macosx/add-dsym/TestAddDsymMidExecutionCommand.py (1076 of 2130)
PASS: lldb-unit :: Utility/./UtilityTests/StringListTest.GetMaxStringLengthMixed (1077 of 2130)
PASS: lldb-api :: functionalities/thread/step_out/TestThreadStepOut.py (1078 of 2130)
PASS: lldb-api :: functionalities/data-formatter/data-formatter-stl/libcxx/iterator/TestDataFormatterLibccIterator.py (1079 of 2130)
PASS: lldb-unit :: Utility/./UtilityTests/UriParserTest.BracketedHostnameWithColon (1080 of 2130)
PASS: lldb-unit :: Process/gdb-remote/./ProcessGdbRemoteTests/GDBRemoteCommunicationClientTest.SendGetMetaDataPacket (1081 of 2130)
PASS: lldb-api :: functionalities/data-formatter/data-formatter-stl/libcxx/multimap/TestDataFormatterLibccMultiMap.py (1082 of 2130)
PASS: lldb-unit :: Utility/./UtilityTests/GeneratorTest.YamlMultiProvider (1083 of 2130)
PASS: lldb-shell :: SymbolFile/DWARF/find-variable-file.cpp (1084 of 2130)
PASS: lldb-unit :: Utility/./UtilityTests/RegularExpression.Empty (1085 of 2130)
PASS: lldb-unit :: Host/./HostTests/SocketTest.DecodeHostAndPort (1086 of 2130)
PASS: lldb-unit :: Utility/./UtilityTests/StringExtractorTest.GetHexBytesAvail_FullString (1087 of 2130)
PASS: lldb-api :: lang/cpp/virtual-overload/TestVirtualOverload.py (1088 of 2130)
PASS: lldb-api :: commands/process/launch-with-shellexpand/TestLaunchWithShellExpand.py (1089 of 2130)
PASS: lldb-unit :: Utility/./UtilityTests/StringExtractorTest.GetHexBytes (1090 of 2130)
PASS: lldb-api :: commands/platform/process/list/TestProcessList.py (1091 of 2130)
PASS: lldb-shell :: SymbolFile/DWARF/deterministic-build.cpp (1092 of 2130)
PASS: lldb-api :: functionalities/breakpoint/cpp_exception/TestCPPExceptionBreakpoint.py (1093 of 2130)
PASS: lldb-api :: lang/cpp/unicode-literals/TestUnicodeLiterals.py (1094 of 2130)
PASS: lldb-unit :: Utility/./UtilityTests/StringListTest.AppendListCStringArray (1095 of 2130)
PASS: lldb-unit :: UnwindAssembly/x86/./UnwindAssemblyx86Tests/Testx86AssemblyInspectionEngine.TestSimplex86_64Augmented (1096 of 2130)
UNSUPPORTED: lldb-api :: functionalities/data-formatter/data-formatter-stl/libstdcpp/list/TestDataFormatterStdList.py (1097 of 2130)
PASS: lldb-unit :: Process/minidump/./LLDBMinidumpTests/MinidumpParserTest.GetThreadContext_x86_64 (1098 of 2130)
PASS: lldb-unit :: Process/gdb-remote/./ProcessGdbRemoteTests/GDBRemoteCommunicationClientTest.SendGetDataPacket (1099 of 2130)
PASS: lldb-shell :: ObjectFile/ELF/PT_LOAD-empty.yaml (1100 of 2130)
PASS: lldb-unit :: Language/Highlighting/./HighlighterTests/HighlighterTest.ClangCursorOutOfBounds (1101 of 2130)
UNSUPPORTED: lldb-api :: benchmarks/frame_variable/TestFrameVariableResponse.py (1102 of 2130)
PASS: lldb-shell :: Settings/TestFrameFormatMangling.test (1103 of 2130)
PASS: lldb-api :: lang/cpp/template-specialization-type/TestTemplateSpecializationType.py (1104 of 2130)
XFAIL: lldb-shell :: Register/x86-mm-xmm-read.test (1105 of 2130)
PASS: lldb-api :: functionalities/thread/exit_during_break/TestExitDuringBreak.py (1106 of 2130)
PASS: lldb-api :: functionalities/param_entry_vals/basic_entry_values/TestBasicEntryValues.py (1107 of 2130)
PASS: lldb-api :: lang/cpp/thread_local/TestThreadLocal.py (1108 of 2130)
PASS: lldb-unit :: Utility/./UtilityTests/StringListTest.AppendStringCString (1109 of 2130)
PASS: lldb-api :: functionalities/signal/raise/TestRaise.py (1110 of 2130)
PASS: lldb-unit :: Utility/./UtilityTests/FileSpecTest.FileAndDirectoryComponents (1111 of 2130)
UNSUPPORTED: lldb-shell :: ScriptInterpreter/Lua/lua.test (1112 of 2130)
PASS: lldb-unit :: Process/gdb-remote/./ProcessGdbRemoteTests/GDBRemoteCommunicationClientTest.WriteRegister (1113 of 2130)
PASS: lldb-api :: commands/command/script/TestCommandScript.py (1114 of 2130)
PASS: lldb-shell :: SymbolFile/DWARF/find-basic-function.cpp (1115 of 2130)
PASS: lldb-api :: macosx/DBGSourcePathRemapping/TestDSYMSourcePathRemapping.py (1116 of 2130)
UNSUPPORTED: lldb-api :: tools/lldb-vscode/completions/TestVSCode_completions.py (1117 of 2130)
PASS: lldb-unit :: Symbol/./SymbolTests/DWARFCallFrameInfoTest.Basic_dwarf3 (1118 of 2130)
UNSUPPORTED: lldb-api :: functionalities/darwin_log/filter/regex/activity/TestDarwinLogFilterRegexActivity.py (1119 of 2130)
PASS: lldb-unit :: UnwindAssembly/ARM64/./Arm64InstEmulationTests/TestArm64InstEmulation.TestRegisterSavedTwice (1120 of 2130)
PASS: lldb-shell :: SymbolFile/Breakpad/symtab-macho.test (1121 of 2130)
UNSUPPORTED: lldb-api :: functionalities/data-formatter/data-formatter-stl/libstdcpp/vbool/TestDataFormatterStdVBool.py (1122 of 2130)
UNSUPPORTED: lldb-api :: benchmarks/libcxxlist/TestBenchmarkLibcxxList.py (1123 of 2130)
PASS: lldb-unit :: Utility/./UtilityTests/StringListTest.SplitIntoLinesEmpty (1124 of 2130)
UNSUPPORTED: lldb-api :: functionalities/darwin_log/filter/exact_match/message/TestDarwinLogFilterMatchMessage.py (1125 of 2130)
PASS: lldb-unit :: Host/./HostTests/MainLoopTest.ReadObject (1126 of 2130)
PASS: lldb-api :: functionalities/breakpoint/comp_dir_symlink/TestCompDirSymLink.py (1127 of 2130)
PASS: lldb-api :: functionalities/postmortem/minidump-new/TestMiniDumpUUID.py (1128 of 2130)
PASS: lldb-shell :: SymbolFile/Breakpad/stack-cfi-parsing.test (1129 of 2130)
PASS: lldb-unit :: Utility/./UtilityTests/StreamTest.SetIndentLevel (1130 of 2130)
UNSUPPORTED: lldb-api :: commands/register/register/intel_xtended_registers/mpx_offset_intersection/TestMPXOffsetIntersection.py (1131 of 2130)
PASS: lldb-api :: functionalities/data-formatter/var-in-aggregate-misuse/TestVarInAggregateMisuse.py (1132 of 2130)
PASS: lldb-api :: types/TestDoubleTypesExpr.py (1133 of 2130)
PASS: lldb-unit :: Utility/./UtilityTests/StringExtractorTest.GetHexBytes_OddPair (1134 of 2130)
PASS: lldb-unit :: Process/minidump/./LLDBMinidumpTests/MinidumpParserTest.GetMemoryRegionInfoFromMemoryList (1135 of 2130)
PASS: lldb-shell :: Settings/TestFrameFormatColor.test (1136 of 2130)
PASS: lldb-unit :: Expression/./ExpressionTests/ClangHostTest.MacOSX (1137 of 2130)
PASS: lldb-unit :: Utility/./UtilityTests/StringListTest.ShiftStdString (1138 of 2130)
PASS: lldb-shell :: Reproducer/TestFileRepro.test (1139 of 2130)
PASS: lldb-unit :: UnwindAssembly/x86/./UnwindAssemblyx86Tests/Testx86AssemblyInspectionEngine.TestPushR13 (1140 of 2130)
UNSUPPORTED: lldb-shell :: SymbolFile/PDB/vbases.test (1141 of 2130)
PASS: lldb-unit :: Process/gdb-remote/./ProcessGdbRemoteTests/GDBRemoteCommunicationClientTest.GetModulesInfo (1142 of 2130)
PASS: lldb-unit :: UnwindAssembly/x86/./UnwindAssemblyx86Tests/Testx86AssemblyInspectionEngine.TestPopESI (1143 of 2130)
PASS: lldb-api :: lang/cpp/diamond/TestDiamond.py (1144 of 2130)
PASS: lldb-api :: commands/expression/class_template_specialization_empty_pack/TestClassTemplateSpecializationParametersHandling.py (1145 of 2130)
UNSUPPORTED: lldb-api :: functionalities/data-formatter/data-formatter-stl/libstdcpp/unique_ptr/TestDataFormatterStdUniquePtr.py (1146 of 2130)
PASS: lldb-unit :: Interpreter/./InterpreterTests/OptionArgParserTest.toChar (1147 of 2130)
PASS: lldb-api :: functionalities/thread/concurrent_events/TestConcurrentCrashWithBreak.py (1148 of 2130)
PASS: lldb-unit :: UnwindAssembly/x86/./UnwindAssemblyx86Tests/Testx86AssemblyInspectionEngine.TestPushR12 (1149 of 2130)
PASS: lldb-unit :: SymbolFile/DWARF/./SymbolFileDWARFTests/SymbolFileDWARFTests.TestAbbrevValidAttrNullForm (1150 of 2130)
PASS: lldb-api :: commands/expression/call-throws/TestCallThatThrows.py (1151 of 2130)
PASS: lldb-api :: python_api/type/TestTypeList.py (1152 of 2130)
PASS: lldb-unit :: UnwindAssembly/x86/./UnwindAssemblyx86Tests/Testx86AssemblyInspectionEngine.Test64bitFramelessBigStackFrame (1153 of 2130)
PASS: lldb-api :: macosx/find-dsym/deep-bundle/TestDeepBundle.py (1154 of 2130)
PASS: lldb-unit :: Symbol/./SymbolTests/LineEntryTest.GetSameLineContiguousAddressRangeNoInlines (1155 of 2130)
PASS: lldb-shell :: Reproducer/TestProcessList.test (1156 of 2130)
UNSUPPORTED: lldb-shell :: SymbolFile/PDB/variables-locations.test (1157 of 2130)
XFAIL: lldb-shell :: Register/x86-64-ymm-write.test (1158 of 2130)
PASS: lldb-shell :: Driver/TestRepl.test (1159 of 2130)
PASS: lldb-shell :: ExecControl/StopHook/stop-hook.test (1160 of 2130)
PASS: lldb-api :: functionalities/postmortem/minidump-new/TestMiniDumpNew.py (1161 of 2130)
PASS: lldb-shell :: SymbolFile/DWARF/DW_OP_piece-struct.s (1162 of 2130)
PASS: lldb-api :: lang/objc/bitfield_ivars/TestBitfieldIvars.py (1163 of 2130)
PASS: lldb-api :: macosx/order/TestOrderFile.py (1164 of 2130)
PASS: lldb-shell :: Breakpoint/split-dwarf-5-addrbase.test (1165 of 2130)
PASS: lldb-unit :: Symbol/./SymbolTests/TestTypeSystemClang.TestOwningModule (1166 of 2130)
PASS: lldb-unit :: Process/minidump/./LLDBMinidumpTests/MinidumpParserTest.GetLinuxProcStatus_no_stream (1167 of 2130)
PASS: lldb-api :: python_api/name_lookup/TestNameLookup.py (1168 of 2130)
PASS: lldb-api :: lang/objc/objc-property/TestObjCProperty.py (1169 of 2130)
PASS: lldb-shell :: Minidump/disassemble-no-module.yaml (1170 of 2130)
PASS: lldb-unit :: SymbolFile/DWARF/./SymbolFileDWARFTests/SymbolFileDWARFTests.TestAbbrevInvalidNULLTag (1171 of 2130)
PASS: lldb-api :: python_api/value/change_values/TestChangeValueAPI.py (1172 of 2130)
PASS: lldb-unit :: UnwindAssembly/x86/./UnwindAssemblyx86Tests/Testx86AssemblyInspectionEngine.TestPopRBP (1173 of 2130)
PASS: lldb-shell :: SymbolFile/DWARF/debug_loc-aslr.s (1174 of 2130)
PASS: lldb-shell :: Quit/TestQuitExitCode0.test (1175 of 2130)
PASS: lldb-api :: functionalities/data-formatter/frameformat_smallstruct/TestFrameFormatSmallStruct.py (1176 of 2130)
PASS: lldb-unit :: Symbol/./SymbolTests/DWARFCallFrameInfoTest.Basic_eh (1177 of 2130)
PASS: lldb-unit :: Symbol/./SymbolTests/TestTypeSystemClang.TestConvertAccessTypeToAccessSpecifier (1178 of 2130)
PASS: lldb-unit :: Symbol/./SymbolTests/TestTypeSystemClang.TestFunctionTemplateInRecordConstruction (1179 of 2130)
PASS: lldb-unit :: Process/minidump/./LLDBMinidumpTests/MinidumpParserTest.MinidumpModuleOrder (1180 of 2130)
PASS: lldb-api :: functionalities/data-formatter/data-formatter-globals/TestDataFormatterGlobals.py (1181 of 2130)
PASS: lldb-unit :: Utility/./UtilityTests/DataExtractorTest.GetDoubleUnaligned (1182 of 2130)
PASS: lldb-api :: tools/lldb-vscode/module/TestVSCode_module.py (1183 of 2130)
PASS: lldb-unit :: Utility/./UtilityTests/ArgsTest.ReplaceArgumentAtIndexFarOutOfRange (1184 of 2130)
PASS: lldb-unit :: UnwindAssembly/x86/./UnwindAssemblyx86Tests/Testx86AssemblyInspectionEngine.TestPopR15 (1185 of 2130)
PASS: lldb-unit :: Utility/./UtilityTests/StringLexerTest.AdvanceIf (1186 of 2130)
PASS: lldb-unit :: Utility/./UtilityTests/StreamTest.PutRawBytesToBigEndian (1187 of 2130)
UNSUPPORTED: lldb-shell :: SymbolFile/PDB/class-layout.test (1188 of 2130)
PASS: lldb-api :: lang/objc/real-definition/TestRealDefinition.py (1189 of 2130)
PASS: lldb-api :: commands/expression/import_base_class_when_class_has_derived_member/TestImportBaseClassWhenClassHasDerivedMember.py (1190 of 2130)
PASS: lldb-unit :: Symbol/./SymbolTests/TestClangASTImporter.MetadataPropagationAfterCopying (1191 of 2130)
PASS: lldb-api :: lang/objc/foundation/TestObjCMethodsString.py (1192 of 2130)
PASS: lldb-unit :: Utility/./UtilityTests/AnsiTerminal.Empty (1193 of 2130)
PASS: lldb-shell :: SymbolFile/DWARF/childless-compile-unit.s (1194 of 2130)
PASS: lldb-shell :: Minidump/Windows/arm-fp-unwind.test (1195 of 2130)
PASS: lldb-unit :: Symbol/./SymbolTests/TestTypeSystemClang.TestGetEnumIntegerTypeUnexpectedType (1196 of 2130)
PASS: lldb-api :: functionalities/data-formatter/nsdictionarysynth/TestNSDictionarySynthetic.py (1197 of 2130)
PASS: lldb-api :: commands/target/dump-symtab-demangle/TestDumpSymtabDemangle.py (1198 of 2130)
PASS: lldb-unit :: Utility/./UtilityTests/NameMatchesTest.Contains (1199 of 2130)
PASS: lldb-shell :: ObjectFile/Breakpad/breakpad-identification.test (1200 of 2130)
PASS: lldb-unit :: Utility/./UtilityTests/PassiveReplayTest.InstrumentedBar (1201 of 2130)
PASS: lldb-shell :: SymbolFile/DWARF/debug_rnglists.s (1202 of 2130)
PASS: lldb-unit :: Utility/./UtilityTests/UriParserTest.BracketedHostnameWithPortIPv6 (1203 of 2130)
PASS: lldb-unit :: Host/./HostTests/ConnectionFileDescriptorTest.TCPGetURIv6 (1204 of 2130)
PASS: lldb-api :: functionalities/asan/TestMemoryHistory.py (1205 of 2130)
PASS: lldb-unit :: Utility/./UtilityTests/StringExtractorTest.GetHexU8_Exact (1206 of 2130)
UNSUPPORTED: lldb-shell :: ScriptInterpreter/Lua/watchpoint_callback.test (1207 of 2130)
PASS: lldb-api :: commands/expression/dollar-in-variable/TestDollarInVariable.py (1208 of 2130)
PASS: lldb-unit :: Utility/./UtilityTests/RangeVector.CombineConsecutiveRanges (1209 of 2130)
PASS: lldb-api :: functionalities/postmortem/mach-core/TestMachCore.py (1210 of 2130)
PASS: lldb-api :: functionalities/deleted-executable/TestDeletedExecutable.py (1211 of 2130)
PASS: lldb-api :: functionalities/postmortem/elf-core/gcore/TestGCore.py (1212 of 2130)
PASS: lldb-api :: functionalities/abbreviation/TestCommonShortSpellings.py (1213 of 2130)
PASS: lldb-unit :: Utility/./UtilityTests/RecordReplayTest.InstrumentedBarPtr (1214 of 2130)
PASS: lldb-unit :: Process/gdb-remote/./ProcessGdbRemoteTests/GDBRemoteClientBaseTest.SendContinueDelegateInterface (1215 of 2130)
PASS: lldb-api :: functionalities/thread/backtrace_limit/TestBacktraceLimit.py (1216 of 2130)
PASS: lldb-unit :: ScriptInterpreter/Python/./ScriptInterpreterPythonTests/PythonDataObjectsTest.TestPythonTupleInitializerList2 (1217 of 2130)
PASS: lldb-unit :: Host/./HostTests/FileSystemTest.FileAndDirectoryComponents (1218 of 2130)
PASS: lldb-api :: functionalities/jitloader_gdb/TestJITLoaderGDB.py (1219 of 2130)
PASS: lldb-api :: lang/c/blocks/TestBlocks.py (1220 of 2130)
PASS: lldb-api :: functionalities/data-formatter/data-formatter-objc/cmtime/TestDataFormatterCMTime.py (1221 of 2130)
PASS: lldb-unit :: Utility/./UtilityTests/StringExtractorTest.GetHexU8_Extra_NoEof (1222 of 2130)
PASS: lldb-unit :: Utility/./UtilityTests/StreamTest.PutRawBytesToMixedEndian (1223 of 2130)
PASS: lldb-unit :: Process/gdb-remote/./ProcessGdbRemoteTests/GDBRemoteCommunicationClientTest.SendSignalsToIgnore (1224 of 2130)
PASS: lldb-shell :: SymbolFile/Breakpad/line-table-mixed-path-styles.test (1225 of 2130)
PASS: lldb-api :: functionalities/thread/concurrent_events/TestConcurrentTwoBreakpointsOneSignal.py (1226 of 2130)
PASS: lldb-api :: functionalities/tail_call_frames/unambiguous_sequence/TestUnambiguousTailCalls.py (1227 of 2130)
PASS: lldb-api :: functionalities/unwind/sigtramp/TestSigtrampUnwind.py (1228 of 2130)
PASS: lldb-unit :: Utility/./UtilityTests/RangeTest.LessThanInvalid (1229 of 2130)
PASS: lldb-api :: functionalities/data-formatter/data-formatter-stl/libcxx/forward_list/TestDataFormatterLibcxxForwardList.py (1230 of 2130)
PASS: lldb-unit :: Host/./HostTests/NativeProcessProtocolTest.ReadMemoryWithoutTrap (1231 of 2130)
PASS: lldb-unit :: Utility/./UtilityTests/ProcessInstanceInfoMatch.Name (1232 of 2130)
PASS: lldb-unit :: Utility/./UtilityTests/LogTest.LLDB_LOG_nullptr (1233 of 2130)
PASS: lldb-api :: commands/expression/persistent_variables/TestPersistentVariables.py (1234 of 2130)
PASS: lldb-api :: functionalities/breakpoint/breakpoint_conditions/TestBreakpointConditions.py (1235 of 2130)
PASS: lldb-unit :: Utility/./UtilityTests/StreamTest.PutBytesAsRawHex8ToLittleEndian (1236 of 2130)
UNSUPPORTED: lldb-shell :: Register/x86-gp-read.test (1237 of 2130)
PASS: lldb-api :: functionalities/data-formatter/poarray/TestPrintObjectArray.py (1238 of 2130)
PASS: lldb-api :: functionalities/breakpoint/breakpoint_by_file_colon_line/TestBreakpointByFileColonLine.py (1239 of 2130)
PASS: lldb-api :: functionalities/thread/concurrent_events/TestConcurrentDelayedCrashWithBreakpointWatchpoint.py (1240 of 2130)
PASS: lldb-unit :: Language/Highlighting/./HighlighterTests/HighlighterTest.ClangCommas (1241 of 2130)
PASS: lldb-unit :: Core/./LLDBCoreTests/ModuleSpecTest.InvalidInMemoryBuffer (1242 of 2130)
PASS: lldb-api :: functionalities/thread/create_after_attach/TestCreateAfterAttach.py (1243 of 2130)
PASS: lldb-unit :: Language/Highlighting/./HighlighterTests/HighlighterTest.DefaultHighlighter (1244 of 2130)
PASS: lldb-unit :: Utility/./UtilityTests/VMRange.SetEndAddress (1245 of 2130)
UNSUPPORTED: lldb-shell :: Register/arm-gp-read.test (1246 of 2130)
PASS: lldb-unit :: Utility/./UtilityTests/TimerTest.CategoryTimesNested (1247 of 2130)
PASS: lldb-api :: commands/expression/radar_8638051/Test8638051.py (1248 of 2130)
PASS: lldb-unit :: Utility/./UtilityTests/BinaryStreamTest.PutSLEB128SixBytes (1249 of 2130)
PASS: lldb-api :: functionalities/target_var/TestTargetVar.py (1250 of 2130)
PASS: lldb-unit :: Utility/./UtilityTests/ArchSpecTest.TestParseMachCPUDashSubtypeTripleSimple (1251 of 2130)
PASS: lldb-unit :: Utility/./UtilityTests/ScalarTest.LongLongAssigmentOperator (1252 of 2130)
PASS: lldb-unit :: Platform/Android/./AdbClientTests/AdbClientTest.CreateByDeviceId_ByEnvVar (1253 of 2130)
PASS: lldb-unit :: Symbol/./SymbolTests/TestTypeSystemClang.TestDeletingImplicitCopyCstrDueToMoveCStr (1254 of 2130)
PASS: lldb-unit :: Utility/./UtilityTests/Flags.AllClear (1255 of 2130)
PASS: lldb-api :: commands/expression/import-std-module/weak_ptr-dbg-info-content/TestDbgInfoContentWeakPtrFromStdModule.py (1256 of 2130)
PASS: lldb-unit :: Utility/./UtilityTests/VMRange.Clear (1257 of 2130)
PASS: lldb-api :: lang/c/function_types/TestFunctionTypes.py (1258 of 2130)
PASS: lldb-unit :: Utility/./UtilityTests/FileSpecTest.RemoveLastPathComponent (1259 of 2130)
PASS: lldb-api :: lang/c/local_types/TestUseClosestType.py (1260 of 2130)
PASS: lldb-unit :: Utility/./UtilityTests/StringExtractorTest.GetHexBytes_OddPair2 (1261 of 2130)
PASS: lldb-api :: functionalities/tail_call_frames/disambiguate_tail_call_seq/TestDisambiguateTailCallSeq.py (1262 of 2130)
PASS: lldb-api :: functionalities/thread/concurrent_events/TestConcurrentSignalDelayBreak.py (1263 of 2130)
PASS: lldb-unit :: Utility/./UtilityTests/TimerTest.CategoryTimes2 (1264 of 2130)
PASS: lldb-unit :: Language/Highlighting/./HighlighterTests/HighlighterTest.ClangTrailingBackslashBeforeNewline (1265 of 2130)
UNSUPPORTED: lldb-api :: macosx/macCatalystAppMacOSFramework/TestMacCatalystAppWithMacOSFramework.py (1266 of 2130)
UNSUPPORTED: lldb-api :: functionalities/data-formatter/data-formatter-stl/libstdcpp/map/TestDataFormatterStdMap.py (1267 of 2130)
PASS: lldb-api :: functionalities/backticks/TestBackticksWithoutATarget.py (1268 of 2130)
PASS: lldb-api :: functionalities/data-formatter/data-formatter-advanced/TestDataFormatterAdv.py (1269 of 2130)
PASS: lldb-unit :: Utility/./UtilityTests/ScalarTest.SetValueFromCString (1270 of 2130)
PASS: lldb-unit :: Utility/./UtilityTests/ProcessInstanceInfoList.Yaml (1271 of 2130)
PASS: lldb-api :: lang/cpp/global_operators/TestCppGlobalOperators.py (1272 of 2130)
PASS: lldb-unit :: Utility/./UtilityTests/ArchSpecTest.MergeFrom (1273 of 2130)
PASS: lldb-api :: functionalities/thread/concurrent_events/TestConcurrentWatchBreakDelay.py (1274 of 2130)
PASS: lldb-unit :: Utility/./UtilityTests/UUIDTest.SetFromStringRef (1275 of 2130)
PASS: lldb-api :: commands/expression/import-std-module/list-dbg-info-content/TestDbgInfoContentListFromStdModule.py (1276 of 2130)
PASS: lldb-api :: functionalities/data-formatter/stringprinter/TestStringPrinter.py (1277 of 2130)
PASS: lldb-unit :: DataFormatter/./LLDBFormatterTests/TypeMatcherTests.GetMatchStringExactName (1278 of 2130)
PASS: lldb-api :: commands/expression/argument_passing_restrictions/TestArgumentPassingRestrictions.py (1279 of 2130)
PASS: lldb-unit :: Utility/./UtilityTests/RecordReplayTest.InstrumentedBar (1280 of 2130)
UNSUPPORTED: lldb-api :: benchmarks/expression/TestExpressionCmd.py (1281 of 2130)
PASS: lldb-api :: commands/expression/completion-crash-incomplete-record/TestCompletionCrashIncompleteRecord.py (1282 of 2130)
PASS: lldb-unit :: Expression/./ExpressionTests/DiagnosticManagerTest.FixedExpression (1283 of 2130)
PASS: lldb-api :: commands/apropos/basic/TestApropos.py (1284 of 2130)
PASS: lldb-api :: functionalities/thread/concurrent_events/TestConcurrentNWatchNBreak.py (1285 of 2130)
PASS: lldb-api :: functionalities/thread/thread_specific_break/TestThreadSpecificBreakpoint.py (1286 of 2130)
PASS: lldb-api :: functionalities/set-data/TestSetData.py (1287 of 2130)
PASS: lldb-unit :: UnwindAssembly/x86/./UnwindAssemblyx86Tests/Testx86AssemblyInspectionEngine.TestPushEBX (1288 of 2130)
PASS: lldb-unit :: Utility/./UtilityTests/StringListTest.JoinEmpty (1289 of 2130)
PASS: lldb-unit :: Utility/./UtilityTests/NameMatchesTest.StartsWith (1290 of 2130)
PASS: lldb-api :: python_api/watchpoint/TestWatchpointIgnoreCount.py (1291 of 2130)
PASS: lldb-api :: functionalities/data-formatter/dump_dynamic/TestDumpDynamic.py (1292 of 2130)
PASS: lldb-shell :: Quit/TestQuitExitCode-30.test (1293 of 2130)
UNSUPPORTED: lldb-shell :: ScriptInterpreter/Lua/quit.test (1294 of 2130)
PASS: lldb-api :: commands/expression/test/TestExprs.py (1295 of 2130)
PASS: lldb-unit :: DataFormatter/./LLDBFormatterTests/TypeMatcherTests.RegexName (1296 of 2130)
PASS: lldb-api :: commands/add-dsym/uuid/TestAddDsymCommand.py (1297 of 2130)
PASS: lldb-unit :: debugserver/./debugserverTests/RNBSocket.AnyListen (1298 of 2130)
PASS: lldb-unit :: Utility/./UtilityTests/OptionsWithRawTest.QuotedSuffix (1299 of 2130)
PASS: lldb-unit :: UnwindAssembly/x86/./UnwindAssemblyx86Tests/Testx86AssemblyInspectionEngine.TestPushR14 (1300 of 2130)
PASS: lldb-api :: lang/objc/objc-ivar-stripped/TestObjCIvarStripped.py (1301 of 2130)
UNSUPPORTED: lldb-api :: benchmarks/libcxxmap/TestBenchmarkLibcxxMap.py (1302 of 2130)
PASS: lldb-api :: iohandler/resize/TestIOHandlerResizeNoEditline.py (1303 of 2130)
UNSUPPORTED: lldb-shell :: ObjectFile/ELF/minidebuginfo-set-and-hit-breakpoint.test (1304 of 2130)
PASS: lldb-api :: commands/target/create-no-such-arch/TestNoSuchArch.py (1305 of 2130)
PASS: lldb-api :: functionalities/inferior-crashing/recursive-inferior/TestRecursiveInferior.py (1306 of 2130)
PASS: lldb-shell :: SymbolFile/NativePDB/break-by-function.cpp (1307 of 2130)
PASS: lldb-shell :: SymbolFile/DWARF/limit-debug-info.s (1308 of 2130)
PASS: lldb-unit :: Utility/./UtilityTests/Predicate.WaitForValueNotEqualTo (1309 of 2130)
PASS: lldb-unit :: Process/gdb-remote/./ProcessGdbRemoteTests/GDBRemoteCommunicationServerTest.SendErrorResponse_ErrorList (1310 of 2130)
PASS: lldb-unit :: Utility/./UtilityTests/OptionsWithRawTest.WhitespaceSuffix (1311 of 2130)
PASS: lldb-api :: functionalities/breakpoint/breakpoint_by_line_and_column/TestBreakpointByLineAndColumn.py (1312 of 2130)
PASS: lldb-unit :: UnwindAssembly/x86/./UnwindAssemblyx86Tests/Testx86AssemblyInspectionEngine.TestPushECX (1313 of 2130)
PASS: lldb-api :: functionalities/multiword-commands/TestMultiWordCommands.py (1314 of 2130)
PASS: lldb-shell :: Commands/command-regex-unalias.test (1315 of 2130)
PASS: lldb-api :: lang/objc/blocks/TestObjCIvarsInBlocks.py (1316 of 2130)
PASS: lldb-api :: tools/lldb-server/TestGdbRemoteProcessInfo.py (1317 of 2130)
PASS: lldb-api :: commands/breakpoint/set/func-regex/TestBreakpointRegexError.py (1318 of 2130)
PASS: lldb-shell :: Breakpoint/debug_addrx.test (1319 of 2130)
PASS: lldb-shell :: SymbolFile/Breakpad/line-table-discontinuous-file-ids.test (1320 of 2130)
UNSUPPORTED: lldb-shell :: SymbolFile/PDB/type-quals.test (1321 of 2130)
PASS: lldb-unit :: DataFormatter/./LLDBFormatterTests/StringPrinterTests.SwiftUTF8 (1322 of 2130)
PASS: lldb-shell :: SymbolFile/DWARF/debug_loc_and_loclists.s (1323 of 2130)
PASS: lldb-shell :: Reproducer/TestDebugSymbols.test (1324 of 2130)
PASS: lldb-shell :: SymbolFile/DWARF/debug_line-tombstone.s (1325 of 2130)
PASS: lldb-unit :: UnwindAssembly/x86/./UnwindAssemblyx86Tests/Testx86AssemblyInspectionEngine.TestPopEDI (1326 of 2130)
PASS: lldb-unit :: Utility/./UtilityTests/SerializationRountripTest.SerializeDeserializeObjectPointer (1327 of 2130)
PASS: lldb-unit :: Utility/./UtilityTests/FileSpecTest.IsRelative (1328 of 2130)
PASS: lldb-shell :: Commands/command-breakpoint-col.test (1329 of 2130)
PASS: lldb-unit :: Utility/./UtilityTests/CompletionRequest.TryCompleteCurrentArgGood (1330 of 2130)
PASS: lldb-api :: api/listeners/TestListener.py (1331 of 2130)
PASS: lldb-shell :: ObjectFile/PECOFF/basic-info.yaml (1332 of 2130)
XFAIL: lldb-shell :: Register/x86-64-write.test (1333 of 2130)
PASS: lldb-api :: lang/objc/foundation/TestFoundationDisassembly.py (1334 of 2130)
PASS: lldb-api :: lang/objc/objc-new-syntax/TestObjCNewSyntaxArray.py (1335 of 2130)
PASS: lldb-api :: functionalities/breakpoint/consecutive_breakpoints/TestConsecutiveBreakpoints.py (1336 of 2130)
PASS: lldb-api :: commands/expression/import-std-module/vector-dbg-info-content/TestDbgInfoContentVectorFromStdModule.py (1337 of 2130)
PASS: lldb-unit :: Utility/./UtilityTests/StringListTest.GetMaxStringLengthDecreasingSize (1338 of 2130)
PASS: lldb-unit :: Utility/./UtilityTests/Flags.GetBitSize (1339 of 2130)
PASS: lldb-shell :: SymbolFile/DWARF/dwarf5-partial-index.cpp (1340 of 2130)
PASS: lldb-api :: functionalities/breakpoint/breakpoint_language/TestBreakpointLanguage.py (1341 of 2130)
PASS: lldb-api :: lang/cpp/operators/TestCppOperators.py (1342 of 2130)
PASS: lldb-unit :: Utility/./UtilityTests/RangeTest.NotEqualInvalid (1343 of 2130)
PASS: lldb-unit :: Host/./HostTests/HostInfoTest.GetHostname (1344 of 2130)
PASS: lldb-shell :: SymbolFile/DWARF/find-qualified-variable.cpp (1345 of 2130)
PASS: lldb-shell :: Minidump/memory-region-from-module.yaml (1346 of 2130)
UNSUPPORTED: lldb-shell :: Register/x86-64-xmm16-write.test (1347 of 2130)
UNSUPPORTED: lldb-api :: functionalities/thread/concurrent_events/TestConcurrentManySignals.py (1348 of 2130)
PASS: lldb-api :: python_api/section/TestSectionAPI.py (1349 of 2130)
PASS: lldb-unit :: Expression/./ExpressionTests/CppModuleConfigurationTest.AmbiguousCLib (1350 of 2130)
PASS: lldb-unit :: Utility/./UtilityTests/UUIDTest.StringConverion (1351 of 2130)
PASS: lldb-api :: functionalities/thread/exit_during_step/TestExitDuringStep.py (1352 of 2130)
PASS: lldb-unit :: ScriptInterpreter/Python/./ScriptInterpreterPythonTests/PythonDataObjectsTest.TestPythonBytes (1353 of 2130)
PASS: lldb-shell :: SymbolFile/NativePDB/source-list.cpp (1354 of 2130)
PASS: lldb-unit :: Utility/./UtilityTests/StringExtractorTest.GetHexU8_InvalidHex_NoEof (1355 of 2130)
PASS: lldb-api :: tools/lldb-vscode/launch/TestVSCode_launch.py (1356 of 2130)
PASS: lldb-unit :: ObjectFile/Breakpad/./ObjectFileBreakpadTests/FileRecord.parse (1357 of 2130)
PASS: lldb-api :: functionalities/recursion/TestValueObjectRecursion.py (1358 of 2130)
PASS: lldb-api :: commands/expression/weak_symbols/TestWeakSymbols.py (1359 of 2130)
PASS: lldb-unit :: Core/./LLDBCoreTests/UniqueCStringMap.NoDefaultConstructor (1360 of 2130)
PASS: lldb-unit :: SymbolFile/DWARF/./SymbolFileDWARFTests/SymbolFileDWARFTests.TestAbbrevOrder1Start1 (1361 of 2130)
PASS: lldb-unit :: Core/./LLDBCoreTests/StreamCallbackTest.Callback (1362 of 2130)
PASS: lldb-api :: lang/objc/modules-auto-import/TestModulesAutoImport.py (1363 of 2130)
PASS: lldb-api :: functionalities/gdb_remote_client/TestPlatformClient.py (1364 of 2130)
PASS: lldb-unit :: Interpreter/./InterpreterTests/CompletionTest.DirCompletionAbsolute (1365 of 2130)
PASS: lldb-unit :: Utility/./UtilityTests/ScalarTest.ComparisonFloat (1366 of 2130)
PASS: lldb-api :: types/TestLongTypesExpr.py (1367 of 2130)
PASS: lldb-unit :: Utility/./UtilityTests/ScalarTest.ExtractBitfield (1368 of 2130)
PASS: lldb-api :: commands/expression/issue_11588/Test11588.py (1369 of 2130)
PASS: lldb-unit :: UnwindAssembly/x86/./UnwindAssemblyx86Tests/Testx86AssemblyInspectionEngine.TestCALLNextInsn (1370 of 2130)
PASS: lldb-unit :: Utility/./UtilityTests/OptionsWithRawTest.EmptyArgsOnlySuffix (1371 of 2130)
PASS: lldb-shell :: SymbolFile/DWARF/DW_TAG_variable-invalid_location.s (1372 of 2130)
PASS: lldb-unit :: UnwindAssembly/x86/./UnwindAssemblyx86Tests/Testx86AssemblyInspectionEngine.TestAddRSP (1373 of 2130)
PASS: lldb-unit :: ObjectFile/ELF/./ObjectFileELFTests/ObjectFileELFTest.SectionsResolveConsistently (1374 of 2130)
PASS: lldb-unit :: Utility/./UtilityTests/RecordReplayTest.InstrumentedBarRef (1375 of 2130)
PASS: lldb-api :: api/multiple-debuggers/TestMultipleDebuggers.py (1376 of 2130)
PASS: lldb-unit :: Core/./LLDBCoreTests/CommunicationTest.SynchronizeWhileClosing (1377 of 2130)
PASS: lldb-unit :: Language/Highlighting/./HighlighterTests/HighlighterTest.ClangTrailingBackslashWithWhitespace (1378 of 2130)
PASS: lldb-unit :: Utility/./UtilityTests/StringExtractorTest.GetHexU8_Underflow_NoEof (1379 of 2130)
PASS: lldb-unit :: Utility/./UtilityTests/UserIDResolver.GetUserName (1380 of 2130)
PASS: lldb-unit :: Symbol/./SymbolTests/TestClangASTImporter.DeportTypeTagDecl (1381 of 2130)
PASS: lldb-api :: commands/watchpoints/watchpoint_size/TestWatchpointSizes.py (1382 of 2130)
PASS: lldb-shell :: Process/TestEnvironment.test (1383 of 2130)
PASS: lldb-unit :: Expression/./ExpressionTests/ClangHostTest.ComputeClangResourceDirectory (1384 of 2130)
PASS: lldb-unit :: ScriptInterpreter/Python/./ScriptInterpreterPythonTests/PythonDataObjectsTest.TestPythonIntegerToStr (1385 of 2130)
PASS: lldb-unit :: Expression/./ExpressionTests/DiagnosticManagerTest.GetStringBasic (1386 of 2130)
PASS: lldb-api :: functionalities/history/TestHistoryRecall.py (1387 of 2130)
PASS: lldb-unit :: UnwindAssembly/x86/./UnwindAssemblyx86Tests/Testx86AssemblyInspectionEngine.TestPushImm (1388 of 2130)
UNSUPPORTED: lldb-shell :: ScriptInterpreter/Lua/breakpoint_callback.test (1389 of 2130)
PASS: lldb-unit :: Utility/./UtilityTests/StringExtractorTest.GetHexBytes_Partial (1390 of 2130)
PASS: lldb-api :: lang/cpp/accelerator-table/TestCPPAccelerator.py (1391 of 2130)
PASS: lldb-api :: lang/cpp/class_types/TestClassTypes.py (1392 of 2130)
PASS: lldb-shell :: SymbolFile/DWARF/dwarf5-debug_line.s (1393 of 2130)
UNSUPPORTED: lldb-api :: functionalities/darwin_log/filter/regex/message/TestDarwinLogFilterRegexMessage.py (1394 of 2130)
PASS: lldb-api :: commands/expression/options/TestExprOptions.py (1395 of 2130)
PASS: lldb-shell :: Reproducer/TestReuseDirectory.test (1396 of 2130)
PASS: lldb-unit :: Utility/./UtilityTests/FileSpecTest.PrependPathComponent (1397 of 2130)
PASS: lldb-api :: tools/lldb-server/TestAppleSimulatorOSType.py (1398 of 2130)
UNSUPPORTED: lldb-shell :: SymbolFile/NativePDB/ast-functions-msvc.cpp (1399 of 2130)
UNSUPPORTED: lldb-api :: functionalities/data-formatter/data-formatter-stl/libstdcpp/smart_ptr/TestDataFormatterStdSmartPtr.py (1400 of 2130)
PASS: lldb-shell :: ObjectFile/PECOFF/basic-info-arm.yaml (1401 of 2130)
PASS: lldb-unit :: Utility/./UtilityTests/ArgsTest.ReplaceArgumentAtIndexOutOfRange (1402 of 2130)
PASS: lldb-api :: python_api/sbtype_typeclass/TestSBTypeTypeClass.py (1403 of 2130)
PASS: lldb-shell :: Minidump/memory-region.yaml (1404 of 2130)
PASS: lldb-unit :: Utility/./UtilityTests/StringListTest.GetMaxStringLengthEmpty (1405 of 2130)
PASS: lldb-shell :: Reproducer/Modules/TestModuleCXX.test (1406 of 2130)
PASS: lldb-api :: lang/objc/objc-foundation-dictionary-empty/TestNSDictionary0.py (1407 of 2130)
PASS: lldb-unit :: Utility/./UtilityTests/CompletionRequest.Constructor (1408 of 2130)
PASS: lldb-api :: lang/c/unions/TestUnionMembers.py (1409 of 2130)
PASS: lldb-api :: commands/expression/diagnostics/TestExprDiagnostics.py (1410 of 2130)
PASS: lldb-api :: types/TestCharTypeExpr.py (1411 of 2130)
PASS: lldb-unit :: Language/Highlighting/./HighlighterTests/HighlighterTest.ClangComments (1412 of 2130)
PASS: lldb-unit :: Process/gdb-remote/./ProcessGdbRemoteTests/GDBRemoteClientBaseTest.InterruptNoResponse (1413 of 2130)
PASS: lldb-unit :: Thread/./ThreadTests/ThreadTest.GetPrivateStopInfo (1414 of 2130)
PASS: lldb-shell :: SymbolFile/DWARF/win-i386-line-table.s (1415 of 2130)
PASS: lldb-api :: lang/c/strings/TestCStrings.py (1416 of 2130)
PASS: lldb-unit :: Host/./HostTests/FileSystemTest.Resolve (1417 of 2130)
PASS: lldb-api :: functionalities/data-formatter/data-formatter-stl/libcxx/list/loop/TestDataFormatterLibcxxListLoop.py (1418 of 2130)
PASS: lldb-unit :: Platform/./LLDBPlatformTests/PlatformDarwinTest.TestParseVersionBuildDir (1419 of 2130)
PASS: lldb-api :: python_api/symbol-context/two-files/TestSymbolContextTwoFiles.py (1420 of 2130)
PASS: lldb-unit :: Utility/./UtilityTests/ArchSpecTest.TripleComponentsWereSpecified (1421 of 2130)
PASS: lldb-unit :: ScriptInterpreter/Python/./ScriptInterpreterPythonTests/PythonDataObjectsTest.TestTypeNameResolutionNoDot (1422 of 2130)
PASS: lldb-unit :: Utility/./UtilityTests/RangeTest.Clear (1423 of 2130)
PASS: lldb-unit :: Expression/./ExpressionTests/CppModuleConfigurationTest.AmbiguousLibCpp (1424 of 2130)
PASS: lldb-unit :: Utility/./UtilityTests/BinaryStreamTest.PutULEB128SevenBytes (1425 of 2130)
PASS: lldb-unit :: UnwindAssembly/PPC64/./PPC64InstEmulationTests/TestPPC64InstEmulation.TestSimpleFunction (1426 of 2130)
PASS: lldb-api :: functionalities/data-formatter/data-formatter-stl/libcxx/initializerlist/TestInitializerList.py (1427 of 2130)
PASS: lldb-unit :: UnwindAssembly/x86/./UnwindAssemblyx86Tests/Testx86AssemblyInspectionEngine.TestPushEBP (1428 of 2130)
UNSUPPORTED: lldb-api :: commands/register/register/intel_xtended_registers/TestMPXRegisters.py (1429 of 2130)
PASS: lldb-api :: macosx/version_zero/TestGetVersionZeroVersion.py (1430 of 2130)
PASS: lldb-unit :: Utility/./UtilityTests/GeneratorTest.GetOrCreate (1431 of 2130)
PASS: lldb-api :: functionalities/tail_call_frames/disambiguate_call_site/TestDisambiguateCallSite.py (1432 of 2130)
PASS: lldb-api :: functionalities/breakpoint/debugbreak/TestDebugBreak.py (1433 of 2130)
PASS: lldb-api :: functionalities/paths/TestPaths.py (1434 of 2130)
UNSUPPORTED: lldb-shell :: SymbolFile/PDB/compilands.test (1435 of 2130)
PASS: lldb-api :: commands/expression/import-std-module/shared_ptr/TestSharedPtrFromStdModule.py (1436 of 2130)
UNSUPPORTED: lldb-shell :: SymbolFile/PDB/enums-layout.test (1437 of 2130)
PASS: lldb-unit :: Process/gdb-remote/./ProcessGdbRemoteTests/GDBRemoteCommunicationServerTest.SendErrorResponse_Status (1438 of 2130)
PASS: lldb-shell :: ObjectFile/ELF/PT_LOAD-overlap.yaml (1439 of 2130)
PASS: lldb-unit :: Process/gdb-remote/./ProcessGdbRemoteTests/GDBRemoteClientBaseTest.SendContinueAndInterrupt (1440 of 2130)
PASS: lldb-api :: commands/target/basic/TestTargetCommand.py (1441 of 2130)
PASS: lldb-shell :: SymbolFile/DWARF/debug_rnglists-dwo.s (1442 of 2130)
PASS: lldb-shell :: SymbolFile/Breakpad/line-table-missing-file.test (1443 of 2130)
PASS: lldb-api :: commands/process/attach/attach_denied/TestAttachDenied.py (1444 of 2130)
PASS: lldb-api :: functionalities/object-file/TestImageListMultiArchitecture.py (1445 of 2130)
PASS: lldb-api :: commands/expression/call-function/TestCallUserDefinedFunction.py (1446 of 2130)
PASS: lldb-api :: driver/batch_mode/TestBatchMode.py (1447 of 2130)
PASS: lldb-unit :: Utility/./UtilityTests/RangeTest.NotEqual (1448 of 2130)
PASS: lldb-unit :: Host/./HostTests/ProcessLaunchInfoTest.Constructor (1449 of 2130)
PASS: lldb-api :: macosx/indirect_symbol/TestIndirectSymbols.py (1450 of 2130)
PASS: lldb-api :: types/TestLongTypes.py (1451 of 2130)
PASS: lldb-shell :: Commands/command-disassemble.s (1452 of 2130)
PASS: lldb-unit :: Process/minidump/./LLDBMinidumpTests/MinidumpParserTest.MinidumpDuplicateModuleMinAddress (1453 of 2130)
UNSUPPORTED: lldb-shell :: Expr/TestIRMemoryMapWindows.test (1454 of 2130)
PASS: lldb-unit :: Utility/./UtilityTests/UriParserTest.PortOverflow (1455 of 2130)
PASS: lldb-api :: lang/cpp/auto/TestCPPAuto.py (1456 of 2130)
UNSUPPORTED: lldb-shell :: Process/Windows/exception_access_violation.cpp (1457 of 2130)
PASS: lldb-api :: lang/cpp/namespace_definitions/TestNamespaceDefinitions.py (1458 of 2130)
PASS: lldb-unit :: Utility/./UtilityTests/StringListTest.ForRangeEmpty (1459 of 2130)
PASS: lldb-api :: lang/objc/objc-checker/TestObjCCheckers.py (1460 of 2130)
PASS: lldb-api :: macosx/function-starts/TestFunctionStarts.py (1461 of 2130)
PASS: lldb-api :: commands/settings/quoting/TestQuoting.py (1462 of 2130)
PASS: lldb-unit :: Symbol/./SymbolTests/Type.CompilerContextPattern (1463 of 2130)
PASS: lldb-unit :: Utility/./UtilityTests/UriParserTest.MinimalPort (1464 of 2130)
PASS: lldb-api :: python_api/get-value-32bit-int/TestGetValue32BitInt.py (1465 of 2130)
PASS: lldb-api :: lang/cpp/overloaded-functions/TestOverloadedFunctions.py (1466 of 2130)
PASS: lldb-unit :: Utility/./UtilityTests/ArchSpecTest.TestParseMachCPUDashSubtypeTripleExtra (1467 of 2130)
PASS: lldb-api :: functionalities/data-formatter/data-formatter-objc/TestDataFormatterObjCNSData.py (1468 of 2130)
PASS: lldb-api :: functionalities/thread/concurrent_events/TestConcurrentDelaySignalWatch.py (1469 of 2130)
PASS: lldb-unit :: Utility/./UtilityTests/OptionsWithRawTest.SingleWhitespaceInput (1470 of 2130)
PASS: lldb-shell :: ScriptInterpreter/Python/crashlog.test (1471 of 2130)
PASS: lldb-shell :: ObjectFile/PECOFF/uuid.yaml (1472 of 2130)
PASS: lldb-unit :: Utility/./UtilityTests/StringLexerTest.Peek (1473 of 2130)
PASS: lldb-unit :: Utility/./UtilityTests/StringExtractorTest.GetHexBytes_FullString (1474 of 2130)
PASS: lldb-api :: functionalities/breakpoint/breakpoint_names/TestBreakpointNames.py (1475 of 2130)
PASS: lldb-api :: types/TestShortType.py (1476 of 2130)
PASS: lldb-api :: commands/expression/timeout/TestCallWithTimeout.py (1477 of 2130)
PASS: lldb-unit :: Process/gdb-remote/./ProcessGdbRemoteTests/GDBRemoteClientBaseTest.SendContinueAndLateInterrupt (1478 of 2130)
PASS: lldb-unit :: UnwindAssembly/x86/./UnwindAssemblyx86Tests/Testx86AssemblyInspectionEngine.TestPushRBP (1479 of 2130)
PASS: lldb-unit :: Utility/./UtilityTests/RangeTest.ContainsEndInclusive (1480 of 2130)
PASS: lldb-shell :: ObjectFile/PECOFF/section-types.yaml (1481 of 2130)
PASS: lldb-api :: commands/expression/import_builtin_fileid/TestImportBuiltinFileID.py (1482 of 2130)
PASS: lldb-api :: python_api/module_section/TestModuleAndSection.py (1483 of 2130)
PASS: lldb-api :: functionalities/var_path/TestVarPath.py (1484 of 2130)
PASS: lldb-unit :: SymbolFile/NativePDB/./SymbolFileNativePDBTests/PDBFPOProgramToDWARFExpressionTests.MultipleDependentAssignments (1485 of 2130)
PASS: lldb-api :: python_api/sbvalue_const_addrof/TestSBValueConstAddrOf.py (1486 of 2130)
PASS: lldb-api :: functionalities/thread/crash_during_step/TestCrashDuringStep.py (1487 of 2130)
PASS: lldb-unit :: Utility/./UtilityTests/BinaryStreamTest.PutULEB128One (1488 of 2130)
PASS: lldb-api :: functionalities/source-map/TestTargetSourceMap.py (1489 of 2130)
PASS: lldb-api :: functionalities/breakpoint/scripted_bkpt/TestScriptedResolver.py (1490 of 2130)
PASS: lldb-api :: commands/gui/breakpoints/TestGuiBreakpoints.py (1491 of 2130)
PASS: lldb-api :: functionalities/breakpoint/breakpoint_locations/TestBreakpointLocations.py (1492 of 2130)
PASS: lldb-api :: python_api/lldbutil/process/TestPrintStackTraces.py (1493 of 2130)
PASS: lldb-shell :: SymbolFile/DWARF/DW_AT_const_value-bitfields.s (1494 of 2130)
PASS: lldb-unit :: Target/./TargetTests/ModuleCacheTest.GetAndPut (1495 of 2130)
PASS: lldb-shell :: SymbolFile/DWARF/debug_ranges-missing-section.s (1496 of 2130)
PASS: lldb-unit :: Utility/./UtilityTests/StreamTest.AddressRangeInvalidRange (1497 of 2130)
PASS: lldb-api :: commands/expression/import-std-module/unique_ptr/TestUniquePtrFromStdModule.py (1498 of 2130)
PASS: lldb-api :: commands/source/info/TestSourceInfo.py (1499 of 2130)
PASS: lldb-unit :: Utility/./UtilityTests/StringExtractorTest.GetU32BigEndian (1500 of 2130)
PASS: lldb-api :: commands/version/TestVersion.py (1501 of 2130)
PASS: lldb-api :: functionalities/mtc/simple/TestMTCSimple.py (1502 of 2130)
PASS: lldb-shell :: Driver/TestError.test (1503 of 2130)
PASS: lldb-unit :: ScriptInterpreter/Python/./ScriptInterpreterPythonTests/PythonDataObjectsTest.TestPythonCallableCheck (1504 of 2130)
PASS: lldb-shell :: Reproducer/TestPythonImport.test (1505 of 2130)
PASS: lldb-shell :: SymbolFile/DWARF/dir-separator-posix.s (1506 of 2130)
PASS: lldb-shell :: Register/x86-64-ymm-read.test (1507 of 2130)
PASS: lldb-unit :: Interpreter/./InterpreterTests/OptionValueFileColonLine.setFromString (1508 of 2130)
UNSUPPORTED: lldb-api :: functionalities/thread/thread_specific_break_plus_condition/TestThreadSpecificBpPlusCondition.py (1509 of 2130)
PASS: lldb-api :: tools/lldb-server/register-reading/TestGdbRemoteGPacket.py (1510 of 2130)
PASS: lldb-api :: commands/expression/save_jit_objects/TestSaveJITObjects.py (1511 of 2130)
PASS: lldb-unit :: Language/CLanguages/./LanguageCLanguagesTests/CLanguages.LookupCLanguagesByLanguageType (1512 of 2130)
PASS: lldb-api :: python_api/function_symbol/TestDisasmAPI.py (1513 of 2130)
PASS: lldb-shell :: ScriptInterpreter/Python/eof.test (1514 of 2130)
PASS: lldb-unit :: Host/./HostTests/SocketTest.TCPGetAddress (1515 of 2130)
PASS: lldb-unit :: Utility/./UtilityTests/AnsiTerminal.KnownPrefix (1516 of 2130)
PASS: lldb-unit :: Symbol/./SymbolTests/TestTypeSystemClang.TestGetTypeClassTypeOfExpr (1517 of 2130)
UNSUPPORTED: lldb-api :: tools/lldb-server/TestGdbRemote_vContThreads.py (1518 of 2130)
PASS: lldb-api :: lang/c/step_over_no_deadlock/TestStepOverDoesntBlock.py (1519 of 2130)
PASS: lldb-api :: commands/process/launch/TestProcessLaunch.py (1520 of 2130)
PASS: lldb-shell :: ScriptInterpreter/Python/sb_address_exception.test (1521 of 2130)
UNSUPPORTED: lldb-shell :: Breakpoint/case-insensitive.test (1522 of 2130)
PASS: lldb-unit :: Utility/./UtilityTests/RegisterValueTest.GetSet8 (1523 of 2130)
PASS: lldb-api :: lang/c/find_struct_type/TestFindStructTypes.py (1524 of 2130)
PASS: lldb-shell :: SymbolFile/Breakpad/line-table-edgecases.test (1525 of 2130)
PASS: lldb-unit :: Utility/./UtilityTests/RecordReplayTest.InstrumentedFoo (1526 of 2130)
PASS: lldb-unit :: Utility/./UtilityTests/StreamTest.AddressSuffix (1527 of 2130)
PASS: lldb-unit :: Target/./TargetTests/PathMappingListTest.RemapRoot (1528 of 2130)
PASS: lldb-unit :: UnwindAssembly/x86/./UnwindAssemblyx86Tests/Testx86AssemblyInspectionEngine.TestPopEBP (1529 of 2130)
PASS: lldb-unit :: Utility/./UtilityTests/StringExtractorTest.InitMisc (1530 of 2130)
PASS: lldb-api :: functionalities/thread/concurrent_events/TestConcurrentWatchpointDelayWatchpointOneBreakpoint.py (1531 of 2130)
PASS: lldb-shell :: Quit/TestQuitExitCodeNonInt.test (1532 of 2130)
PASS: lldb-api :: commands/expression/radar_9531204/TestPrintfAfterUp.py (1533 of 2130)
PASS: lldb-api :: sample_test/TestSampleInlineTest.py (1534 of 2130)
PASS: lldb-unit :: Utility/./UtilityTests/BinaryStreamTest.PutULEB128EightBytes (1535 of 2130)
PASS: lldb-api :: macosx/queues/TestQueues.py (1536 of 2130)
PASS: lldb-api :: lang/c/local_variables/TestLocalVariables.py (1537 of 2130)
PASS: lldb-api :: lang/objc/modules-non-objc-target/TestObjCModulesNonObjCTarget.py (1538 of 2130)
PASS: lldb-api :: python_api/breakpoint/TestBreakpointAPI.py (1539 of 2130)
PASS: lldb-shell :: SymbolFile/NativePDB/function-types-classes.cpp (1540 of 2130)
PASS: lldb-api :: commands/expression/import-std-module/forward_list/TestForwardListFromStdModule.py (1541 of 2130)
PASS: lldb-api :: python_api/sblaunchinfo/TestSBLaunchInfo.py (1542 of 2130)
PASS: lldb-unit :: Utility/./UtilityTests/StatusTest.ErrorConstructor (1543 of 2130)
PASS: lldb-unit :: UnwindAssembly/x86/./UnwindAssemblyx86Tests/Testx86AssemblyInspectionEngine.Testi386IgnoredRegisters (1544 of 2130)
PASS: lldb-unit :: ScriptInterpreter/Python/./ScriptInterpreterPythonTests/PythonDataObjectsTest.TestPythonByteArray (1545 of 2130)
PASS: lldb-api :: functionalities/tail_call_frames/cross_object/TestCrossObjectTailCalls.py (1546 of 2130)
PASS: lldb-unit :: Symbol/./SymbolTests/TestTypeSystemClang.TemplateArguments (1547 of 2130)
PASS: lldb-api :: commands/expression/two-files/TestObjCTypeQueryFromOtherCompileUnit.py (1548 of 2130)
PASS: lldb-api :: tools/lldb-server/TestGdbRemoteExpeditedRegisters.py (1549 of 2130)
FAIL: lldb-api :: functionalities/gdb_remote_client/TestGDBRemoteLoad.py (1550 of 2130)
******************** TEST 'lldb-api :: functionalities/gdb_remote_client/TestGDBRemoteLoad.py' FAILED ********************
Script:
--
/usr/local/Frameworks/Python.framework/Versions/3.7/bin/python3.7 /Users/buildslave/jenkins/workspace/lldb-cmake@2/llvm-project/lldb/test/API/dotest.py --arch x86_64 -s /Users/buildslave/jenkins/workspace/lldb-cmake@2/lldb-build/lldb-test-traces -S nm -u CXXFLAGS -u CFLAGS --codesign-identity - --server /Users/buildslave/jenkins/workspace/lldb-cmake@2/lldb-build/./bin/debugserver --arch x86_64 --build-dir /Users/buildslave/jenkins/workspace/lldb-cmake@2/lldb-build/lldb-test-build.noindex -s=/Users/buildslave/jenkins/workspace/lldb-cmake@2/test/logs -t --env TERM=vt100 --env LLVM_LIBS_DIR=/Users/buildslave/jenkins/workspace/lldb-cmake@2/lldb-build/./lib --build-dir /Users/buildslave/jenkins/workspace/lldb-cmake@2/lldb-build/lldb-test-build.noindex --lldb-module-cache-dir /Users/buildslave/jenkins/workspace/lldb-cmake@2/lldb-build/lldb-test-build.noindex/module-cache-lldb/lldb-api --clang-module-cache-dir /Users/buildslave/jenkins/workspace/lldb-cmake@2/lldb-build/lldb-test-build.noindex/module-cache-clang/lldb-api --executable /Users/buildslave/jenkins/workspace/lldb-cmake@2/lldb-build/./bin/lldb --compiler /Users/buildslave/jenkins/workspace/lldb-cmake@2/lldb-build/./bin/clang --dsymutil /Users/buildslave/jenkins/workspace/lldb-cmake@2/lldb-build/./bin/dsymutil --filecheck /Users/buildslave/jenkins/workspace/lldb-cmake@2/lldb-build/./bin/FileCheck --yaml2obj /Users/buildslave/jenkins/workspace/lldb-cmake@2/lldb-build/./bin/yaml2obj --lldb-libs-dir /Users/buildslave/jenkins/workspace/lldb-cmake@2/lldb-build/./lib /Users/buildslave/jenkins/workspace/lldb-cmake@2/llvm-project/lldb/test/API/functionalities/gdb_remote_client -p TestGDBRemoteLoad.py
--
Exit Code: 1

Hide Details

Command Output (stdout): -- lldb version 12.0.99 clang revision 71f3169e1baeff262583b35ef88f8fb6df7be85e llvm revision 71f3169e1baeff262583b35ef88f8fb6df7be85e LLDB library dir: /Users/buildslave/jenkins/workspace/lldb-cmake@2/lldb-build/bin LLDB import library dir: /Users/buildslave/jenkins/workspace/lldb-cmake@2/lldb-build/./lib libstdcxx tests will not be run because: Don't know how to build with libstdcxx on macosx Skipping following debug info categories: ['dwo']

Hide Details

-- Command Output (stderr): --

Hide Details

Session logs for test failures/errors/unexpected successes will go into directory '/Users/buildslave/jenkins/workspace/lldb-cmake@2/test/logs' Change dir to: /Users/buildslave/jenkins/workspace/lldb-cmake@2/llvm-project/lldb/test/API/functionalities/gdb_remote_client runCmd: settings clear -all output:

Hide Details

runCmd: settings set symbols.enable-external-lookup false output:

Hide Details

runCmd: settings set target.inherit-tcc true output:

Hide Details

runCmd: settings set target.auto-apply-fixits false output:

Hide Details

runCmd: settings set plugin.process.gdb-remote.packet-timeout 60 output:

Hide Details

runCmd: settings set symbols.clang-modules-cache-path "/Users/buildslave/jenkins/workspace/lldb-cmake@2/lldb-build/lldb-test-build.noindex/module-cache-lldb/lldb-api" output:

Hide Details

runCmd: settings set use-color false output:

Hide Details

runCmd: setting set target.prefer-dynamic-value no-dynamic-values output:

Hide Details

FAIL: LLDB (/Users/buildslave/jenkins/workspace/lldb-cmake@2/lldb-build/bin/clang-x86_64) :: test_flash_load (TestGDBRemoteLoad.TestGDBRemoteLoad) <bound method SBProcess.Kill of <lldb.SBProcess; proxy of <Swig Object of type 'lldb::SBProcess *' at 0x108d6d540> >>: success

Hide Details

runCmd: settings clear -all output:

Hide Details

runCmd: settings set symbols.enable-external-lookup false output:

Hide Details

runCmd: settings set target.inherit-tcc true output:

Hide Details

runCmd: settings set target.auto-apply-fixits false output:

Hide Details

runCmd: settings set plugin.process.gdb-remote.packet-timeout 60 output:

Hide Details

runCmd: settings set symbols.clang-modules-cache-path "/Users/buildslave/jenkins/workspace/lldb-cmake@2/lldb-build/lldb-test-build.noindex/module-cache-lldb/lldb-api" output:

Hide Details

runCmd: settings set use-color false output:

Hide Details

runCmd: setting set target.prefer-dynamic-value no-dynamic-values output:

Hide Details

<bound method SBProcess.Kill of <lldb.SBProcess; proxy of <Swig Object of type 'lldb::SBProcess *' at 0x10184d600> >>: success

Hide Details

PASS: LLDB (/Users/buildslave/jenkins/workspace/lldb-cmake@2/lldb-build/bin/clang-x86_64) :: test_module_load_address (TestGDBRemoteLoad.TestGDBRemoteLoad) runCmd: settings clear -all output:

Hide Details

runCmd: settings set symbols.enable-external-lookup false output:

Hide Details

runCmd: settings set target.inherit-tcc true output:

Hide Details

runCmd: settings set target.auto-apply-fixits false output:

Hide Details

runCmd: settings set plugin.process.gdb-remote.packet-timeout 60 output:

Hide Details

runCmd: settings set symbols.clang-modules-cache-path "/Users/buildslave/jenkins/workspace/lldb-cmake@2/lldb-build/lldb-test-build.noindex/module-cache-lldb/lldb-api" output:

Hide Details

runCmd: settings set use-color false output:

Hide Details

runCmd: setting set target.prefer-dynamic-value no-dynamic-values output:

Hide Details

<bound method SBProcess.Kill of <lldb.SBProcess; proxy of <Swig Object of type 'lldb::SBProcess *' at 0x108d6d5a0> >>: success

Hide Details

PASS: LLDB (/Users/buildslave/jenkins/workspace/lldb-cmake@2/lldb-build/bin/clang-x86_64) :: test_ram_load (TestGDBRemoteLoad.TestGDBRemoteLoad) Restore dir to: /Users/buildslave/jenkins/workspace/lldb-cmake@2/lldb-build/tools/lldb/test ====================================================================== FAIL: test_flash_load (TestGDBRemoteLoad.TestGDBRemoteLoad) Test loading an object file to a target's flash memory ---------------------------------------------------------------------- Traceback (most recent call last): File "/Users/buildslave/jenkins/workspace/lldb-cmake@2/llvm-project/lldb/test/API/functionalities/gdb_remote_client/TestGDBRemoteLoad.py", line 67, in test_flash_load process = self.connect(target) File "/Users/buildslave/jenkins/workspace/lldb-cmake@2/llvm-project/lldb/test/API/functionalities/gdb_remote_client/gdbclientutils.py", line 524, in connect self.assertTrue(error.Success(), error.description) AssertionError: False is not True : failed to get reply to handshake packet Config=x86_64-/Users/buildslave/jenkins/workspace/lldb-cmake@2/lldb-build/bin/clang ---------------------------------------------------------------------- Ran 3 tests in 101.727s

Hide Details

RESULT: FAILED (2 passes, 1 failures, 0 errors, 0 skipped, 0 expected failures, 0 unexpected successes)

Hide Details

--

Hide Details

******************** PASS: lldb-unit :: Utility/./UtilityTests/VMRange.Comparison (1551 of 2130) UNSUPPORTED: lldb-shell :: ExecControl/StopHook/stop-hook-threads.test (1552 of 2130) PASS: lldb-unit :: Process/minidump/./LLDBMinidumpTests/MinidumpParserTest.GetMemory (1553 of 2130) PASS: lldb-api :: lang/objc/exceptions/TestObjCExceptions.py (1554 of 2130) PASS: lldb-unit :: Utility/./UtilityTests/RangeTest.LessThan (1555 of 2130) PASS: lldb-unit :: Utility/./UtilityTests/ReproducerTest.SetReplay (1556 of 2130) PASS: lldb-unit :: UnwindAssembly/x86/./UnwindAssemblyx86Tests/Testx86AssemblyInspectionEngine.Test64bitFramelessSmallStackFrame (1557 of 2130) PASS: lldb-unit :: Expression/./ExpressionTests/CppModuleConfigurationTest.IgnoreLibStdCpp (1558 of 2130) PASS: lldb-unit :: Core/./LLDBCoreTests/RichManglingContextTest.FromCxxMethodName (1559 of 2130) PASS: lldb-unit :: Symbol/./SymbolTests/TestTypeSystemClang.TestNotDeletingUserCopyCstrDueToMoveCStr (1560 of 2130) UNSUPPORTED: lldb-api :: tools/lldb-server/TestGdbRemoteCompletion.py (1561 of 2130) PASS: lldb-unit :: ObjectFile/Breakpad/./ObjectFileBreakpadTests/LineRecord.parse (1562 of 2130) PASS: lldb-shell :: SymbolFile/NativePDB/tag-types.cpp (1563 of 2130) PASS: lldb-api :: lang/objc/objc-static-method/TestObjCStaticMethod.py (1564 of 2130) PASS: lldb-api :: functionalities/gdb_remote_client/TestGDBRemoteDiskFileCompletion.py (1565 of 2130) PASS: lldb-api :: functionalities/gdb_remote_client/TestIOSSimulator.py (1566 of 2130) PASS: lldb-unit :: Interpreter/./InterpreterTests/OptionArgParserTest.toScriptLanguage (1567 of 2130) PASS: lldb-api :: commands/expression/fixits/TestFixIts.py (1568 of 2130) PASS: lldb-shell :: Driver/TestSingleQuote.test (1569 of 2130) PASS: lldb-shell :: SymbolFile/Breakpad/stack-cfi-arm.yaml (1570 of 2130) PASS: lldb-unit :: Expression/./ExpressionTests/DiagnosticManagerTest.AppendMessageAttachToLastDiag (1571 of 2130) UNSUPPORTED: lldb-shell :: SymbolFile/NativePDB/local-variables.cpp (1572 of 2130) PASS: lldb-shell :: ObjectFile/ELF/PT_LOAD.yaml (1573 of 2130) PASS: lldb-unit :: Utility/./UtilityTests/DataExtractorTest.GetCStrUnterminated (1574 of 2130) PASS: lldb-unit :: ObjectFile/PECOFF/./ObjectFilePECOFFTests/PECallFrameInfoTest.Chained_eh (1575 of 2130) PASS: lldb-api :: lang/cpp/enum_types/TestCPP11EnumTypes.py (1576 of 2130) PASS: lldb-api :: lang/objc/conflicting-definition/TestConflictingDefinition.py (1577 of 2130) PASS: lldb-unit :: Process/gdb-remote/./ProcessGdbRemoteTests/GDBRemoteCommunicationClientTest.SaveRestoreRegistersNoSuffix (1578 of 2130) PASS: lldb-unit :: Utility/./UtilityTests/BinaryStreamTest.PutSLEB128EightBytes (1579 of 2130) PASS: lldb-api :: commands/gui/viewlarge/TestGuiViewLarge.py (1580 of 2130) PASS: lldb-unit :: Core/./LLDBCoreTests/RichManglingContextTest.IPDRealloc (1581 of 2130) PASS: lldb-unit :: Utility/./UtilityTests/SerializationRountripTest.SerializeDeserializeCStringNull (1582 of 2130) PASS: lldb-api :: functionalities/memory/cache/TestMemoryCache.py (1583 of 2130) PASS: lldb-unit :: Signals/./SignalsTests/UnixSignalsTest.GetFilteredSignals (1584 of 2130) PASS: lldb-unit :: ObjectFile/Breakpad/./ObjectFileBreakpadTests/Record.classify (1585 of 2130) PASS: lldb-unit :: Utility/./UtilityTests/StringListTest.InsertStringAtIndexEnd (1586 of 2130) PASS: lldb-unit :: Signals/./SignalsTests/UnixSignalsTest.VersionChange (1587 of 2130) PASS: lldb-shell :: SymbolFile/DWARF/debug_loc.s (1588 of 2130) PASS: lldb-api :: commands/expression/completion-in-lambda-and-unnamed-class/TestCompletionInLambdaAndUnnamedClass.py (1589 of 2130) PASS: lldb-unit :: Utility/./UtilityTests/StringExtractorTest.GetU64BigEndian (1590 of 2130) PASS: lldb-api :: functionalities/unwind/zeroth_frame/TestZerothFrame.py (1591 of 2130) PASS: lldb-api :: lang/cpp/namespace_conflicts/TestNamespaceConflicts.py (1592 of 2130) PASS: lldb-unit :: Utility/./UtilityTests/ArgsTest.GetArgumentArrayRef (1593 of 2130) PASS: lldb-api :: commands/process/attach-resume/TestAttachResume.py (1594 of 2130) PASS: lldb-api :: functionalities/data-formatter/data-formatter-stl/libcxx/unordered/TestDataFormatterUnordered.py (1595 of 2130) PASS: lldb-api :: functionalities/tail_call_frames/thread_step_out_or_return/TestSteppingOutWithArtificialFrames.py (1596 of 2130) PASS: lldb-api :: commands/command/nested_alias/TestNestedAlias.py (1597 of 2130) PASS: lldb-api :: commands/expression/import-std-module/stack/TestStackFromStdModule.py (1598 of 2130) PASS: lldb-api :: functionalities/wrong_commands/TestWrongCommands.py (1599 of 2130) PASS: lldb-api :: lang/cpp/wchar_t/TestCxxWCharT.py (1600 of 2130) PASS: lldb-api :: python_api/disassemble-raw-data/TestDisassemble_VST1_64.py (1601 of 2130) PASS: lldb-shell :: SymbolFile/DWARF/debug-types-dwarf5.s (1602 of 2130) PASS: lldb-unit :: Utility/./UtilityTests/ArgsTest.ReplaceArgumentAtIndexShort (1603 of 2130) PASS: lldb-api :: functionalities/tail_call_frames/thread_step_out_message/TestArtificialFrameStepOutMessage.py (1604 of 2130) UNSUPPORTED: lldb-shell :: Watchpoint/netbsd-nouserdbregs.test (1605 of 2130) PASS: lldb-unit :: Target/./TargetTests/ExecutionContextTest.GetByteOrderProcess (1606 of 2130) PASS: lldb-unit :: ScriptInterpreter/Python/./ScriptInterpreterPythonTests/PythonDataObjectsTest.TestModuleNameResolutionNoDot (1607 of 2130) PASS: lldb-unit :: Utility/./UtilityTests/RegularExpression.CopyAssignment (1608 of 2130) PASS: lldb-api :: commands/expression/import-std-module/queue/TestQueueFromStdModule.py (1609 of 2130) PASS: lldb-shell :: SymbolFile/NativePDB/nested-types.cpp (1610 of 2130) PASS: lldb-api :: functionalities/data-formatter/data-formatter-objc/TestDataFormatterObjNSException.py (1611 of 2130) PASS: lldb-api :: functionalities/data-formatter/data-formatter-objc/TestDataFormatterObjCNSBundle.py (1612 of 2130) PASS: lldb-unit :: SymbolFile/NativePDB/./SymbolFileNativePDBTests/PDBFPOProgramToDWARFExpressionTests.UnresolvedRegisterAssignmentReference (1613 of 2130) PASS: lldb-unit :: Utility/./UtilityTests/ScalarTest.Comparison (1614 of 2130) UNSUPPORTED: lldb-shell :: Register/x86-64-xmm16-read.test (1615 of 2130) PASS: lldb-api :: iohandler/unicode/TestUnicode.py (1616 of 2130) PASS: lldb-unit :: Utility/./UtilityTests/StringExtractorTest.InitEmpty (1617 of 2130) PASS: lldb-api :: functionalities/gdb_remote_client/TestqOffsets.py (1618 of 2130) PASS: lldb-unit :: Editline/./EditlineTests/EditlineTestFixture.EditlineReceivesSingleLineText (1619 of 2130) PASS: lldb-unit :: Utility/./UtilityTests/TildeExpressionResolver.ResolveFullPath (1620 of 2130) PASS: lldb-unit :: Signals/./SignalsTests/UnixSignalsTest.Iteration (1621 of 2130) PASS: lldb-api :: tools/lldb-vscode/variables/TestVSCode_variables.py (1622 of 2130) PASS: lldb-unit :: Utility/./UtilityTests/BinaryStreamTest.PutSLEB128FourBytes (1623 of 2130) PASS: lldb-api :: functionalities/thread/concurrent_events/TestConcurrentManyWatchpoints.py (1624 of 2130) UNSUPPORTED: lldb-api :: linux/sepdebugsymlink/TestTargetSymbolsSepDebugSymlink.py (1625 of 2130) PASS: lldb-api :: python_api/sbvalue_persist/TestSBValuePersist.py (1626 of 2130) PASS: lldb-api :: functionalities/data-formatter/refpointer-recursion/TestDataFormatterRefPtrRecursion.py (1627 of 2130) PASS: lldb-unit :: Utility/./UtilityTests/Flags.AnySet (1628 of 2130) PASS: lldb-unit :: Utility/./UtilityTests/StreamTest.PutHex64ByteOrderBig (1629 of 2130) PASS: lldb-api :: python_api/lldbutil/iter/TestLLDBIterator.py (1630 of 2130) PASS: lldb-api :: functionalities/data-formatter/data-formatter-stl/libcxx/bitset/TestDataFormatterLibcxxBitset.py (1631 of 2130) PASS: lldb-shell :: SymbolFile/DWARF/clang-ast-from-dwarf-objc-property.m (1632 of 2130) PASS: lldb-unit :: ObjectFile/ELF/./ObjectFileELFTests/ObjectFileELFTest.GetSymtab_NoSymEntryPointArmThumbAddressClass (1633 of 2130) PASS: lldb-unit :: ScriptInterpreter/Python/./ScriptInterpreterPythonTests/PythonDataObjectsTest.TestRun (1634 of 2130) PASS: lldb-api :: commands/disassemble/basic/TestFrameDisassemble.py (1635 of 2130) PASS: lldb-api :: lang/objc/hidden-ivars/TestHiddenIvars.py (1636 of 2130) PASS: lldb-api :: python_api/frame/get-variables/TestGetVariables.py (1637 of 2130) PASS: lldb-unit :: Utility/./UtilityTests/BroadcasterTest.BroadcastEvent (1638 of 2130) PASS: lldb-api :: functionalities/thread/ignore_suspended/TestIgnoreSuspendedThread.py (1639 of 2130) PASS: lldb-unit :: Utility/./UtilityTests/StringListTest.AppendList (1640 of 2130) PASS: lldb-shell :: ObjectFile/MachO/lc_version_min.yaml (1641 of 2130) PASS: lldb-shell :: ObjectFile/ELF/netbsd-core-amd64.test (1642 of 2130) PASS: lldb-api :: functionalities/tsan/thread_leak/TestTsanThreadLeak.py (1643 of 2130) PASS: lldb-shell :: Host/TestCustomShell.test (1644 of 2130) PASS: lldb-unit :: Utility/./UtilityTests/StringListTest.DefaultConstructor (1645 of 2130) PASS: lldb-api :: lang/cpp/dynamic-value/TestDynamicValue.py (1646 of 2130) PASS: lldb-unit :: Utility/./UtilityTests/AnsiTerminal.Unknown (1647 of 2130) PASS: lldb-shell :: ObjectFile/ELF/section-permissions.yaml (1648 of 2130) PASS: lldb-unit :: Utility/./UtilityTests/CompletionRequest.TestCompletionOwnership (1649 of 2130) PASS: lldb-shell :: SymbolFile/DWARF/clang-ast-from-dwarf-unamed-and-anon-structs.cpp (1650 of 2130) PASS: lldb-unit :: Utility/./UtilityTests/UserIDResolver.GetGroupName (1651 of 2130) PASS: lldb-api :: tools/lldb-server/commandline/TestStubSetSID.py (1652 of 2130) PASS: lldb-unit :: Process/minidump/./LLDBMinidumpTests/MinidumpParserTest.GetThreadContext_x86_32_wow64 (1653 of 2130) PASS: lldb-unit :: DataFormatter/./LLDBFormatterTests/FormatManagerTests.CompatibleLangs (1654 of 2130) PASS: lldb-shell :: ObjectFile/ELF/section-types-edgecases.yaml (1655 of 2130) PASS: lldb-unit :: Expression/./ExpressionTests/DWARFExpression.DW_OP_convert (1656 of 2130) PASS: lldb-unit :: Utility/./UtilityTests/StringListTest.SetSize (1657 of 2130) PASS: lldb-shell :: ScriptInterpreter/None/none.test (1658 of 2130) PASS: lldb-unit :: Editline/./EditlineTests/EditlineTestFixture.EditlineReceivesMultiLineText (1659 of 2130) PASS: lldb-api :: lang/cpp/multiple-inheritance/TestCppMultipleInheritance.py (1660 of 2130) UNSUPPORTED: lldb-api :: tools/lldb-server/libraries-svr4/TestGdbRemoteLibrariesSvr4Support.py (1661 of 2130) UNSUPPORTED: lldb-shell :: Register/aarch64-fp-read.test (1662 of 2130) PASS: lldb-shell :: SymbolFile/Breakpad/symtab.test (1663 of 2130) PASS: lldb-shell :: SymbolFile/NativePDB/ast-types.cpp (1664 of 2130) PASS: lldb-api :: lang/objc/objc-struct-return/TestObjCStructReturn.py (1665 of 2130) PASS: lldb-api :: functionalities/reproducers/attach/TestReproducerAttach.py (1666 of 2130) PASS: lldb-api :: lang/cpp/static_methods/TestCPPStaticMethods.py (1667 of 2130) PASS: lldb-api :: macosx/load-kext/TestLoadKext.py (1668 of 2130) PASS: lldb-api :: functionalities/breakpoint/breakpoint_command/TestRegexpBreakCommand.py (1669 of 2130) PASS: lldb-api :: commands/expression/rdar44436068/Test128BitsInteger.py (1670 of 2130) PASS: lldb-api :: commands/expression/xvalue/TestXValuePrinting.py (1671 of 2130) PASS: lldb-unit :: Core/./LLDBCoreTests/MangledTest.ResultForBlockInvocation (1672 of 2130) PASS: lldb-unit :: Host/./HostTests/SocketTest.TCPGetConnectURI (1673 of 2130) PASS: lldb-shell :: SymbolFile/Breakpad/unwind-via-stack-win-no-memory-info.yaml (1674 of 2130) PASS: lldb-unit :: Utility/./UtilityTests/BinaryStreamTest.PutSLEB128OneByte (1675 of 2130) PASS: lldb-api :: functionalities/dlopen_other_executable/TestDlopenOtherExecutable.py (1676 of 2130) PASS: lldb-unit :: Process/gdb-remote/./ProcessGdbRemoteTests/GDBRemoteCommunicationClientTest.GetModulesInfoInvalidResponse (1677 of 2130) PASS: lldb-shell :: BuildScript/toolchain-clang.test (1678 of 2130) PASS: lldb-unit :: Process/minidump/./LLDBMinidumpTests/MinidumpParserTest.FindMemoryRangeWithFullMemoryMinidump (1679 of 2130) PASS: lldb-api :: lang/cpp/breakpoint_in_member_func_w_non_primitive_params/TestBreakpointInMemberFuncWNonPrimitiveParams.py (1680 of 2130) PASS: lldb-api :: lang/objc/modules-hash-mismatch/TestClangModulesHashMismatch.py (1681 of 2130) PASS: lldb-api :: commands/watchpoints/watchpoint_commands/TestWatchpointCommands.py (1682 of 2130) PASS: lldb-unit :: UnwindAssembly/x86/./UnwindAssemblyx86Tests/Testx86AssemblyInspectionEngine.TestPopR12 (1683 of 2130) PASS: lldb-api :: commands/watchpoints/multiple_threads/TestWatchpointMultipleThreads.py (1684 of 2130) PASS: lldb-unit :: debugserver/./debugserverTests/JSON.Parse (1685 of 2130) PASS: lldb-unit :: Utility/./UtilityTests/Flags.Test (1686 of 2130) PASS: lldb-api :: functionalities/inline-stepping/TestInlineStepping.py (1687 of 2130) PASS: lldb-unit :: Utility/./UtilityTests/BinaryStreamTest.PutSLEB128FiveBytes (1688 of 2130) PASS: lldb-api :: functionalities/tsan/multiple/TestTsanMultiple.py (1689 of 2130) PASS: lldb-api :: commands/expression/multiline-navigation/TestMultilineNavigation.py (1690 of 2130) PASS: lldb-unit :: Utility/./UtilityTests/StreamTest.PutRawBytesToLittleEndian (1691 of 2130) PASS: lldb-unit :: UnwindAssembly/x86/./UnwindAssemblyx86Tests/Testx86AssemblyInspectionEngine.TestPushEAX (1692 of 2130) PASS: lldb-shell :: Minidump/Windows/broken-unwind.test (1693 of 2130) PASS: lldb-unit :: Utility/./UtilityTests/PassiveReplayTest.InstrumentedBarPtr (1694 of 2130) PASS: lldb-api :: lang/c/set_values/TestSetValues.py (1695 of 2130) FAIL: lldb-api :: functionalities/gdb_remote_client/TestThreadSelectionBug.py (1696 of 2130) ******************** TEST 'lldb-api :: functionalities/gdb_remote_client/TestThreadSelectionBug.py' FAILED ******************** Script: -- /usr/local/Frameworks/Python.framework/Versions/3.7/bin/python3.7 /Users/buildslave/jenkins/workspace/lldb-cmake@2/llvm-project/lldb/test/API/dotest.py --arch x86_64 -s /Users/buildslave/jenkins/workspace/lldb-cmake@2/lldb-build/lldb-test-traces -S nm -u CXXFLAGS -u CFLAGS --codesign-identity - --server /Users/buildslave/jenkins/workspace/lldb-cmake@2/lldb-build/./bin/debugserver --arch x86_64 --build-dir /Users/buildslave/jenkins/workspace/lldb-cmake@2/lldb-build/lldb-test-build.noindex -s=/Users/buildslave/jenkins/workspace/lldb-cmake@2/test/logs -t --env TERM=vt100 --env LLVM_LIBS_DIR=/Users/buildslave/jenkins/workspace/lldb-cmake@2/lldb-build/./lib --build-dir /Users/buildslave/jenkins/workspace/lldb-cmake@2/lldb-build/lldb-test-build.noindex --lldb-module-cache-dir /Users/buildslave/jenkins/workspace/lldb-cmake@2/lldb-build/lldb-test-build.noindex/module-cache-lldb/lldb-api --clang-module-cache-dir /Users/buildslave/jenkins/workspace/lldb-cmake@2/lldb-build/lldb-test-build.noindex/module-cache-clang/lldb-api --executable /Users/buildslave/jenkins/workspace/lldb-cmake@2/lldb-build/./bin/lldb --compiler /Users/buildslave/jenkins/workspace/lldb-cmake@2/lldb-build/./bin/clang --dsymutil /Users/buildslave/jenkins/workspace/lldb-cmake@2/lldb-build/./bin/dsymutil --filecheck /Users/buildslave/jenkins/workspace/lldb-cmake@2/lldb-build/./bin/FileCheck --yaml2obj /Users/buildslave/jenkins/workspace/lldb-cmake@2/lldb-build/./bin/yaml2obj --lldb-libs-dir /Users/buildslave/jenkins/workspace/lldb-cmake@2/lldb-build/./lib /Users/buildslave/jenkins/workspace/lldb-cmake@2/llvm-project/lldb/test/API/functionalities/gdb_remote_client -p TestThreadSelectionBug.py -- Exit Code: 1

Hide Details

Command Output (stdout): -- lldb version 12.0.99 clang revision 71f3169e1baeff262583b35ef88f8fb6df7be85e llvm revision 71f3169e1baeff262583b35ef88f8fb6df7be85e LLDB library dir: /Users/buildslave/jenkins/workspace/lldb-cmake@2/lldb-build/bin LLDB import library dir: /Users/buildslave/jenkins/workspace/lldb-cmake@2/lldb-build/./lib libstdcxx tests will not be run because: Don't know how to build with libstdcxx on macosx Skipping following debug info categories: ['dwo']

Hide Details

-- Command Output (stderr): --

Hide Details

Session logs for test failures/errors/unexpected successes will go into directory '/Users/buildslave/jenkins/workspace/lldb-cmake@2/test/logs' Change dir to: /Users/buildslave/jenkins/workspace/lldb-cmake@2/llvm-project/lldb/test/API/functionalities/gdb_remote_client runCmd: settings clear -all output:

Hide Details

runCmd: settings set symbols.enable-external-lookup false output:

Hide Details

runCmd: settings set target.inherit-tcc true output:

Hide Details

runCmd: settings set target.auto-apply-fixits false output:

Hide Details

runCmd: settings set plugin.process.gdb-remote.packet-timeout 60 output:

Hide Details

runCmd: settings set symbols.clang-modules-cache-path "/Users/buildslave/jenkins/workspace/lldb-cmake@2/lldb-build/lldb-test-build.noindex/module-cache-lldb/lldb-api" output:

Hide Details

runCmd: settings set use-color false output:

Hide Details

runCmd: setting set target.prefer-dynamic-value no-dynamic-values output:

Hide Details

FAIL: LLDB (/Users/buildslave/jenkins/workspace/lldb-cmake@2/lldb-build/bin/clang-x86_64) :: test (TestThreadSelectionBug.TestThreadSelectionBug) <bound method SBProcess.Kill of <lldb.SBProcess; proxy of <Swig Object of type 'lldb::SBProcess *' at 0x101e8a4b0> >>: success

Hide Details

Restore dir to: /Users/buildslave/jenkins/workspace/lldb-cmake@2/lldb-build/tools/lldb/test ====================================================================== FAIL: test (TestThreadSelectionBug.TestThreadSelectionBug) ---------------------------------------------------------------------- Traceback (most recent call last): File "/Users/buildslave/jenkins/workspace/lldb-cmake@2/llvm-project/lldb/test/API/functionalities/gdb_remote_client/TestThreadSelectionBug.py", line 16, in test process = self.connect(target) File "/Users/buildslave/jenkins/workspace/lldb-cmake@2/llvm-project/lldb/test/API/functionalities/gdb_remote_client/gdbclientutils.py", line 524, in connect self.assertTrue(error.Success(), error.description) AssertionError: False is not True : failed to get reply to handshake packet Config=x86_64-/Users/buildslave/jenkins/workspace/lldb-cmake@2/lldb-build/bin/clang ---------------------------------------------------------------------- Ran 1 test in 106.162s

Hide Details

RESULT: FAILED (0 passes, 1 failures, 0 errors, 0 skipped, 0 expected failures, 0 unexpected successes)

Hide Details

--

Hide Details

******************** PASS: lldb-api :: functionalities/gdb_remote_client/TestGDBRemoteClient.py (1697 of 2130) PASS: lldb-unit :: ScriptInterpreter/Python/./ScriptInterpreterPythonTests/PythonDataObjectsTest.TestPythonIntegerToStructuredInteger (1698 of 2130) PASS: lldb-unit :: Utility/./UtilityTests/StreamTest.PutHex32ByteOrderBig (1699 of 2130) PASS: lldb-api :: functionalities/unwind/noreturn/module-end/TestNoReturnModuleEnd.py (1700 of 2130) PASS: lldb-unit :: Target/./TargetTests/PathMappingListTest.AbsoluteTests (1701 of 2130) PASS: lldb-unit :: UnwindAssembly/x86/./UnwindAssemblyx86Tests/Testx86AssemblyInspectionEngine.TestPopRBX (1702 of 2130) PASS: lldb-unit :: Utility/./UtilityTests/BinaryStreamTest.PutULEB128MaxValue (1703 of 2130) PASS: lldb-api :: lang/c/stepping/TestThreadStepping.py (1704 of 2130) PASS: lldb-unit :: Utility/./UtilityTests/BinaryStreamTest.PutULEB128Zero (1705 of 2130) PASS: lldb-api :: lang/c/stepping/TestStepAndBreakpoints.py (1706 of 2130) PASS: lldb-shell :: ObjectFile/MachO/lc_build_version.yaml (1707 of 2130) PASS: lldb-unit :: Utility/./UtilityTests/ArgsTest.EscapeLLDBCommandArgument (1708 of 2130) PASS: lldb-shell :: SymbolFile/DWARF/debug_ranges.s (1709 of 2130) PASS: lldb-api :: types/TestRecursiveTypes.py (1710 of 2130) PASS: lldb-shell :: SymbolFile/DWARF/DW_AT_declaration-with-children.s (1711 of 2130) PASS: lldb-unit :: Process/gdb-remote/./ProcessGdbRemoteTests/GDBRemoteClientBaseTest.SendContinueAndWait (1712 of 2130) PASS: lldb-unit :: Utility/./UtilityTests/StringListTest.JoinSingle (1713 of 2130) PASS: lldb-unit :: SymbolFile/NativePDB/./SymbolFileNativePDBTests/PDBFPOProgramToDWARFExpressionTests.UnsupportedRASearch (1714 of 2130) PASS: lldb-api :: functionalities/gdb_remote_client/TestWriteMemory.py (1715 of 2130) PASS: lldb-api :: functionalities/ubsan/user-expression/TestUbsanUserExpression.py (1716 of 2130) UNSUPPORTED: lldb-api :: android/platform/TestDefaultCacheLineSize.py (1717 of 2130) PASS: lldb-shell :: Driver/TestNoUseColor.test (1718 of 2130) PASS: lldb-unit :: tools/lldb-server/tests/./LLDBServerTests/TestBase.LaunchModePreservesEnvironment (1719 of 2130) PASS: lldb-api :: source-manager/TestSourceManager.py (1720 of 2130) PASS: lldb-api :: commands/expression/invalid-args/TestInvalidArgsExpression.py (1721 of 2130) PASS: lldb-api :: commands/expression/call-function/TestCallBuiltinFunction.py (1722 of 2130) PASS: lldb-unit :: Utility/./UtilityTests/StreamTest.Indent (1723 of 2130) PASS: lldb-unit :: Utility/./UtilityTests/XcodeSDKTest.ParseTest (1724 of 2130) PASS: lldb-unit :: Utility/./UtilityTests/Flags.IsClear (1725 of 2130) PASS: lldb-api :: functionalities/breakpoint/address_breakpoints/TestAddressBreakpoints.py (1726 of 2130) PASS: lldb-unit :: SymbolFile/DWARF/./SymbolFileDWARFTests/SymbolFileDWARFTests.TestAbbrevNullAttrValidForm (1727 of 2130) PASS: lldb-unit :: Utility/./UtilityTests/OptionsWithRawTest.EmptySuffixSingleWhitespace (1728 of 2130) PASS: lldb-api :: lang/objc/foundation/TestRuntimeTypes.py (1729 of 2130) PASS: lldb-api :: functionalities/thread/concurrent_events/TestConcurrentTwoBreakpointThreads.py (1730 of 2130) PASS: lldb-api :: commands/watchpoints/multiple_hits/TestMultipleHits.py (1731 of 2130) PASS: lldb-api :: functionalities/gdb_remote_client/TestNoWatchpointSupportInfo.py (1732 of 2130) PASS: lldb-unit :: Utility/./UtilityTests/SerializationRountripTest.SerializeDeserializeCStringArrayNullptr (1733 of 2130) UNSUPPORTED: lldb-shell :: Register/x86-64-zmm-write.test (1734 of 2130) PASS: lldb-unit :: Utility/./UtilityTests/RangeTest.ContainsEndInclusiveInvalid (1735 of 2130) PASS: lldb-unit :: Process/minidump/./LLDBMinidumpTests/MinidumpParserTest.GetMemoryRegionInfo (1736 of 2130) PASS: lldb-api :: commands/frame/diagnose/dereference-argument/TestDiagnoseDereferenceArgument.py (1737 of 2130) PASS: lldb-shell :: SymbolFile/DWARF/split-dwarf-inlining.cpp (1738 of 2130) UNSUPPORTED: lldb-api :: benchmarks/expression/TestRepeatedExprs.py (1739 of 2130) PASS: lldb-unit :: Language/Highlighting/./HighlighterTests/HighlighterTest.HighlighterSelectionType (1740 of 2130) PASS: lldb-api :: lang/cpp/namespace/TestNamespace.py (1741 of 2130) PASS: lldb-api :: types/TestFloatTypes.py (1742 of 2130) PASS: lldb-unit :: ScriptInterpreter/Python/./ScriptInterpreterPythonTests/PythonDataObjectsTest.TestOwnedReferences (1743 of 2130) PASS: lldb-api :: commands/reproducer/invalid-args/TestInvalidArgsReproducer.py (1744 of 2130) PASS: lldb-api :: commands/expression/dont_allow_jit/TestAllowJIT.py (1745 of 2130) PASS: lldb-api :: lang/objc/forward-decl/TestForwardDecl.py (1746 of 2130) PASS: lldb-api :: sample_test/TestSampleTest.py (1747 of 2130) PASS: lldb-unit :: Language/Highlighting/./HighlighterTests/HighlighterTest.ClangIdentifiers (1748 of 2130) UNSUPPORTED: lldb-shell :: SymbolFile/PDB/calling-conventions.test (1749 of 2130) PASS: lldb-unit :: DataFormatter/./LLDBFormatterTests/TypeMatcherTests.GetMatchStringRegex (1750 of 2130) PASS: lldb-unit :: Language/Highlighting/./HighlighterTests/HighlighterTest.ClangUnterminatedString (1751 of 2130) PASS: lldb-unit :: Utility/./UtilityTests/StringExtractorTest.GetHexBytes_Underflow (1752 of 2130) PASS: lldb-api :: commands/expression/import-std-module/conflicts/TestStdModuleWithConflicts.py (1753 of 2130) PASS: lldb-api :: python_api/sbdata/TestSBData.py (1754 of 2130) PASS: lldb-unit :: Target/./TargetTests/MemoryRegionInfoTest.Formatv (1755 of 2130) PASS: lldb-shell :: Driver/TestPositionalArgs.test (1756 of 2130) PASS: lldb-shell :: ObjectFile/MachO/subsections.yaml (1757 of 2130) PASS: lldb-shell :: SymbolFile/DWARF/dir-separator-windows.s (1758 of 2130) PASS: lldb-unit :: Utility/./UtilityTests/ArchSpecTest.YAML (1759 of 2130) PASS: lldb-unit :: SymbolFile/NativePDB/./SymbolFileNativePDBTests/PDBFPOProgramToDWARFExpressionTests.SingleAssignmentRegisterRef (1760 of 2130) PASS: lldb-api :: lang/objc/modules-app-update/TestClangModulesAppUpdate.py (1761 of 2130) PASS: lldb-unit :: Utility/./UtilityTests/OptionsWithRawTest.SingleWordSuffix (1762 of 2130) PASS: lldb-api :: python_api/formatters/TestFormattersSBAPI.py (1763 of 2130) PASS: lldb-api :: commands/expression/import-std-module/sysroot/TestStdModuleSysroot.py (1764 of 2130) PASS: lldb-api :: functionalities/signal/handle-abrt/TestHandleAbort.py (1765 of 2130) PASS: lldb-api :: functionalities/data-formatter/data-formatter-objc/nsindexpath/TestDataFormatterNSIndexPath.py (1766 of 2130) PASS: lldb-shell :: SymbolFile/DWARF/DW_AT_loclists_base.s (1767 of 2130) PASS: lldb-unit :: DataFormatter/./LLDBFormatterTests/TypeMatcherTests.CreatedBySameMatchString (1768 of 2130) PASS: lldb-shell :: Breakpoint/debug_rnglistx_rlex.test (1769 of 2130) PASS: lldb-api :: commands/expression/multiline-completion/TestMultilineCompletion.py (1770 of 2130) PASS: lldb-api :: functionalities/thread/num_threads/TestNumThreads.py (1771 of 2130) PASS: lldb-unit :: Language/Highlighting/./HighlighterTests/HighlighterTest.ClangTrailingBackslashMissingNewLine (1772 of 2130) PASS: lldb-unit :: Expression/./ExpressionTests/DiagnosticManagerTest.GetStringMultipleDiags (1773 of 2130) PASS: lldb-unit :: Utility/./UtilityTests/ScalarTest.Promotion (1774 of 2130) PASS: lldb-api :: commands/expression/persist_objc_pointeetype/TestPersistObjCPointeeType.py (1775 of 2130) PASS: lldb-api :: lang/objc/objc-super/TestObjCSuper.py (1776 of 2130) PASS: lldb-unit :: Utility/./UtilityTests/LogChannelEnabledTest.LogThread (1777 of 2130) PASS: lldb-api :: lang/cpp/exceptions/TestCPPExceptionBreakpoints.py (1778 of 2130) PASS: lldb-unit :: Utility/./UtilityTests/FileSpecTest.Yaml (1779 of 2130) UNSUPPORTED: lldb-shell :: SymbolFile/DWARF/debug-types-expressions.test (1780 of 2130) PASS: lldb-unit :: debugserver/./debugserverTests/RNBSocket.LoopBackConnectIPv4 (1781 of 2130) PASS: lldb-unit :: Utility/./UtilityTests/StreamTest.AddressPrefixAndSuffix (1782 of 2130) UNSUPPORTED: lldb-shell :: Unwind/unwind-plan-dwarf-dump.test (1783 of 2130) PASS: lldb-api :: python_api/debugger/TestDebuggerAPI.py (1784 of 2130) PASS: lldb-unit :: Utility/./UtilityTests/StringExtractorTest.GetHexU8_Underflow (1785 of 2130) PASS: lldb-api :: python_api/sbplatform/TestSBPlatform.py (1786 of 2130) PASS: lldb-unit :: Symbol/./SymbolTests/TestTypeSystemClang.TestFunctionTemplateConstruction (1787 of 2130) PASS: lldb-unit :: Host/./HostTests/MainLoopTest.DetectsEOF (1788 of 2130) PASS: lldb-unit :: Process/minidump/./LLDBMinidumpTests/MinidumpParserTest.GetPid (1789 of 2130) PASS: lldb-unit :: Symbol/./SymbolTests/TestTypeSystemClang.TestRemoveFastQualifiers (1790 of 2130) PASS: lldb-api :: functionalities/thread/concurrent_events/TestConcurrentDelaySignalBreak.py (1791 of 2130) PASS: lldb-api :: functionalities/data-formatter/data-formatter-script/TestDataFormatterScript.py (1792 of 2130) UNSUPPORTED: lldb-shell :: SymbolFile/PDB/func-symbols.test (1793 of 2130) PASS: lldb-api :: commands/watchpoints/watchpoint_commands/condition/TestWatchpointConditionCmd.py (1794 of 2130) PASS: lldb-unit :: Host/./HostTests/FileSystemTest.Exists (1795 of 2130) PASS: lldb-unit :: UnwindAssembly/x86/./UnwindAssemblyx86Tests/Testx86AssemblyInspectionEngine.TestPopRBPWithREX (1796 of 2130) PASS: lldb-unit :: Process/gdb-remote/./ProcessGdbRemoteTests/GDBRemoteCommunicationClientTest.SyncThreadState (1797 of 2130) PASS: lldb-api :: python_api/interpreter/TestCommandInterpreterAPI.py (1798 of 2130) PASS: lldb-unit :: Utility/./UtilityTests/StreamTest.QuotedCString (1799 of 2130) PASS: lldb-api :: lang/objcxx/objcxx-ivar-vector/TestIvarVector.py (1800 of 2130) PASS: lldb-unit :: Utility/./UtilityTests/CompletionRequest.ShiftArguments (1801 of 2130) PASS: lldb-unit :: Utility/./UtilityTests/UriParserTest.BracketedHostnameWithPortIPv4 (1802 of 2130) PASS: lldb-unit :: Utility/./UtilityTests/StreamTest.PutCStringWithStringRef (1803 of 2130) PASS: lldb-shell :: SymbolFile/DWARF/debug-types-address-ranges.s (1804 of 2130) PASS: lldb-api :: functionalities/thread/concurrent_events/TestConcurrentCrashWithWatchpointBreakpointSignal.py (1805 of 2130) PASS: lldb-unit :: Utility/./UtilityTests/BinaryStreamTest.PutSLEB128ThreeBytes (1806 of 2130) PASS: lldb-api :: lang/c/conflicting-symbol/TestConflictingSymbol.py (1807 of 2130) PASS: lldb-unit :: Utility/./UtilityTests/NameMatchesTest.RegularExpression (1808 of 2130) PASS: lldb-unit :: Utility/./UtilityTests/StreamTeeTest.GetStreamAtIndexOutOfBounds (1809 of 2130) PASS: lldb-api :: lang/objc/foundation/TestConstStrings.py (1810 of 2130) UNSUPPORTED: lldb-api :: functionalities/unwind/standard/TestStandardUnwind.py (1811 of 2130) PASS: lldb-unit :: Utility/./UtilityTests/StreamTest.AddressRange (1812 of 2130) PASS: lldb-api :: commands/frame/diagnose/dereference-this/TestDiagnoseDereferenceThis.py (1813 of 2130) PASS: lldb-api :: functionalities/data-formatter/data-formatter-synthval/TestDataFormatterSynthVal.py (1814 of 2130) PASS: lldb-api :: tools/lldb-server/inferior-crash/TestGdbRemoteAbort.py (1815 of 2130) PASS: lldb-unit :: Utility/./UtilityTests/CompletionRequest.TryCompleteCurrentArgMode (1816 of 2130) PASS: lldb-unit :: Utility/./UtilityTests/ArchSpecTest.Compatibility (1817 of 2130) PASS: lldb-api :: macosx/duplicate-archive-members/TestDuplicateMembers.py (1818 of 2130) PASS: lldb-api :: functionalities/data-formatter/data-formatter-enum-format/TestDataFormatterEnumFormat.py (1819 of 2130) PASS: lldb-unit :: Host/./HostTests/FileSystemTest.EnumerateDirectory (1820 of 2130) PASS: lldb-api :: functionalities/optimized_code/TestNoASanExceptionAfterEvalOP_piece.py (1821 of 2130) PASS: lldb-unit :: Utility/./UtilityTests/ConstStringTest.CompareStringRef (1822 of 2130) PASS: lldb-unit :: Expression/./ExpressionTests/DWARFExpression.DW_OP_pick (1823 of 2130) PASS: lldb-unit :: Utility/./UtilityTests/StringListTest.CopyListSingle (1824 of 2130) PASS: lldb-api :: commands/statistics/basic/TestStats.py (1825 of 2130) PASS: lldb-shell :: Reproducer/TestCaptureEnvOverride.test (1826 of 2130) PASS: lldb-api :: functionalities/memory/find/TestMemoryFind.py (1827 of 2130) PASS: lldb-unit :: Utility/./UtilityTests/StatusTest.ErrorCodeConstructor (1828 of 2130) PASS: lldb-api :: commands/expression/import-std-module/empty-module/TestEmptyStdModule.py (1829 of 2130) PASS: lldb-shell :: Reproducer/TestGDBRemoteRepro.test (1830 of 2130) PASS: lldb-unit :: Process/minidump/./LLDBMinidumpTests/MinidumpParserTest.GetArchitectureWindows (1831 of 2130) UNSUPPORTED: lldb-api :: functionalities/darwin_log/basic/TestDarwinLogBasic.py (1832 of 2130) PASS: lldb-shell :: SymbolFile/DWARF/debug-types-basic.test (1833 of 2130) PASS: lldb-api :: functionalities/data-formatter/data-formatter-stl/libcxx/queue/TestDataFormatterLibcxxQueue.py (1834 of 2130) PASS: lldb-unit :: Symbol/./SymbolTests/TestClangASTImporter.CanImportInvalidType (1835 of 2130) PASS: lldb-api :: functionalities/breakpoint/breakpoint_ignore_count/TestBreakpointIgnoreCount.py (1836 of 2130) PASS: lldb-api :: python_api/watchpoint/TestSetWatchpoint.py (1837 of 2130) PASS: lldb-shell :: Breakpoint/ppc64-localentry.test (1838 of 2130) PASS: lldb-api :: tools/lldb-server/TestLldbGdbServer.py (1839 of 2130) PASS: lldb-api :: lang/cpp/namespace/TestNamespaceLookup.py (1840 of 2130) PASS: lldb-unit :: Utility/./UtilityTests/ScalarTest.Getters (1841 of 2130) PASS: lldb-unit :: Utility/./UtilityTests/ArgsTest.TestSingleArgWithQuotedSpace (1842 of 2130) PASS: lldb-unit :: Utility/./UtilityTests/StringListTest.InsertStringAtIndexStart (1843 of 2130) PASS: lldb-unit :: Utility/./UtilityTests/RegularExpression.Valid (1844 of 2130) PASS: lldb-unit :: debugserver/./debugserverTests/RNBSocket.LoopBackConnectIPv6 (1845 of 2130) PASS: lldb-api :: sanity/TestModuleCacheSanity.py (1846 of 2130) PASS: lldb-unit :: Process/gdb-remote/./ProcessGdbRemoteTests/GDBRemoteClientBaseTest.SendPacketAndReceiveResponseWithOutputSupport (1847 of 2130) PASS: lldb-unit :: Utility/./UtilityTests/LogTest.Unregister (1848 of 2130) PASS: lldb-api :: functionalities/tail_call_frames/inlining_and_tail_calls/TestInliningAndTailCalls.py (1849 of 2130) PASS: lldb-api :: iohandler/autosuggestion/TestAutosuggestion.py (1850 of 2130) PASS: lldb-api :: commands/watchpoints/step_over_watchpoint/TestStepOverWatchpoint.py (1851 of 2130) PASS: lldb-shell :: ObjectFile/ELF/netbsd-exec-8.99.30-amd64.yaml (1852 of 2130) PASS: lldb-shell :: ObjectFile/ELF/aarch64-relocations.yaml (1853 of 2130) PASS: lldb-unit :: Expression/./ExpressionTests/CppModuleConfigurationTest.Linux (1854 of 2130) PASS: lldb-unit :: Process/minidump/./LLDBMinidumpTests/MinidumpParserTest.FindMemoryRange (1855 of 2130) PASS: lldb-unit :: Utility/./UtilityTests/StringListTest.RemoveBlankLines (1856 of 2130) PASS: lldb-unit :: Utility/./UtilityTests/StreamTest.PutBytesAsRawHex8ToMixedEndian (1857 of 2130) PASS: lldb-shell :: Breakpoint/jitbp_elf.test (1858 of 2130) PASS: lldb-api :: api/check_public_api_headers/TestPublicAPIHeaders.py (1859 of 2130) PASS: lldb-api :: commands/expression/test/TestExprs2.py (1860 of 2130) PASS: lldb-unit :: Utility/./UtilityTests/StreamTest.ChangingByteOrder (1861 of 2130) PASS: lldb-api :: lang/objc/objc-new-syntax/TestObjCNewSyntaxLiteral.py (1862 of 2130) PASS: lldb-api :: commands/expression/import-std-module/unique_ptr-dbg-info-content/TestUniquePtrDbgInfoContent.py (1863 of 2130) PASS: lldb-unit :: Host/./HostTests/HostInfoTest.GetAugmentedArchSpec (1864 of 2130) PASS: lldb-unit :: Utility/./UtilityTests/XcodeSDKTest.GetSDKTypeForTriple (1865 of 2130) PASS: lldb-api :: lang/cpp/virtual-functions/TestCppVirtualFunctions.py (1866 of 2130) PASS: lldb-unit :: Language/Highlighting/./HighlighterTests/HighlighterTest.Colons (1867 of 2130) PASS: lldb-unit :: Utility/./UtilityTests/ArgsTest.ReplaceArgumentAtIndexEqual (1868 of 2130) PASS: lldb-unit :: Process/minidump/./LLDBMinidumpTests/MinidumpParserTest.GetMemoryRegionInfoFromMemory64List (1869 of 2130) PASS: lldb-unit :: Breakpoint/./LLDBBreakpointTests/BreakpointIDTest.StringIsBreakpointName (1870 of 2130) PASS: lldb-unit :: ObjectFile/Breakpad/./ObjectFileBreakpadTests/ModuleRecord.parse (1871 of 2130) PASS: lldb-unit :: ObjectFile/Breakpad/./ObjectFileBreakpadTests/PublicRecord.parse (1872 of 2130) PASS: lldb-api :: commands/expression/formatters/TestFormatters.py (1873 of 2130) PASS: lldb-unit :: Language/Highlighting/./HighlighterTests/HighlighterTest.ClangBraces (1874 of 2130) PASS: lldb-api :: functionalities/data-formatter/synthcapping/TestSyntheticCapping.py (1875 of 2130) PASS: lldb-unit :: Utility/./UtilityTests/ListenerTest.GetEventWait (1876 of 2130) PASS: lldb-api :: lang/objc/modules-cache/TestClangModulesCache.py (1877 of 2130) UNSUPPORTED: lldb-api :: functionalities/tty/TestTerminal.py (1878 of 2130) PASS: lldb-api :: lang/objc/foundation/TestObjCMethodsNSError.py (1879 of 2130) PASS: lldb-api :: functionalities/lazy-loading/TestLazyLoading.py (1880 of 2130) PASS: lldb-unit :: Disassembler/./DisassemblerTests/TestArmv7Disassembly.TestCortexFPDisass (1881 of 2130) PASS: lldb-unit :: Utility/./UtilityTests/ConstStringTest.MangledCounterpart (1882 of 2130) PASS: lldb-api :: functionalities/breakpoint/hardware_breakpoints/require_hw_breakpoints/TestRequireHWBreakpoints.py (1883 of 2130) PASS: lldb-unit :: Utility/./UtilityTests/StreamTest.AddressPrefix (1884 of 2130) PASS: lldb-unit :: Utility/./UtilityTests/OptionsWithRawTest.ArgsButNoDelimiter (1885 of 2130) PASS: lldb-shell :: Process/UnsupportedLanguage.test (1886 of 2130) PASS: lldb-shell :: SymbolFile/DWARF/debug-types-dwo-cross-reference.cpp (1887 of 2130) PASS: lldb-unit :: UnwindAssembly/x86/./UnwindAssemblyx86Tests/Testx86AssemblyInspectionEngine.TestSubRSP (1888 of 2130) PASS: lldb-unit :: Utility/./UtilityTests/RangeTest.SizeTypes (1889 of 2130) PASS: lldb-unit :: Utility/./UtilityTests/StreamTeeTest.Write (1890 of 2130) PASS: lldb-api :: iohandler/resize/TestIOHandlerResize.py (1891 of 2130) UNSUPPORTED: lldb-api :: functionalities/darwin_log/source/debug/TestDarwinLogSourceDebug.py (1892 of 2130) PASS: lldb-api :: functionalities/data-formatter/compactvectors/TestCompactVectors.py (1893 of 2130) PASS: lldb-unit :: Process/gdb-remote/./ProcessGdbRemoteTests/GDBRemoteCommunicationClientTest.GetMemoryRegionInfoInvalidResponse (1894 of 2130) PASS: lldb-unit :: ScriptInterpreter/Python/./ScriptInterpreterPythonTests/PythonDataObjectsTest.TestInstanceNameResolutionNoDot (1895 of 2130) PASS: lldb-shell :: Heap/heap-cstr.test (1896 of 2130) PASS: lldb-api :: tools/lldb-server/TestGdbRemoteHostInfo.py (1897 of 2130) PASS: lldb-unit :: Utility/./UtilityTests/StringLexerTest.Next (1898 of 2130) PASS: lldb-unit :: debugserver/./debugserverTests/RNBSocket.LoopBackListenIPv4 (1899 of 2130) PASS: lldb-unit :: DataFormatter/./LLDBFormatterTests/TypeMatcherTests.RegexMatchPart (1900 of 2130) PASS: lldb-api :: commands/expression/deleting-implicit-copy-constructor/TestDeletingImplicitCopyConstructor.py (1901 of 2130) PASS: lldb-shell :: SymbolFile/DWARF/debug-line-basic.s (1902 of 2130) PASS: lldb-api :: commands/frame/diagnose/complicated-expression/TestComplicatedExpression.py (1903 of 2130) PASS: lldb-unit :: Utility/./UtilityTests/UriParserTest.SchemeHostSeparator (1904 of 2130) PASS: lldb-api :: python_api/process/read-mem-cstring/TestReadMemCString.py (1905 of 2130) PASS: lldb-api :: python_api/interpreter/TestRunCommandInterpreterAPI.py (1906 of 2130) PASS: lldb-unit :: Utility/./UtilityTests/SharedCluster.ClusterManager (1907 of 2130) PASS: lldb-unit :: Utility/./UtilityTests/StringExtractorTest.GetHexU8_Underflow2_NoEof (1908 of 2130) PASS: lldb-api :: commands/watchpoints/watchpoint_commands/command/TestWatchpointCommandPython.py (1909 of 2130) PASS: lldb-api :: functionalities/data-formatter/data-formatter-stl/libcxx/set/TestDataFormatterLibcxxSet.py (1910 of 2130) PASS: lldb-unit :: Utility/./UtilityTests/StreamTest.PutCharWhitespace (1911 of 2130) PASS: lldb-api :: api/multithreaded/TestMultithreaded.py (1912 of 2130) PASS: lldb-unit :: Process/gdb-remote/./ProcessGdbRemoteTests/GDBRemoteCommunicationTest.ReadPacket_checksum (1913 of 2130) PASS: lldb-unit :: Utility/./UtilityTests/UriParserTest.BadPort2 (1914 of 2130) PASS: lldb-api :: lang/cpp/incomplete-types/TestCppIncompleteTypes.py (1915 of 2130) PASS: lldb-api :: functionalities/testid/TestTestId.py (1916 of 2130) PASS: lldb-api :: functionalities/thread/concurrent_events/TestConcurrentBreakpointDelayBreakpointOneSignal.py (1917 of 2130) PASS: lldb-shell :: ObjectFile/ELF/PT_TLS-overlap-PT_LOAD.yaml (1918 of 2130) PASS: lldb-api :: functionalities/data-formatter/data-formatter-objc/TestDataFormatterObjCKVO.py (1919 of 2130) PASS: lldb-api :: lang/objc/radar-9691614/TestObjCMethodReturningBOOL.py (1920 of 2130) PASS: lldb-api :: tools/lldb-vscode/attach/TestVSCode_attach.py (1921 of 2130) PASS: lldb-unit :: Utility/./UtilityTests/StringExtractorTest.GetHexBytesAvail_OddPair (1922 of 2130) PASS: lldb-shell :: Driver/TestConvenienceVariables.test (1923 of 2130) PASS: lldb-shell :: Quit/TestQuitExitCode30.test (1924 of 2130) PASS: lldb-shell :: Commands/command-script-import.test (1925 of 2130) PASS: lldb-unit :: Utility/./UtilityTests/UriParserTest.BadPort (1926 of 2130) PASS: lldb-unit :: Utility/./UtilityTests/ConstStringTest.NullAndEmptyStates (1927 of 2130) PASS: lldb-unit :: Expression/./ExpressionTests/DiagnosticManagerTest.PutString (1928 of 2130) PASS: lldb-unit :: Utility/./UtilityTests/LogChannelEnabledTest.LogGetLogThread (1929 of 2130) PASS: lldb-api :: commands/expression/call-function/TestCallStopAndContinue.py (1930 of 2130) PASS: lldb-api :: tools/lldb-server/TestGdbRemoteExitCode.py (1931 of 2130) PASS: lldb-api :: lang/c/anonymous/TestAnonymous.py (1932 of 2130) PASS: lldb-unit :: Process/gdb-remote/./ProcessGdbRemoteTests/GDBRemoteCommunicationClientTest.TestPacketSpeedJSON (1933 of 2130) PASS: lldb-shell :: SymbolFile/NativePDB/locate-pdb.cpp (1934 of 2130) PASS: lldb-unit :: Utility/./UtilityTests/StringExtractorTest.GetHexU8_InvalidHex (1935 of 2130) PASS: lldb-unit :: Platform/./LLDBPlatformTests/PlatformAppleSimulatorTest.TestSimHasSimEnvionament (1936 of 2130) PASS: lldb-unit :: Utility/./UtilityTests/StreamTeeTest.CopyConstructor (1937 of 2130) UNSUPPORTED: lldb-api :: commands/target/auto-install-main-executable/TestAutoInstallMainExecutable.py (1938 of 2130) PASS: lldb-api :: lang/cpp/typeof/TestTypeOfDeclTypeExpr.py (1939 of 2130) PASS: lldb-shell :: Breakpoint/case-sensitive.test (1940 of 2130) PASS: lldb-unit :: Utility/./UtilityTests/RangeDataVector.FindEntryThatContains (1941 of 2130) PASS: lldb-unit :: Expression/./ExpressionTests/DiagnosticManagerTest.GetStringSeverityLabels (1942 of 2130) PASS: lldb-shell :: Unwind/eh-frame-dwarf-unwind.test (1943 of 2130) PASS: lldb-unit :: Process/gdb-remote/./ProcessGdbRemoteTests/GDBRemoteCommunicationServerTest.SendErrorResponse_UnimplementedError (1944 of 2130) UNSUPPORTED: lldb-api :: lang/c/typedef/Testtypedef.py (1945 of 2130) PASS: lldb-shell :: Settings/TestDisableColor.test (1946 of 2130) PASS: lldb-unit :: UnwindAssembly/x86/./UnwindAssemblyx86Tests/Testx86AssemblyInspectionEngine.TestSpArithx86_64Augmented (1947 of 2130) PASS: lldb-unit :: Utility/./UtilityTests/StringExtractorTest.GetNameColonValueContainsColon (1948 of 2130) PASS: lldb-unit :: SymbolFile/NativePDB/./SymbolFileNativePDBTests/PDBFPOProgramToDWARFExpressionTests.UnresolvedCyclicRegisterAssignmentReference (1949 of 2130) PASS: lldb-api :: functionalities/pre_run_dylibs/TestPreRunDylibs.py (1950 of 2130) PASS: lldb-shell :: Driver/TestHelp.test (1951 of 2130) PASS: lldb-shell :: Quit/TestQuitExitCodeHexA.test (1952 of 2130) PASS: lldb-unit :: Utility/./UtilityTests/ArgsTest.ReplaceArgumentAtIndexLonger (1953 of 2130) PASS: lldb-unit :: Utility/./UtilityTests/StreamTest.PutULEB128 (1954 of 2130) PASS: lldb-shell :: Minidump/dump-all.test (1955 of 2130) PASS: lldb-api :: lang/cpp/this/TestCPPThis.py (1956 of 2130) PASS: lldb-api :: functionalities/float-display/TestFloatDisplay.py (1957 of 2130) PASS: lldb-unit :: Utility/./UtilityTests/StringListTest.PopBack (1958 of 2130) PASS: lldb-unit :: Utility/./UtilityTests/StreamTest.PutMaxHex64ByteOrderBig (1959 of 2130) PASS: lldb-api :: functionalities/thread/exit_during_expression/TestExitDuringExpression.py (1960 of 2130) PASS: lldb-api :: functionalities/thread/concurrent_events/TestConcurrentCrashWithWatchpoint.py (1961 of 2130) PASS: lldb-api :: functionalities/process_crash_info/TestProcessCrashInfo.py (1962 of 2130) UNSUPPORTED: lldb-shell :: SymbolFile/PDB/ast-restore.test (1963 of 2130) PASS: lldb-api :: functionalities/thread/concurrent_events/TestConcurrentSignalWatch.py (1964 of 2130) PASS: lldb-unit :: ScriptInterpreter/Python/./ScriptInterpreterPythonTests/PythonDataObjectsTest.TestPythonListValueEquality (1965 of 2130) PASS: lldb-shell :: SymbolFile/DWARF/DW_TAG_variable-DW_AT_const_value.s (1966 of 2130) PASS: lldb-unit :: Utility/./UtilityTests/AnsiTerminal.AtEnd (1967 of 2130) PASS: lldb-unit :: ScriptInterpreter/Python/./ScriptInterpreterPythonTests/PythonDataObjectsTest.TestPythonTupleInitializerList (1968 of 2130) PASS: lldb-unit :: ScriptInterpreter/Python/./ScriptInterpreterPythonTests/PythonDataObjectsTest.TestPythonBoolean (1969 of 2130) PASS: lldb-unit :: Utility/./UtilityTests/StringListTest.GetMaxStringLengthEqualSize (1970 of 2130) PASS: lldb-shell :: ObjectFile/ELF/build-id-case.yaml (1971 of 2130) PASS: lldb-api :: functionalities/tsan/cpp_global_location/TestTsanCPPGlobalLocation.py (1972 of 2130) UNSUPPORTED: lldb-shell :: ObjectFile/ELF/minidebuginfo-no-lzma.yaml (1973 of 2130) UNSUPPORTED: lldb-api :: benchmarks/stepping/TestSteppingSpeed.py (1974 of 2130) PASS: lldb-unit :: Language/CPlusPlus/./LanguageCPlusPlusTests/CPlusPlusLanguage.FindAlternateFunctionManglings (1975 of 2130) PASS: lldb-api :: functionalities/thread/concurrent_events/TestConcurrentTwoWatchpointsOneBreakpoint.py (1976 of 2130) PASS: lldb-unit :: Process/minidump/./LLDBMinidumpTests/MinidumpParserTest.GetExceptionStream (1977 of 2130) PASS: lldb-unit :: Symbol/./SymbolTests/PostfixExpression.ParseOneExpression (1978 of 2130) UNSUPPORTED: lldb-api :: functionalities/process_save_core/TestProcessSaveCore.py (1979 of 2130) PASS: lldb-unit :: Language/Highlighting/./HighlighterTests/HighlighterTest.ClangScalarLiterals (1980 of 2130) PASS: lldb-unit :: SymbolFile/NativePDB/./SymbolFileNativePDBTests/PDBFPOProgramToDWARFExpressionTests.DependencyChain (1981 of 2130) PASS: lldb-unit :: ScriptInterpreter/Python/./ScriptInterpreterPythonTests/PythonDataObjectsTest.TestPythonInteger (1982 of 2130) PASS: lldb-unit :: tools/lldb-server/tests/./LLDBServerTests/StandardStartupTest.TestStopReplyContainsThreadPcs (1983 of 2130) PASS: lldb-unit :: Utility/./UtilityTests/UriParserTest.Minimal (1984 of 2130) PASS: lldb-shell :: ObjectFile/wasm/basic.yaml (1985 of 2130) PASS: lldb-unit :: Symbol/./SymbolTests/TestTypeSystemClang.TestGetBasicTypeFromEnum (1986 of 2130) PASS: lldb-api :: commands/watchpoints/watchpoint_set_command/TestWatchLocationWithWatchSet.py (1987 of 2130) PASS: lldb-api :: commands/gui/invalid-args/TestInvalidArgsGui.py (1988 of 2130) PASS: lldb-unit :: Process/gdb-remote/./ProcessGdbRemoteTests/GDBRemoteCommunicationClientTest.WriteRegisterNoSuffix (1989 of 2130) PASS: lldb-unit :: Utility/./UtilityTests/StringExtractorTest.DecodeHexU8_InvalidHex (1990 of 2130) PASS: lldb-unit :: Process/gdb-remote/./ProcessGdbRemoteTests/GDBRemoteCommunicationServerTest.SendErrorResponse_ErrorNumber (1991 of 2130) PASS: lldb-unit :: Utility/./UtilityTests/RangeTest.DoesIntersect (1992 of 2130) PASS: lldb-unit :: Utility/./UtilityTests/StringListTest.Assignment (1993 of 2130) PASS: lldb-api :: lang/cpp/char8_t/TestCxxChar8_t.py (1994 of 2130) PASS: lldb-api :: functionalities/data-formatter/varscript_formatting/TestDataFormatterVarScriptFormatting.py (1995 of 2130) PASS: lldb-api :: commands/expression/call-function/TestCallStdStringFunction.py (1996 of 2130) PASS: lldb-api :: lang/cpp/call-function/TestCallCPPFunction.py (1997 of 2130) PASS: lldb-api :: commands/expression/entry-bp/TestExprEntryBP.py (1998 of 2130) PASS: lldb-api :: lang/cpp/class-template-parameter-pack/TestClassTemplateParameterPack.py (1999 of 2130) PASS: lldb-unit :: Utility/./UtilityTests/StringListTest.GetSize (2000 of 2130) PASS: lldb-unit :: Utility/./UtilityTests/StringListTest.GetMaxStringLengthIncreasingSize (2001 of 2130) PASS: lldb-api :: functionalities/thread/step_until/TestStepUntil.py (2002 of 2130) PASS: lldb-api :: python_api/watchpoint/watchlocation/TestSetWatchlocation.py (2003 of 2130) PASS: lldb-unit :: Symbol/./SymbolTests/TestClangASTImporter.DeportDeclTagDecl (2004 of 2130) PASS: lldb-api :: commands/expression/import-std-module/deque-basic/TestDequeFromStdModule.py (2005 of 2130) UNSUPPORTED: lldb-api :: functionalities/darwin_log/filter/regex/category/TestDarwinLogFilterRegexCategory.py (2006 of 2130) PASS: lldb-unit :: Utility/./UtilityTests/NameMatchesTest.EndsWith (2007 of 2130) PASS: lldb-api :: tools/lldb-vscode/breakpoint/TestVSCode_setBreakpoints.py (2008 of 2130) PASS: lldb-api :: commands/expression/char/TestExprsChar.py (2009 of 2130) PASS: lldb-api :: functionalities/data-formatter/builtin-formats/TestBuiltinFormats.py (2010 of 2130) PASS: lldb-unit :: Utility/./UtilityTests/ArchSpecTest.TestSetTriple (2011 of 2130) PASS: lldb-api :: functionalities/data-formatter/data-formatter-synth/TestDataFormatterSynth.py (2012 of 2130) PASS: lldb-shell :: Driver/TestCommands.test (2013 of 2130) PASS: lldb-api :: functionalities/tail_call_frames/ambiguous_tail_call_seq2/TestAmbiguousTailCallSeq2.py (2014 of 2130) PASS: lldb-unit :: Utility/./UtilityTests/StreamTest.AddressRangeSize (2015 of 2130) PASS: lldb-api :: functionalities/tail_call_frames/sbapi_support/TestTailCallFrameSBAPI.py (2016 of 2130) PASS: lldb-shell :: Unwind/thread-step-out-ret-addr-check.test (2017 of 2130) UNSUPPORTED: lldb-api :: functionalities/darwin_log/format/TestDarwinLogMessageFormat.py (2018 of 2130) PASS: lldb-unit :: Utility/./UtilityTests/CompletionRequest.TryCompleteCurrentArgBad (2019 of 2130) PASS: lldb-unit :: Host/./HostTests/File.GetWaitableHandleFileno (2020 of 2130) PASS: lldb-shell :: Minidump/Windows/Sigsegv/sigsegv.test (2021 of 2130) PASS: lldb-shell :: Settings/TestSettingsSet.test (2022 of 2130) PASS: lldb-unit :: Utility/./UtilityTests/RangeTest.Union (2023 of 2130) XFAIL: lldb-shell :: Unwind/prefer-debug-over-eh-frame.test (2024 of 2130) PASS: lldb-unit :: Utility/./UtilityTests/StreamTeeTest.Constructor2Streams (2025 of 2130) PASS: lldb-shell :: SymbolFile/Breakpad/unwind-via-raSearch.test (2026 of 2130) PASS: lldb-unit :: Utility/./UtilityTests/Flags.Reset (2027 of 2130) PASS: lldb-unit :: Utility/./UtilityTests/StringExtractorTest.DecodeHexU8_Underflow (2028 of 2130) PASS: lldb-shell :: Commands/command-disassemble-process.yaml (2029 of 2130) PASS: lldb-unit :: Symbol/./SymbolTests/SymbolsTest.TerminateLocateExecutableSymbolFileForUnknownExecutableAndUnknownSymbolFile (2030 of 2130) PASS: lldb-api :: functionalities/data-formatter/data-formatter-disabling/TestDataFormatterDisabling.py (2031 of 2130) PASS: lldb-api :: functionalities/ubsan/basic/TestUbsanBasic.py (2032 of 2130) UNSUPPORTED: lldb-api :: commands/watchpoints/variable_out_of_scope/TestWatchedVarHitWhenInScope.py (2033 of 2130) PASS: lldb-shell :: Reproducer/TestRelativePath.test (2034 of 2130) PASS: lldb-api :: commands/expression/radar_9673664/TestExprHelpExamples.py (2035 of 2130) PASS: lldb-unit :: Utility/./UtilityTests/EnvironmentTest.EnvpConversion (2036 of 2130) PASS: lldb-unit :: SymbolFile/NativePDB/./SymbolFileNativePDBTests/PDBFPOProgramToDWARFExpressionTests.InvalidAssignmentMultiple (2037 of 2130) PASS: lldb-unit :: Utility/./UtilityTests/RangeTest.Equal (2038 of 2130) UNSUPPORTED: lldb-api :: functionalities/longjmp/TestLongjmp.py (2039 of 2130) PASS: lldb-unit :: Symbol/./SymbolTests/Type.GetTypeScopeAndBasename (2040 of 2130) PASS: lldb-api :: lang/cpp/char1632_t/TestChar1632T.py (2041 of 2130) UNSUPPORTED: lldb-api :: functionalities/unwind/ehframe/TestEhFrameUnwind.py (2042 of 2130) PASS: lldb-api :: functionalities/breakpoint/breakpoint_set_restart/TestBreakpointSetRestart.py (2043 of 2130) PASS: lldb-api :: functionalities/load_unload/TestLoadUnload.py (2044 of 2130) PASS: lldb-unit :: Utility/./UtilityTests/LogChannelTest.List (2045 of 2130) PASS: lldb-shell :: ObjectFile/Breakpad/sections-trailing-func.test (2046 of 2130) PASS: lldb-unit :: Language/Highlighting/./HighlighterTests/HighlighterTest.ClangStringLiterals (2047 of 2130) PASS: lldb-api :: python_api/default-constructor/TestDefaultConstructorForAPIObjects.py (2048 of 2130) PASS: lldb-unit :: Utility/./UtilityTests/StreamTest.PutHex8 (2049 of 2130) PASS: lldb-api :: functionalities/type_lookup/TestTypeLookup.py (2050 of 2130) PASS: lldb-unit :: Target/./TargetTests/ExecutionContextTest.GetByteOrder (2051 of 2130) PASS: lldb-api :: functionalities/data-formatter/nsarraysynth/TestNSArraySynthetic.py (2052 of 2130) PASS: lldb-unit :: Symbol/./SymbolTests/DWARFCallFrameInfoTest.Basic_dwarf4 (2053 of 2130) PASS: lldb-shell :: SymbolFile/DWARF/DW_AT_low_pc-addrx.s (2054 of 2130) PASS: lldb-unit :: SymbolFile/DWARF/./SymbolFileDWARFTests/SymbolFileDWARFTests.TestAbilitiesForDWARF (2055 of 2130) PASS: lldb-api :: python_api/value/empty_class/TestValueAPIEmptyClass.py (2056 of 2130) PASS: lldb-unit :: Process/gdb-remote/./ProcessGdbRemoteTests/GDBRemoteClientBaseTest.SendContinueAndAsyncSignal (2057 of 2130) PASS: lldb-api :: functionalities/tail_call_frames/disambiguate_paths_to_common_sink/TestDisambiguatePathsToCommonSink.py (2058 of 2130) PASS: lldb-api :: commands/expression/import-std-module/deque-dbg-info-content/TestDbgInfoContentDequeFromStdModule.py (2059 of 2130) PASS: lldb-api :: functionalities/inferior-crashing/recursive-inferior/TestRecursiveInferiorStep.py (2060 of 2130) PASS: lldb-unit :: Expression/./ExpressionTests/ClangExpressionDeclMapTest.TestUnknownIdentifierLookup (2061 of 2130) PASS: lldb-unit :: Host/./HostTests/NativeProcessProtocolTest.SetBreakpoint (2062 of 2130) PASS: lldb-unit :: ObjectFile/MachO/./ObjectFileMachOTests/ObjectFileMachOTest.ModuleFromSharedCacheInfo (2063 of 2130) UNSUPPORTED: lldb-api :: linux/mix-dwo-and-regular-objects/TestMixedDwarfBinary.py (2064 of 2130) PASS: lldb-shell :: SymbolFile/DWARF/debug_line-relative_path.s (2065 of 2130) PASS: lldb-unit :: Utility/./UtilityTests/ScalarTest.TruncOrExtendTo (2066 of 2130) PASS: lldb-api :: lang/objc/foundation/TestObjectDescriptionAPI.py (2067 of 2130) PASS: lldb-api :: commands/platform/file/read/TestPlatformFileRead.py (2068 of 2130) PASS: lldb-unit :: Utility/./UtilityTests/GeneratorTest.Create (2069 of 2130) PASS: lldb-api :: functionalities/type_completion/TestTypeCompletion.py (2070 of 2130) PASS: lldb-unit :: Host/./HostTests/HostInfoTest.GetXcodeSDK (2071 of 2130) PASS: lldb-api :: functionalities/data-formatter/data-formatter-skip-summary/TestDataFormatterSkipSummary.py (2072 of 2130) PASS: lldb-unit :: Utility/./UtilityTests/ProcessInstanceInfo.DumpTable (2073 of 2130) UNSUPPORTED: lldb-api :: functionalities/data-formatter/data-formatter-stl/libstdcpp/iterator/TestDataFormatterStdIterator.py (2074 of 2130) PASS: lldb-api :: functionalities/tsan/thread_numbers/TestTsanThreadNumbers.py (2075 of 2130) PASS: lldb-api :: commands/expression/anonymous-struct/TestCallUserAnonTypedef.py (2076 of 2130) PASS: lldb-api :: lang/c/offsetof/TestOffsetof.py (2077 of 2130) UNSUPPORTED: lldb-api :: tools/lldb-vscode/disconnect/TestVSCode_disconnect.py (2078 of 2130) PASS: lldb-unit :: Core/./LLDBCoreTests/ModuleSpecTest.InvalidInMemoryBufferValidFile (2079 of 2130) PASS: lldb-api :: lang/cpp/function-qualifiers/TestCppFunctionQualifiers.py (2080 of 2130) PASS: lldb-shell :: SymbolFile/DWARF/debug-types-signature-loop.s (2081 of 2130) PASS: lldb-unit :: Host/./HostTests/NativeProcessProtocolTest.SetBreakpointFailVerify (2082 of 2130) PASS: lldb-unit :: Utility/./UtilityTests/RangeTest.Constructor (2083 of 2130) PASS: lldb-unit :: Expression/./ExpressionTests/DiagnosticManagerTest.AppendMessageNoDiag (2084 of 2130) PASS: lldb-unit :: debugserver/./debugserverTests/RNBSocket.LoopBackListenIPv6 (2085 of 2130) PASS: lldb-shell :: ObjectFile/ELF/minidebuginfo-corrupt-xz.yaml (2086 of 2130) PASS: lldb-unit :: Utility/./UtilityTests/ArgsTest.TestMultipleArgs (2087 of 2130) PASS: lldb-unit :: Process/minidump/./LLDBMinidumpTests/MinidumpParserTest.GetMiscInfoWindows (2088 of 2130) PASS: lldb-unit :: Language/Highlighting/./HighlighterTests/HighlighterTest.ClangCursorPosEndOfLine (2089 of 2130) PASS: lldb-api :: functionalities/thread/concurrent_events/TestConcurrentBreakpointsDelayedBreakpointOneWatchpoint.py (2090 of 2130) PASS: lldb-unit :: Expression/./ExpressionTests/DiagnosticManagerTest.AddDiagnostic (2091 of 2130) PASS: lldb-unit :: Utility/./UtilityTests/VMRange.ContainsRange (2092 of 2130) PASS: lldb-unit :: Utility/./UtilityTests/StringListTest.LongestCommonPrefixDuplicateElement (2093 of 2130) PASS: lldb-unit :: Symbol/./SymbolTests/TestTypeSystemClang.TestGetEnumIntegerTypeBasicTypes (2094 of 2130) PASS: lldb-shell :: Reproducer/TestCrash.test (2095 of 2130) PASS: lldb-api :: functionalities/data-formatter/data-formatter-stl/libcxx/tuple/TestDataFormatterLibcxxTuple.py (2096 of 2130) PASS: lldb-api :: lang/cpp/subst_template_type_param/TestSubstTemplateTypeParam.py (2097 of 2130) PASS: lldb-shell :: SymbolFile/DWARF/find-method-local-struct.cpp (2098 of 2130) PASS: lldb-api :: lang/cpp/class_static/TestStaticVariables.py (2099 of 2130) PASS: lldb-api :: functionalities/thread/concurrent_events/TestConcurrentManyCrash.py (2100 of 2130) PASS: lldb-unit :: ObjectFile/Breakpad/./ObjectFileBreakpadTests/FuncRecord.parse (2101 of 2130) PASS: lldb-api :: commands/expression/static-initializers/TestStaticInitializers.py (2102 of 2130) PASS: lldb-api :: terminal/TestEditline.py (2103 of 2130) PASS: lldb-api :: commands/expression/import-std-module/basic/TestImportStdModule.py (2104 of 2130) UNSUPPORTED: lldb-shell :: Unwind/eh-frame-small-fde.test (2105 of 2130) PASS: lldb-api :: functionalities/data-formatter/parray/TestPrintArray.py (2106 of 2130) PASS: lldb-api :: functionalities/data-formatter/data-formatter-objc/TestDataFormatterObjCCF.py (2107 of 2130) PASS: lldb-unit :: Utility/./UtilityTests/StringListTest.ForRange (2108 of 2130) UNSUPPORTED: lldb-api :: functionalities/data-formatter/data-formatter-stl/libstdcpp/vector/TestDataFormatterStdVector.py (2109 of 2130) PASS: lldb-unit :: Symbol/./SymbolTests/LineEntryTest.GetSameLineContiguousAddressRangeOneInline (2110 of 2130) PASS: lldb-api :: functionalities/data-formatter/data-formatter-stl/libcxx/list/TestDataFormatterLibcxxList.py (2111 of 2130) PASS: lldb-unit :: ScriptInterpreter/Python/./ScriptInterpreterPythonTests/PythonDataObjectsTest.TestPythonTupleToStructuredList (2112 of 2130) PASS: lldb-unit :: Process/gdb-remote/./ProcessGdbRemoteTests/GDBRemoteCommunicationClientTest.GetQOffsets (2113 of 2130) UNSUPPORTED: lldb-api :: benchmarks/continue/TestBenchmarkContinue.py (2114 of 2130) UNSUPPORTED: lldb-api :: python_api/event/TestEvents.py (2115 of 2130) PASS: lldb-shell :: ObjectFile/ELF/gnu-debuglink.yaml (2116 of 2130) PASS: lldb-api :: types/TestFloatTypesExpr.py (2117 of 2130) PASS: lldb-unit :: Symbol/./SymbolTests/TestTypeSystemClang.AddMethodToObjCObjectType (2118 of 2130) PASS: lldb-shell :: Reproducer/TestDriverOptions.test (2119 of 2130) PASS: lldb-shell :: VSCode/TestOptions.test (2120 of 2130) PASS: lldb-shell :: ObjectFile/wasm/embedded-debug-sections.yaml (2121 of 2130) PASS: lldb-api :: functionalities/target-new-solib-notifications/TestModuleLoadedNotifys.py (2122 of 2130) PASS: lldb-shell :: SymbolFile/Breakpad/line-table.test (2123 of 2130) PASS: lldb-api :: lang/objc/orderedset/TestOrderedSet.py (2124 of 2130) PASS: lldb-api :: commands/frame/diagnose/array/TestArray.py (2125 of 2130) PASS: lldb-unit :: Symbol/./SymbolTests/TestClangASTImporter.ImportInvalidType (2126 of 2130) PASS: lldb-api :: lang/cpp/member-and-local-vars-with-same-name/TestMembersAndLocalsWithSameName.py (2127 of 2130) PASS: lldb-unit :: SymbolFile/DWARF/./SymbolFileDWARFTests/XcodeSDKModuleTests.TestModuleGetXcodeSDK (2128 of 2130) PASS: lldb-api :: tools/lldb-server/TestGdbRemote_vCont.py (2129 of 2130) PASS: lldb-api :: lang/objc/foundation/TestObjCMethods.py (2130 of 2130) Slowest Tests: -------------------------------------------------------------------------- 346.33s: lldb-api :: macosx/simulator/TestSimulatorPlatform.py 176.90s: lldb-api :: lang/objc/print-obj/TestPrintObj.py 119.33s: lldb-api :: tools/lldb-server/TestLldbGdbServer.py 113.52s: lldb-api :: lang/objc/hidden-ivars/TestHiddenIvars.py 106.64s: lldb-api :: functionalities/gdb_remote_client/TestThreadSelectionBug.py 102.69s: lldb-api :: lang/cpp/const_this/TestConstThis.py 102.62s: lldb-api :: functionalities/gdb_remote_client/TestGDBRemoteLoad.py 94.80s: lldb-api :: functionalities/gdb_remote_client/TestRestartBug.py 92.71s: lldb-api :: lang/cpp/enum_types/TestCPP11EnumTypes.py 92.16s: lldb-api :: commands/expression/completion-crash-invalid-iterator/TestInvalidIteratorCompletionCrash.py 86.62s: lldb-api :: lang/objc/exceptions/TestObjCExceptions.py 82.33s: lldb-api :: functionalities/data-formatter/data-formatter-objc/TestDataFormatterObjCNSContainer.py 76.64s: lldb-shell :: SymbolFile/NativePDB/locate-pdb.cpp 74.07s: lldb-api :: lang/objc/objc-new-syntax/TestObjCNewSyntaxLiteral.py 72.85s: lldb-api :: functionalities/data-formatter/data-formatter-objc/cmtime/TestDataFormatterCMTime.py 65.10s: lldb-api :: lang/cpp/namespace/TestNamespaceLookup.py 64.70s: lldb-api :: functionalities/return-value/TestReturnValue.py 54.86s: lldb-api :: commands/target/basic/TestTargetCommand.py 54.10s: lldb-api :: lang/objc/foundation/TestObjCMethods.py 53.71s: lldb-api :: commands/expression/import_builtin_fileid/TestImportBuiltinFileID.py

Hide Details

Tests Times: -------------------------------------------------------------------------- [ Range ] :: [ Percentage ] :: [ Count ] -------------------------------------------------------------------------- [340s,360s) :: [ ] :: [ 1/2130] [320s,340s) :: [ ] :: [ 0/2130] [300s,320s) :: [ ] :: [ 0/2130] [280s,300s) :: [ ] :: [ 0/2130] [260s,280s) :: [ ] :: [ 0/2130] [240s,260s) :: [ ] :: [ 0/2130] [220s,240s) :: [ ] :: [ 0/2130] [200s,220s) :: [ ] :: [ 0/2130] [180s,200s) :: [ ] :: [ 1/2130] [160s,180s) :: [ ] :: [ 0/2130] [140s,160s) :: [ ] :: [ 0/2130] [120s,140s) :: [ ] :: [ 1/2130] [100s,120s) :: [ ] :: [ 4/2130] [ 80s,100s) :: [ ] :: [ 5/2130] [ 60s, 80s) :: [ ] :: [ 5/2130] [ 40s, 60s) :: [ ] :: [ 22/2130] [ 20s, 40s) :: [ ] :: [ 41/2130] [ 0s, 20s) :: [************************************** ] :: [2050/2130] -------------------------------------------------------------------------- ******************** Failed Tests (2): lldb-api :: functionalities/gdb_remote_client/TestGDBRemoteLoad.py lldb-api :: functionalities/gdb_remote_client/TestThreadSelectionBug.py

Hide Details

Hide Details

Testing Time: 2212.83s Unsupported : 150 Passed : 1972 Expectedly Failed: 6 Failed : 2 FAILED: tools/lldb/test/CMakeFiles/check-lldb-lit cd /Users/buildslave/jenkins/workspace/lldb-cmake@2/lldb-build/tools/lldb/test && /usr/local/Frameworks/Python.framework/Versions/3.7/bin/python3.7 /Users/buildslave/jenkins/workspace/lldb-cmake@2/lldb-build/./bin/llvm-lit -v --time-tests --shuffle --xunit-xml-output=/Users/buildslave/jenkins/workspace/lldb-cmake@2/test/results.xml -v -j 4 /Users/buildslave/jenkins/workspace/lldb-cmake@2/lldb-build/tools/lldb/test ninja: build stopped: subcommand failed. Command failed: Command '['/usr/bin/env', 'TERM=vt100', '/usr/local/bin/ninja', '-v', 'check-lldb']' returned non-zero exit status 1 Command: ['/usr/bin/env', 'TERM=vt100', '/usr/local/bin/ninja', '-v', 'check-lldb'] [Pipeline] } [Pipeline] // timeout [Pipeline] } [Pipeline] // stage [Pipeline] stage [Pipeline] { (Declarative: Post Actions) [Pipeline] scanForIssues [Clang (LLVM based)] Sleeping for 5 seconds due to JENKINS-32191... [Clang (LLVM based)] Parsing console log (workspace: '/Users/buildslave/jenkins/workspace/lldb-cmake@2') [Clang (LLVM based)] Successfully parsed console log [Clang (LLVM based)] -> found 11 issues (skipped 12 duplicates) [Clang (LLVM based)] Post processing issues on 'green-dragon-10' with source code encoding 'UTF-8' [Clang (LLVM based)] Creating SCM blamer to obtain author and commit information for affected files [Clang (LLVM based)] Creating SCM miner to obtain statistics for affected repository files [Clang (LLVM based)] Resolving file names for all issues in source directory '/Users/buildslave/jenkins/workspace/lldb-cmake@2' [Clang (LLVM based)] -> resolved paths in source directory (8 found, 0 not found) [Clang (LLVM based)] Resolving module names from module definitions (build.xml, pom.xml, or Manifest.mf files) [Clang (LLVM based)] -> resolved module names for 11 issues [Clang (LLVM based)] Resolving package names (or namespaces) by parsing the affected files [Clang (LLVM based)] -> resolved package names of 8 affected files [Clang (LLVM based)] No filter has been set, publishing all 11 issues [Clang (LLVM based)] Creating fingerprints for all affected code blocks to track issues over different builds [Clang (LLVM based)] -> created fingerprints for 11 issues (skipped 0 issues) [Clang (LLVM based)] Copying affected files to Jenkins' build folder '/Users/Shared/Jenkins/Home/jobs/lldb-cmake/builds/23496/files-with-issues' [Clang (LLVM based)] -> 6 copied, 2 not in workspace, 0 not-found, 0 with I/O error [Pipeline] junit Recording test results [Pipeline] emailext Warning: spatel@rotateright.com is not a recognized user, but sending mail anyway Warning: dancgr@gmail.com is not a recognized user, but sending mail anyway Warning: thomasraoux@google.com is not a recognized user, but sending mail anyway Warning: aqjune@gmail.com is not a recognized user, but sending mail anyway Warning: resistor@mac.com is not a recognized user, but sending mail anyway Warning: aeubanks@google.com is not a recognized user, but sending mail anyway Warning: jonathanchesterfield@gmail.com is not a recognized user, but sending mail anyway Warning: nikita.ppv@gmail.com is not a recognized user, but sending mail anyway Warning: craig.topper@intel.com is not a recognized user, but sending mail anyway Warning: spatel@rotateright.com is not a recognized user, but sending mail anyway Warning: dancgr@gmail.com is not a recognized user, but sending mail anyway Warning: thomasraoux@google.com is not a recognized user, but sending mail anyway Warning: aqjune@gmail.com is not a recognized user, but sending mail anyway Warning: resistor@mac.com is not a recognized user, but sending mail anyway Warning: aeubanks@google.com is not a recognized user, but sending mail anyway Warning: jonathanchesterfield@gmail.com is not a recognized user, but sending mail anyway Warning: nikita.ppv@gmail.com is not a recognized user, but sending mail anyway Warning: craig.topper@intel.com is not a recognized user, but sending mail anyway

Hide Details

Begin Pre-Send Script... Sending email to: Jan Korous <jkorous@apple.com> Jan Korous <jkorous@apple.com> Azhar Mohammed <azhar@apple.com>
[Pipeline] } [Pipeline] // stage [Pipeline] } [Pipeline] // withEnv [Pipeline] } [Pipeline] // node [Pipeline] End of Pipeline ERROR: script returned exit code 1 Finished: FAILURE