FailedConsole Output

Skipping 9,318 KB.. Full Log
on't know how to build with libstdcxx on macosx
Skipping following debug info categories: ['dwo']

Hide Details

-- Command Output (stderr): --

Hide Details

Session logs for test failures/errors/unexpected successes will go into directory '/Users/buildslave/jenkins/workspace/lldb-cmake@2/test/logs' Change dir to: /Users/buildslave/jenkins/workspace/lldb-cmake@2/llvm-project/lldb/test/API/functionalities/gdb_remote_client runCmd: settings clear -all output:

Hide Details

runCmd: settings set symbols.enable-external-lookup false output:

Hide Details

runCmd: settings set target.inherit-tcc true output:

Hide Details

runCmd: settings set target.auto-apply-fixits false output:

Hide Details

runCmd: settings set plugin.process.gdb-remote.packet-timeout 60 output:

Hide Details

runCmd: settings set symbols.clang-modules-cache-path "/Users/buildslave/jenkins/workspace/lldb-cmake@2/lldb-build/lldb-test-build.noindex/module-cache-lldb/lldb-api" output:

Hide Details

runCmd: settings set use-color false output:

Hide Details

runCmd: setting set target.prefer-dynamic-value no-dynamic-values output:

Hide Details

FAIL: LLDB (/Users/buildslave/jenkins/workspace/lldb-cmake@2/lldb-build/bin/clang-x86_64) :: test_flash_load (TestGDBRemoteLoad.TestGDBRemoteLoad) <bound method SBProcess.Kill of <lldb.SBProcess; proxy of <Swig Object of type 'lldb::SBProcess *' at 0x1115c6540> >>: success

Hide Details

runCmd: settings clear -all output:

Hide Details

runCmd: settings set symbols.enable-external-lookup false output:

Hide Details

runCmd: settings set target.inherit-tcc true output:

Hide Details

runCmd: settings set target.auto-apply-fixits false output:

Hide Details

runCmd: settings set plugin.process.gdb-remote.packet-timeout 60 output:

Hide Details

runCmd: settings set symbols.clang-modules-cache-path "/Users/buildslave/jenkins/workspace/lldb-cmake@2/lldb-build/lldb-test-build.noindex/module-cache-lldb/lldb-api" output:

Hide Details

runCmd: settings set use-color false output:

Hide Details

runCmd: setting set target.prefer-dynamic-value no-dynamic-values output:

Hide Details

<bound method SBProcess.Kill of <lldb.SBProcess; proxy of <Swig Object of type 'lldb::SBProcess *' at 0x10a16c600> >>: success

Hide Details

PASS: LLDB (/Users/buildslave/jenkins/workspace/lldb-cmake@2/lldb-build/bin/clang-x86_64) :: test_module_load_address (TestGDBRemoteLoad.TestGDBRemoteLoad) runCmd: settings clear -all output:

Hide Details

runCmd: settings set symbols.enable-external-lookup false output:

Hide Details

runCmd: settings set target.inherit-tcc true output:

Hide Details

runCmd: settings set target.auto-apply-fixits false output:

Hide Details

runCmd: settings set plugin.process.gdb-remote.packet-timeout 60 output:

Hide Details

runCmd: settings set symbols.clang-modules-cache-path "/Users/buildslave/jenkins/workspace/lldb-cmake@2/lldb-build/lldb-test-build.noindex/module-cache-lldb/lldb-api" output:

Hide Details

runCmd: settings set use-color false output:

Hide Details

runCmd: setting set target.prefer-dynamic-value no-dynamic-values output:

Hide Details

<bound method SBProcess.Kill of <lldb.SBProcess; proxy of <Swig Object of type 'lldb::SBProcess *' at 0x1115c65a0> >>: success

Hide Details

PASS: LLDB (/Users/buildslave/jenkins/workspace/lldb-cmake@2/lldb-build/bin/clang-x86_64) :: test_ram_load (TestGDBRemoteLoad.TestGDBRemoteLoad) Restore dir to: /Users/buildslave/jenkins/workspace/lldb-cmake@2/lldb-build/tools/lldb/test ====================================================================== FAIL: test_flash_load (TestGDBRemoteLoad.TestGDBRemoteLoad) Test loading an object file to a target's flash memory ---------------------------------------------------------------------- Traceback (most recent call last): File "/Users/buildslave/jenkins/workspace/lldb-cmake@2/llvm-project/lldb/test/API/functionalities/gdb_remote_client/TestGDBRemoteLoad.py", line 67, in test_flash_load process = self.connect(target) File "/Users/buildslave/jenkins/workspace/lldb-cmake@2/llvm-project/lldb/test/API/functionalities/gdb_remote_client/gdbclientutils.py", line 524, in connect self.assertTrue(error.Success(), error.description) AssertionError: False is not True : failed to get reply to handshake packet Config=x86_64-/Users/buildslave/jenkins/workspace/lldb-cmake@2/lldb-build/bin/clang ---------------------------------------------------------------------- Ran 3 tests in 94.977s

Hide Details

RESULT: FAILED (2 passes, 1 failures, 0 errors, 0 skipped, 0 expected failures, 0 unexpected successes)

Hide Details

--

Hide Details

******************** PASS: lldb-shell :: Reproducer/Functionalities/TestStepping.test (620 of 2134) PASS: lldb-unit :: Host/./HostTests/MainLoopTest.UnmonitoredSignal (621 of 2134) PASS: lldb-unit :: Utility/./UtilityTests/StringListTest.JoinMultiCharSeparator (622 of 2134) PASS: lldb-unit :: ObjectFile/ELF/./ObjectFileELFTests/ObjectFileELFTest.GetModuleSpecifications_EarlySectionHeaders (623 of 2134) PASS: lldb-api :: functionalities/gdb_remote_client/TestThreadSelectionBug.py (624 of 2134) PASS: lldb-unit :: Utility/./UtilityTests/UriParserTest.PortOverflow (625 of 2134) PASS: lldb-api :: functionalities/ptr_refs/TestPtrRefs.py (626 of 2134) PASS: lldb-unit :: Utility/./UtilityTests/OptionsWithRawTest.TerminatedQuote (627 of 2134) PASS: lldb-unit :: Process/gdb-remote/./ProcessGdbRemoteTests/GDBRemoteClientBaseTest.SendContinueAndLateInterrupt (628 of 2134) PASS: lldb-unit :: Utility/./UtilityTests/StreamTest.PutMaxHex64ByteOrderBig (629 of 2134) PASS: lldb-unit :: SymbolFile/NativePDB/./SymbolFileNativePDBTests/PDBFPOProgramToDWARFExpressionTests.InvalidAssignmentSingle (630 of 2134) PASS: lldb-unit :: Thread/./ThreadTests/ThreadTest.SetStopInfo (631 of 2134) PASS: lldb-api :: commands/settings/TestSettings.py (632 of 2134) PASS: lldb-api :: lang/objc/global_ptrs/TestGlobalObjects.py (633 of 2134) PASS: lldb-api :: commands/expression/namespace_local_var_same_name_obj_c/TestNamespaceLocalVarSameNameObjC.py (634 of 2134) PASS: lldb-api :: lang/objc/foundation/TestObjCMethods2.py (635 of 2134) PASS: lldb-unit :: Process/minidump/./LLDBMinidumpTests/MinidumpParserTest.GetMemoryRegionInfoFromMemory64List (636 of 2134) PASS: lldb-api :: lang/c/find_struct_type/TestFindStructTypes.py (637 of 2134) PASS: lldb-unit :: Expression/./ExpressionTests/CppModuleConfigurationTest.AmbiguousLibCpp (638 of 2134) UNSUPPORTED: lldb-shell :: Register/x86-64-gp-write.test (639 of 2134) UNSUPPORTED: lldb-shell :: SymbolFile/PDB/compilands.test (640 of 2134) PASS: lldb-api :: tools/lldb-server/commandline/TestStubReverseConnect.py (641 of 2134) PASS: lldb-api :: functionalities/gdb_remote_client/TestRestartBug.py (642 of 2134) PASS: lldb-unit :: Utility/./UtilityTests/StreamTest.PutBytesAsRawHex8ToBigEndian (643 of 2134) PASS: lldb-api :: functionalities/breakpoint/address_breakpoints/TestBadAddressBreakpoints.py (644 of 2134) PASS: lldb-unit :: Utility/./UtilityTests/RegularExpression.Invalid (645 of 2134) PASS: lldb-api :: commands/frame/diagnose/dereference-argument/TestDiagnoseDereferenceArgument.py (646 of 2134) PASS: lldb-unit :: Disassembler/./DisassemblerTests/TestArm64Disassembly.TestArmv81Instruction (647 of 2134) PASS: lldb-shell :: ObjectFile/PECOFF/invalid-export-table.yaml (648 of 2134) PASS: lldb-unit :: Utility/./UtilityTests/ListenerTest.GetEventImmediate (649 of 2134) PASS: lldb-unit :: Host/./HostTests/FileSystemTest.EmptyTest (650 of 2134) PASS: lldb-shell :: ObjectFile/MachO/symtab.yaml (651 of 2134) PASS: lldb-api :: commands/expression/no-deadlock/TestExprDoesntBlock.py (652 of 2134) PASS: lldb-shell :: ObjectFile/ELF/base-address.yaml (653 of 2134) PASS: lldb-api :: lang/cpp/char8_t/TestCxxChar8_t.py (654 of 2134) UNSUPPORTED: lldb-shell :: SymbolFile/PDB/pointers.test (655 of 2134) PASS: lldb-api :: commands/thread/select/TestThreadSelect.py (656 of 2134) PASS: lldb-unit :: Utility/./UtilityTests/LogChannelTest.EnableOptions (657 of 2134) PASS: lldb-unit :: Process/gdb-remote/./ProcessGdbRemoteTests/GDBRemoteCommunicationServerTest.SendErrorResponse_Status (658 of 2134) PASS: lldb-shell :: ObjectFile/PECOFF/disassemble-thumb.yaml (659 of 2134) PASS: lldb-unit :: Utility/./UtilityTests/StreamTest.AddressRangeInvalidRange (660 of 2134) PASS: lldb-api :: commands/expression/static-initializers/TestStaticInitializers.py (661 of 2134) PASS: lldb-unit :: Utility/./UtilityTests/ScalarTest.SetValueFromData (662 of 2134) PASS: lldb-unit :: UnwindAssembly/x86/./UnwindAssemblyx86Tests/Testx86AssemblyInspectionEngine.TestAddRSP (663 of 2134) PASS: lldb-unit :: Process/minidump/./LLDBMinidumpTests/MinidumpParserTest.GetLinuxProcStatus (664 of 2134) PASS: lldb-unit :: Utility/./UtilityTests/DataExtractorTest.GetCStrUnterminated (665 of 2134) UNSUPPORTED: lldb-api :: tools/lldb-vscode/completions/TestVSCode_completions.py (666 of 2134) UNSUPPORTED: lldb-shell :: Expr/TestIRMemoryMapWindows.test (667 of 2134) PASS: lldb-unit :: Utility/./UtilityTests/StringListTest.InsertStringAtIndexOutOfBounds (668 of 2134) PASS: lldb-shell :: ObjectFile/PECOFF/export-dllfunc.yaml (669 of 2134) UNSUPPORTED: lldb-api :: commands/target/auto-install-main-executable/TestAutoInstallMainExecutable.py (670 of 2134) PASS: lldb-unit :: Core/./LLDBCoreTests/ModuleSpecTest.TestCOFFFile (671 of 2134) PASS: lldb-unit :: UnwindAssembly/x86/./UnwindAssemblyx86Tests/Testx86AssemblyInspectionEngine.Test32BitOnlyInstruction (672 of 2134) PASS: lldb-api :: commands/expression/completion/TestExprCompletion.py (673 of 2134) PASS: lldb-api :: commands/expression/vector_of_enums/TestVectorOfEnums.py (674 of 2134) PASS: lldb-api :: functionalities/target-new-solib-notifications/TestModuleLoadedNotifys.py (675 of 2134) PASS: lldb-api :: macosx/add-dsym/TestAddDsymMidExecutionCommand.py (676 of 2134) PASS: lldb-shell :: Quit/TestQuitExitCodeTooManyArgs.test (677 of 2134) PASS: lldb-shell :: Register/x86-64-read.test (678 of 2134) UNSUPPORTED: lldb-api :: functionalities/breakpoint/breakpoint_in_delayslot/TestAvoidBreakpointInDelaySlot.py (679 of 2134) PASS: lldb-unit :: Process/minidump/./LLDBMinidumpTests/MinidumpParserTest.GetMiscInfo_no_stream (680 of 2134) PASS: lldb-api :: iohandler/unicode/TestUnicode.py (681 of 2134) PASS: lldb-api :: lang/mixed/TestMixedLanguages.py (682 of 2134) PASS: lldb-shell :: SymbolFile/DWARF/DW_TAG_basic_type_DW_ATE_UTF_nonC.ll (683 of 2134) PASS: lldb-unit :: Utility/./UtilityTests/StringExtractorTest.DecodeHexU8_Underflow2 (684 of 2134) UNSUPPORTED: lldb-shell :: SymbolFile/PDB/function-nested-block.test (685 of 2134) UNSUPPORTED: lldb-api :: tools/lldb-server/thread-name/TestGdbRemoteThreadName.py (686 of 2134) PASS: lldb-unit :: Utility/./UtilityTests/LogChannelEnabledTest.LLDB_LOG_ERROR (687 of 2134) PASS: lldb-unit :: Utility/./UtilityTests/DataExtractorTest.GetCStr (688 of 2134) PASS: lldb-unit :: ScriptInterpreter/Python/./ScriptInterpreterPythonTests/PythonDataObjectsTest.TestPythonTupleSize (689 of 2134) PASS: lldb-unit :: Symbol/./SymbolTests/TestClangASTImporter.CompleteFwdDeclWithOtherOrigin (690 of 2134) PASS: lldb-shell :: SymbolFile/NativePDB/globals-fundamental.cpp (691 of 2134) PASS: lldb-unit :: Utility/./UtilityTests/RangeTest.DefaultConstructor (692 of 2134) PASS: lldb-unit :: Utility/./UtilityTests/LogChannelEnabledTest.log_options (693 of 2134) PASS: lldb-api :: commands/watchpoints/watchpoint_on_vectors/TestValueOfVectorVariable.py (694 of 2134) PASS: lldb-unit :: Utility/./UtilityTests/StringExtractorTest.DecodeHexU8_Underflow (695 of 2134) PASS: lldb-unit :: Expression/./ExpressionTests/CppModuleConfigurationTest.AmbiguousCLib (696 of 2134) PASS: lldb-unit :: Utility/./UtilityTests/ConstStringTest.MangledCounterpart (697 of 2134) PASS: lldb-api :: lang/objc/modules-non-objc-target/TestObjCModulesNonObjCTarget.py (698 of 2134) PASS: lldb-unit :: UnwindAssembly/x86/./UnwindAssemblyx86Tests/Testx86AssemblyInspectionEngine.TestPushRBP (699 of 2134) PASS: lldb-unit :: Utility/./UtilityTests/RangeTest.EqualInvalid (700 of 2134) PASS: lldb-shell :: SymbolFile/Breakpad/line-table-edgecases.test (701 of 2134) PASS: lldb-unit :: Utility/./UtilityTests/StringListTest.ShiftStdString (702 of 2134) UNSUPPORTED: lldb-shell :: Register/x86-64-xmm16-write.test (703 of 2134) PASS: lldb-unit :: Expression/./ExpressionTests/DiagnosticManagerTest.GetStringMultiline (704 of 2134) PASS: lldb-api :: python_api/get-value-32bit-int/TestGetValue32BitInt.py (705 of 2134) PASS: lldb-unit :: Utility/./UtilityTests/StringExtractorTest.GetHexU8_Underflow_NoEof (706 of 2134) PASS: lldb-unit :: Expression/./ExpressionTests/CppModuleConfigurationTest.MissingUsrInclude (707 of 2134) PASS: lldb-api :: functionalities/data-formatter/nssetsynth/TestNSSetSynthetic.py (708 of 2134) PASS: lldb-api :: functionalities/gdb_remote_client/TestProcessConnect.py (709 of 2134) PASS: lldb-api :: functionalities/breakpoint/address_breakpoints/TestAddressBreakpoints.py (710 of 2134) PASS: lldb-unit :: Utility/./UtilityTests/CompletionRequest.Constructor (711 of 2134) PASS: lldb-api :: tools/lldb-server/TestGdbRemoteExpeditedRegisters.py (712 of 2134) PASS: lldb-api :: functionalities/data-formatter/data-formatter-objc/TestDataFormatterObjNSException.py (713 of 2134) PASS: lldb-unit :: Symbol/./SymbolTests/SymbolsTest.LocateExecutableSymbolFileForUnknownExecutableAndMissingSymbolFile (714 of 2134) PASS: lldb-unit :: Utility/./UtilityTests/StringListTest.LongestCommonPrefix (715 of 2134) PASS: lldb-shell :: Driver/TestNoUseColor.test (716 of 2134) PASS: lldb-api :: functionalities/data-formatter/data-formatter-ptr-to-array/TestPtrToArrayFormatting.py (717 of 2134) PASS: lldb-shell :: BuildScript/modes.test (718 of 2134) PASS: lldb-api :: types/TestIntegerTypeExpr.py (719 of 2134) PASS: lldb-unit :: Expression/./ExpressionTests/DiagnosticManagerTest.PutStringMultiple (720 of 2134) PASS: lldb-unit :: Host/./HostTests/SocketTest.DomainGetConnectURI (721 of 2134) PASS: lldb-api :: functionalities/data-formatter/format-propagation/TestFormatPropagation.py (722 of 2134) PASS: lldb-api :: functionalities/data-formatter/data-formatter-objc/TestDataFormatterObjCCF.py (723 of 2134) PASS: lldb-api :: functionalities/asan/TestMemoryHistory.py (724 of 2134) PASS: lldb-api :: lang/cpp/member-and-local-vars-with-same-name/TestMembersAndLocalsWithSameName.py (725 of 2134) UNSUPPORTED: lldb-api :: functionalities/darwin_log/filter/exact_match/subsystem/TestDarwinLogFilterMatchSubsystem.py (726 of 2134) PASS: lldb-unit :: Utility/./UtilityTests/StringExtractorTest.GetHexBytesAvail_Underflow (727 of 2134) PASS: lldb-api :: functionalities/value_md5_crash/TestValueMD5Crash.py (728 of 2134) PASS: lldb-unit :: Utility/./UtilityTests/AnsiTerminal.Twice (729 of 2134) PASS: lldb-unit :: ScriptInterpreter/Python/./ScriptInterpreterPythonTests/PythonDataObjectsTest.TestResetting (730 of 2134) PASS: lldb-unit :: ScriptInterpreter/Python/./ScriptInterpreterPythonTests/PythonDataObjectsTest.TestPythonString (731 of 2134) PASS: lldb-unit :: Utility/./UtilityTests/TildeExpressionResolver.ResolveFullPath (732 of 2134) PASS: lldb-unit :: Disassembler/./DisassemblerTests/TestArmv7Disassembly.TestCortexFPDisass (733 of 2134) PASS: lldb-unit :: Utility/./UtilityTests/StringExtractorTest.GetHexBytesAvail_Partial (734 of 2134) PASS: lldb-shell :: Quit/TestQuitExitCodeHex0.test (735 of 2134) PASS: lldb-api :: python_api/interpreter/TestCommandInterpreterAPI.py (736 of 2134) PASS: lldb-unit :: Utility/./UtilityTests/StringExtractorTest.GetHexBytesAvail_FullString (737 of 2134) PASS: lldb-unit :: Process/gdb-remote/./ProcessGdbRemoteTests/GDBRemoteCommunicationClientTest.GetModulesInfo_UUID20 (738 of 2134) PASS: lldb-api :: lang/cpp/namespace_definitions/TestNamespaceDefinitions.py (739 of 2134) PASS: lldb-unit :: Utility/./UtilityTests/LogChannelTest.Disable (740 of 2134) PASS: lldb-api :: functionalities/thread/backtrace_limit/TestBacktraceLimit.py (741 of 2134) PASS: lldb-api :: functionalities/history/TestHistoryRecall.py (742 of 2134) PASS: lldb-api :: functionalities/data-formatter/data-formatter-stl/libcxx/forward_list/TestDataFormatterLibcxxForwardList.py (743 of 2134) PASS: lldb-unit :: Platform/Android/./AdbClientTests/AdbClientTest.CreateByDeviceId (744 of 2134) PASS: lldb-api :: functionalities/dead-strip/TestDeadStrip.py (745 of 2134) PASS: lldb-api :: functionalities/thread/concurrent_events/TestConcurrentWatchpointWithDelayWatchpointThreads.py (746 of 2134) PASS: lldb-unit :: Host/./HostTests/ConnectionFileDescriptorTest.TCPGetURIv4 (747 of 2134) PASS: lldb-api :: commands/watchpoints/multiple_hits/TestMultipleHits.py (748 of 2134) PASS: lldb-api :: lang/cpp/exceptions/TestCPPExceptionBreakpoints.py (749 of 2134) PASS: lldb-unit :: Utility/./UtilityTests/StringExtractorTest.GetU64LittleEndian (750 of 2134) PASS: lldb-unit :: UnwindAssembly/x86/./UnwindAssemblyx86Tests/Testx86AssemblyInspectionEngine.TestPushR13 (751 of 2134) PASS: lldb-unit :: Utility/./UtilityTests/RangeDataVector.FindEntryIndexesThatContain_Overlap (752 of 2134) PASS: lldb-api :: functionalities/gdb_remote_client/TestPlatformClient.py (753 of 2134) PASS: lldb-unit :: Utility/./UtilityTests/GeneratorTest.GetOrCreate (754 of 2134) PASS: lldb-unit :: Utility/./UtilityTests/StreamTest.PutNHex8 (755 of 2134) PASS: lldb-api :: commands/platform/file/close/TestPlatformFileClose.py (756 of 2134) PASS: lldb-unit :: Expression/./ExpressionTests/DiagnosticManagerTest.GetStringSeverityLabels (757 of 2134) PASS: lldb-api :: functionalities/data-formatter/data-formatter-stl/libcxx/string/TestDataFormatterLibcxxString.py (758 of 2134) PASS: lldb-api :: functionalities/data-formatter/data-formatter-stl/libcxx/variant/TestDataFormatterLibcxxVariant.py (759 of 2134) PASS: lldb-api :: functionalities/data-formatter/array_typedef/TestArrayTypedef.py (760 of 2134) PASS: lldb-unit :: Utility/./UtilityTests/StreamTest.PutHex16ByteOrderLittle (761 of 2134) PASS: lldb-shell :: ScriptInterpreter/None/none.test (762 of 2134) PASS: lldb-api :: functionalities/data-formatter/nsdictionarysynth/TestNSDictionarySynthetic.py (763 of 2134) PASS: lldb-unit :: Utility/./UtilityTests/VASprintfTest.NoBufferResize (764 of 2134) PASS: lldb-unit :: Utility/./UtilityTests/OptionsWithRawTest.EmptySuffixSingleWhitespace (765 of 2134) PASS: lldb-unit :: Utility/./UtilityTests/ArgsTest.TestArgv (766 of 2134) PASS: lldb-unit :: ScriptInterpreter/Python/./ScriptInterpreterPythonTests/PythonDataObjectsTest.TestObjectAttributes (767 of 2134) PASS: lldb-api :: commands/target/stop-hook/delete/TestTargetStopHookDelete.py (768 of 2134) PASS: lldb-shell :: Unwind/thread-step-out-ret-addr-check.test (769 of 2134) PASS: lldb-api :: functionalities/tail_call_frames/thread_step_out_message/TestArtificialFrameStepOutMessage.py (770 of 2134) PASS: lldb-shell :: ObjectFile/ELF/aarch64-relocations.yaml (771 of 2134) PASS: lldb-shell :: Driver/TestConvenienceVariables.test (772 of 2134) PASS: lldb-unit :: Utility/./UtilityTests/FileSpecTest.GetPath (773 of 2134) PASS: lldb-api :: lang/objc/modules-cache/TestClangModulesCache.py (774 of 2134) PASS: lldb-api :: lang/c/step-target/TestStepTarget.py (775 of 2134) UNSUPPORTED: lldb-shell :: Register/x86-64-ymm16-write.test (776 of 2134) PASS: lldb-api :: tools/lldb-server/commandline/TestStubSetSID.py (777 of 2134) PASS: lldb-api :: lang/cpp/namespace/TestNamespaceLookup.py (778 of 2134) PASS: lldb-unit :: Utility/./UtilityTests/ScalarTest.APIntConstructor (779 of 2134) PASS: lldb-unit :: Expression/./ExpressionTests/DWARFExpression.DW_OP_pick (780 of 2134) PASS: lldb-unit :: ScriptInterpreter/Python/./ScriptInterpreterPythonTests/PythonDataObjectsTest.TestPythonIntegerToStr (781 of 2134) PASS: lldb-unit :: Utility/./UtilityTests/DataExtractorTest.GetFloatUnaligned (782 of 2134) PASS: lldb-shell :: SymbolFile/DWARF/parallel-indexing-stress.s (783 of 2134) PASS: lldb-api :: lang/objc/rdar-11355592/TestRdar11355592.py (784 of 2134) PASS: lldb-unit :: Utility/./UtilityTests/SerializationRountripTest.SerializeDeserializePod (785 of 2134) PASS: lldb-api :: macosx/lc-note/kern-ver-str/TestKernVerStrLCNOTE.py (786 of 2134) PASS: lldb-unit :: Expression/./ExpressionTests/CppModuleConfigurationTest.Xcode (787 of 2134) PASS: lldb-unit :: Process/minidump/./LLDBMinidumpTests/MinidumpParserTest.GetLinuxProcStatus_no_stream (788 of 2134) PASS: lldb-api :: functionalities/data-formatter/pyobjsynthprovider/TestPyObjSynthProvider.py (789 of 2134) PASS: lldb-unit :: Utility/./UtilityTests/EventTest.DumpEventDataBytes (790 of 2134) PASS: lldb-unit :: ObjectFile/Breakpad/./ObjectFileBreakpadTests/Record.classify (791 of 2134) PASS: lldb-unit :: Symbol/./SymbolTests/LineEntryTest.GetSameLineContiguousAddressRangeNestedInline (792 of 2134) PASS: lldb-unit :: Language/CPlusPlus/./LanguageCPlusPlusTests/CPlusPlusLanguage.ExtractContextAndIdentifier (793 of 2134) PASS: lldb-unit :: Utility/./UtilityTests/StreamTest.PutBytesAsRawHex8ToMixedEndian (794 of 2134) PASS: lldb-api :: lang/cpp/constructors/TestCppConstructors.py (795 of 2134) PASS: lldb-api :: functionalities/inferior-assert/TestInferiorAssert.py (796 of 2134) PASS: lldb-unit :: Process/minidump/./LLDBMinidumpTests/MinidumpParserTest.GetFilteredModuleList (797 of 2134) PASS: lldb-shell :: SymbolFile/NativePDB/function-types-calling-conv.cpp (798 of 2134) PASS: lldb-unit :: Utility/./UtilityTests/PassiveReplayTest.InstrumentedBar (799 of 2134) PASS: lldb-unit :: Utility/./UtilityTests/ReproducerTest.SetCapture (800 of 2134) UNSUPPORTED: lldb-api :: commands/register/register/aarch64_sve_registers/rw_access_static_config/TestSVERegisters.py (801 of 2134) PASS: lldb-api :: commands/breakpoint/set/func-regex/TestBreakpointRegexError.py (802 of 2134) PASS: lldb-api :: commands/expression/import-std-module/forward_list-dbg-info-content/TestDbgInfoContentForwardListFromStdModule.py (803 of 2134) PASS: lldb-shell :: Quit/TestQuitExitCodeNonInt.test (804 of 2134) PASS: lldb-api :: lang/cpp/dynamic-value-same-basename/TestDynamicValueSameBase.py (805 of 2134) UNSUPPORTED: lldb-api :: functionalities/darwin_log/filter/regex/subsystem/TestDarwinLogFilterRegexSubsystem.py (806 of 2134) PASS: lldb-unit :: Language/CPlusPlus/./LanguageCPlusPlusTests/CPlusPlusLanguage.MethodNameParsing (807 of 2134) PASS: lldb-unit :: UnwindAssembly/x86/./UnwindAssemblyx86Tests/Testx86AssemblyInspectionEngine.TestPopEBP (808 of 2134) PASS: lldb-unit :: Utility/./UtilityTests/RangeTest.SizeTypes (809 of 2134) PASS: lldb-api :: lang/cpp/function_refs/TestFunctionRefs.py (810 of 2134) PASS: lldb-unit :: Utility/./UtilityTests/BroadcasterTest.EventTypeHasListeners (811 of 2134) PASS: lldb-unit :: Expression/./ExpressionTests/DiagnosticManagerTest.AppendMessageSubsequentDiags (812 of 2134) PASS: lldb-unit :: Platform/./LLDBPlatformTests/PlatformAppleSimulatorTest.TestSimHasSimEnvionament (813 of 2134) PASS: lldb-unit :: Utility/./UtilityTests/RangeTest.Constructor (814 of 2134) PASS: lldb-api :: python_api/frame/inlines/TestInlinedFrame.py (815 of 2134) PASS: lldb-unit :: Utility/./UtilityTests/StringExtractorTest.GetHexBytes_OddPair2 (816 of 2134) PASS: lldb-unit :: Symbol/./SymbolTests/TestTypeSystemClang.TestIsClangType (817 of 2134) PASS: lldb-unit :: Language/Highlighting/./HighlighterTests/HighlighterTest.ClangCursorOutOfBounds (818 of 2134) PASS: lldb-shell :: Commands/command-regex-delete.test (819 of 2134) PASS: lldb-api :: commands/expression/import-std-module/forward_list/TestForwardListFromStdModule.py (820 of 2134) PASS: lldb-unit :: Utility/./UtilityTests/ArgsTest.EscapeLLDBCommandArgument (821 of 2134) PASS: lldb-api :: lang/objc/objc-builtin-types/TestObjCBuiltinTypes.py (822 of 2134) PASS: lldb-shell :: SymbolFile/DWARF/find-basic-namespace.cpp (823 of 2134) PASS: lldb-unit :: ScriptInterpreter/Python/./ScriptInterpreterPythonTests/PythonDataObjectsTest.TestPythonBoolean (824 of 2134) PASS: lldb-api :: lang/c/global_variables/TestGlobalVariables.py (825 of 2134) PASS: lldb-unit :: Utility/./UtilityTests/NameMatchesTest.Ignore (826 of 2134) PASS: lldb-api :: lang/objc/objc-ivar-protocols/TestIvarProtocols.py (827 of 2134) PASS: lldb-api :: commands/expression/save_jit_objects/TestSaveJITObjects.py (828 of 2134) PASS: lldb-shell :: ExecControl/StopHook/stop-hook.test (829 of 2134) PASS: lldb-unit :: Utility/./UtilityTests/StringExtractorTest.InitMisc (830 of 2134) UNSUPPORTED: lldb-api :: functionalities/darwin_log/filter/regex/category/TestDarwinLogFilterRegexCategory.py (831 of 2134) PASS: lldb-unit :: UnwindAssembly/x86/./UnwindAssemblyx86Tests/Testx86AssemblyInspectionEngine.TestDisassemblyMidFunctionEpilogues (832 of 2134) PASS: lldb-shell :: SymbolFile/DWARF/debug-types-address-ranges.s (833 of 2134) PASS: lldb-shell :: Driver/TestError.test (834 of 2134) PASS: lldb-unit :: Utility/./UtilityTests/OptionsWithRawTest.UnterminatedQuote (835 of 2134) PASS: lldb-unit :: ObjectFile/PECOFF/./ObjectFilePECOFFTests/PECallFrameInfoTest.Chained_eh (836 of 2134) PASS: lldb-api :: lang/objc/direct-dispatch-step/TestObjCDirectDispatchStepping.py (837 of 2134) PASS: lldb-api :: lang/objc/foundation/TestObjCMethodsNSArray.py (838 of 2134) UNSUPPORTED: lldb-api :: linux/add-symbols/TestTargetSymbolsAddCommand.py (839 of 2134) PASS: lldb-api :: functionalities/data-formatter/data-formatter-stl/libcxx/list/TestDataFormatterLibcxxList.py (840 of 2134) PASS: lldb-shell :: ObjectFile/PECOFF/basic-info-arm64.yaml (841 of 2134) PASS: lldb-api :: macosx/duplicate-archive-members/TestDuplicateMembers.py (842 of 2134) PASS: lldb-unit :: Utility/./UtilityTests/ArgsTest.TestInsertArg (843 of 2134) PASS: lldb-unit :: UnwindAssembly/x86/./UnwindAssemblyx86Tests/Testx86AssemblyInspectionEngine.TestPushESI (844 of 2134) PASS: lldb-api :: functionalities/breakpoint/breakpoint_by_line_and_column/TestBreakpointByLineAndColumn.py (845 of 2134) PASS: lldb-unit :: ScriptInterpreter/Python/./ScriptInterpreterPythonTests/PythonDataObjectsTest.TestPythonStringToStr (846 of 2134) PASS: lldb-api :: commands/target/create-no-such-arch/TestNoSuchArch.py (847 of 2134) PASS: lldb-shell :: SymbolFile/DWARF/inline-function-address-shared.test (848 of 2134) PASS: lldb-unit :: Expression/./ExpressionTests/CppModuleConfigurationTest.LinuxLocalLibCpp (849 of 2134) PASS: lldb-unit :: Utility/./UtilityTests/OptionsWithRawTest.EmptySuffix (850 of 2134) PASS: lldb-api :: lang/c/inlines/TestRedefinitionsInInlines.py (851 of 2134) PASS: lldb-api :: functionalities/data-formatter/frameformat_smallstruct/TestFrameFormatSmallStruct.py (852 of 2134) PASS: lldb-unit :: Utility/./UtilityTests/PassiveReplayTest.InstrumentedBarRef (853 of 2134) PASS: lldb-api :: commands/watchpoints/hello_watchpoint/TestMyFirstWatchpoint.py (854 of 2134) PASS: lldb-api :: functionalities/data-formatter/data-formatter-objc/TestDataFormatterObjCNSDate.py (855 of 2134) PASS: lldb-api :: functionalities/thread/concurrent_events/TestConcurrentBreakpointsDelayedBreakpointOneWatchpoint.py (856 of 2134) PASS: lldb-api :: commands/expression/xvalue/TestXValuePrinting.py (857 of 2134) PASS: lldb-api :: commands/frame/diagnose/local-variable/TestLocalVariable.py (858 of 2134) PASS: lldb-api :: commands/expression/completion-crash-incomplete-record/TestCompletionCrashIncompleteRecord.py (859 of 2134) PASS: lldb-api :: lang/objc/radar-9691614/TestObjCMethodReturningBOOL.py (860 of 2134) PASS: lldb-unit :: Utility/./UtilityTests/XcodeSDKTest.SDKSupportsSwift (861 of 2134) PASS: lldb-shell :: ObjectFile/PECOFF/sections-names.yaml (862 of 2134) PASS: lldb-unit :: Utility/./UtilityTests/RangeTest.ContainsRangeStartingFromZero (863 of 2134) PASS: lldb-api :: functionalities/gdb_remote_client/TestqOffsets.py (864 of 2134) PASS: lldb-shell :: SymbolFile/DWARF/DW_AT_location-DW_AT_const_value.s (865 of 2134) PASS: lldb-api :: terminal/TestSTTYBeforeAndAfter.py (866 of 2134) PASS: lldb-shell :: SymbolFile/DWARF/debug_line-relative_path.s (867 of 2134) PASS: lldb-api :: commands/expression/test/TestExprs2.py (868 of 2134) PASS: lldb-api :: types/TestFloatTypesExpr.py (869 of 2134) PASS: lldb-api :: python_api/sbdata/TestSBData.py (870 of 2134) PASS: lldb-shell :: SymbolFile/DWARF/dir-separator-no-comp-dir-relative-name.s (871 of 2134) PASS: lldb-unit :: Thread/./ThreadTests/ThreadTest.GetPrivateStopInfo (872 of 2134) PASS: lldb-unit :: Utility/./UtilityTests/CompletionRequest.DuplicateFilteringWithComments (873 of 2134) PASS: lldb-unit :: Utility/./UtilityTests/StreamTest.Indent (874 of 2134) PASS: lldb-api :: lang/cpp/gmodules/TestWithModuleDebugging.py (875 of 2134) PASS: lldb-api :: commands/frame/diagnose/dereference-this/TestDiagnoseDereferenceThis.py (876 of 2134) PASS: lldb-shell :: ObjectFile/ELF/section-types.yaml (877 of 2134) PASS: lldb-api :: functionalities/jitloader_gdb/TestJITLoaderGDB.py (878 of 2134) PASS: lldb-api :: tools/lldb-server/TestLldbGdbServer.py (879 of 2134) PASS: lldb-unit :: Host/./HostTests/FileSystemTest.MakeAbsolute (880 of 2134) PASS: lldb-api :: commands/expression/import-std-module/empty-module/TestEmptyStdModule.py (881 of 2134) PASS: lldb-shell :: ObjectFile/ELF/netbsd-core-amd64.test (882 of 2134) PASS: lldb-unit :: Utility/./UtilityTests/VASprintfTest.EncodingError (883 of 2134) PASS: lldb-api :: lang/c/vla/TestVLA.py (884 of 2134) PASS: lldb-unit :: SymbolFile/DWARF/./SymbolFileDWARFTests/SymbolFileDWARFTests.ParseArangesNonzeroSegmentSize (885 of 2134) PASS: lldb-api :: lang/objc/objc-ivar-offsets/TestObjCIvarOffsets.py (886 of 2134) PASS: lldb-unit :: ScriptInterpreter/Python/./ScriptInterpreterPythonTests/PythonDataObjectsTest.TestPythonListValueEquality (887 of 2134) PASS: lldb-api :: commands/expression/import-std-module/basic/TestImportStdModule.py (888 of 2134) PASS: lldb-api :: lang/objcxx/hide-runtime-values/TestObjCXXHideRuntimeValues.py (889 of 2134) PASS: lldb-unit :: Instruction/./EmulatorTests/TestAArch64Emulator.TestOverflow (890 of 2134) PASS: lldb-unit :: Utility/./UtilityTests/VMRange.Clear (891 of 2134) PASS: lldb-unit :: Host/./HostTests/File.GetWaitableHandleFileno (892 of 2134) PASS: lldb-shell :: ObjectFile/PECOFF/section-types.yaml (893 of 2134) PASS: lldb-shell :: SymbolFile/DWARF/find-function-regex.cpp (894 of 2134) PASS: lldb-api :: lang/cpp/call-function/TestCallCPPFunction.py (895 of 2134) PASS: lldb-unit :: Utility/./UtilityTests/ConstStringTest.CompareStringRef (896 of 2134) PASS: lldb-api :: tools/lldb-server/TestGdbRemoteExitCode.py (897 of 2134) PASS: lldb-unit :: UnwindAssembly/x86/./UnwindAssemblyx86Tests/Testx86AssemblyInspectionEngine.Testi386IgnoredRegisters (898 of 2134) PASS: lldb-api :: commands/expression/import-std-module/conflicts/TestStdModuleWithConflicts.py (899 of 2134) PASS: lldb-unit :: Utility/./UtilityTests/ArgsTest.TestSingleQuotedArgWithSpace (900 of 2134) UNSUPPORTED: lldb-api :: tools/intel-features/intel-pt/test/TestIntelPTSimpleBinary.py (901 of 2134) PASS: lldb-api :: python_api/lldbutil/process/TestPrintStackTraces.py (902 of 2134) PASS: lldb-shell :: SymbolFile/DWARF/debug-types-signature-loop.s (903 of 2134) PASS: lldb-api :: functionalities/object-file/TestImageListMultiArchitecture.py (904 of 2134) PASS: lldb-api :: macosx/save_crashlog/TestSaveCrashlog.py (905 of 2134) PASS: lldb-unit :: Language/Highlighting/./HighlighterTests/HighlighterTest.ClangTrailingBackslashMissingNewLine (906 of 2134) PASS: lldb-api :: lang/objc/objc-dyn-sbtype/TestObjCDynamicSBType.py (907 of 2134) PASS: lldb-api :: functionalities/thread/thread_specific_break/TestThreadSpecificBreakpoint.py (908 of 2134) PASS: lldb-api :: tools/lldb-server/TestGdbRemoteSingleStep.py (909 of 2134) PASS: lldb-api :: lang/objc/objc-runtime-ivars/TestRuntimeIvars.py (910 of 2134) PASS: lldb-unit :: Symbol/./SymbolTests/Type.CompilerContextPattern (911 of 2134) PASS: lldb-shell :: Commands/command-target-modules-dump-sections.yaml (912 of 2134) PASS: lldb-api :: commands/watchpoints/watchpoint_commands/TestWatchpointCommands.py (913 of 2134) PASS: lldb-unit :: Language/Highlighting/./HighlighterTests/HighlighterTest.Colons (914 of 2134) PASS: lldb-unit :: Utility/./UtilityTests/StreamTest.PutSLEB128 (915 of 2134) PASS: lldb-unit :: Utility/./UtilityTests/StreamTeeTest.Constructor2Streams (916 of 2134) PASS: lldb-unit :: Utility/./UtilityTests/ArgsTest.TestQuotedTrailingBackslash (917 of 2134) PASS: lldb-api :: python_api/hello_world/TestHelloWorld.py (918 of 2134) PASS: lldb-api :: functionalities/recursion/TestValueObjectRecursion.py (919 of 2134) PASS: lldb-shell :: Quit/TestQuitExitCodeImplicit0.test (920 of 2134) PASS: lldb-unit :: Utility/./UtilityTests/CompletionRequest.TryCompleteCurrentArgMode (921 of 2134) UNSUPPORTED: lldb-shell :: ScriptInterpreter/Lua/breakpoint_callback.test (922 of 2134) PASS: lldb-api :: functionalities/breakpoint/global_constructor/TestBreakpointInGlobalConstructor.py (923 of 2134) PASS: lldb-shell :: Settings/TestFrameFormatMangling.test (924 of 2134) PASS: lldb-api :: lang/cpp/typeof/TestTypeOfDeclTypeExpr.py (925 of 2134) PASS: lldb-unit :: ObjectFile/Breakpad/./ObjectFileBreakpadTests/StackCFIRecord.parse (926 of 2134) PASS: lldb-shell :: Commands/command-thread-select.test (927 of 2134) UNSUPPORTED: lldb-shell :: ScriptInterpreter/Lua/nested_sessions.test (928 of 2134) PASS: lldb-unit :: Host/./HostTests/Host.GetEnvironment (929 of 2134) PASS: lldb-api :: functionalities/data-formatter/data-formatter-objc/TestDataFormatterObjCKVO.py (930 of 2134) PASS: lldb-unit :: Utility/./UtilityTests/ScalarTest.GetValue (931 of 2134) PASS: lldb-api :: python_api/name_lookup/TestNameLookup.py (932 of 2134) PASS: lldb-shell :: SymbolFile/DWARF/DW_AT_const_value-bitfields.s (933 of 2134) PASS: lldb-shell :: BuildScript/script-args.test (934 of 2134) PASS: lldb-unit :: Symbol/./SymbolTests/TestClangASTImporter.MetadataPropagationIndirectImport (935 of 2134) PASS: lldb-unit :: Utility/./UtilityTests/Flags.AllClear (936 of 2134) PASS: lldb-unit :: API/./APITests/SBCommandInterpreterTest.MultiWordCommand (937 of 2134) PASS: lldb-api :: commands/platform/file/read/TestPlatformFileRead.py (938 of 2134) PASS: lldb-api :: functionalities/data-formatter/data-formatter-synth/TestDataFormatterSynth.py (939 of 2134) PASS: lldb-unit :: Core/./LLDBCoreTests/RichManglingContextTest.FromCxxMethodName (940 of 2134) PASS: lldb-api :: functionalities/gdb_remote_client/TestStopPCs.py (941 of 2134) PASS: lldb-api :: functionalities/tsan/basic/TestTsanBasic.py (942 of 2134) UNSUPPORTED: lldb-api :: benchmarks/expression/TestExpressionCmd.py (943 of 2134) PASS: lldb-api :: lang/cpp/bitfields/TestCppBitfields.py (944 of 2134) PASS: lldb-shell :: SymbolFile/DWARF/find-variable-dwo.cpp (945 of 2134) UNSUPPORTED: lldb-shell :: ObjectFile/ELF/minidebuginfo-no-lzma.yaml (946 of 2134) PASS: lldb-unit :: Utility/./UtilityTests/ConstStringTest.CompareConstString (947 of 2134) PASS: lldb-unit :: debugserver/./debugserverTests/RNBSocket.LoopBackListenIPv6 (948 of 2134) UNSUPPORTED: lldb-shell :: SymbolFile/PDB/udt-layout.test (949 of 2134) PASS: lldb-api :: lang/cpp/template-function/TestTemplateFunctions.py (950 of 2134) PASS: lldb-unit :: Language/Highlighting/./HighlighterTests/HighlighterTest.ClangTrailingBackslashWithWhitespace (951 of 2134) PASS: lldb-unit :: Utility/./UtilityTests/ArgsTest.AppendArguments (952 of 2134) PASS: lldb-unit :: Utility/./UtilityTests/SubsystemRAIITest.SubsystemWithErrorFailure (953 of 2134) PASS: lldb-unit :: Utility/./UtilityTests/StringExtractorTest.GetNameColonValueContainsColon (954 of 2134) PASS: lldb-unit :: UnwindAssembly/x86/./UnwindAssemblyx86Tests/Testx86AssemblyInspectionEngine.Test64bitFramelessBigStackFrame (955 of 2134) PASS: lldb-api :: functionalities/wrong_commands/TestWrongCommands.py (956 of 2134) PASS: lldb-api :: functionalities/data-formatter/ostypeformatting/TestFormattersOsType.py (957 of 2134) PASS: lldb-unit :: Utility/./UtilityTests/ScalarTest.GetBytes (958 of 2134) PASS: lldb-unit :: Utility/./UtilityTests/StreamTest.AddressSize (959 of 2134) PASS: lldb-unit :: Utility/./UtilityTests/StringListTest.GetSize (960 of 2134) PASS: lldb-api :: commands/gui/basic/TestGuiBasic.py (961 of 2134) PASS: lldb-unit :: Utility/./UtilityTests/ScalarTest.Division (962 of 2134) PASS: lldb-shell :: SymbolFile/NativePDB/ast-methods.cpp (963 of 2134) PASS: lldb-api :: commands/expression/call-function/TestCallStdStringFunction.py (964 of 2134) PASS: lldb-unit :: Utility/./UtilityTests/StringExtractorTest.GetU32BigEndian (965 of 2134) PASS: lldb-unit :: Utility/./UtilityTests/StringListTest.ShiftMove (966 of 2134) PASS: lldb-unit :: Utility/./UtilityTests/RecordReplayTest.InstrumentedBar (967 of 2134) PASS: lldb-unit :: Utility/./UtilityTests/StringExtractorTest.GetHexU8_Extra (968 of 2134) PASS: lldb-unit :: UnwindAssembly/x86/./UnwindAssemblyx86Tests/Testx86AssemblyInspectionEngine.TestSimple32bitFrameFunction (969 of 2134) PASS: lldb-unit :: Symbol/./SymbolTests/DWARFCallFrameInfoTest.Basic_dwarf3 (970 of 2134) PASS: lldb-unit :: ScriptInterpreter/Python/./ScriptInterpreterPythonTests/PythonDataObjectsTest.TestPythonTupleInitializerList (971 of 2134) PASS: lldb-shell :: SymbolFile/DWARF/dir-separator-no-comp-dir.s (972 of 2134) PASS: lldb-api :: macosx/dyld-trie-symbols/TestDyldTrieSymbols.py (973 of 2134) PASS: lldb-api :: functionalities/data-formatter/data-formatter-enum-format/TestDataFormatterEnumFormat.py (974 of 2134) PASS: lldb-api :: api/check_public_api_headers/TestPublicAPIHeaders.py (975 of 2134) PASS: lldb-shell :: SymbolFile/DWARF/debug_rnglists-dwo.s (976 of 2134) PASS: lldb-shell :: ObjectFile/ELF/section-addresses.yaml (977 of 2134) PASS: lldb-api :: lang/objc/forward-decl/TestForwardDecl.py (978 of 2134) PASS: lldb-api :: tools/lldb-vscode/breakpoint/TestVSCode_setBreakpoints.py (979 of 2134) PASS: lldb-shell :: Settings/TestStopCommandSourceOnError.test (980 of 2134) PASS: lldb-api :: python_api/frame/get-variables/TestGetVariables.py (981 of 2134) PASS: lldb-unit :: Editline/./EditlineTests/EditlineTestFixture.EditlineReceivesMultiLineText (982 of 2134) PASS: lldb-api :: functionalities/thread/concurrent_events/TestConcurrentTwoBreakpointsOneWatchpoint.py (983 of 2134) PASS: lldb-api :: functionalities/data-formatter/type_summary_list_arg/TestTypeSummaryListArg.py (984 of 2134) UNSUPPORTED: lldb-api :: functionalities/darwin_log/format/TestDarwinLogMessageFormat.py (985 of 2134) PASS: lldb-unit :: Utility/./UtilityTests/StreamTest.PutRawBytesToBigEndian (986 of 2134) PASS: lldb-api :: lang/objc/unicode-string/TestUnicodeString.py (987 of 2134) PASS: lldb-unit :: Utility/./UtilityTests/SerializationRountripTest.SerializeDeserializePodPointers (988 of 2134) PASS: lldb-unit :: UnwindAssembly/ARM64/./Arm64InstEmulationTests/TestArm64InstEmulation.TestRegisterSavedTwice (989 of 2134) PASS: lldb-api :: lang/objc/modules/TestObjCModules.py (990 of 2134) PASS: lldb-unit :: Target/./TargetTests/ModuleCacheTest.GetAndPutStrangeHostname (991 of 2134) PASS: lldb-api :: functionalities/reproducers/attach/TestReproducerAttach.py (992 of 2134) PASS: lldb-unit :: Utility/./UtilityTests/StructuredDataTest.ParseJSONFromFile (993 of 2134) PASS: lldb-unit :: Expression/./ExpressionTests/DiagnosticManagerTest.AddDiagnostic (994 of 2134) PASS: lldb-unit :: Utility/./UtilityTests/VMRange.Ordering (995 of 2134) PASS: lldb-api :: lang/cpp/enum_types/TestCPP11EnumTypes.py (996 of 2134) PASS: lldb-api :: lang/cpp/std-function-step-into-callable/TestStdFunctionStepIntoCallable.py (997 of 2134) PASS: lldb-api :: commands/command/script/import/TestImport.py (998 of 2134) PASS: lldb-api :: functionalities/postmortem/netbsd-core/TestNetBSDCore.py (999 of 2134) PASS: lldb-unit :: Interpreter/./InterpreterTests/OptionArgParserTest.toChar (1000 of 2134) UNSUPPORTED: lldb-api :: benchmarks/expression/TestRepeatedExprs.py (1001 of 2134) PASS: lldb-api :: functionalities/breakpoint/breakpoint_ids/TestBreakpointIDs.py (1002 of 2134) PASS: lldb-unit :: Process/gdb-remote/./ProcessGdbRemoteTests/GDBRemoteCommunicationClientTest.GetModulesInfo (1003 of 2134) PASS: lldb-api :: tools/lldb-server/TestGdbRemote_vCont.py (1004 of 2134) UNSUPPORTED: lldb-shell :: Reproducer/TestLuaImport.test (1005 of 2134) PASS: lldb-unit :: tools/lldb-server/tests/./LLDBServerTests/StandardStartupTest.TestStopReplyContainsThreadPcs (1006 of 2134) PASS: lldb-api :: functionalities/breakpoint/breakpoint_names/TestBreakpointNames.py (1007 of 2134) PASS: lldb-unit :: Host/./HostTests/NativeProcessProtocolTest.ReadCStringFromMemory_MaxSize (1008 of 2134) PASS: lldb-shell :: Reproducer/Functionalities/TestDataFormatter.test (1009 of 2134) PASS: lldb-shell :: ObjectFile/ELF/gnu-debuglink.yaml (1010 of 2134) PASS: lldb-unit :: Utility/./UtilityTests/StringLexerTest.AdvanceIf (1011 of 2134) PASS: lldb-api :: macosx/function-starts/TestFunctionStarts.py (1012 of 2134) PASS: lldb-shell :: SymbolFile/Breakpad/unwind-via-stack-win.test (1013 of 2134) PASS: lldb-unit :: Process/minidump/./LLDBMinidumpTests/MinidumpParserTest.GetThreadsAndGetThreadContext (1014 of 2134) PASS: lldb-shell :: ObjectFile/ELF/compressed-sections.yaml (1015 of 2134) PASS: lldb-unit :: Utility/./UtilityTests/ArchSpecTest.YAML (1016 of 2134) PASS: lldb-unit :: Process/minidump/./LLDBMinidumpTests/MinidumpParserTest.GetThreadContext_x86_32 (1017 of 2134) PASS: lldb-shell :: SymbolFile/DWARF/childless-compile-unit.s (1018 of 2134) PASS: lldb-api :: lang/objc/objc-foundation-dictionary-empty/TestNSDictionary0.py (1019 of 2134) PASS: lldb-unit :: ObjectFile/Breakpad/./ObjectFileBreakpadTests/FileRecord.parse (1020 of 2134) PASS: lldb-api :: commands/expression/import-std-module/queue/TestQueueFromStdModule.py (1021 of 2134) PASS: lldb-unit :: Core/./LLDBCoreTests/MangledTest.ResultForBlockInvocation (1022 of 2134) PASS: lldb-api :: lang/c/blocks/TestBlocks.py (1023 of 2134) UNSUPPORTED: lldb-api :: functionalities/darwin_log/basic/TestDarwinLogBasic.py (1024 of 2134) PASS: lldb-api :: api/multithreaded/TestMultithreaded.py (1025 of 2134) PASS: lldb-api :: python_api/value/linked_list/TestValueAPILinkedList.py (1026 of 2134) UNSUPPORTED: lldb-shell :: ScriptInterpreter/Lua/lua.test (1027 of 2134) PASS: lldb-shell :: Settings/TestDisassemblyFormat.test (1028 of 2134) UNSUPPORTED: lldb-api :: functionalities/darwin_log/filter/exact_match/message/TestDarwinLogFilterMatchMessage.py (1029 of 2134) PASS: lldb-unit :: Host/./HostTests/SocketTest.TCPGetConnectURI (1030 of 2134) PASS: lldb-api :: source-manager/TestSourceManager.py (1031 of 2134) PASS: lldb-shell :: Breakpoint/debug_addrx.test (1032 of 2134) PASS: lldb-api :: commands/process/launch/TestProcessLaunch.py (1033 of 2134) PASS: lldb-api :: python_api/value_var_update/TestValueVarUpdate.py (1034 of 2134) PASS: lldb-unit :: Utility/./UtilityTests/RangeTest.Clear (1035 of 2134) PASS: lldb-unit :: Utility/./UtilityTests/StatusTest.Formatv (1036 of 2134) PASS: lldb-api :: commands/expression/import-std-module/no-std-module/TestMissingStdModule.py (1037 of 2134) PASS: lldb-shell :: Reproducer/TestMultipleTargets.test (1038 of 2134) PASS: lldb-api :: functionalities/postmortem/elf-core/thread_crash/TestLinuxCoreThreads.py (1039 of 2134) PASS: lldb-api :: commands/watchpoints/step_over_watchpoint/TestStepOverWatchpoint.py (1040 of 2134) PASS: lldb-unit :: Utility/./UtilityTests/RangeDataVector.FindEntryThatContains_Overlap (1041 of 2134) PASS: lldb-unit :: Utility/./UtilityTests/StringListTest.Assignment (1042 of 2134) PASS: lldb-unit :: Process/minidump/./LLDBMinidumpTests/MinidumpParserTest.InvalidMinidump (1043 of 2134) PASS: lldb-unit :: Core/./LLDBCoreTests/RichManglingContextTest.IPDRealloc (1044 of 2134) PASS: lldb-api :: python_api/lldbutil/TestSwigVersion.py (1045 of 2134) PASS: lldb-unit :: Host/./HostTests/NativeProcessProtocolTest.ReadCStringFromMemory (1046 of 2134) PASS: lldb-api :: lang/objc/modules-incomplete/TestIncompleteModules.py (1047 of 2134) PASS: lldb-api :: functionalities/avoids-fd-leak/TestFdLeak.py (1048 of 2134) PASS: lldb-api :: functionalities/ubsan/basic/TestUbsanBasic.py (1049 of 2134) PASS: lldb-unit :: UnwindAssembly/PPC64/./PPC64InstEmulationTests/TestPPC64InstEmulation.TestSimpleFunction (1050 of 2134) UNSUPPORTED: lldb-shell :: ScriptInterpreter/Lua/quit.test (1051 of 2134) PASS: lldb-api :: commands/target/stop-hooks/TestStopHooks.py (1052 of 2134) PASS: lldb-unit :: Utility/./UtilityTests/ArgsTest.DoubleQuotedItem (1053 of 2134) PASS: lldb-unit :: Signals/./SignalsTests/UnixSignalsTest.VersionChange (1054 of 2134) PASS: lldb-api :: lang/objc/objc-new-syntax/TestObjCNewSyntaxArray.py (1055 of 2134) PASS: lldb-shell :: Settings/TestModuleCacheSanity.test (1056 of 2134) PASS: lldb-api :: functionalities/data-formatter/data-formatter-stl/libcxx/unordered/TestDataFormatterUnordered.py (1057 of 2134) PASS: lldb-api :: functionalities/tail_call_frames/inlining_and_tail_calls/TestInliningAndTailCalls.py (1058 of 2134) PASS: lldb-api :: functionalities/thread/concurrent_events/TestConcurrentWatchBreakDelay.py (1059 of 2134) PASS: lldb-unit :: ObjectFile/ELF/./ObjectFileELFTests/ObjectFileELFTest.GetSymtab_NoSymEntryPointArmAddressClass (1060 of 2134) PASS: lldb-unit :: Process/gdb-remote/./ProcessGdbRemoteTests/GDBRemoteCommunicationClientTest.SaveRestoreRegistersNoSuffix (1061 of 2134) PASS: lldb-unit :: ObjectFile/Breakpad/./ObjectFileBreakpadTests/FuncRecord.parse (1062 of 2134) UNSUPPORTED: lldb-api :: benchmarks/libcxxmap/TestBenchmarkLibcxxMap.py (1063 of 2134) UNSUPPORTED: lldb-api :: functionalities/data-formatter/data-formatter-stl/libstdcpp/smart_ptr/TestDataFormatterStdSmartPtr.py (1064 of 2134) PASS: lldb-api :: lang/c/unicode/TestUnicodeSymbols.py (1065 of 2134) PASS: lldb-shell :: Reproducer/TestDiscard.test (1066 of 2134) PASS: lldb-shell :: Commands/command-script-import.test (1067 of 2134) PASS: lldb-unit :: Utility/./UtilityTests/FileSpecTest.GuessPathStyle (1068 of 2134) PASS: lldb-api :: functionalities/tsan/cpp_global_location/TestTsanCPPGlobalLocation.py (1069 of 2134) PASS: lldb-api :: lang/cpp/rvalue-references/TestRvalueReferences.py (1070 of 2134) PASS: lldb-shell :: ObjectFile/ELF/section-overlap.yaml (1071 of 2134) PASS: lldb-api :: commands/frame/diagnose/dereference-function-return/TestDiagnoseDereferenceFunctionReturn.py (1072 of 2134) PASS: lldb-shell :: Settings/TestFrameFormatNoColor.test (1073 of 2134) PASS: lldb-api :: functionalities/thread/concurrent_events/TestConcurrentNWatchNBreak.py (1074 of 2134) PASS: lldb-unit :: Utility/./UtilityTests/SerializationRountripTest.SerializeDeserializeCString (1075 of 2134) PASS: lldb-api :: functionalities/plugins/command_plugin/TestPluginCommands.py (1076 of 2134) PASS: lldb-api :: functionalities/data-formatter/data-formatter-stl/libstdcpp/unique_ptr/invalid/TestDataFormatterInvalidStdUniquePtr.py (1077 of 2134) PASS: lldb-unit :: Utility/./UtilityTests/AnsiTerminal.Basic (1078 of 2134) PASS: lldb-unit :: Utility/./UtilityTests/UUIDTest.StringConverion (1079 of 2134) PASS: lldb-unit :: Utility/./UtilityTests/UriParserTest.BracketedHostnameWithColon (1080 of 2134) PASS: lldb-api :: functionalities/thread/concurrent_events/TestConcurrentTwoWatchpointThreads.py (1081 of 2134) PASS: lldb-unit :: Utility/./UtilityTests/ScalarTest.Equality (1082 of 2134) PASS: lldb-api :: iohandler/completion/TestIOHandlerCompletion.py (1083 of 2134) PASS: lldb-api :: functionalities/thread/concurrent_events/TestConcurrentDelayWatchBreak.py (1084 of 2134) PASS: lldb-shell :: Quit/TestQuitExitCode-30.test (1085 of 2134) PASS: lldb-shell :: SymbolFile/Breakpad/stack-cfi-parsing.test (1086 of 2134) PASS: lldb-unit :: Utility/./UtilityTests/ScalarTest.LongLongAssigmentOperator (1087 of 2134) UNSUPPORTED: lldb-api :: functionalities/data-formatter/data-formatter-stl/libstdcpp/vector/TestDataFormatterStdVector.py (1088 of 2134) PASS: lldb-unit :: Process/gdb-remote/./ProcessGdbRemoteTests/GDBRemoteCommunicationClientTest.SendGetTraceConfigPacket (1089 of 2134) PASS: lldb-api :: functionalities/breakpoint/breakpoint_command/TestRegexpBreakCommand.py (1090 of 2134) PASS: lldb-unit :: Utility/./UtilityTests/StringExtractorTest.GetHexBytesAvail_OddPair (1091 of 2134) PASS: lldb-api :: python_api/sblaunchinfo/TestSBLaunchInfo.py (1092 of 2134) PASS: lldb-unit :: Utility/./UtilityTests/StringExtractorTest.GetU32LittleEndian (1093 of 2134) PASS: lldb-api :: functionalities/non-overlapping-index-variable-i/TestIndexVariable.py (1094 of 2134) UNSUPPORTED: lldb-shell :: SymbolFile/NativePDB/ast-functions-msvc.cpp (1095 of 2134) PASS: lldb-api :: functionalities/breakpoint/consecutive_breakpoints/TestConsecutiveBreakpoints.py (1096 of 2134) PASS: lldb-api :: tools/lldb-vscode/attach/TestVSCode_attach.py (1097 of 2134) PASS: lldb-api :: macosx/indirect_symbol/TestIndirectSymbols.py (1098 of 2134) PASS: lldb-api :: functionalities/data-formatter/synthupdate/TestSyntheticFilterRecompute.py (1099 of 2134) PASS: lldb-unit :: Symbol/./SymbolTests/TestTypeSystemClang.TestFunctionTemplateConstruction (1100 of 2134) PASS: lldb-api :: tools/lldb-vscode/breakpoint/TestVSCode_setFunctionBreakpoints.py (1101 of 2134) PASS: lldb-unit :: Core/./LLDBCoreTests/MangledTest.ResultForValidName (1102 of 2134) PASS: lldb-unit :: Utility/./UtilityTests/StringExtractorTest.GetHexU8_InvalidHex (1103 of 2134) PASS: lldb-api :: python_api/exprpath_synthetic/TestExprPathSynthetic.py (1104 of 2134) PASS: lldb-shell :: SymbolFile/Breakpad/unwind-via-stack-cfi.test (1105 of 2134) PASS: lldb-shell :: Reproducer/TestCrash.test (1106 of 2134) PASS: lldb-unit :: Utility/./UtilityTests/RangeTest.DoesAdjoinOrIntersect (1107 of 2134) PASS: lldb-api :: lang/c/complex/TestComplexC99.py (1108 of 2134) PASS: lldb-api :: functionalities/breakpoint/cpp/TestCPPBreakpointLocations.py (1109 of 2134) PASS: lldb-unit :: SymbolFile/DWARF/./SymbolFileDWARFTests/XcodeSDKModuleTests.TestModuleGetXcodeSDK (1110 of 2134) PASS: lldb-api :: python_api/thread/TestThreadAPI.py (1111 of 2134) PASS: lldb-unit :: Utility/./UtilityTests/StringListTest.CopyListEmpty (1112 of 2134) PASS: lldb-shell :: SymbolFile/DWARF/debug-line-basic.s (1113 of 2134) PASS: lldb-unit :: Utility/./UtilityTests/RangeTest.Slide (1114 of 2134) PASS: lldb-api :: functionalities/data-formatter/data-formatter-script/TestDataFormatterScript.py (1115 of 2134) PASS: lldb-shell :: SymbolFile/DWARF/find-method-local-struct.cpp (1116 of 2134) UNSUPPORTED: lldb-api :: functionalities/data-formatter/data-formatter-stl/libstdcpp/iterator/TestDataFormatterStdIterator.py (1117 of 2134) PASS: lldb-unit :: Symbol/./SymbolTests/TestClangASTImporter.CopyTypeTagDecl (1118 of 2134) XFAIL: lldb-shell :: Unwind/prefer-debug-over-eh-frame.test (1119 of 2134) PASS: lldb-unit :: Target/./TargetTests/ModuleCacheTest.GetAndPut (1120 of 2134) PASS: lldb-api :: lang/cpp/nsimport/TestCppNsImport.py (1121 of 2134) PASS: lldb-unit :: ScriptInterpreter/Python/./ScriptInterpreterPythonTests/PythonDataObjectsTest.TestScript (1122 of 2134) PASS: lldb-api :: commands/expression/argument_passing_restrictions/TestArgumentPassingRestrictions.py (1123 of 2134) PASS: lldb-shell :: Driver/TestProcessAttach.test (1124 of 2134) PASS: lldb-unit :: Symbol/./SymbolTests/TestTypeSystemClang.TestNotDeletingUserCopyCstrDueToMoveCStr (1125 of 2134) PASS: lldb-api :: commands/expression/call-throws/TestCallThatThrows.py (1126 of 2134) PASS: lldb-api :: functionalities/tail_call_frames/unambiguous_sequence/TestUnambiguousTailCalls.py (1127 of 2134) PASS: lldb-unit :: Language/Highlighting/./HighlighterTests/HighlighterTest.ClangCursorPosBeforeOtherToken (1128 of 2134) UNSUPPORTED: lldb-shell :: Register/aarch64-fp-read.test (1129 of 2134) PASS: lldb-api :: tools/lldb-vscode/step/TestVSCode_step.py (1130 of 2134) PASS: lldb-api :: functionalities/limit-debug-info/TestLimitDebugInfo.py (1131 of 2134) PASS: lldb-api :: functionalities/gdb_remote_client/TestWriteMemory.py (1132 of 2134) PASS: lldb-api :: commands/expression/char/TestExprsChar.py (1133 of 2134) PASS: lldb-unit :: Host/./HostTests/MainLoopTest.ReadObject (1134 of 2134) PASS: lldb-unit :: UnwindAssembly/x86/./UnwindAssemblyx86Tests/Testx86AssemblyInspectionEngine.TestPopR13 (1135 of 2134) PASS: lldb-shell :: Quit/TestQuitExitCodeHexA.test (1136 of 2134) PASS: lldb-unit :: Utility/./UtilityTests/StreamTest.PutHex32ByteOrderLittle (1137 of 2134) PASS: lldb-api :: python_api/process/TestProcessAPI.py (1138 of 2134) PASS: lldb-unit :: Utility/./UtilityTests/RegularExpression.CopyAssignment (1139 of 2134) PASS: lldb-unit :: Symbol/./SymbolTests/TestTypeSystemClang.TestUnifyAccessSpecifiers (1140 of 2134) PASS: lldb-api :: functionalities/inferior-crashing/TestInferiorCrashingStep.py (1141 of 2134) UNSUPPORTED: lldb-shell :: ScriptInterpreter/Lua/command_script_import.test (1142 of 2134) PASS: lldb-api :: lang/objc/objc++/TestObjCXX.py (1143 of 2134) PASS: lldb-api :: python_api/process/io/TestProcessIO.py (1144 of 2134) PASS: lldb-shell :: Breakpoint/single-file-split-dwarf.test (1145 of 2134) PASS: lldb-unit :: Symbol/./SymbolTests/TestTypeSystemClang.TestGetTypeClassTypeOfExpr (1146 of 2134) PASS: lldb-api :: lang/objc/ivar-IMP/TestObjCiVarIMP.py (1147 of 2134) PASS: lldb-api :: functionalities/thread/concurrent_events/TestConcurrentSignalBreak.py (1148 of 2134) PASS: lldb-unit :: Expression/./ExpressionTests/CppModuleConfigurationTest.LibCppV2 (1149 of 2134) PASS: lldb-unit :: Core/./LLDBCoreTests/ModuleSpecTest.TestELFFile (1150 of 2134) PASS: lldb-unit :: Target/./TargetTests/MCBasedABI.MapRegisterName (1151 of 2134) PASS: lldb-api :: functionalities/tail_call_frames/cross_object/TestCrossObjectTailCalls.py (1152 of 2134) PASS: lldb-shell :: Driver/TestPositionalArgs.test (1153 of 2134) PASS: lldb-api :: commands/expression/codegen-crash-typedefdecl-not-in_declcontext/TestCodegenCrashTypedefDeclNotInDeclContext.py (1154 of 2134) PASS: lldb-api :: lang/objc/objc-static-method/TestObjCStaticMethod.py (1155 of 2134) PASS: lldb-shell :: Reproducer/Modules/TestModuleCXX.test (1156 of 2134) PASS: lldb-api :: types/TestLongTypes.py (1157 of 2134) PASS: lldb-shell :: SymbolFile/DWARF/DW_TAG_variable-invalid_location.s (1158 of 2134) PASS: lldb-shell :: SymbolFile/DWARF/dwarf5_locations.s (1159 of 2134) PASS: lldb-shell :: SymbolFile/DWARF/anon_class_w_and_wo_export_symbols.ll (1160 of 2134) PASS: lldb-api :: lang/objc/print-obj/TestPrintObj.py (1161 of 2134) PASS: lldb-api :: functionalities/tail_call_frames/ambiguous_tail_call_seq2/TestAmbiguousTailCallSeq2.py (1162 of 2134) PASS: lldb-unit :: ObjectFile/PECOFF/./ObjectFilePECOFFTests/PECallFrameInfoTest.Basic_eh (1163 of 2134) PASS: lldb-unit :: Language/Highlighting/./HighlighterTests/HighlighterTest.ClangScalarLiterals (1164 of 2134) PASS: lldb-unit :: UnwindAssembly/x86/./UnwindAssemblyx86Tests/Testx86AssemblyInspectionEngine.TestPushECX (1165 of 2134) PASS: lldb-api :: functionalities/thread/concurrent_events/TestConcurrentCrashWithWatchpoint.py (1166 of 2134) PASS: lldb-unit :: Symbol/./SymbolTests/TestTypeSystemClang.TestDisplayName (1167 of 2134) PASS: lldb-api :: functionalities/exec/TestExec.py (1168 of 2134) PASS: lldb-api :: functionalities/breakpoint/breakpoint_hit_count/TestBreakpointHitCount.py (1169 of 2134) PASS: lldb-api :: functionalities/breakpoint/move_nearest/TestMoveNearest.py (1170 of 2134) PASS: lldb-unit :: UnwindAssembly/x86/./UnwindAssemblyx86Tests/Testx86AssemblyInspectionEngine.TestPopR14 (1171 of 2134) PASS: lldb-api :: functionalities/thread/jump/TestThreadJump.py (1172 of 2134) PASS: lldb-api :: commands/expression/anonymous-struct/TestCallUserAnonTypedef.py (1173 of 2134) PASS: lldb-api :: lang/c/step_over_no_deadlock/TestStepOverDoesntBlock.py (1174 of 2134) PASS: lldb-unit :: Utility/./UtilityTests/OptionsWithRawTest.LeadingSpaceArgs (1175 of 2134) PASS: lldb-api :: lang/cpp/template-specialization-type/TestTemplateSpecializationType.py (1176 of 2134) PASS: lldb-unit :: Process/minidump/./LLDBMinidumpTests/MinidumpParserTest.GetMemory (1177 of 2134) PASS: lldb-unit :: Utility/./UtilityTests/EnvironmentTest.EnvpConversion (1178 of 2134) PASS: lldb-unit :: Process/gdb-remote/./ProcessGdbRemoteTests/GDBRemoteCommunicationServerTest.SendErrorResponse_StringError (1179 of 2134) PASS: lldb-unit :: Symbol/./SymbolTests/TestClangASTImporter.DeportDeclTagDecl (1180 of 2134) PASS: lldb-unit :: Utility/./UtilityTests/NameMatchesTest.StartsWith (1181 of 2134) PASS: lldb-unit :: UnwindAssembly/x86/./UnwindAssemblyx86Tests/Testx86AssemblyInspectionEngine.TestDisassemblyJunkBytes (1182 of 2134) PASS: lldb-unit :: Utility/./UtilityTests/SerializationRountripTest.SerializeDeserializeCStringNull (1183 of 2134) PASS: lldb-unit :: UnwindAssembly/ARM64/./Arm64InstEmulationTests/TestArm64InstEmulation.TestSimpleDarwinFunction (1184 of 2134) PASS: lldb-unit :: Utility/./UtilityTests/UUIDTest.Validity (1185 of 2134) PASS: lldb-unit :: Expression/./ExpressionTests/DiagnosticManagerTest.PutString (1186 of 2134) PASS: lldb-api :: macosx/DBGSourcePathRemapping/TestDSYMSourcePathRemapping.py (1187 of 2134) PASS: lldb-api :: commands/expression/persistent_variables/TestPersistentVariables.py (1188 of 2134) PASS: lldb-shell :: Heap/heap-cstr.test (1189 of 2134) PASS: lldb-unit :: Utility/./UtilityTests/StringListTest.SplitIntoLinesEmpty (1190 of 2134) PASS: lldb-api :: functionalities/inferior-crashing/recursive-inferior/TestRecursiveInferior.py (1191 of 2134) PASS: lldb-api :: functionalities/breakpoint/breakpoint_callback_command_source/TestBreakpointCallbackCommandSource.py (1192 of 2134) PASS: lldb-api :: functionalities/data-formatter/vector-types/TestVectorTypesFormatting.py (1193 of 2134) PASS: lldb-unit :: Host/./HostTests/NativeProcessProtocolTest.ReadCStringFromMemory_CrossPageBoundary (1194 of 2134) PASS: lldb-api :: commands/expression/invalid-args/TestInvalidArgsExpression.py (1195 of 2134) PASS: lldb-unit :: Utility/./UtilityTests/NameMatchesTest.RegularExpression (1196 of 2134) PASS: lldb-unit :: DataFormatter/./LLDBFormatterTests/TypeMatcherTests.RegexName (1197 of 2134) PASS: lldb-api :: commands/expression/cast_int_to_anonymous_enum/TestCastIntToAnonymousEnum.py (1198 of 2134) PASS: lldb-api :: terminal/TestEditline.py (1199 of 2134) PASS: lldb-api :: tools/lldb-server/register-reading/TestGdbRemoteGPacket.py (1200 of 2134) PASS: lldb-api :: lang/c/bitfields/TestBitfields.py (1201 of 2134) PASS: lldb-shell :: SymbolFile/DWARF/DW_AT_declaration-with-children.s (1202 of 2134) PASS: lldb-api :: types/TestShortType.py (1203 of 2134) PASS: lldb-unit :: Expression/./ExpressionTests/DiagnosticManagerTest.AppendMessageAttachToLastDiag (1204 of 2134) PASS: lldb-unit :: Language/CLanguages/./LanguageCLanguagesTests/CLanguages.LookupCLanguagesByLanguageType (1205 of 2134) PASS: lldb-api :: commands/platform/process/list/TestProcessList.py (1206 of 2134) PASS: lldb-api :: functionalities/postmortem/minidump/TestMiniDump.py (1207 of 2134) PASS: lldb-unit :: ScriptInterpreter/Python/./ScriptInterpreterPythonTests/PythonDataObjectsTest.TestOwnedReferences (1208 of 2134) PASS: lldb-api :: functionalities/step-avoids-no-debug/TestStepNoDebug.py (1209 of 2134) PASS: lldb-api :: tools/lldb-server/TestGdbRemote_qThreadStopInfo.py (1210 of 2134) PASS: lldb-unit :: Utility/./UtilityTests/RangeVector.CombineConsecutiveRanges (1211 of 2134) PASS: lldb-unit :: Symbol/./SymbolTests/LineEntryTest.GetSameLineContiguousAddressRangeNoInlines (1212 of 2134) PASS: lldb-unit :: Process/gdb-remote/./ProcessGdbRemoteTests/GDBRemoteCommunicationClientTest.GetQOffsets (1213 of 2134) PASS: lldb-unit :: Utility/./UtilityTests/ArgsTest.ReplaceArgumentAtIndexEqual (1214 of 2134) PASS: lldb-api :: commands/command/script_alias/TestCommandScriptAlias.py (1215 of 2134) UNSUPPORTED: lldb-api :: functionalities/thread/create_during_step/TestCreateDuringStep.py (1216 of 2134) PASS: lldb-unit :: Utility/./UtilityTests/BinaryStreamTest.PutSLEB128One (1217 of 2134) PASS: lldb-shell :: ObjectFile/Breakpad/breakpad-identification.test (1218 of 2134) PASS: lldb-unit :: Utility/./UtilityTests/OptionsWithRawTest.ArgsButNoDelimiter (1219 of 2134) UNSUPPORTED: lldb-api :: tools/lldb-vscode/disconnect/TestVSCode_disconnect.py (1220 of 2134) PASS: lldb-unit :: Utility/./UtilityTests/BinaryStreamTest.PutSLEB128TwoBytes (1221 of 2134) PASS: lldb-api :: lang/objc/foundation/TestObjCMethods.py (1222 of 2134) PASS: lldb-unit :: Utility/./UtilityTests/LogChannelEnabledTest.LogThread (1223 of 2134) PASS: lldb-shell :: Minidump/memory-region.yaml (1224 of 2134) PASS: lldb-api :: functionalities/param_entry_vals/basic_entry_values/TestBasicEntryValues.py (1225 of 2134) PASS: lldb-unit :: Utility/./UtilityTests/BinaryStreamTest.PutULEB128TwoBytes (1226 of 2134) PASS: lldb-api :: functionalities/abbreviation/TestAbbreviations.py (1227 of 2134) PASS: lldb-shell :: SymbolFile/DWARF/debug_loc_and_loclists.s (1228 of 2134) PASS: lldb-unit :: Utility/./UtilityTests/OptionsWithRawTest.WhitespaceInput (1229 of 2134) PASS: lldb-unit :: Utility/./UtilityTests/StringListTest.JoinSingle (1230 of 2134) PASS: lldb-api :: commands/reproducer/invalid-args/TestInvalidArgsReproducer.py (1231 of 2134) PASS: lldb-unit :: Expression/./ExpressionTests/DWARFExpression.DW_OP_unknown (1232 of 2134) PASS: lldb-unit :: Utility/./UtilityTests/VMRange.SetEndAddress (1233 of 2134) PASS: lldb-api :: functionalities/data-formatter/dump_dynamic/TestDumpDynamic.py (1234 of 2134) PASS: lldb-unit :: Utility/./UtilityTests/RangeTest.Equal (1235 of 2134) PASS: lldb-unit :: Utility/./UtilityTests/ScalarTest.ComparisonFloat (1236 of 2134) PASS: lldb-unit :: Process/gdb-remote/./ProcessGdbRemoteTests/GDBRemoteCommunicationClientTest.GetMemoryRegionInfoInvalidResponse (1237 of 2134) PASS: lldb-unit :: Utility/./UtilityTests/ScalarTest.Comparison (1238 of 2134) PASS: lldb-unit :: UnwindAssembly/x86/./UnwindAssemblyx86Tests/Testx86AssemblyInspectionEngine.TestPopR15 (1239 of 2134) PASS: lldb-unit :: Utility/./UtilityTests/ProcessInstanceInfo.DumpTable_invalidUID (1240 of 2134) PASS: lldb-unit :: UnwindAssembly/x86/./UnwindAssemblyx86Tests/Testx86AssemblyInspectionEngine.TestReturnDetect (1241 of 2134) PASS: lldb-api :: commands/expression/ir-interpreter-phi-nodes/TestIRInterpreterPHINodes.py (1242 of 2134) PASS: lldb-api :: commands/command/nested_alias/TestNestedAlias.py (1243 of 2134) PASS: lldb-shell :: Driver/TestTarget.test (1244 of 2134) PASS: lldb-unit :: Utility/./UtilityTests/UUIDTest.SetFromStringRef (1245 of 2134) UNSUPPORTED: lldb-api :: functionalities/unwind/standard/TestStandardUnwind.py (1246 of 2134) UNSUPPORTED: lldb-shell :: SymbolFile/PDB/enums-layout.test (1247 of 2134) UNSUPPORTED: lldb-api :: functionalities/thread/state/TestThreadStates.py (1248 of 2134) PASS: lldb-unit :: Utility/./UtilityTests/RangeTest.NotEqualInvalid (1249 of 2134) PASS: lldb-unit :: Utility/./UtilityTests/FileSpecTest.Equal (1250 of 2134) PASS: lldb-api :: functionalities/breakpoint/scripted_bkpt/TestScriptedResolver.py (1251 of 2134) PASS: lldb-unit :: Process/minidump/./LLDBMinidumpTests/MinidumpParserTest.GetPidWow64 (1252 of 2134) PASS: lldb-api :: tools/lldb-vscode/stackTrace/TestVSCode_stackTrace.py (1253 of 2134) PASS: lldb-shell :: Breakpoint/split-dwarf-5-addrbase.test (1254 of 2134) PASS: lldb-api :: lang/cpp/multiple-inheritance/TestCppMultipleInheritance.py (1255 of 2134) UNSUPPORTED: lldb-shell :: Register/x86-zmm-read.test (1256 of 2134) PASS: lldb-unit :: Utility/./UtilityTests/UriParserTest.SchemeHostSeparator4 (1257 of 2134) PASS: lldb-unit :: Utility/./UtilityTests/StreamTeeTest.SetStreamAtIndexOutOfBounds (1258 of 2134) PASS: lldb-shell :: ScriptInterpreter/Python/eof.test (1259 of 2134) PASS: lldb-api :: lang/objc/self/TestObjCSelf.py (1260 of 2134) UNSUPPORTED: lldb-api :: arm/breakpoint-it/TestBreakpointIt.py (1261 of 2134) PASS: lldb-unit :: Symbol/./SymbolTests/TestTypeSystemClang.TestRecordHasFields (1262 of 2134) PASS: lldb-unit :: Utility/./UtilityTests/StringLexerTest.PutBack (1263 of 2134) PASS: lldb-api :: lang/objc/foundation/TestObjCMethodsString.py (1264 of 2134) PASS: lldb-unit :: UnwindAssembly/x86/./UnwindAssemblyx86Tests/Testx86AssemblyInspectionEngine.TestSimplei386ugmented (1265 of 2134) PASS: lldb-api :: commands/expression/import-std-module/stack/TestStackFromStdModule.py (1266 of 2134) PASS: lldb-shell :: SymbolFile/DWARF/find-basic-type.cpp (1267 of 2134) UNSUPPORTED: lldb-shell :: ScriptInterpreter/Lua/independent_state.test (1268 of 2134) PASS: lldb-unit :: Utility/./UtilityTests/StringExtractorTest.GetHexU8_Underflow2 (1269 of 2134) PASS: lldb-unit :: Expression/./ExpressionTests/DiagnosticManagerTest.GetStringBasic (1270 of 2134) PASS: lldb-unit :: Utility/./UtilityTests/StreamTest.PutChar (1271 of 2134) PASS: lldb-shell :: SymbolFile/NativePDB/break-by-function.cpp (1272 of 2134) PASS: lldb-api :: functionalities/gdb_remote_client/TestGDBRemoteClient.py (1273 of 2134) PASS: lldb-api :: lang/c/set_values/TestSetValues.py (1274 of 2134) PASS: lldb-unit :: Utility/./UtilityTests/StringListTest.AppendStringMove (1275 of 2134) PASS: lldb-api :: functionalities/breakpoint/auto_continue/TestBreakpointAutoContinue.py (1276 of 2134) PASS: lldb-unit :: Utility/./UtilityTests/AnsiTerminal.Unknown (1277 of 2134) PASS: lldb-unit :: Symbol/./SymbolTests/TestTypeSystemClang.TestRemoveFastQualifiers (1278 of 2134) PASS: lldb-shell :: SymbolFile/DWARF/find-basic-function.cpp (1279 of 2134) PASS: lldb-unit :: Utility/./UtilityTests/BinaryStreamTest.PutSLEB128MaxValue (1280 of 2134) PASS: lldb-api :: tools/lldb-server/TestGdbRemoteThreadsInStopReply.py (1281 of 2134) PASS: lldb-unit :: Utility/./UtilityTests/StringListTest.GetMaxStringLengthIncreasingSize (1282 of 2134) PASS: lldb-unit :: Utility/./UtilityTests/StreamTeeTest.GetStreamAtIndexOutOfBoundsEmpty (1283 of 2134) PASS: lldb-api :: tools/lldb-server/TestGdbRemoteHostInfo.py (1284 of 2134) PASS: lldb-unit :: Utility/./UtilityTests/UriParserTest.MinimalPort (1285 of 2134) PASS: lldb-unit :: UnwindAssembly/x86/./UnwindAssemblyx86Tests/Testx86AssemblyInspectionEngine.TestPushR12 (1286 of 2134) PASS: lldb-unit :: SymbolFile/DWARF/./SymbolFileDWARFTests/DWARFASTParserClangTests.EnsureAllDIEsInDeclContextHaveBeenParsedParsesOnlyMatchingEntries (1287 of 2134) PASS: lldb-api :: commands/expression/import-std-module/list/TestListFromStdModule.py (1288 of 2134) PASS: lldb-api :: commands/expression/import-std-module/vector/TestVectorFromStdModule.py (1289 of 2134) PASS: lldb-unit :: Utility/./UtilityTests/StringListTest.AppendStringCString (1290 of 2134) PASS: lldb-shell :: ObjectFile/Breakpad/sections.test (1291 of 2134) PASS: lldb-api :: functionalities/inferior-crashing/recursive-inferior/TestRecursiveInferiorStep.py (1292 of 2134) PASS: lldb-unit :: Target/./TargetTests/StackFrameRecognizerTest.NullModuleRegex (1293 of 2134) PASS: lldb-api :: functionalities/breakpoint/serialize/TestBreakpointSerialization.py (1294 of 2134) PASS: lldb-unit :: Process/minidump/./LLDBMinidumpTests/RegisterContextMinidump.ConvertMinidumpContext_x86_32 (1295 of 2134) PASS: lldb-api :: python_api/disassemble-raw-data/TestDisassemble_VST1_64.py (1296 of 2134) PASS: lldb-api :: functionalities/data-formatter/data-formatter-objc/TestDataFormatterObjCNSURL.py (1297 of 2134) PASS: lldb-api :: tools/lldb-server/TestGdbRemoteRegisterState.py (1298 of 2134) PASS: lldb-unit :: Language/Highlighting/./HighlighterTests/HighlighterTest.DefaultHighlighter (1299 of 2134) PASS: lldb-unit :: SymbolFile/NativePDB/./SymbolFileNativePDBTests/PDBFPOProgramToDWARFExpressionTests.InvalidOpUnary (1300 of 2134) UNSUPPORTED: lldb-shell :: Unwind/unwind-plan-dwarf-dump.test (1301 of 2134) PASS: lldb-api :: lang/objc/modules-auto-import/TestModulesAutoImport.py (1302 of 2134) PASS: lldb-api :: lang/cpp/diamond/TestDiamond.py (1303 of 2134) PASS: lldb-api :: python_api/sbvalue_const_addrof/TestSBValueConstAddrOf.py (1304 of 2134) PASS: lldb-shell :: ObjectFile/ELF/minidebuginfo-corrupt-xz.yaml (1305 of 2134) PASS: lldb-unit :: Utility/./UtilityTests/StringListTest.CopyListSingle (1306 of 2134) PASS: lldb-shell :: SymbolFile/DWARF/find-inline-method.s (1307 of 2134) PASS: lldb-unit :: Interpreter/./InterpreterTests/OptionArgParserTest.toBoolean (1308 of 2134) PASS: lldb-api :: lang/c/strings/TestCStrings.py (1309 of 2134) PASS: lldb-unit :: UnwindAssembly/x86/./UnwindAssemblyx86Tests/Testx86AssemblyInspectionEngine.Test32bitFramelessBigStackFrame (1310 of 2134) PASS: lldb-unit :: Utility/./UtilityTests/UriParserTest.TypicalPortPathIPv6 (1311 of 2134) PASS: lldb-api :: api/listeners/TestListener.py (1312 of 2134) PASS: lldb-api :: types/TestLongTypesExpr.py (1313 of 2134) PASS: lldb-unit :: Process/minidump/./LLDBMinidumpTests/MinidumpParserTest.GetArchitectureWindows (1314 of 2134) UNSUPPORTED: lldb-shell :: BuildScript/toolchain-clang-cl.test (1315 of 2134) PASS: lldb-api :: commands/watchpoints/multiple_threads/TestWatchpointMultipleThreads.py (1316 of 2134) PASS: lldb-unit :: Utility/./UtilityTests/StringListTest.AppendListCStringArray (1317 of 2134) PASS: lldb-api :: commands/expression/dont_allow_jit/TestAllowJIT.py (1318 of 2134) PASS: lldb-api :: lang/cpp/template/TestTemplateArgs.py (1319 of 2134) PASS: lldb-unit :: Utility/./UtilityTests/ArgsTest.TestQuotedUnknownEscape (1320 of 2134) PASS: lldb-api :: lang/objc/conflicting-definition/TestConflictingDefinition.py (1321 of 2134) PASS: lldb-api :: functionalities/data-formatter/data-formatter-named-summaries/TestDataFormatterNamedSummaries.py (1322 of 2134) PASS: lldb-unit :: Utility/./UtilityTests/DataExtractorTest.GetBitfield (1323 of 2134) PASS: lldb-unit :: Utility/./UtilityTests/StreamTeeTest.CopyConstructor (1324 of 2134) PASS: lldb-api :: functionalities/return-value/TestReturnValue.py (1325 of 2134) PASS: lldb-unit :: Utility/./UtilityTests/BinaryStreamTest.PutULEB128FourBytes (1326 of 2134) PASS: lldb-unit :: SymbolFile/NativePDB/./SymbolFileNativePDBTests/PDBFPOProgramToDWARFExpressionTests.UnresolvedRegisterAssignmentReference (1327 of 2134) PASS: lldb-unit :: Target/./TargetTests/PathMappingListTest.RelativeTests (1328 of 2134) PASS: lldb-unit :: Utility/./UtilityTests/ArgsTest.Yaml (1329 of 2134) PASS: lldb-shell :: Commands/command-disassemble.s (1330 of 2134) UNSUPPORTED: lldb-api :: functionalities/tty/TestTerminal.py (1331 of 2134) PASS: lldb-api :: functionalities/pre_run_dylibs/TestPreRunDylibs.py (1332 of 2134) PASS: lldb-api :: commands/expression/inline-namespace/TestInlineNamespace.py (1333 of 2134) PASS: lldb-shell :: Commands/command-backtrace.test (1334 of 2134) PASS: lldb-api :: commands/version/TestVersion.py (1335 of 2134) PASS: lldb-unit :: Utility/./UtilityTests/StreamTest.PutCStringWithStringRef (1336 of 2134) PASS: lldb-api :: commands/target/dump-symtab-demangle/TestDumpSymtabDemangle.py (1337 of 2134) PASS: lldb-unit :: Utility/./UtilityTests/CompletionRequest.ShiftArguments (1338 of 2134) PASS: lldb-unit :: Process/gdb-remote/./ProcessGdbRemoteTests/GDBRemoteCommunicationClientTest.WriteRegisterNoSuffix (1339 of 2134) PASS: lldb-api :: commands/expression/import-std-module/unique_ptr-dbg-info-content/TestUniquePtrDbgInfoContent.py (1340 of 2134) PASS: lldb-unit :: Utility/./UtilityTests/LogTest.Register (1341 of 2134) PASS: lldb-api :: functionalities/data-formatter/setvaluefromcstring/TestSetValueFromCString.py (1342 of 2134) PASS: lldb-api :: macosx/version_zero/TestGetVersionZeroVersion.py (1343 of 2134) PASS: lldb-unit :: Utility/./UtilityTests/ScalarTest.RightShiftOperator (1344 of 2134) PASS: lldb-unit :: Utility/./UtilityTests/BinaryStreamTest.PutULEB128SixBytes (1345 of 2134) PASS: lldb-shell :: ObjectFile/PECOFF/basic-info-arm.yaml (1346 of 2134) PASS: lldb-shell :: ObjectFile/wasm/basic.yaml (1347 of 2134) PASS: lldb-api :: functionalities/tail_call_frames/disambiguate_paths_to_common_sink/TestDisambiguatePathsToCommonSink.py (1348 of 2134) PASS: lldb-unit :: UnwindAssembly/x86/./UnwindAssemblyx86Tests/Testx86AssemblyInspectionEngine.TestSimple64bitFrameFunction (1349 of 2134) PASS: lldb-unit :: ScriptInterpreter/Python/./ScriptInterpreterPythonTests/PythonDataObjectsTest.TestPythonListManipulation (1350 of 2134) PASS: lldb-api :: python_api/interpreter/TestRunCommandInterpreterAPI.py (1351 of 2134) PASS: lldb-unit :: Utility/./UtilityTests/StreamTest.ShiftOperatorStrings (1352 of 2134) PASS: lldb-unit :: Utility/./UtilityTests/StringLexerTest.Next (1353 of 2134) PASS: lldb-unit :: Target/./TargetTests/ExecutionContextTest.GetByteOrder (1354 of 2134) PASS: lldb-unit :: Expression/./ExpressionTests/DiagnosticManagerTest.PutStringSeverities (1355 of 2134) PASS: lldb-api :: lang/objc/modules-hash-mismatch/TestClangModulesHashMismatch.py (1356 of 2134) UNSUPPORTED: lldb-api :: lang/objc/objc-dynamic-value/TestObjCDynamicValue.py (1357 of 2134) PASS: lldb-unit :: Utility/./UtilityTests/VMRange.IsValid (1358 of 2134) PASS: lldb-shell :: Quit/TestQuitExitCode30.test (1359 of 2134) PASS: lldb-shell :: Minidump/Windows/Sigsegv/sigsegv.test (1360 of 2134) PASS: lldb-shell :: Driver/TestCore.test (1361 of 2134) PASS: lldb-shell :: Commands/command-breakpoint-col.test (1362 of 2134) UNSUPPORTED: lldb-api :: benchmarks/turnaround/TestCompileRunToBreakpointTurnaround.py (1363 of 2134) PASS: lldb-unit :: ScriptInterpreter/Python/./ScriptInterpreterPythonTests/PythonDataObjectsTest.TestRun (1364 of 2134) PASS: lldb-unit :: Symbol/./SymbolTests/SymbolsTest.TerminateLocateExecutableSymbolFileForUnknownExecutableAndUnknownSymbolFile (1365 of 2134) PASS: lldb-unit :: Expression/./ExpressionTests/DiagnosticManagerTest.GetStringNoDiags (1366 of 2134) PASS: lldb-unit :: Utility/./UtilityTests/StreamTest.PutPtr (1367 of 2134) PASS: lldb-api :: iohandler/resize/TestIOHandlerResize.py (1368 of 2134) PASS: lldb-api :: functionalities/data-formatter/data-formatter-synthval/TestDataFormatterSynthVal.py (1369 of 2134) PASS: lldb-unit :: Utility/./UtilityTests/StreamTeeTest.Write (1370 of 2134) PASS: lldb-unit :: Utility/./UtilityTests/StringListTest.ForRange (1371 of 2134) UNSUPPORTED: lldb-api :: functionalities/darwin_log/filter/exact_match/category/TestDarwinLogFilterMatchCategory.py (1372 of 2134) PASS: lldb-unit :: Utility/./UtilityTests/StringLexerTest.NextIfList (1373 of 2134) PASS: lldb-unit :: SymbolFile/NativePDB/./SymbolFileNativePDBTests/PDBFPOProgramToDWARFExpressionTests.UnsupportedRASearch (1374 of 2134) PASS: lldb-api :: functionalities/thread/concurrent_events/TestConcurrentTwoWatchpointsOneSignal.py (1375 of 2134) PASS: lldb-api :: functionalities/thread/concurrent_events/TestConcurrentBreakpointOneDelayBreakpointThreads.py (1376 of 2134) PASS: lldb-shell :: SymbolFile/DWARF/find-basic-variable.cpp (1377 of 2134) PASS: lldb-unit :: Utility/./UtilityTests/StringExtractorTest.GetHexBytes_OddPair (1378 of 2134) PASS: lldb-api :: commands/target/select/TestTargetSelect.py (1379 of 2134) PASS: lldb-shell :: Settings/TestFrameFormatColor.test (1380 of 2134) PASS: lldb-unit :: Process/gdb-remote/./ProcessGdbRemoteTests/GDBRemoteCommunicationClientTest.SendGetDataPacket (1381 of 2134) PASS: lldb-api :: types/TestCharTypeExpr.py (1382 of 2134) UNSUPPORTED: lldb-shell :: SymbolFile/PDB/type-quals.test (1383 of 2134) UNSUPPORTED: lldb-shell :: SymbolFile/PDB/typedefs.test (1384 of 2134) PASS: lldb-shell :: Breakpoint/debug_rnglist_basic.test (1385 of 2134) PASS: lldb-unit :: debugserver/./debugserverTests/RNBSocket.LoopBackConnectIPv6 (1386 of 2134) PASS: lldb-unit :: Symbol/./SymbolTests/TestClangASTImporter.CanImportInvalidType (1387 of 2134) PASS: lldb-unit :: Utility/./UtilityTests/BinaryStreamTest.PutSLEB128NineBytes (1388 of 2134) PASS: lldb-api :: python_api/sbtype_typeclass/TestSBTypeTypeClass.py (1389 of 2134) PASS: lldb-unit :: Language/Highlighting/./HighlighterTests/HighlighterTest.DefaultHighlighterWithCursorOutOfBounds (1390 of 2134) PASS: lldb-api :: lang/cpp/lambdas/TestLambdas.py (1391 of 2134) PASS: lldb-api :: sanity/TestModuleCacheSanity.py (1392 of 2134) PASS: lldb-api :: macosx/thread-names/TestInterruptThreadNames.py (1393 of 2134) PASS: lldb-unit :: Symbol/./SymbolTests/LineEntryTest.GetSameLineContiguousAddressRangeOneInline (1394 of 2134) PASS: lldb-unit :: Language/Highlighting/./HighlighterTests/HighlighterTest.ClangCommas (1395 of 2134) PASS: lldb-unit :: Symbol/./SymbolTests/PostfixExpression.ToDWARF (1396 of 2134) PASS: lldb-api :: driver/batch_mode/TestBatchMode.py (1397 of 2134) UNSUPPORTED: lldb-api :: tools/lldb-server/libraries-svr4/TestGdbRemoteLibrariesSvr4Support.py (1398 of 2134) PASS: lldb-unit :: Utility/./UtilityTests/TimerTest.CategoryTimes (1399 of 2134) PASS: lldb-unit :: Utility/./UtilityTests/OptionsWithRawTest.SingleWordSuffix (1400 of 2134) PASS: lldb-api :: functionalities/data-formatter/typedef_array/TestTypedefArray.py (1401 of 2134) PASS: lldb-shell :: ObjectFile/MachO/lc_build_version.yaml (1402 of 2134) PASS: lldb-unit :: UnwindAssembly/x86/./UnwindAssemblyx86Tests/Testx86AssemblyInspectionEngine.TestStackRealign8BitDisp_i386 (1403 of 2134) PASS: lldb-api :: python_api/lldbutil/iter/TestLLDBIterator.py (1404 of 2134) PASS: lldb-api :: python_api/section/TestSectionAPI.py (1405 of 2134) PASS: lldb-unit :: Utility/./UtilityTests/StringListTest.JoinEmpty (1406 of 2134) PASS: lldb-unit :: Utility/./UtilityTests/StreamTest.AddressSuffix (1407 of 2134) PASS: lldb-api :: commands/watchpoints/watchpoint_commands/condition/TestWatchpointConditionCmd.py (1408 of 2134) PASS: lldb-shell :: SymbolFile/DWARF/dir-separator-posix.s (1409 of 2134) UNSUPPORTED: lldb-shell :: SymbolFile/NativePDB/stack_unwinding01.cpp (1410 of 2134) PASS: lldb-api :: functionalities/tail_call_frames/cross_dso/TestCrossDSOTailCalls.py (1411 of 2134) PASS: lldb-unit :: Utility/./UtilityTests/UriParserTest.LongPath (1412 of 2134) PASS: lldb-unit :: Symbol/./SymbolTests/TestTypeSystemClang.TestGetBasicTypeFromEnum (1413 of 2134) PASS: lldb-shell :: SymbolFile/NativePDB/ast-types.cpp (1414 of 2134) PASS: lldb-unit :: UnwindAssembly/x86/./UnwindAssemblyx86Tests/Testx86AssemblyInspectionEngine.TestSubRSP (1415 of 2134) UNSUPPORTED: lldb-api :: commands/watchpoints/multi_watchpoint_slots/TestWatchpointMultipleSlots.py (1416 of 2134) PASS: lldb-shell :: Reproducer/TestGDBRemoteRepro.test (1417 of 2134) PASS: lldb-unit :: Utility/./UtilityTests/StreamTest.PutHex16ByteOrderBig (1418 of 2134) PASS: lldb-api :: lang/cpp/namespace/TestNamespace.py (1419 of 2134) PASS: lldb-unit :: Utility/./UtilityTests/ScalarTest.Scalar_512 (1420 of 2134) UNSUPPORTED: lldb-api :: commands/watchpoints/variable_out_of_scope/TestWatchedVarHitWhenInScope.py (1421 of 2134) PASS: lldb-unit :: Language/Highlighting/./HighlighterTests/HighlighterTest.ClangCursorPosInOtherToken (1422 of 2134) PASS: lldb-shell :: Breakpoint/jitbp_elf.test (1423 of 2134) PASS: lldb-shell :: Reproducer/TestProcessList.test (1424 of 2134) PASS: lldb-shell :: SymbolFile/Breakpad/line-table.test (1425 of 2134) PASS: lldb-api :: functionalities/float-display/TestFloatDisplay.py (1426 of 2134) PASS: lldb-unit :: Host/./HostTests/MainLoopTest.DetectsEOF (1427 of 2134) PASS: lldb-unit :: Utility/./UtilityTests/StreamTest.PutRawBytesToMixedEndian (1428 of 2134) PASS: lldb-shell :: SymbolFile/DWARF/clang-ast-from-dwarf-objc-property.m (1429 of 2134) PASS: lldb-unit :: Utility/./UtilityTests/StringExtractorTest.GetHexBytes (1430 of 2134) PASS: lldb-shell :: Minidump/memory-region-from-module.yaml (1431 of 2134) PASS: lldb-api :: commands/target/stop-hook/enable/TestTargetStopHookEnable.py (1432 of 2134) PASS: lldb-unit :: UnwindAssembly/x86/./UnwindAssemblyx86Tests/Testx86AssemblyInspectionEngine.TestMovRSPtoRBP (1433 of 2134) PASS: lldb-api :: functionalities/load_using_paths/TestLoadUsingPaths.py (1434 of 2134) PASS: lldb-unit :: Utility/./UtilityTests/OptionsWithRawTest.ArgsButNoLeadingDash (1435 of 2134) PASS: lldb-unit :: Utility/./UtilityTests/BinaryStreamTest.PutULEB128One (1436 of 2134) PASS: lldb-api :: commands/expression/completion-in-lambda-and-unnamed-class/TestCompletionInLambdaAndUnnamedClass.py (1437 of 2134) PASS: lldb-unit :: UnwindAssembly/x86/./UnwindAssemblyx86Tests/Testx86AssemblyInspectionEngine.TestPushR15 (1438 of 2134) PASS: lldb-unit :: Host/./HostTests/File.GetStreamFromDescriptor (1439 of 2134) PASS: lldb-shell :: SymbolFile/DWARF/debug_line-tombstone.s (1440 of 2134) PASS: lldb-unit :: SymbolFile/NativePDB/./SymbolFileNativePDBTests/PDBFPOProgramToDWARFExpressionTests.DependencyChain (1441 of 2134) PASS: lldb-api :: python_api/class_members/TestSBTypeClassMembers.py (1442 of 2134) PASS: lldb-api :: lang/cpp/breakpoint_in_member_func_w_non_primitive_params/TestBreakpointInMemberFuncWNonPrimitiveParams.py (1443 of 2134) PASS: lldb-unit :: Utility/./UtilityTests/BinaryStreamTest.PutSLEB128FiveBytes (1444 of 2134) PASS: lldb-api :: functionalities/gdb_remote_client/TestNoGPacketSupported.py (1445 of 2134) PASS: lldb-api :: tools/lldb-server/TestAppleSimulatorOSType.py (1446 of 2134) PASS: lldb-unit :: Utility/./UtilityTests/RegularExpression.Empty (1447 of 2134) PASS: lldb-shell :: ObjectFile/Breakpad/discontiguous-sections.test (1448 of 2134) PASS: lldb-api :: commands/expression/issue_11588/Test11588.py (1449 of 2134) PASS: lldb-shell :: SymbolFile/DWARF/split-dwarf-multiple-cu.ll (1450 of 2134) PASS: lldb-shell :: SymbolFile/NativePDB/tag-types.cpp (1451 of 2134) PASS: lldb-unit :: Utility/./UtilityTests/StreamTeeTest.SetStreamAtIndexOverwrite (1452 of 2134) PASS: lldb-unit :: Utility/./UtilityTests/ListenerTest.GetEventWait (1453 of 2134) PASS: lldb-api :: functionalities/unwind/zeroth_frame/TestZerothFrame.py (1454 of 2134) PASS: lldb-unit :: Utility/./UtilityTests/IndexToObjectTest.ObjectForIndex (1455 of 2134) PASS: lldb-api :: functionalities/data-formatter/data-formatter-synthtype/TestDataFormatterSynthType.py (1456 of 2134) PASS: lldb-unit :: ScriptInterpreter/Python/./ScriptInterpreterPythonTests/PythonDataObjectsTest.TestPythonIntegerToStructuredInteger (1457 of 2134) PASS: lldb-unit :: Utility/./UtilityTests/StringListTest.InsertStringAtIndexStart (1458 of 2134) PASS: lldb-api :: lang/cpp/unsigned_types/TestUnsignedTypes.py (1459 of 2134) PASS: lldb-unit :: UnwindAssembly/x86/./UnwindAssemblyx86Tests/Testx86AssemblyInspectionEngine.TestPushEDI (1460 of 2134) PASS: lldb-api :: python_api/function_symbol/TestDisasmAPI.py (1461 of 2134) PASS: lldb-api :: tools/lldb-vscode/variables/TestVSCode_variables.py (1462 of 2134) PASS: lldb-api :: commands/target/create-deps/TestTargetCreateDeps.py (1463 of 2134) PASS: lldb-unit :: Process/gdb-remote/./ProcessGdbRemoteTests/GDBRemoteClientBaseTest.SendContinueDelegateInterface (1464 of 2134) PASS: lldb-unit :: Utility/./UtilityTests/DataExtractorTest.UncommonAddressSize (1465 of 2134) PASS: lldb-api :: lang/objc/ptr_refs/TestPtrRefsObjC.py (1466 of 2134) PASS: lldb-unit :: debugserver/./debugserverTests/JSON.Parse (1467 of 2134) PASS: lldb-api :: macosx/load-kext/TestLoadKext.py (1468 of 2134) PASS: lldb-shell :: SymbolFile/dissassemble-entry-point.s (1469 of 2134) PASS: lldb-api :: functionalities/data-formatter/data-formatter-stl/libcxx/initializerlist/TestInitializerList.py (1470 of 2134) PASS: lldb-api :: macosx/macCatalyst/TestMacCatalyst.py (1471 of 2134) UNSUPPORTED: lldb-api :: functionalities/thread/break_after_join/TestBreakAfterJoin.py (1472 of 2134) UNSUPPORTED: lldb-api :: linux/thread/create_during_instruction_step/TestCreateDuringInstructionStep.py (1473 of 2134) PASS: lldb-unit :: Utility/./UtilityTests/StreamTest.PutStringAsRawHex8 (1474 of 2134) PASS: lldb-unit :: Utility/./UtilityTests/ConstStringTest.UpdateMangledCounterpart (1475 of 2134) PASS: lldb-api :: functionalities/show_location/TestShowLocationDwarf5.py (1476 of 2134) PASS: lldb-unit :: Utility/./UtilityTests/StringListTest.GetMaxStringLengthDecreasingSize (1477 of 2134) PASS: lldb-api :: commands/watchpoints/watchpoint_set_command/TestWatchLocationWithWatchSet.py (1478 of 2134) PASS: lldb-api :: functionalities/data-formatter/data-formatter-stl/libcxx/iterator/TestDataFormatterLibccIterator.py (1479 of 2134) PASS: lldb-api :: lang/cpp/unicode-literals/TestUnicodeLiterals.py (1480 of 2134) PASS: lldb-api :: types/TestIntegerType.py (1481 of 2134) PASS: lldb-api :: functionalities/process_group/TestChangeProcessGroup.py (1482 of 2134) PASS: lldb-unit :: Signals/./SignalsTests/UnixSignalsTest.GetInfo (1483 of 2134) PASS: lldb-shell :: ObjectFile/wasm/embedded-debug-sections.yaml (1484 of 2134) PASS: lldb-unit :: ScriptInterpreter/Python/./ScriptInterpreterPythonTests/PythonDataObjectsTest.TestGlobalNameResolutionWithDot (1485 of 2134) PASS: lldb-unit :: Utility/./UtilityTests/OptionsWithRawTest.MultiWordSuffix (1486 of 2134) PASS: lldb-api :: python_api/symbol-context/two-files/TestSymbolContextTwoFiles.py (1487 of 2134) PASS: lldb-api :: functionalities/data-formatter/data-formatter-objc/TestDataFormatterObjCNSData.py (1488 of 2134) PASS: lldb-unit :: Utility/./UtilityTests/EnvironmentTest.EnvpConstruction (1489 of 2134) PASS: lldb-api :: lang/c/array_types/TestArrayTypes.py (1490 of 2134) PASS: lldb-unit :: Utility/./UtilityTests/ArgsTest.ReplaceArgumentAtIndexLonger (1491 of 2134) PASS: lldb-api :: functionalities/thread/concurrent_events/TestConcurrentSignalDelayBreak.py (1492 of 2134) PASS: lldb-unit :: Utility/./UtilityTests/StringListTest.PopBack (1493 of 2134) UNSUPPORTED: lldb-api :: lang/objc/rdar-12408181/TestRdar12408181.py (1494 of 2134) XFAIL: lldb-shell :: Register/x86-64-write.test (1495 of 2134) PASS: lldb-unit :: Expression/./ExpressionTests/ClangExpressionDeclMapTest.TestUnknownIdentifierLookup (1496 of 2134) PASS: lldb-shell :: Breakpoint/dummy-target.test (1497 of 2134) PASS: lldb-unit :: Utility/./UtilityTests/BinaryStreamTest.PutSLEB128OneByte (1498 of 2134) PASS: lldb-unit :: Expression/./ExpressionTests/DiagnosticManagerTest.AppendMessageNoDiag (1499 of 2134) PASS: lldb-unit :: Utility/./UtilityTests/LogChannelEnabledTest.LogGetLogThread (1500 of 2134) UNSUPPORTED: lldb-api :: commands/register/register/intel_xtended_registers/mpx_bound_violation/TestBoundViolation.py (1501 of 2134) UNSUPPORTED: lldb-shell :: SymbolFile/DWARF/debug-types-expressions.test (1502 of 2134) PASS: lldb-api :: functionalities/data-formatter/cstring-utf8-summary/TestCstringUnicode.py (1503 of 2134) PASS: lldb-shell :: ObjectFile/ELF/netbsd-exec-8.99.30-amd64.yaml (1504 of 2134) PASS: lldb-unit :: Utility/./UtilityTests/StringListTest.AppendListCStringArrayEmpty (1505 of 2134) PASS: lldb-api :: lang/cpp/overloaded-functions/TestOverloadedFunctions.py (1506 of 2134) PASS: lldb-unit :: Utility/./UtilityTests/LogChannelEnabledTest.LogVerboseThread (1507 of 2134) PASS: lldb-api :: lang/cpp/class-template-parameter-pack/TestClassTemplateParameterPack.py (1508 of 2134) PASS: lldb-unit :: Symbol/./SymbolTests/TestTypeSystemClang.TestGetBasicTypeFromName (1509 of 2134) PASS: lldb-api :: functionalities/ubsan/user-expression/TestUbsanUserExpression.py (1510 of 2134) PASS: lldb-unit :: Utility/./UtilityTests/UriParserTest.SchemeHostSeparator (1511 of 2134) PASS: lldb-api :: commands/expression/po_verbosity/TestPoVerbosity.py (1512 of 2134) PASS: lldb-api :: commands/frame/diagnose/complicated-expression/TestComplicatedExpression.py (1513 of 2134) PASS: lldb-shell :: SymbolFile/DWARF/debug_rnglists.s (1514 of 2134) PASS: lldb-unit :: Utility/./UtilityTests/StreamTest.PutHex32ByteOrderBig (1515 of 2134) PASS: lldb-unit :: ScriptInterpreter/Python/./ScriptInterpreterPythonTests/PythonDataObjectsTest.TestPythonCallableInvoke (1516 of 2134) PASS: lldb-unit :: UnwindAssembly/x86/./UnwindAssemblyx86Tests/Testx86AssemblyInspectionEngine.TestLEAVE (1517 of 2134) PASS: lldb-api :: functionalities/breakpoint/breakpoint_set_restart/TestBreakpointSetRestart.py (1518 of 2134) PASS: lldb-shell :: SymbolFile/Breakpad/symtab.test (1519 of 2134) PASS: lldb-api :: lang/cpp/virtual-overload/TestVirtualOverload.py (1520 of 2134) PASS: lldb-unit :: Utility/./UtilityTests/XcodeSDKTest.GetCanonicalNameAndConstruct (1521 of 2134) PASS: lldb-shell :: SymbolFile/NativePDB/disassembly.cpp (1522 of 2134) PASS: lldb-unit :: Utility/./UtilityTests/FileSpecTest.EqualDotsPosix (1523 of 2134) PASS: lldb-unit :: Expression/./ExpressionTests/DiagnosticManagerTest.GetStringMultipleDiags (1524 of 2134) PASS: lldb-unit :: Utility/./UtilityTests/ConstStringTest.YAML (1525 of 2134) PASS: lldb-api :: commands/process/attach-resume/TestAttachResume.py (1526 of 2134) PASS: lldb-unit :: ScriptInterpreter/Python/./ScriptInterpreterPythonTests/PythonDataObjectsTest.TestPythonDictionaryValueEquality (1527 of 2134) PASS: lldb-unit :: Utility/./UtilityTests/FileSpecTest.CopyByAppendingPathComponent (1528 of 2134) PASS: lldb-shell :: SymbolFile/DWARF/DW_AT_data_bit_offset-DW_OP_stack_value.s (1529 of 2134) UNSUPPORTED: lldb-shell :: ScriptInterpreter/Lua/persistent_state.test (1530 of 2134) PASS: lldb-unit :: Utility/./UtilityTests/BinaryStreamTest.PutSLEB128EightBytes (1531 of 2134) PASS: lldb-unit :: Process/minidump/./LLDBMinidumpTests/MinidumpParserTest.GetExceptionStream (1532 of 2134) PASS: lldb-unit :: Utility/./UtilityTests/AnsiTerminal.Incomplete (1533 of 2134) PASS: lldb-unit :: Process/gdb-remote/./ProcessGdbRemoteTests/GDBRemoteCommunicationClientTest.TestPacketSpeedJSON (1534 of 2134) UNSUPPORTED: lldb-api :: benchmarks/startup/TestStartupDelays.py (1535 of 2134) PASS: lldb-unit :: Utility/./UtilityTests/StringListTest.CopyList (1536 of 2134) PASS: lldb-api :: functionalities/archives/TestBSDArchives.py (1537 of 2134) PASS: lldb-unit :: Core/./LLDBCoreTests/ModuleSpecTest.InvalidInMemoryBufferValidFile (1538 of 2134) PASS: lldb-unit :: Process/minidump/./LLDBMinidumpTests/MinidumpParserTest.GetPidWindows (1539 of 2134) PASS: lldb-unit :: Utility/./UtilityTests/OptionsWithRawTest.EmptyArgsOnlySuffix (1540 of 2134) PASS: lldb-api :: functionalities/breakpoint/breakpoint_conditions/TestBreakpointConditions.py (1541 of 2134) PASS: lldb-unit :: Process/gdb-remote/./ProcessGdbRemoteTests/GDBRemoteCommunicationServerTest.SendErrorResponse_ErrorList (1542 of 2134) PASS: lldb-unit :: Utility/./UtilityTests/StringExtractorTest.GetHexU8_Underflow (1543 of 2134) PASS: lldb-api :: functionalities/data-formatter/type_summary_list_script/TestTypeSummaryListScript.py (1544 of 2134) PASS: lldb-api :: lang/objc/objc_direct-methods/TestObjCDirectMethods.py (1545 of 2134) PASS: lldb-unit :: Utility/./UtilityTests/VMRange.Comparison (1546 of 2134) PASS: lldb-shell :: SymbolFile/DWARF/dwp.s (1547 of 2134) PASS: lldb-unit :: Utility/./UtilityTests/StringListTest.GetMaxStringLengthEmpty (1548 of 2134) PASS: lldb-unit :: Utility/./UtilityTests/GeneratorTest.YamlMultiProvider (1549 of 2134) PASS: lldb-shell :: Process/TestEnvironment.test (1550 of 2134) UNSUPPORTED: lldb-api :: functionalities/data-formatter/data-formatter-stl/libstdcpp/list/TestDataFormatterStdList.py (1551 of 2134) PASS: lldb-unit :: Utility/./UtilityTests/StringExtractorTest.InitEmpty (1552 of 2134) PASS: lldb-shell :: Commands/command-source.test (1553 of 2134) PASS: lldb-api :: python_api/lldbutil/iter/TestRegistersIterator.py (1554 of 2134) PASS: lldb-unit :: Symbol/./SymbolTests/TestTypeSystemClang.TestDeletingImplicitCopyCstrDueToMoveCStr (1555 of 2134) PASS: lldb-api :: commands/expression/persist_objc_pointeetype/TestPersistObjCPointeeType.py (1556 of 2134) PASS: lldb-api :: types/TestFloatTypes.py (1557 of 2134) PASS: lldb-unit :: Host/./HostTests/HostInfoTest.GetHostname (1558 of 2134) PASS: lldb-unit :: Expression/./ExpressionTests/CppModuleConfigurationTest.UnknownLibCppFile (1559 of 2134) PASS: lldb-unit :: Utility/./UtilityTests/BinaryStreamTest.PutULEB128MaxValue (1560 of 2134) PASS: lldb-unit :: Utility/./UtilityTests/StringExtractorTest.GetHexBytes_Underflow (1561 of 2134) PASS: lldb-unit :: Utility/./UtilityTests/Flags.Reset (1562 of 2134) PASS: lldb-api :: lang/objc/objc-property/TestObjCProperty.py (1563 of 2134) PASS: lldb-unit :: Utility/./UtilityTests/ArgsTest.TestAppendArg (1564 of 2134) PASS: lldb-unit :: Utility/./UtilityTests/ScalarTest.CastOperations (1565 of 2134) PASS: lldb-shell :: ObjectFile/ELF/minidebuginfo-find-symbols.yaml (1566 of 2134) PASS: lldb-unit :: Expression/./ExpressionTests/DWARFExpression.DW_OP_convert (1567 of 2134) PASS: lldb-api :: commands/disassemble/basic/TestFrameDisassemble.py (1568 of 2134) UNSUPPORTED: lldb-api :: functionalities/darwin_log/source/debug/TestDarwinLogSourceDebug.py (1569 of 2134) PASS: lldb-unit :: Symbol/./SymbolTests/TestTypeSystemClang.TestGetTypeClassTypeOf (1570 of 2134) PASS: lldb-unit :: Host/./HostTests/SocketAddressTest.Set (1571 of 2134) PASS: lldb-unit :: Utility/./UtilityTests/StringExtractorTest.GetHexU8_InvalidHex_NoEof (1572 of 2134) PASS: lldb-unit :: Utility/./UtilityTests/StatusTest.ErrorConversion (1573 of 2134) PASS: lldb-api :: functionalities/type_lookup/TestTypeLookup.py (1574 of 2134) PASS: lldb-api :: python_api/type/TestTypeList.py (1575 of 2134) PASS: lldb-shell :: ObjectFile/MachO/lc_version_min.yaml (1576 of 2134) PASS: lldb-api :: functionalities/data-formatter/data-formatter-advanced/TestDataFormatterAdv.py (1577 of 2134) PASS: lldb-unit :: Core/./LLDBCoreTests/RichManglingContextTest.Basic (1578 of 2134) UNSUPPORTED: lldb-api :: functionalities/longjmp/TestLongjmp.py (1579 of 2134) PASS: lldb-api :: tools/lldb-vscode/console/TestVSCode_console.py (1580 of 2134) UNSUPPORTED: lldb-api :: linux/sepdebugsymlink/TestTargetSymbolsSepDebugSymlink.py (1581 of 2134) PASS: lldb-unit :: Utility/./UtilityTests/StreamTest.PutULEB128 (1582 of 2134) UNSUPPORTED: lldb-api :: functionalities/darwin_log/filter/regex/activity-chain/TestDarwinLogFilterRegexActivityChain.py (1583 of 2134) PASS: lldb-api :: lang/objc/objc-class-method/TestObjCClassMethod.py (1584 of 2134) PASS: lldb-unit :: Host/./HostTests/FileSystemTest.GetPermissions (1585 of 2134) PASS: lldb-api :: lang/cpp/incomplete-types/TestCppIncompleteTypes.py (1586 of 2134) PASS: lldb-unit :: Process/gdb-remote/./ProcessGdbRemoteTests/GDBRemoteCommunicationClientTest.SendStopTracePacket (1587 of 2134) UNSUPPORTED: lldb-shell :: ExecControl/StopHook/stop-hook-threads.test (1588 of 2134) PASS: lldb-api :: lang/objc/objc-new-syntax/TestObjCNewSyntaxLiteral.py (1589 of 2134) PASS: lldb-unit :: DataFormatter/./LLDBFormatterTests/TypeMatcherTests.GetMatchStringRegex (1590 of 2134) PASS: lldb-api :: types/TestCharType.py (1591 of 2134) PASS: lldb-shell :: SymbolFile/NativePDB/global-classes.cpp (1592 of 2134) PASS: lldb-api :: functionalities/var_path/TestVarPath.py (1593 of 2134) PASS: lldb-api :: lang/c/shared_lib_stripped_symbols/TestSharedLibStrippedSymbols.py (1594 of 2134) PASS: lldb-unit :: Utility/./UtilityTests/BinaryStreamTest.PutSLEB128ThreeBytes (1595 of 2134) PASS: lldb-api :: lang/c/shared_lib/TestSharedLib.py (1596 of 2134) PASS: lldb-shell :: SymbolFile/DWARF/debug_ranges.s (1597 of 2134) PASS: lldb-unit :: Host/./HostTests/Host.WaitStatusFormat (1598 of 2134) UNSUPPORTED: lldb-api :: functionalities/data-formatter/data-formatter-stl/libstdcpp/tuple/TestDataFormatterStdTuple.py (1599 of 2134) PASS: lldb-unit :: Utility/./UtilityTests/SubsystemRAIITest.NormalSubsystem (1600 of 2134) PASS: lldb-api :: commands/target/stop-hook/disable/TestTargetStopHookDisable.py (1601 of 2134) PASS: lldb-api :: functionalities/thread/backtrace_all/TestBacktraceAll.py (1602 of 2134) PASS: lldb-shell :: ObjectFile/PECOFF/symbol.yaml (1603 of 2134) PASS: lldb-api :: python_api/target/TestTargetAPI.py (1604 of 2134) PASS: lldb-unit :: Utility/./UtilityTests/StreamTest.PutHex64ByteOrderBig (1605 of 2134) PASS: lldb-unit :: Process/minidump/./LLDBMinidumpTests/MinidumpParserTest.MinidumpDuplicateModuleSeparateCode (1606 of 2134) PASS: lldb-unit :: Utility/./UtilityTests/StringExtractorTest.GetNameColonValueNoSemicolon (1607 of 2134) PASS: lldb-api :: functionalities/data-formatter/data-formatter-stl/libcxx/atomic/TestLibCxxAtomic.py (1608 of 2134) PASS: lldb-shell :: Reproducer/TestDriverOptions.test (1609 of 2134) PASS: lldb-unit :: Utility/./UtilityTests/BinaryStreamTest.PutULEB128FiveBytes (1610 of 2134) UNSUPPORTED: lldb-shell :: Register/x86-gp-write.test (1611 of 2134) PASS: lldb-shell :: ObjectFile/PECOFF/sections.yaml (1612 of 2134) PASS: lldb-unit :: Expression/./ExpressionTests/ClangExpressionDeclMapTest.TestPersistentDeclLookup (1613 of 2134) PASS: lldb-unit :: Host/./HostTests/NativeProcessProtocolTest.SetBreakpointFailRead (1614 of 2134) PASS: lldb-api :: functionalities/postmortem/minidump-new/TestMiniDumpNew.py (1615 of 2134) PASS: lldb-unit :: Utility/./UtilityTests/Flags.IsClear (1616 of 2134) PASS: lldb-api :: functionalities/thread/concurrent_events/TestConcurrentCrashWithWatchpointBreakpointSignal.py (1617 of 2134) PASS: lldb-api :: functionalities/thread/concurrent_events/TestConcurrentManyBreakpoints.py (1618 of 2134) PASS: lldb-shell :: ObjectFile/ELF/PT_LOAD-overlap.yaml (1619 of 2134) PASS: lldb-unit :: debugserver/./debugserverTests/RNBSocket.LoopBackConnectIPv4 (1620 of 2134) UNSUPPORTED: lldb-api :: benchmarks/stepping/TestSteppingSpeed.py (1621 of 2134) PASS: lldb-shell :: SymbolFile/DWARF/limit-debug-info.s (1622 of 2134) UNSUPPORTED: lldb-api :: functionalities/darwin_log/filter/regex/message/TestDarwinLogFilterRegexMessage.py (1623 of 2134) PASS: lldb-unit :: ScriptInterpreter/Python/./ScriptInterpreterPythonTests/PythonDataObjectsTest.TestPythonTupleValues (1624 of 2134) PASS: lldb-api :: functionalities/unwind/sigtramp/TestSigtrampUnwind.py (1625 of 2134) PASS: lldb-unit :: Utility/./UtilityTests/PassiveReplayTest.InstrumentedFooInvalid (1626 of 2134) PASS: lldb-unit :: Utility/./UtilityTests/GeneratorTest.Create (1627 of 2134) PASS: lldb-shell :: Breakpoint/split-dwarf5-debug-stroffsets.test (1628 of 2134) PASS: lldb-unit :: Utility/./UtilityTests/SerializationRountripTest.SerializeDeserializeObjectPointer (1629 of 2134) PASS: lldb-unit :: Utility/./UtilityTests/FileSpecTest.PrependPathComponent (1630 of 2134) PASS: lldb-unit :: Utility/./UtilityTests/StringListTest.GetMaxStringLengthEqualSize (1631 of 2134) PASS: lldb-api :: lang/cpp/accelerator-table/TestCPPAccelerator.py (1632 of 2134) PASS: lldb-unit :: Utility/./UtilityTests/RangeTest.ContainsAddr (1633 of 2134) PASS: lldb-shell :: ObjectFile/ELF/build-id-case.yaml (1634 of 2134) PASS: lldb-api :: commands/expression/import-std-module/vector-bool/TestVectorBoolFromStdModule.py (1635 of 2134) PASS: lldb-api :: functionalities/fat_archives/TestFatArchives.py (1636 of 2134) PASS: lldb-api :: functionalities/thread/step_until/TestStepUntil.py (1637 of 2134) UNSUPPORTED: lldb-api :: commands/register/register/intel_xtended_registers/mpx_offset_intersection/TestMPXOffsetIntersection.py (1638 of 2134) PASS: lldb-unit :: Utility/./UtilityTests/ArchSpecTest.Compatibility (1639 of 2134) PASS: lldb-unit :: Utility/./UtilityTests/UriParserTest.Empty (1640 of 2134) PASS: lldb-shell :: ObjectFile/PECOFF/uuid.yaml (1641 of 2134) PASS: lldb-unit :: ObjectFile/ELF/./ObjectFileELFTests/ObjectFileELFTest.SectionsResolveConsistently (1642 of 2134) PASS: lldb-unit :: Utility/./UtilityTests/ReproducerTest.SetReplay (1643 of 2134) PASS: lldb-unit :: Utility/./UtilityTests/StringListTest.JoinThree (1644 of 2134) PASS: lldb-api :: python_api/debugger/TestDebuggerAPI.py (1645 of 2134) PASS: lldb-api :: functionalities/memory/find/TestMemoryFind.py (1646 of 2134) PASS: lldb-unit :: Utility/./UtilityTests/StreamTest.PutCharWhitespace (1647 of 2134) UNSUPPORTED: lldb-shell :: SymbolFile/PDB/func-symbols.test (1648 of 2134) PASS: lldb-unit :: Host/./HostTests/MainLoopTest.Signal (1649 of 2134) PASS: lldb-unit :: Process/gdb-remote/./ProcessGdbRemoteTests/GDBRemoteCommunicationClientTest.ReadRegister (1650 of 2134) PASS: lldb-api :: lang/c/conflicting-symbol/TestConflictingSymbol.py (1651 of 2134) PASS: lldb-shell :: SymbolFile/DWARF/module-ownership.mm (1652 of 2134) PASS: lldb-api :: commands/platform/basic/TestPlatformCommand.py (1653 of 2134) PASS: lldb-api :: commands/disassemble/basic/TestDisassembleBreakpoint.py (1654 of 2134) PASS: lldb-api :: lang/c/local_types/TestUseClosestType.py (1655 of 2134) UNSUPPORTED: lldb-shell :: SymbolFile/PDB/class-layout.test (1656 of 2134) PASS: lldb-unit :: Host/./HostTests/HostInfoTest.GetXcodeSDK (1657 of 2134) PASS: lldb-unit :: Utility/./UtilityTests/RangeTest.LessThanInvalid (1658 of 2134) PASS: lldb-shell :: ScriptInterpreter/Python/crashlog.test (1659 of 2134) PASS: lldb-unit :: Utility/./UtilityTests/UriParserTest.MinimalPath (1660 of 2134) PASS: lldb-unit :: ScriptInterpreter/Python/./ScriptInterpreterPythonTests/PythonDataObjectsTest.TestPythonStringToStructuredString (1661 of 2134) PASS: lldb-api :: functionalities/gdb_remote_client/TestRecognizeBreakpoint.py (1662 of 2134) PASS: lldb-unit :: Utility/./UtilityTests/OptionsWithRawTest.QuotedSuffix (1663 of 2134) PASS: lldb-shell :: Breakpoint/implicit_const_form_support.test (1664 of 2134) UNSUPPORTED: lldb-shell :: Register/x86-64-zmm-write.test (1665 of 2134) PASS: lldb-unit :: Utility/./UtilityTests/StreamTeeTest.Constructor1Stream (1666 of 2134) PASS: lldb-unit :: Host/./HostTests/FileSystemTest.GetByteSize (1667 of 2134) PASS: lldb-unit :: Host/./HostTests/MainLoopTest.TerminatesImmediately (1668 of 2134) PASS: lldb-shell :: SymbolFile/DWARF/dwarf5-debug_line.s (1669 of 2134) PASS: lldb-unit :: DataFormatter/./LLDBFormatterTests/TypeMatcherTests.ExactName (1670 of 2134) PASS: lldb-api :: commands/frame/recognizer/TestFrameRecognizer.py (1671 of 2134) PASS: lldb-unit :: ScriptInterpreter/Python/./ScriptInterpreterPythonTests/PythonDataObjectsTest.TestPythonListToStructuredList (1672 of 2134) PASS: lldb-api :: macosx/simulator/TestSimulatorPlatform.py (1673 of 2134) PASS: lldb-unit :: Utility/./UtilityTests/ArgsTest.BareSingleQuote (1674 of 2134) PASS: lldb-api :: python_api/breakpoint/TestBreakpointAPI.py (1675 of 2134) PASS: lldb-unit :: Utility/./UtilityTests/StringListTest.SplitIntoLines (1676 of 2134) PASS: lldb-api :: commands/process/launch-with-shellexpand/TestLaunchWithShellExpand.py (1677 of 2134) PASS: lldb-unit :: Utility/./UtilityTests/BinaryStreamTest.PutSLEB128SixBytes (1678 of 2134) PASS: lldb-unit :: DataFormatter/./LLDBFormatterTests/StringPrinterTests.CxxUTF8 (1679 of 2134) PASS: lldb-api :: lang/objc/variadic_methods/TestVariadicMethods.py (1680 of 2134) PASS: lldb-api :: lang/cpp/type_lookup/TestCppTypeLookup.py (1681 of 2134) PASS: lldb-unit :: Utility/./UtilityTests/BinaryStreamTest.PutULEB128NineBytes (1682 of 2134) UNSUPPORTED: lldb-shell :: Register/arm-fp-read.test (1683 of 2134) PASS: lldb-api :: commands/expression/two-files/TestObjCTypeQueryFromOtherCompileUnit.py (1684 of 2134) PASS: lldb-unit :: Process/minidump/./LLDBMinidumpTests/MinidumpParserTest.GetMiscInfoWindows (1685 of 2134) UNSUPPORTED: lldb-shell :: ScriptInterpreter/Lua/watchpoint_callback.test (1686 of 2134) PASS: lldb-shell :: Expr/TestMultilineExpr.test (1687 of 2134) PASS: lldb-api :: commands/expression/entry-bp/TestExprEntryBP.py (1688 of 2134) PASS: lldb-api :: lang/c/struct_types/TestStructTypes.py (1689 of 2134) PASS: lldb-api :: lang/c/unions/TestUnionMembers.py (1690 of 2134) PASS: lldb-api :: functionalities/step_scripted/TestStepScripted.py (1691 of 2134) PASS: lldb-api :: functionalities/abbreviation/TestCommonShortSpellings.py (1692 of 2134) PASS: lldb-shell :: SymbolFile/DWARF/apple-index-is-used.cpp (1693 of 2134) PASS: lldb-unit :: Utility/./UtilityTests/ProcessInstanceInfo.Yaml (1694 of 2134) PASS: lldb-unit :: Target/./TargetTests/RemoteAwarePlatformTest.TestResolveExecutabelOnClientByPlatform (1695 of 2134) PASS: lldb-unit :: Target/./TargetTests/ExecutionContextTest.GetByteOrderProcess (1696 of 2134) PASS: lldb-api :: functionalities/data-formatter/data-formatter-stl/libcxx/queue/TestDataFormatterLibcxxQueue.py (1697 of 2134) PASS: lldb-api :: commands/expression/import-std-module/vector-of-vectors/TestVectorOfVectorsFromStdModule.py (1698 of 2134) PASS: lldb-api :: functionalities/thread/concurrent_events/TestConcurrentSignalWatchBreak.py (1699 of 2134) PASS: lldb-api :: commands/gui/invalid-args/TestInvalidArgsGui.py (1700 of 2134) PASS: lldb-unit :: Utility/./UtilityTests/StringListTest.SplitIntoLinesSingleTrailingCR (1701 of 2134) PASS: lldb-api :: commands/expression/diagnostics/TestExprDiagnostics.py (1702 of 2134) PASS: lldb-shell :: ObjectFile/ELF/PT_LOAD-empty.yaml (1703 of 2134) PASS: lldb-api :: lang/cpp/virtual-functions/TestCppVirtualFunctions.py (1704 of 2134) PASS: lldb-api :: functionalities/thread/concurrent_events/TestConcurrentSignalNWatchNBreak.py (1705 of 2134) PASS: lldb-unit :: Utility/./UtilityTests/StreamTest.AddressRangeSize (1706 of 2134) PASS: lldb-api :: commands/add-dsym/uuid/TestAddDsymCommand.py (1707 of 2134) UNSUPPORTED: lldb-api :: android/platform/TestDefaultCacheLineSize.py (1708 of 2134) PASS: lldb-unit :: Process/gdb-remote/./ProcessGdbRemoteTests/GDBRemoteCommunicationServerTest.SendErrorResponse_UnimplementedError (1709 of 2134) PASS: lldb-unit :: Language/Highlighting/./HighlighterTests/HighlighterTest.Keywords (1710 of 2134) PASS: lldb-unit :: Utility/./UtilityTests/FileSpecTest.FormatFileSpec (1711 of 2134) PASS: lldb-unit :: Utility/./UtilityTests/CompletionRequest.FakeLastArg (1712 of 2134) PASS: lldb-unit :: Process/minidump/./LLDBMinidumpTests/MinidumpParserTest.GetMemoryRegionInfoFromMemoryList (1713 of 2134) PASS: lldb-shell :: Process/UnsupportedLanguage.test (1714 of 2134) PASS: lldb-unit :: Target/./TargetTests/ExecutionContextTest.GetByteOrderTarget (1715 of 2134) PASS: lldb-unit :: Utility/./UtilityTests/ArgsTest.TestOverwriteArgs (1716 of 2134) UNSUPPORTED: lldb-api :: commands/watchpoints/hello_watchlocation/TestWatchLocation.py (1717 of 2134) PASS: lldb-unit :: UnwindAssembly/x86/./UnwindAssemblyx86Tests/Testx86AssemblyInspectionEngine.TestPushEBP (1718 of 2134) PASS: lldb-api :: commands/watchpoints/watchpoint_size/TestWatchpointSizes.py (1719 of 2134) PASS: lldb-api :: commands/expression/radar_9673664/TestExprHelpExamples.py (1720 of 2134) PASS: lldb-api :: functionalities/postmortem/elf-core/TestLinuxCore.py (1721 of 2134) PASS: lldb-api :: python_api/objc_type/TestObjCType.py (1722 of 2134) PASS: lldb-api :: functionalities/data-formatter/data-formatter-skip-summary/TestDataFormatterSkipSummary.py (1723 of 2134) PASS: lldb-unit :: UnwindAssembly/x86/./UnwindAssemblyx86Tests/Testx86AssemblyInspectionEngine.TestPopRBPWithREX (1724 of 2134) PASS: lldb-unit :: Process/minidump/./LLDBMinidumpTests/MinidumpParserTest.GetMemoryRegionInfo (1725 of 2134) PASS: lldb-shell :: Reproducer/TestFileRepro.test (1726 of 2134) PASS: lldb-shell :: ScriptInterpreter/None/import_module.test (1727 of 2134) PASS: lldb-api :: api/log/TestAPILog.py (1728 of 2134) PASS: lldb-api :: functionalities/lazy-loading/TestLazyLoading.py (1729 of 2134) PASS: lldb-api :: lang/cpp/char1632_t/TestChar1632T.py (1730 of 2134) PASS: lldb-unit :: Utility/./UtilityTests/RegularExpression.Match (1731 of 2134) PASS: lldb-unit :: Utility/./UtilityTests/BinaryStreamTest.PutULEB128SevenBytes (1732 of 2134) PASS: lldb-unit :: Utility/./UtilityTests/StatusTest.ErrorConstructor (1733 of 2134) PASS: lldb-unit :: Host/./HostTests/FileSystemTest.Exists (1734 of 2134) XFAIL: lldb-shell :: SymbolFile/DWARF/find-type-in-function.cpp (1735 of 2134) PASS: lldb-unit :: SymbolFile/NativePDB/./SymbolFileNativePDBTests/PDBFPOProgramToDWARFExpressionTests.MultipleIndependentAssignments (1736 of 2134) PASS: lldb-api :: commands/expression/import-std-module/shared_ptr/TestSharedPtrFromStdModule.py (1737 of 2134) PASS: lldb-unit :: Utility/./UtilityTests/StreamTeeTest.AppendStream (1738 of 2134) PASS: lldb-unit :: tools/lldb-server/tests/./LLDBServerTests/TestBase.DebugserverEnv (1739 of 2134) PASS: lldb-api :: lang/c/complex_int/TestComplexInt.py (1740 of 2134) PASS: lldb-api :: commands/expression/formatters/TestFormatters.py (1741 of 2134) PASS: lldb-api :: macosx/nslog/TestDarwinNSLogOutput.py (1742 of 2134) PASS: lldb-api :: lang/cpp/limit-debug-info/TestWithLimitDebugInfo.py (1743 of 2134) PASS: lldb-unit :: Utility/./UtilityTests/FileSpecTest.FileAndDirectoryComponents (1744 of 2134) PASS: lldb-shell :: SymbolFile/DWARF/debug_loc.s (1745 of 2134) PASS: lldb-unit :: Utility/./UtilityTests/VASprintfTest.BufferResize (1746 of 2134) PASS: lldb-shell :: SymbolFile/DWARF/dwp-debug-types.s (1747 of 2134) PASS: lldb-shell :: Reproducer/TestHomeDir.test (1748 of 2134) PASS: lldb-api :: functionalities/thread/concurrent_events/TestConcurrentDelayedCrashWithBreakpointSignal.py (1749 of 2134) PASS: lldb-unit :: Utility/./UtilityTests/RegisterValueTest.GetSet8 (1750 of 2134) PASS: lldb-api :: lang/cpp/const_this/TestConstThis.py (1751 of 2134) PASS: lldb-shell :: SymbolFile/DWARF/debug_aranges-empty-section.s (1752 of 2134) PASS: lldb-shell :: Reproducer/TestRelativePath.test (1753 of 2134) PASS: lldb-api :: tools/lldb-vscode/breakpoint-events/TestVSCode_breakpointEvents.py (1754 of 2134) PASS: lldb-shell :: Register/x86-64-gp-read.test (1755 of 2134) PASS: lldb-api :: functionalities/thread/exit_during_expression/TestExitDuringExpression.py (1756 of 2134) PASS: lldb-api :: python_api/watchpoint/TestWatchpointIter.py (1757 of 2134) PASS: lldb-api :: lang/cpp/function-qualifiers/TestCppFunctionQualifiers.py (1758 of 2134) PASS: lldb-api :: commands/expression/import_builtin_fileid/TestImportBuiltinFileID.py (1759 of 2134) UNSUPPORTED: lldb-api :: tools/lldb-server/TestGdbRemoteAuxvSupport.py (1760 of 2134) PASS: lldb-unit :: UnwindAssembly/x86/./UnwindAssemblyx86Tests/Testx86AssemblyInspectionEngine.Test64bitFramelessSmallStackFrame (1761 of 2134) PASS: lldb-unit :: Utility/./UtilityTests/DataExtractorTest.GetCStrAtNullOffset (1762 of 2134) PASS: lldb-shell :: Host/TestCustomShell.test (1763 of 2134) PASS: lldb-unit :: Symbol/./SymbolTests/TestTypeSystemClang.TestConvertAccessTypeToAccessSpecifier (1764 of 2134) UNSUPPORTED: lldb-shell :: SymbolFile/PDB/variables-locations.test (1765 of 2134) PASS: lldb-unit :: Core/./LLDBCoreTests/SourceFileCache.FindSourceFileNotFound (1766 of 2134) PASS: lldb-unit :: Language/CPlusPlus/./LanguageCPlusPlusTests/CPlusPlusLanguage.FindAlternateFunctionManglings (1767 of 2134) PASS: lldb-unit :: Utility/./UtilityTests/StreamTest.PutCString (1768 of 2134) PASS: lldb-shell :: SymbolFile/DWARF/win-i386-line-table.s (1769 of 2134) PASS: lldb-unit :: Signals/./SignalsTests/UnixSignalsTest.GetFilteredSignals (1770 of 2134) UNSUPPORTED: lldb-shell :: SymbolFile/PDB/ast-restore.test (1771 of 2134) PASS: lldb-api :: commands/expression/calculator_mode/TestCalculatorMode.py (1772 of 2134) PASS: lldb-api :: functionalities/memory-region/TestMemoryRegion.py (1773 of 2134) PASS: lldb-unit :: Utility/./UtilityTests/ArchSpecTest.TestParseMachCPUDashSubtypeTripleExtra (1774 of 2134) PASS: lldb-api :: functionalities/thread/state_after_expression/TestStateAfterExpression.py (1775 of 2134) PASS: lldb-shell :: ObjectFile/ELF/basic-info.yaml (1776 of 2134) PASS: lldb-unit :: Utility/./UtilityTests/ArchSpecTest.TestParseMachCPUDashSubtypeTripleSimple (1777 of 2134) PASS: lldb-shell :: Unwind/trap_frame_sym_ctx.test (1778 of 2134) PASS: lldb-unit :: Symbol/./SymbolTests/TestClangASTImporter.CopyDeclTagDecl (1779 of 2134) PASS: lldb-shell :: SymbolFile/DWARF/debug-types-dwarf5.s (1780 of 2134) PASS: lldb-shell :: SymbolFile/NativePDB/ast-functions.cpp (1781 of 2134) PASS: lldb-unit :: Utility/./UtilityTests/OptionsWithRawTest.EmptyInput (1782 of 2134) UNSUPPORTED: lldb-shell :: SymbolFile/target-symbols-add-unwind.test (1783 of 2134) PASS: lldb-api :: functionalities/breakpoint/debugbreak/TestDebugBreak.py (1784 of 2134) UNSUPPORTED: lldb-shell :: Watchpoint/netbsd-nouserdbregs.test (1785 of 2134) PASS: lldb-shell :: SymbolFile/DWARF/debug_loc-aslr.s (1786 of 2134) PASS: lldb-unit :: Utility/./UtilityTests/DataExtractorTest.GetDoubleUnaligned (1787 of 2134) PASS: lldb-api :: commands/session/history/TestSessionHistory.py (1788 of 2134) PASS: lldb-api :: types/TestDoubleTypesExpr.py (1789 of 2134) PASS: lldb-unit :: Utility/./UtilityTests/FileSpecTest.Match (1790 of 2134) UNSUPPORTED: lldb-shell :: SymbolFile/PDB/calling-conventions.test (1791 of 2134) PASS: lldb-api :: functionalities/conditional_break/TestConditionalBreak.py (1792 of 2134) PASS: lldb-shell :: Reproducer/TestCaptureEnvOverride.test (1793 of 2134) PASS: lldb-api :: lang/objc/objc-new-syntax/TestObjCNewSyntaxDictionary.py (1794 of 2134) PASS: lldb-unit :: Host/./HostTests/ProcessLaunchInfoTest.Constructor (1795 of 2134) PASS: lldb-api :: functionalities/breakpoint/source_regexp/TestSourceRegexBreakpoints.py (1796 of 2134) PASS: lldb-api :: functionalities/thread/concurrent_events/TestConcurrentSignalDelayWatch.py (1797 of 2134) PASS: lldb-unit :: Utility/./UtilityTests/TimeoutTest.Format (1798 of 2134) PASS: lldb-api :: lang/cpp/global_variables/TestCPPGlobalVariables.py (1799 of 2134) PASS: lldb-unit :: Utility/./UtilityTests/RangeTest.ContainsRange (1800 of 2134) PASS: lldb-unit :: Utility/./UtilityTests/StringExtractorTest.GetHexBytesAvail_OddPair2 (1801 of 2134) PASS: lldb-unit :: Utility/./UtilityTests/FileSpecTest.IsRelative (1802 of 2134) PASS: lldb-api :: functionalities/gdb_remote_client/TestNestedRegDefinitions.py (1803 of 2134) PASS: lldb-shell :: SymbolFile/DWARF/static_scope.s (1804 of 2134) PASS: lldb-unit :: SymbolFile/NativePDB/./SymbolFileNativePDBTests/PDBFPOProgramToDWARFExpressionTests.UnresolvedCyclicRegisterAssignmentReference (1805 of 2134) PASS: lldb-unit :: Utility/./UtilityTests/BinaryStreamTest.PutSLEB128Zero (1806 of 2134) PASS: lldb-api :: functionalities/data-formatter/data-formatter-stl/libcxx/function/TestLibCxxFunction.py (1807 of 2134) PASS: lldb-unit :: Expression/./ExpressionTests/CppModuleConfigurationTest.Linux (1808 of 2134) PASS: lldb-api :: functionalities/tsan/thread_numbers/TestTsanThreadNumbers.py (1809 of 2134) PASS: lldb-unit :: Utility/./UtilityTests/StringListTest.AppendList (1810 of 2134) PASS: lldb-api :: functionalities/thread/concurrent_events/TestConcurrentCrashWithBreak.py (1811 of 2134) PASS: lldb-shell :: ObjectFile/ELF/avr-basic-info.yaml (1812 of 2134) PASS: lldb-shell :: SymbolFile/NativePDB/globals-bss.cpp (1813 of 2134) PASS: lldb-unit :: Utility/./UtilityTests/OptionsWithRawTest.SingleWhitespaceInput (1814 of 2134) PASS: lldb-shell :: ObjectFile/ELF/duplicate-section.yaml (1815 of 2134) PASS: lldb-unit :: Utility/./UtilityTests/RangeDataVector.CustomSort (1816 of 2134) PASS: lldb-api :: functionalities/paths/TestPaths.py (1817 of 2134) PASS: lldb-api :: functionalities/data-formatter/data-formatter-stl/libcxx/multiset/TestDataFormatterLibcxxMultiSet.py (1818 of 2134) UNSUPPORTED: lldb-api :: benchmarks/libcxxlist/TestBenchmarkLibcxxList.py (1819 of 2134) PASS: lldb-unit :: Utility/./UtilityTests/ArgsTest.ReplaceArgumentAtIndexFarOutOfRange (1820 of 2134) UNSUPPORTED: lldb-shell :: SymbolFile/PDB/function-level-linking.test (1821 of 2134) PASS: lldb-unit :: Process/minidump/./LLDBMinidumpTests/MinidumpParserTest.GetThreadContext_x86_64 (1822 of 2134) PASS: lldb-unit :: Target/./TargetTests/MemoryRegionInfoTest.Formatv (1823 of 2134) PASS: lldb-api :: python_api/watchpoint/watchlocation/TestTargetWatchAddress.py (1824 of 2134) PASS: lldb-api :: commands/log/invalid-args/TestInvalidArgsLog.py (1825 of 2134) PASS: lldb-unit :: Utility/./UtilityTests/ProcessInstanceInfoList.Yaml (1826 of 2134) PASS: lldb-api :: commands/apropos/with-process/TestAproposWithProcess.py (1827 of 2134) PASS: lldb-api :: macosx/queues/TestQueues.py (1828 of 2134) PASS: lldb-unit :: UnwindAssembly/x86/./UnwindAssemblyx86Tests/Testx86AssemblyInspectionEngine.TestPushRBX (1829 of 2134) PASS: lldb-api :: commands/frame/language/TestGuessLanguage.py (1830 of 2134) PASS: lldb-unit :: Utility/./UtilityTests/ArgsTest.GetArgumentArrayRef (1831 of 2134) PASS: lldb-unit :: Language/Highlighting/./HighlighterTests/HighlighterTest.HighlighterSelectionType (1832 of 2134) PASS: lldb-api :: functionalities/breakpoint/comp_dir_symlink/TestCompDirSymLink.py (1833 of 2134) PASS: lldb-unit :: UnwindAssembly/x86/./UnwindAssemblyx86Tests/Testx86AssemblyInspectionEngine.TestCALLNextInsn (1834 of 2134) PASS: lldb-unit :: UnwindAssembly/x86/./UnwindAssemblyx86Tests/Testx86AssemblyInspectionEngine.TestPushEAX (1835 of 2134) PASS: lldb-api :: tools/lldb-server/TestGdbRemoteProcessInfo.py (1836 of 2134) PASS: lldb-unit :: Utility/./UtilityTests/DataExtractorTest.GetCStrEmpty (1837 of 2134) PASS: lldb-unit :: Utility/./UtilityTests/StringExtractorTest.GetHexBytes_Partial (1838 of 2134) PASS: lldb-unit :: tools/lldb-server/tests/./LLDBServerTests/TestBase.LaunchModePreservesEnvironment (1839 of 2134) PASS: lldb-api :: python_api/sbstructureddata/TestStructuredDataAPI.py (1840 of 2134) PASS: lldb-unit :: ObjectFile/Breakpad/./ObjectFileBreakpadTests/ModuleRecord.parse (1841 of 2134) PASS: lldb-shell :: BuildScript/toolchain-clang.test (1842 of 2134) PASS: lldb-unit :: Utility/./UtilityTests/ArgsTest.TestSingleArgWithQuotedSpace (1843 of 2134) PASS: lldb-unit :: Host/./HostTests/SocketTest.TCPListen0ConnectAccept (1844 of 2134) PASS: lldb-unit :: Utility/./UtilityTests/RangeTest.ContainsEndInclusive (1845 of 2134) UNSUPPORTED: lldb-api :: benchmarks/frame_variable/TestFrameVariableResponse.py (1846 of 2134) PASS: lldb-api :: functionalities/thread/create_after_attach/TestCreateAfterAttach.py (1847 of 2134) PASS: lldb-unit :: UnwindAssembly/ARM64/./Arm64InstEmulationTests/TestArm64InstEmulation.TestCFARegisterTrackedAcrossJumps (1848 of 2134) UNSUPPORTED: lldb-api :: functionalities/data-formatter/data-formatter-stl/libstdcpp/vbool/TestDataFormatterStdVBool.py (1849 of 2134) PASS: lldb-unit :: Utility/./UtilityTests/ArgsTest.ReplaceArgumentAtIndexOutOfRange (1850 of 2134) PASS: lldb-api :: functionalities/plugins/python_os_plugin/stepping_plugin_threads/TestOSPluginStepping.py (1851 of 2134) PASS: lldb-unit :: Utility/./UtilityTests/Predicate.WaitForValueEqualTo (1852 of 2134) PASS: lldb-api :: commands/expression/function_template_specialization_temp_args/TestFunctionTemplateSpecializationTempArgs.py (1853 of 2134) PASS: lldb-unit :: Process/minidump/./LLDBMinidumpTests/RegisterContextMinidump.ConvertMinidumpContext_x86_64 (1854 of 2134) PASS: lldb-api :: arm/emulation/TestEmulations.py (1855 of 2134) PASS: lldb-api :: lang/objc/foundation/TestRuntimeTypes.py (1856 of 2134) PASS: lldb-unit :: Utility/./UtilityTests/XcodeSDKTest.MergeTest (1857 of 2134) PASS: lldb-shell :: Driver/TestUseColor.test (1858 of 2134) PASS: lldb-unit :: UnwindAssembly/x86/./UnwindAssemblyx86Tests/Testx86AssemblyInspectionEngine.TestPushR14 (1859 of 2134) PASS: lldb-api :: lang/c/register_variables/TestRegisterVariables.py (1860 of 2134) PASS: lldb-unit :: Symbol/./SymbolTests/TestClangASTImporter.RecordLayout (1861 of 2134) PASS: lldb-unit :: Utility/./UtilityTests/CompletionRequest.TestCompletionOwnership (1862 of 2134) PASS: lldb-api :: lang/cpp/breakpoint-commands/TestCPPBreakpointCommands.py (1863 of 2134) PASS: lldb-unit :: Core/./LLDBCoreTests/ModuleSpecTest.TestMachOFile (1864 of 2134) PASS: lldb-api :: commands/session/save/TestSessionSave.py (1865 of 2134) PASS: lldb-shell :: SymbolFile/NativePDB/s_constant.cpp (1866 of 2134) PASS: lldb-unit :: SymbolFile/NativePDB/./SymbolFileNativePDBTests/PDBFPOProgramToDWARFExpressionTests.UnknownOp (1867 of 2134) PASS: lldb-api :: lang/objc/orderedset/TestOrderedSet.py (1868 of 2134) PASS: lldb-api :: api/command-return-object/TestSBCommandReturnObject.py (1869 of 2134) PASS: lldb-api :: python_api/signals/TestSignalsAPI.py (1870 of 2134) PASS: lldb-api :: lang/objc/blocks/TestObjCIvarsInBlocks.py (1871 of 2134) PASS: lldb-unit :: Process/minidump/./LLDBMinidumpTests/MinidumpParserTest.MinidumpDuplicateModuleMinAddress (1872 of 2134) UNSUPPORTED: lldb-shell :: SymbolFile/PDB/vbases.test (1873 of 2134) PASS: lldb-unit :: Utility/./UtilityTests/ScalarTest.Getters (1874 of 2134) PASS: lldb-unit :: Process/gdb-remote/./ProcessGdbRemoteTests/GDBRemoteCommunicationServerTest.SendErrorResponse_ErrorNumber (1875 of 2134) PASS: lldb-shell :: Reproducer/TestDump.test (1876 of 2134) PASS: lldb-api :: lang/cpp/this_class_type_mixing/TestThisClassTypeMixing.py (1877 of 2134) PASS: lldb-unit :: Language/Highlighting/./HighlighterTests/HighlighterTest.ClangCursorPosAfterOtherToken (1878 of 2134) PASS: lldb-unit :: Language/Highlighting/./HighlighterTests/HighlighterTest.ClangBraces (1879 of 2134) UNSUPPORTED: lldb-shell :: Unwind/eh-frame-small-fde.test (1880 of 2134) PASS: lldb-shell :: SymbolFile/NativePDB/nested-types.cpp (1881 of 2134) PASS: lldb-api :: functionalities/thread/concurrent_events/TestConcurrentTwoBreakpointThreads.py (1882 of 2134) PASS: lldb-shell :: Reproducer/TestWorkingDir.test (1883 of 2134) PASS: lldb-unit :: UnwindAssembly/x86/./UnwindAssemblyx86Tests/Testx86AssemblyInspectionEngine.TestSimplex86_64Augmented (1884 of 2134) PASS: lldb-shell :: Reproducer/Functionalities/TestImageList.test (1885 of 2134) PASS: lldb-shell :: SymbolFile/DWARF/array-sizes.s (1886 of 2134) PASS: lldb-api :: commands/statistics/basic/TestStats.py (1887 of 2134) PASS: lldb-unit :: Utility/./UtilityTests/TimeoutTest.Construction (1888 of 2134) PASS: lldb-api :: functionalities/data-formatter/synthcapping/TestSyntheticCapping.py (1889 of 2134) PASS: lldb-unit :: Utility/./UtilityTests/StringExtractorTest.GetNameColonValueNoColon (1890 of 2134) PASS: lldb-api :: commands/expression/ir-interpreter/TestIRInterpreter.py (1891 of 2134) PASS: lldb-unit :: Utility/./UtilityTests/UriParserTest.BracketedHostname (1892 of 2134) PASS: lldb-api :: functionalities/data-formatter/refpointer-recursion/TestDataFormatterRefPtrRecursion.py (1893 of 2134) PASS: lldb-unit :: Utility/./UtilityTests/StreamTest.PutBytesAsRawHex8ToLittleEndian (1894 of 2134) PASS: lldb-api :: functionalities/deleted-executable/TestDeletedExecutable.py (1895 of 2134) PASS: lldb-api :: python_api/formatters/TestFormattersSBAPI.py (1896 of 2134) UNSUPPORTED: lldb-shell :: Register/x86-zmm-write.test (1897 of 2134) PASS: lldb-unit :: Expression/./ExpressionTests/DWARFExpression.DW_OP_piece (1898 of 2134) PASS: lldb-unit :: Utility/./UtilityTests/StringListTest.InsertStringAtIndexEnd (1899 of 2134) PASS: lldb-api :: functionalities/data-formatter/hexcaps/TestDataFormatterHexCaps.py (1900 of 2134) PASS: lldb-shell :: ObjectFile/MachO/lc_build_version_notools.yaml (1901 of 2134) PASS: lldb-unit :: Utility/./UtilityTests/RangeTest.ClearWithStarAddress (1902 of 2134) PASS: lldb-api :: macosx/safe-to-func-call/TestSafeFuncCalls.py (1903 of 2134) PASS: lldb-unit :: Expression/./ExpressionTests/DWARFExpression.DW_OP_stack_value (1904 of 2134) PASS: lldb-unit :: ScriptInterpreter/Python/./ScriptInterpreterPythonTests/PythonDataObjectsTest.TestPythonInteger (1905 of 2134) PASS: lldb-unit :: Utility/./UtilityTests/StringListTest.LongestCommonPrefixSingleElement (1906 of 2134) PASS: lldb-unit :: Utility/./UtilityTests/ScalarTest.ExtractBitfield (1907 of 2134) PASS: lldb-api :: python_api/module_section/TestModuleAndSection.py (1908 of 2134) PASS: lldb-shell :: SymbolFile/Breakpad/line-table-missing-file.test (1909 of 2134) PASS: lldb-unit :: Target/./TargetTests/ModuleCacheTest.GetAndPutUuidExists (1910 of 2134) PASS: lldb-api :: commands/quit/TestQuit.py (1911 of 2134) PASS: lldb-unit :: Symbol/./SymbolTests/TestClangASTImporter.MetadataPropagation (1912 of 2134) PASS: lldb-unit :: Utility/./UtilityTests/ProcessInstanceInfoMatch.Name (1913 of 2134) PASS: lldb-unit :: Host/./HostTests/FileSystemTest.Resolve (1914 of 2134) PASS: lldb-shell :: Breakpoint/debug_rnglist_offset_pair.test (1915 of 2134) PASS: lldb-api :: sample_test/TestSampleTest.py (1916 of 2134) PASS: lldb-unit :: Utility/./UtilityTests/ConstStringTest.NullAndEmptyStates (1917 of 2134) PASS: lldb-api :: functionalities/thread/concurrent_events/TestConcurrentCrashWithSignal.py (1918 of 2134) PASS: lldb-api :: functionalities/data-formatter/data-formatter-proper-plurals/TestFormattersOneIsSingular.py (1919 of 2134) PASS: lldb-unit :: Utility/./UtilityTests/SerializationRountripTest.SerializeDeserializeObjectReference (1920 of 2134) PASS: lldb-unit :: Utility/./UtilityTests/ArchSpecTest.OperatorBool (1921 of 2134) PASS: lldb-api :: functionalities/thread/concurrent_events/TestConcurrentSignalWatch.py (1922 of 2134) PASS: lldb-api :: functionalities/inline-stepping/TestInlineStepping.py (1923 of 2134) PASS: lldb-api :: lang/cpp/operator-overload/TestOperatorOverload.py (1924 of 2134) PASS: lldb-unit :: Utility/./UtilityTests/StringExtractorTest.DecodeHexU8_InvalidHex2 (1925 of 2134) PASS: lldb-api :: linux/builtin_trap/TestBuiltinTrap.py (1926 of 2134) PASS: lldb-api :: functionalities/data-formatter/data-formatter-objc/TestDataFormatterObjCExpr.py (1927 of 2134) PASS: lldb-shell :: ObjectFile/ELF/short-build-id.yaml (1928 of 2134) PASS: lldb-unit :: Utility/./UtilityTests/StreamTest.AddressPrefixAndSuffix (1929 of 2134) PASS: lldb-unit :: UnwindAssembly/x86/./UnwindAssemblyx86Tests/Testx86AssemblyInspectionEngine.TestPushExtended (1930 of 2134) PASS: lldb-shell :: SymbolFile/Breakpad/symtab-macho.test (1931 of 2134) PASS: lldb-api :: functionalities/tail_call_frames/sbapi_support/TestTailCallFrameSBAPI.py (1932 of 2134) UNSUPPORTED: lldb-api :: tools/lldb-server/TestGdbRemoteModuleInfo.py (1933 of 2134) PASS: lldb-api :: functionalities/breakpoint/breakpoint_language/TestBreakpointLanguage.py (1934 of 2134) PASS: lldb-unit :: Utility/./UtilityTests/SerializationRountripTest.SerializeDeserializeCStringArrayNullptr (1935 of 2134) PASS: lldb-api :: functionalities/gdb_remote_client/TestTargetXMLArch.py (1936 of 2134) PASS: lldb-unit :: Utility/./UtilityTests/DataExtractorTest.GetDouble (1937 of 2134) PASS: lldb-unit :: Platform/./LLDBPlatformTests/PlatformAppleSimulatorTest.TestHostPlatformToSim (1938 of 2134) PASS: lldb-api :: lang/objcxx/objcxx-ivar-vector/TestIvarVector.py (1939 of 2134) PASS: lldb-api :: commands/expression/weak_symbols/TestWeakSymbols.py (1940 of 2134) PASS: lldb-api :: functionalities/data-formatter/parray/TestPrintArray.py (1941 of 2134) PASS: lldb-api :: functionalities/thread/num_threads/TestNumThreads.py (1942 of 2134) PASS: lldb-api :: functionalities/inferior-crashing/TestInferiorCrashing.py (1943 of 2134) PASS: lldb-api :: commands/expression/multiline-completion/TestMultilineCompletion.py (1944 of 2134) PASS: lldb-unit :: ObjectFile/Breakpad/./ObjectFileBreakpadTests/StackWinRecord.parse (1945 of 2134) PASS: lldb-api :: functionalities/signal/handle-abrt/TestHandleAbort.py (1946 of 2134) PASS: lldb-unit :: Utility/./UtilityTests/BinaryStreamTest.PutSLEB128FourBytes (1947 of 2134) PASS: lldb-api :: functionalities/data-formatter/data-formatter-stl/libcxx/tuple/TestDataFormatterLibcxxTuple.py (1948 of 2134) PASS: lldb-api :: commands/expression/expr-in-syscall/TestExpressionInSyscall.py (1949 of 2134) PASS: lldb-api :: functionalities/backticks/TestBackticksWithoutATarget.py (1950 of 2134) PASS: lldb-unit :: SymbolFile/NativePDB/./SymbolFileNativePDBTests/PDBFPOProgramToDWARFExpressionTests.UnresolvedDependentCyclicRegisterAssignmentReference (1951 of 2134) PASS: lldb-shell :: Watchpoint/SetErrorCases.test (1952 of 2134) PASS: lldb-api :: python_api/file_handle/TestFileHandle.py (1953 of 2134) PASS: lldb-api :: lang/cpp/offsetof/TestOffsetofCpp.py (1954 of 2134) PASS: lldb-unit :: Process/minidump/./LLDBMinidumpTests/MinidumpParserTest.GetThreadContext_x86_32_wow64 (1955 of 2134) PASS: lldb-api :: functionalities/memory/cache/TestMemoryCache.py (1956 of 2134) PASS: lldb-api :: python_api/sbplatform/TestSBPlatform.py (1957 of 2134) PASS: lldb-unit :: Utility/./UtilityTests/ArchSpecTest.TestSetTriple (1958 of 2134) PASS: lldb-shell :: ObjectFile/ELF/PT_TLS-overlap-PT_LOAD.yaml (1959 of 2134) PASS: lldb-api :: python_api/disassemble-raw-data/TestDisassembleRawData.py (1960 of 2134) PASS: lldb-shell :: Minidump/disassemble-no-module.yaml (1961 of 2134) PASS: lldb-unit :: Utility/./UtilityTests/AnsiTerminal.Empty (1962 of 2134) PASS: lldb-api :: commands/expression/regression-access-function-template-in-record/TestRegressionAccessFunctionTemplateInRecord.py (1963 of 2134) PASS: lldb-api :: lang/objc/objc-struct-argument/TestObjCStructArgument.py (1964 of 2134) PASS: lldb-shell :: Recognizer/assert.test (1965 of 2134) PASS: lldb-api :: functionalities/data-formatter/compactvectors/TestCompactVectors.py (1966 of 2134) UNSUPPORTED: lldb-shell :: Unwind/eh-frame-augment-noop.test (1967 of 2134) PASS: lldb-shell :: Breakpoint/case-sensitive.test (1968 of 2134) PASS: lldb-unit :: Symbol/./SymbolTests/TestTypeSystemClang.TestBuiltinTypeForEncodingAndBitSize (1969 of 2134) PASS: lldb-unit :: Utility/./UtilityTests/RangeTest.SlideZero (1970 of 2134) PASS: lldb-unit :: Language/Highlighting/./HighlighterTests/HighlighterTest.FallbackHighlighter (1971 of 2134) PASS: lldb-api :: python_api/value/empty_class/TestValueAPIEmptyClass.py (1972 of 2134) PASS: lldb-unit :: Utility/./UtilityTests/SerializationRountripTest.SerializeDeserializePodReferences (1973 of 2134) PASS: lldb-shell :: Settings/TestSettingsWrite.test (1974 of 2134) PASS: lldb-api :: functionalities/breakpoint/dummy_target_breakpoints/TestBreakpointsWithNoTargets.py (1975 of 2134) PASS: lldb-api :: functionalities/target_var/TestTargetVar.py (1976 of 2134) PASS: lldb-unit :: Utility/./UtilityTests/Flags.AnyClear (1977 of 2134) PASS: lldb-unit :: Utility/./UtilityTests/BinaryStreamTest.PutULEB128Zero (1978 of 2134) PASS: lldb-api :: python_api/watchpoint/condition/TestWatchpointConditionAPI.py (1979 of 2134) PASS: lldb-unit :: Symbol/./SymbolTests/TestTypeSystemClang.TestGetTypeClassDeclType (1980 of 2134) PASS: lldb-api :: functionalities/tsan/multiple/TestTsanMultiple.py (1981 of 2134) PASS: lldb-api :: functionalities/source-map/TestTargetSourceMap.py (1982 of 2134) PASS: lldb-unit :: Process/minidump/./LLDBMinidumpTests/MinidumpParserTest.FindMemoryRange (1983 of 2134) PASS: lldb-shell :: Breakpoint/ppc64-localentry.test (1984 of 2134) PASS: lldb-shell :: Driver/TestFile.test (1985 of 2134) PASS: lldb-api :: functionalities/data-formatter/data-formatter-cpp/TestDataFormatterCpp.py (1986 of 2134) PASS: lldb-unit :: Utility/./UtilityTests/StringListTest.AppendStringStdString (1987 of 2134) PASS: lldb-unit :: Expression/./ExpressionTests/DiagnosticManagerTest.FixedExpression (1988 of 2134) PASS: lldb-unit :: Symbol/./SymbolTests/TestClangASTImporter.MetadataPropagationAfterCopying (1989 of 2134) PASS: lldb-shell :: SymbolFile/Breakpad/line-table-mixed-path-styles.test (1990 of 2134) PASS: lldb-shell :: Breakpoint/debug_rnglistx_rlex.test (1991 of 2134) PASS: lldb-unit :: Utility/./UtilityTests/StringListTest.LongestCommonPrefixEmpty (1992 of 2134) UNSUPPORTED: lldb-api :: tools/lldb-server/platform-process-connect/TestPlatformProcessConnect.py (1993 of 2134) UNSUPPORTED: lldb-api :: tools/lldb-server/signal-filtering/TestGdbRemote_QPassSignals.py (1994 of 2134) PASS: lldb-api :: python_api/watchpoint/TestSetWatchpoint.py (1995 of 2134) PASS: lldb-api :: lang/objc/bitfield_ivars/TestBitfieldIvars.py (1996 of 2134) PASS: lldb-api :: commands/expression/fixits/TestFixIts.py (1997 of 2134) PASS: lldb-unit :: Utility/./UtilityTests/Flags.Clear (1998 of 2134) PASS: lldb-unit :: Utility/./UtilityTests/StringExtractorTest.GetU64BigEndian (1999 of 2134) PASS: lldb-unit :: Host/./HostTests/NativeProcessProtocolTest.SetBreakpointFailWrite (2000 of 2134) PASS: lldb-shell :: SymbolFile/DWARF/dwarf5-partial-index.cpp (2001 of 2134) PASS: lldb-unit :: Symbol/./SymbolTests/TestTypeSystemClang.AddMethodToObjCObjectType (2002 of 2134) PASS: lldb-unit :: Utility/./UtilityTests/DataExtractorTest.GetMaxU64 (2003 of 2134) PASS: lldb-api :: commands/expression/rdar42038760/TestScalarURem.py (2004 of 2134) PASS: lldb-api :: functionalities/data-formatter/stringprinter/TestStringPrinter.py (2005 of 2134) PASS: lldb-unit :: Utility/./UtilityTests/LogChannelTest.Enable (2006 of 2134) PASS: lldb-shell :: ObjectFile/ELF/section-types-edgecases.yaml (2007 of 2134) PASS: lldb-unit :: UnwindAssembly/x86/./UnwindAssemblyx86Tests/Testx86AssemblyInspectionEngine.TestAddESP (2008 of 2134) PASS: lldb-api :: functionalities/multidebugger_commands/TestMultipleDebuggersCommands.py (2009 of 2134) PASS: lldb-api :: functionalities/dynamic_value_child_count/TestDynamicValueChildCount.py (2010 of 2134) PASS: lldb-api :: functionalities/data-formatter/data-formatter-objc/TestDataFormatterObjCNSError.py (2011 of 2134) PASS: lldb-unit :: Core/./LLDBCoreTests/MangledTest.NameIndexes_FindFunctionSymbols (2012 of 2134) PASS: lldb-api :: lang/cpp/symbols/TestSymbols.py (2013 of 2134) PASS: lldb-unit :: Host/./HostTests/FileSystemTest.EnumerateDirectory (2014 of 2134) PASS: lldb-api :: functionalities/breakpoint/breakpoint_locations/TestBreakpointLocations.py (2015 of 2134) PASS: lldb-api :: commands/expression/options/TestExprOptions.py (2016 of 2134) PASS: lldb-unit :: Target/./TargetTests/PathMappingListTest.AbsoluteTests (2017 of 2134) PASS: lldb-api :: macosx/find-dsym/deep-bundle/TestDeepBundle.py (2018 of 2134) PASS: lldb-unit :: Utility/./UtilityTests/UriParserTest.Minimal (2019 of 2134) PASS: lldb-api :: commands/expression/top-level/TestTopLevelExprs.py (2020 of 2134) PASS: lldb-unit :: DataFormatter/./LLDBFormatterTests/TypeMatcherTests.CreatedBySameMatchStringExactNamePrefixes (2021 of 2134) PASS: lldb-unit :: Core/./LLDBCoreTests/ModuleSpecTest.InvalidInMemoryBuffer (2022 of 2134) PASS: lldb-api :: python_api/lldbutil/frame/TestFrameUtils.py (2023 of 2134) PASS: lldb-unit :: Utility/./UtilityTests/Flags.AllSet (2024 of 2134) PASS: lldb-api :: lang/objcxx/cxx-bridged-po/TestObjCXXBridgedPO.py (2025 of 2134) PASS: lldb-unit :: Utility/./UtilityTests/StreamTest.PutCharNull (2026 of 2134) PASS: lldb-unit :: Symbol/./SymbolTests/DWARFCallFrameInfoTest.Basic_eh (2027 of 2134) PASS: lldb-unit :: Utility/./UtilityTests/StringExtractorTest.DecodeHexU8_Extra (2028 of 2134) PASS: lldb-api :: macosx/profile_vrs_detach/TestDetachVrsProfile.py (2029 of 2134) PASS: lldb-api :: commands/log/basic/TestLogging.py (2030 of 2134) PASS: lldb-api :: types/TestRecursiveTypes.py (2031 of 2134) PASS: lldb-api :: lang/objc/single-entry-dictionary/TestObjCSingleEntryDictionary.py (2032 of 2134) PASS: lldb-unit :: Utility/./UtilityTests/FileSpecTest.EqualDotsPosixRoot (2033 of 2134) PASS: lldb-api :: lang/cpp/extern_c/TestExternCSymbols.py (2034 of 2134) PASS: lldb-shell :: Driver/TestSingleQuote.test (2035 of 2134) PASS: lldb-unit :: UnwindAssembly/x86/./UnwindAssemblyx86Tests/Testx86AssemblyInspectionEngine.Test32bitFramelessSmallStackFrame (2036 of 2134) PASS: lldb-api :: functionalities/signal/TestSendSignal.py (2037 of 2134) PASS: lldb-shell :: ObjectFile/wasm/stripped-debug-sections.yaml (2038 of 2134) PASS: lldb-api :: functionalities/unwind/noreturn/TestNoreturnUnwind.py (2039 of 2134) PASS: lldb-api :: functionalities/data-formatter/nsarraysynth/TestNSArraySynthetic.py (2040 of 2134) PASS: lldb-api :: commands/expression/radar_8638051/Test8638051.py (2041 of 2134) PASS: lldb-api :: commands/target/modules/search-paths/insert/TestTargetModulesSearchpathsInsert.py (2042 of 2134) UNSUPPORTED: lldb-api :: lang/cpp/printf/TestPrintf.py (2043 of 2134) PASS: lldb-api :: lang/c/modules/TestCModules.py (2044 of 2134) PASS: lldb-shell :: SymbolFile/DWARF/DW_OP_piece-struct.s (2045 of 2134) UNSUPPORTED: lldb-api :: functionalities/thread/concurrent_events/TestConcurrentManySignals.py (2046 of 2134) PASS: lldb-shell :: Breakpoint/debug_rnglist_rlestartend.test (2047 of 2134) PASS: lldb-api :: functionalities/data-formatter/data-formatter-disabling/TestDataFormatterDisabling.py (2048 of 2134) UNSUPPORTED: lldb-shell :: Register/arm-gp-read.test (2049 of 2134) PASS: lldb-api :: commands/command/script/TestCommandScript.py (2050 of 2134) PASS: lldb-unit :: Utility/./UtilityTests/ArgsTest.StringListConstructor (2051 of 2134) UNSUPPORTED: lldb-api :: tools/lldb-server/TestGdbRemoteCompletion.py (2052 of 2134) UNSUPPORTED: lldb-shell :: SymbolFile/DWARF/DW_TAG_GNU_call_site-DW_AT_low_pc.s (2053 of 2134) PASS: lldb-api :: commands/expression/ignore-artificial-constructors/TestIgnoreArtificialConstructors.py (2054 of 2134) PASS: lldb-unit :: Utility/./UtilityTests/RegularExpression.Valid (2055 of 2134) PASS: lldb-unit :: Utility/./UtilityTests/AnsiTerminal.AtEnd (2056 of 2134) PASS: lldb-unit :: Utility/./UtilityTests/ScalarTest.SetValueFromCString (2057 of 2134) PASS: lldb-unit :: Expression/./ExpressionTests/CppModuleConfigurationTest.Sysroot (2058 of 2134) PASS: lldb-unit :: ScriptInterpreter/Python/./ScriptInterpreterPythonTests/PythonDataObjectsTest.TestPythonByteArray (2059 of 2134) PASS: lldb-api :: commands/expression/import-std-module/deque-dbg-info-content/TestDbgInfoContentDequeFromStdModule.py (2060 of 2134) PASS: lldb-api :: lang/c/stepping/TestThreadStepping.py (2061 of 2134) PASS: lldb-unit :: Symbol/./SymbolTests/PostfixExpression.ParseOneExpression (2062 of 2134) PASS: lldb-unit :: Language/Highlighting/./HighlighterTests/HighlighterTest.ClangCursorPosEndOfLine (2063 of 2134) PASS: lldb-unit :: Symbol/./SymbolTests/PostfixExpression.ParseFPOProgram (2064 of 2134) PASS: lldb-shell :: SymbolFile/DWARF/debug-types-missing-signature.test (2065 of 2134) PASS: lldb-unit :: Utility/./UtilityTests/DeserializerTest.HasData (2066 of 2134) PASS: lldb-api :: functionalities/data-formatter/data-formatter-python-synth/TestDataFormatterPythonSynth.py (2067 of 2134) PASS: lldb-unit :: Signals/./SignalsTests/UnixSignalsTest.Iteration (2068 of 2134) PASS: lldb-shell :: Driver/TestCommands.test (2069 of 2134) PASS: lldb-api :: lang/objc/rdar-10967107/TestRdar10967107.py (2070 of 2134) PASS: lldb-unit :: Utility/./UtilityTests/AnsiTerminal.AtStart (2071 of 2134) PASS: lldb-api :: commands/frame/diagnose/bad-reference/TestBadReference.py (2072 of 2134) PASS: lldb-api :: functionalities/data-formatter/data-formatter-stl/libcxx/optional/TestDataFormatterLibcxxOptional.py (2073 of 2134) PASS: lldb-shell :: ObjectFile/PECOFF/dep-modules.yaml (2074 of 2134) PASS: lldb-shell :: ScriptInterpreter/Python/scripted_breakpoint.test (2075 of 2134) PASS: lldb-unit :: Utility/./UtilityTests/StreamTest.ShiftOperatorPtr (2076 of 2134) UNSUPPORTED: lldb-shell :: Breakpoint/case-insensitive.test (2077 of 2134) PASS: lldb-unit :: Host/./HostTests/FileActionTest.Open (2078 of 2134) PASS: lldb-shell :: SymbolFile/DWARF/dwo-type-in-main-file.s (2079 of 2134) PASS: lldb-unit :: Utility/./UtilityTests/FileSpecTest.OperatorBool (2080 of 2134) PASS: lldb-unit :: Utility/./UtilityTests/StreamTest.PutRawBytesToLittleEndian (2081 of 2134) PASS: lldb-api :: functionalities/gdb_remote_client/TestArmRegisterDefinition.py (2082 of 2134) PASS: lldb-api :: lang/objc/objc-static-method-stripped/TestObjCStaticMethodStripped.py (2083 of 2134) PASS: lldb-api :: macosx/find-dsym/bundle-with-dot-in-filename/TestBundleWithDotInFilename.py (2084 of 2134) PASS: lldb-shell :: SymbolFile/NativePDB/locate-pdb.cpp (2085 of 2134) PASS: lldb-unit :: Utility/./UtilityTests/PassiveReplayTest.InstrumentedFoo (2086 of 2134) UNSUPPORTED: lldb-api :: functionalities/darwin_log/filter/exact_match/activity/TestDarwinLogFilterMatchActivity.py (2087 of 2134) PASS: lldb-shell :: SymbolFile/DWARF/debug_loclists-dwo.s (2088 of 2134) PASS: lldb-api :: commands/expression/multiline-navigation/TestMultilineNavigation.py (2089 of 2134) UNSUPPORTED: lldb-shell :: ObjectFile/ELF/minidebuginfo-set-and-hit-breakpoint.test (2090 of 2134) PASS: lldb-shell :: Register/x86-64-ymm-read.test (2091 of 2134) PASS: lldb-unit :: Utility/./UtilityTests/RangeDataVector.FindEntryIndexesThatContain (2092 of 2134) PASS: lldb-unit :: SymbolFile/DWARF/./SymbolFileDWARFTests/SymbolFileDWARFTests.TestAbbrevMissingTerminator (2093 of 2134) PASS: lldb-api :: functionalities/dlopen_other_executable/TestDlopenOtherExecutable.py (2094 of 2134) PASS: lldb-unit :: DataFormatter/./LLDBFormatterTests/TypeMatcherTests.RegexMatchPart (2095 of 2134) PASS: lldb-unit :: Utility/./UtilityTests/ConstStringTest.FromMidOfBufferStringRef (2096 of 2134) PASS: lldb-api :: lang/cpp/alignas_base_class/TestAlignAsBaseClass.py (2097 of 2134) PASS: lldb-unit :: Language/Highlighting/./HighlighterTests/HighlighterTest.HighlighterSelectionPath (2098 of 2134) PASS: lldb-shell :: SymbolFile/DWARF/DW_AT_low_pc-addrx.s (2099 of 2134) PASS: lldb-unit :: Utility/./UtilityTests/XcodeSDKTest.FindXcodeContentsDirectoryInPath (2100 of 2134) PASS: lldb-api :: commands/expression/namespace_local_var_same_name_cpp_and_c/TestNamespaceLocalVarSameNameCppAndC.py (2101 of 2134) PASS: lldb-unit :: Process/gdb-remote/./ProcessGdbRemoteTests/GDBRemoteCommunicationClientTest.SendGetMetaDataPacket (2102 of 2134) PASS: lldb-shell :: SymbolFile/DWARF/gnu-style-compression.cpp (2103 of 2134) PASS: lldb-api :: lang/objc/foundation/TestObjCMethodsNSError.py (2104 of 2134) PASS: lldb-api :: functionalities/thread/ignore_suspended/TestIgnoreSuspendedThread.py (2105 of 2134) PASS: lldb-unit :: Utility/./UtilityTests/StringListTest.JoinNonSpace (2106 of 2134) PASS: lldb-api :: functionalities/stats_api/TestStatisticsAPI.py (2107 of 2134) PASS: lldb-unit :: Utility/./UtilityTests/StringExtractorTest.GetNameColonValueSuccess (2108 of 2134) PASS: lldb-api :: lang/cpp/llvm-style/TestLLVMStyle.py (2109 of 2134) PASS: lldb-api :: lang/cpp/trivial_abi/TestTrivialABI.py (2110 of 2134) PASS: lldb-unit :: Utility/./UtilityTests/BinaryStreamTest.PutSLEB128SevenBytes (2111 of 2134) PASS: lldb-api :: functionalities/thread/concurrent_events/TestConcurrentTwoBreakpointsOneSignal.py (2112 of 2134) PASS: lldb-api :: functionalities/asan/TestReportData.py (2113 of 2134) PASS: lldb-api :: functionalities/testid/TestTestId.py (2114 of 2134) PASS: lldb-unit :: Utility/./UtilityTests/UriParserTest.TypicalPortPathIPv4 (2115 of 2134) PASS: lldb-unit :: Utility/./UtilityTests/ProcessInfoTest.Constructor (2116 of 2134) PASS: lldb-unit :: SymbolFile/DWARF/./SymbolFileDWARFTests/SymbolFileDWARFTests.TestAbbrevNullAttrValidForm (2117 of 2134) PASS: lldb-unit :: ScriptInterpreter/Python/./ScriptInterpreterPythonTests/PythonDataObjectsTest.TestPythonDictionaryToStructuredDictionary (2118 of 2134) PASS: lldb-unit :: Utility/./UtilityTests/UriParserTest.BracketedHostnamePort (2119 of 2134) PASS: lldb-unit :: Language/Highlighting/./HighlighterTests/HighlighterTest.DefaultHighlighterWithCursor (2120 of 2134) PASS: lldb-api :: lang/objc/modules-inline-functions/TestModulesInlineFunctions.py (2121 of 2134) PASS: lldb-unit :: Utility/./UtilityTests/UriParserTest.BadPort (2122 of 2134) PASS: lldb-shell :: SymbolFile/DWARF/DW_TAG_variable-DW_AT_const_value.s (2123 of 2134) PASS: lldb-api :: macosx/order/TestOrderFile.py (2124 of 2134) PASS: lldb-unit :: ScriptInterpreter/Python/./ScriptInterpreterPythonTests/PythonDataObjectsTest.TestPythonTupleToStructuredList (2125 of 2134) PASS: lldb-shell :: Reproducer/TestPythonImport.test (2126 of 2134) PASS: lldb-api :: functionalities/thread/concurrent_events/TestConcurrentDelaySignalBreak.py (2127 of 2134) PASS: lldb-api :: lang/cpp/class_types/TestClassTypesDisassembly.py (2128 of 2134) PASS: lldb-api :: commands/watchpoints/watchpoint_disable/TestWatchpointDisable.py (2129 of 2134) PASS: lldb-shell :: Minidump/Windows/find-module.test (2130 of 2134) PASS: lldb-api :: python_api/symbol-context/TestSymbolContext.py (2131 of 2134) PASS: lldb-api :: commands/register/register/register_command/TestRegisters.py (2132 of 2134) PASS: lldb-api :: functionalities/data-formatter/data-formatter-stl/libcxx/multimap/TestDataFormatterLibccMultiMap.py (2133 of 2134) PASS: lldb-api :: functionalities/data-formatter/data-formatter-objc/cmtime/TestDataFormatterCMTime.py (2134 of 2134) Slowest Tests: -------------------------------------------------------------------------- 270.30s: lldb-api :: macosx/simulator/TestSimulatorPlatform.py 129.62s: lldb-api :: commands/expression/two-files/TestObjCTypeQueryFromOtherCompileUnit.py 102.75s: lldb-api :: tools/lldb-server/TestLldbGdbServer.py 95.48s: lldb-api :: functionalities/gdb_remote_client/TestGDBRemoteLoad.py 91.46s: lldb-api :: lang/objc/variadic_methods/TestVariadicMethods.py 81.73s: lldb-api :: lang/objc/hidden-ivars/TestHiddenIvars.py 79.26s: lldb-api :: lang/cpp/enum_types/TestCPP11EnumTypes.py 75.97s: lldb-api :: functionalities/postmortem/mach-core/TestMachCore.py 64.93s: lldb-api :: python_api/target/TestTargetAPI.py 62.17s: lldb-api :: api/multithreaded/TestMultithreaded.py 61.23s: lldb-api :: lang/objc/foundation/TestObjCMethods.py 54.45s: lldb-api :: lang/objc/exceptions/TestObjCExceptions.py 50.71s: lldb-api :: functionalities/gdb_remote_client/TestRecognizeBreakpoint.py 49.93s: lldb-api :: lang/objc/foundation/TestFoundationDisassembly.py 48.86s: lldb-api :: functionalities/postmortem/minidump-new/TestMiniDumpNew.py 48.72s: lldb-api :: types/TestLongTypesExpr.py 46.43s: lldb-api :: commands/frame/recognizer/TestFrameRecognizer.py 46.42s: lldb-shell :: SymbolFile/NativePDB/ast-methods.cpp 44.38s: lldb-api :: functionalities/gdb_remote_client/TestStopPCs.py 43.50s: lldb-api :: lang/cpp/namespace/TestNamespaceLookup.py

Hide Details

Tests Times: -------------------------------------------------------------------------- [ Range ] :: [ Percentage ] :: [ Count ] -------------------------------------------------------------------------- [260s,280s) :: [ ] :: [ 1/2134] [240s,260s) :: [ ] :: [ 0/2134] [220s,240s) :: [ ] :: [ 0/2134] [200s,220s) :: [ ] :: [ 0/2134] [180s,200s) :: [ ] :: [ 0/2134] [160s,180s) :: [ ] :: [ 0/2134] [140s,160s) :: [ ] :: [ 0/2134] [120s,140s) :: [ ] :: [ 1/2134] [100s,120s) :: [ ] :: [ 1/2134] [ 80s,100s) :: [ ] :: [ 4/2134] [ 60s, 80s) :: [ ] :: [ 4/2134] [ 40s, 60s) :: [ ] :: [ 13/2134] [ 20s, 40s) :: [ ] :: [ 49/2134] [ 0s, 20s) :: [************************************** ] :: [2061/2134] -------------------------------------------------------------------------- ******************** Failed Tests (1): lldb-api :: functionalities/gdb_remote_client/TestGDBRemoteLoad.py

Hide Details

Hide Details

Testing Time: 1917.23s Unsupported : 150 Passed : 1977 Expectedly Failed: 6 Failed : 1 FAILED: tools/lldb/test/CMakeFiles/check-lldb-lit cd /Users/buildslave/jenkins/workspace/lldb-cmake@2/lldb-build/tools/lldb/test && /usr/local/Frameworks/Python.framework/Versions/3.7/bin/python3.7 /Users/buildslave/jenkins/workspace/lldb-cmake@2/lldb-build/./bin/llvm-lit -v --time-tests --shuffle --xunit-xml-output=/Users/buildslave/jenkins/workspace/lldb-cmake@2/test/results.xml -v -j 4 /Users/buildslave/jenkins/workspace/lldb-cmake@2/lldb-build/tools/lldb/test ninja: build stopped: subcommand failed. Command failed: Command '['/usr/bin/env', 'TERM=vt100', '/usr/local/bin/ninja', '-v', 'check-lldb']' returned non-zero exit status 1 Command: ['/usr/bin/env', 'TERM=vt100', '/usr/local/bin/ninja', '-v', 'check-lldb'] [Pipeline] } [Pipeline] // timeout [Pipeline] } [Pipeline] // stage [Pipeline] stage [Pipeline] { (Declarative: Post Actions) [Pipeline] scanForIssues [Clang (LLVM based)] Sleeping for 5 seconds due to JENKINS-32191... [Clang (LLVM based)] Parsing console log (workspace: '/Users/buildslave/jenkins/workspace/lldb-cmake@2') [Clang (LLVM based)] Successfully parsed console log [Clang (LLVM based)] -> found 12 issues (skipped 12 duplicates) [Clang (LLVM based)] Post processing issues on 'green-dragon-10' with source code encoding 'UTF-8' [Clang (LLVM based)] Creating SCM blamer to obtain author and commit information for affected files [Clang (LLVM based)] Creating SCM miner to obtain statistics for affected repository files [Clang (LLVM based)] Resolving file names for all issues in source directory '/Users/buildslave/jenkins/workspace/lldb-cmake@2' [Clang (LLVM based)] -> resolved paths in source directory (8 found, 0 not found) [Clang (LLVM based)] Resolving module names from module definitions (build.xml, pom.xml, or Manifest.mf files) [Clang (LLVM based)] -> resolved module names for 12 issues [Clang (LLVM based)] Resolving package names (or namespaces) by parsing the affected files [Clang (LLVM based)] -> resolved package names of 8 affected files [Clang (LLVM based)] No filter has been set, publishing all 12 issues [Clang (LLVM based)] Creating fingerprints for all affected code blocks to track issues over different builds [Clang (LLVM based)] -> created fingerprints for 12 issues (skipped 0 issues) [Clang (LLVM based)] Copying affected files to Jenkins' build folder '/Users/Shared/Jenkins/Home/jobs/lldb-cmake/builds/23518/files-with-issues' [Clang (LLVM based)] -> 6 copied, 2 not in workspace, 0 not-found, 0 with I/O error [Pipeline] junit Recording test results [Pipeline] } [Pipeline] // stage [Pipeline] } [Pipeline] // withEnv [Pipeline] } [Pipeline] // node [Pipeline] End of Pipeline ERROR: script returned exit code 1 Finished: FAILURE