FailedConsole Output

Skipping 9,576 KB.. Full Log
rn.py (654 of 2134)
PASS: lldb-unit :: UnwindAssembly/x86/./UnwindAssemblyx86Tests/Testx86AssemblyInspectionEngine.TestPopEDI (655 of 2134)
PASS: lldb-unit :: Utility/./UtilityTests/StreamTest.AddressRange (656 of 2134)
PASS: lldb-api :: functionalities/data-formatter/data-formatter-objc/nsstring/TestDataFormatterNSString.py (657 of 2134)
PASS: lldb-unit :: Process/gdb-remote/./ProcessGdbRemoteTests/GDBRemoteCommunicationServerTest.SendErrorResponse_UnimplementedError (658 of 2134)
PASS: lldb-unit :: Utility/./UtilityTests/StringListTest.JoinMultiCharSeparator (659 of 2134)
PASS: lldb-api :: functionalities/data-formatter/data-formatter-stl/libcxx/atomic/TestLibCxxAtomic.py (660 of 2134)
PASS: lldb-unit :: Language/Highlighting/./HighlighterTests/HighlighterTest.ClangCursorOutOfBounds (661 of 2134)
PASS: lldb-api :: tools/lldb-server/register-reading/TestGdbRemoteGPacket.py (662 of 2134)
PASS: lldb-api :: functionalities/tail_call_frames/disambiguate_paths_to_common_sink/TestDisambiguatePathsToCommonSink.py (663 of 2134)
PASS: lldb-api :: functionalities/data-formatter/type_summary_list_arg/TestTypeSummaryListArg.py (664 of 2134)
PASS: lldb-api :: lang/cpp/rvalue-references/TestRvalueReferences.py (665 of 2134)
PASS: lldb-unit :: Utility/./UtilityTests/OptionsWithRawTest.LeadingSpaceArgs (666 of 2134)
PASS: lldb-api :: commands/target/stop-hook/delete/TestTargetStopHookDelete.py (667 of 2134)
PASS: lldb-unit :: Utility/./UtilityTests/StringExtractorTest.InitEmpty (668 of 2134)
PASS: lldb-unit :: UnwindAssembly/x86/./UnwindAssemblyx86Tests/Testx86AssemblyInspectionEngine.Test32bitFramelessSmallStackFrame (669 of 2134)
PASS: lldb-unit :: Language/Highlighting/./HighlighterTests/HighlighterTest.Keywords (670 of 2134)
PASS: lldb-unit :: Expression/./ExpressionTests/DWARFExpression.DW_OP_piece (671 of 2134)
PASS: lldb-unit :: UnwindAssembly/x86/./UnwindAssemblyx86Tests/Testx86AssemblyInspectionEngine.TestPushRBX (672 of 2134)
PASS: lldb-api :: commands/expression/import-std-module/weak_ptr-dbg-info-content/TestDbgInfoContentWeakPtrFromStdModule.py (673 of 2134)
PASS: lldb-api :: functionalities/breakpoint/breakpoint_by_file_colon_line/TestBreakpointByFileColonLine.py (674 of 2134)
PASS: lldb-unit :: Utility/./UtilityTests/TimeoutTest.Format (675 of 2134)
PASS: lldb-unit :: Utility/./UtilityTests/StringListTest.LongestCommonPrefix (676 of 2134)
PASS: lldb-unit :: Utility/./UtilityTests/StreamTest.PutCStringWithStringRef (677 of 2134)
PASS: lldb-unit :: Utility/./UtilityTests/AnsiTerminal.Unknown (678 of 2134)
UNSUPPORTED: lldb-api :: functionalities/data-formatter/data-formatter-stl/libstdcpp/string/TestDataFormatterStdString.py (679 of 2134)
PASS: lldb-shell :: SymbolFile/DWARF/debug-types-dwarf5.s (680 of 2134)
PASS: lldb-unit :: Language/Highlighting/./HighlighterTests/HighlighterTest.DefaultHighlighterWithCursorOutOfBounds (681 of 2134)
PASS: lldb-api :: functionalities/breakpoint/breakpoint_ids/TestBreakpointIDs.py (682 of 2134)
PASS: lldb-unit :: Utility/./UtilityTests/Predicate.WaitForValueNotEqualTo (683 of 2134)
PASS: lldb-api :: functionalities/data-formatter/data-formatter-objc/TestDataFormatterObjCPlain.py (684 of 2134)
PASS: lldb-unit :: Utility/./UtilityTests/NameMatchesTest.Contains (685 of 2134)
PASS: lldb-api :: lang/cpp/template-specialization-type/TestTemplateSpecializationType.py (686 of 2134)
PASS: lldb-api :: functionalities/thread/concurrent_events/TestConcurrentDelayedCrashWithBreakpointWatchpoint.py (687 of 2134)
PASS: lldb-unit :: Utility/./UtilityTests/StreamTest.Indent (688 of 2134)
PASS: lldb-unit :: Signals/./SignalsTests/UnixSignalsTest.Iteration (689 of 2134)
PASS: lldb-api :: tools/lldb-server/TestGdbRemoteProcessInfo.py (690 of 2134)
PASS: lldb-unit :: Utility/./UtilityTests/StringListTest.LongestCommonPrefixEmpty (691 of 2134)
PASS: lldb-api :: lang/cpp/typeof/TestTypeOfDeclTypeExpr.py (692 of 2134)
PASS: lldb-unit :: Utility/./UtilityTests/StringLexerTest.Peek (693 of 2134)
PASS: lldb-api :: commands/frame/diagnose/complicated-expression/TestComplicatedExpression.py (694 of 2134)
PASS: lldb-unit :: Utility/./UtilityTests/RangeTest.ContainsRangeStartingFromZero (695 of 2134)
PASS: lldb-unit :: Utility/./UtilityTests/BroadcasterTest.EventTypeHasListeners (696 of 2134)
PASS: lldb-unit :: Expression/./ExpressionTests/DiagnosticManagerTest.AddDiagnostic (697 of 2134)
PASS: lldb-unit :: Utility/./UtilityTests/StringExtractorTest.GetNameColonValueSuccess (698 of 2134)
PASS: lldb-unit :: Utility/./UtilityTests/TimerTest.CategoryTimesNested (699 of 2134)
PASS: lldb-api :: python_api/symbol-context/two-files/TestSymbolContextTwoFiles.py (700 of 2134)
PASS: lldb-api :: python_api/exprpath_synthetic/TestExprPathSynthetic.py (701 of 2134)
PASS: lldb-api :: commands/expression/context-object/TestContextObject.py (702 of 2134)
PASS: lldb-unit :: ScriptInterpreter/Python/./ScriptInterpreterPythonTests/PythonDataObjectsTest.TestDictionaryResolutionWithDot (703 of 2134)
PASS: lldb-unit :: Language/Highlighting/./HighlighterTests/HighlighterTest.DefaultHighlighterWithCursor (704 of 2134)
PASS: lldb-api :: functionalities/tsan/multiple/TestTsanMultiple.py (705 of 2134)
PASS: lldb-shell :: SymbolFile/DWARF/split-dwarf-inlining.cpp (706 of 2134)
PASS: lldb-unit :: Editline/./EditlineTests/EditlineTestFixture.EditlineReceivesMultiLineText (707 of 2134)
PASS: lldb-api :: tools/lldb-server/inferior-crash/TestGdbRemoteSegFault.py (708 of 2134)
PASS: lldb-unit :: Utility/./UtilityTests/StreamTest.PutHex32ByteOrderBig (709 of 2134)
PASS: lldb-unit :: Utility/./UtilityTests/StringListTest.GetSize (710 of 2134)
UNSUPPORTED: lldb-shell :: Register/x86-gp-write.test (711 of 2134)
PASS: lldb-shell :: Breakpoint/dummy-target.test (712 of 2134)
PASS: lldb-shell :: SymbolFile/Breakpad/line-table-missing-file.test (713 of 2134)
PASS: lldb-shell :: Driver/TestHelp.test (714 of 2134)
PASS: lldb-api :: lang/objc/foundation/TestFoundationDisassembly.py (715 of 2134)
PASS: lldb-api :: commands/gui/basicdebug/TestGuiBasicDebug.py (716 of 2134)
PASS: lldb-api :: commands/expression/xvalue/TestXValuePrinting.py (717 of 2134)
PASS: lldb-api :: functionalities/breakpoint/move_nearest/TestMoveNearest.py (718 of 2134)
PASS: lldb-api :: lang/c/find_struct_type/TestFindStructTypes.py (719 of 2134)
PASS: lldb-unit :: Utility/./UtilityTests/UriParserTest.MinimalPort (720 of 2134)
PASS: lldb-api :: lang/cpp/gmodules-templates/TestGModules.py (721 of 2134)
PASS: lldb-unit :: Utility/./UtilityTests/StringExtractorTest.GetU64LittleEndian (722 of 2134)
PASS: lldb-unit :: Utility/./UtilityTests/ArgsTest.GetQuotedCommandString (723 of 2134)
PASS: lldb-api :: lang/cpp/type_lookup/TestCppTypeLookup.py (724 of 2134)
PASS: lldb-unit :: Target/./TargetTests/RemoteAwarePlatformTest.TestResolveExecutabelOnClientByPlatform (725 of 2134)
PASS: lldb-api :: lang/objc/variadic_methods/TestVariadicMethods.py (726 of 2134)
PASS: lldb-unit :: UnwindAssembly/x86/./UnwindAssemblyx86Tests/Testx86AssemblyInspectionEngine.TestPushEDI (727 of 2134)
UNSUPPORTED: lldb-shell :: Register/x86-64-ymm16-read.test (728 of 2134)
PASS: lldb-unit :: Utility/./UtilityTests/OptionsWithRawTest.EmptySuffix (729 of 2134)
PASS: lldb-unit :: ScriptInterpreter/Python/./ScriptInterpreterPythonTests/PythonDataObjectsTest.TestInstanceNameResolutionNoDot (730 of 2134)
PASS: lldb-api :: lang/c/array_types/TestArrayTypes.py (731 of 2134)
UNSUPPORTED: lldb-api :: functionalities/data-formatter/data-formatter-stl/libstdcpp/vbool/TestDataFormatterStdVBool.py (732 of 2134)
PASS: lldb-unit :: DataFormatter/./LLDBFormatterTests/StringPrinterTests.CxxUTF8 (733 of 2134)
PASS: lldb-unit :: Utility/./UtilityTests/RangeDataVector.FindEntryThatContains_Overlap (734 of 2134)
PASS: lldb-api :: lang/objc/rdar-10967107/TestRdar10967107.py (735 of 2134)
PASS: lldb-api :: functionalities/thread/concurrent_events/TestConcurrentTwoWatchpointsOneDelayBreakpoint.py (736 of 2134)
PASS: lldb-api :: functionalities/data-formatter/ptr_ref_typedef/TestPtrRef2Typedef.py (737 of 2134)
PASS: lldb-unit :: Symbol/./SymbolTests/TestTypeSystemClang.TestIsClangType (738 of 2134)
PASS: lldb-api :: commands/frame/var/TestFrameVar.py (739 of 2134)
PASS: lldb-shell :: Driver/TestRepl.test (740 of 2134)
PASS: lldb-unit :: Utility/./UtilityTests/ArchSpecTest.MergeFrom (741 of 2134)
PASS: lldb-shell :: ObjectFile/ELF/avr-basic-info.yaml (742 of 2134)
PASS: lldb-unit :: Utility/./UtilityTests/RangeDataVector.CustomSort (743 of 2134)
PASS: lldb-api :: lang/objc/modules-auto-import/TestModulesAutoImport.py (744 of 2134)
PASS: lldb-unit :: Utility/./UtilityTests/ArchSpecTest.YAML (745 of 2134)
UNSUPPORTED: lldb-api :: benchmarks/continue/TestBenchmarkContinue.py (746 of 2134)
PASS: lldb-api :: functionalities/target-new-solib-notifications/TestModuleLoadedNotifys.py (747 of 2134)
PASS: lldb-api :: iohandler/resize/TestIOHandlerResizeNoEditline.py (748 of 2134)
PASS: lldb-shell :: SymbolFile/DWARF/debug_rnglists.s (749 of 2134)
PASS: lldb-api :: functionalities/data-formatter/hexcaps/TestDataFormatterHexCaps.py (750 of 2134)
PASS: lldb-api :: types/TestIntegerType.py (751 of 2134)
PASS: lldb-api :: tools/lldb-vscode/breakpoint/TestVSCode_setBreakpoints.py (752 of 2134)
PASS: lldb-api :: functionalities/breakpoint/consecutive_breakpoints/TestConsecutiveBreakpoints.py (753 of 2134)
XFAIL: lldb-shell :: SymbolFile/DWARF/find-type-in-function.cpp (754 of 2134)
PASS: lldb-unit :: Editline/./EditlineTests/EditlineTestFixture.EditlineReceivesSingleLineText (755 of 2134)
PASS: lldb-unit :: UnwindAssembly/x86/./UnwindAssemblyx86Tests/Testx86AssemblyInspectionEngine.TestPopEBP (756 of 2134)
PASS: lldb-unit :: Utility/./UtilityTests/StringListTest.Join (757 of 2134)
PASS: lldb-unit :: Utility/./UtilityTests/RangeTest.ContainsAddr (758 of 2134)
PASS: lldb-api :: types/TestShortType.py (759 of 2134)
PASS: lldb-api :: commands/expression/issue_11588/Test11588.py (760 of 2134)
PASS: lldb-unit :: Utility/./UtilityTests/OptionsWithRawTest.WhitespaceSuffix (761 of 2134)
PASS: lldb-api :: lang/objc/self/TestObjCSelf.py (762 of 2134)
PASS: lldb-unit :: Symbol/./SymbolTests/TestClangASTImporter.MetadataPropagation (763 of 2134)
PASS: lldb-shell :: SymbolFile/DWARF/debug-types-basic.test (764 of 2134)
PASS: lldb-api :: types/TestCharType.py (765 of 2134)
PASS: lldb-unit :: UnwindAssembly/PPC64/./PPC64InstEmulationTests/TestPPC64InstEmulation.TestMediumFunction (766 of 2134)
PASS: lldb-api :: functionalities/data-formatter/data-formatter-stl/libcxx/forward_list/TestDataFormatterLibcxxForwardList.py (767 of 2134)
PASS: lldb-api :: lang/objcxx/cxx-bridged-po/TestObjCXXBridgedPO.py (768 of 2134)
PASS: lldb-unit :: Expression/./ExpressionTests/ClangExpressionDeclMapTest.TestPersistentDeclLookup (769 of 2134)
PASS: lldb-shell :: SymbolFile/NativePDB/ast-functions.cpp (770 of 2134)
PASS: lldb-unit :: Utility/./UtilityTests/UUIDTest.SetFromStringRef (771 of 2134)
UNSUPPORTED: lldb-api :: macosx/macCatalystAppMacOSFramework/TestMacCatalystAppWithMacOSFramework.py (772 of 2134)
PASS: lldb-api :: commands/expression/call-function/TestCallStopAndContinue.py (773 of 2134)
PASS: lldb-unit :: Utility/./UtilityTests/CompletionRequest.TryCompleteCurrentArgGood (774 of 2134)
PASS: lldb-unit :: Host/./HostTests/FileSystemTest.GetByteSize (775 of 2134)
PASS: lldb-unit :: Utility/./UtilityTests/UriParserTest.MinimalPortPath (776 of 2134)
PASS: lldb-api :: functionalities/data-formatter/data-formatter-caching/TestDataFormatterCaching.py (777 of 2134)
PASS: lldb-api :: commands/frame/diagnose/dereference-argument/TestDiagnoseDereferenceArgument.py (778 of 2134)
PASS: lldb-api :: lang/objc/foundation/TestConstStrings.py (779 of 2134)
PASS: lldb-unit :: Utility/./UtilityTests/StringListTest.AppendStringCString (780 of 2134)
PASS: lldb-api :: lang/cpp/template-function/TestTemplateFunctions.py (781 of 2134)
PASS: lldb-api :: lang/c/local_variables/TestLocalVariables.py (782 of 2134)
PASS: lldb-api :: commands/expression/options/TestExprOptions.py (783 of 2134)
PASS: lldb-shell :: SymbolFile/DWARF/deterministic-build.cpp (784 of 2134)
PASS: lldb-unit :: Core/./LLDBCoreTests/RichManglingContextTest.SwitchProvider (785 of 2134)
PASS: lldb-unit :: ScriptInterpreter/Python/./ScriptInterpreterPythonTests/PythonDataObjectsTest.TestPythonCallableInvoke (786 of 2134)
PASS: lldb-unit :: Process/minidump/./LLDBMinidumpTests/RegisterContextMinidump.ConvertMinidumpContext_x86_32 (787 of 2134)
PASS: lldb-unit :: Utility/./UtilityTests/FileSpecTest.EqualDotsPosixRoot (788 of 2134)
PASS: lldb-api :: commands/expression/entry-bp/TestExprEntryBP.py (789 of 2134)
PASS: lldb-shell :: Register/x86-64-ymm-read.test (790 of 2134)
PASS: lldb-api :: api/multiple-debuggers/TestMultipleDebuggers.py (791 of 2134)
PASS: lldb-unit :: Host/./HostTests/FileSystemTest.EmptyTest (792 of 2134)
PASS: lldb-unit :: Utility/./UtilityTests/OptionsWithRawTest.QuotedSuffix (793 of 2134)
PASS: lldb-shell :: SymbolFile/DWARF/inline-function-address-shared.test (794 of 2134)
PASS: lldb-unit :: Utility/./UtilityTests/StringListTest.AppendStringMove (795 of 2134)
PASS: lldb-api :: commands/expression/top-level/TestTopLevelExprs.py (796 of 2134)
UNSUPPORTED: lldb-api :: functionalities/thread/thread_specific_break_plus_condition/TestThreadSpecificBpPlusCondition.py (797 of 2134)
PASS: lldb-api :: lang/objcxx/class-name-clash/TestNameClash.py (798 of 2134)
PASS: lldb-api :: commands/expression/import-std-module/vector/TestVectorFromStdModule.py (799 of 2134)
PASS: lldb-unit :: Process/minidump/./LLDBMinidumpTests/MinidumpParserTest.InvalidMinidump (800 of 2134)
XFAIL: lldb-shell :: Register/x86-mm-xmm-write.test (801 of 2134)
PASS: lldb-shell :: ObjectFile/PECOFF/sections.yaml (802 of 2134)
PASS: lldb-unit :: Utility/./UtilityTests/DataExtractorTest.GetMaxU64 (803 of 2134)
PASS: lldb-unit :: Interpreter/./InterpreterTests/CompletionTest.DirCompletionUsername (804 of 2134)
PASS: lldb-api :: python_api/interpreter/TestRunCommandInterpreterAPI.py (805 of 2134)
PASS: lldb-shell :: ObjectFile/MachO/symtab.yaml (806 of 2134)
PASS: lldb-unit :: tools/lldb-server/tests/./LLDBServerTests/TestBase.LaunchModePreservesEnvironment (807 of 2134)
PASS: lldb-unit :: Utility/./UtilityTests/VMRange.SetEndAddress (808 of 2134)
PASS: lldb-api :: commands/expression/import-std-module/shared_ptr/TestSharedPtrFromStdModule.py (809 of 2134)
PASS: lldb-api :: python_api/symbol-context/TestSymbolContext.py (810 of 2134)
PASS: lldb-api :: lang/objc/objc-new-syntax/TestObjCNewSyntaxLiteral.py (811 of 2134)
PASS: lldb-unit :: Utility/./UtilityTests/ArgsTest.TestQuotedTrailingBackslash (812 of 2134)
PASS: lldb-shell :: SymbolFile/DWARF/debug_line-relative_path.s (813 of 2134)
PASS: lldb-api :: python_api/value_var_update/TestValueVarUpdate.py (814 of 2134)
PASS: lldb-api :: commands/command/script_alias/TestCommandScriptAlias.py (815 of 2134)
UNSUPPORTED: lldb-api :: benchmarks/libcxxlist/TestBenchmarkLibcxxList.py (816 of 2134)
PASS: lldb-api :: functionalities/type_lookup/TestTypeLookup.py (817 of 2134)
PASS: lldb-api :: commands/expression/persistent_types/TestPersistentTypes.py (818 of 2134)
PASS: lldb-unit :: Symbol/./SymbolTests/TestTypeSystemClang.TestOwningModule (819 of 2134)
PASS: lldb-api :: functionalities/gdb_remote_client/TestRecognizeBreakpoint.py (820 of 2134)
PASS: lldb-api :: commands/watchpoints/multiple_hits/TestMultipleHits.py (821 of 2134)
UNSUPPORTED: lldb-api :: functionalities/data-formatter/data-formatter-stl/libstdcpp/list/TestDataFormatterStdList.py (822 of 2134)
PASS: lldb-unit :: Symbol/./SymbolTests/TestTypeSystemClang.TestFunctionTemplateInRecordConstruction (823 of 2134)
PASS: lldb-unit :: Utility/./UtilityTests/StringListTest.SplitIntoLines (824 of 2134)
PASS: lldb-unit :: Utility/./UtilityTests/StringListTest.ShiftMove (825 of 2134)
PASS: lldb-api :: functionalities/data-formatter/data-formatter-objc/TestDataFormatterObjCExpr.py (826 of 2134)
PASS: lldb-unit :: Host/./HostTests/SocketTest.TCPGetConnectURI (827 of 2134)
PASS: lldb-unit :: Utility/./UtilityTests/BinaryStreamTest.PutSLEB128SevenBytes (828 of 2134)
PASS: lldb-shell :: Commands/command-backtrace.test (829 of 2134)
PASS: lldb-unit :: DataFormatter/./LLDBFormatterTests/TypeMatcherTests.CreatedBySameMatchString (830 of 2134)
PASS: lldb-api :: functionalities/thread/concurrent_events/TestConcurrentTwoBreakpointsOneWatchpoint.py (831 of 2134)
PASS: lldb-api :: tools/lldb-vscode/console/TestVSCode_console.py (832 of 2134)
PASS: lldb-unit :: UnwindAssembly/x86/./UnwindAssemblyx86Tests/Testx86AssemblyInspectionEngine.TestStackRealign32BitDisp_x86_64 (833 of 2134)
PASS: lldb-unit :: Expression/./ExpressionTests/CppModuleConfigurationTest.Sysroot (834 of 2134)
PASS: lldb-unit :: UnwindAssembly/x86/./UnwindAssemblyx86Tests/Testx86AssemblyInspectionEngine.TestPushRBP (835 of 2134)
PASS: lldb-shell :: ScriptInterpreter/Python/crashlog.test (836 of 2134)
PASS: lldb-shell :: SymbolFile/Breakpad/unwind-via-stack-win-no-memory-info.yaml (837 of 2134)
PASS: lldb-unit :: Expression/./ExpressionTests/DiagnosticManagerTest.AppendMessageNoDiag (838 of 2134)
PASS: lldb-unit :: Utility/./UtilityTests/StringExtractorTest.GetHexBytesAvail_FullString (839 of 2134)
PASS: lldb-api :: commands/process/signal/TestProcessSignal.py (840 of 2134)
PASS: lldb-unit :: Utility/./UtilityTests/FileSpecTest.FormatFileSpec (841 of 2134)
UNSUPPORTED: lldb-shell :: SymbolFile/NativePDB/ast-functions-msvc.cpp (842 of 2134)
UNSUPPORTED: lldb-shell :: ScriptInterpreter/Lua/persistent_state.test (843 of 2134)
PASS: lldb-unit :: Core/./LLDBCoreTests/RichManglingContextTest.IPDRealloc (844 of 2134)
PASS: lldb-unit :: Utility/./UtilityTests/StringExtractorTest.GetHexBytes_FullString (845 of 2134)
PASS: lldb-unit :: Utility/./UtilityTests/ScalarTest.APIntConstructor (846 of 2134)
PASS: lldb-unit :: Process/gdb-remote/./ProcessGdbRemoteTests/GDBRemoteCommunicationClientTest.SendGetMetaDataPacket (847 of 2134)
PASS: lldb-api :: commands/expression/vector_of_enums/TestVectorOfEnums.py (848 of 2134)
PASS: lldb-unit :: Utility/./UtilityTests/StringListTest.DefaultConstructor (849 of 2134)
PASS: lldb-shell :: ObjectFile/MachO/lc_build_version_notools.yaml (850 of 2134)
PASS: lldb-api :: api/log/TestAPILog.py (851 of 2134)
PASS: lldb-unit :: Language/Highlighting/./HighlighterTests/HighlighterTest.ClangIdentifiers (852 of 2134)
PASS: lldb-shell :: Driver/TestCore.test (853 of 2134)
PASS: lldb-shell :: ObjectFile/ELF/minidebuginfo-find-symbols.yaml (854 of 2134)
PASS: lldb-unit :: UnwindAssembly/x86/./UnwindAssemblyx86Tests/Testx86AssemblyInspectionEngine.TestSubESP (855 of 2134)
PASS: lldb-unit :: Host/./HostTests/NativeProcessProtocolTest.SetBreakpointFailWrite (856 of 2134)
PASS: lldb-shell :: Settings/TestFrameFormatNoColor.test (857 of 2134)
PASS: lldb-api :: types/TestCharTypeExpr.py (858 of 2134)
UNSUPPORTED: lldb-shell :: Unwind/eh-frame-augment-noop.test (859 of 2134)
PASS: lldb-api :: lang/objcxx/hide-runtime-values/TestObjCXXHideRuntimeValues.py (860 of 2134)
PASS: lldb-shell :: SymbolFile/Breakpad/line-table-mixed-path-styles.test (861 of 2134)
PASS: lldb-api :: functionalities/rerun/TestRerun.py (862 of 2134)
PASS: lldb-api :: terminal/TestEditline.py (863 of 2134)
PASS: lldb-unit :: Utility/./UtilityTests/StringListTest.InsertStringAtIndexStdString (864 of 2134)
UNSUPPORTED: lldb-shell :: Register/aarch64-gp-read.test (865 of 2134)
PASS: lldb-unit :: Utility/./UtilityTests/VASprintfTest.BufferResize (866 of 2134)
PASS: lldb-unit :: Utility/./UtilityTests/OptionsWithRawTest.SingleWhitespaceInput (867 of 2134)
PASS: lldb-api :: functionalities/archives/TestBSDArchives.py (868 of 2134)
PASS: lldb-shell :: ObjectFile/PECOFF/sections-names.yaml (869 of 2134)
PASS: lldb-api :: commands/platform/file/close/TestPlatformFileClose.py (870 of 2134)
PASS: lldb-unit :: UnwindAssembly/x86/./UnwindAssemblyx86Tests/Testx86AssemblyInspectionEngine.TestPushR12 (871 of 2134)
PASS: lldb-api :: functionalities/thread/concurrent_events/TestConcurrentDelayedCrashWithBreakpointSignal.py (872 of 2134)
PASS: lldb-unit :: Target/./TargetTests/ModuleCacheTest.GetAndPut (873 of 2134)
UNSUPPORTED: lldb-api :: functionalities/darwin_log/filter/regex/subsystem/TestDarwinLogFilterRegexSubsystem.py (874 of 2134)
PASS: lldb-unit :: Utility/./UtilityTests/RegisterValueTest.GetSet8 (875 of 2134)
PASS: lldb-unit :: Process/gdb-remote/./ProcessGdbRemoteTests/GDBRemoteCommunicationClientTest.GetMemoryRegionInfoInvalidResponse (876 of 2134)
PASS: lldb-unit :: Utility/./UtilityTests/StringExtractorTest.GetHexU8_Exact_NoEof (877 of 2134)
PASS: lldb-unit :: Utility/./UtilityTests/Flags.GetBitSize (878 of 2134)
PASS: lldb-unit :: DataFormatter/./LLDBFormatterTests/TypeMatcherTests.CreatedBySameMatchStringExactNamePrefixes (879 of 2134)
PASS: lldb-api :: python_api/frame/get-variables/TestGetVariables.py (880 of 2134)
PASS: lldb-api :: functionalities/gdb_remote_client/TestRegDefinitionInParts.py (881 of 2134)
PASS: lldb-api :: commands/apropos/with-process/TestAproposWithProcess.py (882 of 2134)
PASS: lldb-api :: functionalities/data-formatter/typedef_array/TestTypedefArray.py (883 of 2134)
PASS: lldb-unit :: Expression/./ExpressionTests/CppModuleConfigurationTest.AmbiguousLibCpp (884 of 2134)
PASS: lldb-shell :: ObjectFile/Breakpad/breakpad-identification.test (885 of 2134)
PASS: lldb-api :: functionalities/process_crash_info/TestProcessCrashInfo.py (886 of 2134)
PASS: lldb-api :: lang/mixed/TestMixedLanguages.py (887 of 2134)
PASS: lldb-unit :: ScriptInterpreter/Python/./ScriptInterpreterPythonTests/PythonDataObjectsTest.TestObjectAttributes (888 of 2134)
PASS: lldb-unit :: Utility/./UtilityTests/UriParserTest.BracketedHostnameWithPortIPv6 (889 of 2134)
PASS: lldb-shell :: Minidump/memory-region-from-module.yaml (890 of 2134)
PASS: lldb-api :: lang/cpp/dynamic-value/TestDynamicValue.py (891 of 2134)
PASS: lldb-api :: functionalities/memory/find/TestMemoryFind.py (892 of 2134)
PASS: lldb-unit :: UnwindAssembly/x86/./UnwindAssemblyx86Tests/Testx86AssemblyInspectionEngine.TestPushImm (893 of 2134)
PASS: lldb-api :: types/TestShortTypeExpr.py (894 of 2134)
PASS: lldb-shell :: SymbolFile/NativePDB/break-by-line.cpp (895 of 2134)
PASS: lldb-api :: lang/objc/bitfield_ivars/TestBitfieldIvars.py (896 of 2134)
PASS: lldb-api :: functionalities/breakpoint/serialize/TestBreakpointSerialization.py (897 of 2134)
PASS: lldb-unit :: Utility/./UtilityTests/DataExtractorTest.GetFloat (898 of 2134)
PASS: lldb-unit :: Utility/./UtilityTests/StringExtractorTest.GetHexU8_Underflow2 (899 of 2134)
UNSUPPORTED: lldb-api :: tools/lldb-server/thread-name/TestGdbRemoteThreadName.py (900 of 2134)
PASS: lldb-api :: lang/objcxx/objcxx-ivar-vector/TestIvarVector.py (901 of 2134)
PASS: lldb-unit :: Utility/./UtilityTests/FileSpecTest.RemoveLastPathComponent (902 of 2134)
PASS: lldb-unit :: Language/CPlusPlus/./LanguageCPlusPlusTests/CPlusPlusLanguage.MethodNameParsing (903 of 2134)
PASS: lldb-unit :: Utility/./UtilityTests/StreamTest.PutHex16ByteOrderBig (904 of 2134)
PASS: lldb-unit :: Process/gdb-remote/./ProcessGdbRemoteTests/GDBRemoteCommunicationClientTest.SendGetTraceConfigPacket (905 of 2134)
PASS: lldb-api :: functionalities/data-formatter/nsdictionarysynth/TestNSDictionarySynthetic.py (906 of 2134)
PASS: lldb-unit :: Symbol/./SymbolTests/DWARFCallFrameInfoTest.Basic_dwarf3 (907 of 2134)
PASS: lldb-api :: commands/watchpoints/watchpoint_commands/command/TestWatchpointCommandLLDB.py (908 of 2134)
PASS: lldb-unit :: Utility/./UtilityTests/StringExtractorTest.InitMisc (909 of 2134)
PASS: lldb-unit :: Utility/./UtilityTests/FileSpecTest.IsRelative (910 of 2134)
PASS: lldb-api :: python_api/lldbutil/process/TestPrintStackTraces.py (911 of 2134)
PASS: lldb-unit :: DataFormatter/./LLDBFormatterTests/TypeMatcherTests.GetMatchStringRegex (912 of 2134)
PASS: lldb-api :: commands/command/nested_alias/TestNestedAlias.py (913 of 2134)
PASS: lldb-unit :: SymbolFile/DWARF/./SymbolFileDWARFTests/XcodeSDKModuleTests.TestModuleGetXcodeSDK (914 of 2134)
PASS: lldb-api :: functionalities/breakpoint/breakpoint_locations/TestBreakpointLocations.py (915 of 2134)
UNSUPPORTED: lldb-api :: functionalities/data-formatter/data-formatter-stl/libstdcpp/smart_ptr/TestDataFormatterStdSmartPtr.py (916 of 2134)
PASS: lldb-unit :: Utility/./UtilityTests/BinaryStreamTest.PutSLEB128FiveBytes (917 of 2134)
PASS: lldb-api :: python_api/sbstructureddata/TestStructuredDataAPI.py (918 of 2134)
PASS: lldb-unit :: Expression/./ExpressionTests/DWARFExpression.DW_OP_convert (919 of 2134)
PASS: lldb-unit :: Process/gdb-remote/./ProcessGdbRemoteTests/GDBRemoteCommunicationClientTest.WriteRegisterNoSuffix (920 of 2134)
PASS: lldb-unit :: Host/./HostTests/NativeProcessProtocolTest.SetBreakpointFailRead (921 of 2134)
PASS: lldb-shell :: SymbolFile/NativePDB/disassembly.cpp (922 of 2134)
PASS: lldb-api :: functionalities/gdb_remote_client/TestPlatformClient.py (923 of 2134)
PASS: lldb-unit :: Target/./TargetTests/StackFrameRecognizerTest.NullModuleRegex (924 of 2134)
UNSUPPORTED: lldb-shell :: Register/arm-fp-read.test (925 of 2134)
PASS: lldb-unit :: Core/./LLDBCoreTests/ModuleSpecTest.InvalidInMemoryBufferValidFile (926 of 2134)
PASS: lldb-shell :: BuildScript/compiler-full-path.test (927 of 2134)
PASS: lldb-unit :: Utility/./UtilityTests/StringListTest.SplitIntoLinesSingleTrailingCR (928 of 2134)
PASS: lldb-api :: lang/c/modules/TestCModules.py (929 of 2134)
PASS: lldb-unit :: Symbol/./SymbolTests/TestClangASTImporter.CanImportInvalidType (930 of 2134)
PASS: lldb-unit :: UnwindAssembly/x86/./UnwindAssemblyx86Tests/Testx86AssemblyInspectionEngine.Test64bitFramelessSmallStackFrame (931 of 2134)
PASS: lldb-api :: commands/expression/calculator_mode/TestCalculatorMode.py (932 of 2134)
PASS: lldb-api :: python_api/type/TestTypeList.py (933 of 2134)
PASS: lldb-api :: lang/objc/modules-inline-functions/TestModulesInlineFunctions.py (934 of 2134)
PASS: lldb-unit :: Expression/./ExpressionTests/DiagnosticManagerTest.AppendMessageAttachToLastDiag (935 of 2134)
PASS: lldb-api :: lang/cpp/namespace/TestNamespace.py (936 of 2134)
UNSUPPORTED: lldb-api :: functionalities/darwin_log/source/info/TestDarwinLogSourceInfo.py (937 of 2134)
PASS: lldb-shell :: SymbolFile/NativePDB/ast-methods.cpp (938 of 2134)
PASS: lldb-api :: functionalities/unwind/sigtramp/TestSigtrampUnwind.py (939 of 2134)
PASS: lldb-shell :: Minidump/no-process-id.yaml (940 of 2134)
PASS: lldb-api :: tools/lldb-server/TestGdbRemoteAttach.py (941 of 2134)
PASS: lldb-api :: lang/objc/modules-app-update/TestClangModulesAppUpdate.py (942 of 2134)
PASS: lldb-api :: functionalities/breakpoint/breakpoint_ignore_count/TestBreakpointIgnoreCount.py (943 of 2134)
UNSUPPORTED: lldb-api :: linux/thread/create_during_instruction_step/TestCreateDuringInstructionStep.py (944 of 2134)
PASS: lldb-api :: lang/objc/unicode-string/TestUnicodeString.py (945 of 2134)
PASS: lldb-unit :: Host/./HostTests/HostInfoTest.GetHostname (946 of 2134)
PASS: lldb-api :: commands/quit/TestQuit.py (947 of 2134)
PASS: lldb-unit :: Utility/./UtilityTests/StreamTeeTest.SetStreamAtIndexOutOfBounds (948 of 2134)
PASS: lldb-shell :: Settings/TestFrameFormatMangling.test (949 of 2134)
PASS: lldb-api :: functionalities/gdb_remote_client/TestNoWatchpointSupportInfo.py (950 of 2134)
PASS: lldb-unit :: Utility/./UtilityTests/StreamTeeTest.GetStreamAtIndexOutOfBoundsEmpty (951 of 2134)
PASS: lldb-api :: lang/objc/objc-foundation-dictionary-empty/TestNSDictionary0.py (952 of 2134)
PASS: lldb-api :: macosx/DBGSourcePathRemapping/TestDSYMSourcePathRemapping.py (953 of 2134)
PASS: lldb-api :: lang/objc/objc-ivar-offsets/TestObjCIvarOffsets.py (954 of 2134)
PASS: lldb-unit :: Expression/./ExpressionTests/DiagnosticManagerTest.FixedExpression (955 of 2134)
PASS: lldb-api :: functionalities/data-formatter/user-format-vs-summary/TestUserFormatVsSummary.py (956 of 2134)
PASS: lldb-unit :: Process/minidump/./LLDBMinidumpTests/MinidumpParserTest.GetMemoryRegionInfoLinuxMaps (957 of 2134)
PASS: lldb-api :: functionalities/gdb_remote_client/TestJLink6Armv7RegisterDefinition.py (958 of 2134)
UNSUPPORTED: lldb-api :: tools/lldb-server/TestGdbRemoteAuxvSupport.py (959 of 2134)
PASS: lldb-api :: lang/cpp/this/TestCPPThis.py (960 of 2134)
PASS: lldb-shell :: ObjectFile/PECOFF/export-dllfunc.yaml (961 of 2134)
PASS: lldb-unit :: Utility/./UtilityTests/StringExtractorTest.GetHexU8_InvalidHex (962 of 2134)
PASS: lldb-unit :: UnwindAssembly/x86/./UnwindAssemblyx86Tests/Testx86AssemblyInspectionEngine.TestSpArithx86_64Augmented (963 of 2134)
PASS: lldb-unit :: SymbolFile/NativePDB/./SymbolFileNativePDBTests/PDBFPOProgramToDWARFExpressionTests.MissingTargetRegister (964 of 2134)
PASS: lldb-shell :: SymbolFile/DWARF/DW_AT_location-DW_AT_const_value.s (965 of 2134)
PASS: lldb-api :: commands/expression/inline-namespace/TestInlineNamespace.py (966 of 2134)
PASS: lldb-shell :: SymbolFile/DWARF/dwarf5-atomic.s (967 of 2134)
PASS: lldb-shell :: Breakpoint/debug_rnglist_rlestartend.test (968 of 2134)
PASS: lldb-api :: python_api/watchpoint/TestSetWatchpoint.py (969 of 2134)
PASS: lldb-shell :: Driver/TestFile.test (970 of 2134)
PASS: lldb-unit :: Expression/./ExpressionTests/DiagnosticManagerTest.GetStringNoDiags (971 of 2134)
PASS: lldb-unit :: Utility/./UtilityTests/ArchSpecTest.TripleComponentsWereSpecified (972 of 2134)
PASS: lldb-shell :: SymbolFile/DWARF/static_scope.s (973 of 2134)
PASS: lldb-api :: functionalities/data-formatter/cstring-utf8-summary/TestCstringUnicode.py (974 of 2134)
PASS: lldb-api :: functionalities/data-formatter/refpointer-recursion/TestDataFormatterRefPtrRecursion.py (975 of 2134)
PASS: lldb-unit :: Host/./HostTests/NativeProcessProtocolTest.SetBreakpointFailVerify (976 of 2134)
UNSUPPORTED: lldb-api :: functionalities/thread/break_after_join/TestBreakAfterJoin.py (977 of 2134)
PASS: lldb-unit :: Utility/./UtilityTests/FileSpecTest.Yaml (978 of 2134)
PASS: lldb-shell :: Breakpoint/single-file-split-dwarf.test (979 of 2134)
PASS: lldb-shell :: SymbolFile/DWARF/debug_rnglists-dwo.s (980 of 2134)
PASS: lldb-api :: lang/cpp/chained-calls/TestCppChainedCalls.py (981 of 2134)
PASS: lldb-unit :: UnwindAssembly/ARM64/./Arm64InstEmulationTests/TestArm64InstEmulation.TestFramelessThreeEpilogueFunction (982 of 2134)
PASS: lldb-unit :: Symbol/./SymbolTests/LineEntryTest.GetSameLineContiguousAddressRangeNoInlines (983 of 2134)
PASS: lldb-unit :: Utility/./UtilityTests/PassiveReplayTest.InstrumentedFooInvalid (984 of 2134)
PASS: lldb-unit :: Process/gdb-remote/./ProcessGdbRemoteTests/GDBRemoteCommunicationClientTest.GetQOffsets (985 of 2134)
PASS: lldb-unit :: Expression/./ExpressionTests/DWARFExpression.DW_OP_unknown (986 of 2134)
PASS: lldb-shell :: SymbolFile/DWARF/dir-separator-posix.s (987 of 2134)
PASS: lldb-unit :: Core/./LLDBCoreTests/ModuleSpecTest.TestMachOFile (988 of 2134)
PASS: lldb-shell :: Quit/TestQuitExitCode0.test (989 of 2134)
PASS: lldb-api :: functionalities/data-formatter/vector-types/TestVectorTypesFormatting.py (990 of 2134)
PASS: lldb-api :: iohandler/completion/TestIOHandlerCompletion.py (991 of 2134)
PASS: lldb-api :: functionalities/inferior-changed/TestInferiorChanged.py (992 of 2134)
PASS: lldb-unit :: Utility/./UtilityTests/RangeTest.SlideZero (993 of 2134)
PASS: lldb-api :: functionalities/breakpoint/address_breakpoints/TestBadAddressBreakpoints.py (994 of 2134)
PASS: lldb-unit :: DataFormatter/./LLDBFormatterTests/TypeMatcherTests.RegexName (995 of 2134)
PASS: lldb-unit :: Utility/./UtilityTests/VMRange.CollectionContains (996 of 2134)
PASS: lldb-shell :: Minidump/disassemble-no-module.yaml (997 of 2134)
PASS: lldb-api :: commands/statistics/basic/TestStats.py (998 of 2134)
PASS: lldb-shell :: SymbolFile/DWARF/debug-types-dwo-cross-reference.cpp (999 of 2134)
UNSUPPORTED: lldb-api :: tools/intel-features/intel-pt/test/TestIntelPTSimpleBinary.py (1000 of 2134)
PASS: lldb-api :: functionalities/data-formatter/data-formatter-globals/TestDataFormatterGlobals.py (1001 of 2134)
PASS: lldb-shell :: ScriptInterpreter/Python/scripted_breakpoint.test (1002 of 2134)
PASS: lldb-unit :: UnwindAssembly/x86/./UnwindAssemblyx86Tests/Testx86AssemblyInspectionEngine.TestSpillRegToStackViaMOVx86_64 (1003 of 2134)
PASS: lldb-unit :: Utility/./UtilityTests/RangeTest.ClearWithStarAddress (1004 of 2134)
PASS: lldb-unit :: Symbol/./SymbolTests/SymbolsTest.LocateExecutableSymbolFileForUnknownExecutableAndMissingSymbolFile (1005 of 2134)
PASS: lldb-unit :: Language/CPlusPlus/./LanguageCPlusPlusTests/CPlusPlusLanguage.ExtractContextAndIdentifier (1006 of 2134)
PASS: lldb-api :: commands/expression/two-files/TestObjCTypeQueryFromOtherCompileUnit.py (1007 of 2134)
UNSUPPORTED: lldb-api :: functionalities/darwin_log/format/TestDarwinLogMessageFormat.py (1008 of 2134)
PASS: lldb-unit :: Utility/./UtilityTests/FileSpecTest.FileAndDirectoryComponents (1009 of 2134)
PASS: lldb-api :: functionalities/tail_call_frames/thread_step_out_or_return/TestSteppingOutWithArtificialFrames.py (1010 of 2134)
PASS: lldb-api :: functionalities/thread/concurrent_events/TestConcurrentManyBreakpoints.py (1011 of 2134)
PASS: lldb-unit :: ScriptInterpreter/Python/./ScriptInterpreterPythonTests/PythonDataObjectsTest.TestPythonByteArray (1012 of 2134)
PASS: lldb-unit :: UnwindAssembly/x86/./UnwindAssemblyx86Tests/Testx86AssemblyInspectionEngine.TestSpillRegToStackViaMOVi386 (1013 of 2134)
PASS: lldb-unit :: Utility/./UtilityTests/StringLexerTest.AdvanceIf (1014 of 2134)
PASS: lldb-api :: functionalities/breakpoint/auto_continue/TestBreakpointAutoContinue.py (1015 of 2134)
PASS: lldb-unit :: Process/minidump/./LLDBMinidumpTests/MinidumpParserTest.GetThreadContext_x86_64 (1016 of 2134)
PASS: lldb-unit :: Utility/./UtilityTests/StreamTeeTest.DefaultConstructor (1017 of 2134)
PASS: lldb-unit :: Utility/./UtilityTests/StringListTest.LongestCommonPrefixNoPrefix (1018 of 2134)
PASS: lldb-unit :: Utility/./UtilityTests/StateTest.Formatv (1019 of 2134)
PASS: lldb-unit :: Utility/./UtilityTests/StringExtractorTest.GetU32LittleEndian (1020 of 2134)
PASS: lldb-unit :: Utility/./UtilityTests/StringLexerTest.PutBack (1021 of 2134)
PASS: lldb-unit :: Utility/./UtilityTests/CompletionRequest.TryCompleteCurrentArgBad (1022 of 2134)
PASS: lldb-api :: lang/cpp/scope/TestCppScope.py (1023 of 2134)
PASS: lldb-unit :: Utility/./UtilityTests/BinaryStreamTest.PutULEB128OneByte (1024 of 2134)
PASS: lldb-unit :: Utility/./UtilityTests/BinaryStreamTest.PutULEB128One (1025 of 2134)
PASS: lldb-unit :: Utility/./UtilityTests/DataExtractorTest.GetULEB128_bit63 (1026 of 2134)
PASS: lldb-api :: commands/settings/TestSettings.py (1027 of 2134)
UNSUPPORTED: lldb-api :: commands/expression/macros/TestMacros.py (1028 of 2134)
PASS: lldb-api :: commands/source/info/TestSourceInfo.py (1029 of 2134)
PASS: lldb-unit :: Utility/./UtilityTests/StringExtractorTest.GetHexU8_Underflow (1030 of 2134)
PASS: lldb-api :: commands/expression/import-std-module/vector-bool/TestVectorBoolFromStdModule.py (1031 of 2134)
PASS: lldb-api :: lang/cpp/template/TestTemplateArgs.py (1032 of 2134)
PASS: lldb-unit :: Expression/./ExpressionTests/DiagnosticManagerTest.GetStringBasic (1033 of 2134)
PASS: lldb-unit :: Host/./HostTests/MainLoopTest.Signal (1034 of 2134)
PASS: lldb-shell :: ObjectFile/PECOFF/section-types.yaml (1035 of 2134)
PASS: lldb-api :: lang/cpp/multiple-inheritance/TestCppMultipleInheritance.py (1036 of 2134)
PASS: lldb-shell :: SymbolFile/DWARF/module-ownership.mm (1037 of 2134)
PASS: lldb-api :: commands/target/create-deps/TestTargetCreateDeps.py (1038 of 2134)
PASS: lldb-api :: functionalities/thread/concurrent_events/TestConcurrentTwoBreakpointsOneDelaySignal.py (1039 of 2134)
PASS: lldb-shell :: Breakpoint/ppc64-localentry.test (1040 of 2134)
PASS: lldb-unit :: Utility/./UtilityTests/RangeTest.Copy (1041 of 2134)
PASS: lldb-unit :: Utility/./UtilityTests/StreamTest.PutPtr (1042 of 2134)
PASS: lldb-shell :: SymbolFile/NativePDB/tag-types.cpp (1043 of 2134)
UNSUPPORTED: lldb-api :: commands/register/register/aarch64_sve_registers/rw_access_static_config/TestSVERegisters.py (1044 of 2134)
UNSUPPORTED: lldb-api :: linux/mix-dwo-and-regular-objects/TestMixedDwarfBinary.py (1045 of 2134)
PASS: lldb-api :: lang/cpp/limit-debug-info/TestWithLimitDebugInfo.py (1046 of 2134)
PASS: lldb-unit :: Utility/./UtilityTests/ScalarTest.Scalar_512 (1047 of 2134)
PASS: lldb-api :: functionalities/tail_call_frames/ambiguous_tail_call_seq2/TestAmbiguousTailCallSeq2.py (1048 of 2134)
PASS: lldb-api :: functionalities/tail_call_frames/sbapi_support/TestTailCallFrameSBAPI.py (1049 of 2134)
PASS: lldb-api :: commands/platform/file/read/TestPlatformFileRead.py (1050 of 2134)
UNSUPPORTED: lldb-api :: functionalities/thread/multi_break/TestMultipleBreakpoints.py (1051 of 2134)
PASS: lldb-api :: commands/command/source/TestCommandSource.py (1052 of 2134)
PASS: lldb-unit :: ScriptInterpreter/Python/./ScriptInterpreterPythonTests/PythonDataObjectsTest.TestPythonTupleSize (1053 of 2134)
PASS: lldb-api :: functionalities/exec/TestExec.py (1054 of 2134)
PASS: lldb-api :: functionalities/thread/concurrent_events/TestConcurrentCrashWithWatchpointBreakpointSignal.py (1055 of 2134)
PASS: lldb-unit :: Utility/./UtilityTests/FileSpecTest.OperatorBool (1056 of 2134)
PASS: lldb-api :: functionalities/data-formatter/data-formatter-stl/libcxx/vbool/TestDataFormatterLibcxxVBool.py (1057 of 2134)
PASS: lldb-api :: functionalities/paths/TestPaths.py (1058 of 2134)
PASS: lldb-unit :: Utility/./UtilityTests/SerializationRountripTest.SerializeDeserializePod (1059 of 2134)
PASS: lldb-api :: types/TestLongTypes.py (1060 of 2134)
PASS: lldb-api :: functionalities/tail_call_frames/thread_step_out_message/TestArtificialFrameStepOutMessage.py (1061 of 2134)
PASS: lldb-api :: commands/version/TestVersion.py (1062 of 2134)
PASS: lldb-unit :: Utility/./UtilityTests/StringListTest.PopBack (1063 of 2134)
PASS: lldb-shell :: Breakpoint/jitbp_elf.test (1064 of 2134)
PASS: lldb-unit :: Target/./TargetTests/MemoryRegionInfoTest.Formatv (1065 of 2134)
PASS: lldb-unit :: Utility/./UtilityTests/ConstStringTest.FromMidOfBufferStringRef (1066 of 2134)
UNSUPPORTED: lldb-shell :: ScriptInterpreter/Lua/watchpoint_callback.test (1067 of 2134)
PASS: lldb-unit :: Process/minidump/./LLDBMinidumpTests/MinidumpParserTest.GetMiscInfo_no_stream (1068 of 2134)
PASS: lldb-unit :: ObjectFile/Breakpad/./ObjectFileBreakpadTests/LineRecord.parse (1069 of 2134)
PASS: lldb-unit :: Utility/./UtilityTests/IndexToObjectTest.ObjectForIndex (1070 of 2134)
PASS: lldb-unit :: Symbol/./SymbolTests/Type.CompilerContextPattern (1071 of 2134)
PASS: lldb-unit :: DataFormatter/./LLDBFormatterTests/TypeMatcherTests.ExactName (1072 of 2134)
PASS: lldb-unit :: Host/./HostTests/FileSystemTest.EnumerateDirectory (1073 of 2134)
PASS: lldb-unit :: Utility/./UtilityTests/RangeTest.SetRangeBase (1074 of 2134)
PASS: lldb-unit :: UnwindAssembly/x86/./UnwindAssemblyx86Tests/Testx86AssemblyInspectionEngine.TestPopEBX (1075 of 2134)
PASS: lldb-api :: commands/expression/import-std-module/forward_list/TestForwardListFromStdModule.py (1076 of 2134)
PASS: lldb-api :: commands/disassemble/basic/TestDisassembleBreakpoint.py (1077 of 2134)
PASS: lldb-shell :: ObjectFile/ELF/PT_TLS-overlap-PT_LOAD.yaml (1078 of 2134)
PASS: lldb-api :: functionalities/data-formatter/data-formatter-ptr-to-array/TestPtrToArrayFormatting.py (1079 of 2134)
PASS: lldb-shell :: Settings/TestDisassemblyFormat.test (1080 of 2134)
PASS: lldb-unit :: Utility/./UtilityTests/ArgsTest.TestTrailingBackslash (1081 of 2134)
PASS: lldb-api :: functionalities/ptr_refs/TestPtrRefs.py (1082 of 2134)
PASS: lldb-unit :: Host/./HostTests/SocketTest.DomainGetConnectURI (1083 of 2134)
PASS: lldb-unit :: Utility/./UtilityTests/DataExtractorTest.GetBitfield (1084 of 2134)
PASS: lldb-api :: tools/lldb-vscode/launch/TestVSCode_launch.py (1085 of 2134)
UNSUPPORTED: lldb-api :: functionalities/thread/concurrent_events/TestConcurrentManySignals.py (1086 of 2134)
PASS: lldb-api :: functionalities/breakpoint/breakpoint_language/TestBreakpointLanguage.py (1087 of 2134)
PASS: lldb-unit :: Utility/./UtilityTests/StreamTest.PutStringAsRawHex8 (1088 of 2134)
PASS: lldb-unit :: Utility/./UtilityTests/LogTest.LLDB_LOG_nullptr (1089 of 2134)
PASS: lldb-unit :: Utility/./UtilityTests/SubsystemRAIITest.NormalSubsystem (1090 of 2134)
PASS: lldb-api :: lang/c/vla/TestVLA.py (1091 of 2134)
PASS: lldb-unit :: UnwindAssembly/x86/./UnwindAssemblyx86Tests/Testx86AssemblyInspectionEngine.TestCALLNextInsn (1092 of 2134)
PASS: lldb-unit :: Utility/./UtilityTests/CompletionRequest.DuplicateFiltering (1093 of 2134)
PASS: lldb-api :: tools/lldb-server/TestGdbRemote_qThreadStopInfo.py (1094 of 2134)
PASS: lldb-api :: functionalities/data-formatter/language_category_updates/TestDataFormatterLanguageCategoryUpdates.py (1095 of 2134)
PASS: lldb-unit :: Utility/./UtilityTests/ProcessInstanceInfo.Yaml (1096 of 2134)
PASS: lldb-shell :: SymbolFile/DWARF/debug_ranges.s (1097 of 2134)
PASS: lldb-api :: functionalities/float-display/TestFloatDisplay.py (1098 of 2134)
PASS: lldb-shell :: Commands/command-thread-select.test (1099 of 2134)
PASS: lldb-api :: lang/cpp/dynamic-value-same-basename/TestDynamicValueSameBase.py (1100 of 2134)
PASS: lldb-api :: functionalities/data-formatter/data-formatter-stl/libcxx/optional/TestDataFormatterLibcxxOptional.py (1101 of 2134)
PASS: lldb-api :: lang/cpp/operators/TestCppOperators.py (1102 of 2134)
PASS: lldb-unit :: UnwindAssembly/x86/./UnwindAssemblyx86Tests/Testx86AssemblyInspectionEngine.TestAddRSP (1103 of 2134)
PASS: lldb-unit :: Target/./TargetTests/PathMappingListTest.RemapRoot (1104 of 2134)
PASS: lldb-api :: commands/expression/cast_int_to_anonymous_enum/TestCastIntToAnonymousEnum.py (1105 of 2134)
PASS: lldb-api :: functionalities/data-formatter/setvaluefromcstring/TestSetValueFromCString.py (1106 of 2134)
PASS: lldb-shell :: SymbolFile/DWARF/DW_AT_loclists_base.s (1107 of 2134)
PASS: lldb-unit :: Utility/./UtilityTests/StringExtractorTest.GetHexBytes_Partial (1108 of 2134)
PASS: lldb-api :: commands/apropos/basic/TestApropos.py (1109 of 2134)
PASS: lldb-shell :: ObjectFile/ELF/compressed-sections.yaml (1110 of 2134)
PASS: lldb-api :: functionalities/breakpoint/breakpoint_command/TestBreakpointCommandsFromPython.py (1111 of 2134)
PASS: lldb-api :: lang/objc/foundation/TestObjCMethods.py (1112 of 2134)
PASS: lldb-shell :: Breakpoint/debug_rnglist_offset_pair.test (1113 of 2134)
PASS: lldb-api :: lang/objc/modules-hash-mismatch/TestClangModulesHashMismatch.py (1114 of 2134)
PASS: lldb-unit :: Process/gdb-remote/./ProcessGdbRemoteTests/GDBRemoteCommunicationClientTest.GetMemoryRegionInfo (1115 of 2134)
PASS: lldb-unit :: Signals/./SignalsTests/UnixSignalsTest.VersionChange (1116 of 2134)
PASS: lldb-unit :: Utility/./UtilityTests/BinaryStreamTest.PutULEB128SevenBytes (1117 of 2134)
PASS: lldb-unit :: SymbolFile/DWARF/./SymbolFileDWARFTests/SymbolFileDWARFTests.TestAbilitiesForDWARF (1118 of 2134)
PASS: lldb-unit :: UnwindAssembly/x86/./UnwindAssemblyx86Tests/Testx86AssemblyInspectionEngine.TestPushEDX (1119 of 2134)
PASS: lldb-api :: lang/cpp/class_types/TestClassTypesDisassembly.py (1120 of 2134)
UNSUPPORTED: lldb-shell :: ScriptInterpreter/Lua/independent_state.test (1121 of 2134)
PASS: lldb-api :: commands/frame/select/TestFrameSelect.py (1122 of 2134)
PASS: lldb-api :: functionalities/thread/concurrent_events/TestConcurrentDelaySignalBreak.py (1123 of 2134)
PASS: lldb-api :: lang/objc/blocks/TestObjCIvarsInBlocks.py (1124 of 2134)
PASS: lldb-unit :: SymbolFile/NativePDB/./SymbolFileNativePDBTests/PDBFPOProgramToDWARFExpressionTests.UnresolvedRegisterReference (1125 of 2134)
PASS: lldb-api :: terminal/TestSTTYBeforeAndAfter.py (1126 of 2134)
UNSUPPORTED: lldb-api :: benchmarks/libcxxmap/TestBenchmarkLibcxxMap.py (1127 of 2134)
PASS: lldb-unit :: Interpreter/./InterpreterTests/OptionArgParserTest.toChar (1128 of 2134)
PASS: lldb-unit :: Utility/./UtilityTests/UriParserTest.SchemeHostSeparator2 (1129 of 2134)
PASS: lldb-unit :: Symbol/./SymbolTests/Type.GetTypeScopeAndBasename (1130 of 2134)
PASS: lldb-unit :: Process/minidump/./LLDBMinidumpTests/MinidumpParserTest.FindMemoryRangeWithFullMemoryMinidump (1131 of 2134)
PASS: lldb-shell :: Minidump/fb-dump.test (1132 of 2134)
PASS: lldb-unit :: Utility/./UtilityTests/StringListTest.GetMaxStringLengthEmpty (1133 of 2134)
PASS: lldb-shell :: SymbolFile/DWARF/parallel-indexing-stress.s (1134 of 2134)
PASS: lldb-unit :: Utility/./UtilityTests/StringListTest.GetMaxStringLengthEqualSize (1135 of 2134)
PASS: lldb-shell :: ObjectFile/ELF/short-build-id.yaml (1136 of 2134)
PASS: lldb-api :: lang/cpp/class-template-parameter-pack/TestClassTemplateParameterPack.py (1137 of 2134)
PASS: lldb-unit :: Utility/./UtilityTests/TildeExpressionResolver.ResolveFullPath (1138 of 2134)
PASS: lldb-api :: functionalities/data-formatter/dump_dynamic/TestDumpDynamic.py (1139 of 2134)
PASS: lldb-api :: commands/frame/diagnose/local-variable/TestLocalVariable.py (1140 of 2134)
PASS: lldb-shell :: Minidump/dump-all.test (1141 of 2134)
PASS: lldb-unit :: Host/./HostTests/Host.WaitStatusFormat (1142 of 2134)
PASS: lldb-api :: lang/cpp/inlines/TestInlines.py (1143 of 2134)
PASS: lldb-unit :: Utility/./UtilityTests/StreamTest.SetIndentLevel (1144 of 2134)
PASS: lldb-api :: lang/c/conflicting-symbol/TestConflictingSymbol.py (1145 of 2134)
PASS: lldb-unit :: Process/gdb-remote/./ProcessGdbRemoteTests/GDBRemoteClientBaseTest.SendContinueDelegateInterface (1146 of 2134)
PASS: lldb-api :: python_api/interpreter/TestCommandInterpreterAPI.py (1147 of 2134)
PASS: lldb-api :: functionalities/memory/cache/TestMemoryCache.py (1148 of 2134)
PASS: lldb-api :: functionalities/inferior-crashing/recursive-inferior/TestRecursiveInferior.py (1149 of 2134)
PASS: lldb-unit :: Host/./HostTests/MainLoopTest.DetectsEOF (1150 of 2134)
PASS: lldb-unit :: UnwindAssembly/x86/./UnwindAssemblyx86Tests/Testx86AssemblyInspectionEngine.TestPushR15 (1151 of 2134)
PASS: lldb-api :: functionalities/thread/state_after_expression/TestStateAfterExpression.py (1152 of 2134)
PASS: lldb-unit :: Utility/./UtilityTests/ProcessInstanceInfo.DumpTable_invalidUID (1153 of 2134)
PASS: lldb-api :: functionalities/thread/concurrent_events/TestConcurrentCrashWithBreak.py (1154 of 2134)
PASS: lldb-api :: functionalities/gdb_remote_client/TestNoGPacketSupported.py (1155 of 2134)
PASS: lldb-api :: driver/batch_mode/TestBatchMode.py (1156 of 2134)
PASS: lldb-api :: functionalities/breakpoint/global_constructor/TestBreakpointInGlobalConstructor.py (1157 of 2134)
PASS: lldb-shell :: SymbolFile/DWARF/apple-index-is-used.cpp (1158 of 2134)
PASS: lldb-unit :: Utility/./UtilityTests/RangeTest.EqualInvalid (1159 of 2134)
PASS: lldb-shell :: Breakpoint/debug_addrx.test (1160 of 2134)
PASS: lldb-unit :: Host/./HostTests/ConnectionFileDescriptorTest.TCPGetURIv4 (1161 of 2134)
PASS: lldb-api :: python_api/lldbutil/TestSwigVersion.py (1162 of 2134)
PASS: lldb-api :: python_api/watchpoint/watchlocation/TestSetWatchlocation.py (1163 of 2134)
PASS: lldb-api :: python_api/sbplatform/TestSBPlatform.py (1164 of 2134)
PASS: lldb-unit :: Expression/./ExpressionTests/CppModuleConfigurationTest.Linux (1165 of 2134)
PASS: lldb-api :: commands/watchpoints/watchpoint_count/TestWatchpointCount.py (1166 of 2134)
PASS: lldb-unit :: Disassembler/./DisassemblerTests/TestArm64Disassembly.TestArmv81Instruction (1167 of 2134)
PASS: lldb-api :: lang/objc/ptr_refs/TestPtrRefsObjC.py (1168 of 2134)
PASS: lldb-unit :: ObjectFile/Breakpad/./ObjectFileBreakpadTests/FuncRecord.parse (1169 of 2134)
PASS: lldb-api :: functionalities/gdb_remote_client/TestGDBRemoteDiskFileCompletion.py (1170 of 2134)
PASS: lldb-unit :: Utility/./UtilityTests/RangeTest.NotEqual (1171 of 2134)
PASS: lldb-unit :: Utility/./UtilityTests/Flags.AnyClear (1172 of 2134)
PASS: lldb-shell :: SymbolFile/NativePDB/source-list.cpp (1173 of 2134)
PASS: lldb-shell :: Commands/command-regex-unalias.test (1174 of 2134)
PASS: lldb-api :: commands/expression/persist_objc_pointeetype/TestPersistObjCPointeeType.py (1175 of 2134)
PASS: lldb-api :: lang/cpp/breakpoint_in_member_func_w_non_primitive_params/TestBreakpointInMemberFuncWNonPrimitiveParams.py (1176 of 2134)
PASS: lldb-shell :: SymbolFile/DWARF/dwarf5-partial-index.cpp (1177 of 2134)
PASS: lldb-shell :: Process/Optimization.test (1178 of 2134)
PASS: lldb-api :: functionalities/data-formatter/pyobjsynthprovider/TestPyObjSynthProvider.py (1179 of 2134)
PASS: lldb-shell :: SymbolFile/DWARF/debug_line-tombstone.s (1180 of 2134)
PASS: lldb-unit :: UnwindAssembly/x86/./UnwindAssemblyx86Tests/Testx86AssemblyInspectionEngine.TestPopRBPWithREX (1181 of 2134)
XFAIL: lldb-shell :: Unwind/prefer-debug-over-eh-frame.test (1182 of 2134)
PASS: lldb-unit :: Utility/./UtilityTests/RangeVector.CombineConsecutiveRanges (1183 of 2134)
PASS: lldb-unit :: Utility/./UtilityTests/UriParserTest.BracketedHostnameWithPortIPv4 (1184 of 2134)
PASS: lldb-api :: functionalities/thread/concurrent_events/TestConcurrentTwoWatchpointsOneSignal.py (1185 of 2134)
PASS: lldb-unit :: ObjectFile/Breakpad/./ObjectFileBreakpadTests/InfoRecord.parse (1186 of 2134)
PASS: lldb-unit :: Symbol/./SymbolTests/TestClangASTImporter.DeportTypeTagDecl (1187 of 2134)
PASS: lldb-api :: commands/target/create-no-such-arch/TestNoSuchArch.py (1188 of 2134)
PASS: lldb-api :: lang/c/stepping/TestThreadStepping.py (1189 of 2134)
PASS: lldb-api :: lang/c/global_variables/TestGlobalVariables.py (1190 of 2134)
PASS: lldb-api :: lang/objc/foundation/TestObjCMethodsNSArray.py (1191 of 2134)
PASS: lldb-api :: commands/expression/radar_9673664/TestExprHelpExamples.py (1192 of 2134)
PASS: lldb-api :: commands/expression/import-std-module/vector-dbg-info-content/TestDbgInfoContentVectorFromStdModule.py (1193 of 2134)
PASS: lldb-unit :: UnwindAssembly/ARM64/./Arm64InstEmulationTests/TestArm64InstEmulation.TestMediumDarwinFunction (1194 of 2134)
PASS: lldb-unit :: debugserver/./debugserverTests/RNBSocket.LoopBackConnectIPv4 (1195 of 2134)
PASS: lldb-unit :: Utility/./UtilityTests/SubsystemRAIITest.SubsystemWithErrorSuccess (1196 of 2134)
PASS: lldb-unit :: Utility/./UtilityTests/ArgsTest.StringListConstructor (1197 of 2134)
PASS: lldb-unit :: Utility/./UtilityTests/ArgsTest.ReplaceArgumentAtIndexLonger (1198 of 2134)
PASS: lldb-shell :: Unwind/eh-frame-dwarf-unwind.test (1199 of 2134)
PASS: lldb-api :: iohandler/autosuggestion/TestAutosuggestion.py (1200 of 2134)
PASS: lldb-unit :: Expression/./ExpressionTests/CppModuleConfigurationTest.MissingUsrInclude (1201 of 2134)
PASS: lldb-unit :: Process/gdb-remote/./ProcessGdbRemoteTests/GDBRemoteCommunicationClientTest.SendSignalsToIgnore (1202 of 2134)
PASS: lldb-unit :: Utility/./UtilityTests/StreamTest.ShiftOperatorPtr (1203 of 2134)
PASS: lldb-api :: macosx/macCatalyst/TestMacCatalyst.py (1204 of 2134)
PASS: lldb-shell :: SymbolFile/DWARF/debug-types-address-ranges.s (1205 of 2134)
PASS: lldb-unit :: Utility/./UtilityTests/UriParserTest.Minimal (1206 of 2134)
PASS: lldb-unit :: Utility/./UtilityTests/RangeTest.DoesAdjoinOrIntersect (1207 of 2134)
PASS: lldb-unit :: Process/gdb-remote/./ProcessGdbRemoteTests/GDBRemoteCommunicationClientTest.GetModulesInfo_UUID20 (1208 of 2134)
PASS: lldb-api :: functionalities/tail_call_frames/cross_object/TestCrossObjectTailCalls.py (1209 of 2134)
PASS: lldb-unit :: Symbol/./SymbolTests/DWARFCallFrameInfoTest.Basic_eh (1210 of 2134)
PASS: lldb-unit :: Utility/./UtilityTests/StreamTeeTest.AppendStream (1211 of 2134)
PASS: lldb-api :: functionalities/breakpoint/source_regexp/TestSourceRegexBreakpoints.py (1212 of 2134)
PASS: lldb-unit :: DataFormatter/./LLDBFormatterTests/TypeMatcherTests.GetMatchStringExactName (1213 of 2134)
PASS: lldb-unit :: Utility/./UtilityTests/BinaryStreamTest.PutSLEB128One (1214 of 2134)
PASS: lldb-unit :: Utility/./UtilityTests/UserIDResolver.GetGroupName (1215 of 2134)
PASS: lldb-unit :: Utility/./UtilityTests/ScalarTest.CastOperations (1216 of 2134)
PASS: lldb-shell :: Commands/command-breakpoint-col.test (1217 of 2134)
PASS: lldb-unit :: ScriptInterpreter/Python/./ScriptInterpreterPythonTests/PythonDataObjectsTest.TestPythonTupleValues (1218 of 2134)
PASS: lldb-unit :: Utility/./UtilityTests/VMRange.Clear (1219 of 2134)
PASS: lldb-unit :: Utility/./UtilityTests/UriParserTest.SchemeHostSeparator4 (1220 of 2134)
PASS: lldb-api :: commands/watchpoints/multiple_threads/TestWatchpointMultipleThreads.py (1221 of 2134)
PASS: lldb-api :: commands/command/script/TestCommandScript.py (1222 of 2134)
UNSUPPORTED: lldb-api :: commands/register/register/intel_xtended_registers/TestMPXRegisters.py (1223 of 2134)
PASS: lldb-api :: functionalities/set-data/TestSetData.py (1224 of 2134)
PASS: lldb-unit :: Symbol/./SymbolTests/TestClangASTImporter.RecordLayout (1225 of 2134)
PASS: lldb-unit :: Utility/./UtilityTests/Flags.AnySet (1226 of 2134)
PASS: lldb-unit :: Expression/./ExpressionTests/DiagnosticManagerTest.PutString (1227 of 2134)
PASS: lldb-api :: functionalities/limit-debug-info/TestLimitDebugInfo.py (1228 of 2134)
UNSUPPORTED: lldb-api :: benchmarks/stepping/TestSteppingSpeed.py (1229 of 2134)
PASS: lldb-shell :: SymbolFile/NativePDB/globals-bss.cpp (1230 of 2134)
PASS: lldb-unit :: Utility/./UtilityTests/RecordReplayTest.InstrumentedBarPtr (1231 of 2134)
PASS: lldb-unit :: ScriptInterpreter/Python/./ScriptInterpreterPythonTests/PythonDataObjectsTest.TestPythonListToStructuredList (1232 of 2134)
PASS: lldb-unit :: ScriptInterpreter/Python/./ScriptInterpreterPythonTests/PythonDataObjectsTest.TestResetting (1233 of 2134)
PASS: lldb-api :: commands/watchpoints/watchpoint_events/TestWatchpointEvents.py (1234 of 2134)
PASS: lldb-unit :: Utility/./UtilityTests/UriParserTest.SchemeHostSeparator (1235 of 2134)
PASS: lldb-unit :: Utility/./UtilityTests/LogChannelEnabledTest.LLDB_LOG_ERROR (1236 of 2134)
PASS: lldb-api :: functionalities/data-formatter/type_summary_list_script/TestTypeSummaryListScript.py (1237 of 2134)
PASS: lldb-api :: commands/command/delete/TestCommandDelete.py (1238 of 2134)
PASS: lldb-unit :: debugserver/./debugserverTests/RNBSocket.LoopBackListenIPv6 (1239 of 2134)
PASS: lldb-unit :: Core/./LLDBCoreTests/MangledTest.ResultForValidName (1240 of 2134)
PASS: lldb-api :: functionalities/value_md5_crash/TestValueMD5Crash.py (1241 of 2134)
PASS: lldb-unit :: Utility/./UtilityTests/Flags.IsClear (1242 of 2134)
PASS: lldb-api :: lang/cpp/global_variables/TestCPPGlobalVariables.py (1243 of 2134)
PASS: lldb-unit :: Utility/./UtilityTests/StreamTeeTest.CopyConstructor (1244 of 2134)
PASS: lldb-shell :: Driver/TestError.test (1245 of 2134)
PASS: lldb-shell :: Breakpoint/implicit_const_form_support.test (1246 of 2134)
PASS: lldb-api :: lang/objc/orderedset/TestOrderedSet.py (1247 of 2134)
PASS: lldb-api :: functionalities/data-formatter/stringprinter/TestStringPrinter.py (1248 of 2134)
PASS: lldb-unit :: Utility/./UtilityTests/OptionsWithRawTest.SingleWordSuffix (1249 of 2134)
PASS: lldb-shell :: SymbolFile/DWARF/find-inline-method.s (1250 of 2134)
PASS: lldb-shell :: ObjectFile/ELF/section-permissions.yaml (1251 of 2134)
PASS: lldb-api :: commands/frame/diagnose/dereference-function-return/TestDiagnoseDereferenceFunctionReturn.py (1252 of 2134)
PASS: lldb-unit :: DataFormatter/./LLDBFormatterTests/StringPrinterTests.CxxASCII (1253 of 2134)
PASS: lldb-unit :: Utility/./UtilityTests/StringListTest.GetMaxStringLengthMixed (1254 of 2134)
UNSUPPORTED: lldb-shell :: BuildScript/toolchain-msvc.test (1255 of 2134)
PASS: lldb-api :: lang/c/stepping/TestStepAndBreakpoints.py (1256 of 2134)
PASS: lldb-unit :: ScriptInterpreter/Python/./ScriptInterpreterPythonTests/PythonDataObjectsTest.TestExtractingUInt64ThroughStructuredData (1257 of 2134)
PASS: lldb-api :: lang/cpp/function-qualifiers/TestCppFunctionQualifiers.py (1258 of 2134)
PASS: lldb-unit :: Host/./HostTests/File.GetStreamFromDescriptor (1259 of 2134)
UNSUPPORTED: lldb-shell :: SymbolFile/PDB/udt-layout.test (1260 of 2134)
PASS: lldb-api :: functionalities/abbreviation/TestCommonShortSpellings.py (1261 of 2134)
PASS: lldb-unit :: UnwindAssembly/x86/./UnwindAssemblyx86Tests/Testx86AssemblyInspectionEngine.TestPopR13 (1262 of 2134)
PASS: lldb-unit :: ScriptInterpreter/Python/./ScriptInterpreterPythonTests/PythonDataObjectsTest.TestPythonListValueEquality (1263 of 2134)
PASS: lldb-unit :: Utility/./UtilityTests/StringListTest.ForRange (1264 of 2134)
PASS: lldb-shell :: ObjectFile/wasm/stripped-debug-sections.yaml (1265 of 2134)
PASS: lldb-api :: functionalities/breakpoint/cpp_exception/TestCPPExceptionBreakpoint.py (1266 of 2134)
PASS: lldb-unit :: Utility/./UtilityTests/OptionsWithRawTest.MultiWordSuffix (1267 of 2134)
PASS: lldb-api :: lang/cpp/unique-types/TestUniqueTypes.py (1268 of 2134)
PASS: lldb-shell :: Reproducer/TestFileRepro.test (1269 of 2134)
PASS: lldb-unit :: Utility/./UtilityTests/StringListTest.Clear (1270 of 2134)
UNSUPPORTED: lldb-shell :: SymbolFile/PDB/variables-locations.test (1271 of 2134)
PASS: lldb-unit :: Utility/./UtilityTests/StringListTest.GetMaxStringLengthDecreasingSize (1272 of 2134)
PASS: lldb-unit :: Utility/./UtilityTests/StringExtractorTest.GetHexU8_InvalidHex_NoEof (1273 of 2134)
PASS: lldb-api :: commands/expression/formatters/TestFormatters.py (1274 of 2134)
PASS: lldb-unit :: Process/minidump/./LLDBMinidumpTests/MinidumpParserTest.MinidumpModuleOrder (1275 of 2134)
PASS: lldb-api :: functionalities/data-formatter/data-formatter-objc/TestDataFormatterObjCNSBundle.py (1276 of 2134)
PASS: lldb-unit :: Utility/./UtilityTests/BinaryStreamTest.PutULEB128ThreeBytes (1277 of 2134)
PASS: lldb-unit :: Core/./LLDBCoreTests/UniqueCStringMap.NoDefaultConstructor (1278 of 2134)
PASS: lldb-api :: functionalities/plugins/command_plugin/TestPluginCommands.py (1279 of 2134)
PASS: lldb-api :: lang/objc/objc-static-method-stripped/TestObjCStaticMethodStripped.py (1280 of 2134)
PASS: lldb-unit :: Utility/./UtilityTests/DataExtractorTest.GetCStrAtEnd (1281 of 2134)
PASS: lldb-unit :: Utility/./UtilityTests/StatusTest.ErrorConstructor (1282 of 2134)
PASS: lldb-api :: commands/session/history/TestSessionHistory.py (1283 of 2134)
PASS: lldb-api :: python_api/formatters/TestFormattersSBAPI.py (1284 of 2134)
PASS: lldb-shell :: ObjectFile/ELF/section-types.yaml (1285 of 2134)
PASS: lldb-unit :: ScriptInterpreter/Python/./ScriptInterpreterPythonTests/PythonDataObjectsTest.TestScript (1286 of 2134)
PASS: lldb-unit :: Utility/./UtilityTests/BroadcasterTest.BroadcastEvent (1287 of 2134)
PASS: lldb-shell :: SymbolFile/DWARF/dwarf5-index-is-used.cpp (1288 of 2134)
PASS: lldb-api :: api/listeners/TestListener.py (1289 of 2134)
PASS: lldb-api :: functionalities/tail_call_frames/inlining_and_tail_calls/TestInliningAndTailCalls.py (1290 of 2134)
PASS: lldb-api :: functionalities/testid/TestTestId.py (1291 of 2134)
PASS: lldb-unit :: Language/Highlighting/./HighlighterTests/HighlighterTest.HighlighterSelectionPath (1292 of 2134)
PASS: lldb-unit :: Utility/./UtilityTests/UriParserTest.TypicalPortPathIPv6 (1293 of 2134)
PASS: lldb-unit :: Utility/./UtilityTests/StreamTest.AddressSuffix (1294 of 2134)
UNSUPPORTED: lldb-shell :: SymbolFile/PDB/type-quals.test (1295 of 2134)
PASS: lldb-api :: commands/expression/test/TestExprs.py (1296 of 2134)
PASS: lldb-api :: python_api/disassemble-raw-data/TestDisassembleRawData.py (1297 of 2134)
PASS: lldb-unit :: UnwindAssembly/x86/./UnwindAssemblyx86Tests/Testx86AssemblyInspectionEngine.TestPopR12 (1298 of 2134)
PASS: lldb-unit :: Symbol/./SymbolTests/TestTypeSystemClang.TestDisplayName (1299 of 2134)
PASS: lldb-api :: functionalities/source-map/TestTargetSourceMap.py (1300 of 2134)
PASS: lldb-unit :: Expression/./ExpressionTests/DiagnosticManagerTest.GetStringMultipleDiags (1301 of 2134)
UNSUPPORTED: lldb-api :: functionalities/thread/state/TestThreadStates.py (1302 of 2134)
PASS: lldb-shell :: SymbolFile/Breakpad/stack-cfi-arm.yaml (1303 of 2134)
PASS: lldb-api :: functionalities/data-formatter/data-formatter-categories/TestDataFormatterCategories.py (1304 of 2134)
PASS: lldb-api :: commands/expression/test/TestExprs2.py (1305 of 2134)
PASS: lldb-unit :: Host/./HostTests/FileSystemTest.Resolve (1306 of 2134)
PASS: lldb-unit :: Utility/./UtilityTests/AnsiTerminal.AtEnd (1307 of 2134)
UNSUPPORTED: lldb-api :: lang/cpp/printf/TestPrintf.py (1308 of 2134)
PASS: lldb-unit :: Utility/./UtilityTests/UriParserTest.BracketedHostnameWithColon (1309 of 2134)
PASS: lldb-unit :: ScriptInterpreter/Python/./ScriptInterpreterPythonTests/PythonDataObjectsTest.TestBorrowedReferences (1310 of 2134)
PASS: lldb-unit :: Utility/./UtilityTests/StreamTest.AddressRangeSize (1311 of 2134)
PASS: lldb-shell :: ObjectFile/ELF/PT_LOAD-overlap-PT_INTERP.yaml (1312 of 2134)
UNSUPPORTED: lldb-api :: tools/lldb-server/libraries-svr4/TestGdbRemoteLibrariesSvr4Support.py (1313 of 2134)
PASS: lldb-api :: lang/cpp/subst_template_type_param/TestSubstTemplateTypeParam.py (1314 of 2134)
PASS: lldb-api :: commands/expression/class_template_specialization_empty_pack/TestClassTemplateSpecializationParametersHandling.py (1315 of 2134)
PASS: lldb-api :: functionalities/thread/concurrent_events/TestConcurrentCrashWithSignal.py (1316 of 2134)
PASS: lldb-unit :: Process/gdb-remote/./ProcessGdbRemoteTests/GDBRemoteCommunicationTest.ReadPacket_checksum (1317 of 2134)
PASS: lldb-unit :: Utility/./UtilityTests/StringExtractorTest.GetU32BigEndian (1318 of 2134)
UNSUPPORTED: lldb-shell :: SymbolFile/PDB/function-level-linking.test (1319 of 2134)
PASS: lldb-api :: commands/process/launch-with-shellexpand/TestLaunchWithShellExpand.py (1320 of 2134)
PASS: lldb-unit :: ObjectFile/Breakpad/./ObjectFileBreakpadTests/FileRecord.parse (1321 of 2134)
PASS: lldb-unit :: debugserver/./debugserverTests/RNBSocket.AnyListen (1322 of 2134)
PASS: lldb-unit :: Utility/./UtilityTests/SerializationRountripTest.SerializeDeserializeObjectReference (1323 of 2134)
PASS: lldb-shell :: Watchpoint/SetErrorCases.test (1324 of 2134)
PASS: lldb-api :: functionalities/thread/concurrent_events/TestConcurrentDelayWatchBreak.py (1325 of 2134)
PASS: lldb-api :: commands/expression/import-std-module/unique_ptr-dbg-info-content/TestUniquePtrDbgInfoContent.py (1326 of 2134)
PASS: lldb-api :: commands/help/TestHelp.py (1327 of 2134)
PASS: lldb-api :: lang/objc/objc++/TestObjCXX.py (1328 of 2134)
PASS: lldb-api :: commands/expression/import-std-module/stack/TestStackFromStdModule.py (1329 of 2134)
PASS: lldb-unit :: Utility/./UtilityTests/RegularExpression.Valid (1330 of 2134)
PASS: lldb-api :: functionalities/data-formatter/var-in-aggregate-misuse/TestVarInAggregateMisuse.py (1331 of 2134)
PASS: lldb-api :: functionalities/tsan/global_location/TestTsanGlobalLocation.py (1332 of 2134)
PASS: lldb-unit :: ObjectFile/Breakpad/./ObjectFileBreakpadTests/ModuleRecord.parse (1333 of 2134)
PASS: lldb-api :: lang/c/offsetof/TestOffsetof.py (1334 of 2134)
PASS: lldb-unit :: Utility/./UtilityTests/Flags.Clear (1335 of 2134)
PASS: lldb-api :: functionalities/reproducers/attach/TestReproducerAttach.py (1336 of 2134)
PASS: lldb-unit :: SymbolFile/DWARF/./SymbolFileDWARFTests/SymbolFileDWARFTests.TestAbbrevInvalidNULLTag (1337 of 2134)
PASS: lldb-api :: functionalities/data-formatter/data-formatter-objc/TestDataFormatterObjCNSURL.py (1338 of 2134)
PASS: lldb-api :: functionalities/gdb_remote_client/TestWriteMemory.py (1339 of 2134)
PASS: lldb-unit :: Host/./HostTests/SocketTest.UDPConnect (1340 of 2134)
PASS: lldb-unit :: SymbolFile/NativePDB/./SymbolFileNativePDBTests/PDBFPOProgramToDWARFExpressionTests.UnresolvedDependentCyclicRegisterAssignmentReference (1341 of 2134)
UNSUPPORTED: lldb-api :: functionalities/thread/create_during_step/TestCreateDuringStep.py (1342 of 2134)
PASS: lldb-unit :: Symbol/./SymbolTests/TestTypeSystemClang.TemplateArguments (1343 of 2134)
PASS: lldb-shell :: Register/x86-64-read.test (1344 of 2134)
PASS: lldb-unit :: Utility/./UtilityTests/StructuredDataTest.ParseJSONFromFile (1345 of 2134)
PASS: lldb-shell :: Minidump/Windows/arm-fp-unwind.test (1346 of 2134)
PASS: lldb-unit :: Utility/./UtilityTests/Flags.AllSet (1347 of 2134)
PASS: lldb-shell :: ObjectFile/ELF/netbsd-core-amd64.test (1348 of 2134)
PASS: lldb-api :: functionalities/thread/concurrent_events/TestConcurrentTwoWatchpointThreads.py (1349 of 2134)
PASS: lldb-api :: lang/objc/rdar-11355592/TestRdar11355592.py (1350 of 2134)
PASS: lldb-unit :: UnwindAssembly/x86/./UnwindAssemblyx86Tests/Testx86AssemblyInspectionEngine.TestSimplex86_64Augmented (1351 of 2134)
PASS: lldb-api :: commands/expression/timeout/TestCallWithTimeout.py (1352 of 2134)
PASS: lldb-api :: commands/expression/multiline-navigation/TestMultilineNavigation.py (1353 of 2134)
PASS: lldb-unit :: Utility/./UtilityTests/VMRange.Ordering (1354 of 2134)
PASS: lldb-api :: functionalities/breakpoint/scripted_bkpt/TestScriptedResolver.py (1355 of 2134)
PASS: lldb-unit :: Symbol/./SymbolTests/TestClangASTImporter.MetadataPropagationAfterCopying (1356 of 2134)
UNSUPPORTED: lldb-shell :: SymbolFile/DWARF/DW_TAG_GNU_call_site-DW_AT_low_pc.s (1357 of 2134)
PASS: lldb-api :: tools/lldb-server/TestLldbGdbServer.py (1358 of 2134)
PASS: lldb-shell :: SymbolFile/DWARF/debug_ranges-missing-section.s (1359 of 2134)
PASS: lldb-api :: functionalities/completion/TestCompletion.py (1360 of 2134)
PASS: lldb-api :: lang/objc/single-entry-dictionary/TestObjCSingleEntryDictionary.py (1361 of 2134)
PASS: lldb-api :: macosx/safe-to-func-call/TestSafeFuncCalls.py (1362 of 2134)
PASS: lldb-api :: tools/lldb-vscode/variables/TestVSCode_variables.py (1363 of 2134)
PASS: lldb-shell :: SymbolFile/DWARF/compilercontext.ll (1364 of 2134)
PASS: lldb-unit :: UnwindAssembly/x86/./UnwindAssemblyx86Tests/Testx86AssemblyInspectionEngine.TestAddESP (1365 of 2134)
PASS: lldb-api :: commands/expression/import-std-module/vector-of-vectors/TestVectorOfVectorsFromStdModule.py (1366 of 2134)
PASS: lldb-api :: types/TestFloatTypes.py (1367 of 2134)
PASS: lldb-unit :: ScriptInterpreter/Python/./ScriptInterpreterPythonTests/PythonDataObjectsTest.TestPythonIntegerToStructuredInteger (1368 of 2134)
PASS: lldb-api :: functionalities/thread/concurrent_events/TestConcurrentTwoWatchpointsOneBreakpoint.py (1369 of 2134)
PASS: lldb-shell :: ObjectFile/ELF/aarch64-relocations.yaml (1370 of 2134)
PASS: lldb-api :: lang/objc/objc-dyn-sbtype/TestObjCDynamicSBType.py (1371 of 2134)
PASS: lldb-shell :: ObjectFile/ELF/PT_LOAD.yaml (1372 of 2134)
PASS: lldb-unit :: Language/CPlusPlus/./LanguageCPlusPlusTests/CPlusPlusLanguage.CPlusPlusNameParser (1373 of 2134)
PASS: lldb-api :: python_api/process/io/TestProcessIO.py (1374 of 2134)
PASS: lldb-unit :: Utility/./UtilityTests/CompletionRequest.DuplicateFilteringWithComments (1375 of 2134)
PASS: lldb-api :: python_api/breakpoint/TestBreakpointAPI.py (1376 of 2134)
PASS: lldb-unit :: API/./APITests/SBCommandInterpreterTest.MultiWordCommand (1377 of 2134)
UNSUPPORTED: lldb-shell :: SymbolFile/DWARF/debug-types-expressions.test (1378 of 2134)
PASS: lldb-unit :: Utility/./UtilityTests/LogChannelEnabledTest.LogGetLogThread (1379 of 2134)
PASS: lldb-unit :: API/./APITests/SBCommandInterpreterTest.SingleWordCommand (1380 of 2134)
PASS: lldb-shell :: Commands/CommandScriptImmediateOutput/CommandScriptImmediateOutputConsole.test (1381 of 2134)
PASS: lldb-unit :: Process/gdb-remote/./ProcessGdbRemoteTests/GDBRemoteClientBaseTest.InterruptNoResponse (1382 of 2134)
PASS: lldb-unit :: Utility/./UtilityTests/SerializationRountripTest.SerializeDeserializePodReferences (1383 of 2134)
PASS: lldb-api :: tools/lldb-server/TestGdbRemote_vCont.py (1384 of 2134)
PASS: lldb-unit :: Utility/./UtilityTests/XcodeSDKTest.GetCanonicalNameAndConstruct (1385 of 2134)
PASS: lldb-shell :: ObjectFile/Breakpad/uuid-matching-mac.test (1386 of 2134)
PASS: lldb-unit :: Utility/./UtilityTests/ArgsTest.BareSingleQuote (1387 of 2134)
UNSUPPORTED: lldb-shell :: Register/x86-64-xmm16-read.test (1388 of 2134)
PASS: lldb-unit :: Utility/./UtilityTests/FileSpecTest.EqualSeparator (1389 of 2134)
PASS: lldb-api :: functionalities/tail_call_frames/disambiguate_call_site/TestDisambiguateCallSite.py (1390 of 2134)
PASS: lldb-shell :: Commands/CommandScriptImmediateOutput/CommandScriptImmediateOutputFile.test (1391 of 2134)
PASS: lldb-api :: functionalities/data-formatter/data-formatter-stl/libcxx/list/TestDataFormatterLibcxxList.py (1392 of 2134)
PASS: lldb-api :: lang/c/step_over_no_deadlock/TestStepOverDoesntBlock.py (1393 of 2134)
PASS: lldb-shell :: Driver/TestTarget.test (1394 of 2134)
PASS: lldb-api :: functionalities/thread/concurrent_events/TestConcurrentBreakpointDelayBreakpointOneSignal.py (1395 of 2134)
PASS: lldb-shell :: SymbolFile/DWARF/debug-names-compressed.cpp (1396 of 2134)
PASS: lldb-api :: commands/expression/call-throws/TestCallThatThrows.py (1397 of 2134)
PASS: lldb-api :: iohandler/unicode/TestUnicode.py (1398 of 2134)
PASS: lldb-unit :: Utility/./UtilityTests/UriParserTest.MinimalPath (1399 of 2134)
PASS: lldb-unit :: Utility/./UtilityTests/SerializationRountripTest.SerializeDeserializeCStringNull (1400 of 2134)
PASS: lldb-shell :: Breakpoint/split-dwarf5-debug-stroffsets.test (1401 of 2134)
PASS: lldb-unit :: Utility/./UtilityTests/ArgsTest.GetArgumentArrayRef (1402 of 2134)
PASS: lldb-api :: macosx/thread_suspend/TestInternalThreadSuspension.py (1403 of 2134)
PASS: lldb-api :: functionalities/data-formatter/synthupdate/TestSyntheticFilterRecompute.py (1404 of 2134)
PASS: lldb-shell :: Driver/TestNoUseColor.test (1405 of 2134)
PASS: lldb-unit :: Symbol/./SymbolTests/TestClangASTImporter.MetadataPropagationIndirectImport (1406 of 2134)
PASS: lldb-unit :: Language/Highlighting/./HighlighterTests/HighlighterTest.Colons (1407 of 2134)
PASS: lldb-unit :: Target/./TargetTests/PathMappingListTest.RelativeTests (1408 of 2134)
PASS: lldb-api :: functionalities/dynamic_value_child_count/TestDynamicValueChildCount.py (1409 of 2134)
UNSUPPORTED: lldb-api :: tools/lldb-server/TestGdbRemoteModuleInfo.py (1410 of 2134)
PASS: lldb-unit :: Utility/./UtilityTests/DeserializerTest.HasData (1411 of 2134)
PASS: lldb-unit :: Utility/./UtilityTests/UriParserTest.LongPath (1412 of 2134)
PASS: lldb-unit :: Utility/./UtilityTests/UriParserTest.Empty (1413 of 2134)
PASS: lldb-unit :: Core/./LLDBCoreTests/RichManglingContextTest.Basic (1414 of 2134)
PASS: lldb-unit :: Utility/./UtilityTests/ScalarTest.TruncOrExtendTo (1415 of 2134)
PASS: lldb-api :: python_api/get-value-32bit-int/TestGetValue32BitInt.py (1416 of 2134)
PASS: lldb-unit :: Core/./LLDBCoreTests/ModuleSpecTest.TestELFFile (1417 of 2134)
PASS: lldb-unit :: Utility/./UtilityTests/ArgsTest.TestAppendArg (1418 of 2134)
UNSUPPORTED: lldb-api :: functionalities/process_save_core/TestProcessSaveCore.py (1419 of 2134)
PASS: lldb-unit :: UnwindAssembly/ARM64/./Arm64InstEmulationTests/TestArm64InstEmulation.TestRegisterSavedTwice (1420 of 2134)
PASS: lldb-unit :: Utility/./UtilityTests/RangeTest.Slide (1421 of 2134)
PASS: lldb-unit :: Utility/./UtilityTests/NameMatchesTest.StartsWith (1422 of 2134)
PASS: lldb-unit :: Host/./HostTests/SocketAddressTest.GetAddressInfo (1423 of 2134)
PASS: lldb-api :: functionalities/data-formatter/data-formatter-objc/nsindexpath/TestDataFormatterNSIndexPath.py (1424 of 2134)
PASS: lldb-api :: commands/expression/context-object-objc/TestContextObjectObjc.py (1425 of 2134)
PASS: lldb-api :: commands/expression/scoped_enums/TestScopedEnumType.py (1426 of 2134)
PASS: lldb-unit :: Utility/./UtilityTests/VASprintfTest.EncodingError (1427 of 2134)
UNSUPPORTED: lldb-api :: android/platform/TestDefaultCacheLineSize.py (1428 of 2134)
PASS: lldb-unit :: ObjectFile/Breakpad/./ObjectFileBreakpadTests/PublicRecord.parse (1429 of 2134)
PASS: lldb-unit :: Utility/./UtilityTests/ArgsTest.TestInsertArg (1430 of 2134)
PASS: lldb-unit :: Utility/./UtilityTests/StringExtractorTest.DecodeHexU8_Underflow (1431 of 2134)
PASS: lldb-shell :: SymbolFile/NativePDB/function-types-builtins.cpp (1432 of 2134)
PASS: lldb-unit :: Host/./HostTests/MainLoopTest.TerminatesImmediately (1433 of 2134)
PASS: lldb-api :: functionalities/postmortem/elf-core/gcore/TestGCore.py (1434 of 2134)
PASS: lldb-unit :: Symbol/./SymbolTests/TestTypeSystemClang.TestGetBasicTypeFromEnum (1435 of 2134)
PASS: lldb-api :: commands/target/stop-hook/enable/TestTargetStopHookEnable.py (1436 of 2134)
PASS: lldb-api :: python_api/file_handle/TestFileHandle.py (1437 of 2134)
PASS: lldb-shell :: Process/TestEnvironment.test (1438 of 2134)
PASS: lldb-shell :: BuildScript/toolchain-clang.test (1439 of 2134)
PASS: lldb-shell :: Reproducer/Modules/TestModuleCXX.test (1440 of 2134)
PASS: lldb-api :: sample_test/TestSampleInlineTest.py (1441 of 2134)
PASS: lldb-api :: commands/breakpoint/set/func-regex/TestBreakpointRegexError.py (1442 of 2134)
UNSUPPORTED: lldb-shell :: Watchpoint/netbsd-nouserdbregs.test (1443 of 2134)
PASS: lldb-api :: macosx/thread-names/TestInterruptThreadNames.py (1444 of 2134)
PASS: lldb-unit :: Utility/./UtilityTests/StreamTest.PutRawBytesToLittleEndian (1445 of 2134)
UNSUPPORTED: lldb-api :: commands/register/register/intel_xtended_registers/mpx_offset_intersection/TestMPXOffsetIntersection.py (1446 of 2134)
PASS: lldb-api :: functionalities/optimized_code/TestNoASanExceptionAfterEvalOP_piece.py (1447 of 2134)
PASS: lldb-api :: tools/lldb-server/commandline/TestStubSetSID.py (1448 of 2134)
PASS: lldb-unit :: Utility/./UtilityTests/StringListTest.ShiftCString (1449 of 2134)
PASS: lldb-unit :: SymbolFile/DWARF/./SymbolFileDWARFTests/SymbolFileDWARFTests.TestAbbrevNullAttrValidForm (1450 of 2134)
PASS: lldb-api :: tools/lldb-vscode/step/TestVSCode_step.py (1451 of 2134)
PASS: lldb-api :: functionalities/data-formatter/data-formatter-stl/libcxx/initializerlist/TestInitializerList.py (1452 of 2134)
PASS: lldb-unit :: Expression/./ExpressionTests/DWARFExpression.DW_OP_stack_value (1453 of 2134)
PASS: lldb-api :: python_api/findvalue_duplist/TestSBFrameFindValue.py (1454 of 2134)
PASS: lldb-shell :: ObjectFile/MachO/subsections.yaml (1455 of 2134)
UNSUPPORTED: lldb-api :: functionalities/breakpoint/hardware_breakpoints/write_memory_with_hw_breakpoint/TestWriteMemoryWithHWBreakpoint.py (1456 of 2134)
PASS: lldb-api :: commands/command/script/import/rdar-12586188/TestRdar12586188.py (1457 of 2134)
PASS: lldb-shell :: SymbolFile/Breakpad/unwind-via-raSearch.test (1458 of 2134)
PASS: lldb-unit :: Utility/./UtilityTests/ConstStringTest.CompareStringRef (1459 of 2134)
PASS: lldb-api :: python_api/disassemble-raw-data/TestDisassemble_VST1_64.py (1460 of 2134)
PASS: lldb-shell :: SymbolFile/DWARF/anon_class_w_and_wo_export_symbols.ll (1461 of 2134)
PASS: lldb-shell :: SymbolFile/DWARF/dwarf5_locations.s (1462 of 2134)
PASS: lldb-api :: sample_test/TestSampleTest.py (1463 of 2134)
PASS: lldb-unit :: Host/./HostTests/SocketAddressTest.Set (1464 of 2134)
PASS: lldb-unit :: SymbolFile/NativePDB/./SymbolFileNativePDBTests/PDBFPOProgramToDWARFExpressionTests.UnsupportedRASearch (1465 of 2134)
PASS: lldb-unit :: Utility/./UtilityTests/BinaryStreamTest.PutSLEB128ThreeBytes (1466 of 2134)
PASS: lldb-api :: macosx/version_zero/TestGetVersionZeroVersion.py (1467 of 2134)
PASS: lldb-shell :: Expr/TestIRMemoryMap.test (1468 of 2134)
PASS: lldb-shell :: SymbolFile/NativePDB/function-types-calling-conv.cpp (1469 of 2134)
PASS: lldb-unit :: Language/Highlighting/./HighlighterTests/HighlighterTest.ClangTrailingBackslashWithWhitespace (1470 of 2134)
PASS: lldb-unit :: Utility/./UtilityTests/NameMatchesTest.Equals (1471 of 2134)
PASS: lldb-unit :: Utility/./UtilityTests/XcodeSDKTest.MergeTest (1472 of 2134)
PASS: lldb-unit :: Utility/./UtilityTests/OptionsWithRawTest.EmptyArgsOnlySuffix (1473 of 2134)
PASS: lldb-shell :: Reproducer/TestHomeDir.test (1474 of 2134)
PASS: lldb-api :: tools/lldb-vscode/breakpoint/TestVSCode_setExceptionBreakpoints.py (1475 of 2134)
PASS: lldb-api :: types/TestLongTypesExpr.py (1476 of 2134)
PASS: lldb-unit :: Utility/./UtilityTests/StringListTest.LongestCommonPrefixSingleElement (1477 of 2134)
PASS: lldb-unit :: SymbolFile/DWARF/./SymbolFileDWARFTests/SymbolFileDWARFTests.TestAbbrevOrder1Start1 (1478 of 2134)
PASS: lldb-api :: commands/expression/completion-in-lambda-and-unnamed-class/TestCompletionInLambdaAndUnnamedClass.py (1479 of 2134)
PASS: lldb-unit :: Utility/./UtilityTests/LogChannelEnabledTest.log_options (1480 of 2134)
PASS: lldb-unit :: Utility/./UtilityTests/RangeDataVector.FindEntryThatContains (1481 of 2134)
PASS: lldb-unit :: Utility/./UtilityTests/ArgsTest.TestArgv (1482 of 2134)
PASS: lldb-api :: lang/objc/objc-stepping/TestObjCStepping.py (1483 of 2134)
PASS: lldb-unit :: Utility/./UtilityTests/StringListTest.JoinThree (1484 of 2134)
PASS: lldb-api :: macosx/find-dsym/deep-bundle/TestDeepBundle.py (1485 of 2134)
PASS: lldb-unit :: Symbol/./SymbolTests/TestTypeSystemClang.TestGetEnumIntegerTypeBasicTypes (1486 of 2134)
PASS: lldb-unit :: Symbol/./SymbolTests/PostfixExpression.ToDWARF (1487 of 2134)
PASS: lldb-api :: python_api/lldbutil/frame/TestFrameUtils.py (1488 of 2134)
PASS: lldb-shell :: ScriptInterpreter/Python/sb_address_exception.test (1489 of 2134)
PASS: lldb-unit :: Utility/./UtilityTests/StringListTest.InsertStringAtIndexStart (1490 of 2134)
PASS: lldb-unit :: Utility/./UtilityTests/OptionsWithRawTest.ArgsButNoLeadingDash (1491 of 2134)
PASS: lldb-shell :: Driver/TestUseColor.test (1492 of 2134)
XFAIL: lldb-shell :: Register/x86-64-ymm-write.test (1493 of 2134)
PASS: lldb-unit :: Host/./HostTests/FileSystemTest.Exists (1494 of 2134)
PASS: lldb-api :: lang/cpp/global_operators/TestCppGlobalOperators.py (1495 of 2134)
PASS: lldb-unit :: Process/minidump/./LLDBMinidumpTests/MinidumpParserTest.GetLinuxProcStatus (1496 of 2134)
PASS: lldb-api :: commands/watchpoints/hello_watchpoint/TestMyFirstWatchpoint.py (1497 of 2134)
PASS: lldb-unit :: Utility/./UtilityTests/StreamTest.PutBytesAsRawHex8ToMixedEndian (1498 of 2134)
PASS: lldb-api :: functionalities/breakpoint/breakpoint_conditions/TestBreakpointConditions.py (1499 of 2134)
PASS: lldb-api :: sanity/TestSettingSkipping.py (1500 of 2134)
PASS: lldb-shell :: SymbolFile/DWARF/DW_TAG_basic_type_DW_ATE_UTF_nonC.ll (1501 of 2134)
PASS: lldb-unit :: Utility/./UtilityTests/StringListTest.AppendList (1502 of 2134)
PASS: lldb-unit :: Utility/./UtilityTests/OptionsWithRawTest.WhitespaceInput (1503 of 2134)
PASS: lldb-unit :: Host/./HostTests/ConnectionFileDescriptorTest.TCPGetURIv6 (1504 of 2134)
PASS: lldb-api :: functionalities/step_scripted/TestStepScripted.py (1505 of 2134)
PASS: lldb-unit :: Host/./HostTests/SocketTest.DecodeHostAndPort (1506 of 2134)
PASS: lldb-api :: lang/objc/objc-builtin-types/TestObjCBuiltinTypes.py (1507 of 2134)
PASS: lldb-unit :: Utility/./UtilityTests/StringExtractorTest.GetNameColonValueContainsColon (1508 of 2134)
PASS: lldb-unit :: Utility/./UtilityTests/ArgsTest.TestSingleArgWithQuotedSpace (1509 of 2134)
PASS: lldb-api :: functionalities/load_unload/TestLoadUnload.py (1510 of 2134)
PASS: lldb-api :: commands/log/basic/TestLogging.py (1511 of 2134)
UNSUPPORTED: lldb-shell :: Unwind/unwind-plan-dwarf-dump.test (1512 of 2134)
UNSUPPORTED: lldb-api :: functionalities/darwin_log/basic/TestDarwinLogBasic.py (1513 of 2134)
PASS: lldb-api :: commands/process/attach/attach_denied/TestAttachDenied.py (1514 of 2134)
UNSUPPORTED: lldb-api :: functionalities/unwind/standard/TestStandardUnwind.py (1515 of 2134)
PASS: lldb-shell :: SymbolFile/DWARF/DW_TAG_variable-invalid_location.s (1516 of 2134)
PASS: lldb-api :: lang/objc/foundation/TestObjCMethodsString.py (1517 of 2134)
PASS: lldb-unit :: UnwindAssembly/x86/./UnwindAssemblyx86Tests/Testx86AssemblyInspectionEngine.TestSimple64bitFrameFunction (1518 of 2134)
PASS: lldb-api :: lang/objc/modules-update/TestClangModulesUpdate.py (1519 of 2134)
PASS: lldb-unit :: Utility/./UtilityTests/ListenerTest.GetEventWait (1520 of 2134)
PASS: lldb-unit :: Utility/./UtilityTests/StreamTest.PutChar (1521 of 2134)
PASS: lldb-api :: python_api/sbenvironment/TestSBEnvironment.py (1522 of 2134)
PASS: lldb-unit :: Utility/./UtilityTests/ScalarTest.Getters (1523 of 2134)
PASS: lldb-unit :: Utility/./UtilityTests/StreamTest.PutHex64ByteOrderLittle (1524 of 2134)
PASS: lldb-unit :: ScriptInterpreter/Python/./ScriptInterpreterPythonTests/PythonDataObjectsTest.TestPythonFile (1525 of 2134)
PASS: lldb-api :: functionalities/thread/num_threads/TestNumThreads.py (1526 of 2134)
PASS: lldb-unit :: UnwindAssembly/x86/./UnwindAssemblyx86Tests/Testx86AssemblyInspectionEngine.TestLEAVE (1527 of 2134)
UNSUPPORTED: lldb-shell :: SymbolFile/PDB/vbases.test (1528 of 2134)
PASS: lldb-api :: lang/objc/objc-new-syntax/TestObjCNewSyntaxArray.py (1529 of 2134)
PASS: lldb-api :: lang/cpp/overloaded-functions/TestOverloadedFunctions.py (1530 of 2134)
PASS: lldb-unit :: tools/lldb-server/tests/./LLDBServerTests/TestBase.DebugserverEnv (1531 of 2134)
PASS: lldb-api :: functionalities/thread/concurrent_events/TestConcurrentNWatchNBreak.py (1532 of 2134)
PASS: lldb-unit :: Utility/./UtilityTests/ScalarTest.Promotion (1533 of 2134)
PASS: lldb-api :: tools/lldb-server/TestGdbRemoteHostInfo.py (1534 of 2134)
UNSUPPORTED: lldb-shell :: Register/x86-64-xmm16-write.test (1535 of 2134)
PASS: lldb-unit :: Utility/./UtilityTests/ArgsTest.ReplaceArgumentAtIndexOutOfRange (1536 of 2134)
PASS: lldb-shell :: Settings/TestFrameFormatColor.test (1537 of 2134)
PASS: lldb-shell :: Settings/TestLineMarkerColor.test (1538 of 2134)
PASS: lldb-unit :: Utility/./UtilityTests/OptionsWithRawTest.EmptyInput (1539 of 2134)
PASS: lldb-api :: python_api/target/TestTargetAPI.py (1540 of 2134)
UNSUPPORTED: lldb-api :: tools/lldb-server/registers-target-xml-reading/TestGdbRemoteTargetXmlPacket.py (1541 of 2134)
PASS: lldb-api :: python_api/default-constructor/TestDefaultConstructorForAPIObjects.py (1542 of 2134)
PASS: lldb-unit :: Utility/./UtilityTests/VMRange.Comparison (1543 of 2134)
PASS: lldb-api :: lang/c/shared_lib_stripped_symbols/TestSharedLibStrippedSymbols.py (1544 of 2134)
PASS: lldb-api :: tools/lldb-server/commandline/TestStubReverseConnect.py (1545 of 2134)
PASS: lldb-unit :: Process/gdb-remote/./ProcessGdbRemoteTests/GDBRemoteCommunicationServerTest.SendErrorResponse_ErrorList (1546 of 2134)
PASS: lldb-unit :: Utility/./UtilityTests/StringListTest.CopyList (1547 of 2134)
PASS: lldb-api :: python_api/sbvalue_const_addrof/TestSBValueConstAddrOf.py (1548 of 2134)
PASS: lldb-api :: commands/expression/import-std-module/weak_ptr/TestWeakPtrFromStdModule.py (1549 of 2134)
PASS: lldb-api :: commands/expression/anonymous-struct/TestCallUserAnonTypedef.py (1550 of 2134)
PASS: lldb-shell :: ObjectFile/PECOFF/uuid.yaml (1551 of 2134)
PASS: lldb-unit :: Platform/./LLDBPlatformTests/PlatformDarwinTest.TestParseVersionBuildDir (1552 of 2134)
PASS: lldb-shell :: SymbolFile/NativePDB/global-classes.cpp (1553 of 2134)
PASS: lldb-api :: lang/c/complex/TestComplexC99.py (1554 of 2134)
UNSUPPORTED: lldb-shell :: Expr/TestIRMemoryMapWindows.test (1555 of 2134)
PASS: lldb-shell :: Driver/TestProcessAttach.test (1556 of 2134)
PASS: lldb-unit :: Expression/./ExpressionTests/DiagnosticManagerTest.PutStringSeverities (1557 of 2134)
PASS: lldb-unit :: Utility/./UtilityTests/GeneratorTest.Get (1558 of 2134)
PASS: lldb-unit :: Utility/./UtilityTests/BinaryStreamTest.PutSLEB128MaxValue (1559 of 2134)
PASS: lldb-unit :: ScriptInterpreter/Python/./ScriptInterpreterPythonTests/PythonDataObjectsTest.TestPythonStringToStr (1560 of 2134)
PASS: lldb-unit :: Utility/./UtilityTests/StringExtractorTest.GetHexBytes_OddPair2 (1561 of 2134)
PASS: lldb-api :: functionalities/thread/concurrent_events/TestConcurrentDelaySignalWatch.py (1562 of 2134)
PASS: lldb-unit :: Utility/./UtilityTests/BinaryStreamTest.PutSLEB128TwoBytes (1563 of 2134)
PASS: lldb-unit :: Language/Highlighting/./HighlighterTests/HighlighterTest.ClangCursorPosEndOfLine (1564 of 2134)
PASS: lldb-api :: lang/objc/modules-compile-error/TestModulesCompileError.py (1565 of 2134)
PASS: lldb-api :: python_api/frame/TestFrames.py (1566 of 2134)
PASS: lldb-unit :: Process/gdb-remote/./ProcessGdbRemoteTests/GDBRemoteClientBaseTest.SendContinueDelegateStructuredDataReceipt (1567 of 2134)
PASS: lldb-unit :: Utility/./UtilityTests/RangeTest.ContainsRange (1568 of 2134)
PASS: lldb-api :: lang/cpp/wchar_t/TestCxxWCharT.py (1569 of 2134)
PASS: lldb-unit :: Utility/./UtilityTests/ArchSpecTest.OperatorBool (1570 of 2134)
PASS: lldb-unit :: Process/gdb-remote/./ProcessGdbRemoteTests/GDBRemoteCommunicationClientTest.WriteRegister (1571 of 2134)
PASS: lldb-shell :: SymbolFile/DWARF/dwp.s (1572 of 2134)
PASS: lldb-shell :: SymbolFile/NativePDB/locate-pdb.cpp (1573 of 2134)
PASS: lldb-unit :: ScriptInterpreter/Python/./ScriptInterpreterPythonTests/PythonDataObjectsTest.TestPythonStringToStructuredString (1574 of 2134)
PASS: lldb-unit :: ScriptInterpreter/Python/./ScriptInterpreterPythonTests/PythonDataObjectsTest.TestOwnedReferences (1575 of 2134)
PASS: lldb-shell :: SymbolFile/Breakpad/unwind-via-stack-win.test (1576 of 2134)
PASS: lldb-api :: functionalities/postmortem/mach-core/TestMachCore.py (1577 of 2134)
PASS: lldb-api :: lang/c/const_variables/TestConstVariables.py (1578 of 2134)
PASS: lldb-unit :: Symbol/./SymbolTests/PostfixExpression.ParseOneExpression (1579 of 2134)
PASS: lldb-unit :: Utility/./UtilityTests/BinaryStreamTest.PutULEB128SixBytes (1580 of 2134)
PASS: lldb-api :: macosx/dyld-trie-symbols/TestDyldTrieSymbols.py (1581 of 2134)
PASS: lldb-api :: functionalities/inferior-assert/TestInferiorAssert.py (1582 of 2134)
PASS: lldb-unit :: Utility/./UtilityTests/StringExtractorTest.DecodeHexU8_Underflow2 (1583 of 2134)
PASS: lldb-unit :: UnwindAssembly/x86/./UnwindAssemblyx86Tests/Testx86AssemblyInspectionEngine.Test32BitOnlyInstruction (1584 of 2134)
PASS: lldb-api :: functionalities/unwind/noreturn/TestNoreturnUnwind.py (1585 of 2134)
PASS: lldb-api :: tools/lldb-server/TestGdbRemoteExitCode.py (1586 of 2134)
PASS: lldb-unit :: SymbolFile/NativePDB/./SymbolFileNativePDBTests/PDBFPOProgramToDWARFExpressionTests.InvalidOpBinary (1587 of 2134)
UNSUPPORTED: lldb-shell :: ScriptInterpreter/Lua/quit.test (1588 of 2134)
PASS: lldb-unit :: Utility/./UtilityTests/SharedCluster.ClusterManager (1589 of 2134)
PASS: lldb-unit :: Utility/./UtilityTests/ArgsTest.TestUnknownEscape (1590 of 2134)
PASS: lldb-shell :: ScriptInterpreter/None/none.test (1591 of 2134)
PASS: lldb-api :: functionalities/gdb_remote_client/TestArmRegisterDefinition.py (1592 of 2134)
UNSUPPORTED: lldb-shell :: Register/x86-gp-read.test (1593 of 2134)
PASS: lldb-unit :: Expression/./ExpressionTests/ClangExpressionDeclMapTest.TestUnknownIdentifierLookup (1594 of 2134)
PASS: lldb-unit :: Utility/./UtilityTests/StreamTest.PutBytesAsRawHex8ToLittleEndian (1595 of 2134)
PASS: lldb-api :: commands/expression/result_numbering/TestResultNumbering.py (1596 of 2134)
PASS: lldb-unit :: Utility/./UtilityTests/Predicate.WaitForValueEqualTo (1597 of 2134)
PASS: lldb-unit :: UnwindAssembly/x86/./UnwindAssemblyx86Tests/Testx86AssemblyInspectionEngine.TestSimplei386ugmented (1598 of 2134)
XFAIL: lldb-shell :: Register/x86-64-write.test (1599 of 2134)
PASS: lldb-unit :: Utility/./UtilityTests/RangeDataVector.FindEntryIndexesThatContain_Overlap (1600 of 2134)
PASS: lldb-shell :: Reproducer/Functionalities/TestImageList.test (1601 of 2134)
PASS: lldb-api :: functionalities/inferior-crashing/TestInferiorCrashing.py (1602 of 2134)
PASS: lldb-unit :: Symbol/./SymbolTests/TestTypeSystemClang.TestGetTypeClassTypeOf (1603 of 2134)
PASS: lldb-api :: commands/expression/diagnostics/TestExprDiagnostics.py (1604 of 2134)
PASS: lldb-unit :: Utility/./UtilityTests/StringListTest.JoinSingle (1605 of 2134)
UNSUPPORTED: lldb-shell :: ScriptInterpreter/Lua/io.test (1606 of 2134)
PASS: lldb-api :: python_api/section/TestSectionAPI.py (1607 of 2134)
PASS: lldb-api :: lang/objc/objc-super/TestObjCSuper.py (1608 of 2134)
PASS: lldb-shell :: ObjectFile/wasm/basic.yaml (1609 of 2134)
PASS: lldb-unit :: Utility/./UtilityTests/BinaryStreamTest.PutSLEB128SixBytes (1610 of 2134)
PASS: lldb-unit :: Utility/./UtilityTests/XcodeSDKTest.SDKSupportsModules (1611 of 2134)
PASS: lldb-shell :: SymbolFile/DWARF/DW_AT_low_pc-addrx.s (1612 of 2134)
PASS: lldb-shell :: ObjectFile/ELF/many-sections.s (1613 of 2134)
PASS: lldb-unit :: Host/./HostTests/SocketTest.UDPGetConnectURI (1614 of 2134)
PASS: lldb-api :: functionalities/breakpoint/breakpoint_set_restart/TestBreakpointSetRestart.py (1615 of 2134)
UNSUPPORTED: lldb-api :: functionalities/breakpoint/hardware_breakpoints/hardware_breakpoint_on_multiple_threads/TestHWBreakMultiThread.py (1616 of 2134)
PASS: lldb-api :: commands/expression/unwind_expression/TestUnwindExpression.py (1617 of 2134)
PASS: lldb-unit :: Utility/./UtilityTests/CompletionRequest.Constructor (1618 of 2134)
PASS: lldb-api :: functionalities/data-formatter/data-formatter-synth/TestDataFormatterSynth.py (1619 of 2134)
PASS: lldb-api :: lang/cpp/breakpoint-commands/TestCPPBreakpointCommands.py (1620 of 2134)
PASS: lldb-api :: functionalities/thread/concurrent_events/TestConcurrentSignalBreak.py (1621 of 2134)
PASS: lldb-api :: lang/cpp/thread_local/TestThreadLocal.py (1622 of 2134)
PASS: lldb-unit :: Utility/./UtilityTests/DataExtractorTest.GetFloatUnaligned (1623 of 2134)
UNSUPPORTED: lldb-api :: linux/sepdebugsymlink/TestTargetSymbolsSepDebugSymlink.py (1624 of 2134)
UNSUPPORTED: lldb-shell :: Register/x86-64-zmm-read.test (1625 of 2134)
PASS: lldb-api :: lang/objc/objc-optimized/TestObjcOptimized.py (1626 of 2134)
PASS: lldb-api :: functionalities/data-formatter/data-formatter-stl/libcxx/tuple/TestDataFormatterLibcxxTuple.py (1627 of 2134)
PASS: lldb-api :: python_api/objc_type/TestObjCType.py (1628 of 2134)
PASS: lldb-shell :: Minidump/Windows/Sigsegv/sigsegv.test (1629 of 2134)
PASS: lldb-api :: functionalities/gdb_remote_client/TestStopPCs.py (1630 of 2134)
PASS: lldb-unit :: UnwindAssembly/x86/./UnwindAssemblyx86Tests/Testx86AssemblyInspectionEngine.TestPushRBPWithREX (1631 of 2134)
PASS: lldb-unit :: UnwindAssembly/x86/./UnwindAssemblyx86Tests/Testx86AssemblyInspectionEngine.TestPushEBP (1632 of 2134)
PASS: lldb-api :: commands/expression/codegen-crash-typedefdecl-not-in_declcontext/TestCodegenCrashTypedefDeclNotInDeclContext.py (1633 of 2134)
PASS: lldb-api :: functionalities/breakpoint/objc/TestObjCBreakpoints.py (1634 of 2134)
PASS: lldb-api :: commands/expression/save_jit_objects/TestSaveJITObjects.py (1635 of 2134)
PASS: lldb-shell :: ObjectFile/PECOFF/symbol.yaml (1636 of 2134)
PASS: lldb-api :: functionalities/data-formatter/data-formatter-stl/libstdcpp/unique_ptr/invalid/TestDataFormatterInvalidStdUniquePtr.py (1637 of 2134)
PASS: lldb-api :: macosx/add-dsym/TestAddDsymMidExecutionCommand.py (1638 of 2134)
PASS: lldb-api :: commands/expression/deleting-implicit-copy-constructor/TestDeletingImplicitCopyConstructor.py (1639 of 2134)
UNSUPPORTED: lldb-api :: functionalities/darwin_log/filter/exact_match/message/TestDarwinLogFilterMatchMessage.py (1640 of 2134)
PASS: lldb-shell :: SymbolFile/DWARF/debug-types-missing-signature.test (1641 of 2134)
PASS: lldb-unit :: Utility/./UtilityTests/StringExtractorTest.DecodeHexU8_InvalidHex2 (1642 of 2134)
PASS: lldb-api :: functionalities/inline-stepping/TestInlineStepping.py (1643 of 2134)
PASS: lldb-shell :: Settings/TestStopCommandSourceOnError.test (1644 of 2134)
PASS: lldb-unit :: Host/./HostTests/FileSystemTest.Readable (1645 of 2134)
PASS: lldb-shell :: SymbolFile/DWARF/find-basic-function.cpp (1646 of 2134)
PASS: lldb-unit :: Utility/./UtilityTests/BinaryStreamTest.PutULEB128MaxValue (1647 of 2134)
PASS: lldb-api :: python_api/name_lookup/TestNameLookup.py (1648 of 2134)
UNSUPPORTED: lldb-shell :: SymbolFile/PDB/ast-restore.test (1649 of 2134)
PASS: lldb-api :: lang/cpp/incomplete-types/TestCppIncompleteTypes.py (1650 of 2134)
PASS: lldb-unit :: Utility/./UtilityTests/ScalarTest.RightShiftOperator (1651 of 2134)
PASS: lldb-unit :: Utility/./UtilityTests/LogChannelTest.List (1652 of 2134)
PASS: lldb-api :: lang/cpp/bitfields/TestCppBitfields.py (1653 of 2134)
FAIL: lldb-api :: functionalities/gdb_remote_client/TestGDBRemoteLoad.py (1654 of 2134)
******************** TEST 'lldb-api :: functionalities/gdb_remote_client/TestGDBRemoteLoad.py' FAILED ********************
Script:
--
/usr/local/Frameworks/Python.framework/Versions/3.7/bin/python3.7 /Users/buildslave/jenkins/workspace/lldb-cmake@2/llvm-project/lldb/test/API/dotest.py -s /Users/buildslave/jenkins/workspace/lldb-cmake@2/lldb-build/lldb-test-traces -S nm -u CXXFLAGS -u CFLAGS --codesign-identity - --server /Users/buildslave/jenkins/workspace/lldb-cmake@2/lldb-build/./bin/debugserver --arch x86_64 --build-dir /Users/buildslave/jenkins/workspace/lldb-cmake@2/lldb-build/lldb-test-build.noindex -s=/Users/buildslave/jenkins/workspace/lldb-cmake@2/test/logs -t --env TERM=vt100 --env LLVM_LIBS_DIR=/Users/buildslave/jenkins/workspace/lldb-cmake@2/lldb-build/./lib --arch x86_64 --build-dir /Users/buildslave/jenkins/workspace/lldb-cmake@2/lldb-build/lldb-test-build.noindex --lldb-module-cache-dir /Users/buildslave/jenkins/workspace/lldb-cmake@2/lldb-build/lldb-test-build.noindex/module-cache-lldb/lldb-api --clang-module-cache-dir /Users/buildslave/jenkins/workspace/lldb-cmake@2/lldb-build/lldb-test-build.noindex/module-cache-clang/lldb-api --executable /Users/buildslave/jenkins/workspace/lldb-cmake@2/lldb-build/./bin/lldb --compiler /Users/buildslave/jenkins/workspace/lldb-cmake@2/lldb-build/./bin/clang --dsymutil /Users/buildslave/jenkins/workspace/lldb-cmake@2/lldb-build/./bin/dsymutil --filecheck /Users/buildslave/jenkins/workspace/lldb-cmake@2/lldb-build/./bin/FileCheck --yaml2obj /Users/buildslave/jenkins/workspace/lldb-cmake@2/lldb-build/./bin/yaml2obj --lldb-libs-dir /Users/buildslave/jenkins/workspace/lldb-cmake@2/lldb-build/./lib /Users/buildslave/jenkins/workspace/lldb-cmake@2/llvm-project/lldb/test/API/functionalities/gdb_remote_client -p TestGDBRemoteLoad.py
--
Exit Code: 1

Hide Details

Command Output (stdout): -- lldb version 12.0.99 clang revision badd7264e1500d3bcde5f78090024fe116c4ce29 llvm revision badd7264e1500d3bcde5f78090024fe116c4ce29 libstdcxx tests will not be run because: Don't know how to build with libstdcxx on macosx Skipping following debug info categories: ['dwo']

Hide Details

-- Command Output (stderr): --

Hide Details

Session logs for test failures/errors/unexpected successes will go into directory '/Users/buildslave/jenkins/workspace/lldb-cmake@2/test/logs' Change dir to: /Users/buildslave/jenkins/workspace/lldb-cmake@2/llvm-project/lldb/test/API/functionalities/gdb_remote_client runCmd: settings clear -all output:

Hide Details

runCmd: settings set symbols.enable-external-lookup false output:

Hide Details

runCmd: settings set target.inherit-tcc true output:

Hide Details

runCmd: settings set target.auto-apply-fixits false output:

Hide Details

runCmd: settings set plugin.process.gdb-remote.packet-timeout 60 output:

Hide Details

runCmd: settings set symbols.clang-modules-cache-path "/Users/buildslave/jenkins/workspace/lldb-cmake@2/lldb-build/lldb-test-build.noindex/module-cache-lldb/lldb-api" output:

Hide Details

runCmd: settings set use-color false output:

Hide Details

runCmd: setting set target.prefer-dynamic-value no-dynamic-values output:

Hide Details

FAIL: LLDB (/Users/buildslave/jenkins/workspace/lldb-cmake@2/lldb-build/bin/clang-x86_64) :: test_flash_load (TestGDBRemoteLoad.TestGDBRemoteLoad) <bound method SBProcess.Kill of <lldb.SBProcess; proxy of <Swig Object of type 'lldb::SBProcess *' at 0x113fd84e0> >>: success

Hide Details

runCmd: settings clear -all output:

Hide Details

runCmd: settings set symbols.enable-external-lookup false output:

Hide Details

runCmd: settings set target.inherit-tcc true output:

Hide Details

runCmd: settings set target.auto-apply-fixits false output:

Hide Details

runCmd: settings set plugin.process.gdb-remote.packet-timeout 60 output:

Hide Details

runCmd: settings set symbols.clang-modules-cache-path "/Users/buildslave/jenkins/workspace/lldb-cmake@2/lldb-build/lldb-test-build.noindex/module-cache-lldb/lldb-api" output:

Hide Details

runCmd: settings set use-color false output:

Hide Details

runCmd: setting set target.prefer-dynamic-value no-dynamic-values output:

Hide Details

<bound method SBProcess.Kill of <lldb.SBProcess; proxy of <Swig Object of type 'lldb::SBProcess *' at 0x10cb905a0> >>: success

Hide Details

PASS: LLDB (/Users/buildslave/jenkins/workspace/lldb-cmake@2/lldb-build/bin/clang-x86_64) :: test_module_load_address (TestGDBRemoteLoad.TestGDBRemoteLoad) runCmd: settings clear -all output:

Hide Details

runCmd: settings set symbols.enable-external-lookup false output:

Hide Details

runCmd: settings set target.inherit-tcc true output:

Hide Details

runCmd: settings set target.auto-apply-fixits false output:

Hide Details

runCmd: settings set plugin.process.gdb-remote.packet-timeout 60 output:

Hide Details

runCmd: settings set symbols.clang-modules-cache-path "/Users/buildslave/jenkins/workspace/lldb-cmake@2/lldb-build/lldb-test-build.noindex/module-cache-lldb/lldb-api" output:

Hide Details

runCmd: settings set use-color false output:

Hide Details

runCmd: setting set target.prefer-dynamic-value no-dynamic-values output:

Hide Details

<bound method SBProcess.Kill of <lldb.SBProcess; proxy of <Swig Object of type 'lldb::SBProcess *' at 0x113fd8540> >>: success

Hide Details

PASS: LLDB (/Users/buildslave/jenkins/workspace/lldb-cmake@2/lldb-build/bin/clang-x86_64) :: test_ram_load (TestGDBRemoteLoad.TestGDBRemoteLoad) Restore dir to: /Users/buildslave/jenkins/workspace/lldb-cmake@2/lldb-build/tools/lldb/test ====================================================================== FAIL: test_flash_load (TestGDBRemoteLoad.TestGDBRemoteLoad) Test loading an object file to a target's flash memory ---------------------------------------------------------------------- Traceback (most recent call last): File "/Users/buildslave/jenkins/workspace/lldb-cmake@2/llvm-project/lldb/test/API/functionalities/gdb_remote_client/TestGDBRemoteLoad.py", line 67, in test_flash_load process = self.connect(target) File "/Users/buildslave/jenkins/workspace/lldb-cmake@2/llvm-project/lldb/test/API/functionalities/gdb_remote_client/gdbclientutils.py", line 524, in connect self.assertTrue(error.Success(), error.description) AssertionError: False is not True : failed to get reply to handshake packet Config=x86_64-/Users/buildslave/jenkins/workspace/lldb-cmake@2/lldb-build/bin/clang ---------------------------------------------------------------------- Ran 3 tests in 106.032s

Hide Details

RESULT: FAILED (2 passes, 1 failures, 0 errors, 0 skipped, 0 expected failures, 0 unexpected successes)

Hide Details

--

Hide Details

******************** PASS: lldb-api :: lang/objc/modules-cache/TestClangModulesCache.py (1655 of 2134) PASS: lldb-shell :: Host/TestCustomShell.test (1656 of 2134) PASS: lldb-unit :: Utility/./UtilityTests/DataExtractorTest.GetCStr (1657 of 2134) PASS: lldb-api :: functionalities/data-formatter/ostypeformatting/TestFormattersOsType.py (1658 of 2134) PASS: lldb-api :: lang/cpp/frame-var-anon-unions/TestFrameVariableAnonymousUnions.py (1659 of 2134) PASS: lldb-unit :: Utility/./UtilityTests/StringListTest.InsertStringAtIndexOutOfBounds (1660 of 2134) UNSUPPORTED: lldb-api :: commands/watchpoints/multi_watchpoint_slots/TestWatchpointMultipleSlots.py (1661 of 2134) PASS: lldb-api :: functionalities/postmortem/elf-core/thread_crash/TestLinuxCoreThreads.py (1662 of 2134) PASS: lldb-api :: functionalities/thread/concurrent_events/TestConcurrentSignalNWatchNBreak.py (1663 of 2134) PASS: lldb-api :: functionalities/memory-region/TestMemoryRegion.py (1664 of 2134) PASS: lldb-api :: functionalities/data-formatter/data-formatter-objc/TestDataFormatterObjCNSContainer.py (1665 of 2134) PASS: lldb-unit :: Utility/./UtilityTests/ArchSpecTest.TestParseMachCPUDashSubtypeTripleExtra (1666 of 2134) PASS: lldb-api :: functionalities/data-formatter/data-formatter-advanced/TestDataFormatterAdv.py (1667 of 2134) PASS: lldb-api :: lang/c/function_types/TestFunctionTypes.py (1668 of 2134) PASS: lldb-api :: api/multiple-targets/TestMultipleTargets.py (1669 of 2134) PASS: lldb-api :: commands/watchpoints/watchpoint_disable/TestWatchpointDisable.py (1670 of 2134) PASS: lldb-api :: functionalities/data-formatter/data-formatter-skip-summary/TestDataFormatterSkipSummary.py (1671 of 2134) PASS: lldb-api :: lang/objc/exceptions/TestObjCExceptions.py (1672 of 2134) PASS: lldb-unit :: Utility/./UtilityTests/ArgsTest.TestSingleArg (1673 of 2134) PASS: lldb-api :: lang/objc/objc-baseclass-sbtype/TestObjCBaseClassSBType.py (1674 of 2134) PASS: lldb-unit :: Utility/./UtilityTests/PassiveReplayTest.InstrumentedBarRef (1675 of 2134) PASS: lldb-shell :: SymbolFile/symbol-binding.test (1676 of 2134) PASS: lldb-api :: lang/objc/conflicting-definition/TestConflictingDefinition.py (1677 of 2134) PASS: lldb-api :: functionalities/data-formatter/nssetsynth/TestNSSetSynthetic.py (1678 of 2134) PASS: lldb-api :: functionalities/data-formatter/data-formatter-objc/TestDataFormatterObjNSException.py (1679 of 2134) PASS: lldb-shell :: ObjectFile/PECOFF/disassemble-thumb.yaml (1680 of 2134) PASS: lldb-api :: functionalities/thread/concurrent_events/TestConcurrentWatchBreak.py (1681 of 2134) PASS: lldb-api :: lang/objc/direct-dispatch-step/TestObjCDirectDispatchStepping.py (1682 of 2134) PASS: lldb-shell :: SymbolFile/DWARF/clang-ast-from-dwarf-objc-property.m (1683 of 2134) PASS: lldb-unit :: Host/./HostTests/Host.GetEnvironment (1684 of 2134) PASS: lldb-api :: lang/c/shared_lib/TestSharedLib.py (1685 of 2134) PASS: lldb-unit :: Utility/./UtilityTests/DataExtractorTest.GetSLEB128_bit63 (1686 of 2134) PASS: lldb-api :: functionalities/data-formatter/poarray/TestPrintObjectArray.py (1687 of 2134) PASS: lldb-shell :: ObjectFile/MachO/lc_build_version.yaml (1688 of 2134) PASS: lldb-api :: functionalities/mtc/simple/TestMTCSimple.py (1689 of 2134) UNSUPPORTED: lldb-api :: functionalities/longjmp/TestLongjmp.py (1690 of 2134) PASS: lldb-unit :: Utility/./UtilityTests/BinaryStreamTest.PutULEB128Zero (1691 of 2134) PASS: lldb-unit :: Utility/./UtilityTests/StreamTest.AddressEmptyPrefix (1692 of 2134) PASS: lldb-shell :: Quit/TestQuitExitCodeTooManyArgs.test (1693 of 2134) PASS: lldb-unit :: Utility/./UtilityTests/StringExtractorTest.GetNameColonValueNoColon (1694 of 2134) UNSUPPORTED: lldb-shell :: SymbolFile/PDB/typedefs.test (1695 of 2134) PASS: lldb-api :: functionalities/data-formatter/varscript_formatting/TestDataFormatterVarScriptFormatting.py (1696 of 2134) PASS: lldb-unit :: UnwindAssembly/x86/./UnwindAssemblyx86Tests/Testx86AssemblyInspectionEngine.TestPush0 (1697 of 2134) PASS: lldb-api :: functionalities/postmortem/netbsd-core/TestNetBSDCore.py (1698 of 2134) PASS: lldb-unit :: Utility/./UtilityTests/StreamTest.AddressRangeInvalidRange (1699 of 2134) PASS: lldb-api :: lang/cpp/static_methods/TestCPPStaticMethods.py (1700 of 2134) PASS: lldb-shell :: Reproducer/TestSynchronous.test (1701 of 2134) UNSUPPORTED: lldb-shell :: SymbolFile/NativePDB/local-variables.cpp (1702 of 2134) PASS: lldb-unit :: Utility/./UtilityTests/CompletionRequest.TestCompletionOwnership (1703 of 2134) UNSUPPORTED: lldb-shell :: ObjectFile/ELF/minidebuginfo-set-and-hit-breakpoint.test (1704 of 2134) PASS: lldb-api :: functionalities/data-formatter/data-formatter-stl/libcxx/variant/TestDataFormatterLibcxxVariant.py (1705 of 2134) PASS: lldb-unit :: Utility/./UtilityTests/ReproducerTest.SetCapture (1706 of 2134) PASS: lldb-api :: functionalities/data-formatter/data-formatter-stl/libcxx/function/TestLibCxxFunction.py (1707 of 2134) PASS: lldb-unit :: Utility/./UtilityTests/UriParserTest.SchemeHostSeparator3 (1708 of 2134) PASS: lldb-api :: functionalities/data-formatter/data-formatter-stl/libcxx/list/loop/TestDataFormatterLibcxxListLoop.py (1709 of 2134) PASS: lldb-unit :: Core/./LLDBCoreTests/ModuleSpecTest.InvalidInMemoryBuffer (1710 of 2134) PASS: lldb-api :: functionalities/thread/step_out/TestThreadStepOut.py (1711 of 2134) PASS: lldb-api :: commands/expression/ir-interpreter/TestIRInterpreter.py (1712 of 2134) PASS: lldb-api :: commands/target/dump-symtab-demangle/TestDumpSymtabDemangle.py (1713 of 2134) PASS: lldb-unit :: Process/gdb-remote/./ProcessGdbRemoteTests/GDBRemoteClientBaseTest.SendContinueAndWait (1714 of 2134) PASS: lldb-unit :: Utility/./UtilityTests/RangeTest.LessThanInvalid (1715 of 2134) PASS: lldb-api :: lang/cpp/class_static/TestStaticVariables.py (1716 of 2134) PASS: lldb-unit :: Utility/./UtilityTests/StructuredDataTest.StringDump (1717 of 2134) PASS: lldb-unit :: Utility/./UtilityTests/VMRange.Reset (1718 of 2134) PASS: lldb-api :: functionalities/pre_run_dylibs/TestPreRunDylibs.py (1719 of 2134) PASS: lldb-api :: lang/cpp/exceptions/TestCPPExceptionBreakpoints.py (1720 of 2134) PASS: lldb-api :: functionalities/data-formatter/summary-string-onfail/Test-rdar-9974002.py (1721 of 2134) PASS: lldb-api :: functionalities/thread/concurrent_events/TestConcurrentWatchpointWithDelayWatchpointThreads.py (1722 of 2134) PASS: lldb-unit :: UnwindAssembly/PPC64/./PPC64InstEmulationTests/TestPPC64InstEmulation.TestSimpleFunction (1723 of 2134) PASS: lldb-api :: commands/platform/process/list/TestProcessList.py (1724 of 2134) PASS: lldb-api :: commands/expression/function_template_specialization_temp_args/TestFunctionTemplateSpecializationTempArgs.py (1725 of 2134) PASS: lldb-shell :: SymbolFile/DWARF/find-function-regex.cpp (1726 of 2134) PASS: lldb-api :: commands/expression/radar_8638051/Test8638051.py (1727 of 2134) UNSUPPORTED: lldb-shell :: Register/x86-zmm-write.test (1728 of 2134) PASS: lldb-api :: arm/emulation/TestEmulations.py (1729 of 2134) PASS: lldb-unit :: SymbolFile/NativePDB/./SymbolFileNativePDBTests/PDBFPOProgramToDWARFExpressionTests.InvalidOpUnary (1730 of 2134) UNSUPPORTED: lldb-shell :: ScriptInterpreter/Lua/command_script_import.test (1731 of 2134) PASS: lldb-unit :: Host/./HostTests/File.GetWaitableHandleFileno (1732 of 2134) PASS: lldb-shell :: Settings/TestSettingsSet.test (1733 of 2134) PASS: lldb-api :: commands/platform/basic/TestPlatformCommand.py (1734 of 2134) PASS: lldb-unit :: UnwindAssembly/ARM64/./Arm64InstEmulationTests/TestArm64InstEmulation.TestCFARegisterTrackedAcrossJumps (1735 of 2134) PASS: lldb-unit :: Target/./TargetTests/MCBasedABI.MapRegisterName (1736 of 2134) PASS: lldb-unit :: Utility/./UtilityTests/ConstStringTest.YAML (1737 of 2134) PASS: lldb-unit :: Utility/./UtilityTests/VMRange.ContainsRange (1738 of 2134) PASS: lldb-unit :: Utility/./UtilityTests/RangeTest.Union (1739 of 2134) PASS: lldb-unit :: Utility/./UtilityTests/StreamTeeTest.Constructor1Stream (1740 of 2134) PASS: lldb-unit :: Process/gdb-remote/./ProcessGdbRemoteTests/GDBRemoteClientBaseTest.SendContinueAndLateInterrupt (1741 of 2134) PASS: lldb-api :: functionalities/data-formatter/builtin-formats/TestBuiltinFormats.py (1742 of 2134) PASS: lldb-unit :: Utility/./UtilityTests/ConstStringTest.format_provider (1743 of 2134) PASS: lldb-api :: lang/objc/objc-static-method/TestObjCStaticMethod.py (1744 of 2134) PASS: lldb-unit :: UnwindAssembly/x86/./UnwindAssemblyx86Tests/Testx86AssemblyInspectionEngine.TestPushESI (1745 of 2134) PASS: lldb-api :: lang/cpp/function_refs/TestFunctionRefs.py (1746 of 2134) PASS: lldb-shell :: ObjectFile/ELF/section-overlap.yaml (1747 of 2134) PASS: lldb-unit :: Utility/./UtilityTests/ProcessInfoTest.Constructor (1748 of 2134) PASS: lldb-api :: functionalities/thread/concurrent_events/TestConcurrentSignalWatch.py (1749 of 2134) PASS: lldb-api :: functionalities/history/TestHistoryRecall.py (1750 of 2134) PASS: lldb-api :: functionalities/var_path/TestVarPath.py (1751 of 2134) PASS: lldb-unit :: ScriptInterpreter/Python/./ScriptInterpreterPythonTests/PythonDataObjectsTest.TestPythonBytes (1752 of 2134) PASS: lldb-api :: functionalities/thread/concurrent_events/TestConcurrentSignalDelayBreak.py (1753 of 2134) PASS: lldb-api :: functionalities/object-file/TestImageListMultiArchitecture.py (1754 of 2134) PASS: lldb-api :: functionalities/gdb_remote_client/TestIOSSimulator.py (1755 of 2134) PASS: lldb-api :: lang/cpp/namespace/TestNamespaceLookup.py (1756 of 2134) PASS: lldb-unit :: Utility/./UtilityTests/OptionsWithRawTest.EmptySuffixSingleWhitespace (1757 of 2134) PASS: lldb-unit :: Utility/./UtilityTests/StreamTest.AddressPrefix (1758 of 2134) PASS: lldb-api :: python_api/value/empty_class/TestValueAPIEmptyClass.py (1759 of 2134) PASS: lldb-api :: lang/cpp/nested-class-other-compilation-unit/TestNestedClassWithParentInAnotherCU.py (1760 of 2134) PASS: lldb-unit :: Utility/./UtilityTests/StreamTest.PutHex32ByteOrderLittle (1761 of 2134) PASS: lldb-unit :: Utility/./UtilityTests/RangeTest.NotEqualInvalid (1762 of 2134) PASS: lldb-unit :: Language/Highlighting/./HighlighterTests/HighlighterTest.ClangBraces (1763 of 2134) PASS: lldb-api :: lang/cpp/extern_c/TestExternCSymbols.py (1764 of 2134) UNSUPPORTED: lldb-shell :: SymbolFile/PDB/func-symbols.test (1765 of 2134) PASS: lldb-unit :: Utility/./UtilityTests/UriParserTest.TypicalPortPathIPv4 (1766 of 2134) PASS: lldb-unit :: Utility/./UtilityTests/LogChannelEnabledTest.LogVerboseThread (1767 of 2134) PASS: lldb-shell :: Driver/TestCommands.test (1768 of 2134) PASS: lldb-shell :: ObjectFile/ELF/basic-info.yaml (1769 of 2134) PASS: lldb-unit :: Utility/./UtilityTests/StringLexerTest.Next (1770 of 2134) PASS: lldb-api :: python_api/sbtype_typeclass/TestSBTypeTypeClass.py (1771 of 2134) PASS: lldb-unit :: ScriptInterpreter/Python/./ScriptInterpreterPythonTests/PythonDataObjectsTest.TestExceptions (1772 of 2134) PASS: lldb-api :: python_api/frame/inlines/TestInlinedFrame.py (1773 of 2134) PASS: lldb-unit :: Expression/./ExpressionTests/CppModuleConfigurationTest.IgnoreLibStdCpp (1774 of 2134) PASS: lldb-api :: lang/c/local_types/TestUseClosestType.py (1775 of 2134) PASS: lldb-unit :: Process/minidump/./LLDBMinidumpTests/MinidumpParserTest.GetExceptionStream (1776 of 2134) PASS: lldb-unit :: Process/gdb-remote/./ProcessGdbRemoteTests/GDBRemoteClientBaseTest.SendContinueAndAsyncPacket (1777 of 2134) PASS: lldb-unit :: Expression/./ExpressionTests/CppModuleConfigurationTest.AmbiguousCLib (1778 of 2134) PASS: lldb-api :: python_api/function_symbol/TestSymbolAPI.py (1779 of 2134) PASS: lldb-unit :: Signals/./SignalsTests/UnixSignalsTest.GetFilteredSignals (1780 of 2134) PASS: lldb-unit :: Utility/./UtilityTests/BinaryStreamTest.PutSLEB128FourBytes (1781 of 2134) PASS: lldb-unit :: Utility/./UtilityTests/StringListTest.CopyListSingle (1782 of 2134) PASS: lldb-shell :: SymbolFile/NativePDB/bitfields.cpp (1783 of 2134) PASS: lldb-api :: lang/c/unicode/TestUnicodeSymbols.py (1784 of 2134) PASS: lldb-unit :: tools/lldb-server/tests/./LLDBServerTests/StandardStartupTest.TestStopReplyContainsThreadPcs (1785 of 2134) PASS: lldb-unit :: Process/minidump/./LLDBMinidumpTests/MinidumpParserTest.GetMemoryRegionInfoFromMemory64List (1786 of 2134) PASS: lldb-unit :: Symbol/./SymbolTests/TestTypeSystemClang.TestFunctionTemplateConstruction (1787 of 2134) PASS: lldb-api :: commands/watchpoints/watchpoint_size/TestWatchpointSizes.py (1788 of 2134) PASS: lldb-unit :: Utility/./UtilityTests/UriParserTest.BracketedHostnamePort (1789 of 2134) PASS: lldb-unit :: Utility/./UtilityTests/StringListTest.JoinEmpty (1790 of 2134) PASS: lldb-api :: functionalities/conditional_break/TestConditionalBreak.py (1791 of 2134) PASS: lldb-unit :: Utility/./UtilityTests/StringLexerTest.HasAtLeast (1792 of 2134) PASS: lldb-unit :: UnwindAssembly/x86/./UnwindAssemblyx86Tests/Testx86AssemblyInspectionEngine.TestPushExtended (1793 of 2134) PASS: lldb-shell :: ObjectFile/ELF/gnu-debuglink.yaml (1794 of 2134) PASS: lldb-unit :: UnwindAssembly/x86/./UnwindAssemblyx86Tests/Testx86AssemblyInspectionEngine.Test32bitFramelessBigStackFrame (1795 of 2134) PASS: lldb-api :: functionalities/avoids-fd-leak/TestFdLeak.py (1796 of 2134) PASS: lldb-api :: functionalities/data-formatter/data-formatter-objc/TestDataFormatterObjCNSDate.py (1797 of 2134) PASS: lldb-api :: commands/expression/no-deadlock/TestExprDoesntBlock.py (1798 of 2134) UNSUPPORTED: lldb-shell :: SymbolFile/PDB/class-layout.test (1799 of 2134) PASS: lldb-api :: lang/cpp/dynamic-value/TestCppValueCast.py (1800 of 2134) PASS: lldb-api :: iohandler/resize/TestIOHandlerResize.py (1801 of 2134) PASS: lldb-api :: lang/objc/foundation/TestRuntimeTypes.py (1802 of 2134) UNSUPPORTED: lldb-shell :: SymbolFile/PDB/calling-conventions.test (1803 of 2134) PASS: lldb-api :: python_api/watchpoint/TestWatchpointIgnoreCount.py (1804 of 2134) PASS: lldb-api :: functionalities/gdb_remote_client/TestProcessConnect.py (1805 of 2134) PASS: lldb-api :: functionalities/data-formatter/compactvectors/TestCompactVectors.py (1806 of 2134) PASS: lldb-shell :: SymbolFile/NativePDB/function-types-classes.cpp (1807 of 2134) PASS: lldb-shell :: SymbolFile/DWARF/limit-debug-info.s (1808 of 2134) PASS: lldb-api :: functionalities/thread/exit_during_step/TestExitDuringStep.py (1809 of 2134) UNSUPPORTED: lldb-api :: functionalities/unwind/ehframe/TestEhFrameUnwind.py (1810 of 2134) UNSUPPORTED: lldb-api :: commands/expression/completion-crash-invalid-iterator/TestInvalidIteratorCompletionCrash.py (1811 of 2134) UNSUPPORTED: lldb-api :: functionalities/darwin_log/filter/regex/category/TestDarwinLogFilterRegexCategory.py (1812 of 2134) PASS: lldb-api :: commands/watchpoints/watchpoint_on_vectors/TestValueOfVectorVariable.py (1813 of 2134) PASS: lldb-unit :: Utility/./UtilityTests/ArgsTest.ReplaceArgumentAtIndexEqual (1814 of 2134) PASS: lldb-api :: lang/cpp/alignas_base_class/TestAlignAsBaseClass.py (1815 of 2134) PASS: lldb-unit :: Process/gdb-remote/./ProcessGdbRemoteTests/GDBRemoteCommunicationClientTest.SendGetDataPacket (1816 of 2134) PASS: lldb-api :: commands/frame/diagnose/inheritance/TestDiagnoseInheritance.py (1817 of 2134) PASS: lldb-unit :: Language/Highlighting/./HighlighterTests/HighlighterTest.ClangPPDirectives (1818 of 2134) PASS: lldb-api :: functionalities/pointer_num_children/TestPointerNumChildren.py (1819 of 2134) PASS: lldb-unit :: Utility/./UtilityTests/BinaryStreamTest.PutULEB128TwoBytes (1820 of 2134) PASS: lldb-shell :: Quit/TestQuitExitCode-30.test (1821 of 2134) PASS: lldb-api :: lang/objc/foundation/TestSymbolTable.py (1822 of 2134) PASS: lldb-api :: functionalities/thread/exit_during_break/TestExitDuringBreak.py (1823 of 2134) PASS: lldb-unit :: Utility/./UtilityTests/StreamTeeTest.Assignment (1824 of 2134) PASS: lldb-shell :: SymbolFile/Breakpad/line-table-edgecases.test (1825 of 2134) PASS: lldb-unit :: Utility/./UtilityTests/BinaryStreamTest.PutULEB128FourBytes (1826 of 2134) PASS: lldb-unit :: Platform/Android/./AdbClientTests/AdbClientTest.CreateByDeviceId_ByEnvVar (1827 of 2134) PASS: lldb-unit :: Language/Highlighting/./HighlighterTests/HighlighterTest.ClangTrailingBackslashMissingNewLine (1828 of 2134) PASS: lldb-shell :: SymbolFile/DWARF/debug_loc.s (1829 of 2134) PASS: lldb-unit :: Utility/./UtilityTests/StringListTest.AppendStringStdString (1830 of 2134) PASS: lldb-unit :: Host/./HostTests/SocketTest.TCPGetAddress (1831 of 2134) PASS: lldb-api :: commands/gui/viewlarge/TestGuiViewLarge.py (1832 of 2134) PASS: lldb-api :: python_api/watchpoint/TestWatchpointIter.py (1833 of 2134) PASS: lldb-api :: commands/expression/call-function/TestCallUserDefinedFunction.py (1834 of 2134) PASS: lldb-api :: commands/expression/import-std-module/unique_ptr/TestUniquePtrFromStdModule.py (1835 of 2134) PASS: lldb-api :: functionalities/data-formatter/data-formatter-proper-plurals/TestFormattersOneIsSingular.py (1836 of 2134) PASS: lldb-unit :: Process/gdb-remote/./ProcessGdbRemoteTests/GDBRemoteClientBaseTest.SendContinueAndInterrupt (1837 of 2134) PASS: lldb-unit :: Utility/./UtilityTests/ScalarTest.ExtractBitfield (1838 of 2134) PASS: lldb-api :: lang/c/register_variables/TestRegisterVariables.py (1839 of 2134) PASS: lldb-api :: commands/expression/invalid-args/TestInvalidArgsExpression.py (1840 of 2134) PASS: lldb-unit :: UnwindAssembly/x86/./UnwindAssemblyx86Tests/Testx86AssemblyInspectionEngine.TestReturnDetect (1841 of 2134) PASS: lldb-shell :: ObjectFile/PECOFF/basic-info-arm.yaml (1842 of 2134) PASS: lldb-unit :: Utility/./UtilityTests/StringLexerTest.NextIfList (1843 of 2134) PASS: lldb-unit :: Utility/./UtilityTests/StringExtractorTest.DecodeHexU8_InvalidHex (1844 of 2134) PASS: lldb-unit :: Platform/./LLDBPlatformTests/PlatformDarwinTest.FindComponentInPath (1845 of 2134) PASS: lldb-api :: commands/reproducer/invalid-args/TestInvalidArgsReproducer.py (1846 of 2134) PASS: lldb-api :: lang/objc/forward-decl/TestForwardDecl.py (1847 of 2134) PASS: lldb-unit :: UnwindAssembly/x86/./UnwindAssemblyx86Tests/Testx86AssemblyInspectionEngine.TestPopESI (1848 of 2134) PASS: lldb-unit :: Language/Highlighting/./HighlighterTests/HighlighterTest.ClangPreserveNewLine (1849 of 2134) PASS: lldb-unit :: Utility/./UtilityTests/StringListTest.InsertStringAtIndexMove (1850 of 2134) PASS: lldb-unit :: Utility/./UtilityTests/FileSpecTest.PrependPathComponent (1851 of 2134) PASS: lldb-api :: lang/objc/objc-class-method/TestObjCClassMethod.py (1852 of 2134) PASS: lldb-unit :: Symbol/./SymbolTests/TestTypeSystemClang.TestGetEnumIntegerTypeInvalid (1853 of 2134) PASS: lldb-unit :: Utility/./UtilityTests/GeneratorTest.Create (1854 of 2134) PASS: lldb-unit :: Utility/./UtilityTests/NameMatchesTest.RegularExpression (1855 of 2134) PASS: lldb-api :: functionalities/data-formatter/data-formatter-synthval/TestDataFormatterSynthVal.py (1856 of 2134) PASS: lldb-shell :: Quit/TestQuitExitCode30.test (1857 of 2134) PASS: lldb-shell :: Unwind/trap_frame_sym_ctx.test (1858 of 2134) PASS: lldb-api :: types/TestIntegerTypeExpr.py (1859 of 2134) PASS: lldb-unit :: Utility/./UtilityTests/CompletionRequest.TryCompleteCurrentArgMode (1860 of 2134) PASS: lldb-api :: lang/c/unions/TestUnionMembers.py (1861 of 2134) PASS: lldb-api :: functionalities/breakpoint/comp_dir_symlink/TestCompDirSymLink.py (1862 of 2134) PASS: lldb-unit :: Utility/./UtilityTests/BinaryStreamTest.PutSLEB128EightBytes (1863 of 2134) PASS: lldb-unit :: Utility/./UtilityTests/StringExtractorTest.GetHexBytesAvail_Partial (1864 of 2134) UNSUPPORTED: lldb-api :: benchmarks/expression/TestRepeatedExprs.py (1865 of 2134) PASS: lldb-unit :: Process/minidump/./LLDBMinidumpTests/MinidumpParserTest.GetPid (1866 of 2134) UNSUPPORTED: lldb-api :: commands/watchpoints/variable_out_of_scope/TestWatchedVarHitWhenInScope.py (1867 of 2134) PASS: lldb-unit :: Expression/./ExpressionTests/DiagnosticManagerTest.HasFixits (1868 of 2134) PASS: lldb-unit :: Utility/./UtilityTests/StringListTest.SplitIntoLinesEmpty (1869 of 2134) PASS: lldb-unit :: Core/./LLDBCoreTests/ModuleSpecTest.TestCOFFFile (1870 of 2134) PASS: lldb-unit :: Symbol/./SymbolTests/TestTypeSystemClang.TestGetTypeClassTypeOfExpr (1871 of 2134) PASS: lldb-api :: lang/cpp/const_this/TestConstThis.py (1872 of 2134) PASS: lldb-unit :: Utility/./UtilityTests/SerializationRountripTest.SerializeDeserializePodPointers (1873 of 2134) PASS: lldb-unit :: ObjectFile/PECOFF/./ObjectFilePECOFFTests/PECallFrameInfoTest.Frame_reg_eh (1874 of 2134) PASS: lldb-api :: functionalities/data-formatter/data-formatter-stl/libcxx/multimap/TestDataFormatterLibccMultiMap.py (1875 of 2134) PASS: lldb-unit :: Utility/./UtilityTests/RangeTest.SizeTypes (1876 of 2134) PASS: lldb-api :: python_api/class_members/TestSBTypeClassMembers.py (1877 of 2134) PASS: lldb-unit :: Process/minidump/./LLDBMinidumpTests/RegisterContextMinidump.ConvertMinidumpContext_x86_64 (1878 of 2134) PASS: lldb-unit :: Utility/./UtilityTests/DataExtractorTest.PeekData (1879 of 2134) UNSUPPORTED: lldb-api :: lang/objc/objc-dynamic-value/TestObjCDynamicValue.py (1880 of 2134) PASS: lldb-unit :: Utility/./UtilityTests/StringListTest.ShiftStdString (1881 of 2134) PASS: lldb-unit :: SymbolFile/DWARF/./SymbolFileDWARFTests/SymbolFileDWARFTests.TestAbbrevMissingTerminator (1882 of 2134) PASS: lldb-unit :: Utility/./UtilityTests/StringListTest.SetSize (1883 of 2134) PASS: lldb-api :: macosx/find-app-in-bundle/TestFindAppInBundle.py (1884 of 2134) PASS: lldb-unit :: Symbol/./SymbolTests/LineEntryTest.GetSameLineContiguousAddressRangeNestedInline (1885 of 2134) PASS: lldb-api :: lang/cpp/auto/TestCPPAuto.py (1886 of 2134) PASS: lldb-unit :: Core/./LLDBCoreTests/CommunicationTest.SynchronizeWhileClosing (1887 of 2134) PASS: lldb-unit :: Instruction/./EmulatorTests/TestAArch64Emulator.TestOverflow (1888 of 2134) PASS: lldb-api :: python_api/function_symbol/TestDisasmAPI.py (1889 of 2134) UNSUPPORTED: lldb-shell :: SymbolFile/PDB/expressions.test (1890 of 2134) PASS: lldb-unit :: Process/minidump/./LLDBMinidumpTests/MinidumpParserTest.FindMemoryRange (1891 of 2134) PASS: lldb-unit :: Platform/Android/./AdbClientTests/AdbClientTest.CreateByDeviceId (1892 of 2134) PASS: lldb-api :: commands/breakpoint/command/list/TestBreakpointCommandList.py (1893 of 2134) PASS: lldb-shell :: ObjectFile/ELF/base-address.yaml (1894 of 2134) PASS: lldb-unit :: Utility/./UtilityTests/VMRange.IsValid (1895 of 2134) UNSUPPORTED: lldb-api :: commands/register/register/intel_xtended_registers/mpx_bound_violation/TestBoundViolation.py (1896 of 2134) PASS: lldb-unit :: Platform/./LLDBPlatformTests/PlatformAppleSimulatorTest.TestHostPlatformToSim (1897 of 2134) PASS: lldb-api :: functionalities/data-formatter/data-formatter-objc/TestDataFormatterObjCNSData.py (1898 of 2134) UNSUPPORTED: lldb-api :: tools/lldb-server/TestGdbRemoteCompletion.py (1899 of 2134) PASS: lldb-unit :: Language/Highlighting/./HighlighterTests/HighlighterTest.ClangScalarLiterals (1900 of 2134) PASS: lldb-shell :: ObjectFile/PECOFF/dep-modules.yaml (1901 of 2134) PASS: lldb-api :: functionalities/data-formatter/array_typedef/TestArrayTypedef.py (1902 of 2134) UNSUPPORTED: lldb-shell :: Register/aarch64-fp-read.test (1903 of 2134) PASS: lldb-api :: commands/process/attach-resume/TestAttachResume.py (1904 of 2134) PASS: lldb-unit :: DataFormatter/./LLDBFormatterTests/TypeMatcherTests.RegexMatchPart (1905 of 2134) UNSUPPORTED: lldb-api :: linux/add-symbols/TestTargetSymbolsAddCommand.py (1906 of 2134) PASS: lldb-unit :: Language/Highlighting/./HighlighterTests/HighlighterTest.ClangStringLiterals (1907 of 2134) PASS: lldb-unit :: Utility/./UtilityTests/ScalarTest.SetValueFromData (1908 of 2134) PASS: lldb-api :: commands/expression/multiline-completion/TestMultilineCompletion.py (1909 of 2134) PASS: lldb-api :: tools/lldb-vscode/attach/TestVSCode_attach.py (1910 of 2134) PASS: lldb-api :: functionalities/data-formatter/data-formatter-stl/libcxx/string/TestDataFormatterLibcxxString.py (1911 of 2134) PASS: lldb-unit :: Symbol/./SymbolTests/TestTypeSystemClang.TestNotDeletingUserCopyCstrDueToMoveCStr (1912 of 2134) PASS: lldb-api :: commands/settings/quoting/TestQuoting.py (1913 of 2134) PASS: lldb-api :: commands/expression/import-std-module/list-dbg-info-content/TestDbgInfoContentListFromStdModule.py (1914 of 2134) PASS: lldb-unit :: Utility/./UtilityTests/ScalarTest.Division (1915 of 2134) PASS: lldb-api :: tools/lldb-server/TestGdbRemoteThreadsInStopReply.py (1916 of 2134) UNSUPPORTED: lldb-api :: tools/lldb-server/TestGdbRemote_vContThreads.py (1917 of 2134) PASS: lldb-unit :: SymbolFile/DWARF/./SymbolFileDWARFTests/SymbolFileDWARFTests.TestAbbrevOutOfOrder (1918 of 2134) PASS: lldb-unit :: UnwindAssembly/ARM64/./Arm64InstEmulationTests/TestArm64InstEmulation.TestRegisterDoubleSpills (1919 of 2134) PASS: lldb-api :: functionalities/data-formatter/boolreference/TestFormattersBoolRefPtr.py (1920 of 2134) PASS: lldb-unit :: Language/Highlighting/./HighlighterTests/HighlighterTest.ClangUnterminatedString (1921 of 2134) PASS: lldb-unit :: Utility/./UtilityTests/PassiveReplayTest.InstrumentedBar (1922 of 2134) PASS: lldb-shell :: ObjectFile/MachO/lc_version_min.yaml (1923 of 2134) PASS: lldb-unit :: Utility/./UtilityTests/FileSpecTest.GetPath (1924 of 2134) PASS: lldb-api :: python_api/value/TestValueAPI.py (1925 of 2134) XFAIL: lldb-shell :: Register/x86-mm-xmm-read.test (1926 of 2134) PASS: lldb-unit :: Process/minidump/./LLDBMinidumpTests/MinidumpParserTest.GetLinuxProcStatus_no_stream (1927 of 2134) PASS: lldb-unit :: Process/gdb-remote/./ProcessGdbRemoteTests/GDBRemoteCommunicationClientTest.SaveRestoreRegistersNoSuffix (1928 of 2134) PASS: lldb-api :: functionalities/thread/thread_specific_break/TestThreadSpecificBreakpoint.py (1929 of 2134) PASS: lldb-api :: functionalities/thread/backtrace_limit/TestBacktraceLimit.py (1930 of 2134) PASS: lldb-shell :: SymbolFile/Breakpad/symtab-macho.test (1931 of 2134) PASS: lldb-shell :: Breakpoint/debug_rnglistx_rlex.test (1932 of 2134) PASS: lldb-api :: functionalities/data-formatter/data-formatter-python-synth/TestDataFormatterPythonSynth.py (1933 of 2134) PASS: lldb-api :: commands/add-dsym/uuid/TestAddDsymCommand.py (1934 of 2134) PASS: lldb-api :: commands/expression/weak_symbols/TestWeakSymbols.py (1935 of 2134) PASS: lldb-unit :: Utility/./UtilityTests/BinaryStreamTest.PutULEB128FiveBytes (1936 of 2134) PASS: lldb-unit :: Language/Highlighting/./HighlighterTests/HighlighterTest.FallbackHighlighter (1937 of 2134) UNSUPPORTED: lldb-api :: functionalities/darwin_log/filter/regex/message/TestDarwinLogFilterRegexMessage.py (1938 of 2134) PASS: lldb-unit :: Process/minidump/./LLDBMinidumpTests/MinidumpParserTest.GetArchitecture (1939 of 2134) PASS: lldb-api :: types/TestFloatTypesExpr.py (1940 of 2134) PASS: lldb-api :: commands/expression/dollar-in-variable/TestDollarInVariable.py (1941 of 2134) PASS: lldb-api :: functionalities/data-formatter/data-formatter-smart-array/TestDataFormatterSmartArray.py (1942 of 2134) PASS: lldb-api :: tools/lldb-vscode/breakpoint/TestVSCode_setFunctionBreakpoints.py (1943 of 2134) PASS: lldb-unit :: SymbolFile/DWARF/./SymbolFileDWARFTests/SymbolFileDWARFTests.TestAbbrevOrder1Start5 (1944 of 2134) PASS: lldb-unit :: Utility/./UtilityTests/StringListTest.InsertStringAtIndexEnd (1945 of 2134) PASS: lldb-api :: functionalities/thread/jump/TestThreadJump.py (1946 of 2134) PASS: lldb-unit :: Expression/./ExpressionTests/CppModuleConfigurationTest.LibCppV2 (1947 of 2134) PASS: lldb-api :: python_api/hello_world/TestHelloWorld.py (1948 of 2134) PASS: lldb-api :: lang/cpp/nsimport/TestCppNsImport.py (1949 of 2134) PASS: lldb-unit :: Expression/./ExpressionTests/DiagnosticManagerTest.AppendMessageSubsequentDiags (1950 of 2134) PASS: lldb-api :: functionalities/tail_call_frames/cross_dso/TestCrossDSOTailCalls.py (1951 of 2134) PASS: lldb-shell :: SymbolFile/DWARF/debug_loc_and_loclists.s (1952 of 2134) PASS: lldb-shell :: ObjectFile/ELF/netbsd-exec-8.99.30-amd64.yaml (1953 of 2134) PASS: lldb-api :: lang/c/tls_globals/TestTlsGlobals.py (1954 of 2134) PASS: lldb-unit :: Expression/./ExpressionTests/DiagnosticManagerTest.PutStringMultiple (1955 of 2134) PASS: lldb-api :: functionalities/breakpoint/hardware_breakpoints/require_hw_breakpoints/TestRequireHWBreakpoints.py (1956 of 2134) PASS: lldb-shell :: SymbolFile/DWARF/DW_AT_const_value.s (1957 of 2134) PASS: lldb-unit :: Utility/./UtilityTests/StringExtractorTest.GetNameColonValueNoSemicolon (1958 of 2134) UNSUPPORTED: lldb-shell :: BuildScript/toolchain-clang-cl.test (1959 of 2134) PASS: lldb-unit :: Utility/./UtilityTests/UserIDResolver.GetUserName (1960 of 2134) PASS: lldb-api :: macosx/order/TestOrderFile.py (1961 of 2134) PASS: lldb-shell :: Minidump/Windows/broken-unwind.test (1962 of 2134) PASS: lldb-api :: functionalities/gdb_remote_client/TestNestedRegDefinitions.py (1963 of 2134) PASS: lldb-unit :: Process/gdb-remote/./ProcessGdbRemoteTests/GDBRemoteCommunicationClientTest.ReadRegister (1964 of 2134) PASS: lldb-api :: lang/objc/objc-ivar-stripped/TestObjCIvarStripped.py (1965 of 2134) PASS: lldb-api :: functionalities/data-formatter/format-propagation/TestFormatPropagation.py (1966 of 2134) PASS: lldb-unit :: Expression/./ExpressionTests/ClangHostTest.MacOSX (1967 of 2134) PASS: lldb-unit :: Utility/./UtilityTests/StringExtractorTest.GetHexBytes_Underflow (1968 of 2134) PASS: lldb-unit :: Utility/./UtilityTests/GeneratorTest.YamlMultiProvider (1969 of 2134) PASS: lldb-unit :: UnwindAssembly/x86/./UnwindAssemblyx86Tests/Testx86AssemblyInspectionEngine.TestPopRBX (1970 of 2134) UNSUPPORTED: lldb-api :: functionalities/darwin_log/filter/exact_match/activity-chain/TestDarwinLogFilterMatchActivityChain.py (1971 of 2134) PASS: lldb-shell :: Quit/TestQuitExitCodeHexA.test (1972 of 2134) PASS: lldb-api :: commands/register/register/register_command/TestRegisters.py (1973 of 2134) PASS: lldb-unit :: Process/gdb-remote/./ProcessGdbRemoteTests/GDBRemoteCommunicationClientTest.SyncThreadState (1974 of 2134) PASS: lldb-unit :: Host/./HostTests/NativeProcessProtocolTest.ReadCStringFromMemory (1975 of 2134) PASS: lldb-unit :: Utility/./UtilityTests/ConstStringTest.MangledCounterpart (1976 of 2134) PASS: lldb-shell :: Reproducer/Functionalities/TestStepping.test (1977 of 2134) PASS: lldb-shell :: SymbolFile/NativePDB/globals-fundamental.cpp (1978 of 2134) PASS: lldb-unit :: Utility/./UtilityTests/AnsiTerminal.AtStart (1979 of 2134) PASS: lldb-unit :: Utility/./UtilityTests/AnsiTerminal.Empty (1980 of 2134) PASS: lldb-unit :: Utility/./UtilityTests/StatusTest.ErrorConversion (1981 of 2134) PASS: lldb-unit :: Utility/./UtilityTests/RangeTest.ContainsEndInclusive (1982 of 2134) PASS: lldb-unit :: Utility/./UtilityTests/ArgsTest.TestQuotedUnknownEscape (1983 of 2134) PASS: lldb-unit :: Host/./HostTests/SocketTest.TCPListen0GetPort (1984 of 2134) PASS: lldb-unit :: Process/gdb-remote/./ProcessGdbRemoteTests/GDBRemoteCommunicationClientTest.GetModulesInfoInvalidResponse (1985 of 2134) PASS: lldb-unit :: Expression/./ExpressionTests/CppModuleConfigurationTest.LinuxLocalLibCpp (1986 of 2134) PASS: lldb-unit :: Utility/./UtilityTests/FileSpecTest.Equal (1987 of 2134) PASS: lldb-unit :: Utility/./UtilityTests/FileSpecTest.CopyByAppendingPathComponent (1988 of 2134) PASS: lldb-shell :: Minidump/Windows/find-module.test (1989 of 2134) PASS: lldb-api :: tools/lldb-server/TestGdbRemoteKill.py (1990 of 2134) PASS: lldb-api :: functionalities/gdb_remote_client/TestThreadSelectionBug.py (1991 of 2134) PASS: lldb-unit :: debugserver/./debugserverTests/RNBSocket.LoopBackConnectIPv6 (1992 of 2134) PASS: lldb-api :: functionalities/breakpoint/breakpoint_hit_count/TestBreakpointHitCount.py (1993 of 2134) PASS: lldb-unit :: Symbol/./SymbolTests/TestClangASTImporter.ImportInvalidType (1994 of 2134) PASS: lldb-unit :: Utility/./UtilityTests/StreamTest.PutCharWhitespace (1995 of 2134) UNSUPPORTED: lldb-shell :: Register/x86-64-ymm16-write.test (1996 of 2134) PASS: lldb-api :: functionalities/load_using_paths/TestLoadUsingPaths.py (1997 of 2134) PASS: lldb-api :: functionalities/data-formatter/synthcapping/TestSyntheticCapping.py (1998 of 2134) PASS: lldb-shell :: SymbolFile/DWARF/DW_TAG_variable-DW_AT_const_value.s (1999 of 2134) PASS: lldb-api :: functionalities/process_group/TestChangeProcessGroup.py (2000 of 2134) PASS: lldb-shell :: ObjectFile/ELF/minidebuginfo-corrupt-xz.yaml (2001 of 2134) PASS: lldb-shell :: Commands/command-target-modules-dump-sections.yaml (2002 of 2134) PASS: lldb-shell :: Reproducer/TestDSYM.test (2003 of 2134) PASS: lldb-unit :: Symbol/./SymbolTests/TestTypeSystemClang.TestGetBasicTypeFromName (2004 of 2134) PASS: lldb-unit :: UnwindAssembly/x86/./UnwindAssemblyx86Tests/Testx86AssemblyInspectionEngine.Test64bitFramelessBigStackFrame (2005 of 2134) PASS: lldb-unit :: Host/./HostTests/FileSystemTest.FileAndDirectoryComponents (2006 of 2134) PASS: lldb-api :: commands/frame/recognizer/TestFrameRecognizer.py (2007 of 2134) UNSUPPORTED: lldb-api :: benchmarks/frame_variable/TestFrameVariableResponse.py (2008 of 2134) PASS: lldb-api :: lang/c/bitfields/TestBitfields.py (2009 of 2134) PASS: lldb-unit :: Language/Highlighting/./HighlighterTests/HighlighterTest.DefaultHighlighter (2010 of 2134) PASS: lldb-unit :: Utility/./UtilityTests/ArchSpecTest.TestSetTriple (2011 of 2134) PASS: lldb-unit :: Utility/./UtilityTests/CompletionRequest.FakeLastArg (2012 of 2134) PASS: lldb-unit :: UnwindAssembly/x86/./UnwindAssemblyx86Tests/Testx86AssemblyInspectionEngine.TestPushECX (2013 of 2134) PASS: lldb-shell :: ObjectFile/PECOFF/invalid-export-table.yaml (2014 of 2134) PASS: lldb-shell :: ScriptInterpreter/Python/eof.test (2015 of 2134) PASS: lldb-unit :: Utility/./UtilityTests/StringListTest.ForRangeEmpty (2016 of 2134) PASS: lldb-shell :: SymbolFile/DWARF/find-variable-file.cpp (2017 of 2134) PASS: lldb-unit :: Utility/./UtilityTests/SerializationRountripTest.SerializeDeserializeCString (2018 of 2134) PASS: lldb-unit :: Core/./LLDBCoreTests/RichManglingContextTest.FromCxxMethodName (2019 of 2134) PASS: lldb-api :: commands/expression/persistent_types/TestNestedPersistentTypes.py (2020 of 2134) PASS: lldb-unit :: Utility/./UtilityTests/LogChannelTest.Enable (2021 of 2134) PASS: lldb-unit :: ObjectFile/ELF/./ObjectFileELFTests/ObjectFileELFTest.GetSymtab_NoSymEntryPointArmAddressClass (2022 of 2134) UNSUPPORTED: lldb-api :: functionalities/darwin_log/filter/exact_match/activity/TestDarwinLogFilterMatchActivity.py (2023 of 2134) PASS: lldb-shell :: Heap/heap-cstr.test (2024 of 2134) PASS: lldb-unit :: Utility/./UtilityTests/FileSpecTest.Match (2025 of 2134) UNSUPPORTED: lldb-api :: benchmarks/expression/TestExpressionCmd.py (2026 of 2134) PASS: lldb-api :: functionalities/data-formatter/data-formatter-objc/TestDataFormatterObjCNSError.py (2027 of 2134) UNSUPPORTED: lldb-api :: tools/lldb-server/signal-filtering/TestGdbRemote_QPassSignals.py (2028 of 2134) PASS: lldb-unit :: Target/./TargetTests/PathMappingListTest.AbsoluteTests (2029 of 2134) PASS: lldb-unit :: UnwindAssembly/x86/./UnwindAssemblyx86Tests/Testx86AssemblyInspectionEngine.TestPopR14 (2030 of 2134) PASS: lldb-api :: lang/cpp/diamond/TestDiamond.py (2031 of 2134) PASS: lldb-api :: commands/gui/basic/TestGuiBasic.py (2032 of 2134) PASS: lldb-shell :: SymbolFile/NativePDB/ast-types.cpp (2033 of 2134) UNSUPPORTED: lldb-api :: lang/cpp/function-template-parameter-pack/TestFunctionTemplateParameterPack.py (2034 of 2134) PASS: lldb-unit :: Language/Highlighting/./HighlighterTests/HighlighterTest.ClangCursorPos (2035 of 2134) PASS: lldb-unit :: Process/minidump/./LLDBMinidumpTests/MinidumpParserTest.GetFilteredModuleList (2036 of 2134) PASS: lldb-unit :: Host/./HostTests/NativeProcessProtocolTest.ReadMemoryWithoutTrap (2037 of 2134) PASS: lldb-unit :: ObjectFile/Breakpad/./ObjectFileBreakpadTests/StackCFIRecord.parse (2038 of 2134) PASS: lldb-unit :: Utility/./UtilityTests/TimerTest.CategoryTimes (2039 of 2134) PASS: lldb-api :: source-manager/TestSourceManager.py (2040 of 2134) UNSUPPORTED: lldb-shell :: Register/x86-64-gp-write.test (2041 of 2134) PASS: lldb-api :: python_api/watchpoint/watchlocation/TestTargetWatchAddress.py (2042 of 2134) PASS: lldb-unit :: Host/./HostTests/SocketTest.DomainListenConnectAccept (2043 of 2134) PASS: lldb-api :: api/check_public_api_headers/TestPublicAPIHeaders.py (2044 of 2134) PASS: lldb-unit :: Utility/./UtilityTests/DataExtractorTest.GetCStrUnterminated (2045 of 2134) PASS: lldb-shell :: SymbolFile/DWARF/dwp-debug-types.s (2046 of 2134) PASS: lldb-unit :: Utility/./UtilityTests/ScalarTest.GetValue (2047 of 2134) PASS: lldb-unit :: Symbol/./SymbolTests/TestTypeSystemClang.TestUnifyAccessSpecifiers (2048 of 2134) PASS: lldb-api :: lang/cpp/accelerator-table/TestCPPAccelerator.py (2049 of 2134) PASS: lldb-api :: functionalities/thread/concurrent_events/TestConcurrentCrashWithWatchpoint.py (2050 of 2134) PASS: lldb-shell :: SymbolFile/DWARF/dwp-separate-debug-file.cpp (2051 of 2134) PASS: lldb-shell :: Reproducer/TestVersionCheck.test (2052 of 2134) PASS: lldb-api :: python_api/lldbutil/iter/TestLLDBIterator.py (2053 of 2134) PASS: lldb-shell :: VSCode/TestOptions.test (2054 of 2134) PASS: lldb-unit :: SymbolFile/DWARF/./SymbolFileDWARFTests/DWARFASTParserClangTests.EnsureAllDIEsInDeclContextHaveBeenParsedParsesOnlyMatchingEntries (2055 of 2134) PASS: lldb-api :: macosx/find-dsym/bundle-with-dot-in-filename/TestBundleWithDotInFilename.py (2056 of 2134) PASS: lldb-api :: python_api/sblaunchinfo/TestSBLaunchInfo.py (2057 of 2134) PASS: lldb-api :: lang/objc/objc_direct-methods/TestObjCDirectMethods.py (2058 of 2134) PASS: lldb-api :: lang/objc/modules/TestObjCModules.py (2059 of 2134) UNSUPPORTED: lldb-shell :: Register/arm-gp-read.test (2060 of 2134) PASS: lldb-unit :: Process/minidump/./LLDBMinidumpTests/MinidumpParserTest.GetMiscInfoWindows (2061 of 2134) PASS: lldb-shell :: Breakpoint/debug_rnglist_basic.test (2062 of 2134) PASS: lldb-unit :: Language/Highlighting/./HighlighterTests/HighlighterTest.ClangComments (2063 of 2134) PASS: lldb-shell :: Reproducer/TestDebugSymbols.test (2064 of 2134) PASS: lldb-shell :: Process/UnsupportedLanguage.test (2065 of 2134) PASS: lldb-unit :: Utility/./UtilityTests/StringExtractorTest.GetHexU8_Extra_NoEof (2066 of 2134) PASS: lldb-shell :: SymbolFile/DWARF/find-variable-dwo.cpp (2067 of 2134) PASS: lldb-unit :: Utility/./UtilityTests/NameMatchesTest.Ignore (2068 of 2134) PASS: lldb-unit :: Utility/./UtilityTests/EventTest.DumpEventDataBytes (2069 of 2134) PASS: lldb-api :: lang/cpp/modules-import/TestCXXModulesImport.py (2070 of 2134) PASS: lldb-unit :: Utility/./UtilityTests/StringLexerTest.GetUnlexed (2071 of 2134) PASS: lldb-unit :: Host/./HostTests/FileSystemTest.GetPermissions (2072 of 2134) UNSUPPORTED: lldb-api :: commands/target/auto-install-main-executable/TestAutoInstallMainExecutable.py (2073 of 2134) PASS: lldb-unit :: Target/./TargetTests/ExecutionContextTest.GetByteOrderProcess (2074 of 2134) PASS: lldb-api :: functionalities/data-formatter/data-formatter-stl/libcxx/queue/TestDataFormatterLibcxxQueue.py (2075 of 2134) PASS: lldb-api :: commands/watchpoints/watchpoint_set_command/TestWatchLocationWithWatchSet.py (2076 of 2134) PASS: lldb-unit :: Utility/./UtilityTests/FileSpecTest.GuessPathStyle (2077 of 2134) PASS: lldb-api :: sanity/TestModuleCacheSanity.py (2078 of 2134) PASS: lldb-shell :: SymbolFile/DWARF/DW_OP_piece-smaller-than-struct.s (2079 of 2134) PASS: lldb-unit :: Thread/./ThreadTests/ThreadTest.GetPrivateStopInfo (2080 of 2134) PASS: lldb-unit :: UnwindAssembly/x86/./UnwindAssemblyx86Tests/Testx86AssemblyInspectionEngine.Testi386IgnoredRegisters (2081 of 2134) PASS: lldb-unit :: Expression/./ExpressionTests/DiagnosticManagerTest.GetStringMultiline (2082 of 2134) PASS: lldb-api :: functionalities/breakpoint/breakpoint_names/TestBreakpointNames.py (2083 of 2134) PASS: lldb-api :: python_api/debugger/TestDebuggerAPI.py (2084 of 2134) PASS: lldb-unit :: ScriptInterpreter/Python/./ScriptInterpreterPythonTests/PythonDataObjectsTest.TestPythonIntegerToStr (2085 of 2134) PASS: lldb-unit :: Process/./ProcessEventDataTests/ProcessEventDataTest.DoOnRemoval (2086 of 2134) PASS: lldb-unit :: Utility/./UtilityTests/LogTest.Register (2087 of 2134) PASS: lldb-shell :: ObjectFile/ELF/PT_LOAD-empty.yaml (2088 of 2134) PASS: lldb-unit :: Utility/./UtilityTests/EnvironmentTest.EnvpConversion (2089 of 2134) PASS: lldb-unit :: Utility/./UtilityTests/BinaryStreamTest.PutSLEB128OneByte (2090 of 2134) PASS: lldb-api :: functionalities/data-formatter/data-formatter-stl/libcxx/multiset/TestDataFormatterLibcxxMultiSet.py (2091 of 2134) PASS: lldb-unit :: Symbol/./SymbolTests/TestTypeSystemClang.TestRecordHasFields (2092 of 2134) PASS: lldb-api :: tools/lldb-server/TestGdbRemoteExpeditedRegisters.py (2093 of 2134) PASS: lldb-shell :: Driver/TestPositionalArgs.test (2094 of 2134) PASS: lldb-unit :: Utility/./UtilityTests/ProcessInstanceInfo.Dump (2095 of 2134) PASS: lldb-api :: functionalities/postmortem/minidump/TestMiniDump.py (2096 of 2134) PASS: lldb-unit :: Utility/./UtilityTests/PassiveReplayTest.InstrumentedFoo (2097 of 2134) PASS: lldb-shell :: Minidump/memory-region.yaml (2098 of 2134) PASS: lldb-unit :: Disassembler/./DisassemblerTests/TestArmv7Disassembly.TestCortexFPDisass (2099 of 2134) PASS: lldb-shell :: Unwind/thread-step-out-ret-addr-check.test (2100 of 2134) PASS: lldb-shell :: SymbolFile/DWARF/dir-separator-no-comp-dir.s (2101 of 2134) PASS: lldb-unit :: Process/minidump/./LLDBMinidumpTests/MinidumpParserTest.GetThreadsAndGetThreadContext (2102 of 2134) PASS: lldb-api :: functionalities/postmortem/elf-core/TestLinuxCore.py (2103 of 2134) PASS: lldb-unit :: Utility/./UtilityTests/FileSpecTest.EqualDotsPosix (2104 of 2134) PASS: lldb-api :: lang/objc/foundation/TestObjCMethodsNSError.py (2105 of 2134) UNSUPPORTED: lldb-api :: functionalities/breakpoint/breakpoint_in_delayslot/TestAvoidBreakpointInDelaySlot.py (2106 of 2134) PASS: lldb-unit :: Utility/./UtilityTests/StreamTest.AddressPrefixAndSuffix (2107 of 2134) PASS: lldb-api :: functionalities/postmortem/minidump-new/TestMiniDumpUUID.py (2108 of 2134) PASS: lldb-unit :: Utility/./UtilityTests/StreamTest.AddressRangeEmptyRange (2109 of 2134) PASS: lldb-api :: lang/cpp/char8_t/TestCxxChar8_t.py (2110 of 2134) PASS: lldb-api :: python_api/watchpoint/condition/TestWatchpointConditionAPI.py (2111 of 2134) PASS: lldb-unit :: ObjectFile/PECOFF/./ObjectFilePECOFFTests/PECallFrameInfoTest.Chained_eh (2112 of 2134) PASS: lldb-unit :: Expression/./ExpressionTests/CppModuleConfigurationTest.MissingLibCpp (2113 of 2134) PASS: lldb-unit :: Utility/./UtilityTests/DataExtractorTest.GetMaxU64_unchecked (2114 of 2134) PASS: lldb-api :: tools/lldb-server/inferior-crash/TestGdbRemoteAbort.py (2115 of 2134) PASS: lldb-shell :: SymbolFile/Breakpad/line-table-discontinuous-file-ids.test (2116 of 2134) PASS: lldb-unit :: UnwindAssembly/x86/./UnwindAssemblyx86Tests/Testx86AssemblyInspectionEngine.TestPushR13 (2117 of 2134) PASS: lldb-unit :: Utility/./UtilityTests/ProcessInstanceInfoMatch.Name (2118 of 2134) PASS: lldb-unit :: Utility/./UtilityTests/RangeTest.Equal (2119 of 2134) PASS: lldb-shell :: Commands/command-source.test (2120 of 2134) PASS: lldb-unit :: UnwindAssembly/x86/./UnwindAssemblyx86Tests/Testx86AssemblyInspectionEngine.TestMovRSPtoRBP (2121 of 2134) PASS: lldb-unit :: Platform/./LLDBPlatformTests/PlatformAppleSimulatorTest.TestSimHasSimEnvionament (2122 of 2134) PASS: lldb-api :: commands/expression/completion/TestExprCompletion.py (2123 of 2134) PASS: lldb-unit :: Utility/./UtilityTests/RangeTest.Constructor (2124 of 2134) PASS: lldb-unit :: Process/gdb-remote/./ProcessGdbRemoteTests/GDBRemoteCommunicationServerTest.SendErrorResponse_Status (2125 of 2134) PASS: lldb-api :: commands/expression/import_base_class_when_class_has_derived_member/TestImportBaseClassWhenClassHasDerivedMember.py (2126 of 2134) PASS: lldb-unit :: Expression/./ExpressionTests/ClangHostTest.ComputeClangResourceDirectory (2127 of 2134) PASS: lldb-unit :: Expression/./ExpressionTests/CppModuleConfigurationTest.UnknownLibCppFile (2128 of 2134) PASS: lldb-api :: lang/cpp/offsetof/TestOffsetofCpp.py (2129 of 2134) PASS: lldb-api :: lang/c/forward/TestForwardDeclaration.py (2130 of 2134) PASS: lldb-unit :: Utility/./UtilityTests/ArgsTest.DoubleQuotedItem (2131 of 2134) PASS: lldb-api :: commands/expression/import-std-module/forward_list-dbg-info-content/TestDbgInfoContentForwardListFromStdModule.py (2132 of 2134) PASS: lldb-api :: commands/expression/expr-in-syscall/TestExpressionInSyscall.py (2133 of 2134) PASS: lldb-api :: macosx/simulator/TestSimulatorPlatform.py (2134 of 2134) Slowest Tests: -------------------------------------------------------------------------- 411.58s: lldb-api :: macosx/simulator/TestSimulatorPlatform.py 211.94s: lldb-api :: lang/objc/foundation/TestObjCMethodsNSError.py 136.23s: lldb-api :: lang/cpp/char8_t/TestCxxChar8_t.py 115.35s: lldb-api :: functionalities/gdb_remote_client/TestGDBRemoteLoad.py 112.46s: lldb-api :: functionalities/postmortem/elf-core/TestLinuxCore.py 108.87s: lldb-api :: functionalities/postmortem/mach-core/TestMachCore.py 100.23s: lldb-api :: tools/lldb-server/TestLldbGdbServer.py 67.53s: lldb-api :: functionalities/postmortem/minidump-new/TestMiniDumpUUID.py 61.03s: lldb-api :: lang/objc/objc_direct-methods/TestObjCDirectMethods.py 59.53s: lldb-api :: lang/objc/modules/TestObjCModules.py 59.22s: lldb-api :: lang/objc/hidden-ivars/TestHiddenIvars.py 57.59s: lldb-api :: lang/objc/exceptions/TestObjCExceptions.py 57.04s: lldb-api :: lang/cpp/enum_types/TestCPP11EnumTypes.py 56.02s: lldb-api :: functionalities/postmortem/minidump/TestMiniDump.py 53.92s: lldb-api :: functionalities/gdb_remote_client/TestArmRegisterDefinition.py 51.81s: lldb-api :: lang/objc/foundation/TestFoundationDisassembly.py 51.61s: lldb-shell :: SymbolFile/NativePDB/locate-pdb.cpp 49.47s: lldb-api :: lang/objc/foundation/TestObjCMethods.py 47.60s: lldb-api :: lang/cpp/namespace/TestNamespaceLookup.py 47.42s: lldb-api :: functionalities/mtc/simple/TestMTCSimple.py

Hide Details

Tests Times: -------------------------------------------------------------------------- [ Range ] :: [ Percentage ] :: [ Count ] -------------------------------------------------------------------------- [400s,420s) :: [ ] :: [ 1/2134] [380s,400s) :: [ ] :: [ 0/2134] [360s,380s) :: [ ] :: [ 0/2134] [340s,360s) :: [ ] :: [ 0/2134] [320s,340s) :: [ ] :: [ 0/2134] [300s,320s) :: [ ] :: [ 0/2134] [280s,300s) :: [ ] :: [ 0/2134] [260s,280s) :: [ ] :: [ 0/2134] [240s,260s) :: [ ] :: [ 0/2134] [220s,240s) :: [ ] :: [ 0/2134] [200s,220s) :: [ ] :: [ 1/2134] [180s,200s) :: [ ] :: [ 0/2134] [160s,180s) :: [ ] :: [ 0/2134] [140s,160s) :: [ ] :: [ 0/2134] [120s,140s) :: [ ] :: [ 1/2134] [100s,120s) :: [ ] :: [ 4/2134] [ 80s,100s) :: [ ] :: [ 0/2134] [ 60s, 80s) :: [ ] :: [ 4/2134] [ 40s, 60s) :: [ ] :: [ 18/2134] [ 20s, 40s) :: [ ] :: [ 40/2134] [ 0s, 20s) :: [************************************** ] :: [2065/2134] -------------------------------------------------------------------------- ******************** Failed Tests (1): lldb-api :: functionalities/gdb_remote_client/TestGDBRemoteLoad.py

Hide Details

Hide Details

Testing Time: 2025.49s Unsupported : 150 Passed : 1977 Expectedly Failed: 6 Failed : 1 FAILED: tools/lldb/test/CMakeFiles/check-lldb-lit cd /Users/buildslave/jenkins/workspace/lldb-cmake@2/lldb-build/tools/lldb/test && /usr/local/Frameworks/Python.framework/Versions/3.7/bin/python3.7 /Users/buildslave/jenkins/workspace/lldb-cmake@2/lldb-build/./bin/llvm-lit -v --time-tests --shuffle --xunit-xml-output=/Users/buildslave/jenkins/workspace/lldb-cmake@2/test/results.xml -v -j 4 /Users/buildslave/jenkins/workspace/lldb-cmake@2/lldb-build/tools/lldb/test ninja: build stopped: subcommand failed. Command failed: Command '['/usr/bin/env', 'TERM=vt100', '/usr/local/bin/ninja', '-v', 'check-lldb']' returned non-zero exit status 1 Command: ['/usr/bin/env', 'TERM=vt100', '/usr/local/bin/ninja', '-v', 'check-lldb'] [Pipeline] } [Pipeline] // timeout [Pipeline] } [Pipeline] // stage [Pipeline] stage [Pipeline] { (Declarative: Post Actions) [Pipeline] scanForIssues [Clang (LLVM based)] Sleeping for 5 seconds due to JENKINS-32191... [Clang (LLVM based)] Parsing console log (workspace: '/Users/buildslave/jenkins/workspace/lldb-cmake@2') [Clang (LLVM based)] Successfully parsed console log [Clang (LLVM based)] -> found 13 issues (skipped 12 duplicates) [Clang (LLVM based)] Post processing issues on 'green-dragon-10' with source code encoding 'UTF-8' [Clang (LLVM based)] Creating SCM blamer to obtain author and commit information for affected files [Clang (LLVM based)] Creating SCM miner to obtain statistics for affected repository files [Clang (LLVM based)] Resolving file names for all issues in source directory '/Users/buildslave/jenkins/workspace/lldb-cmake@2' [Clang (LLVM based)] -> resolved paths in source directory (9 found, 0 not found) [Clang (LLVM based)] Resolving module names from module definitions (build.xml, pom.xml, or Manifest.mf files) [Clang (LLVM based)] -> resolved module names for 13 issues [Clang (LLVM based)] Resolving package names (or namespaces) by parsing the affected files [Clang (LLVM based)] -> resolved package names of 9 affected files [Clang (LLVM based)] No filter has been set, publishing all 13 issues [Clang (LLVM based)] Creating fingerprints for all affected code blocks to track issues over different builds [Clang (LLVM based)] -> created fingerprints for 13 issues (skipped 0 issues) [Clang (LLVM based)] Copying affected files to Jenkins' build folder '/Users/Shared/Jenkins/Home/jobs/lldb-cmake/builds/23547/files-with-issues' [Clang (LLVM based)] -> 7 copied, 2 not in workspace, 0 not-found, 0 with I/O error [Pipeline] junit Recording test results [Pipeline] } [Pipeline] // stage [Pipeline] } [Pipeline] // withEnv [Pipeline] } [Pipeline] // node [Pipeline] End of Pipeline ERROR: script returned exit code 1 Finished: FAILURE