FailedConsole Output

Skipping 26,169 KB.. Full Log
_some_image_overridden
    [ 1196]   1196     Trampoline      0x00007fff660e6d5a                    0x0000000000000006 0x00010300 fileno
    [ 1197]   1197     Trampoline      0x00007fff660e6d60                    0x0000000000000006 0x00010300 fls
    [ 1198]   1198     Trampoline      0x00007fff660e6d66                    0x0000000000000006 0x00010300 free
    [ 1199]   1199     Trampoline      0x00007fff660e6d6c                    0x0000000000000006 0x00010300 fstat$INODE64
    [ 1200]   1200     Trampoline      0x00007fff660e6d72                    0x0000000000000006 0x00010300 fsync
    [ 1201]   1201     Trampoline      0x00007fff660e6d78                    0x0000000000000006 0x00010300 getenv
    [ 1202]   1202     Trampoline      0x00007fff660e6d7e                    0x0000000000000006 0x00010300 geteuid
    [ 1203]   1203     Trampoline      0x00007fff660e6d84                    0x0000000000000006 0x00010300 getpid
    [ 1204]   1204     Trampoline      0x00007fff660e6d8a                    0x0000000000000006 0x00010300 getsectiondata
    [ 1205]   1205     Trampoline      0x00007fff660e6d90                    0x0000000000000006 0x00010300 getsegmentdata
    [ 1206]   1206     Trampoline      0x00007fff660e6d96                    0x0000000000000006 0x00010300 issetugid
    [ 1207]   1207     Trampoline      0x00007fff660e6d9c                    0x0000000000000006 0x00010300 lstat$INODE64
    [ 1208]   1208     Trampoline      0x00007fff660e6da2                    0x0000000000000006 0x00010300 mach_error_string
    [ 1209]   1209     Trampoline      0x00007fff660e6da8                    0x0000000000000006 0x00010300 mach_port_deallocate
    [ 1210]   1210   X Undefined       0x0000000000000000                    0x0000000000000000 0x00010300 mach_task_self_
    [ 1211]   1211     Trampoline      0x00007fff660e6dae                    0x0000000000000006 0x00010300 malloc
    [ 1212]   1212     Trampoline      0x00007fff660e6db4                    0x0000000000000006 0x00010300 malloc_default_zone
    [ 1213]   1213     Trampoline      0x00007fff660e6dba                    0x0000000000000006 0x00010300 malloc_size
    [ 1214]   1214     Trampoline      0x00007fff660e6dc0                    0x0000000000000006 0x00010300 malloc_zone_batch_malloc
    [ 1215]   1215     Trampoline      0x00007fff660e6dc6                    0x0000000000000006 0x00010300 malloc_zone_calloc
    [ 1216]   1216     Trampoline      0x00007fff660e6dcc                    0x0000000000000006 0x00010300 malloc_zone_from_ptr
    [ 1217]   1217     Trampoline      0x00007fff660e6dd2                    0x0000000000000006 0x00010300 malloc_zone_malloc
    [ 1218]   1218     Trampoline      0x00007fff660e6dd8                    0x0000000000000006 0x00010300 malloc_zone_memalign
    [ 1219]   1219     Trampoline      0x00007fff660e6dde                    0x0000000000000006 0x00010300 memcmp
    [ 1220]   1220     Trampoline      0x00007fff660e6de4                    0x0000000000000006 0x00010300 memcpy
    [ 1221]   1221     Trampoline      0x00007fff660e6dea                    0x0000000000000006 0x00010300 memmove
    [ 1222]   1222     Trampoline      0x00007fff660e6df0                    0x0000000000000006 0x00010300 memset_pattern16
    [ 1223]   1223     Trampoline      0x00007fff660e6dfc                    0x0000000000000006 0x00010300 open
    [ 1224]   1224     Trampoline      0x00007fff660e6e02                    0x0000000000000006 0x00010300 os_unfair_lock_lock_with_options
    [ 1225]   1225     Trampoline      0x00007fff660e6e08                    0x0000000000000006 0x00010300 os_unfair_lock_unlock
    [ 1226]   1226     Trampoline      0x00007fff660e6e0e                    0x0000000000000006 0x00010300 os_unfair_recursive_lock_lock_with_options
    [ 1227]   1227     Trampoline      0x00007fff660e6e14                    0x0000000000000006 0x00010300 os_unfair_recursive_lock_trylock
    [ 1228]   1228     Trampoline      0x00007fff660e6e1a                    0x0000000000000006 0x00010300 os_unfair_recursive_lock_tryunlock4objc
    [ 1229]   1229     Trampoline      0x00007fff660e6e20                    0x0000000000000006 0x00010300 os_unfair_recursive_lock_unlock
    [ 1230]   1230     Trampoline      0x00007fff660e6e26                    0x0000000000000006 0x00010300 posix_memalign
    [ 1231]   1231     Trampoline      0x00007fff660e6e2c                    0x0000000000000006 0x00010300 pread
    [ 1232]   1232     Trampoline      0x00007fff660e6e32                    0x0000000000000006 0x00010300 pthread_cond_broadcast
    [ 1233]   1233     Trampoline      0x00007fff660e6e38                    0x0000000000000006 0x00010300 pthread_cond_wait
    [ 1234]   1234     Trampoline      0x00007fff660e6e3e                    0x0000000000000006 0x00010300 pthread_getname_np
    [ 1235]   1235     Trampoline      0x00007fff660e6e44                    0x0000000000000006 0x00010300 pthread_getspecific
    [ 1236]   1236     Trampoline      0x00007fff660e6e4a                    0x0000000000000006 0x00010300 pthread_is_threaded_np
    [ 1237]   1237     Trampoline      0x00007fff660e6e50                    0x0000000000000006 0x00010300 pthread_key_init_np
    [ 1238]   1238     Trampoline      0x00007fff660e6e56                    0x0000000000000006 0x00010300 pthread_mach_thread_np
    [ 1239]   1239     Trampoline      0x00007fff660e6e5c                    0x0000000000000006 0x00010300 pthread_mutex_lock
    [ 1240]   1240     Trampoline      0x00007fff660e6e62                    0x0000000000000006 0x00010300 pthread_mutex_unlock
    [ 1241]   1241     Trampoline      0x00007fff660e6e68                    0x0000000000000006 0x00010300 pthread_setspecific
    [ 1242]   1242     Trampoline      0x00007fff660e6e6e                    0x0000000000000006 0x00010300 realloc
    [ 1243]   1243     Trampoline      0x00007fff660e6e74                    0x0000000000000006 0x00010300 reallocf
    [ 1244]   1244     Trampoline      0x00007fff660e6e7a                    0x0000000000000006 0x00010300 snprintf
    [ 1245]   1245     Trampoline      0x00007fff660e6e80                    0x0000000000000006 0x00010300 sprintf
    [ 1246]   1246     Trampoline      0x00007fff660e6e86                    0x0000000000000006 0x00010300 strcat
    [ 1247]   1247     Trampoline      0x00007fff660e6e8c                    0x0000000000000006 0x00010300 strchr
    [ 1248]   1248     Trampoline      0x00007fff660e6e92                    0x0000000000000006 0x00010300 strcmp
    [ 1249]   1249     Trampoline      0x00007fff660e6e98                    0x0000000000000006 0x00010300 strcspn
    [ 1250]   1250     Trampoline      0x00007fff660e6e9e                    0x0000000000000006 0x00010300 strdup
    [ 1251]   1251     Trampoline      0x00007fff660e6ea4                    0x0000000000000006 0x00010300 strlcpy
    [ 1252]   1252     Trampoline      0x00007fff660e6eaa                    0x0000000000000006 0x00010300 strlen
    [ 1253]   1253     Trampoline      0x00007fff660e6eb0                    0x0000000000000006 0x00010300 strncmp
    [ 1254]   1254     Trampoline      0x00007fff660e6eb6                    0x0000000000000006 0x00010300 strncpy
    [ 1255]   1255     Trampoline      0x00007fff660e6ebc                    0x0000000000000006 0x00010300 strstr
    [ 1256]   1256     Trampoline      0x00007fff660e6ec2                    0x0000000000000006 0x00010300 task_restartable_ranges_register
    [ 1257]   1257     Trampoline      0x00007fff660e6ec8                    0x0000000000000006 0x00010300 task_restartable_ranges_synchronize
    [ 1258]   1258     Trampoline      0x00007fff660e6ece                    0x0000000000000006 0x00010300 task_threads
    [ 1259]   1259     Trampoline      0x00007fff660e6ed4                    0x0000000000000006 0x00010300 thread_get_state
    [ 1260]   1260     Trampoline      0x00007fff660e6eda                    0x0000000000000006 0x00010300 unw_get_proc_info
    [ 1261]   1261     Trampoline      0x00007fff660e6ee0                    0x0000000000000006 0x00010300 unw_get_reg
    [ 1262]   1262     Trampoline      0x00007fff660e6ee6                    0x0000000000000006 0x00010300 unw_getcontext
    [ 1263]   1263     Trampoline      0x00007fff660e6eec                    0x0000000000000006 0x00010300 unw_init_local
    [ 1264]   1264     Trampoline      0x00007fff660e6ef2                    0x0000000000000006 0x00010300 unw_step
    [ 1265]   1265     Trampoline      0x00007fff660e6ef8                    0x0000000000000006 0x00010300 vasprintf
    [ 1266]   1266     Trampoline      0x00007fff660e6efe                    0x0000000000000006 0x00010300 vm_allocate
    [ 1267]   1267     Trampoline      0x00007fff660e6f04                    0x0000000000000006 0x00010300 vm_deallocate
    [ 1268]   1268     Trampoline      0x00007fff660e6f0a                    0x0000000000000006 0x00010300 vm_remap
    [ 1269]   1269     Trampoline      0x00007fff660e6f10                    0x0000000000000006 0x00010300 write
    [ 1270]   1270   X Undefined       0x0000000000000000                    0x0000000000000000 0x00010300 dyld_stub_binder
    [ 1271]   1271  S  Trampoline      0x00007fff660e6df6                    0x0000000000000006 0x00000000 objc_release
0x7f92980ab800:   BreakpointList with 0 Breakpoints:
0x7f92980ab860:   BreakpointList with 0 Breakpoints:

Hide Details

Hide Details

Expecting sub string: a.out Matched

Hide Details

Expecting sub string: Target Matched

Hide Details

Expecting sub string: Module Matched

Hide Details

Expecting sub string: Breakpoint Matched

Hide Details

PASS: LLDB (/Users/buildslave/jenkins/workspace/lldb-cmake@2/lldb-build/bin/clang-x86_64) :: test_get_description_gmodules (TestTargetAPI.TargetAPITestCase) runCmd: settings clear -all output:

Hide Details

runCmd: settings set symbols.enable-external-lookup false output:

Hide Details

runCmd: settings set target.inherit-tcc true output:

Hide Details

runCmd: settings set target.auto-apply-fixits false output:

Hide Details

runCmd: settings set plugin.process.gdb-remote.packet-timeout 60 output:

Hide Details

runCmd: settings set symbols.clang-modules-cache-path "/Users/buildslave/jenkins/workspace/lldb-cmake@2/lldb-build/lldb-test-build.noindex/module-cache-lldb/lldb-api" output:

Hide Details

runCmd: settings set use-color false output:

Hide Details

runCmd: setting set target.prefer-dynamic-value no-dynamic-values output:

Hide Details

PASS: LLDB (/Users/buildslave/jenkins/workspace/lldb-cmake@2/lldb-build/bin/clang-x86_64) :: test_get_platform_dsym (TestTargetAPI.TargetAPITestCase) runCmd: settings clear -all output:

Hide Details

runCmd: settings set symbols.enable-external-lookup false output:

Hide Details

runCmd: settings set target.inherit-tcc true output:

Hide Details

runCmd: settings set target.auto-apply-fixits false output:

Hide Details

runCmd: settings set plugin.process.gdb-remote.packet-timeout 60 output:

Hide Details

runCmd: settings set symbols.clang-modules-cache-path "/Users/buildslave/jenkins/workspace/lldb-cmake@2/lldb-build/lldb-test-build.noindex/module-cache-lldb/lldb-api" output:

Hide Details

runCmd: settings set use-color false output:

Hide Details

runCmd: setting set target.prefer-dynamic-value no-dynamic-values output:

Hide Details

PASS: LLDB (/Users/buildslave/jenkins/workspace/lldb-cmake@2/lldb-build/bin/clang-x86_64) :: test_get_platform_dwarf (TestTargetAPI.TargetAPITestCase) UNSUPPORTED: LLDB (/Users/buildslave/jenkins/workspace/lldb-cmake@2/lldb-build/bin/clang-x86_64) :: test_get_platform_dwo (TestTargetAPI.TargetAPITestCase) (test case does not fall in any category of interest for this run) runCmd: settings clear -all output:

Hide Details

runCmd: settings set symbols.enable-external-lookup false output:

Hide Details

runCmd: settings set target.inherit-tcc true output:

Hide Details

runCmd: settings set target.auto-apply-fixits false output:

Hide Details

runCmd: settings set plugin.process.gdb-remote.packet-timeout 60 output:

Hide Details

runCmd: settings set symbols.clang-modules-cache-path "/Users/buildslave/jenkins/workspace/lldb-cmake@2/lldb-build/lldb-test-build.noindex/module-cache-lldb/lldb-api" output:

Hide Details

runCmd: settings set use-color false output:

Hide Details

runCmd: setting set target.prefer-dynamic-value no-dynamic-values output:

Hide Details

PASS: LLDB (/Users/buildslave/jenkins/workspace/lldb-cmake@2/lldb-build/bin/clang-x86_64) :: test_get_platform_gmodules (TestTargetAPI.TargetAPITestCase) runCmd: settings clear -all output:

Hide Details

runCmd: settings set symbols.enable-external-lookup false output:

Hide Details

runCmd: settings set target.inherit-tcc true output:

Hide Details

runCmd: settings set target.auto-apply-fixits false output:

Hide Details

runCmd: settings set plugin.process.gdb-remote.packet-timeout 60 output:

Hide Details

runCmd: settings set symbols.clang-modules-cache-path "/Users/buildslave/jenkins/workspace/lldb-cmake@2/lldb-build/lldb-test-build.noindex/module-cache-lldb/lldb-api" output:

Hide Details

runCmd: settings set use-color false output:

Hide Details

runCmd: setting set target.prefer-dynamic-value no-dynamic-values output:

Hide Details

looking at:

Hide Details

Expecting sub string: a(1) Not matched

Hide Details

FAIL: LLDB (/Users/buildslave/jenkins/workspace/lldb-cmake@2/lldb-build/bin/clang-x86_64) :: test_launch_new_process_and_redirect_stdout (TestTargetAPI.TargetAPITestCase) <bound method SBProcess.Kill of <lldb.SBProcess; proxy of <Swig Object of type 'lldb::SBProcess *' at 0x10d2c65a0> >>: success

Hide Details

runCmd: settings clear -all output:

Hide Details

runCmd: settings set symbols.enable-external-lookup false output:

Hide Details

runCmd: settings set target.inherit-tcc true output:

Hide Details

runCmd: settings set target.auto-apply-fixits false output:

Hide Details

runCmd: settings set plugin.process.gdb-remote.packet-timeout 60 output:

Hide Details

runCmd: settings set symbols.clang-modules-cache-path "/Users/buildslave/jenkins/workspace/lldb-cmake@2/lldb-build/lldb-test-build.noindex/module-cache-lldb/lldb-api" output:

Hide Details

runCmd: settings set use-color false output:

Hide Details

runCmd: setting set target.prefer-dynamic-value no-dynamic-values output:

Hide Details

FAIL: LLDB (/Users/buildslave/jenkins/workspace/lldb-cmake@2/lldb-build/bin/clang-x86_64) :: test_launch_simple (TestTargetAPI.TargetAPITestCase) <bound method SBProcess.Kill of <lldb.SBProcess; proxy of <Swig Object of type 'lldb::SBProcess *' at 0x11470fed0> >>: success

Hide Details

runCmd: settings clear -all output:

Hide Details

runCmd: settings set symbols.enable-external-lookup false output:

Hide Details

runCmd: settings set target.inherit-tcc true output:

Hide Details

runCmd: settings set target.auto-apply-fixits false output:

Hide Details

runCmd: settings set plugin.process.gdb-remote.packet-timeout 60 output:

Hide Details

runCmd: settings set symbols.clang-modules-cache-path "/Users/buildslave/jenkins/workspace/lldb-cmake@2/lldb-build/lldb-test-build.noindex/module-cache-lldb/lldb-api" output:

Hide Details

runCmd: settings set use-color false output:

Hide Details

runCmd: setting set target.prefer-dynamic-value no-dynamic-values output:

Hide Details

<bound method SBProcess.Kill of <lldb.SBProcess; proxy of <Swig Object of type 'lldb::SBProcess *' at 0x10d2c65d0> >>: success

Hide Details

PASS: LLDB (/Users/buildslave/jenkins/workspace/lldb-cmake@2/lldb-build/bin/clang-x86_64) :: test_read_memory_dsym (TestTargetAPI.TargetAPITestCase) runCmd: settings clear -all output:

Hide Details

runCmd: settings set symbols.enable-external-lookup false output:

Hide Details

runCmd: settings set target.inherit-tcc true output:

Hide Details

runCmd: settings set target.auto-apply-fixits false output:

Hide Details

runCmd: settings set plugin.process.gdb-remote.packet-timeout 60 output:

Hide Details

runCmd: settings set symbols.clang-modules-cache-path "/Users/buildslave/jenkins/workspace/lldb-cmake@2/lldb-build/lldb-test-build.noindex/module-cache-lldb/lldb-api" output:

Hide Details

runCmd: settings set use-color false output:

Hide Details

runCmd: setting set target.prefer-dynamic-value no-dynamic-values output:

Hide Details

<bound method SBProcess.Kill of <lldb.SBProcess; proxy of <Swig Object of type 'lldb::SBProcess *' at 0x11470fa80> >>: success

Hide Details

PASS: LLDB (/Users/buildslave/jenkins/workspace/lldb-cmake@2/lldb-build/bin/clang-x86_64) :: test_read_memory_dwarf (TestTargetAPI.TargetAPITestCase) UNSUPPORTED: LLDB (/Users/buildslave/jenkins/workspace/lldb-cmake@2/lldb-build/bin/clang-x86_64) :: test_read_memory_dwo (TestTargetAPI.TargetAPITestCase) (test case does not fall in any category of interest for this run) runCmd: settings clear -all output:

Hide Details

runCmd: settings set symbols.enable-external-lookup false output:

Hide Details

runCmd: settings set target.inherit-tcc true output:

Hide Details

runCmd: settings set target.auto-apply-fixits false output:

Hide Details

runCmd: settings set plugin.process.gdb-remote.packet-timeout 60 output:

Hide Details

runCmd: settings set symbols.clang-modules-cache-path "/Users/buildslave/jenkins/workspace/lldb-cmake@2/lldb-build/lldb-test-build.noindex/module-cache-lldb/lldb-api" output:

Hide Details

runCmd: settings set use-color false output:

Hide Details

runCmd: setting set target.prefer-dynamic-value no-dynamic-values output:

Hide Details

<bound method SBProcess.Kill of <lldb.SBProcess; proxy of <Swig Object of type 'lldb::SBProcess *' at 0x10d2c6060> >>: success

Hide Details

PASS: LLDB (/Users/buildslave/jenkins/workspace/lldb-cmake@2/lldb-build/bin/clang-x86_64) :: test_read_memory_gmodules (TestTargetAPI.TargetAPITestCase) runCmd: settings clear -all output:

Hide Details

runCmd: settings set symbols.enable-external-lookup false output:

Hide Details

runCmd: settings set target.inherit-tcc true output:

Hide Details

runCmd: settings set target.auto-apply-fixits false output:

Hide Details

runCmd: settings set plugin.process.gdb-remote.packet-timeout 60 output:

Hide Details

runCmd: settings set symbols.clang-modules-cache-path "/Users/buildslave/jenkins/workspace/lldb-cmake@2/lldb-build/lldb-test-build.noindex/module-cache-lldb/lldb-api" output:

Hide Details

runCmd: settings set use-color false output:

Hide Details

runCmd: setting set target.prefer-dynamic-value no-dynamic-values output:

Hide Details

PASS: LLDB (/Users/buildslave/jenkins/workspace/lldb-cmake@2/lldb-build/bin/clang-x86_64) :: test_resolve_file_address_dsym (TestTargetAPI.TargetAPITestCase) runCmd: settings clear -all output:

Hide Details

runCmd: settings set symbols.enable-external-lookup false output:

Hide Details

runCmd: settings set target.inherit-tcc true output:

Hide Details

runCmd: settings set target.auto-apply-fixits false output:

Hide Details

runCmd: settings set plugin.process.gdb-remote.packet-timeout 60 output:

Hide Details

runCmd: settings set symbols.clang-modules-cache-path "/Users/buildslave/jenkins/workspace/lldb-cmake@2/lldb-build/lldb-test-build.noindex/module-cache-lldb/lldb-api" output:

Hide Details

runCmd: settings set use-color false output:

Hide Details

runCmd: setting set target.prefer-dynamic-value no-dynamic-values output:

Hide Details

PASS: LLDB (/Users/buildslave/jenkins/workspace/lldb-cmake@2/lldb-build/bin/clang-x86_64) :: test_resolve_file_address_dwarf (TestTargetAPI.TargetAPITestCase) UNSUPPORTED: LLDB (/Users/buildslave/jenkins/workspace/lldb-cmake@2/lldb-build/bin/clang-x86_64) :: test_resolve_file_address_dwo (TestTargetAPI.TargetAPITestCase) (test case does not fall in any category of interest for this run) runCmd: settings clear -all output:

Hide Details

runCmd: settings set symbols.enable-external-lookup false output:

Hide Details

runCmd: settings set target.inherit-tcc true output:

Hide Details

runCmd: settings set target.auto-apply-fixits false output:

Hide Details

runCmd: settings set plugin.process.gdb-remote.packet-timeout 60 output:

Hide Details

runCmd: settings set symbols.clang-modules-cache-path "/Users/buildslave/jenkins/workspace/lldb-cmake@2/lldb-build/lldb-test-build.noindex/module-cache-lldb/lldb-api" output:

Hide Details

runCmd: settings set use-color false output:

Hide Details

runCmd: setting set target.prefer-dynamic-value no-dynamic-values output:

Hide Details

PASS: LLDB (/Users/buildslave/jenkins/workspace/lldb-cmake@2/lldb-build/bin/clang-x86_64) :: test_resolve_file_address_gmodules (TestTargetAPI.TargetAPITestCase) runCmd: settings clear -all output:

Hide Details

runCmd: settings set symbols.enable-external-lookup false output:

Hide Details

runCmd: settings set target.inherit-tcc true output:

Hide Details

runCmd: settings set target.auto-apply-fixits false output:

Hide Details

runCmd: settings set plugin.process.gdb-remote.packet-timeout 60 output:

Hide Details

runCmd: settings set symbols.clang-modules-cache-path "/Users/buildslave/jenkins/workspace/lldb-cmake@2/lldb-build/lldb-test-build.noindex/module-cache-lldb/lldb-api" output:

Hide Details

runCmd: settings set use-color false output:

Hide Details

runCmd: setting set target.prefer-dynamic-value no-dynamic-values output:

Hide Details

breakpoint1: SBBreakpoint: id = 1, file = 'main.c', line = 21, exact_match = 0, locations = 1

Hide Details

breakpoint2: SBBreakpoint: id = 2, file = 'main.c', line = 26, exact_match = 0, locations = 1

Hide Details

address1: a.out`a + 11 at main.c:21:13

Hide Details

address2: a.out`a + 63 at main.c:26:12

Hide Details

context1: Module: file = "/Users/buildslave/jenkins/workspace/lldb-cmake@2/lldb-build/lldb-test-build.noindex/python_api/target/TestTargetAPI.test_resolve_symbol_context_with_address_dsym/a.out", arch = "x86_64" CompileUnit: id = {0x00000000}, file = "/Users/buildslave/jenkins/workspace/lldb-cmake@2/llvm-project/lldb/test/API/python_api/target/main.c", language = "c99" Function: id = {0x7fffffff0000004e}, name = "a", range = [0x0000000100000dd0-0x0000000100000e18) FuncType: id = {0x7fffffff0000004e}, byte-size = 0, decl = main.c:19, compiler_type = "int (int)" Blocks: id = {0x7fffffff0000004e}, range = [0x100000dd0-0x100000e18) LineEntry: [0x0000000100000ddb-0x0000000100000ddf): /Users/buildslave/jenkins/workspace/lldb-cmake@2/llvm-project/lldb/test/API/python_api/target/main.c:21:13, is_start_of_statement = TRUE, is_prologue_end = TRUE Symbol: id = {0x00000005}, range = [0x0000000100000dd0-0x0000000100000e20), name="a"

Hide Details

context2: Module: file = "/Users/buildslave/jenkins/workspace/lldb-cmake@2/lldb-build/lldb-test-build.noindex/python_api/target/TestTargetAPI.test_resolve_symbol_context_with_address_dsym/a.out", arch = "x86_64" CompileUnit: id = {0x00000000}, file = "/Users/buildslave/jenkins/workspace/lldb-cmake@2/llvm-project/lldb/test/API/python_api/target/main.c", language = "c99" Function: id = {0x7fffffff0000004e}, name = "a", range = [0x0000000100000dd0-0x0000000100000e18) FuncType: id = {0x7fffffff0000004e}, byte-size = 0, decl = main.c:19, compiler_type = "int (int)" Blocks: id = {0x7fffffff0000004e}, range = [0x100000dd0-0x100000e18) LineEntry: [0x0000000100000e0f-0x0000000100000e12): /Users/buildslave/jenkins/workspace/lldb-cmake@2/llvm-project/lldb/test/API/python_api/target/main.c:26:12, is_start_of_statement = TRUE Symbol: id = {0x00000005}, range = [0x0000000100000dd0-0x0000000100000e20), name="a"

Hide Details

symbol1: id = {0x00000005}, range = [0x0000000100000dd0-0x0000000100000e20), name="a"

Hide Details

symbol2: id = {0x00000005}, range = [0x0000000100000dd0-0x0000000100000e20), name="a"

Hide Details

<bound method SBProcess.Kill of <lldb.SBProcess; proxy of <Swig Object of type 'lldb::SBProcess *' at 0x10d2c6060> >>: success

Hide Details

PASS: LLDB (/Users/buildslave/jenkins/workspace/lldb-cmake@2/lldb-build/bin/clang-x86_64) :: test_resolve_symbol_context_with_address_dsym (TestTargetAPI.TargetAPITestCase) runCmd: settings clear -all output:

Hide Details

runCmd: settings set symbols.enable-external-lookup false output:

Hide Details

runCmd: settings set target.inherit-tcc true output:

Hide Details

runCmd: settings set target.auto-apply-fixits false output:

Hide Details

runCmd: settings set plugin.process.gdb-remote.packet-timeout 60 output:

Hide Details

runCmd: settings set symbols.clang-modules-cache-path "/Users/buildslave/jenkins/workspace/lldb-cmake@2/lldb-build/lldb-test-build.noindex/module-cache-lldb/lldb-api" output:

Hide Details

runCmd: settings set use-color false output:

Hide Details

runCmd: setting set target.prefer-dynamic-value no-dynamic-values output:

Hide Details

breakpoint1: SBBreakpoint: id = 1, file = 'main.c', line = 21, exact_match = 0, locations = 1

Hide Details

breakpoint2: SBBreakpoint: id = 2, file = 'main.c', line = 26, exact_match = 0, locations = 1

Hide Details

address1: a.out`a + 11 at main.c:21:13

Hide Details

address2: a.out`a + 63 at main.c:26:12

Hide Details

context1: Module: file = "/Users/buildslave/jenkins/workspace/lldb-cmake@2/lldb-build/lldb-test-build.noindex/python_api/target/TestTargetAPI.test_resolve_symbol_context_with_address_dwarf/a.out", arch = "x86_64" CompileUnit: id = {0x00000000}, file = "/Users/buildslave/jenkins/workspace/lldb-cmake@2/llvm-project/lldb/test/API/python_api/target/main.c", language = "unknown" Function: id = {0x10000004e}, name = "a", range = [0x0000000100000dd0-0x0000000100000e18) FuncType: id = {0x10000004e}, byte-size = 0, decl = main.c:19, compiler_type = "int (int)" Blocks: id = {0x10000004e}, range = [0x100000dd0-0x100000e18) LineEntry: [0x0000000100000ddb-0x0000000100000ddf): /Users/buildslave/jenkins/workspace/lldb-cmake@2/llvm-project/lldb/test/API/python_api/target/main.c:21:13, is_start_of_statement = TRUE, is_prologue_end = TRUE Symbol: id = {0x00000005}, range = [0x0000000100000dd0-0x0000000100000e20), name="a"

Hide Details

context2: Module: file = "/Users/buildslave/jenkins/workspace/lldb-cmake@2/lldb-build/lldb-test-build.noindex/python_api/target/TestTargetAPI.test_resolve_symbol_context_with_address_dwarf/a.out", arch = "x86_64" CompileUnit: id = {0x00000000}, file = "/Users/buildslave/jenkins/workspace/lldb-cmake@2/llvm-project/lldb/test/API/python_api/target/main.c", language = "unknown" Function: id = {0x10000004e}, name = "a", range = [0x0000000100000dd0-0x0000000100000e18) FuncType: id = {0x10000004e}, byte-size = 0, decl = main.c:19, compiler_type = "int (int)" Blocks: id = {0x10000004e}, range = [0x100000dd0-0x100000e18) LineEntry: [0x0000000100000e0f-0x0000000100000e12): /Users/buildslave/jenkins/workspace/lldb-cmake@2/llvm-project/lldb/test/API/python_api/target/main.c:26:12, is_start_of_statement = TRUE Symbol: id = {0x00000005}, range = [0x0000000100000dd0-0x0000000100000e20), name="a"

Hide Details

symbol1: id = {0x00000005}, range = [0x0000000100000dd0-0x0000000100000e20), name="a"

Hide Details

symbol2: id = {0x00000005}, range = [0x0000000100000dd0-0x0000000100000e20), name="a"

Hide Details

<bound method SBProcess.Kill of <lldb.SBProcess; proxy of <Swig Object of type 'lldb::SBProcess *' at 0x11470fa80> >>: success

Hide Details

PASS: LLDB (/Users/buildslave/jenkins/workspace/lldb-cmake@2/lldb-build/bin/clang-x86_64) :: test_resolve_symbol_context_with_address_dwarf (TestTargetAPI.TargetAPITestCase) UNSUPPORTED: LLDB (/Users/buildslave/jenkins/workspace/lldb-cmake@2/lldb-build/bin/clang-x86_64) :: test_resolve_symbol_context_with_address_dwo (TestTargetAPI.TargetAPITestCase) (test case does not fall in any category of interest for this run) runCmd: settings clear -all output:

Hide Details

runCmd: settings set symbols.enable-external-lookup false output:

Hide Details

runCmd: settings set target.inherit-tcc true output:

Hide Details

runCmd: settings set target.auto-apply-fixits false output:

Hide Details

runCmd: settings set plugin.process.gdb-remote.packet-timeout 60 output:

Hide Details

runCmd: settings set symbols.clang-modules-cache-path "/Users/buildslave/jenkins/workspace/lldb-cmake@2/lldb-build/lldb-test-build.noindex/module-cache-lldb/lldb-api" output:

Hide Details

runCmd: settings set use-color false output:

Hide Details

runCmd: setting set target.prefer-dynamic-value no-dynamic-values output:

Hide Details

breakpoint1: SBBreakpoint: id = 1, file = 'main.c', line = 21, exact_match = 0, locations = 1

Hide Details

breakpoint2: SBBreakpoint: id = 2, file = 'main.c', line = 26, exact_match = 0, locations = 1

Hide Details

address1: a.out`a + 11 at main.c:21:13

Hide Details

address2: a.out`a + 63 at main.c:26:12

Hide Details

context1: Module: file = "/Users/buildslave/jenkins/workspace/lldb-cmake@2/lldb-build/lldb-test-build.noindex/python_api/target/TestTargetAPI.test_resolve_symbol_context_with_address_gmodules/a.out", arch = "x86_64" CompileUnit: id = {0x00000000}, file = "/Users/buildslave/jenkins/workspace/lldb-cmake@2/llvm-project/lldb/test/API/python_api/target/main.c", language = "unknown" Function: id = {0x100000072}, name = "a", range = [0x0000000100000dd0-0x0000000100000e18) FuncType: id = {0x100000072}, byte-size = 0, decl = main.c:19, compiler_type = "int (int)" Blocks: id = {0x100000072}, range = [0x100000dd0-0x100000e18) LineEntry: [0x0000000100000ddb-0x0000000100000ddf): /Users/buildslave/jenkins/workspace/lldb-cmake@2/llvm-project/lldb/test/API/python_api/target/main.c:21:13, is_start_of_statement = TRUE, is_prologue_end = TRUE Symbol: id = {0x00000005}, range = [0x0000000100000dd0-0x0000000100000e20), name="a"

Hide Details

context2: Module: file = "/Users/buildslave/jenkins/workspace/lldb-cmake@2/lldb-build/lldb-test-build.noindex/python_api/target/TestTargetAPI.test_resolve_symbol_context_with_address_gmodules/a.out", arch = "x86_64" CompileUnit: id = {0x00000000}, file = "/Users/buildslave/jenkins/workspace/lldb-cmake@2/llvm-project/lldb/test/API/python_api/target/main.c", language = "unknown" Function: id = {0x100000072}, name = "a", range = [0x0000000100000dd0-0x0000000100000e18) FuncType: id = {0x100000072}, byte-size = 0, decl = main.c:19, compiler_type = "int (int)" Blocks: id = {0x100000072}, range = [0x100000dd0-0x100000e18) LineEntry: [0x0000000100000e0f-0x0000000100000e12): /Users/buildslave/jenkins/workspace/lldb-cmake@2/llvm-project/lldb/test/API/python_api/target/main.c:26:12, is_start_of_statement = TRUE Symbol: id = {0x00000005}, range = [0x0000000100000dd0-0x0000000100000e20), name="a"

Hide Details

symbol1: id = {0x00000005}, range = [0x0000000100000dd0-0x0000000100000e20), name="a"

Hide Details

symbol2: id = {0x00000005}, range = [0x0000000100000dd0-0x0000000100000e20), name="a"

Hide Details

<bound method SBProcess.Kill of <lldb.SBProcess; proxy of <Swig Object of type 'lldb::SBProcess *' at 0x10d2c65a0> >>: success

Hide Details

PASS: LLDB (/Users/buildslave/jenkins/workspace/lldb-cmake@2/lldb-build/bin/clang-x86_64) :: test_resolve_symbol_context_with_address_gmodules (TestTargetAPI.TargetAPITestCase) Restore dir to: /Users/buildslave/jenkins/workspace/lldb-cmake@2/lldb-build/tools/lldb/test ====================================================================== FAIL: test_launch_new_process_and_redirect_stdout (TestTargetAPI.TargetAPITestCase) Exercise SBTaget.Launch() API with redirected stdout. ---------------------------------------------------------------------- Traceback (most recent call last): File "/Users/buildslave/jenkins/workspace/lldb-cmake@2/llvm-project/lldb/packages/Python/lldbsuite/test/decorators.py", line 134, in wrapper return func(*args, **kwargs) File "/Users/buildslave/jenkins/workspace/lldb-cmake@2/llvm-project/lldb/packages/Python/lldbsuite/test/decorators.py", line 344, in wrapper return func(self, *args, **kwargs) File "/Users/buildslave/jenkins/workspace/lldb-cmake@2/llvm-project/lldb/test/API/python_api/target/TestTargetAPI.py", line 397, in test_launch_new_process_and_redirect_stdout substrs=["a(1)", "b(2)", "a(3)"]) File "/Users/buildslave/jenkins/workspace/lldb-cmake@2/llvm-project/lldb/packages/Python/lldbsuite/test/lldbtest.py", line 2476, in expect if msg else EXP_MSG(str, output, exe)) AssertionError: False is not True : '' does not match expected result, got '' Config=x86_64-/Users/buildslave/jenkins/workspace/lldb-cmake@2/lldb-build/bin/clang ====================================================================== FAIL: test_launch_simple (TestTargetAPI.TargetAPITestCase) ---------------------------------------------------------------------- Traceback (most recent call last): File "/Users/buildslave/jenkins/workspace/lldb-cmake@2/llvm-project/lldb/packages/Python/lldbsuite/test/decorators.py", line 134, in wrapper return func(*args, **kwargs) File "/Users/buildslave/jenkins/workspace/lldb-cmake@2/llvm-project/lldb/packages/Python/lldbsuite/test/decorators.py", line 344, in wrapper return func(self, *args, **kwargs) File "/Users/buildslave/jenkins/workspace/lldb-cmake@2/llvm-project/lldb/test/API/python_api/target/TestTargetAPI.py", line 175, in test_launch_simple self.assertIn('arg: foo', output) AssertionError: 'arg: foo' not found in '' Config=x86_64-/Users/buildslave/jenkins/workspace/lldb-cmake@2/lldb-build/bin/clang ---------------------------------------------------------------------- Ran 42 tests in 209.551s

Hide Details

RESULT: FAILED (30 passes, 2 failures, 0 errors, 10 skipped, 0 expected failures, 0 unexpected successes)

Hide Details

--

Hide Details

******************** PASS: lldb-unit :: Utility/./UtilityTests/VMRange.SetEndAddress (1337 of 2134) PASS: lldb-shell :: Settings/TestFrameFormatMangling.test (1338 of 2134) FAIL: lldb-api :: commands/expression/import-std-module/list/TestListFromStdModule.py (1339 of 2134) ******************** TEST 'lldb-api :: commands/expression/import-std-module/list/TestListFromStdModule.py' FAILED ******************** Script: -- /usr/local/Frameworks/Python.framework/Versions/3.7/bin/python3.7 /Users/buildslave/jenkins/workspace/lldb-cmake@2/llvm-project/lldb/test/API/dotest.py -s /Users/buildslave/jenkins/workspace/lldb-cmake@2/lldb-build/lldb-test-traces -S nm -u CXXFLAGS -u CFLAGS --codesign-identity - --server /Users/buildslave/jenkins/workspace/lldb-cmake@2/lldb-build/./bin/debugserver --arch x86_64 --build-dir /Users/buildslave/jenkins/workspace/lldb-cmake@2/lldb-build/lldb-test-build.noindex -s=/Users/buildslave/jenkins/workspace/lldb-cmake@2/test/logs -t --env TERM=vt100 --env LLVM_LIBS_DIR=/Users/buildslave/jenkins/workspace/lldb-cmake@2/lldb-build/./lib --arch x86_64 --build-dir /Users/buildslave/jenkins/workspace/lldb-cmake@2/lldb-build/lldb-test-build.noindex --lldb-module-cache-dir /Users/buildslave/jenkins/workspace/lldb-cmake@2/lldb-build/lldb-test-build.noindex/module-cache-lldb/lldb-api --clang-module-cache-dir /Users/buildslave/jenkins/workspace/lldb-cmake@2/lldb-build/lldb-test-build.noindex/module-cache-clang/lldb-api --executable /Users/buildslave/jenkins/workspace/lldb-cmake@2/lldb-build/./bin/lldb --compiler /Users/buildslave/jenkins/workspace/lldb-cmake@2/lldb-build/./bin/clang --dsymutil /Users/buildslave/jenkins/workspace/lldb-cmake@2/lldb-build/./bin/dsymutil --filecheck /Users/buildslave/jenkins/workspace/lldb-cmake@2/lldb-build/./bin/FileCheck --yaml2obj /Users/buildslave/jenkins/workspace/lldb-cmake@2/lldb-build/./bin/yaml2obj --lldb-libs-dir /Users/buildslave/jenkins/workspace/lldb-cmake@2/lldb-build/./lib /Users/buildslave/jenkins/workspace/lldb-cmake@2/llvm-project/lldb/test/API/commands/expression/import-std-module/list -p TestListFromStdModule.py -- Exit Code: 1

Hide Details

Command Output (stdout): -- lldb version 12.0.99 clang revision f2284e3405d87143b2478f28b8045bef84953c91 llvm revision f2284e3405d87143b2478f28b8045bef84953c91 libstdcxx tests will not be run because: Don't know how to build with libstdcxx on macosx Skipping following debug info categories: ['dwo']

Hide Details

-- Command Output (stderr): --

Hide Details

Session logs for test failures/errors/unexpected successes will go into directory '/Users/buildslave/jenkins/workspace/lldb-cmake@2/test/logs' Change dir to: /Users/buildslave/jenkins/workspace/lldb-cmake@2/llvm-project/lldb/test/API/commands/expression/import-std-module/list runCmd: settings clear -all output:

Hide Details

runCmd: settings set symbols.enable-external-lookup false output:

Hide Details

runCmd: settings set target.inherit-tcc true output:

Hide Details

runCmd: settings set target.auto-apply-fixits false output:

Hide Details

runCmd: settings set plugin.process.gdb-remote.packet-timeout 60 output:

Hide Details

runCmd: settings set symbols.clang-modules-cache-path "/Users/buildslave/jenkins/workspace/lldb-cmake@2/lldb-build/lldb-test-build.noindex/module-cache-lldb/lldb-api" output:

Hide Details

runCmd: settings set use-color false output:

Hide Details

runCmd: setting set target.prefer-dynamic-value no-dynamic-values output:

Hide Details

FAIL: LLDB (/Users/buildslave/jenkins/workspace/lldb-cmake@2/lldb-build/bin/clang-x86_64) :: test_dsym (TestListFromStdModule.TestBasicList) <bound method SBProcess.Kill of <lldb.SBProcess; proxy of <Swig Object of type 'lldb::SBProcess *' at 0x111e8bcf0> >>: success

Hide Details

runCmd: settings clear -all output:

Hide Details

runCmd: settings set symbols.enable-external-lookup false output:

Hide Details

runCmd: settings set target.inherit-tcc true output:

Hide Details

runCmd: settings set target.auto-apply-fixits false output:

Hide Details

runCmd: settings set plugin.process.gdb-remote.packet-timeout 60 output:

Hide Details

runCmd: settings set symbols.clang-modules-cache-path "/Users/buildslave/jenkins/workspace/lldb-cmake@2/lldb-build/lldb-test-build.noindex/module-cache-lldb/lldb-api" output:

Hide Details

runCmd: settings set use-color false output:

Hide Details

runCmd: setting set target.prefer-dynamic-value no-dynamic-values output:

Hide Details

FAIL: LLDB (/Users/buildslave/jenkins/workspace/lldb-cmake@2/lldb-build/bin/clang-x86_64) :: test_dwarf (TestListFromStdModule.TestBasicList) <bound method SBProcess.Kill of <lldb.SBProcess; proxy of <Swig Object of type 'lldb::SBProcess *' at 0x10a489b70> >>: success

Hide Details

UNSUPPORTED: LLDB (/Users/buildslave/jenkins/workspace/lldb-cmake@2/lldb-build/bin/clang-x86_64) :: test_dwo (TestListFromStdModule.TestBasicList) (test case does not fall in any category of interest for this run) runCmd: settings clear -all output:

Hide Details

runCmd: settings set symbols.enable-external-lookup false output:

Hide Details

runCmd: settings set target.inherit-tcc true output:

Hide Details

runCmd: settings set target.auto-apply-fixits false output:

Hide Details

runCmd: settings set plugin.process.gdb-remote.packet-timeout 60 output:

Hide Details

runCmd: settings set symbols.clang-modules-cache-path "/Users/buildslave/jenkins/workspace/lldb-cmake@2/lldb-build/lldb-test-build.noindex/module-cache-lldb/lldb-api" output:

Hide Details

runCmd: settings set use-color false output:

Hide Details

runCmd: setting set target.prefer-dynamic-value no-dynamic-values output:

Hide Details

runCmd: settings set target.import-std-module true output:

Hide Details

runCmd: expr (size_t)a.size() output: (size_t) $0 = 3

Hide Details

Hide Details

Expecting sub string: (size_t) $0 = 3 Matched

Hide Details

runCmd: expr (int)a.front() output: (int) $1 = 3

Hide Details

Hide Details

Expecting sub string: (int) $1 = 3 Matched

Hide Details

runCmd: expr (int)a.back() output: (int) $2 = 2

Hide Details

Hide Details

Expecting sub string: (int) $2 = 2 Matched

Hide Details

runCmd: expr a.sort() output:

Hide Details

runCmd: expr (int)a.front() output: (int) $3 = 1

Hide Details

Hide Details

Expecting sub string: (int) $3 = 1 Matched

Hide Details

runCmd: expr (int)a.back() output: (int) $4 = 3

Hide Details

Hide Details

Expecting sub string: (int) $4 = 3 Matched

Hide Details

runCmd: expr std::reverse(a.begin(), a.end()) output:

Hide Details

runCmd: expr (int)a.front() output: (int) $5 = 3

Hide Details

Hide Details

Expecting sub string: (int) $5 = 3 Matched

Hide Details

runCmd: expr (int)a.back() output: (int) $6 = 1

Hide Details

Hide Details

Expecting sub string: (int) $6 = 1 Matched

Hide Details

runCmd: expr (int)(*a.begin()) output: (int) $7 = 3

Hide Details

Hide Details

Expecting sub string: (int) $7 = 3 Matched

Hide Details

runCmd: expr (int)(*a.rbegin()) output: (int) $8 = 1

Hide Details

Hide Details

Expecting sub string: (int) $8 = 1 Matched

Hide Details

<bound method SBProcess.Kill of <lldb.SBProcess; proxy of <Swig Object of type 'lldb::SBProcess *' at 0x1118d1420> >>: success

Hide Details

PASS: LLDB (/Users/buildslave/jenkins/workspace/lldb-cmake@2/lldb-build/bin/clang-x86_64) :: test_gmodules (TestListFromStdModule.TestBasicList) Restore dir to: /Users/buildslave/jenkins/workspace/lldb-cmake@2/lldb-build/tools/lldb/test ====================================================================== FAIL: test_dsym (TestListFromStdModule.TestBasicList) ---------------------------------------------------------------------- Traceback (most recent call last): File "/Users/buildslave/jenkins/workspace/lldb-cmake@2/llvm-project/lldb/packages/Python/lldbsuite/test/lldbtest.py", line 1802, in test_method return attrvalue(self) File "/Users/buildslave/jenkins/workspace/lldb-cmake@2/llvm-project/lldb/packages/Python/lldbsuite/test/decorators.py", line 134, in wrapper return func(*args, **kwargs) File "/Users/buildslave/jenkins/workspace/lldb-cmake@2/llvm-project/lldb/test/API/commands/expression/import-std-module/list/TestListFromStdModule.py", line 19, in test "// Set break point at this line.", lldb.SBFileSpec("main.cpp")) File "/Users/buildslave/jenkins/workspace/lldb-cmake@2/llvm-project/lldb/packages/Python/lldbsuite/test/lldbutil.py", line 954, in run_to_source_breakpoint only_one_thread, extra_images) File "/Users/buildslave/jenkins/workspace/lldb-cmake@2/llvm-project/lldb/packages/Python/lldbsuite/test/lldbutil.py", line 873, in run_to_breakpoint_do_run "Process launch failed: %s" % (error.GetCString())) AssertionError: True is not False : Process launch failed: process exited with status -1 (tried to attach to process already being debugged) Config=x86_64-/Users/buildslave/jenkins/workspace/lldb-cmake@2/lldb-build/bin/clang ====================================================================== FAIL: test_dwarf (TestListFromStdModule.TestBasicList) ---------------------------------------------------------------------- Traceback (most recent call last): File "/Users/buildslave/jenkins/workspace/lldb-cmake@2/llvm-project/lldb/packages/Python/lldbsuite/test/lldbtest.py", line 1802, in test_method return attrvalue(self) File "/Users/buildslave/jenkins/workspace/lldb-cmake@2/llvm-project/lldb/packages/Python/lldbsuite/test/decorators.py", line 134, in wrapper return func(*args, **kwargs) File "/Users/buildslave/jenkins/workspace/lldb-cmake@2/llvm-project/lldb/test/API/commands/expression/import-std-module/list/TestListFromStdModule.py", line 19, in test "// Set break point at this line.", lldb.SBFileSpec("main.cpp")) File "/Users/buildslave/jenkins/workspace/lldb-cmake@2/llvm-project/lldb/packages/Python/lldbsuite/test/lldbutil.py", line 954, in run_to_source_breakpoint only_one_thread, extra_images) File "/Users/buildslave/jenkins/workspace/lldb-cmake@2/llvm-project/lldb/packages/Python/lldbsuite/test/lldbutil.py", line 873, in run_to_breakpoint_do_run "Process launch failed: %s" % (error.GetCString())) AssertionError: True is not False : Process launch failed: process exited with status -1 (tried to attach to process already being debugged) Config=x86_64-/Users/buildslave/jenkins/workspace/lldb-cmake@2/lldb-build/bin/clang ---------------------------------------------------------------------- Ran 4 tests in 92.369s

Hide Details

RESULT: FAILED (1 passes, 2 failures, 0 errors, 1 skipped, 0 expected failures, 0 unexpected successes)

Hide Details

--

Hide Details

******************** UNSUPPORTED: lldb-shell :: ScriptInterpreter/Lua/persistent_state.test (1340 of 2134) PASS: lldb-unit :: debugserver/./debugserverTests/RNBSocket.LoopBackListenIPv4 (1341 of 2134) UNSUPPORTED: lldb-shell :: ObjectFile/ELF/minidebuginfo-set-and-hit-breakpoint.test (1342 of 2134) PASS: lldb-shell :: SymbolFile/DWARF/dwarf5-index-is-used.cpp (1343 of 2134) PASS: lldb-shell :: Reproducer/TestDebugSymbols.test (1344 of 2134) PASS: lldb-unit :: Utility/./UtilityTests/SerializationRountripTest.SerializeDeserializeCStringArray (1345 of 2134) PASS: lldb-unit :: Interpreter/./InterpreterTests/CompletionTest.FileCompletionAbsolute (1346 of 2134) PASS: lldb-unit :: Expression/./ExpressionTests/CppModuleConfigurationTest.AmbiguousLibCpp (1347 of 2134) PASS: lldb-api :: lang/cpp/typeof/TestTypeOfDeclTypeExpr.py (1348 of 2134) PASS: lldb-unit :: Language/Highlighting/./HighlighterTests/HighlighterTest.ClangScalarLiterals (1349 of 2134) UNSUPPORTED: lldb-shell :: SymbolFile/PDB/variables.test (1350 of 2134) PASS: lldb-unit :: Utility/./UtilityTests/StringExtractorTest.GetHexBytes (1351 of 2134) PASS: lldb-unit :: Utility/./UtilityTests/OptionsWithRawTest.ArgsButNoLeadingDash (1352 of 2134) PASS: lldb-shell :: Host/TestCustomShell.test (1353 of 2134) PASS: lldb-shell :: Breakpoint/debug_rnglist_basic.test (1354 of 2134) PASS: lldb-unit :: Language/Highlighting/./HighlighterTests/HighlighterTest.ClangTrailingBackslashBeforeNewline (1355 of 2134) PASS: lldb-api :: functionalities/gdb_remote_client/TestGDBRemoteClient.py (1356 of 2134) PASS: lldb-shell :: ObjectFile/Breakpad/sections.test (1357 of 2134) PASS: lldb-unit :: Expression/./ExpressionTests/CppModuleConfigurationTest.IgnoreLibStdCpp (1358 of 2134) PASS: lldb-unit :: Utility/./UtilityTests/XcodeSDKTest.ParseTest (1359 of 2134) PASS: lldb-api :: lang/cpp/class_types/TestClassTypes.py (1360 of 2134) PASS: lldb-unit :: Utility/./UtilityTests/SubsystemRAIITest.NormalSubsystem (1361 of 2134) PASS: lldb-api :: commands/expression/completion/TestExprCompletion.py (1362 of 2134) PASS: lldb-unit :: Utility/./UtilityTests/LogChannelTest.List (1363 of 2134) XFAIL: lldb-shell :: SymbolFile/DWARF/find-type-in-function.cpp (1364 of 2134) PASS: lldb-unit :: Utility/./UtilityTests/StringExtractorTest.GetHexBytes_OddPair2 (1365 of 2134) PASS: lldb-unit :: Host/./HostTests/FileSystemTest.Readable (1366 of 2134) PASS: lldb-api :: functionalities/data-formatter/data-formatter-stl/libcxx/multimap/TestDataFormatterLibccMultiMap.py (1367 of 2134) UNSUPPORTED: lldb-shell :: Register/x86-gp-read.test (1368 of 2134) PASS: lldb-api :: commands/session/save/TestSessionSave.py (1369 of 2134) PASS: lldb-api :: iohandler/autosuggestion/TestAutosuggestion.py (1370 of 2134) PASS: lldb-api :: functionalities/signal/raise/TestRaise.py (1371 of 2134) PASS: lldb-api :: lang/objc/foundation/TestObjCMethodsString.py (1372 of 2134) PASS: lldb-unit :: DataFormatter/./LLDBFormatterTests/StringPrinterTests.CxxASCII (1373 of 2134) FAIL: lldb-api :: macosx/simulator/TestSimulatorPlatform.py (1374 of 2134) ******************** TEST 'lldb-api :: macosx/simulator/TestSimulatorPlatform.py' FAILED ******************** Script: -- /usr/local/Frameworks/Python.framework/Versions/3.7/bin/python3.7 /Users/buildslave/jenkins/workspace/lldb-cmake@2/llvm-project/lldb/test/API/dotest.py -s /Users/buildslave/jenkins/workspace/lldb-cmake@2/lldb-build/lldb-test-traces -S nm -u CXXFLAGS -u CFLAGS --codesign-identity - --server /Users/buildslave/jenkins/workspace/lldb-cmake@2/lldb-build/./bin/debugserver --arch x86_64 --build-dir /Users/buildslave/jenkins/workspace/lldb-cmake@2/lldb-build/lldb-test-build.noindex -s=/Users/buildslave/jenkins/workspace/lldb-cmake@2/test/logs -t --env TERM=vt100 --env LLVM_LIBS_DIR=/Users/buildslave/jenkins/workspace/lldb-cmake@2/lldb-build/./lib --arch x86_64 --build-dir /Users/buildslave/jenkins/workspace/lldb-cmake@2/lldb-build/lldb-test-build.noindex --lldb-module-cache-dir /Users/buildslave/jenkins/workspace/lldb-cmake@2/lldb-build/lldb-test-build.noindex/module-cache-lldb/lldb-api --clang-module-cache-dir /Users/buildslave/jenkins/workspace/lldb-cmake@2/lldb-build/lldb-test-build.noindex/module-cache-clang/lldb-api --executable /Users/buildslave/jenkins/workspace/lldb-cmake@2/lldb-build/./bin/lldb --compiler /Users/buildslave/jenkins/workspace/lldb-cmake@2/lldb-build/./bin/clang --dsymutil /Users/buildslave/jenkins/workspace/lldb-cmake@2/lldb-build/./bin/dsymutil --filecheck /Users/buildslave/jenkins/workspace/lldb-cmake@2/lldb-build/./bin/FileCheck --yaml2obj /Users/buildslave/jenkins/workspace/lldb-cmake@2/lldb-build/./bin/yaml2obj --lldb-libs-dir /Users/buildslave/jenkins/workspace/lldb-cmake@2/lldb-build/./lib /Users/buildslave/jenkins/workspace/lldb-cmake@2/llvm-project/lldb/test/API/macosx/simulator -p TestSimulatorPlatform.py -- Exit Code: 1

Hide Details

Command Output (stdout): -- lldb version 12.0.99 clang revision f2284e3405d87143b2478f28b8045bef84953c91 llvm revision f2284e3405d87143b2478f28b8045bef84953c91 libstdcxx tests will not be run because: Don't know how to build with libstdcxx on macosx Skipping following debug info categories: ['dwo'] ** Simulator is unresponsive. Retrying 2 more time(s)

Hide Details

-- Command Output (stderr): --

Hide Details

Session logs for test failures/errors/unexpected successes will go into directory '/Users/buildslave/jenkins/workspace/lldb-cmake@2/test/logs' Change dir to: /Users/buildslave/jenkins/workspace/lldb-cmake@2/llvm-project/lldb/test/API/macosx/simulator runCmd: settings clear -all output:

Hide Details

runCmd: settings set symbols.enable-external-lookup false output:

Hide Details

runCmd: settings set target.inherit-tcc true output:

Hide Details

runCmd: settings set target.auto-apply-fixits false output:

Hide Details

runCmd: settings set plugin.process.gdb-remote.packet-timeout 60 output:

Hide Details

runCmd: settings set symbols.clang-modules-cache-path "/Users/buildslave/jenkins/workspace/lldb-cmake@2/lldb-build/lldb-test-build.noindex/module-cache-lldb/lldb-api" output:

Hide Details

runCmd: settings set use-color false output:

Hide Details

runCmd: setting set target.prefer-dynamic-value no-dynamic-values output:

Hide Details

runCmd: log enable gdb-remote packets -f /Users/buildslave/jenkins/workspace/lldb-cmake@2/lldb-build/lldb-test-build.noindex/macosx/simulator/TestSimulatorPlatform.test_ios/packets.log output:

Hide Details

runCmd: image list -b -t output: [ 0] a.out x86_64-apple-ios13.5.0-simulator [ 1] dyld x86_64-apple-macosx10.15.0 [ 2] dyld_sim x86_64-apple-ios13.5.0-simulator [ 3] libc++.1.dylib x86_64-apple-ios13.5.0-simulator [ 4] libSystem.B.dylib x86_64-apple-ios13.5.0-simulator [ 5] libc++abi.dylib x86_64-apple-ios13.5.0-simulator [ 6] libcache.dylib x86_64-apple-ios13.5.0-simulator [ 7] libcommonCrypto.dylib x86_64-apple-ios13.5.0-simulator [ 8] libcompiler_rt.dylib x86_64-apple-ios13.5.0-simulator [ 9] libcopyfile.dylib x86_64-apple-ios13.5.0-simulator [ 10] libcorecrypto.dylib x86_64-apple-ios13.5.0-simulator [ 11] libdispatch.dylib x86_64-apple-ios13.5.0-simulator [ 12] libdyld.dylib x86_64-apple-ios13.5.0-simulator [ 13] liblaunch.dylib x86_64-apple-ios13.5.0-simulator [ 14] libmacho.dylib x86_64-apple-ios13.5.0-simulator [ 15] libremovefile.dylib x86_64-apple-ios13.5.0-simulator [ 16] libsystem_asl.dylib x86_64-apple-ios13.5.0-simulator [ 17] libsystem_blocks.dylib x86_64-apple-ios13.5.0-simulator [ 18] libsystem_c.dylib x86_64-apple-ios13.5.0-simulator [ 19] libsystem_configuration.dylib x86_64-apple-ios13.5.0-simulator [ 20] libsystem_containermanager.dylib x86_64-apple-ios13.5.0-simulator [ 21] libsystem_coreservices.dylib x86_64-apple-ios13.5.0-simulator [ 22] libsystem_darwin.dylib x86_64-apple-ios13.5.0-simulator [ 23] libsystem_dnssd.dylib x86_64-apple-ios13.5.0-simulator [ 24] libsystem_featureflags.dylib x86_64-apple-ios13.5.0-simulator [ 25] libsystem_info.dylib x86_64-apple-ios13.5.0-simulator [ 26] libsystem_m.dylib x86_64-apple-ios13.5.0-simulator [ 27] libsystem_malloc.dylib x86_64-apple-ios13.5.0-simulator [ 28] libsystem_notify.dylib x86_64-apple-ios13.5.0-simulator [ 29] libsystem_sandbox.dylib x86_64-apple-ios13.5.0-simulator [ 30] libsystem_sim_kernel.dylib x86_64-apple-ios13.5.0-simulator [ 31] libsystem_sim_platform.dylib x86_64-apple-ios13.5.0-simulator [ 32] libsystem_sim_pthread.dylib x86_64-apple-ios13.5.0-simulator [ 33] libsystem_trace.dylib x86_64-apple-ios13.5.0-simulator [ 34] libunwind.dylib x86_64-apple-ios13.5.0-simulator [ 35] libxpc.dylib x86_64-apple-ios13.5.0-simulator [ 36] libsystem_sim_pthread_host.dylib x86_64-apple-ios13.5.0-simulator [ 37] libsystem_sim_platform_host.dylib x86_64-apple-ios13.5.0-simulator [ 38] libsystem_sim_kernel_host.dylib x86_64-apple-ios13.5.0-simulator [ 39] libsystem_kernel.dylib x86_64-apple-macosx10.15.0-simulator(0x00007fff51b5a000) [ 40] libobjc.A.dylib x86_64-apple-ios13.5.0-simulator [ 41] libsystem_platform.dylib x86_64-apple-macosx10.15.0-simulator(0x00007fff51bfd000) [ 42] libsystem_pthread.dylib x86_64-apple-macosx10.15.0-simulator(0x00007fff51c06000)

Hide Details

Hide Details

Expecting pattern: a\.out x86_64-apple-ios13.5.*-simulator Matched

Hide Details

<bound method SBProcess.Kill of <lldb.SBProcess; proxy of <Swig Object of type 'lldb::SBProcess *' at 0x113a19ea0> >>: success

Hide Details

PASS: LLDB (/Users/buildslave/jenkins/workspace/lldb-cmake@2/lldb-build/bin/clang-x86_64) :: test_ios (TestSimulatorPlatform.TestSimulatorPlatformLaunching) runCmd: settings clear -all output:

Hide Details

runCmd: settings set symbols.enable-external-lookup false output:

Hide Details

runCmd: settings set target.inherit-tcc true output:

Hide Details

runCmd: settings set target.auto-apply-fixits false output:

Hide Details

runCmd: settings set plugin.process.gdb-remote.packet-timeout 60 output:

Hide Details

runCmd: settings set symbols.clang-modules-cache-path "/Users/buildslave/jenkins/workspace/lldb-cmake@2/lldb-build/lldb-test-build.noindex/module-cache-lldb/lldb-api" output:

Hide Details

runCmd: settings set use-color false output:

Hide Details

runCmd: setting set target.prefer-dynamic-value no-dynamic-values output:

Hide Details

UNSUPPORTED: LLDB (/Users/buildslave/jenkins/workspace/lldb-cmake@2/lldb-build/bin/clang-x86_64) :: test_ios_backdeploy_apple_silicon (TestSimulatorPlatform.TestSimulatorPlatformLaunching) (skipping due to the following parameter(s): architecture) runCmd: settings clear -all output:

Hide Details

runCmd: settings set symbols.enable-external-lookup false output:

Hide Details

runCmd: settings set target.inherit-tcc true output:

Hide Details

runCmd: settings set target.auto-apply-fixits false output:

Hide Details

runCmd: settings set plugin.process.gdb-remote.packet-timeout 60 output:

Hide Details

runCmd: settings set symbols.clang-modules-cache-path "/Users/buildslave/jenkins/workspace/lldb-cmake@2/lldb-build/lldb-test-build.noindex/module-cache-lldb/lldb-api" output:

Hide Details

runCmd: settings set use-color false output:

Hide Details

runCmd: setting set target.prefer-dynamic-value no-dynamic-values output:

Hide Details

runCmd: log enable gdb-remote packets -f /Users/buildslave/jenkins/workspace/lldb-cmake@2/lldb-build/lldb-test-build.noindex/macosx/simulator/TestSimulatorPlatform.test_ios_backdeploy_x86/packets.log output:

Hide Details

runCmd: image list -b -t output: [ 0] a.out x86_64-apple-ios13.0.0-simulator [ 1] dyld x86_64-apple-macosx10.15.0 [ 2] dyld_sim x86_64-apple-ios13.5.0-simulator [ 3] libc++.1.dylib x86_64-apple-ios13.5.0-simulator [ 4] libSystem.B.dylib x86_64-apple-ios13.5.0-simulator [ 5] libc++abi.dylib x86_64-apple-ios13.5.0-simulator [ 6] libcache.dylib x86_64-apple-ios13.5.0-simulator [ 7] libcommonCrypto.dylib x86_64-apple-ios13.5.0-simulator [ 8] libcompiler_rt.dylib x86_64-apple-ios13.5.0-simulator [ 9] libcopyfile.dylib x86_64-apple-ios13.5.0-simulator [ 10] libcorecrypto.dylib x86_64-apple-ios13.5.0-simulator [ 11] libdispatch.dylib x86_64-apple-ios13.5.0-simulator [ 12] libdyld.dylib x86_64-apple-ios13.5.0-simulator [ 13] liblaunch.dylib x86_64-apple-ios13.5.0-simulator [ 14] libmacho.dylib x86_64-apple-ios13.5.0-simulator [ 15] libremovefile.dylib x86_64-apple-ios13.5.0-simulator [ 16] libsystem_asl.dylib x86_64-apple-ios13.5.0-simulator [ 17] libsystem_blocks.dylib x86_64-apple-ios13.5.0-simulator [ 18] libsystem_c.dylib x86_64-apple-ios13.5.0-simulator [ 19] libsystem_configuration.dylib x86_64-apple-ios13.5.0-simulator [ 20] libsystem_containermanager.dylib x86_64-apple-ios13.5.0-simulator [ 21] libsystem_coreservices.dylib x86_64-apple-ios13.5.0-simulator [ 22] libsystem_darwin.dylib x86_64-apple-ios13.5.0-simulator [ 23] libsystem_dnssd.dylib x86_64-apple-ios13.5.0-simulator [ 24] libsystem_featureflags.dylib x86_64-apple-ios13.5.0-simulator [ 25] libsystem_info.dylib x86_64-apple-ios13.5.0-simulator [ 26] libsystem_m.dylib x86_64-apple-ios13.5.0-simulator [ 27] libsystem_malloc.dylib x86_64-apple-ios13.5.0-simulator [ 28] libsystem_notify.dylib x86_64-apple-ios13.5.0-simulator [ 29] libsystem_sandbox.dylib x86_64-apple-ios13.5.0-simulator [ 30] libsystem_sim_kernel.dylib x86_64-apple-ios13.5.0-simulator [ 31] libsystem_sim_platform.dylib x86_64-apple-ios13.5.0-simulator [ 32] libsystem_sim_pthread.dylib x86_64-apple-ios13.5.0-simulator [ 33] libsystem_trace.dylib x86_64-apple-ios13.5.0-simulator [ 34] libunwind.dylib x86_64-apple-ios13.5.0-simulator [ 35] libxpc.dylib x86_64-apple-ios13.5.0-simulator [ 36] libsystem_sim_pthread_host.dylib x86_64-apple-ios13.5.0-simulator [ 37] libsystem_sim_platform_host.dylib x86_64-apple-ios13.5.0-simulator [ 38] libsystem_sim_kernel_host.dylib x86_64-apple-ios13.5.0-simulator [ 39] libsystem_kernel.dylib x86_64-apple-macosx10.15.0-simulator(0x00007fff51b5a000) [ 40] libobjc.A.dylib x86_64-apple-ios13.5.0-simulator [ 41] libsystem_platform.dylib x86_64-apple-macosx10.15.0-simulator(0x00007fff51bfd000) [ 42] libsystem_pthread.dylib x86_64-apple-macosx10.15.0-simulator(0x00007fff51c06000)

Hide Details

Hide Details

Expecting pattern: a\.out x86_64-apple-ios13.0.*-simulator Matched

Hide Details

<bound method SBProcess.Kill of <lldb.SBProcess; proxy of <Swig Object of type 'lldb::SBProcess *' at 0x11291bc90> >>: success

Hide Details

PASS: LLDB (/Users/buildslave/jenkins/workspace/lldb-cmake@2/lldb-build/bin/clang-x86_64) :: test_ios_backdeploy_x86 (TestSimulatorPlatform.TestSimulatorPlatformLaunching) runCmd: settings clear -all output:

Hide Details

runCmd: settings set symbols.enable-external-lookup false output:

Hide Details

runCmd: settings set target.inherit-tcc true output:

Hide Details

runCmd: settings set target.auto-apply-fixits false output:

Hide Details

runCmd: settings set plugin.process.gdb-remote.packet-timeout 60 output:

Hide Details

runCmd: settings set symbols.clang-modules-cache-path "/Users/buildslave/jenkins/workspace/lldb-cmake@2/lldb-build/lldb-test-build.noindex/module-cache-lldb/lldb-api" output:

Hide Details

runCmd: settings set use-color false output:

Hide Details

runCmd: setting set target.prefer-dynamic-value no-dynamic-values output:

Hide Details

runCmd: log enable gdb-remote packets -f /Users/buildslave/jenkins/workspace/lldb-cmake@2/lldb-build/lldb-test-build.noindex/macosx/simulator/TestSimulatorPlatform.test_lc_version_min_iphoneos/packets.log output:

Hide Details

runCmd: image list -b -t output: [ 0] a.out x86_64-apple-ios11.0.0-simulator [ 1] dyld x86_64-apple-macosx10.15.0 [ 2] dyld_sim x86_64-apple-ios13.5.0-simulator [ 3] libc++.1.dylib x86_64-apple-ios13.5.0-simulator [ 4] libSystem.B.dylib x86_64-apple-ios13.5.0-simulator [ 5] libc++abi.dylib x86_64-apple-ios13.5.0-simulator [ 6] libcache.dylib x86_64-apple-ios13.5.0-simulator [ 7] libcommonCrypto.dylib x86_64-apple-ios13.5.0-simulator [ 8] libcompiler_rt.dylib x86_64-apple-ios13.5.0-simulator [ 9] libcopyfile.dylib x86_64-apple-ios13.5.0-simulator [ 10] libcorecrypto.dylib x86_64-apple-ios13.5.0-simulator [ 11] libdispatch.dylib x86_64-apple-ios13.5.0-simulator [ 12] libdyld.dylib x86_64-apple-ios13.5.0-simulator [ 13] liblaunch.dylib x86_64-apple-ios13.5.0-simulator [ 14] libmacho.dylib x86_64-apple-ios13.5.0-simulator [ 15] libremovefile.dylib x86_64-apple-ios13.5.0-simulator [ 16] libsystem_asl.dylib x86_64-apple-ios13.5.0-simulator [ 17] libsystem_blocks.dylib x86_64-apple-ios13.5.0-simulator [ 18] libsystem_c.dylib x86_64-apple-ios13.5.0-simulator [ 19] libsystem_configuration.dylib x86_64-apple-ios13.5.0-simulator [ 20] libsystem_containermanager.dylib x86_64-apple-ios13.5.0-simulator [ 21] libsystem_coreservices.dylib x86_64-apple-ios13.5.0-simulator [ 22] libsystem_darwin.dylib x86_64-apple-ios13.5.0-simulator [ 23] libsystem_dnssd.dylib x86_64-apple-ios13.5.0-simulator [ 24] libsystem_featureflags.dylib x86_64-apple-ios13.5.0-simulator [ 25] libsystem_info.dylib x86_64-apple-ios13.5.0-simulator [ 26] libsystem_m.dylib x86_64-apple-ios13.5.0-simulator [ 27] libsystem_malloc.dylib x86_64-apple-ios13.5.0-simulator [ 28] libsystem_notify.dylib x86_64-apple-ios13.5.0-simulator [ 29] libsystem_sandbox.dylib x86_64-apple-ios13.5.0-simulator [ 30] libsystem_sim_kernel.dylib x86_64-apple-ios13.5.0-simulator [ 31] libsystem_sim_platform.dylib x86_64-apple-ios13.5.0-simulator [ 32] libsystem_sim_pthread.dylib x86_64-apple-ios13.5.0-simulator [ 33] libsystem_trace.dylib x86_64-apple-ios13.5.0-simulator [ 34] libunwind.dylib x86_64-apple-ios13.5.0-simulator [ 35] libxpc.dylib x86_64-apple-ios13.5.0-simulator [ 36] libsystem_sim_pthread_host.dylib x86_64-apple-ios13.5.0-simulator [ 37] libsystem_sim_platform_host.dylib x86_64-apple-ios13.5.0-simulator [ 38] libsystem_sim_kernel_host.dylib x86_64-apple-ios13.5.0-simulator [ 39] libsystem_kernel.dylib x86_64-apple-macosx10.15.0-simulator(0x00007fff51b5a000) [ 40] libobjc.A.dylib x86_64-apple-ios13.5.0-simulator [ 41] libsystem_platform.dylib x86_64-apple-macosx10.15.0-simulator(0x00007fff51bfd000) [ 42] libsystem_pthread.dylib x86_64-apple-macosx10.15.0-simulator(0x00007fff51c06000)

Hide Details

Hide Details

Expecting pattern: a\.out x86_64-apple-ios11.0.*-simulator Matched

Hide Details

<bound method SBProcess.Kill of <lldb.SBProcess; proxy of <Swig Object of type 'lldb::SBProcess *' at 0x10b4bbf60> >>: success

Hide Details

PASS: LLDB (/Users/buildslave/jenkins/workspace/lldb-cmake@2/lldb-build/bin/clang-x86_64) :: test_lc_version_min_iphoneos (TestSimulatorPlatform.TestSimulatorPlatformLaunching) runCmd: settings clear -all output:

Hide Details

runCmd: settings set symbols.enable-external-lookup false output:

Hide Details

runCmd: settings set target.inherit-tcc true output:

Hide Details

runCmd: settings set target.auto-apply-fixits false output:

Hide Details

runCmd: settings set plugin.process.gdb-remote.packet-timeout 60 output:

Hide Details

runCmd: settings set symbols.clang-modules-cache-path "/Users/buildslave/jenkins/workspace/lldb-cmake@2/lldb-build/lldb-test-build.noindex/module-cache-lldb/lldb-api" output:

Hide Details

runCmd: settings set use-color false output:

Hide Details

runCmd: setting set target.prefer-dynamic-value no-dynamic-values output:

Hide Details

runCmd: log enable gdb-remote packets -f /Users/buildslave/jenkins/workspace/lldb-cmake@2/lldb-build/lldb-test-build.noindex/macosx/simulator/TestSimulatorPlatform.test_lc_version_min_macosx/packets.log output:

Hide Details

FAIL: LLDB (/Users/buildslave/jenkins/workspace/lldb-cmake@2/lldb-build/bin/clang-x86_64) :: test_lc_version_min_macosx (TestSimulatorPlatform.TestSimulatorPlatformLaunching) <bound method SBProcess.Kill of <lldb.SBProcess; proxy of <Swig Object of type 'lldb::SBProcess *' at 0x112990120> >>: success

Hide Details

runCmd: settings clear -all output:

Hide Details

runCmd: settings set symbols.enable-external-lookup false output:

Hide Details

runCmd: settings set target.inherit-tcc true output:

Hide Details

runCmd: settings set target.auto-apply-fixits false output:

Hide Details

runCmd: settings set plugin.process.gdb-remote.packet-timeout 60 output:

Hide Details

runCmd: settings set symbols.clang-modules-cache-path "/Users/buildslave/jenkins/workspace/lldb-cmake@2/lldb-build/lldb-test-build.noindex/module-cache-lldb/lldb-api" output:

Hide Details

runCmd: settings set use-color false output:

Hide Details

runCmd: setting set target.prefer-dynamic-value no-dynamic-values output:

Hide Details

runCmd: log enable gdb-remote packets -f /Users/buildslave/jenkins/workspace/lldb-cmake@2/lldb-build/lldb-test-build.noindex/macosx/simulator/TestSimulatorPlatform.test_lc_version_min_tvos/packets.log output:

Hide Details

FAIL: LLDB (/Users/buildslave/jenkins/workspace/lldb-cmake@2/lldb-build/bin/clang-x86_64) :: test_lc_version_min_tvos (TestSimulatorPlatform.TestSimulatorPlatformLaunching) <bound method SBProcess.Kill of <lldb.SBProcess; proxy of <Swig Object of type 'lldb::SBProcess *' at 0x10b4bbf60> >>: success

Hide Details

UNSUPPORTED: LLDB (/Users/buildslave/jenkins/workspace/lldb-cmake@2/lldb-build/bin/clang-x86_64) :: test_lc_version_min_watchos (TestSimulatorPlatform.TestSimulatorPlatformLaunching) (skip on macosx, darwin, ios, tvos, watchos, bridgeos) runCmd: settings clear -all output:

Hide Details

runCmd: settings set symbols.enable-external-lookup false output:

Hide Details

runCmd: settings set target.inherit-tcc true output:

Hide Details

runCmd: settings set target.auto-apply-fixits false output:

Hide Details

runCmd: settings set plugin.process.gdb-remote.packet-timeout 60 output:

Hide Details

runCmd: settings set symbols.clang-modules-cache-path "/Users/buildslave/jenkins/workspace/lldb-cmake@2/lldb-build/lldb-test-build.noindex/module-cache-lldb/lldb-api" output:

Hide Details

runCmd: settings set use-color false output:

Hide Details

runCmd: setting set target.prefer-dynamic-value no-dynamic-values output:

Hide Details

runCmd: log enable gdb-remote packets -f /Users/buildslave/jenkins/workspace/lldb-cmake@2/lldb-build/lldb-test-build.noindex/macosx/simulator/TestSimulatorPlatform.test_tvos/packets.log output:

Hide Details

runCmd: image list -b -t output: [ 0] a.out x86_64-apple-tvos13.4.0-simulator [ 1] dyld x86_64-apple-macosx10.15.0 [ 2] dyld_sim x86_64-apple-tvos13.4.0-simulator [ 3] libc++.1.dylib x86_64-apple-tvos13.4.0-simulator [ 4] libSystem.B.dylib x86_64-apple-tvos13.4.0-simulator [ 5] libc++abi.dylib x86_64-apple-tvos13.4.0-simulator [ 6] libcache.dylib x86_64-apple-tvos13.4.0-simulator [ 7] libcommonCrypto.dylib x86_64-apple-tvos13.4.0-simulator [ 8] libcompiler_rt.dylib x86_64-apple-tvos13.4.0-simulator [ 9] libcopyfile.dylib x86_64-apple-tvos13.4.0-simulator [ 10] libcorecrypto.dylib x86_64-apple-tvos13.4.0-simulator [ 11] libdispatch.dylib x86_64-apple-tvos13.4.0-simulator [ 12] libdyld.dylib x86_64-apple-tvos13.4.0-simulator [ 13] liblaunch.dylib x86_64-apple-tvos13.4.0-simulator [ 14] libmacho.dylib x86_64-apple-tvos13.4.0-simulator [ 15] libremovefile.dylib x86_64-apple-tvos13.4.0-simulator [ 16] libsystem_asl.dylib x86_64-apple-tvos13.4.0-simulator [ 17] libsystem_blocks.dylib x86_64-apple-tvos13.4.0-simulator [ 18] libsystem_c.dylib x86_64-apple-tvos13.4.0-simulator [ 19] libsystem_configuration.dylib x86_64-apple-tvos13.4.0-simulator [ 20] libsystem_containermanager.dylib x86_64-apple-tvos13.4.0-simulator [ 21] libsystem_coreservices.dylib x86_64-apple-tvos13.4.0-simulator [ 22] libsystem_darwin.dylib x86_64-apple-tvos13.4.0-simulator [ 23] libsystem_dnssd.dylib x86_64-apple-tvos13.4.0-simulator [ 24] libsystem_featureflags.dylib x86_64-apple-tvos13.4.0-simulator [ 25] libsystem_info.dylib x86_64-apple-tvos13.4.0-simulator [ 26] libsystem_m.dylib x86_64-apple-tvos13.4.0-simulator [ 27] libsystem_malloc.dylib x86_64-apple-tvos13.4.0-simulator [ 28] libsystem_notify.dylib x86_64-apple-tvos13.4.0-simulator [ 29] libsystem_sandbox.dylib x86_64-apple-tvos13.4.0-simulator [ 30] libsystem_sim_kernel.dylib x86_64-apple-tvos13.4.0-simulator [ 31] libsystem_sim_platform.dylib x86_64-apple-tvos13.4.0-simulator [ 32] libsystem_sim_pthread.dylib x86_64-apple-tvos13.4.0-simulator [ 33] libsystem_trace.dylib x86_64-apple-tvos13.4.0-simulator [ 34] libunwind.dylib x86_64-apple-tvos13.4.0-simulator [ 35] libxpc.dylib x86_64-apple-tvos13.4.0-simulator [ 36] libsystem_sim_pthread_host.dylib x86_64-apple-tvos13.4.0-simulator [ 37] libsystem_sim_platform_host.dylib x86_64-apple-tvos13.4.0-simulator [ 38] libsystem_sim_kernel_host.dylib x86_64-apple-tvos13.4.0-simulator [ 39] libsystem_kernel.dylib x86_64-apple-macosx10.15.0-simulator(0x00007fff421b1000) [ 40] libobjc.A.dylib x86_64-apple-tvos13.4.0-simulator [ 41] libsystem_platform.dylib x86_64-apple-macosx10.15.0-simulator(0x00007fff42254000) [ 42] libsystem_pthread.dylib x86_64-apple-macosx10.15.0-simulator(0x00007fff4225d000)

Hide Details

Hide Details

Expecting pattern: a\.out x86_64-apple-tvos13.4.*-simulator Matched

Hide Details

<bound method SBProcess.Kill of <lldb.SBProcess; proxy of <Swig Object of type 'lldb::SBProcess *' at 0x10b4bb060> >>: success

Hide Details

PASS: LLDB (/Users/buildslave/jenkins/workspace/lldb-cmake@2/lldb-build/bin/clang-x86_64) :: test_tvos (TestSimulatorPlatform.TestSimulatorPlatformLaunching) runCmd: settings clear -all output:

Hide Details

runCmd: settings set symbols.enable-external-lookup false output:

Hide Details

runCmd: settings set target.inherit-tcc true output:

Hide Details

runCmd: settings set target.auto-apply-fixits false output:

Hide Details

runCmd: settings set plugin.process.gdb-remote.packet-timeout 60 output:

Hide Details

runCmd: settings set symbols.clang-modules-cache-path "/Users/buildslave/jenkins/workspace/lldb-cmake@2/lldb-build/lldb-test-build.noindex/module-cache-lldb/lldb-api" output:

Hide Details

runCmd: settings set use-color false output:

Hide Details

runCmd: setting set target.prefer-dynamic-value no-dynamic-values output:

Hide Details

UNSUPPORTED: LLDB (/Users/buildslave/jenkins/workspace/lldb-cmake@2/lldb-build/bin/clang-x86_64) :: test_tvos_backdeploy_apple_silicon (TestSimulatorPlatform.TestSimulatorPlatformLaunching) (skipping due to the following parameter(s): architecture) UNSUPPORTED: LLDB (/Users/buildslave/jenkins/workspace/lldb-cmake@2/lldb-build/bin/clang-x86_64) :: test_watchos_armv7k (TestSimulatorPlatform.TestSimulatorPlatformLaunching) (skip on macosx, darwin, ios, tvos, watchos, bridgeos) UNSUPPORTED: LLDB (/Users/buildslave/jenkins/workspace/lldb-cmake@2/lldb-build/bin/clang-x86_64) :: test_watchos_backdeploy_apple_silicon (TestSimulatorPlatform.TestSimulatorPlatformLaunching) (skip on macosx, darwin, ios, tvos, watchos, bridgeos) UNSUPPORTED: LLDB (/Users/buildslave/jenkins/workspace/lldb-cmake@2/lldb-build/bin/clang-x86_64) :: test_watchos_i386 (TestSimulatorPlatform.TestSimulatorPlatformLaunching) (skip on macosx, darwin, ios, tvos, watchos, bridgeos) Restore dir to: /Users/buildslave/jenkins/workspace/lldb-cmake@2/lldb-build/tools/lldb/test ====================================================================== FAIL: test_lc_version_min_macosx (TestSimulatorPlatform.TestSimulatorPlatformLaunching) Test running a back-deploying non-simulator MacOS X binary ---------------------------------------------------------------------- Traceback (most recent call last): File "/Users/buildslave/jenkins/workspace/lldb-cmake@2/llvm-project/lldb/packages/Python/lldbsuite/test/decorators.py", line 134, in wrapper return func(*args, **kwargs) File "/Users/buildslave/jenkins/workspace/lldb-cmake@2/llvm-project/lldb/test/API/macosx/simulator/TestSimulatorPlatform.py", line 142, in test_lc_version_min_macosx expected_load_command='LC_VERSION_MIN_MACOSX') File "/Users/buildslave/jenkins/workspace/lldb-cmake@2/llvm-project/lldb/test/API/macosx/simulator/TestSimulatorPlatform.py", line 72, in run_with lldb.SBFileSpec("hello.c")) File "/Users/buildslave/jenkins/workspace/lldb-cmake@2/llvm-project/lldb/packages/Python/lldbsuite/test/lldbutil.py", line 954, in run_to_source_breakpoint only_one_thread, extra_images) File "/Users/buildslave/jenkins/workspace/lldb-cmake@2/llvm-project/lldb/packages/Python/lldbsuite/test/lldbutil.py", line 873, in run_to_breakpoint_do_run "Process launch failed: %s" % (error.GetCString())) AssertionError: True is not False : Process launch failed: process exited with status -1 (tried to attach to process already being debugged) Config=x86_64-/Users/buildslave/jenkins/workspace/lldb-cmake@2/lldb-build/bin/clang ====================================================================== FAIL: test_lc_version_min_tvos (TestSimulatorPlatform.TestSimulatorPlatformLaunching) Test running a back-deploying tvOS simulator binary ---------------------------------------------------------------------- Traceback (most recent call last): File "/Users/buildslave/jenkins/workspace/lldb-cmake@2/llvm-project/lldb/packages/Python/lldbsuite/test/decorators.py", line 134, in wrapper return func(*args, **kwargs) File "/Users/buildslave/jenkins/workspace/lldb-cmake@2/llvm-project/lldb/packages/Python/lldbsuite/test/decorators.py", line 134, in wrapper return func(*args, **kwargs) File "/Users/buildslave/jenkins/workspace/lldb-cmake@2/llvm-project/lldb/packages/Python/lldbsuite/test/decorators.py", line 134, in wrapper return func(*args, **kwargs) [Previous line repeated 1 more time] File "/Users/buildslave/jenkins/workspace/lldb-cmake@2/llvm-project/lldb/test/API/macosx/simulator/TestSimulatorPlatform.py", line 192, in test_lc_version_min_tvos expected_load_command='LC_VERSION_MIN_TVOS') File "/Users/buildslave/jenkins/workspace/lldb-cmake@2/llvm-project/lldb/test/API/macosx/simulator/TestSimulatorPlatform.py", line 72, in run_with lldb.SBFileSpec("hello.c")) File "/Users/buildslave/jenkins/workspace/lldb-cmake@2/llvm-project/lldb/packages/Python/lldbsuite/test/lldbutil.py", line 954, in run_to_source_breakpoint only_one_thread, extra_images) File "/Users/buildslave/jenkins/workspace/lldb-cmake@2/llvm-project/lldb/packages/Python/lldbsuite/test/lldbutil.py", line 873, in run_to_breakpoint_do_run "Process launch failed: %s" % (error.GetCString())) AssertionError: True is not False : Process launch failed: process exited with status -1 (tried to attach to process already being debugged) Config=x86_64-/Users/buildslave/jenkins/workspace/lldb-cmake@2/lldb-build/bin/clang ---------------------------------------------------------------------- Ran 12 tests in 368.446s

Hide Details

RESULT: FAILED (4 passes, 2 failures, 0 errors, 6 skipped, 0 expected failures, 0 unexpected successes)

Hide Details

--

Hide Details

******************** PASS: lldb-unit :: Utility/./UtilityTests/BinaryStreamTest.PutSLEB128SevenBytes (1375 of 2134) PASS: lldb-shell :: Commands/CommandScriptImmediateOutput/CommandScriptImmediateOutputConsole.test (1376 of 2134) UNSUPPORTED: lldb-shell :: SymbolFile/PDB/func-symbols.test (1377 of 2134) PASS: lldb-api :: lang/cpp/unsigned_types/TestUnsignedTypes.py (1378 of 2134) PASS: lldb-api :: commands/target/stop-hook/disable/TestTargetStopHookDisable.py (1379 of 2134) PASS: lldb-api :: lang/objcxx/objcxx-ivar-vector/TestIvarVector.py (1380 of 2134) PASS: lldb-api :: lang/objc/objc-class-method/TestObjCClassMethod.py (1381 of 2134) PASS: lldb-unit :: Utility/./UtilityTests/SerializationRountripTest.SerializeDeserializeObjectReference (1382 of 2134) UNSUPPORTED: lldb-shell :: Register/aarch64-gp-read.test (1383 of 2134) PASS: lldb-unit :: Utility/./UtilityTests/BinaryStreamTest.PutULEB128EightBytes (1384 of 2134) PASS: lldb-api :: functionalities/data-formatter/data-formatter-stl/libcxx/map/TestDataFormatterLibccMap.py (1385 of 2134) PASS: lldb-unit :: Utility/./UtilityTests/StreamTest.PutNHex8 (1386 of 2134) PASS: lldb-api :: lang/c/blocks/TestBlocks.py (1387 of 2134) PASS: lldb-unit :: Utility/./UtilityTests/ConstStringTest.CompareConstString (1388 of 2134) PASS: lldb-unit :: Expression/./ExpressionTests/CppModuleConfigurationTest.UnrelatedLibrary (1389 of 2134) PASS: lldb-api :: lang/objc/objc-baseclass-sbtype/TestObjCBaseClassSBType.py (1390 of 2134) PASS: lldb-api :: tools/lldb-server/TestGdbRemoteRegisterState.py (1391 of 2134) PASS: lldb-shell :: Commands/command-backtrace.test (1392 of 2134) PASS: lldb-unit :: Process/minidump/./LLDBMinidumpTests/MinidumpParserTest.GetPid (1393 of 2134) PASS: lldb-api :: api/log/TestAPILog.py (1394 of 2134) PASS: lldb-api :: commands/expression/dont_allow_jit/TestAllowJIT.py (1395 of 2134) UNSUPPORTED: lldb-shell :: SymbolFile/PDB/expressions.test (1396 of 2134) PASS: lldb-api :: macosx/profile_vrs_detach/TestDetachVrsProfile.py (1397 of 2134) PASS: lldb-unit :: Process/minidump/./LLDBMinidumpTests/MinidumpParserTest.GetPidWindows (1398 of 2134) PASS: lldb-api :: functionalities/lazy-loading/TestLazyLoading.py (1399 of 2134) PASS: lldb-unit :: Language/Highlighting/./HighlighterTests/HighlighterTest.ClangUnterminatedString (1400 of 2134) PASS: lldb-api :: tools/lldb-vscode/breakpoint/TestVSCode_setFunctionBreakpoints.py (1401 of 2134) PASS: lldb-unit :: Utility/./UtilityTests/LogChannelEnabledTest.LogThread (1402 of 2134) PASS: lldb-api :: functionalities/tail_call_frames/thread_step_out_or_return/TestSteppingOutWithArtificialFrames.py (1403 of 2134) PASS: lldb-unit :: UnwindAssembly/x86/./UnwindAssemblyx86Tests/Testx86AssemblyInspectionEngine.TestStackRealign8BitDisp_i386 (1404 of 2134) PASS: lldb-unit :: UnwindAssembly/x86/./UnwindAssemblyx86Tests/Testx86AssemblyInspectionEngine.TestPushR13 (1405 of 2134) PASS: lldb-shell :: ObjectFile/ELF/PT_LOAD.yaml (1406 of 2134) PASS: lldb-api :: functionalities/data-formatter/data-formatter-stl/libcxx/initializerlist/TestInitializerList.py (1407 of 2134) PASS: lldb-unit :: UnwindAssembly/x86/./UnwindAssemblyx86Tests/Testx86AssemblyInspectionEngine.TestPushImm (1408 of 2134) PASS: lldb-api :: python_api/watchpoint/condition/TestWatchpointConditionAPI.py (1409 of 2134) PASS: lldb-shell :: Breakpoint/debug_addrx.test (1410 of 2134) PASS: lldb-api :: lang/cpp/modules-import/TestCXXModulesImport.py (1411 of 2134) PASS: lldb-unit :: Utility/./UtilityTests/UriParserTest.SchemeHostSeparator (1412 of 2134) PASS: lldb-shell :: SymbolFile/DWARF/debug-types-dwarf5.s (1413 of 2134) PASS: lldb-unit :: Utility/./UtilityTests/StringListTest.LongestCommonPrefix (1414 of 2134) PASS: lldb-shell :: BuildScript/modes.test (1415 of 2134) PASS: lldb-api :: terminal/TestEditline.py (1416 of 2134) UNSUPPORTED: lldb-api :: functionalities/data-formatter/data-formatter-stl/libstdcpp/smart_ptr/TestDataFormatterStdSmartPtr.py (1417 of 2134) PASS: lldb-unit :: UnwindAssembly/x86/./UnwindAssemblyx86Tests/Testx86AssemblyInspectionEngine.TestPopRBP (1418 of 2134) PASS: lldb-shell :: SymbolFile/DWARF/DW_OP_piece-struct.s (1419 of 2134) PASS: lldb-unit :: Utility/./UtilityTests/StreamTeeTest.DefaultConstructor (1420 of 2134) PASS: lldb-api :: commands/expression/scoped_enums/TestScopedEnumType.py (1421 of 2134) PASS: lldb-unit :: Utility/./UtilityTests/StringListTest.RemoveBlankLines (1422 of 2134) UNSUPPORTED: lldb-api :: commands/register/register/intel_xtended_registers/mpx_bound_violation/TestBoundViolation.py (1423 of 2134) PASS: lldb-unit :: Process/minidump/./LLDBMinidumpTests/MinidumpParserTest.GetThreadContext_x86_64 (1424 of 2134) PASS: lldb-api :: commands/command/script/import/TestImport.py (1425 of 2134) PASS: lldb-shell :: Expr/TestMultilineExpr.test (1426 of 2134) PASS: lldb-unit :: DataFormatter/./LLDBFormatterTests/TypeMatcherTests.ExactName (1427 of 2134) PASS: lldb-unit :: Utility/./UtilityTests/StreamTest.QuotedCString (1428 of 2134) PASS: lldb-shell :: ObjectFile/PECOFF/section-types.yaml (1429 of 2134) PASS: lldb-api :: lang/cpp/multiple-inheritance/TestCppMultipleInheritance.py (1430 of 2134) PASS: lldb-unit :: Utility/./UtilityTests/RangeDataVector.CustomSort (1431 of 2134) PASS: lldb-shell :: SymbolFile/DWARF/debug_loc_and_loclists.s (1432 of 2134) PASS: lldb-shell :: Reproducer/TestSynchronous.test (1433 of 2134) PASS: lldb-api :: commands/expression/import-std-module/basic/TestImportStdModule.py (1434 of 2134) PASS: lldb-api :: functionalities/data-formatter/data-formatter-objc/TestDataFormatterObjCNSContainer.py (1435 of 2134) PASS: lldb-unit :: Utility/./UtilityTests/BinaryStreamTest.PutSLEB128SixBytes (1436 of 2134) PASS: lldb-api :: lang/cpp/namespace_definitions/TestNamespaceDefinitions.py (1437 of 2134) PASS: lldb-api :: commands/expression/pr35310/TestExprsBug35310.py (1438 of 2134) PASS: lldb-unit :: Utility/./UtilityTests/RangeTest.ContainsRange (1439 of 2134) PASS: lldb-unit :: Utility/./UtilityTests/StringListTest.DefaultConstructor (1440 of 2134) PASS: lldb-unit :: Utility/./UtilityTests/StringListTest.GetMaxStringLengthEmpty (1441 of 2134) PASS: lldb-api :: commands/expression/import-std-module/stack/TestStackFromStdModule.py (1442 of 2134) PASS: lldb-shell :: ObjectFile/ELF/PT_LOAD-overlap-PT_INTERP.yaml (1443 of 2134) PASS: lldb-unit :: Utility/./UtilityTests/StringExtractorTest.DecodeHexU8_Exact (1444 of 2134) UNSUPPORTED: lldb-shell :: Process/Windows/exception_access_violation.cpp (1445 of 2134) UNSUPPORTED: lldb-shell :: SymbolFile/PDB/class-layout.test (1446 of 2134) PASS: lldb-api :: functionalities/gdb_remote_client/TestRestartBug.py (1447 of 2134) PASS: lldb-unit :: Process/gdb-remote/./ProcessGdbRemoteTests/GDBRemoteCommunicationClientTest.GetModulesInfo (1448 of 2134) PASS: lldb-shell :: SymbolFile/DWARF/inline-function-address-shared.test (1449 of 2134) PASS: lldb-api :: functionalities/gdb_remote_client/TestNoWatchpointSupportInfo.py (1450 of 2134) PASS: lldb-unit :: Platform/./LLDBPlatformTests/PlatformAppleSimulatorTest.TestHostPlatformToSim (1451 of 2134) PASS: lldb-unit :: Process/gdb-remote/./ProcessGdbRemoteTests/GDBRemoteCommunicationClientTest.SendGetDataPacket (1452 of 2134) PASS: lldb-unit :: Target/./TargetTests/RemoteAwarePlatformTest.TestResolveExecutabelOnClientByPlatform (1453 of 2134) PASS: lldb-unit :: Utility/./UtilityTests/VMRange.IsValid (1454 of 2134) PASS: lldb-api :: lang/objc/objc-foundation-dictionary-empty/TestNSDictionary0.py (1455 of 2134) PASS: lldb-shell :: Quit/TestQuitExitCodeTooManyArgs.test (1456 of 2134) PASS: lldb-api :: lang/objc/objc-checker/TestObjCCheckers.py (1457 of 2134) PASS: lldb-api :: lang/cpp/stl/TestStdCXXDisassembly.py (1458 of 2134) PASS: lldb-unit :: ObjectFile/MachO/./ObjectFileMachOTests/ObjectFileMachOTest.ModuleFromSharedCacheInfo (1459 of 2134) PASS: lldb-api :: macosx/thread-names/TestInterruptThreadNames.py (1460 of 2134) PASS: lldb-unit :: Utility/./UtilityTests/DataExtractorTest.GetDoubleUnaligned (1461 of 2134) PASS: lldb-unit :: Utility/./UtilityTests/BinaryStreamTest.PutULEB128MaxValue (1462 of 2134) PASS: lldb-unit :: Utility/./UtilityTests/DataExtractorTest.GetCStr (1463 of 2134) PASS: lldb-unit :: Target/./TargetTests/ModuleCacheTest.GetAndPutStrangeHostname (1464 of 2134) UNSUPPORTED: lldb-shell :: Register/arm-fp-read.test (1465 of 2134) PASS: lldb-unit :: Utility/./UtilityTests/VMRange.Ordering (1466 of 2134) PASS: lldb-shell :: ScriptInterpreter/None/import_module.test (1467 of 2134) PASS: lldb-unit :: Expression/./ExpressionTests/DiagnosticManagerTest.PutString (1468 of 2134) PASS: lldb-unit :: ScriptInterpreter/Python/./ScriptInterpreterPythonTests/PythonDataObjectsTest.TestPythonStringToStr (1469 of 2134) PASS: lldb-unit :: SymbolFile/NativePDB/./SymbolFileNativePDBTests/PDBFPOProgramToDWARFExpressionTests.DependencyChain (1470 of 2134) PASS: lldb-api :: functionalities/data-formatter/stringprinter/TestStringPrinter.py (1471 of 2134) PASS: lldb-unit :: Utility/./UtilityTests/EventTest.DumpEventDataBytes (1472 of 2134) PASS: lldb-unit :: Utility/./UtilityTests/AnsiTerminal.Incomplete (1473 of 2134) PASS: lldb-unit :: UnwindAssembly/x86/./UnwindAssemblyx86Tests/Testx86AssemblyInspectionEngine.TestDisassemblyJunkBytes (1474 of 2134) PASS: lldb-api :: lang/objc/foundation/TestFoundationDisassembly.py (1475 of 2134) PASS: lldb-api :: tools/lldb-server/TestGdbRemote_vCont.py (1476 of 2134) PASS: lldb-unit :: Utility/./UtilityTests/ArgsTest.Yaml (1477 of 2134) PASS: lldb-unit :: Utility/./UtilityTests/BinaryStreamTest.PutSLEB128ThreeBytes (1478 of 2134) PASS: lldb-unit :: Language/CPlusPlus/./LanguageCPlusPlusTests/CPlusPlusLanguage.MethodNameParsing (1479 of 2134) PASS: lldb-api :: lang/objc/objc-builtin-types/TestObjCBuiltinTypes.py (1480 of 2134) PASS: lldb-unit :: Utility/./UtilityTests/RangeDataVector.FindEntryThatContains (1481 of 2134) PASS: lldb-unit :: Utility/./UtilityTests/ArchSpecTest.TripleComponentsWereSpecified (1482 of 2134) PASS: lldb-unit :: Symbol/./SymbolTests/TestTypeSystemClang.TestFunctionTemplateConstruction (1483 of 2134) PASS: lldb-unit :: Language/Highlighting/./HighlighterTests/HighlighterTest.HighlighterSelectionType (1484 of 2134) UNSUPPORTED: lldb-shell :: Register/x86-64-ymm16-read.test (1485 of 2134) PASS: lldb-unit :: Host/./HostTests/NativeProcessProtocolTest.ReadCStringFromMemory_CrossPageBoundary (1486 of 2134) UNSUPPORTED: lldb-api :: commands/expression/completion-crash-invalid-iterator/TestInvalidIteratorCompletionCrash.py (1487 of 2134) PASS: lldb-api :: commands/breakpoint/command/list/TestBreakpointCommandList.py (1488 of 2134) PASS: lldb-unit :: debugserver/./debugserverTests/RNBSocket.LoopBackConnectIPv4 (1489 of 2134) PASS: lldb-api :: lang/c/inlines/TestRedefinitionsInInlines.py (1490 of 2134) PASS: lldb-unit :: Utility/./UtilityTests/ArgsTest.TestSingleArg (1491 of 2134) PASS: lldb-unit :: Process/minidump/./LLDBMinidumpTests/RegisterContextMinidump.CheckRegisterContextMinidump_ARM (1492 of 2134) PASS: lldb-api :: functionalities/data-formatter/data-formatter-caching/TestDataFormatterCaching.py (1493 of 2134) PASS: lldb-api :: functionalities/gdb_remote_client/TestTargetXMLArch.py (1494 of 2134) PASS: lldb-api :: lang/cpp/llvm-style/TestLLVMStyle.py (1495 of 2134) PASS: lldb-unit :: Utility/./UtilityTests/Flags.GetBitSize (1496 of 2134) PASS: lldb-unit :: Utility/./UtilityTests/SerializationRountripTest.SerializeDeserializeCString (1497 of 2134) PASS: lldb-unit :: Utility/./UtilityTests/UriParserTest.Minimal (1498 of 2134) PASS: lldb-unit :: Utility/./UtilityTests/FileSpecTest.FormatFileSpec (1499 of 2134) PASS: lldb-api :: python_api/process/io/TestProcessIO.py (1500 of 2134) PASS: lldb-unit :: Language/CPlusPlus/./LanguageCPlusPlusTests/CPlusPlusLanguage.FindAlternateFunctionManglings (1501 of 2134) UNSUPPORTED: lldb-shell :: SymbolFile/PDB/compilands.test (1502 of 2134) PASS: lldb-unit :: Utility/./UtilityTests/StreamTest.PutRawBytesToLittleEndian (1503 of 2134) PASS: lldb-api :: commands/process/launch-with-shellexpand/TestLaunchWithShellExpand.py (1504 of 2134) PASS: lldb-shell :: SymbolFile/DWARF/debug_line-tombstone.s (1505 of 2134) PASS: lldb-shell :: SymbolFile/DWARF/dwarf5-partial-index.cpp (1506 of 2134) PASS: lldb-unit :: Utility/./UtilityTests/PassiveReplayTest.InstrumentedBar (1507 of 2134) PASS: lldb-unit :: Utility/./UtilityTests/BinaryStreamTest.PutULEB128ThreeBytes (1508 of 2134) PASS: lldb-shell :: Minidump/no-process-id.yaml (1509 of 2134) PASS: lldb-api :: commands/breakpoint/set/func-regex/TestBreakpointRegexError.py (1510 of 2134) PASS: lldb-unit :: Utility/./UtilityTests/LogChannelEnabledTest.LLDB_LOG_ERROR (1511 of 2134) PASS: lldb-api :: python_api/watchpoint/TestWatchpointIgnoreCount.py (1512 of 2134) PASS: lldb-unit :: Utility/./UtilityTests/StringListTest.InsertStringAtIndexMove (1513 of 2134) PASS: lldb-api :: functionalities/breakpoint/scripted_bkpt/TestScriptedResolver.py (1514 of 2134) UNSUPPORTED: lldb-api :: lang/objc/objc-dynamic-value/TestObjCDynamicValue.py (1515 of 2134) PASS: lldb-shell :: SymbolFile/DWARF/win-i386-line-table.s (1516 of 2134) PASS: lldb-unit :: Symbol/./SymbolTests/LineEntryTest.GetSameLineContiguousAddressRangeNoInlines (1517 of 2134) PASS: lldb-unit :: ScriptInterpreter/Python/./ScriptInterpreterPythonTests/PythonDataObjectsTest.TestPythonListValueEquality (1518 of 2134) UNSUPPORTED: lldb-shell :: Unwind/unwind-plan-dwarf-dump.test (1519 of 2134) PASS: lldb-api :: functionalities/tsan/thread_numbers/TestTsanThreadNumbers.py (1520 of 2134) PASS: lldb-unit :: Utility/./UtilityTests/AnsiTerminal.WhiteSpace (1521 of 2134) PASS: lldb-shell :: Driver/TestSingleQuote.test (1522 of 2134) PASS: lldb-unit :: Language/Highlighting/./HighlighterTests/HighlighterTest.ClangStringLiterals (1523 of 2134) PASS: lldb-api :: functionalities/thread/concurrent_events/TestConcurrentDelayWatchBreak.py (1524 of 2134) PASS: lldb-api :: functionalities/thread/concurrent_events/TestConcurrentDelaySignalWatch.py (1525 of 2134) PASS: lldb-unit :: SymbolFile/DWARF/./SymbolFileDWARFTests/SymbolFileDWARFTests.TestAbbrevInvalidNULLTag (1526 of 2134) PASS: lldb-unit :: Utility/./UtilityTests/StringLexerTest.NextIf (1527 of 2134) PASS: lldb-api :: functionalities/plugins/command_plugin/TestPluginCommands.py (1528 of 2134) PASS: lldb-api :: commands/frame/diagnose/complicated-expression/TestComplicatedExpression.py (1529 of 2134) PASS: lldb-shell :: Register/x86-64-read.test (1530 of 2134) PASS: lldb-shell :: SymbolFile/Breakpad/line-table-missing-file.test (1531 of 2134) PASS: lldb-unit :: UnwindAssembly/x86/./UnwindAssemblyx86Tests/Testx86AssemblyInspectionEngine.TestDisassemblyMidFunctionEpilogues (1532 of 2134) PASS: lldb-api :: macosx/safe-to-func-call/TestSafeFuncCalls.py (1533 of 2134) PASS: lldb-unit :: Host/./HostTests/SocketTest.UDPGetConnectURI (1534 of 2134) PASS: lldb-unit :: Process/gdb-remote/./ProcessGdbRemoteTests/GDBRemoteCommunicationClientTest.GetModulesInfo_UUID20 (1535 of 2134) PASS: lldb-unit :: Utility/./UtilityTests/FileSpecTest.GetPath (1536 of 2134) PASS: lldb-unit :: ScriptInterpreter/Python/./ScriptInterpreterPythonTests/PythonDataObjectsTest.TestPythonBoolean (1537 of 2134) PASS: lldb-unit :: Language/Highlighting/./HighlighterTests/HighlighterTest.ClangPPDirectives (1538 of 2134) PASS: lldb-unit :: Utility/./UtilityTests/ScalarTest.Equality (1539 of 2134) PASS: lldb-shell :: SymbolFile/Breakpad/line-table.test (1540 of 2134) PASS: lldb-unit :: Process/minidump/./LLDBMinidumpTests/MinidumpParserTest.GetMemory (1541 of 2134) PASS: lldb-shell :: Settings/TestLineMarkerColor.test (1542 of 2134) PASS: lldb-api :: functionalities/tsan/basic/TestTsanBasic.py (1543 of 2134) PASS: lldb-unit :: Expression/./ExpressionTests/ClangExpressionDeclMapTest.TestUnknownIdentifierLookup (1544 of 2134) PASS: lldb-shell :: ObjectFile/Breakpad/sections-trailing-func.test (1545 of 2134) PASS: lldb-shell :: SymbolFile/Breakpad/stack-cfi-parsing.test (1546 of 2134) PASS: lldb-unit :: Utility/./UtilityTests/RangeDataVector.FindEntryIndexesThatContain_Overlap (1547 of 2134) PASS: lldb-unit :: Utility/./UtilityTests/ScalarTest.Comparison (1548 of 2134) PASS: lldb-unit :: Utility/./UtilityTests/TimeoutTest.Format (1549 of 2134) PASS: lldb-api :: commands/watchpoints/multiple_hits/TestMultipleHits.py (1550 of 2134) PASS: lldb-unit :: ScriptInterpreter/Python/./ScriptInterpreterPythonTests/PythonDataObjectsTest.TestPythonStringToStructuredString (1551 of 2134) PASS: lldb-unit :: Utility/./UtilityTests/OptionsWithRawTest.WhitespaceInput (1552 of 2134) PASS: lldb-unit :: Utility/./UtilityTests/EnvironmentTest.EnvpConversion (1553 of 2134) PASS: lldb-unit :: Utility/./UtilityTests/SerializationRountripTest.SerializeDeserializePodReferences (1554 of 2134) PASS: lldb-unit :: Expression/./ExpressionTests/ClangExpressionDeclMapTest.TestPersistentDeclLookup (1555 of 2134) PASS: lldb-unit :: Utility/./UtilityTests/StreamTest.AddressPrefix (1556 of 2134) PASS: lldb-unit :: Symbol/./SymbolTests/TestTypeSystemClang.TestDeletingImplicitCopyCstrDueToMoveCStr (1557 of 2134) PASS: lldb-unit :: Utility/./UtilityTests/RangeTest.SizeTypes (1558 of 2134) PASS: lldb-unit :: UnwindAssembly/ARM64/./Arm64InstEmulationTests/TestArm64InstEmulation.TestFramelessThreeEpilogueFunction (1559 of 2134) PASS: lldb-api :: functionalities/thread/concurrent_events/TestConcurrentManyCrash.py (1560 of 2134) PASS: lldb-unit :: ScriptInterpreter/Python/./ScriptInterpreterPythonTests/PythonDataObjectsTest.TestPythonIntegerToStr (1561 of 2134) PASS: lldb-unit :: Utility/./UtilityTests/RecordReplayTest.InstrumentedBarRef (1562 of 2134) PASS: lldb-unit :: UnwindAssembly/ARM64/./Arm64InstEmulationTests/TestArm64InstEmulation.TestCFARegisterTrackedAcrossJumps (1563 of 2134) PASS: lldb-api :: commands/expression/options/TestExprOptions.py (1564 of 2134) PASS: lldb-api :: functionalities/data-formatter/data-formatter-stl/libcxx/variant/TestDataFormatterLibcxxVariant.py (1565 of 2134) PASS: lldb-unit :: Utility/./UtilityTests/DataExtractorTest.GetSLEB128_bit63 (1566 of 2134) PASS: lldb-unit :: Utility/./UtilityTests/BinaryStreamTest.PutULEB128FourBytes (1567 of 2134) PASS: lldb-api :: lang/objc/objc-runtime-ivars/TestRuntimeIvars.py (1568 of 2134) PASS: lldb-api :: functionalities/data-formatter/data-formatter-stl/libcxx/vbool/TestDataFormatterLibcxxVBool.py (1569 of 2134) PASS: lldb-unit :: Process/gdb-remote/./ProcessGdbRemoteTests/GDBRemoteCommunicationClientTest.ReadRegister (1570 of 2134) PASS: lldb-unit :: Utility/./UtilityTests/StringExtractorTest.DecodeHexU8_InvalidHex2 (1571 of 2134) PASS: lldb-unit :: Utility/./UtilityTests/BinaryStreamTest.PutSLEB128Zero (1572 of 2134) PASS: lldb-api :: python_api/name_lookup/TestNameLookup.py (1573 of 2134) PASS: lldb-api :: functionalities/data-formatter/data-formatter-python-synth/TestDataFormatterPythonSynth.py (1574 of 2134) PASS: lldb-api :: functionalities/data-formatter/boolreference/TestFormattersBoolRefPtr.py (1575 of 2134) PASS: lldb-api :: lang/objc/objc-new-syntax/TestObjCNewSyntaxArray.py (1576 of 2134) PASS: lldb-api :: functionalities/breakpoint/objc/TestObjCBreakpoints.py (1577 of 2134) PASS: lldb-api :: api/command-return-object/TestSBCommandReturnObject.py (1578 of 2134) PASS: lldb-unit :: Symbol/./SymbolTests/TestTypeSystemClang.TestDisplayName (1579 of 2134) PASS: lldb-shell :: Reproducer/TestDriverOptions.test (1580 of 2134) UNSUPPORTED: lldb-api :: arm/breakpoint-thumb-codesection/TestBreakpointThumbCodesection.py (1581 of 2134) PASS: lldb-shell :: SymbolFile/DWARF/debug_ranges.s (1582 of 2134) PASS: lldb-unit :: UnwindAssembly/x86/./UnwindAssemblyx86Tests/Testx86AssemblyInspectionEngine.TestPopRBX (1583 of 2134) UNSUPPORTED: lldb-api :: functionalities/darwin_log/filter/exact_match/subsystem/TestDarwinLogFilterMatchSubsystem.py (1584 of 2134) PASS: lldb-unit :: UnwindAssembly/ARM64/./Arm64InstEmulationTests/TestArm64InstEmulation.TestSimpleDarwinFunction (1585 of 2134) PASS: lldb-unit :: ObjectFile/Breakpad/./ObjectFileBreakpadTests/FuncRecord.parse (1586 of 2134) PASS: lldb-unit :: ScriptInterpreter/Python/./ScriptInterpreterPythonTests/PythonDataObjectsTest.TestBorrowedReferences (1587 of 2134) PASS: lldb-unit :: Utility/./UtilityTests/VASprintfTest.NoBufferResize (1588 of 2134) PASS: lldb-api :: lang/objc/foundation/TestConstStrings.py (1589 of 2134) PASS: lldb-api :: functionalities/data-formatter/data-formatter-synthval/TestDataFormatterSynthVal.py (1590 of 2134) PASS: lldb-unit :: Symbol/./SymbolTests/TestClangASTImporter.ImportInvalidType (1591 of 2134) PASS: lldb-api :: lang/objc/objc-static-method-stripped/TestObjCStaticMethodStripped.py (1592 of 2134) PASS: lldb-shell :: SymbolFile/DWARF/debug_aranges-empty-section.s (1593 of 2134) PASS: lldb-unit :: Utility/./UtilityTests/RangeTest.ContainsEndInclusive (1594 of 2134) UNSUPPORTED: lldb-api :: tools/intel-features/intel-pt/test/TestIntelPTSimpleBinary.py (1595 of 2134) PASS: lldb-api :: commands/expression/class_template_specialization_empty_pack/TestClassTemplateSpecializationParametersHandling.py (1596 of 2134) PASS: lldb-unit :: Utility/./UtilityTests/OptionsWithRawTest.EmptyArgsOnlySuffix (1597 of 2134) PASS: lldb-api :: lang/objc/rdar-10967107/TestRdar10967107.py (1598 of 2134) PASS: lldb-api :: functionalities/abbreviation/TestAbbreviations.py (1599 of 2134) UNSUPPORTED: lldb-api :: python_api/event/TestEvents.py (1600 of 2134) PASS: lldb-unit :: Language/Highlighting/./HighlighterTests/HighlighterTest.ClangCursorPosInOtherToken (1601 of 2134) PASS: lldb-api :: functionalities/gdb_remote_client/TestThreadSelectionBug.py (1602 of 2134) PASS: lldb-shell :: ObjectFile/ELF/many-sections.s (1603 of 2134) PASS: lldb-unit :: Utility/./UtilityTests/ScalarTest.RightShiftOperator (1604 of 2134) PASS: lldb-unit :: Language/Highlighting/./HighlighterTests/HighlighterTest.ClangPreserveNewLine (1605 of 2134) PASS: lldb-unit :: Symbol/./SymbolTests/SymbolsTest.LocateExecutableSymbolFileForUnknownExecutableAndMissingSymbolFile (1606 of 2134) PASS: lldb-api :: lang/objc/ptr_refs/TestPtrRefsObjC.py (1607 of 2134) PASS: lldb-unit :: Utility/./UtilityTests/StringListTest.JoinEmpty (1608 of 2134) PASS: lldb-unit :: Utility/./UtilityTests/RangeTest.ClearWithStarAddress (1609 of 2134) PASS: lldb-unit :: Utility/./UtilityTests/StreamTest.PutCharNull (1610 of 2134) PASS: lldb-unit :: Utility/./UtilityTests/RangeTest.Constructor (1611 of 2134) PASS: lldb-api :: functionalities/breakpoint/breakpoint_by_file_colon_line/TestBreakpointByFileColonLine.py (1612 of 2134) PASS: lldb-api :: functionalities/data-formatter/data-formatter-synth/TestDataFormatterSynth.py (1613 of 2134) PASS: lldb-api :: functionalities/thread/backtrace_all/TestBacktraceAll.py (1614 of 2134) PASS: lldb-unit :: Utility/./UtilityTests/OptionsWithRawTest.MultiWordSuffix (1615 of 2134) PASS: lldb-unit :: Utility/./UtilityTests/StringLexerTest.HasAtLeast (1616 of 2134) PASS: lldb-api :: functionalities/unwind/zeroth_frame/TestZerothFrame.py (1617 of 2134) PASS: lldb-unit :: Utility/./UtilityTests/ScalarTest.ComparisonFloat (1618 of 2134) PASS: lldb-shell :: Driver/LocalLLDBInit.test (1619 of 2134) PASS: lldb-api :: lang/cpp/chained-calls/TestCppChainedCalls.py (1620 of 2134) PASS: lldb-unit :: Core/./LLDBCoreTests/RichManglingContextTest.SwitchProvider (1621 of 2134) UNSUPPORTED: lldb-shell :: ScriptInterpreter/Lua/watchpoint_callback.test (1622 of 2134) PASS: lldb-unit :: ScriptInterpreter/Python/./ScriptInterpreterPythonTests/PythonDataObjectsTest.TestRun (1623 of 2134) UNSUPPORTED: lldb-api :: commands/expression/call-restarts/TestCallThatRestarts.py (1624 of 2134) PASS: lldb-api :: lang/objc/modules-app-update/TestClangModulesAppUpdate.py (1625 of 2134) PASS: lldb-unit :: Host/./HostTests/SocketAddressTest.Set (1626 of 2134) PASS: lldb-unit :: Utility/./UtilityTests/RegisterValueTest.GetSet8 (1627 of 2134) PASS: lldb-api :: functionalities/thread/thread_exit/TestThreadExit.py (1628 of 2134) PASS: lldb-shell :: ObjectFile/ELF/section-permissions.yaml (1629 of 2134) PASS: lldb-unit :: Host/./HostTests/SocketTest.TCPGetConnectURI (1630 of 2134) PASS: lldb-api :: functionalities/breakpoint/hardware_breakpoints/require_hw_breakpoints/TestRequireHWBreakpoints.py (1631 of 2134) PASS: lldb-api :: functionalities/data-formatter/ptr_ref_typedef/TestPtrRef2Typedef.py (1632 of 2134) PASS: lldb-api :: functionalities/data-formatter/synthupdate/TestSyntheticFilterRecompute.py (1633 of 2134) PASS: lldb-api :: lang/cpp/stl/TestSTL.py (1634 of 2134) UNSUPPORTED: lldb-shell :: Register/aarch64-fp-read.test (1635 of 2134) PASS: lldb-unit :: SymbolFile/NativePDB/./SymbolFileNativePDBTests/PDBFPOProgramToDWARFExpressionTests.MultipleIndependentAssignments (1636 of 2134) PASS: lldb-shell :: Settings/TestSettingsWrite.test (1637 of 2134) PASS: lldb-api :: macosx/find-dsym/deep-bundle/TestDeepBundle.py (1638 of 2134) PASS: lldb-api :: functionalities/data-formatter/vector-types/TestVectorTypesFormatting.py (1639 of 2134) PASS: lldb-unit :: Process/gdb-remote/./ProcessGdbRemoteTests/GDBRemoteCommunicationClientTest.GetModulesInfoInvalidResponse (1640 of 2134) PASS: lldb-api :: functionalities/thread/jump/TestThreadJump.py (1641 of 2134) PASS: lldb-api :: functionalities/thread/step_out/TestThreadStepOut.py (1642 of 2134) PASS: lldb-unit :: Utility/./UtilityTests/BroadcasterTest.BroadcastEvent (1643 of 2134) PASS: lldb-unit :: Utility/./UtilityTests/ArgsTest.BareSingleQuote (1644 of 2134) PASS: lldb-unit :: ScriptInterpreter/Python/./ScriptInterpreterPythonTests/PythonDataObjectsTest.TestTypeNameResolutionNoDot (1645 of 2134) UNSUPPORTED: lldb-api :: commands/register/register/intel_xtended_registers/mpx_offset_intersection/TestMPXOffsetIntersection.py (1646 of 2134) PASS: lldb-shell :: SymbolFile/DWARF/find-inline-method.s (1647 of 2134) UNSUPPORTED: lldb-shell :: Watchpoint/netbsd-nouserdbregs.test (1648 of 2134) PASS: lldb-api :: lang/objc/foundation/TestObjCMethods.py (1649 of 2134) PASS: lldb-unit :: Platform/./LLDBPlatformTests/PlatformAppleSimulatorTest.TestSimHasSimEnvionament (1650 of 2134) PASS: lldb-unit :: Utility/./UtilityTests/UriParserTest.BracketedHostnameWithPortIPv4 (1651 of 2134) PASS: lldb-api :: tools/lldb-server/inferior-crash/TestGdbRemoteAbort.py (1652 of 2134) PASS: lldb-api :: commands/target/dump-symtab-demangle/TestDumpSymtabDemangle.py (1653 of 2134) PASS: lldb-api :: functionalities/ptr_refs/TestPtrRefs.py (1654 of 2134) PASS: lldb-shell :: ObjectFile/PECOFF/dep-modules.yaml (1655 of 2134) PASS: lldb-api :: lang/cpp/operators/TestCppOperators.py (1656 of 2134) PASS: lldb-shell :: Settings/TestModuleCacheSanity.test (1657 of 2134) PASS: lldb-unit :: Utility/./UtilityTests/StreamTest.AddressPrefixAndSuffix (1658 of 2134) PASS: lldb-api :: lang/cpp/symbols/TestSymbols.py (1659 of 2134) PASS: lldb-api :: commands/frame/diagnose/local-variable/TestLocalVariable.py (1660 of 2134) PASS: lldb-shell :: SymbolFile/DWARF/dwp-separate-debug-file.cpp (1661 of 2134) PASS: lldb-shell :: Driver/TestCore.test (1662 of 2134) PASS: lldb-api :: commands/log/invalid-args/TestInvalidArgsLog.py (1663 of 2134) PASS: lldb-unit :: DataFormatter/./LLDBFormatterTests/TypeMatcherTests.RegexMatchPart (1664 of 2134) PASS: lldb-api :: commands/expression/call-function/TestCallStdStringFunction.py (1665 of 2134) PASS: lldb-api :: functionalities/jitloader_gdb/TestJITLoaderGDB.py (1666 of 2134) PASS: lldb-unit :: Process/gdb-remote/./ProcessGdbRemoteTests/GDBRemoteCommunicationServerTest.SendErrorResponse_ErrorList (1667 of 2134) PASS: lldb-api :: lang/c/const_variables/TestConstVariables.py (1668 of 2134) PASS: lldb-api :: lang/c/bitfields/TestBitfields.py (1669 of 2134) UNSUPPORTED: lldb-api :: lang/cpp/static_members/TestCPPStaticMembers.py (1670 of 2134) UNSUPPORTED: lldb-api :: macosx/macCatalystAppMacOSFramework/TestMacCatalystAppWithMacOSFramework.py (1671 of 2134) PASS: lldb-unit :: Utility/./UtilityTests/StringListTest.GetSize (1672 of 2134) PASS: lldb-api :: lang/objc/objc-property/TestObjCProperty.py (1673 of 2134) PASS: lldb-api :: types/TestDoubleTypesExpr.py (1674 of 2134) PASS: lldb-unit :: debugserver/./debugserverTests/RNBSocket.AnyListen (1675 of 2134) PASS: lldb-unit :: Target/./TargetTests/ModuleCacheTest.GetAndPut (1676 of 2134) PASS: lldb-shell :: SymbolFile/NativePDB/disassembly.cpp (1677 of 2134) PASS: lldb-api :: functionalities/thread/exit_during_expression/TestExitDuringExpression.py (1678 of 2134) PASS: lldb-unit :: Utility/./UtilityTests/UriParserTest.BadPort (1679 of 2134) PASS: lldb-api :: functionalities/mtc/simple/TestMTCSimple.py (1680 of 2134) PASS: lldb-shell :: Reproducer/TestVersionCheck.test (1681 of 2134) PASS: lldb-unit :: Process/gdb-remote/./ProcessGdbRemoteTests/GDBRemoteClientBaseTest.SendContinueAndInterrupt (1682 of 2134) PASS: lldb-api :: tools/lldb-server/TestGdbRemoteAttach.py (1683 of 2134) PASS: lldb-api :: functionalities/data-formatter/data-formatter-stl/libcxx/string/TestDataFormatterLibcxxString.py (1684 of 2134) PASS: lldb-unit :: Utility/./UtilityTests/StreamTeeTest.Constructor2Streams (1685 of 2134) PASS: lldb-unit :: Utility/./UtilityTests/UriParserTest.MinimalPath (1686 of 2134) PASS: lldb-unit :: Utility/./UtilityTests/SharedCluster.ClusterManager (1687 of 2134) PASS: lldb-unit :: Utility/./UtilityTests/LogChannelEnabledTest.log_options (1688 of 2134) PASS: lldb-unit :: Process/minidump/./LLDBMinidumpTests/RegisterContextMinidump.ConvertMinidumpContext_x86_64 (1689 of 2134) PASS: lldb-shell :: SymbolFile/DWARF/debug_loclists-dwo.s (1690 of 2134) PASS: lldb-api :: functionalities/gdb_remote_client/TestJLink6Armv7RegisterDefinition.py (1691 of 2134) PASS: lldb-api :: lang/cpp/function-qualifiers/TestCppFunctionQualifiers.py (1692 of 2134) PASS: lldb-unit :: Utility/./UtilityTests/UserIDResolver.GetUserName (1693 of 2134) PASS: lldb-api :: functionalities/postmortem/netbsd-core/TestNetBSDCore.py (1694 of 2134) UNSUPPORTED: lldb-api :: functionalities/data-formatter/data-formatter-stl/libstdcpp/vector/TestDataFormatterStdVector.py (1695 of 2134) PASS: lldb-api :: functionalities/tail_call_frames/cross_object/TestCrossObjectTailCalls.py (1696 of 2134) PASS: lldb-unit :: Process/./ProcessEventDataTests/ProcessEventDataTest.DoOnRemoval (1697 of 2134) PASS: lldb-unit :: Utility/./UtilityTests/ArgsTest.TestTrailingBackslash (1698 of 2134) PASS: lldb-api :: lang/objcxx/class-name-clash/TestNameClash.py (1699 of 2134) PASS: lldb-unit :: UnwindAssembly/x86/./UnwindAssemblyx86Tests/Testx86AssemblyInspectionEngine.TestPushR14 (1700 of 2134) PASS: lldb-api :: macosx/lc-note/kern-ver-str/TestKernVerStrLCNOTE.py (1701 of 2134) PASS: lldb-api :: lang/cpp/operator-overload/TestOperatorOverload.py (1702 of 2134) PASS: lldb-api :: lang/objc/foundation/TestRuntimeTypes.py (1703 of 2134) PASS: lldb-api :: commands/expression/call-function/TestCallBuiltinFunction.py (1704 of 2134) PASS: lldb-api :: functionalities/ubsan/basic/TestUbsanBasic.py (1705 of 2134) UNSUPPORTED: lldb-shell :: SymbolFile/PDB/function-nested-block.test (1706 of 2134) PASS: lldb-shell :: ObjectFile/wasm/stripped-debug-sections.yaml (1707 of 2134) PASS: lldb-unit :: Process/gdb-remote/./ProcessGdbRemoteTests/GDBRemoteCommunicationClientTest.GetMemoryRegionInfoInvalidResponse (1708 of 2134) UNSUPPORTED: lldb-shell :: Register/arm-gp-read.test (1709 of 2134) PASS: lldb-api :: commands/expression/dollar-in-variable/TestDollarInVariable.py (1710 of 2134) PASS: lldb-unit :: Utility/./UtilityTests/ConstStringTest.format_provider (1711 of 2134) PASS: lldb-shell :: Driver/TestHelp.test (1712 of 2134) PASS: lldb-api :: lang/objc/orderedset/TestOrderedSet.py (1713 of 2134) PASS: lldb-api :: functionalities/plugins/python_os_plugin/TestPythonOSPlugin.py (1714 of 2134) UNSUPPORTED: lldb-api :: tools/lldb-server/signal-filtering/TestGdbRemote_QPassSignals.py (1715 of 2134) PASS: lldb-unit :: Utility/./UtilityTests/CompletionRequest.TryCompleteCurrentArgBad (1716 of 2134) PASS: lldb-unit :: Utility/./UtilityTests/StringListTest.ShiftCString (1717 of 2134) PASS: lldb-unit :: Signals/./SignalsTests/UnixSignalsTest.VersionChange (1718 of 2134) PASS: lldb-api :: functionalities/gdb_remote_client/TestqOffsets.py (1719 of 2134) PASS: lldb-api :: functionalities/data-formatter/data-formatter-stl/libcxx/set/TestDataFormatterLibcxxSet.py (1720 of 2134) PASS: lldb-unit :: Utility/./UtilityTests/CompletionRequest.Constructor (1721 of 2134) PASS: lldb-api :: python_api/value/TestValueAPI.py (1722 of 2134) PASS: lldb-unit :: Utility/./UtilityTests/DeserializerTest.HasData (1723 of 2134) PASS: lldb-api :: functionalities/breakpoint/cpp/TestCPPBreakpointLocations.py (1724 of 2134) UNSUPPORTED: lldb-api :: functionalities/darwin_log/filter/exact_match/message/TestDarwinLogFilterMatchMessage.py (1725 of 2134) PASS: lldb-unit :: Symbol/./SymbolTests/TestClangASTImporter.MetadataPropagationIndirectImport (1726 of 2134) PASS: lldb-shell :: Breakpoint/split-dwarf5-debug-stroffsets.test (1727 of 2134) PASS: lldb-unit :: SymbolFile/DWARF/./SymbolFileDWARFTests/SymbolFileDWARFTests.TestAbbrevNullAttrValidForm (1728 of 2134) UNSUPPORTED: lldb-shell :: Register/x86-ymm-read.test (1729 of 2134) PASS: lldb-unit :: Utility/./UtilityTests/StreamTest.PutChar (1730 of 2134) PASS: lldb-unit :: Target/./TargetTests/ExecutionContextTest.GetByteOrderProcess (1731 of 2134) PASS: lldb-api :: commands/frame/diagnose/virtual-method-call/TestDiagnoseDereferenceVirtualMethodCall.py (1732 of 2134) PASS: lldb-shell :: Breakpoint/jitbp_elf.test (1733 of 2134) PASS: lldb-unit :: Core/./LLDBCoreTests/SourceFileCache.FindSourceFileNotFound (1734 of 2134) PASS: lldb-api :: functionalities/non-overlapping-index-variable-i/TestIndexVariable.py (1735 of 2134) PASS: lldb-shell :: SymbolFile/DWARF/DW_TAG_basic_type_DW_ATE_UTF_nonC.ll (1736 of 2134) PASS: lldb-unit :: Utility/./UtilityTests/ProcessInstanceInfo.Yaml (1737 of 2134) PASS: lldb-unit :: UnwindAssembly/x86/./UnwindAssemblyx86Tests/Testx86AssemblyInspectionEngine.TestPushR15 (1738 of 2134) PASS: lldb-unit :: Utility/./UtilityTests/AnsiTerminal.Basic (1739 of 2134) PASS: lldb-api :: commands/expression/import-std-module/sysroot/TestStdModuleSysroot.py (1740 of 2134) PASS: lldb-unit :: Utility/./UtilityTests/StringExtractorTest.GetHexU8_InvalidHex (1741 of 2134) PASS: lldb-unit :: Utility/./UtilityTests/PassiveReplayTest.InstrumentedFoo (1742 of 2134) PASS: lldb-unit :: Utility/./UtilityTests/StreamTest.AddressNoSuffix (1743 of 2134) PASS: lldb-unit :: Symbol/./SymbolTests/LineEntryTest.GetSameLineContiguousAddressRangeOneInline (1744 of 2134) PASS: lldb-api :: functionalities/data-formatter/data-formatter-categories/TestDataFormatterCategories.py (1745 of 2134) PASS: lldb-unit :: Utility/./UtilityTests/ProcessInstanceInfoList.Yaml (1746 of 2134) PASS: lldb-shell :: SymbolFile/DWARF/debug-types-dwo-cross-reference.cpp (1747 of 2134) PASS: lldb-api :: functionalities/data-formatter/varscript_formatting/TestDataFormatterVarScriptFormatting.py (1748 of 2134) PASS: lldb-api :: functionalities/thread/concurrent_events/TestConcurrentWatchpointWithDelayWatchpointThreads.py (1749 of 2134) XFAIL: lldb-shell :: Unwind/prefer-debug-over-eh-frame.test (1750 of 2134) PASS: lldb-unit :: Utility/./UtilityTests/FileSpecTest.FileAndDirectoryComponents (1751 of 2134) PASS: lldb-unit :: Utility/./UtilityTests/DataExtractorTest.UncommonAddressSize (1752 of 2134) PASS: lldb-unit :: Utility/./UtilityTests/StringListTest.PopBack (1753 of 2134) PASS: lldb-shell :: SymbolFile/DWARF/dwarf5_locations.s (1754 of 2134) UNSUPPORTED: lldb-api :: functionalities/darwin_log/basic/TestDarwinLogBasic.py (1755 of 2134) PASS: lldb-unit :: Utility/./UtilityTests/LogTest.Register (1756 of 2134) PASS: lldb-shell :: Commands/command-disassemble-process.yaml (1757 of 2134) PASS: lldb-api :: functionalities/breakpoint/breakpoint_by_line_and_column/TestBreakpointByLineAndColumn.py (1758 of 2134) PASS: lldb-unit :: SymbolFile/NativePDB/./SymbolFileNativePDBTests/PDBFPOProgramToDWARFExpressionTests.InvalidOpUnary (1759 of 2134) UNSUPPORTED: lldb-api :: benchmarks/libcxxmap/TestBenchmarkLibcxxMap.py (1760 of 2134) PASS: lldb-shell :: ObjectFile/ELF/PT_LOAD-overlap-PT_TLS.yaml (1761 of 2134) PASS: lldb-api :: functionalities/dynamic_value_child_count/TestDynamicValueChildCount.py (1762 of 2134) PASS: lldb-unit :: SymbolFile/NativePDB/./SymbolFileNativePDBTests/PDBFPOProgramToDWARFExpressionTests.UnresolvedRegisterReference (1763 of 2134) PASS: lldb-unit :: Host/./HostTests/Host.GetEnvironment (1764 of 2134) UNSUPPORTED: lldb-api :: tools/lldb-server/TestGdbRemoteCompletion.py (1765 of 2134) PASS: lldb-unit :: Utility/./UtilityTests/CompletionRequest.TryCompleteCurrentArgGood (1766 of 2134) PASS: lldb-unit :: Utility/./UtilityTests/StreamTest.PutHex32ByteOrderLittle (1767 of 2134) PASS: lldb-shell :: ObjectFile/PECOFF/uuid.yaml (1768 of 2134) PASS: lldb-unit :: Language/CPlusPlus/./LanguageCPlusPlusTests/CPlusPlusLanguage.ExtractContextAndIdentifier (1769 of 2134) PASS: lldb-api :: functionalities/memory-region/TestMemoryRegion.py (1770 of 2134) PASS: lldb-unit :: ScriptInterpreter/Python/./ScriptInterpreterPythonTests/PythonDataObjectsTest.TestCallable (1771 of 2134) PASS: lldb-api :: functionalities/thread/thread_specific_break/TestThreadSpecificBreakpoint.py (1772 of 2134) PASS: lldb-api :: functionalities/inferior-crashing/TestInferiorCrashingStep.py (1773 of 2134) PASS: lldb-api :: commands/frame/diagnose/bad-reference/TestBadReference.py (1774 of 2134) PASS: lldb-api :: commands/expression/ir-interpreter/TestIRInterpreter.py (1775 of 2134) PASS: lldb-api :: functionalities/gdb_remote_client/TestRecognizeBreakpoint.py (1776 of 2134) PASS: lldb-unit :: Utility/./UtilityTests/ArgsTest.TestOverwriteArgs (1777 of 2134) PASS: lldb-unit :: ScriptInterpreter/Python/./ScriptInterpreterPythonTests/PythonDataObjectsTest.TestPythonFile (1778 of 2134) PASS: lldb-unit :: DataFormatter/./LLDBFormatterTests/TypeMatcherTests.CreatedBySameMatchStringExactNamePrefixes (1779 of 2134) PASS: lldb-api :: lang/cpp/constructors/TestCppConstructors.py (1780 of 2134) PASS: lldb-api :: lang/cpp/bitfields/TestCppBitfields.py (1781 of 2134) PASS: lldb-unit :: Core/./LLDBCoreTests/UniqueCStringMap.NoDefaultConstructor (1782 of 2134) PASS: lldb-unit :: UnwindAssembly/x86/./UnwindAssemblyx86Tests/Testx86AssemblyInspectionEngine.TestPopEDI (1783 of 2134) PASS: lldb-api :: functionalities/param_entry_vals/basic_entry_values/TestBasicEntryValues.py (1784 of 2134) PASS: lldb-api :: lang/objc/objc-struct-argument/TestObjCStructArgument.py (1785 of 2134) PASS: lldb-api :: tools/lldb-vscode/breakpoint/TestVSCode_setBreakpoints.py (1786 of 2134) PASS: lldb-api :: commands/gui/breakpoints/TestGuiBreakpoints.py (1787 of 2134) PASS: lldb-unit :: Utility/./UtilityTests/VMRange.Comparison (1788 of 2134) PASS: lldb-api :: commands/expression/import-std-module/shared_ptr/TestSharedPtrFromStdModule.py (1789 of 2134) PASS: lldb-api :: tools/lldb-vscode/module/TestVSCode_module.py (1790 of 2134) PASS: lldb-unit :: Utility/./UtilityTests/StringExtractorTest.GetHexBytes_Partial (1791 of 2134) PASS: lldb-api :: lang/objc/objc-new-syntax/TestObjCNewSyntaxDictionary.py (1792 of 2134) PASS: lldb-unit :: Utility/./UtilityTests/StreamTest.AddressSize (1793 of 2134) UNSUPPORTED: lldb-api :: functionalities/darwin_log/source/debug/TestDarwinLogSourceDebug.py (1794 of 2134) UNSUPPORTED: lldb-api :: functionalities/darwin_log/source/info/TestDarwinLogSourceInfo.py (1795 of 2134) PASS: lldb-shell :: SymbolFile/Breakpad/line-table-edgecases.test (1796 of 2134) PASS: lldb-api :: tools/lldb-vscode/coreFile/TestVSCode_coreFile.py (1797 of 2134) PASS: lldb-unit :: Utility/./UtilityTests/NameMatchesTest.Equals (1798 of 2134) PASS: lldb-api :: commands/frame/select/TestFrameSelect.py (1799 of 2134) PASS: lldb-api :: tools/lldb-server/TestGdbRemoteThreadsInStopReply.py (1800 of 2134) PASS: lldb-unit :: Utility/./UtilityTests/StreamTeeTest.AppendStream (1801 of 2134) PASS: lldb-unit :: Utility/./UtilityTests/Flags.AllSet (1802 of 2134) PASS: lldb-unit :: Symbol/./SymbolTests/TestClangASTImporter.MetadataPropagation (1803 of 2134) PASS: lldb-unit :: Utility/./UtilityTests/ArgsTest.TestSingleQuotedArgWithSpace (1804 of 2134) PASS: lldb-api :: functionalities/inferior-crashing/recursive-inferior/TestRecursiveInferior.py (1805 of 2134) PASS: lldb-unit :: Target/./TargetTests/PathMappingListTest.AbsoluteTests (1806 of 2134) PASS: lldb-api :: python_api/disassemble-raw-data/TestDisassembleRawData.py (1807 of 2134) PASS: lldb-unit :: Process/gdb-remote/./ProcessGdbRemoteTests/GDBRemoteCommunicationClientTest.SendSignalsToIgnore (1808 of 2134) PASS: lldb-shell :: SymbolFile/DWARF/gnu-style-compression.cpp (1809 of 2134) PASS: lldb-api :: python_api/hello_world/TestHelloWorld.py (1810 of 2134) PASS: lldb-unit :: ScriptInterpreter/Python/./ScriptInterpreterPythonTests/PythonDataObjectsTest.TestModuleNameResolutionNoDot (1811 of 2134) UNSUPPORTED: lldb-shell :: ObjectFile/ELF/minidebuginfo-no-lzma.yaml (1812 of 2134) PASS: lldb-api :: functionalities/data-formatter/data-formatter-stl/libstdcpp/unique_ptr/invalid/TestDataFormatterInvalidStdUniquePtr.py (1813 of 2134) PASS: lldb-unit :: SymbolFile/DWARF/./SymbolFileDWARFTests/SymbolFileDWARFTests.TestAbbrevOrder1Start1 (1814 of 2134) PASS: lldb-unit :: Interpreter/./InterpreterTests/OptionValueFileColonLine.setFromString (1815 of 2134) PASS: lldb-api :: lang/objc/modules-non-objc-target/TestObjCModulesNonObjCTarget.py (1816 of 2134) PASS: lldb-unit :: Utility/./UtilityTests/XcodeSDKTest.SDKSupportsSwift (1817 of 2134) PASS: lldb-unit :: Utility/./UtilityTests/Flags.AnySet (1818 of 2134) PASS: lldb-api :: functionalities/thread/concurrent_events/TestConcurrentSignalDelayBreak.py (1819 of 2134) PASS: lldb-shell :: SymbolFile/NativePDB/break-by-function.cpp (1820 of 2134) PASS: lldb-unit :: Utility/./UtilityTests/OptionsWithRawTest.EmptySuffixSingleWhitespace (1821 of 2134) PASS: lldb-unit :: SymbolFile/DWARF/./SymbolFileDWARFTests/SymbolFileDWARFTests.TestAbbrevOrder1Start5 (1822 of 2134) PASS: lldb-shell :: Minidump/dump-all.test (1823 of 2134) PASS: lldb-api :: functionalities/inferior-changed/TestInferiorChanged.py (1824 of 2134) PASS: lldb-unit :: ObjectFile/PECOFF/./ObjectFilePECOFFTests/PECallFrameInfoTest.Chained_eh (1825 of 2134) PASS: lldb-unit :: Utility/./UtilityTests/ListenerTest.GetEventImmediate (1826 of 2134) PASS: lldb-api :: commands/command/source/TestCommandSource.py (1827 of 2134) UNSUPPORTED: lldb-shell :: ScriptInterpreter/Lua/quit.test (1828 of 2134) PASS: lldb-unit :: SymbolFile/NativePDB/./SymbolFileNativePDBTests/PDBFPOProgramToDWARFExpressionTests.UnknownOp (1829 of 2134) PASS: lldb-api :: functionalities/stats_api/TestStatisticsAPI.py (1830 of 2134) PASS: lldb-unit :: Process/gdb-remote/./ProcessGdbRemoteTests/GDBRemoteClientBaseTest.SendContinueAndWait (1831 of 2134) PASS: lldb-api :: lang/objc/objc-new-syntax/TestObjCNewSyntaxLiteral.py (1832 of 2134) PASS: lldb-unit :: Utility/./UtilityTests/SubsystemRAIITest.SubsystemWithErrorFailure (1833 of 2134) PASS: lldb-api :: python_api/sbenvironment/TestSBEnvironment.py (1834 of 2134) PASS: lldb-api :: functionalities/gdb_remote_client/TestNoGPacketSupported.py (1835 of 2134) PASS: lldb-unit :: ScriptInterpreter/Python/./ScriptInterpreterPythonTests/PythonDataObjectsTest.TestExceptions (1836 of 2134) UNSUPPORTED: lldb-shell :: Register/x86-64-ymm16-write.test (1837 of 2134) PASS: lldb-api :: functionalities/data-formatter/data-formatter-objc/TestDataFormatterObjCCF.py (1838 of 2134) PASS: lldb-unit :: ScriptInterpreter/Python/./ScriptInterpreterPythonTests/PythonDataObjectsTest.TestGlobalNameResolutionNoDot (1839 of 2134) PASS: lldb-unit :: Utility/./UtilityTests/FileSpecTest.EqualDotsPosixRoot (1840 of 2134) PASS: lldb-api :: lang/objc/foundation/TestObjectDescriptionAPI.py (1841 of 2134) PASS: lldb-shell :: Reproducer/TestDiscard.test (1842 of 2134) PASS: lldb-unit :: Utility/./UtilityTests/ArchSpecTest.TestSetTriple (1843 of 2134) PASS: lldb-unit :: Utility/./UtilityTests/StringExtractorTest.GetHexU8_Underflow (1844 of 2134) PASS: lldb-unit :: Utility/./UtilityTests/BinaryStreamTest.PutSLEB128EightBytes (1845 of 2134) PASS: lldb-unit :: Host/./HostTests/MainLoopTest.TerminatesImmediately (1846 of 2134) PASS: lldb-api :: functionalities/signal/handle-abrt/TestHandleAbort.py (1847 of 2134) PASS: lldb-unit :: Utility/./UtilityTests/StreamTest.AddressRange (1848 of 2134) PASS: lldb-unit :: DataFormatter/./LLDBFormatterTests/TypeMatcherTests.CreatedBySameMatchString (1849 of 2134) PASS: lldb-unit :: Process/minidump/./LLDBMinidumpTests/MinidumpParserTest.GetMemoryRegionInfoLinuxMaps (1850 of 2134) PASS: lldb-api :: functionalities/pointer_num_children/TestPointerNumChildren.py (1851 of 2134) PASS: lldb-api :: commands/register/register/register_command/TestRegisters.py (1852 of 2134) PASS: lldb-api :: functionalities/data-formatter/data-formatter-objc/TestDataFormatterObjCNSError.py (1853 of 2134) PASS: lldb-unit :: Utility/./UtilityTests/StreamTeeTest.GetStreamAtIndexOutOfBounds (1854 of 2134) PASS: lldb-unit :: Platform/./LLDBPlatformTests/PlatformDarwinTest.FindComponentInPath (1855 of 2134) PASS: lldb-api :: functionalities/testid/TestTestId.py (1856 of 2134) PASS: lldb-unit :: Utility/./UtilityTests/TimeoutTest.Construction (1857 of 2134) PASS: lldb-api :: commands/expression/radar_9673664/TestExprHelpExamples.py (1858 of 2134) PASS: lldb-api :: lang/cpp/nsimport/TestCppNsImport.py (1859 of 2134) PASS: lldb-api :: functionalities/thread/concurrent_events/TestConcurrentSignalWatchBreak.py (1860 of 2134) PASS: lldb-unit :: Utility/./UtilityTests/NameMatchesTest.Contains (1861 of 2134) PASS: lldb-api :: lang/c/step-target/TestStepTarget.py (1862 of 2134) PASS: lldb-unit :: Utility/./UtilityTests/ArchSpecTest.Compatibility (1863 of 2134) PASS: lldb-unit :: Host/./HostTests/HostInfoTest.GetAugmentedArchSpec (1864 of 2134) UNSUPPORTED: lldb-api :: functionalities/thread/multi_break/TestMultipleBreakpoints.py (1865 of 2134) PASS: lldb-unit :: Host/./HostTests/FileSystemTest.OpenErrno (1866 of 2134) PASS: lldb-api :: commands/target/basic/TestTargetCommand.py (1867 of 2134) PASS: lldb-api :: lang/c/step_over_no_deadlock/TestStepOverDoesntBlock.py (1868 of 2134) PASS: lldb-unit :: Host/./HostTests/ConnectionFileDescriptorTest.TCPGetURIv4 (1869 of 2134) PASS: lldb-api :: lang/objc/objc-optimized/TestObjcOptimized.py (1870 of 2134) PASS: lldb-unit :: Utility/./UtilityTests/StringListTest.ForRangeEmpty (1871 of 2134) PASS: lldb-api :: commands/target/stop-hook/enable/TestTargetStopHookEnable.py (1872 of 2134) PASS: lldb-unit :: Utility/./UtilityTests/StateTest.Formatv (1873 of 2134) PASS: lldb-unit :: Process/minidump/./LLDBMinidumpTests/MinidumpParserTest.MinidumpModuleOrder (1874 of 2134) PASS: lldb-shell :: SymbolFile/DWARF/DW_AT_low_pc-addrx.s (1875 of 2134) PASS: lldb-unit :: Platform/Android/./AdbClientTests/AdbClientTest.CreateByDeviceId (1876 of 2134) PASS: lldb-api :: commands/version/TestVersion.py (1877 of 2134) PASS: lldb-api :: functionalities/data-formatter/type_summary_list_script/TestTypeSummaryListScript.py (1878 of 2134) PASS: lldb-api :: functionalities/breakpoint/breakpoint_ids/TestBreakpointIDs.py (1879 of 2134) PASS: lldb-unit :: Utility/./UtilityTests/UriParserTest.SchemeHostSeparator2 (1880 of 2134) UNSUPPORTED: lldb-shell :: SymbolFile/DWARF/split-dwarf-expression-eval-bug.cpp (1881 of 2134) PASS: lldb-api :: functionalities/breakpoint/inlined_breakpoints/TestInlinedBreakpoints.py (1882 of 2134) PASS: lldb-api :: lang/cpp/class_types/TestClassTypesDisassembly.py (1883 of 2134) PASS: lldb-unit :: Symbol/./SymbolTests/TestTypeSystemClang.TestGetBasicTypeFromName (1884 of 2134) PASS: lldb-unit :: Utility/./UtilityTests/RangeTest.Equal (1885 of 2134) PASS: lldb-shell :: Commands/command-script-import.test (1886 of 2134) PASS: lldb-unit :: Utility/./UtilityTests/StringExtractorTest.GetNameColonValueContainsColon (1887 of 2134) PASS: lldb-unit :: Utility/./UtilityTests/UriParserTest.BracketedHostname (1888 of 2134) PASS: lldb-api :: functionalities/thread/concurrent_events/TestConcurrentWatchpointDelayWatchpointOneBreakpoint.py (1889 of 2134) PASS: lldb-api :: functionalities/data-formatter/language_category_updates/TestDataFormatterLanguageCategoryUpdates.py (1890 of 2134) PASS: lldb-unit :: Expression/./ExpressionTests/CppModuleConfigurationTest.MissingLibCpp (1891 of 2134) PASS: lldb-unit :: UnwindAssembly/x86/./UnwindAssemblyx86Tests/Testx86AssemblyInspectionEngine.TestLEAVE (1892 of 2134) PASS: lldb-unit :: Symbol/./SymbolTests/TestClangASTImporter.CanImportInvalidType (1893 of 2134) PASS: lldb-unit :: ObjectFile/Breakpad/./ObjectFileBreakpadTests/PublicRecord.parse (1894 of 2134) PASS: lldb-api :: commands/watchpoints/watchpoint_commands/command/TestWatchpointCommandPython.py (1895 of 2134) PASS: lldb-unit :: Utility/./UtilityTests/ArchSpecTest.OperatorBool (1896 of 2134) PASS: lldb-shell :: SymbolFile/DWARF/dwarf5-atomic.s (1897 of 2134) UNSUPPORTED: lldb-api :: tools/lldb-server/TestGdbRemoteAuxvSupport.py (1898 of 2134) PASS: lldb-api :: lang/objc/ivar-IMP/TestObjCiVarIMP.py (1899 of 2134) PASS: lldb-api :: functionalities/data-formatter/hexcaps/TestDataFormatterHexCaps.py (1900 of 2134) PASS: lldb-api :: python_api/sbdata/TestSBData.py (1901 of 2134) PASS: lldb-shell :: ObjectFile/MachO/lc_build_version_notools.yaml (1902 of 2134) PASS: lldb-api :: lang/c/unions/TestUnionMembers.py (1903 of 2134) PASS: lldb-shell :: Reproducer/TestPythonImport.test (1904 of 2134) PASS: lldb-api :: commands/help/TestHelp.py (1905 of 2134) PASS: lldb-unit :: Utility/./UtilityTests/OptionsWithRawTest.SingleWordSuffix (1906 of 2134) PASS: lldb-shell :: Reproducer/Functionalities/TestImageList.test (1907 of 2134) PASS: lldb-unit :: Utility/./UtilityTests/UriParserTest.PortOverflow (1908 of 2134) PASS: lldb-api :: commands/gui/viewlarge/TestGuiViewLarge.py (1909 of 2134) PASS: lldb-unit :: Process/gdb-remote/./ProcessGdbRemoteTests/GDBRemoteCommunicationServerTest.SendErrorResponse_StringError (1910 of 2134) PASS: lldb-api :: python_api/disassemble-raw-data/TestDisassemble_VST1_64.py (1911 of 2134) PASS: lldb-api :: lang/objc/foundation/TestObjCMethods2.py (1912 of 2134) PASS: lldb-unit :: Utility/./UtilityTests/DataExtractorTest.GetFloatUnaligned (1913 of 2134) PASS: lldb-api :: commands/expression/save_jit_objects/TestSaveJITObjects.py (1914 of 2134) PASS: lldb-api :: sample_test/TestSampleInlineTest.py (1915 of 2134) PASS: lldb-api :: commands/quit/TestQuit.py (1916 of 2134) PASS: lldb-api :: tools/lldb-vscode/console/TestVSCode_console.py (1917 of 2134) PASS: lldb-unit :: UnwindAssembly/x86/./UnwindAssemblyx86Tests/Testx86AssemblyInspectionEngine.Test32BitOnlyInstruction (1918 of 2134) PASS: lldb-unit :: Utility/./UtilityTests/StreamTest.AddressSuffix (1919 of 2134) PASS: lldb-unit :: Utility/./UtilityTests/DataExtractorTest.GetMaxU64_unchecked (1920 of 2134) PASS: lldb-unit :: Utility/./UtilityTests/ArgsTest.TestUnknownEscape (1921 of 2134) PASS: lldb-unit :: Utility/./UtilityTests/UriParserTest.TypicalPortPathIPv4 (1922 of 2134) PASS: lldb-api :: functionalities/ubsan/user-expression/TestUbsanUserExpression.py (1923 of 2134) PASS: lldb-unit :: Utility/./UtilityTests/LogChannelTest.Enable (1924 of 2134) PASS: lldb-unit :: UnwindAssembly/x86/./UnwindAssemblyx86Tests/Testx86AssemblyInspectionEngine.TestPopEBX (1925 of 2134) PASS: lldb-api :: commands/frame/diagnose/inheritance/TestDiagnoseInheritance.py (1926 of 2134) UNSUPPORTED: lldb-api :: functionalities/darwin_log/filter/exact_match/activity/TestDarwinLogFilterMatchActivity.py (1927 of 2134) PASS: lldb-api :: functionalities/data-formatter/data-formatter-objc/cmtime/TestDataFormatterCMTime.py (1928 of 2134) PASS: lldb-unit :: Utility/./UtilityTests/ArgsTest.GetArgumentArrayRef (1929 of 2134) PASS: lldb-unit :: Process/minidump/./LLDBMinidumpTests/MinidumpParserTest.GetPidWow64 (1930 of 2134) PASS: lldb-unit :: Utility/./UtilityTests/VASprintfTest.EncodingError (1931 of 2134) PASS: lldb-unit :: Utility/./UtilityTests/RegularExpression.CopyAssignment (1932 of 2134) UNSUPPORTED: lldb-api :: commands/register/register/intel_xtended_registers/TestMPXRegisters.py (1933 of 2134) PASS: lldb-api :: commands/expression/weak_symbols/TestWeakSymbols.py (1934 of 2134) PASS: lldb-api :: python_api/process/read-mem-cstring/TestReadMemCString.py (1935 of 2134) UNSUPPORTED: lldb-api :: functionalities/longjmp/TestLongjmp.py (1936 of 2134) PASS: lldb-api :: commands/expression/entry-bp/TestExprEntryBP.py (1937 of 2134) PASS: lldb-unit :: Utility/./UtilityTests/TimerTest.CategoryTimesStats (1938 of 2134) PASS: lldb-unit :: Process/gdb-remote/./ProcessGdbRemoteTests/GDBRemoteCommunicationClientTest.SendStartTracePacket (1939 of 2134) UNSUPPORTED: lldb-api :: lang/objc/rdar-12408181/TestRdar12408181.py (1940 of 2134) PASS: lldb-api :: lang/objcxx/hide-runtime-values/TestObjCXXHideRuntimeValues.py (1941 of 2134) PASS: lldb-shell :: SymbolFile/DWARF/DW_AT_const_value-bitfields.s (1942 of 2134) PASS: lldb-unit :: tools/lldb-server/tests/./LLDBServerTests/TestBase.LaunchModePreservesEnvironment (1943 of 2134) PASS: lldb-unit :: Utility/./UtilityTests/GeneratorTest.GetOrCreate (1944 of 2134) PASS: lldb-unit :: Symbol/./SymbolTests/TestTypeSystemClang.TemplateArguments (1945 of 2134) PASS: lldb-unit :: Utility/./UtilityTests/SerializationRountripTest.SerializeDeserializeCStringArrayNullptr (1946 of 2134) PASS: lldb-shell :: Driver/TestProcessAttach.test (1947 of 2134) PASS: lldb-unit :: DataFormatter/./LLDBFormatterTests/FormatManagerTests.CompatibleLangs (1948 of 2134) PASS: lldb-unit :: Process/./ProcessEventDataTests/ProcessEventDataTest.ShouldStop (1949 of 2134) PASS: lldb-unit :: Utility/./UtilityTests/AnsiTerminal.AtEnd (1950 of 2134) PASS: lldb-unit :: Process/gdb-remote/./ProcessGdbRemoteTests/GDBRemoteCommunicationClientTest.GetMemoryRegionInfo (1951 of 2134) PASS: lldb-unit :: Process/minidump/./LLDBMinidumpTests/MinidumpParserTest.GetFilteredModuleList (1952 of 2134) PASS: lldb-unit :: Utility/./UtilityTests/StringListTest.InsertStringAtIndexOutOfBounds (1953 of 2134) PASS: lldb-unit :: Utility/./UtilityTests/StreamTest.AddressRangeSize (1954 of 2134) UNSUPPORTED: lldb-shell :: SymbolFile/PDB/ast-restore.test (1955 of 2134) PASS: lldb-api :: lang/objc/variadic_methods/TestVariadicMethods.py (1956 of 2134) PASS: lldb-unit :: Utility/./UtilityTests/BinaryStreamTest.PutULEB128SevenBytes (1957 of 2134) PASS: lldb-api :: functionalities/thread/concurrent_events/TestConcurrentSignalWatch.py (1958 of 2134) PASS: lldb-unit :: Utility/./UtilityTests/FileSpecTest.IsRelative (1959 of 2134) PASS: lldb-api :: lang/cpp/accelerator-table/TestCPPAccelerator.py (1960 of 2134) PASS: lldb-unit :: Utility/./UtilityTests/RangeTest.ContainsRangeStartingFromZero (1961 of 2134) PASS: lldb-api :: functionalities/load_unload/TestLoadUnload.py (1962 of 2134) PASS: lldb-unit :: ObjectFile/PECOFF/./ObjectFilePECOFFTests/PECallFrameInfoTest.Frame_reg_eh (1963 of 2134) PASS: lldb-unit :: Symbol/./SymbolTests/TestTypeSystemClang.TestBuiltinTypeForEncodingAndBitSize (1964 of 2134) PASS: lldb-shell :: Quit/TestQuitExitCodeNonInt.test (1965 of 2134) PASS: lldb-api :: commands/expression/import-std-module/unique_ptr-dbg-info-content/TestUniquePtrDbgInfoContent.py (1966 of 2134) PASS: lldb-unit :: Utility/./UtilityTests/StringExtractorTest.DecodeHexU8_Underflow2 (1967 of 2134) PASS: lldb-api :: commands/command/script_alias/TestCommandScriptAlias.py (1968 of 2134) PASS: lldb-shell :: ObjectFile/ELF/build-id-case.yaml (1969 of 2134) PASS: lldb-unit :: Utility/./UtilityTests/BinaryStreamTest.PutULEB128One (1970 of 2134) PASS: lldb-api :: commands/expression/issue_11588/Test11588.py (1971 of 2134) PASS: lldb-shell :: ObjectFile/Breakpad/discontiguous-sections.test (1972 of 2134) PASS: lldb-shell :: SymbolFile/DWARF/find-basic-type.cpp (1973 of 2134) PASS: lldb-api :: functionalities/thread/concurrent_events/TestConcurrentWatchBreak.py (1974 of 2134) PASS: lldb-api :: tools/lldb-server/inferior-crash/TestGdbRemoteSegFault.py (1975 of 2134) PASS: lldb-api :: functionalities/thread/num_threads/TestNumThreads.py (1976 of 2134) PASS: lldb-api :: commands/command/invalid-args/TestInvalidArgsCommand.py (1977 of 2134) PASS: lldb-unit :: UnwindAssembly/x86/./UnwindAssemblyx86Tests/Testx86AssemblyInspectionEngine.TestSubRSP (1978 of 2134) PASS: lldb-unit :: Target/./TargetTests/MemoryRegionInfoTest.Formatv (1979 of 2134) PASS: lldb-api :: functionalities/data-formatter/poarray/TestPrintObjectArray.py (1980 of 2134) PASS: lldb-unit :: Core/./LLDBCoreTests/ModuleSpecTest.InvalidInMemoryBuffer (1981 of 2134) PASS: lldb-api :: functionalities/process_group/TestChangeProcessGroup.py (1982 of 2134) PASS: lldb-shell :: ScriptInterpreter/Python/crashlog.test (1983 of 2134) PASS: lldb-api :: functionalities/tail_call_frames/ambiguous_tail_call_seq2/TestAmbiguousTailCallSeq2.py (1984 of 2134) PASS: lldb-api :: functionalities/type_lookup/TestTypeLookup.py (1985 of 2134) UNSUPPORTED: lldb-api :: tools/lldb-server/TestGdbRemote_vContThreads.py (1986 of 2134) PASS: lldb-unit :: Utility/./UtilityTests/StringListTest.ShiftStdString (1987 of 2134) PASS: lldb-unit :: ScriptInterpreter/Python/./ScriptInterpreterPythonTests/PythonDataObjectsTest.TestPythonCallableCheck (1988 of 2134) PASS: lldb-api :: lang/cpp/char1632_t/TestChar1632T.py (1989 of 2134) PASS: lldb-api :: functionalities/data-formatter/data-formatter-script/TestDataFormatterScript.py (1990 of 2134) PASS: lldb-api :: functionalities/inferior-crashing/TestInferiorCrashing.py (1991 of 2134) PASS: lldb-unit :: UnwindAssembly/x86/./UnwindAssemblyx86Tests/Testx86AssemblyInspectionEngine.TestPushECX (1992 of 2134) PASS: lldb-api :: api/listeners/TestListener.py (1993 of 2134) PASS: lldb-unit :: Process/minidump/./LLDBMinidumpTests/RegisterContextMinidump.ConvertMinidumpContext_x86_32 (1994 of 2134) PASS: lldb-unit :: Utility/./UtilityTests/DataExtractorTest.GetFloat (1995 of 2134) PASS: lldb-shell :: Driver/TestUseColor.test (1996 of 2134) PASS: lldb-shell :: SymbolFile/NativePDB/source-list.cpp (1997 of 2134) PASS: lldb-unit :: Utility/./UtilityTests/StreamTest.PutSLEB128 (1998 of 2134) PASS: lldb-unit :: UnwindAssembly/x86/./UnwindAssemblyx86Tests/Testx86AssemblyInspectionEngine.TestPushRBPWithREX (1999 of 2134) PASS: lldb-api :: functionalities/data-formatter/data-formatter-objc/TestDataFormatterObjCExpr.py (2000 of 2134) UNSUPPORTED: lldb-api :: lang/cpp/printf/TestPrintf.py (2001 of 2134) PASS: lldb-unit :: Language/Highlighting/./HighlighterTests/HighlighterTest.ClangTrailingBackslashWithWhitespace (2002 of 2134) PASS: lldb-api :: functionalities/breakpoint/dummy_target_breakpoints/TestBreakpointsWithNoTargets.py (2003 of 2134) PASS: lldb-api :: api/multiple-debuggers/TestMultipleDebuggers.py (2004 of 2134) PASS: lldb-shell :: Commands/command-target-modules-dump-sections.yaml (2005 of 2134) UNSUPPORTED: lldb-api :: commands/watchpoints/variable_out_of_scope/TestWatchedVarHitWhenInScope.py (2006 of 2134) PASS: lldb-api :: types/TestFloatTypes.py (2007 of 2134) PASS: lldb-unit :: Utility/./UtilityTests/DataExtractorTest.GetMaxS64 (2008 of 2134) PASS: lldb-unit :: Utility/./UtilityTests/RangeTest.Clear (2009 of 2134) PASS: lldb-api :: source-manager/TestSourceManager.py (2010 of 2134) PASS: lldb-api :: commands/thread/select/TestThreadSelect.py (2011 of 2134) UNSUPPORTED: lldb-api :: benchmarks/startup/TestStartupDelays.py (2012 of 2134) PASS: lldb-api :: functionalities/load_using_paths/TestLoadUsingPaths.py (2013 of 2134) UNSUPPORTED: lldb-api :: functionalities/darwin_log/filter/regex/activity/TestDarwinLogFilterRegexActivity.py (2014 of 2134) PASS: lldb-unit :: Utility/./UtilityTests/StreamTest.AddressEmptyPrefix (2015 of 2134) UNSUPPORTED: lldb-api :: tools/lldb-server/thread-name/TestGdbRemoteThreadName.py (2016 of 2134) PASS: lldb-api :: functionalities/breakpoint/consecutive_breakpoints/TestConsecutiveBreakpoints.py (2017 of 2134) PASS: lldb-unit :: Utility/./UtilityTests/StreamTest.PutCString (2018 of 2134) PASS: lldb-unit :: Symbol/./SymbolTests/TestTypeSystemClang.TestGetTypeClassDeclType (2019 of 2134) UNSUPPORTED: lldb-shell :: ExecControl/StopHook/stop-hook-threads.test (2020 of 2134) PASS: lldb-shell :: SymbolFile/Breakpad/stack-cfi-arm.yaml (2021 of 2134) PASS: lldb-shell :: ObjectFile/wasm/unified-debug-sections.yaml (2022 of 2134) PASS: lldb-shell :: Reproducer/Functionalities/TestExpressionEvaluation.test (2023 of 2134) PASS: lldb-unit :: Process/minidump/./LLDBMinidumpTests/MinidumpParserTest.GetThreadsAndGetThreadContext (2024 of 2134) PASS: lldb-unit :: Symbol/./SymbolTests/TestTypeSystemClang.TestDisplayNameEmpty (2025 of 2134) PASS: lldb-shell :: Minidump/disassemble-no-module.yaml (2026 of 2134) PASS: lldb-shell :: SymbolFile/DWARF/debug-types-basic.test (2027 of 2134) PASS: lldb-shell :: SymbolFile/DWARF/limit-debug-info.s (2028 of 2134) UNSUPPORTED: lldb-shell :: Unwind/eh-frame-augment-noop.test (2029 of 2134) PASS: lldb-unit :: Host/./HostTests/SocketTest.DomainGetConnectURI (2030 of 2134) PASS: lldb-shell :: Reproducer/TestFileRepro.test (2031 of 2134) PASS: lldb-unit :: Expression/./ExpressionTests/DiagnosticManagerTest.GetStringPreserveOrder (2032 of 2134) PASS: lldb-unit :: Process/gdb-remote/./ProcessGdbRemoteTests/GDBRemoteClientBaseTest.SendContinueDelegateInterface (2033 of 2134) PASS: lldb-unit :: Interpreter/./InterpreterTests/OptionArgParserTest.toScriptLanguage (2034 of 2134) PASS: lldb-unit :: Host/./HostTests/HostInfoTest.GetXcodeSDK (2035 of 2134) PASS: lldb-unit :: Utility/./UtilityTests/StreamTest.PutULEB128 (2036 of 2134) PASS: lldb-unit :: ObjectFile/Breakpad/./ObjectFileBreakpadTests/LineRecord.parse (2037 of 2134) PASS: lldb-shell :: SymbolFile/DWARF/debug-names-compressed.cpp (2038 of 2134) PASS: lldb-unit :: DataFormatter/./LLDBFormatterTests/TypeMatcherTests.GetMatchStringRegex (2039 of 2134) PASS: lldb-unit :: Utility/./UtilityTests/StreamTest.PutBytesAsRawHex8ToBigEndian (2040 of 2134) PASS: lldb-shell :: Driver/TestTarget.test (2041 of 2134) PASS: lldb-api :: commands/watchpoints/watchpoint_commands/TestWatchpointCommands.py (2042 of 2134) PASS: lldb-api :: tools/lldb-server/TestAppleSimulatorOSType.py (2043 of 2134) UNSUPPORTED: lldb-api :: functionalities/thread/create_during_step/TestCreateDuringStep.py (2044 of 2134) PASS: lldb-unit :: Utility/./UtilityTests/StreamTest.PutBytesAsRawHex8ToMixedEndian (2045 of 2134) PASS: lldb-api :: python_api/formatters/TestFormattersSBAPI.py (2046 of 2134) PASS: lldb-api :: functionalities/breakpoint/serialize/TestBreakpointSerialization.py (2047 of 2134) PASS: lldb-shell :: ObjectFile/wasm/embedded-debug-sections.yaml (2048 of 2134) PASS: lldb-unit :: tools/lldb-server/tests/./LLDBServerTests/TestBase.DebugserverEnv (2049 of 2134) PASS: lldb-shell :: ObjectFile/ELF/PT_LOAD-overlap-section.yaml (2050 of 2134) PASS: lldb-unit :: UnwindAssembly/x86/./UnwindAssemblyx86Tests/Testx86AssemblyInspectionEngine.Test32bitFramelessBigStackFrame (2051 of 2134) PASS: lldb-api :: lang/cpp/virtual-functions/TestCppVirtualFunctions.py (2052 of 2134) PASS: lldb-unit :: Utility/./UtilityTests/ProcessInstanceInfo.DumpTable_invalidUID (2053 of 2134) PASS: lldb-unit :: Host/./HostTests/MainLoopTest.Signal (2054 of 2134) PASS: lldb-unit :: Symbol/./SymbolTests/TestTypeSystemClang.TestRecordHasFields (2055 of 2134) PASS: lldb-unit :: Process/minidump/./LLDBMinidumpTests/MinidumpParserTest.InvalidMinidump (2056 of 2134) PASS: lldb-unit :: Utility/./UtilityTests/UriParserTest.BracketedHostnameWithColon (2057 of 2134) PASS: lldb-api :: functionalities/exec/TestExec.py (2058 of 2134) PASS: lldb-api :: functionalities/step-avoids-no-debug/TestStepNoDebug.py (2059 of 2134) PASS: lldb-unit :: ObjectFile/Breakpad/./ObjectFileBreakpadTests/FileRecord.parse (2060 of 2134) PASS: lldb-unit :: UnwindAssembly/x86/./UnwindAssemblyx86Tests/Testx86AssemblyInspectionEngine.TestStackRealignMSVC_i386 (2061 of 2134) PASS: lldb-unit :: Utility/./UtilityTests/CompletionRequest.DuplicateFilteringWithComments (2062 of 2134) PASS: lldb-api :: functionalities/thread/state_after_expression/TestStateAfterExpression.py (2063 of 2134) UNSUPPORTED: lldb-api :: functionalities/data-formatter/data-formatter-stl/libstdcpp/vbool/TestDataFormatterStdVBool.py (2064 of 2134) PASS: lldb-unit :: Host/./HostTests/MainLoopTest.ReadObject (2065 of 2134) PASS: lldb-unit :: debugserver/./debugserverTests/JSON.Parse (2066 of 2134) PASS: lldb-api :: commands/expression/test/TestExprs2.py (2067 of 2134) PASS: lldb-unit :: Core/./LLDBCoreTests/CommunicationTest.SynchronizeWhileClosing (2068 of 2134) PASS: lldb-unit :: Utility/./UtilityTests/StringExtractorTest.GetHexU8_Extra_NoEof (2069 of 2134) PASS: lldb-api :: python_api/sbvalue_const_addrof/TestSBValueConstAddrOf.py (2070 of 2134) PASS: lldb-unit :: Process/gdb-remote/./ProcessGdbRemoteTests/GDBRemoteCommunicationServerTest.SendErrorResponse_Status (2071 of 2134) PASS: lldb-shell :: SymbolFile/Breakpad/unwind-via-stack-win-no-memory-info.yaml (2072 of 2134) PASS: lldb-unit :: Expression/./ExpressionTests/DiagnosticManagerTest.GetStringNoDiags (2073 of 2134) PASS: lldb-api :: python_api/process/TestProcessAPI.py (2074 of 2134) PASS: lldb-unit :: Symbol/./SymbolTests/PostfixExpression.ParseOneExpression (2075 of 2134) PASS: lldb-unit :: Utility/./UtilityTests/StreamTest.PutCharWhitespace (2076 of 2134) PASS: lldb-unit :: Utility/./UtilityTests/RangeTest.DoesIntersect (2077 of 2134) PASS: lldb-api :: commands/watchpoints/hello_watchpoint/TestMyFirstWatchpoint.py (2078 of 2134) PASS: lldb-api :: lang/objc/objc-stepping/TestObjCStepping.py (2079 of 2134) PASS: lldb-api :: types/TestFloatTypesExpr.py (2080 of 2134) PASS: lldb-unit :: Utility/./UtilityTests/VMRange.ContainsAddr (2081 of 2134) PASS: lldb-unit :: Utility/./UtilityTests/StringExtractorTest.GetHexU8_Extra (2082 of 2134) PASS: lldb-unit :: Target/./TargetTests/ExecutionContextTest.GetByteOrder (2083 of 2134) PASS: lldb-api :: functionalities/thread_plan/TestThreadPlanCommands.py (2084 of 2134) PASS: lldb-shell :: ObjectFile/PECOFF/sections-names.yaml (2085 of 2134) PASS: lldb-unit :: ScriptInterpreter/Python/./ScriptInterpreterPythonTests/PythonDataObjectsTest.TestResetting (2086 of 2134) PASS: lldb-unit :: Language/Highlighting/./HighlighterTests/HighlighterTest.ClangEmptyInput (2087 of 2134) PASS: lldb-unit :: Utility/./UtilityTests/StringListTest.Join (2088 of 2134) PASS: lldb-unit :: Process/minidump/./LLDBMinidumpTests/MinidumpParserTest.GetMemoryRegionInfoFromMemory64List (2089 of 2134) PASS: lldb-unit :: UnwindAssembly/x86/./UnwindAssemblyx86Tests/Testx86AssemblyInspectionEngine.TestPushRBX (2090 of 2134) PASS: lldb-api :: commands/target/stop-hook/delete/TestTargetStopHookDelete.py (2091 of 2134) PASS: lldb-api :: lang/cpp/template-function/TestTemplateFunctions.py (2092 of 2134) PASS: lldb-unit :: DataFormatter/./LLDBFormatterTests/TypeMatcherTests.RegexName (2093 of 2134) PASS: lldb-shell :: Expr/TestIRMemoryMap.test (2094 of 2134) PASS: lldb-api :: commands/frame/diagnose/dereference-function-return/TestDiagnoseDereferenceFunctionReturn.py (2095 of 2134) PASS: lldb-shell :: ObjectFile/MachO/lc_version_min.yaml (2096 of 2134) PASS: lldb-shell :: SymbolFile/NativePDB/nested-types.cpp (2097 of 2134) PASS: lldb-unit :: Utility/./UtilityTests/StreamTeeTest.SetStreamAtIndexOutOfBounds (2098 of 2134) PASS: lldb-unit :: Host/./HostTests/FileSystemTest.GetPermissions (2099 of 2134) PASS: lldb-unit :: Language/Highlighting/./HighlighterTests/HighlighterTest.ClangCommas (2100 of 2134) PASS: lldb-shell :: Process/UnsupportedLanguage.test (2101 of 2134) PASS: lldb-unit :: Utility/./UtilityTests/FileSpecTest.CopyByAppendingPathComponent (2102 of 2134) PASS: lldb-api :: functionalities/thread/exit_during_step/TestExitDuringStep.py (2103 of 2134) PASS: lldb-unit :: Expression/./ExpressionTests/CppModuleConfigurationTest.Linux (2104 of 2134) PASS: lldb-api :: functionalities/data-formatter/data-formatter-disabling/TestDataFormatterDisabling.py (2105 of 2134) PASS: lldb-shell :: Driver/TestFile.test (2106 of 2134) PASS: lldb-api :: commands/expression/import-std-module/vector/TestVectorFromStdModule.py (2107 of 2134) PASS: lldb-unit :: Utility/./UtilityTests/StreamTest.ChangingByteOrder (2108 of 2134) PASS: lldb-unit :: Expression/./ExpressionTests/DiagnosticManagerTest.AppendMessageAttachToLastDiag (2109 of 2134) UNSUPPORTED: lldb-api :: benchmarks/libcxxlist/TestBenchmarkLibcxxList.py (2110 of 2134) PASS: lldb-unit :: Utility/./UtilityTests/UriParserTest.BadPort2 (2111 of 2134) PASS: lldb-api :: functionalities/breakpoint/move_nearest/TestMoveNearest.py (2112 of 2134) PASS: lldb-api :: lang/cpp/unicode-literals/TestUnicodeLiterals.py (2113 of 2134) PASS: lldb-api :: functionalities/data-formatter/data-formatter-stl/libcxx/unordered/TestDataFormatterUnordered.py (2114 of 2134) PASS: lldb-unit :: Disassembler/./DisassemblerTests/TestArm64Disassembly.TestArmv81Instruction (2115 of 2134) PASS: lldb-unit :: SymbolFile/DWARF/./SymbolFileDWARFTests/SymbolFileDWARFTests.TestAbbrevValidAttrNullForm (2116 of 2134) PASS: lldb-api :: api/multithreaded/TestMultithreaded.py (2117 of 2134) PASS: lldb-api :: macosx/find-dsym/bundle-with-dot-in-filename/TestBundleWithDotInFilename.py (2118 of 2134) PASS: lldb-unit :: Utility/./UtilityTests/SerializationRountripTest.SerializeDeserializeCStringNull (2119 of 2134) PASS: lldb-api :: functionalities/memory/cache/TestMemoryCache.py (2120 of 2134) PASS: lldb-api :: terminal/TestSTTYBeforeAndAfter.py (2121 of 2134) PASS: lldb-api :: lang/cpp/covariant-return-types/TestCovariantReturnTypes.py (2122 of 2134) PASS: lldb-api :: lang/c/global_variables/TestGlobalVariables.py (2123 of 2134) PASS: lldb-unit :: Utility/./UtilityTests/ArchSpecTest.MergeFrom (2124 of 2134) UNSUPPORTED: lldb-shell :: SymbolFile/PDB/function-level-linking.test (2125 of 2134) PASS: lldb-api :: functionalities/thread/concurrent_events/TestConcurrentDelayedCrashWithBreakpointWatchpoint.py (2126 of 2134) PASS: lldb-api :: python_api/default-constructor/TestDefaultConstructorForAPIObjects.py (2127 of 2134) PASS: lldb-api :: functionalities/data-formatter/data-formatter-cpp/TestDataFormatterCpp.py (2128 of 2134) PASS: lldb-unit :: Process/minidump/./LLDBMinidumpTests/MinidumpParserTest.GetMiscInfoWindows (2129 of 2134) PASS: lldb-unit :: Process/minidump/./LLDBMinidumpTests/MinidumpParserTest.GetArchitecture (2130 of 2134) PASS: lldb-api :: functionalities/tsan/cpp_global_location/TestTsanCPPGlobalLocation.py (2131 of 2134) PASS: lldb-api :: commands/expression/persist_objc_pointeetype/TestPersistObjCPointeeType.py (2132 of 2134) PASS: lldb-api :: functionalities/data-formatter/data-formatter-objc/nsstring/TestDataFormatterNSString.py (2133 of 2134) PASS: lldb-api :: lang/c/anonymous/TestAnonymous.py (2134 of 2134) Slowest Tests: -------------------------------------------------------------------------- 368.95s: lldb-api :: macosx/simulator/TestSimulatorPlatform.py 210.49s: lldb-api :: python_api/target/TestTargetAPI.py 114.95s: lldb-api :: lang/objc/hidden-ivars/TestHiddenIvars.py 103.65s: lldb-api :: lang/objc/foundation/TestObjCMethodsString.py 101.29s: lldb-api :: functionalities/gdb_remote_client/TestGDBRemoteLoad.py 99.62s: lldb-api :: tools/lldb-server/TestLldbGdbServer.py 96.70s: lldb-api :: python_api/function_symbol/TestSymbolAPI.py 94.31s: lldb-api :: lang/cpp/call-function/TestCallCPPFunction.py 93.37s: lldb-api :: commands/expression/import-std-module/list/TestListFromStdModule.py 72.98s: lldb-api :: types/TestLongTypesExpr.py 62.21s: lldb-api :: lang/cpp/enum_types/TestCPP11EnumTypes.py 55.29s: lldb-api :: lang/objc/exceptions/TestObjCExceptions.py 54.05s: lldb-api :: functionalities/completion/TestCompletion.py 53.15s: lldb-api :: lang/objc/foundation/TestObjCMethods.py 52.42s: lldb-api :: lang/objc/foundation/TestFoundationDisassembly.py 47.72s: lldb-api :: api/multithreaded/TestMultithreaded.py 47.20s: lldb-api :: lang/objc/real-definition/TestRealDefinition.py 46.11s: lldb-shell :: SymbolFile/Breakpad/unwind-via-stack-win.test 45.20s: lldb-api :: functionalities/data-formatter/data-formatter-stl/libcxx/multimap/TestDataFormatterLibccMultiMap.py 42.76s: lldb-api :: lang/objc/modules-inline-functions/TestModulesInlineFunctions.py

Hide Details

Tests Times: -------------------------------------------------------------------------- [ Range ] :: [ Percentage ] :: [ Count ] -------------------------------------------------------------------------- [360s,380s) :: [ ] :: [ 1/2134] [340s,360s) :: [ ] :: [ 0/2134] [320s,340s) :: [ ] :: [ 0/2134] [300s,320s) :: [ ] :: [ 0/2134] [280s,300s) :: [ ] :: [ 0/2134] [260s,280s) :: [ ] :: [ 0/2134] [240s,260s) :: [ ] :: [ 0/2134] [220s,240s) :: [ ] :: [ 0/2134] [200s,220s) :: [ ] :: [ 1/2134] [180s,200s) :: [ ] :: [ 0/2134] [160s,180s) :: [ ] :: [ 0/2134] [140s,160s) :: [ ] :: [ 0/2134] [120s,140s) :: [ ] :: [ 0/2134] [100s,120s) :: [ ] :: [ 4/2134] [ 80s,100s) :: [ ] :: [ 3/2134] [ 60s, 80s) :: [ ] :: [ 2/2134] [ 40s, 60s) :: [ ] :: [ 12/2134] [ 20s, 40s) :: [ ] :: [ 52/2134] [ 0s, 20s) :: [************************************** ] :: [2059/2134] -------------------------------------------------------------------------- ******************** Failed Tests (8): lldb-api :: functionalities/gdb_remote_client/TestGDBRemoteLoad.py lldb-api :: macosx/simulator/TestSimulatorPlatform.py lldb-api :: python_api/target/TestTargetAPI.py lldb-api :: lang/objc/modules-inline-functions/TestModulesInlineFunctions.py lldb-api :: python_api/function_symbol/TestSymbolAPI.py lldb-api :: functionalities/data-formatter/cstring-utf8-summary/TestCstringUnicode.py lldb-api :: lang/cpp/call-function/TestCallCPPFunction.py lldb-api :: commands/expression/import-std-module/list/TestListFromStdModule.py

Hide Details

Hide Details

Testing Time: 2001.58s Unsupported : 150 Passed : 1970 Expectedly Failed: 6 Failed : 8 FAILED: tools/lldb/test/CMakeFiles/check-lldb-lit cd /Users/buildslave/jenkins/workspace/lldb-cmake@2/lldb-build/tools/lldb/test && /usr/local/Frameworks/Python.framework/Versions/3.7/bin/python3.7 /Users/buildslave/jenkins/workspace/lldb-cmake@2/lldb-build/./bin/llvm-lit -v --time-tests --shuffle --xunit-xml-output=/Users/buildslave/jenkins/workspace/lldb-cmake@2/test/results.xml -v -j 4 /Users/buildslave/jenkins/workspace/lldb-cmake@2/lldb-build/tools/lldb/test ninja: build stopped: subcommand failed. Command failed: Command '['/usr/bin/env', 'TERM=vt100', '/usr/local/bin/ninja', '-v', 'check-lldb']' returned non-zero exit status 1 Command: ['/usr/bin/env', 'TERM=vt100', '/usr/local/bin/ninja', '-v', 'check-lldb'] [Pipeline] } [Pipeline] // timeout [Pipeline] } [Pipeline] // stage [Pipeline] stage [Pipeline] { (Declarative: Post Actions) [Pipeline] scanForIssues [Clang (LLVM based)] Sleeping for 5 seconds due to JENKINS-32191... [Clang (LLVM based)] Parsing console log (workspace: '/Users/buildslave/jenkins/workspace/lldb-cmake@2') [Clang (LLVM based)] Successfully parsed console log [Clang (LLVM based)] -> found 1 issue (skipped 0 duplicates) [Clang (LLVM based)] Post processing issues on 'green-dragon-10' with source code encoding 'UTF-8' [Clang (LLVM based)] Creating SCM blamer to obtain author and commit information for affected files [Clang (LLVM based)] Creating SCM miner to obtain statistics for affected repository files [Clang (LLVM based)] Resolving file names for all issues in source directory '/Users/buildslave/jenkins/workspace/lldb-cmake@2' [Clang (LLVM based)] -> resolved paths in source directory (1 found, 0 not found) [Clang (LLVM based)] Resolving module names from module definitions (build.xml, pom.xml, or Manifest.mf files) [Clang (LLVM based)] -> resolved module names for 1 issues [Clang (LLVM based)] Resolving package names (or namespaces) by parsing the affected files [Clang (LLVM based)] -> resolved package names of 1 affected files [Clang (LLVM based)] No filter has been set, publishing all 1 issues [Clang (LLVM based)] Creating fingerprints for all affected code blocks to track issues over different builds [Clang (LLVM based)] -> created fingerprints for 1 issues (skipped 0 issues) [Clang (LLVM based)] Copying affected files to Jenkins' build folder '/Users/Shared/Jenkins/Home/jobs/lldb-cmake/builds/23553/files-with-issues' [Clang (LLVM based)] -> 1 copied, 0 not in workspace, 0 not-found, 0 with I/O error [Pipeline] junit Recording test results [Pipeline] emailext Warning: i@maskray.me is not a recognized user, but sending mail anyway Warning: i@maskray.me is not a recognized user, but sending mail anyway

Hide Details

Begin Pre-Send Script... Sending email to: mschifer@apple.com i@maskray.me Michael Spencer <michael_spencer@apple.com> Azhar Mohammed <azhar@apple.com>
[Pipeline] } [Pipeline] // stage [Pipeline] } [Pipeline] // withEnv [Pipeline] } [Pipeline] // node [Pipeline] End of Pipeline ERROR: script returned exit code 1 Finished: FAILURE