FailedConsole Output

Skipping 17,469 KB.. Full Log
ndAssembly/x86/./UnwindAssemblyx86Tests/Testx86AssemblyInspectionEngine.TestPushEAX (693 of 2134)
PASS: lldb-api :: python_api/value/TestValueAPI.py (694 of 2134)
PASS: lldb-api :: types/TestDoubleTypesExpr.py (695 of 2134)
UNSUPPORTED: lldb-shell :: SymbolFile/PDB/calling-conventions.test (696 of 2134)
PASS: lldb-shell :: Unwind/thread-step-out-ret-addr-check.test (697 of 2134)
PASS: lldb-unit :: Utility/./UtilityTests/Flags.Test (698 of 2134)
PASS: lldb-unit :: Utility/./UtilityTests/ConstStringTest.CompareStringRef (699 of 2134)
PASS: lldb-shell :: SymbolFile/DWARF/debug_aranges-empty-section.s (700 of 2134)
PASS: lldb-unit :: UnwindAssembly/x86/./UnwindAssemblyx86Tests/Testx86AssemblyInspectionEngine.TestPopRBPWithREX (701 of 2134)
PASS: lldb-shell :: ObjectFile/ELF/netbsd-exec-8.99.30-amd64.yaml (702 of 2134)
PASS: lldb-shell :: Reproducer/TestHomeDir.test (703 of 2134)
PASS: lldb-unit :: ObjectFile/Breakpad/./ObjectFileBreakpadTests/LineRecord.parse (704 of 2134)
PASS: lldb-unit :: Utility/./UtilityTests/UriParserTest.Minimal (705 of 2134)
PASS: lldb-api :: commands/expression/import-std-module/deque-basic/TestDequeFromStdModule.py (706 of 2134)
PASS: lldb-unit :: Utility/./UtilityTests/FileSpecTest.Match (707 of 2134)
PASS: lldb-unit :: Utility/./UtilityTests/TimerTest.CategoryTimes (708 of 2134)
PASS: lldb-api :: commands/expression/import-std-module/conflicts/TestStdModuleWithConflicts.py (709 of 2134)
PASS: lldb-unit :: Process/minidump/./LLDBMinidumpTests/MinidumpParserTest.GetMemory (710 of 2134)
PASS: lldb-shell :: ObjectFile/MachO/lc_version_min.yaml (711 of 2134)
PASS: lldb-api :: lang/objcxx/hide-runtime-values/TestObjCXXHideRuntimeValues.py (712 of 2134)
PASS: lldb-api :: functionalities/multidebugger_commands/TestMultipleDebuggersCommands.py (713 of 2134)
PASS: lldb-api :: lang/cpp/class-template-parameter-pack/TestClassTemplateParameterPack.py (714 of 2134)
PASS: lldb-unit :: Utility/./UtilityTests/StreamTest.SetIndentLevel (715 of 2134)
PASS: lldb-unit :: Utility/./UtilityTests/StringListTest.ShiftCString (716 of 2134)
PASS: lldb-api :: lang/c/enum_types/TestEnumTypes.py (717 of 2134)
UNSUPPORTED: lldb-api :: functionalities/data-formatter/data-formatter-stl/libstdcpp/map/TestDataFormatterStdMap.py (718 of 2134)
PASS: lldb-unit :: Target/./TargetTests/StackFrameRecognizerTest.NullModuleRegex (719 of 2134)
PASS: lldb-api :: lang/objcxx/cxx-bridged-po/TestObjCXXBridgedPO.py (720 of 2134)
PASS: lldb-api :: types/TestFloatTypesExpr.py (721 of 2134)
PASS: lldb-api :: functionalities/unwind/noreturn/module-end/TestNoReturnModuleEnd.py (722 of 2134)
PASS: lldb-api :: tools/lldb-vscode/breakpoint/TestVSCode_setFunctionBreakpoints.py (723 of 2134)
UNSUPPORTED: lldb-api :: functionalities/darwin_log/filter/regex/category/TestDarwinLogFilterRegexCategory.py (724 of 2134)
PASS: lldb-unit :: Language/Highlighting/./HighlighterTests/HighlighterTest.DefaultHighlighterWithCursorOutOfBounds (725 of 2134)
PASS: lldb-api :: lang/objc/modules-cache/TestClangModulesCache.py (726 of 2134)
UNSUPPORTED: lldb-api :: tools/lldb-server/signal-filtering/TestGdbRemote_QPassSignals.py (727 of 2134)
PASS: lldb-shell :: SymbolFile/dissassemble-entry-point.s (728 of 2134)
PASS: lldb-unit :: Utility/./UtilityTests/DataExtractorTest.GetSLEB128_bit63 (729 of 2134)
PASS: lldb-api :: commands/expression/formatters/TestFormatters.py (730 of 2134)
PASS: lldb-api :: functionalities/thread/exit_during_break/TestExitDuringBreak.py (731 of 2134)
PASS: lldb-api :: lang/cpp/template-function/TestTemplateFunctions.py (732 of 2134)
PASS: lldb-api :: lang/objc/modules-inline-functions/TestModulesInlineFunctions.py (733 of 2134)
PASS: lldb-unit :: Utility/./UtilityTests/BinaryStreamTest.PutSLEB128FiveBytes (734 of 2134)
PASS: lldb-shell :: SymbolFile/Breakpad/stack-cfi-parsing.test (735 of 2134)
PASS: lldb-shell :: Minidump/Windows/find-module.test (736 of 2134)
PASS: lldb-unit :: Utility/./UtilityTests/UriParserTest.BracketedHostnameWithPortIPv6 (737 of 2134)
PASS: lldb-api :: functionalities/thread/concurrent_events/TestConcurrentSignalNWatchNBreak.py (738 of 2134)
PASS: lldb-unit :: ScriptInterpreter/Python/./ScriptInterpreterPythonTests/PythonDataObjectsTest.TestPythonIntegerToStructuredInteger (739 of 2134)
PASS: lldb-shell :: ObjectFile/ELF/aarch64-relocations.yaml (740 of 2134)
PASS: lldb-unit :: Utility/./UtilityTests/ArgsTest.GetArgumentArrayRef (741 of 2134)
PASS: lldb-unit :: Utility/./UtilityTests/ConstStringTest.MangledCounterpart (742 of 2134)
UNSUPPORTED: lldb-api :: lang/objc/rdar-12408181/TestRdar12408181.py (743 of 2134)
PASS: lldb-shell :: ObjectFile/ELF/basic-info.yaml (744 of 2134)
PASS: lldb-shell :: ObjectFile/ELF/section-overlap.yaml (745 of 2134)
PASS: lldb-api :: commands/expression/namespace_local_var_same_name_obj_c/TestNamespaceLocalVarSameNameObjC.py (746 of 2134)
PASS: lldb-unit :: Symbol/./SymbolTests/DWARFCallFrameInfoTest.Basic_dwarf3 (747 of 2134)
PASS: lldb-unit :: UnwindAssembly/x86/./UnwindAssemblyx86Tests/Testx86AssemblyInspectionEngine.TestSpArithx86_64Augmented (748 of 2134)
PASS: lldb-unit :: Process/gdb-remote/./ProcessGdbRemoteTests/GDBRemoteClientBaseTest.SendContinueAndInterrupt (749 of 2134)
PASS: lldb-shell :: SymbolFile/DWARF/find-function-regex.cpp (750 of 2134)
PASS: lldb-unit :: ScriptInterpreter/Python/./ScriptInterpreterPythonTests/PythonDataObjectsTest.TestPythonString (751 of 2134)
PASS: lldb-unit :: Utility/./UtilityTests/RangeTest.Slide (752 of 2134)
PASS: lldb-unit :: Process/minidump/./LLDBMinidumpTests/MinidumpParserTest.InvalidMinidump (753 of 2134)
PASS: lldb-api :: commands/expression/import-std-module/deque-dbg-info-content/TestDbgInfoContentDequeFromStdModule.py (754 of 2134)
PASS: lldb-api :: functionalities/tail_call_frames/ambiguous_tail_call_seq2/TestAmbiguousTailCallSeq2.py (755 of 2134)
PASS: lldb-api :: api/listeners/TestListener.py (756 of 2134)
PASS: lldb-unit :: Target/./TargetTests/ModuleCacheTest.GetAndPutUuidExists (757 of 2134)
PASS: lldb-api :: functionalities/data-formatter/data-formatter-stl/libstdcpp/unique_ptr/invalid/TestDataFormatterInvalidStdUniquePtr.py (758 of 2134)
PASS: lldb-unit :: Core/./LLDBCoreTests/RichManglingContextTest.SwitchProvider (759 of 2134)
PASS: lldb-unit :: Utility/./UtilityTests/StringExtractorTest.GetU64BigEndian (760 of 2134)
PASS: lldb-api :: functionalities/data-formatter/data-formatter-named-summaries/TestDataFormatterNamedSummaries.py (761 of 2134)
PASS: lldb-unit :: Expression/./ExpressionTests/DWARFExpression.DW_OP_piece (762 of 2134)
PASS: lldb-shell :: ObjectFile/ELF/PT_LOAD.yaml (763 of 2134)
PASS: lldb-shell :: ExecControl/StopHook/stop-hook.test (764 of 2134)
PASS: lldb-shell :: Settings/TestSettingsWrite.test (765 of 2134)
PASS: lldb-shell :: SymbolFile/DWARF/dir-separator-windows.s (766 of 2134)
PASS: lldb-shell :: SymbolFile/DWARF/win-i386-line-table.s (767 of 2134)
PASS: lldb-unit :: Utility/./UtilityTests/RangeTest.ClearWithStarAddress (768 of 2134)
PASS: lldb-api :: functionalities/inline-stepping/TestInlineStepping.py (769 of 2134)
PASS: lldb-shell :: SymbolFile/DWARF/clang-ast-from-dwarf-unamed-and-anon-structs.cpp (770 of 2134)
UNSUPPORTED: lldb-api :: functionalities/data-formatter/data-formatter-stl/libstdcpp/iterator/TestDataFormatterStdIterator.py (771 of 2134)
PASS: lldb-api :: lang/cpp/extern_c/TestExternCSymbols.py (772 of 2134)
PASS: lldb-api :: lang/cpp/global_operators/TestCppGlobalOperators.py (773 of 2134)
PASS: lldb-shell :: Host/TestCustomShell.test (774 of 2134)
PASS: lldb-unit :: Utility/./UtilityTests/BinaryStreamTest.PutSLEB128Zero (775 of 2134)
PASS: lldb-api :: lang/objc/modules-app-update/TestClangModulesAppUpdate.py (776 of 2134)
PASS: lldb-api :: functionalities/asan/TestMemoryHistory.py (777 of 2134)
PASS: lldb-unit :: Expression/./ExpressionTests/DiagnosticManagerTest.AppendMessageSubsequentDiags (778 of 2134)
PASS: lldb-unit :: UnwindAssembly/ARM64/./Arm64InstEmulationTests/TestArm64InstEmulation.TestSimpleDarwinFunction (779 of 2134)
PASS: lldb-api :: commands/platform/file/close/TestPlatformFileClose.py (780 of 2134)
PASS: lldb-api :: lang/objc/conflicting-definition/TestConflictingDefinition.py (781 of 2134)
PASS: lldb-api :: lang/cpp/this/TestCPPThis.py (782 of 2134)
PASS: lldb-api :: functionalities/data-formatter/stringprinter/TestStringPrinter.py (783 of 2134)
PASS: lldb-unit :: ObjectFile/ELF/./ObjectFileELFTests/ObjectFileELFTest.SectionsResolveConsistently (784 of 2134)
PASS: lldb-api :: tools/lldb-vscode/stackTrace/TestVSCode_stackTrace.py (785 of 2134)
PASS: lldb-api :: commands/expression/rdar42038760/TestScalarURem.py (786 of 2134)
PASS: lldb-api :: functionalities/gdb_remote_client/TestRegDefinitionInParts.py (787 of 2134)
PASS: lldb-unit :: Expression/./ExpressionTests/DiagnosticManagerTest.FixedExpression (788 of 2134)
PASS: lldb-api :: lang/cpp/llvm-style/TestLLVMStyle.py (789 of 2134)
PASS: lldb-api :: python_api/exprpath_synthetic/TestExprPathSynthetic.py (790 of 2134)
PASS: lldb-unit :: Utility/./UtilityTests/StreamTest.PutHex8 (791 of 2134)
PASS: lldb-unit :: Utility/./UtilityTests/ListenerTest.GetEventImmediate (792 of 2134)
PASS: lldb-unit :: Utility/./UtilityTests/StringListTest.CopyListSingle (793 of 2134)
PASS: lldb-api :: commands/settings/TestSettings.py (794 of 2134)
PASS: lldb-api :: commands/process/attach-resume/TestAttachResume.py (795 of 2134)
PASS: lldb-api :: lang/objc/foundation/TestConstStrings.py (796 of 2134)
PASS: lldb-api :: functionalities/data-formatter/user-format-vs-summary/TestUserFormatVsSummary.py (797 of 2134)
PASS: lldb-api :: commands/gui/breakpoints/TestGuiBreakpoints.py (798 of 2134)
PASS: lldb-api :: commands/process/signal/TestProcessSignal.py (799 of 2134)
PASS: lldb-unit :: Utility/./UtilityTests/AnsiTerminal.Incomplete (800 of 2134)
PASS: lldb-unit :: ObjectFile/Breakpad/./ObjectFileBreakpadTests/PublicRecord.parse (801 of 2134)
PASS: lldb-shell :: ObjectFile/MachO/lc_build_version.yaml (802 of 2134)
PASS: lldb-unit :: SymbolFile/DWARF/./SymbolFileDWARFTests/SymbolFileDWARFTests.TestAbbrevValidAttrNullForm (803 of 2134)
PASS: lldb-api :: commands/expression/import-std-module/unique_ptr/TestUniquePtrFromStdModule.py (804 of 2134)
PASS: lldb-unit :: Utility/./UtilityTests/StringExtractorTest.InitEmpty (805 of 2134)
PASS: lldb-shell :: Driver/TestProcessAttach.test (806 of 2134)
PASS: lldb-api :: commands/frame/var-scope/TestFrameVariableScope.py (807 of 2134)
PASS: lldb-unit :: Utility/./UtilityTests/ProcessInstanceInfo.Yaml (808 of 2134)
PASS: lldb-api :: functionalities/data-formatter/array_typedef/TestArrayTypedef.py (809 of 2134)
PASS: lldb-unit :: Utility/./UtilityTests/ArgsTest.TestOverwriteArgs (810 of 2134)
PASS: lldb-unit :: SymbolFile/DWARF/./SymbolFileDWARFTests/SymbolFileDWARFTests.TestAbilitiesForDWARF (811 of 2134)
PASS: lldb-api :: lang/objc/real-definition/TestRealDefinition.py (812 of 2134)
PASS: lldb-unit :: UnwindAssembly/x86/./UnwindAssemblyx86Tests/Testx86AssemblyInspectionEngine.TestPushRBPWithREX (813 of 2134)
PASS: lldb-api :: commands/expression/import-std-module/stack/TestStackFromStdModule.py (814 of 2134)
PASS: lldb-unit :: Utility/./UtilityTests/VMRange.Ordering (815 of 2134)
PASS: lldb-unit :: Target/./TargetTests/ExecutionContextTest.GetByteOrderTarget (816 of 2134)
UNSUPPORTED: lldb-shell :: ScriptInterpreter/Lua/command_script_import.test (817 of 2134)
PASS: lldb-shell :: ObjectFile/PECOFF/basic-info-arm.yaml (818 of 2134)
PASS: lldb-unit :: UnwindAssembly/x86/./UnwindAssemblyx86Tests/Testx86AssemblyInspectionEngine.TestAddESP (819 of 2134)
PASS: lldb-api :: python_api/interpreter/TestCommandInterpreterAPI.py (820 of 2134)
PASS: lldb-api :: tools/lldb-server/TestGdbRemoteExpeditedRegisters.py (821 of 2134)
PASS: lldb-api :: python_api/lldbutil/process/TestPrintStackTraces.py (822 of 2134)
PASS: lldb-unit :: Utility/./UtilityTests/ArchSpecTest.TestParseMachCPUDashSubtypeTripleSimple (823 of 2134)
PASS: lldb-api :: functionalities/thread/backtrace_limit/TestBacktraceLimit.py (824 of 2134)
PASS: lldb-unit :: Utility/./UtilityTests/DataExtractorTest.UncommonAddressSize (825 of 2134)
PASS: lldb-unit :: Symbol/./SymbolTests/TestClangASTImporter.MetadataPropagationAfterCopying (826 of 2134)
PASS: lldb-unit :: UnwindAssembly/x86/./UnwindAssemblyx86Tests/Testx86AssemblyInspectionEngine.TestSimplei386ugmented (827 of 2134)
PASS: lldb-unit :: Utility/./UtilityTests/DataExtractorTest.GetMaxS64 (828 of 2134)
PASS: lldb-unit :: Process/minidump/./LLDBMinidumpTests/RegisterContextMinidump.CheckRegisterContextMinidump_ARM (829 of 2134)
PASS: lldb-api :: python_api/function_symbol/TestSymbolAPI.py (830 of 2134)
PASS: lldb-api :: functionalities/data-formatter/data-formatter-synth/TestDataFormatterSynth.py (831 of 2134)
PASS: lldb-unit :: Utility/./UtilityTests/StreamTest.PutHex32ByteOrderLittle (832 of 2134)
PASS: lldb-api :: functionalities/thread/concurrent_events/TestConcurrentTwoBreakpointsOneSignal.py (833 of 2134)
PASS: lldb-api :: lang/cpp/auto/TestCPPAuto.py (834 of 2134)
PASS: lldb-unit :: Language/Highlighting/./HighlighterTests/HighlighterTest.ClangCommas (835 of 2134)
PASS: lldb-unit :: UnwindAssembly/x86/./UnwindAssemblyx86Tests/Testx86AssemblyInspectionEngine.TestDisassemblyMidFunctionEpilogues (836 of 2134)
PASS: lldb-unit :: Utility/./UtilityTests/UriParserTest.BadPort (837 of 2134)
PASS: lldb-unit :: Interpreter/./InterpreterTests/CompletionTest.DirCompletionAbsolute (838 of 2134)
PASS: lldb-api :: functionalities/thread/concurrent_events/TestConcurrentSignalDelayWatch.py (839 of 2134)
PASS: lldb-unit :: Utility/./UtilityTests/VASprintfTest.BufferResize (840 of 2134)
PASS: lldb-unit :: Utility/./UtilityTests/StringExtractorTest.GetHexU8_Extra_NoEof (841 of 2134)
PASS: lldb-shell :: SymbolFile/DWARF/debug-types-line-tables.s (842 of 2134)
PASS: lldb-api :: lang/c/conflicting-symbol/TestConflictingSymbol.py (843 of 2134)
PASS: lldb-api :: lang/objc/orderedset/TestOrderedSet.py (844 of 2134)
PASS: lldb-api :: tools/lldb-vscode/console/TestVSCode_console.py (845 of 2134)
PASS: lldb-api :: functionalities/pre_run_dylibs/TestPreRunDylibs.py (846 of 2134)
PASS: lldb-shell :: ScriptInterpreter/Python/eof.test (847 of 2134)
PASS: lldb-api :: lang/objc/foundation/TestObjCMethodsNSArray.py (848 of 2134)
UNSUPPORTED: lldb-api :: benchmarks/expression/TestExpressionCmd.py (849 of 2134)
UNSUPPORTED: lldb-api :: lang/cpp/function-template-parameter-pack/TestFunctionTemplateParameterPack.py (850 of 2134)
PASS: lldb-api :: macosx/add-dsym/TestAddDsymMidExecutionCommand.py (851 of 2134)
PASS: lldb-api :: lang/objc/objc-class-method/TestObjCClassMethod.py (852 of 2134)
PASS: lldb-api :: functionalities/tail_call_frames/unambiguous_sequence/TestUnambiguousTailCalls.py (853 of 2134)
PASS: lldb-api :: functionalities/memory/find/TestMemoryFind.py (854 of 2134)
PASS: lldb-api :: commands/command/script/import/TestImport.py (855 of 2134)
UNSUPPORTED: lldb-api :: functionalities/thread/concurrent_events/TestConcurrentManySignals.py (856 of 2134)
PASS: lldb-unit :: Utility/./UtilityTests/RegularExpression.Empty (857 of 2134)
PASS: lldb-api :: python_api/sbvalue_persist/TestSBValuePersist.py (858 of 2134)
PASS: lldb-unit :: Utility/./UtilityTests/RecordReplayTest.InstrumentedBarRef (859 of 2134)
PASS: lldb-unit :: Utility/./UtilityTests/LogChannelTest.Disable (860 of 2134)
PASS: lldb-unit :: ObjectFile/PECOFF/./ObjectFilePECOFFTests/PECallFrameInfoTest.Frame_reg_eh (861 of 2134)
PASS: lldb-unit :: UnwindAssembly/x86/./UnwindAssemblyx86Tests/Testx86AssemblyInspectionEngine.Test64bitFramelessSmallStackFrame (862 of 2134)
PASS: lldb-shell :: Quit/TestQuitExitCode30.test (863 of 2134)
PASS: lldb-api :: functionalities/thread/exit_during_step/TestExitDuringStep.py (864 of 2134)
PASS: lldb-api :: lang/objc/modules-hash-mismatch/TestClangModulesHashMismatch.py (865 of 2134)
PASS: lldb-api :: lang/cpp/thread_local/TestThreadLocal.py (866 of 2134)
PASS: lldb-api :: functionalities/data-formatter/var-in-aggregate-misuse/TestVarInAggregateMisuse.py (867 of 2134)
PASS: lldb-shell :: SymbolFile/NativePDB/ast-methods.cpp (868 of 2134)
PASS: lldb-unit :: Host/./HostTests/File.GetWaitableHandleFileno (869 of 2134)
PASS: lldb-api :: lang/c/function_types/TestFunctionTypes.py (870 of 2134)
PASS: lldb-unit :: Utility/./UtilityTests/FileSpecTest.EqualDotsPosix (871 of 2134)
PASS: lldb-shell :: Quit/TestQuitExitCode-30.test (872 of 2134)
PASS: lldb-api :: functionalities/plugins/command_plugin/TestPluginCommands.py (873 of 2134)
PASS: lldb-shell :: SymbolFile/NativePDB/source-list.cpp (874 of 2134)
PASS: lldb-shell :: SymbolFile/Breakpad/unwind-via-raSearch.test (875 of 2134)
PASS: lldb-unit :: DataFormatter/./LLDBFormatterTests/TypeMatcherTests.ExactName (876 of 2134)
PASS: lldb-unit :: Utility/./UtilityTests/NameMatchesTest.Contains (877 of 2134)
PASS: lldb-unit :: Symbol/./SymbolTests/TestClangASTImporter.CopyTypeTagDecl (878 of 2134)
UNSUPPORTED: lldb-shell :: ScriptInterpreter/Lua/nested_sessions.test (879 of 2134)
PASS: lldb-api :: functionalities/postmortem/elf-core/gcore/TestGCore.py (880 of 2134)
PASS: lldb-unit :: Symbol/./SymbolTests/TestClangASTImporter.CompleteFwdDeclWithOtherOrigin (881 of 2134)
PASS: lldb-api :: functionalities/testid/TestTestId.py (882 of 2134)
PASS: lldb-unit :: Utility/./UtilityTests/PassiveReplayTest.InstrumentedFoo (883 of 2134)
PASS: lldb-unit :: Language/Highlighting/./HighlighterTests/HighlighterTest.DefaultHighlighterWithCursor (884 of 2134)
PASS: lldb-unit :: Utility/./UtilityTests/StringListTest.LongestCommonPrefixEmpty (885 of 2134)
PASS: lldb-unit :: Utility/./UtilityTests/ArgsTest.TestUnknownEscape (886 of 2134)
PASS: lldb-shell :: Breakpoint/ppc64-localentry.test (887 of 2134)
PASS: lldb-unit :: Utility/./UtilityTests/BinaryStreamTest.PutSLEB128MaxValue (888 of 2134)
PASS: lldb-api :: iohandler/completion/TestIOHandlerCompletion.py (889 of 2134)
PASS: lldb-api :: commands/expression/import-std-module/list-dbg-info-content/TestDbgInfoContentListFromStdModule.py (890 of 2134)
PASS: lldb-api :: python_api/sblaunchinfo/TestSBLaunchInfo.py (891 of 2134)
PASS: lldb-api :: functionalities/inferior-crashing/TestInferiorCrashing.py (892 of 2134)
PASS: lldb-unit :: Process/gdb-remote/./ProcessGdbRemoteTests/GDBRemoteCommunicationClientTest.SaveRestoreRegistersNoSuffix (893 of 2134)
PASS: lldb-api :: tools/lldb-server/commandline/TestStubReverseConnect.py (894 of 2134)
PASS: lldb-unit :: Utility/./UtilityTests/StatusTest.ErrorConstructor (895 of 2134)
PASS: lldb-unit :: Utility/./UtilityTests/BinaryStreamTest.PutSLEB128One (896 of 2134)
PASS: lldb-unit :: Language/Highlighting/./HighlighterTests/HighlighterTest.ClangTrailingBackslashBeforeNewline (897 of 2134)
PASS: lldb-api :: commands/platform/process/list/TestProcessList.py (898 of 2134)
PASS: lldb-unit :: UnwindAssembly/x86/./UnwindAssemblyx86Tests/Testx86AssemblyInspectionEngine.TestSpillRegToStackViaMOVi386 (899 of 2134)
PASS: lldb-api :: python_api/watchpoint/watchlocation/TestTargetWatchAddress.py (900 of 2134)
PASS: lldb-unit :: Utility/./UtilityTests/StructuredDataTest.StringDump (901 of 2134)
PASS: lldb-api :: commands/expression/class_template_specialization_empty_pack/TestClassTemplateSpecializationParametersHandling.py (902 of 2134)
PASS: lldb-unit :: Platform/Android/./AdbClientTests/AdbClientTest.CreateByDeviceId (903 of 2134)
PASS: lldb-api :: commands/watchpoints/multiple_threads/TestWatchpointMultipleThreads.py (904 of 2134)
PASS: lldb-unit :: ObjectFile/Breakpad/./ObjectFileBreakpadTests/StackCFIRecord.parse (905 of 2134)
PASS: lldb-unit :: Utility/./UtilityTests/StreamTeeTest.Constructor2Streams (906 of 2134)
PASS: lldb-unit :: Language/Highlighting/./HighlighterTests/HighlighterTest.ClangComments (907 of 2134)
PASS: lldb-shell :: Register/x86-64-gp-read.test (908 of 2134)
PASS: lldb-api :: functionalities/step_scripted/TestStepScripted.py (909 of 2134)
PASS: lldb-shell :: BuildScript/toolchain-clang.test (910 of 2134)
UNSUPPORTED: lldb-api :: functionalities/breakpoint/hardware_breakpoints/hardware_breakpoint_on_multiple_threads/TestHWBreakMultiThread.py (911 of 2134)
PASS: lldb-unit :: Symbol/./SymbolTests/TestTypeSystemClang.TestOwningModule (912 of 2134)
PASS: lldb-unit :: Process/gdb-remote/./ProcessGdbRemoteTests/GDBRemoteCommunicationServerTest.SendErrorResponse_ErrorNumber (913 of 2134)
UNSUPPORTED: lldb-api :: functionalities/darwin_log/source/info/TestDarwinLogSourceInfo.py (914 of 2134)
PASS: lldb-api :: functionalities/data-formatter/data-formatter-stl/libcxx/optional/TestDataFormatterLibcxxOptional.py (915 of 2134)
PASS: lldb-api :: lang/mixed/TestMixedLanguages.py (916 of 2134)
PASS: lldb-api :: types/TestLongTypes.py (917 of 2134)
PASS: lldb-api :: commands/expression/two-files/TestObjCTypeQueryFromOtherCompileUnit.py (918 of 2134)
UNSUPPORTED: lldb-api :: macosx/macCatalystAppMacOSFramework/TestMacCatalystAppWithMacOSFramework.py (919 of 2134)
PASS: lldb-api :: commands/expression/entry-bp/TestExprEntryBP.py (920 of 2134)
PASS: lldb-api :: lang/cpp/limit-debug-info/TestWithLimitDebugInfo.py (921 of 2134)
PASS: lldb-shell :: ObjectFile/Breakpad/uuid-matching-mac.test (922 of 2134)
PASS: lldb-unit :: SymbolFile/DWARF/./SymbolFileDWARFTests/SymbolFileDWARFTests.ParseArangesNonzeroSegmentSize (923 of 2134)
UNSUPPORTED: lldb-api :: functionalities/data-formatter/data-formatter-stl/libstdcpp/vector/TestDataFormatterStdVector.py (924 of 2134)
PASS: lldb-unit :: ScriptInterpreter/Python/./ScriptInterpreterPythonTests/PythonDataObjectsTest.TestPythonFile (925 of 2134)
PASS: lldb-api :: lang/objc/objc-ivar-offsets/TestObjCIvarOffsets.py (926 of 2134)
PASS: lldb-api :: tools/lldb-server/inferior-crash/TestGdbRemoteAbort.py (927 of 2134)
PASS: lldb-shell :: Minidump/dump-all.test (928 of 2134)
PASS: lldb-api :: functionalities/data-formatter/data-formatter-stl/libcxx/multimap/TestDataFormatterLibccMultiMap.py (929 of 2134)
PASS: lldb-unit :: ScriptInterpreter/Python/./ScriptInterpreterPythonTests/PythonDataObjectsTest.TestPythonListValueEquality (930 of 2134)
PASS: lldb-api :: lang/c/step_over_no_deadlock/TestStepOverDoesntBlock.py (931 of 2134)
PASS: lldb-unit :: UnwindAssembly/x86/./UnwindAssemblyx86Tests/Testx86AssemblyInspectionEngine.TestPushESI (932 of 2134)
PASS: lldb-api :: functionalities/non-overlapping-index-variable-i/TestIndexVariable.py (933 of 2134)
PASS: lldb-unit :: Utility/./UtilityTests/ConstStringTest.NullAndEmptyStates (934 of 2134)
PASS: lldb-unit :: Utility/./UtilityTests/ScalarTest.Equality (935 of 2134)
PASS: lldb-unit :: Host/./HostTests/SocketTest.UDPConnect (936 of 2134)
UNSUPPORTED: lldb-shell :: Register/x86-zmm-write.test (937 of 2134)
PASS: lldb-unit :: Expression/./ExpressionTests/DiagnosticManagerTest.HasFixits (938 of 2134)
UNSUPPORTED: lldb-api :: commands/register/register/aarch64_sve_registers/rw_access_static_config/TestSVERegisters.py (939 of 2134)
PASS: lldb-shell :: Reproducer/TestWorkingDir.test (940 of 2134)
UNSUPPORTED: lldb-api :: tools/lldb-vscode/disconnect/TestVSCode_disconnect.py (941 of 2134)
PASS: lldb-unit :: Utility/./UtilityTests/ScalarTest.TruncOrExtendTo (942 of 2134)
PASS: lldb-unit :: ScriptInterpreter/Python/./ScriptInterpreterPythonTests/PythonDataObjectsTest.TestExceptions (943 of 2134)
PASS: lldb-unit :: Utility/./UtilityTests/CompletionRequest.TryCompleteCurrentArgMode (944 of 2134)
PASS: lldb-unit :: Utility/./UtilityTests/VMRange.Comparison (945 of 2134)
PASS: lldb-unit :: ObjectFile/ELF/./ObjectFileELFTests/ObjectFileELFTest.GetSymtab_NoSymEntryPointArmAddressClass (946 of 2134)
UNSUPPORTED: lldb-api :: linux/mix-dwo-and-regular-objects/TestMixedDwarfBinary.py (947 of 2134)
PASS: lldb-api :: python_api/lldbutil/TestSwigVersion.py (948 of 2134)
PASS: lldb-api :: functionalities/memory/cache/TestMemoryCache.py (949 of 2134)
PASS: lldb-unit :: debugserver/./debugserverTests/RNBSocket.LoopBackListenIPv6 (950 of 2134)
PASS: lldb-unit :: Thread/./ThreadTests/ThreadTest.GetPrivateStopInfo (951 of 2134)
PASS: lldb-api :: commands/apropos/with-process/TestAproposWithProcess.py (952 of 2134)
PASS: lldb-api :: commands/watchpoints/watchpoint_disable/TestWatchpointDisable.py (953 of 2134)
PASS: lldb-shell :: SymbolFile/Breakpad/unwind-via-stack-cfi.test (954 of 2134)
PASS: lldb-unit :: Interpreter/./InterpreterTests/OptionArgParserTest.toChar (955 of 2134)
PASS: lldb-unit :: Utility/./UtilityTests/CompletionRequest.TryCompleteCurrentArgBad (956 of 2134)
UNSUPPORTED: lldb-api :: lang/cpp/printf/TestPrintf.py (957 of 2134)
PASS: lldb-unit :: Utility/./UtilityTests/FileSpecTest.IsRelative (958 of 2134)
PASS: lldb-api :: commands/expression/import-std-module/sysroot/TestStdModuleSysroot.py (959 of 2134)
PASS: lldb-api :: python_api/watchpoint/TestWatchpointIgnoreCount.py (960 of 2134)
PASS: lldb-unit :: Utility/./UtilityTests/FileSpecTest.EqualSeparator (961 of 2134)
PASS: lldb-unit :: Process/gdb-remote/./ProcessGdbRemoteTests/GDBRemoteCommunicationClientTest.SendStopTracePacket (962 of 2134)
PASS: lldb-api :: commands/gui/basicdebug/TestGuiBasicDebug.py (963 of 2134)
PASS: lldb-unit :: Utility/./UtilityTests/SerializationRountripTest.SerializeDeserializeCStringNull (964 of 2134)
PASS: lldb-unit :: DataFormatter/./LLDBFormatterTests/StringPrinterTests.SwiftUTF8 (965 of 2134)
PASS: lldb-api :: commands/expression/ignore-artificial-constructors/TestIgnoreArtificialConstructors.py (966 of 2134)
PASS: lldb-api :: lang/objc/foundation/TestObjCMethodsNSError.py (967 of 2134)
PASS: lldb-api :: functionalities/gdb_remote_client/TestNoGPacketSupported.py (968 of 2134)
PASS: lldb-api :: lang/objc/global_ptrs/TestGlobalObjects.py (969 of 2134)
PASS: lldb-unit :: Utility/./UtilityTests/LogChannelTest.List (970 of 2134)
PASS: lldb-api :: lang/objc/objc-runtime-ivars/TestRuntimeIvars.py (971 of 2134)
PASS: lldb-api :: python_api/value/empty_class/TestValueAPIEmptyClass.py (972 of 2134)
PASS: lldb-api :: linux/builtin_trap/TestBuiltinTrap.py (973 of 2134)
PASS: lldb-unit :: Utility/./UtilityTests/DataExtractorTest.PeekData (974 of 2134)
PASS: lldb-api :: functionalities/mtc/simple/TestMTCSimple.py (975 of 2134)
PASS: lldb-api :: tools/lldb-vscode/breakpoint/TestVSCode_setBreakpoints.py (976 of 2134)
UNSUPPORTED: lldb-api :: functionalities/data-formatter/data-formatter-stl/libstdcpp/unique_ptr/TestDataFormatterStdUniquePtr.py (977 of 2134)
UNSUPPORTED: lldb-api :: python_api/event/TestEvents.py (978 of 2134)
PASS: lldb-shell :: SymbolFile/DWARF/debug_ranges_and_rnglists.test (979 of 2134)
PASS: lldb-unit :: API/./APITests/SBCommandInterpreterTest.SingleWordCommand (980 of 2134)
PASS: lldb-shell :: SymbolFile/DWARF/find-method.cpp (981 of 2134)
PASS: lldb-api :: functionalities/data-formatter/data-formatter-objc/TestDataFormatterObjCKVO.py (982 of 2134)
PASS: lldb-unit :: Utility/./UtilityTests/FileSpecTest.FormatFileSpec (983 of 2134)
PASS: lldb-api :: commands/target/stop-hooks/TestStopHooks.py (984 of 2134)
PASS: lldb-api :: functionalities/data-formatter/data-formatter-objc/TestDataFormatterObjCNSDate.py (985 of 2134)
PASS: lldb-unit :: Utility/./UtilityTests/ConstStringTest.CompareConstString (986 of 2134)
PASS: lldb-api :: commands/expression/fixits/TestFixIts.py (987 of 2134)
PASS: lldb-shell :: Commands/command-thread-select.test (988 of 2134)
PASS: lldb-unit :: Utility/./UtilityTests/XcodeSDKTest.MergeTest (989 of 2134)
PASS: lldb-unit :: Utility/./UtilityTests/XcodeSDKTest.ParseTest (990 of 2134)
PASS: lldb-api :: lang/objc/objc-struct-return/TestObjCStructReturn.py (991 of 2134)
PASS: lldb-api :: functionalities/postmortem/netbsd-core/TestNetBSDCore.py (992 of 2134)
PASS: lldb-unit :: Utility/./UtilityTests/FileSpecTest.GetPath (993 of 2134)
PASS: lldb-api :: functionalities/float-display/TestFloatDisplay.py (994 of 2134)
PASS: lldb-api :: macosx/thread_suspend/TestInternalThreadSuspension.py (995 of 2134)
PASS: lldb-api :: functionalities/data-formatter/data-formatter-objc/nsstring/TestDataFormatterNSString.py (996 of 2134)
PASS: lldb-unit :: Core/./LLDBCoreTests/MangledTest.ResultForBlockInvocation (997 of 2134)
PASS: lldb-api :: commands/expression/import-std-module/list/TestListFromStdModule.py (998 of 2134)
PASS: lldb-api :: commands/session/history/TestSessionHistory.py (999 of 2134)
PASS: lldb-unit :: Interpreter/./InterpreterTests/OptionArgParserTest.toBoolean (1000 of 2134)
PASS: lldb-unit :: Symbol/./SymbolTests/DWARFCallFrameInfoTest.Basic_dwarf4 (1001 of 2134)
UNSUPPORTED: lldb-api :: functionalities/darwin_log/format/TestDarwinLogMessageFormat.py (1002 of 2134)
PASS: lldb-unit :: Host/./HostTests/MainLoopTest.ReadObject (1003 of 2134)
PASS: lldb-api :: commands/expression/ir-interpreter/TestIRInterpreter.py (1004 of 2134)
PASS: lldb-api :: functionalities/thread/concurrent_events/TestConcurrentCrashWithBreak.py (1005 of 2134)
PASS: lldb-unit :: Host/./HostTests/NativeProcessProtocolTest.ReadCStringFromMemory_CrossPageBoundary (1006 of 2134)
PASS: lldb-api :: functionalities/paths/TestPaths.py (1007 of 2134)
PASS: lldb-api :: commands/expression/multiline-completion/TestMultilineCompletion.py (1008 of 2134)
PASS: lldb-unit :: Symbol/./SymbolTests/TestTypeSystemClang.TestGetTypeClassDeclType (1009 of 2134)
PASS: lldb-api :: python_api/frame/get-variables/TestGetVariables.py (1010 of 2134)
PASS: lldb-api :: lang/c/stepping/TestStepAndBreakpoints.py (1011 of 2134)
PASS: lldb-shell :: ObjectFile/ELF/section-types.yaml (1012 of 2134)
PASS: lldb-api :: sample_test/TestSampleTest.py (1013 of 2134)
PASS: lldb-api :: macosx/nslog/TestDarwinNSLogOutput.py (1014 of 2134)
PASS: lldb-shell :: Commands/command-regex-unalias.test (1015 of 2134)
PASS: lldb-api :: functionalities/fat_archives/TestFatArchives.py (1016 of 2134)
PASS: lldb-unit :: Host/./HostTests/Host.GetEnvironment (1017 of 2134)
PASS: lldb-unit :: Host/./HostTests/FileSystemTest.MakeAbsolute (1018 of 2134)
PASS: lldb-unit :: Utility/./UtilityTests/ReproducerTest.SetReplay (1019 of 2134)
PASS: lldb-unit :: Utility/./UtilityTests/StringListTest.Assignment (1020 of 2134)
PASS: lldb-shell :: SymbolFile/DWARF/DW_TAG_basic_type_DW_ATE_UTF_nonC.ll (1021 of 2134)
PASS: lldb-unit :: Utility/./UtilityTests/UriParserTest.SchemeHostSeparator (1022 of 2134)
PASS: lldb-unit :: Utility/./UtilityTests/SerializationRountripTest.SerializeDeserializeObjectPointer (1023 of 2134)
PASS: lldb-shell :: SymbolFile/DWARF/dwarf5-partial-index.cpp (1024 of 2134)
PASS: lldb-api :: commands/expression/deleting-implicit-copy-constructor/TestDeletingImplicitCopyConstructor.py (1025 of 2134)
PASS: lldb-unit :: Process/./ProcessEventDataTests/ProcessEventDataTest.DoOnRemoval (1026 of 2134)
PASS: lldb-api :: commands/expression/radar_9531204/TestPrintfAfterUp.py (1027 of 2134)
PASS: lldb-unit :: UnwindAssembly/PPC64/./PPC64InstEmulationTests/TestPPC64InstEmulation.TestMediumFunction (1028 of 2134)
PASS: lldb-api :: lang/cpp/alignas_base_class/TestAlignAsBaseClass.py (1029 of 2134)
PASS: lldb-unit :: Utility/./UtilityTests/ScalarTest.ExtractBitfield (1030 of 2134)
PASS: lldb-unit :: SymbolFile/NativePDB/./SymbolFileNativePDBTests/PDBFPOProgramToDWARFExpressionTests.UnknownOp (1031 of 2134)
PASS: lldb-unit :: Utility/./UtilityTests/ArgsTest.TestTrailingBackslash (1032 of 2134)
PASS: lldb-api :: python_api/watchpoint/condition/TestWatchpointConditionAPI.py (1033 of 2134)
PASS: lldb-unit :: ScriptInterpreter/Python/./ScriptInterpreterPythonTests/PythonDataObjectsTest.TestModuleNameResolutionNoDot (1034 of 2134)
PASS: lldb-shell :: SymbolFile/DWARF/DW_AT_low_pc-addrx.s (1035 of 2134)
PASS: lldb-unit :: Expression/./ExpressionTests/CppModuleConfigurationTest.Sysroot (1036 of 2134)
PASS: lldb-unit :: ScriptInterpreter/Python/./ScriptInterpreterPythonTests/PythonDataObjectsTest.TestRun (1037 of 2134)
PASS: lldb-unit :: Symbol/./SymbolTests/TestTypeSystemClang.TestGetTypeClassNested (1038 of 2134)
PASS: lldb-api :: functionalities/data-formatter/builtin-formats/TestBuiltinFormats.py (1039 of 2134)
PASS: lldb-shell :: ObjectFile/PECOFF/sections.yaml (1040 of 2134)
PASS: lldb-unit :: Host/./HostTests/HostInfoTest.GetHostname (1041 of 2134)
PASS: lldb-unit :: Utility/./UtilityTests/RangeDataVector.FindEntryIndexesThatContain (1042 of 2134)
PASS: lldb-api :: functionalities/breakpoint/dummy_target_breakpoints/TestBreakpointsWithNoTargets.py (1043 of 2134)
PASS: lldb-shell :: SymbolFile/DWARF/DW_OP_piece-smaller-than-struct.s (1044 of 2134)
PASS: lldb-unit :: Utility/./UtilityTests/RangeTest.SlideZero (1045 of 2134)
PASS: lldb-shell :: Reproducer/TestFileRepro.test (1046 of 2134)
PASS: lldb-unit :: Process/gdb-remote/./ProcessGdbRemoteTests/GDBRemoteCommunicationClientTest.SendGetDataPacket (1047 of 2134)
PASS: lldb-shell :: Reproducer/TestVersionCheck.test (1048 of 2134)
PASS: lldb-api :: functionalities/data-formatter/data-formatter-stl/libcxx/initializerlist/TestInitializerList.py (1049 of 2134)
PASS: lldb-api :: commands/statistics/basic/TestStats.py (1050 of 2134)
PASS: lldb-shell :: ObjectFile/MachO/symtab.yaml (1051 of 2134)
PASS: lldb-api :: macosx/safe-to-func-call/TestSafeFuncCalls.py (1052 of 2134)
PASS: lldb-unit :: Utility/./UtilityTests/StreamTest.PutChar (1053 of 2134)
PASS: lldb-api :: api/log/TestAPILog.py (1054 of 2134)
PASS: lldb-unit :: debugserver/./debugserverTests/JSON.Parse (1055 of 2134)
PASS: lldb-unit :: Utility/./UtilityTests/VMRange.CollectionContains (1056 of 2134)
PASS: lldb-unit :: ScriptInterpreter/Python/./ScriptInterpreterPythonTests/PythonDataObjectsTest.TestTypeNameResolutionNoDot (1057 of 2134)
PASS: lldb-unit :: Utility/./UtilityTests/ArgsTest.ReplaceArgumentAtIndexLonger (1058 of 2134)
PASS: lldb-api :: functionalities/data-formatter/data-formatter-globals/TestDataFormatterGlobals.py (1059 of 2134)
PASS: lldb-unit :: Utility/./UtilityTests/ArchSpecTest.OperatorBool (1060 of 2134)
PASS: lldb-api :: functionalities/breakpoint/cpp_exception/TestCPPExceptionBreakpoint.py (1061 of 2134)
PASS: lldb-api :: lang/cpp/namespace_conflicts/TestNamespaceConflicts.py (1062 of 2134)
PASS: lldb-unit :: Utility/./UtilityTests/RangeTest.SetRangeBase (1063 of 2134)
PASS: lldb-shell :: SymbolFile/DWARF/debug_line-tombstone.s (1064 of 2134)
PASS: lldb-api :: types/TestShortType.py (1065 of 2134)
PASS: lldb-unit :: Utility/./UtilityTests/StringExtractorTest.DecodeHexU8_Underflow (1066 of 2134)
PASS: lldb-api :: functionalities/breakpoint/step_over_breakpoint/TestStepOverBreakpoint.py (1067 of 2134)
PASS: lldb-unit :: Platform/./LLDBPlatformTests/PlatformDarwinTest.FindComponentInPath (1068 of 2134)
PASS: lldb-unit :: SymbolFile/NativePDB/./SymbolFileNativePDBTests/PDBFPOProgramToDWARFExpressionTests.UnresolvedDependentCyclicRegisterAssignmentReference (1069 of 2134)
PASS: lldb-api :: functionalities/postmortem/elf-core/thread_crash/TestLinuxCoreThreads.py (1070 of 2134)
PASS: lldb-unit :: Symbol/./SymbolTests/DWARFCallFrameInfoTest.Basic_eh (1071 of 2134)
PASS: lldb-api :: functionalities/data-formatter/data-formatter-enum-format/TestDataFormatterEnumFormat.py (1072 of 2134)
PASS: lldb-shell :: ObjectFile/ELF/minidebuginfo-corrupt-xz.yaml (1073 of 2134)
PASS: lldb-unit :: Utility/./UtilityTests/StringListTest.GetMaxStringLengthDecreasingSize (1074 of 2134)
PASS: lldb-api :: python_api/sbvalue_const_addrof/TestSBValueConstAddrOf.py (1075 of 2134)
UNSUPPORTED: lldb-api :: functionalities/darwin_log/filter/regex/message/TestDarwinLogFilterRegexMessage.py (1076 of 2134)
PASS: lldb-unit :: Utility/./UtilityTests/OptionsWithRawTest.SingleWhitespaceInput (1077 of 2134)
PASS: lldb-unit :: Utility/./UtilityTests/ArgsTest.TestQuotedTrailingBackslash (1078 of 2134)
PASS: lldb-api :: lang/c/array_types/TestArrayTypes.py (1079 of 2134)
PASS: lldb-api :: commands/frame/var/TestFrameVar.py (1080 of 2134)
PASS: lldb-api :: commands/expression/import-std-module/unique_ptr-dbg-info-content/TestUniquePtrDbgInfoContent.py (1081 of 2134)
PASS: lldb-unit :: Process/gdb-remote/./ProcessGdbRemoteTests/GDBRemoteCommunicationClientTest.GetModulesInfoInvalidResponse (1082 of 2134)
PASS: lldb-unit :: UnwindAssembly/x86/./UnwindAssemblyx86Tests/Testx86AssemblyInspectionEngine.TestPopRBP (1083 of 2134)
PASS: lldb-unit :: Utility/./UtilityTests/ArgsTest.Yaml (1084 of 2134)
PASS: lldb-api :: lang/objc/objc-struct-argument/TestObjCStructArgument.py (1085 of 2134)
PASS: lldb-unit :: UnwindAssembly/x86/./UnwindAssemblyx86Tests/Testx86AssemblyInspectionEngine.TestReturnDetect (1086 of 2134)
PASS: lldb-unit :: Utility/./UtilityTests/DataExtractorTest.GetMaxU64 (1087 of 2134)
PASS: lldb-api :: functionalities/breakpoint/scripted_bkpt/TestScriptedResolver.py (1088 of 2134)
PASS: lldb-unit :: Utility/./UtilityTests/StringExtractorTest.GetHexU8_Exact (1089 of 2134)
UNSUPPORTED: lldb-shell :: Register/x86-64-ymm16-write.test (1090 of 2134)
PASS: lldb-unit :: UnwindAssembly/x86/./UnwindAssemblyx86Tests/Testx86AssemblyInspectionEngine.TestSubRSP (1091 of 2134)
UNSUPPORTED: lldb-api :: functionalities/darwin_log/filter/regex/activity/TestDarwinLogFilterRegexActivity.py (1092 of 2134)
PASS: lldb-unit :: Utility/./UtilityTests/RangeTest.DefaultConstructor (1093 of 2134)
PASS: lldb-api :: functionalities/step-avoids-no-debug/TestStepNoDebug.py (1094 of 2134)
UNSUPPORTED: lldb-shell :: Register/x86-64-zmm-write.test (1095 of 2134)
PASS: lldb-unit :: Utility/./UtilityTests/StringExtractorTest.GetHexBytes_Partial (1096 of 2134)
PASS: lldb-unit :: Utility/./UtilityTests/ArchSpecTest.MergeFrom (1097 of 2134)
UNSUPPORTED: lldb-api :: functionalities/data-formatter/data-formatter-stl/libstdcpp/vbool/TestDataFormatterStdVBool.py (1098 of 2134)
PASS: lldb-unit :: Symbol/./SymbolTests/TestTypeSystemClang.TestDisplayName (1099 of 2134)
PASS: lldb-unit :: Utility/./UtilityTests/FileSpecTest.FileAndDirectoryComponents (1100 of 2134)
PASS: lldb-unit :: UnwindAssembly/x86/./UnwindAssemblyx86Tests/Testx86AssemblyInspectionEngine.TestPushR14 (1101 of 2134)
PASS: lldb-unit :: Utility/./UtilityTests/StringExtractorTest.GetHexU8_Extra (1102 of 2134)
UNSUPPORTED: lldb-shell :: Register/x86-64-zmm-read.test (1103 of 2134)
PASS: lldb-api :: functionalities/breakpoint/inlined_breakpoints/TestInlinedBreakpoints.py (1104 of 2134)
PASS: lldb-shell :: SymbolFile/NativePDB/disassembly.cpp (1105 of 2134)
PASS: lldb-api :: lang/objc/rdar-11355592/TestRdar11355592.py (1106 of 2134)
PASS: lldb-shell :: Unwind/trap_frame_sym_ctx.test (1107 of 2134)
PASS: lldb-unit :: Utility/./UtilityTests/ArgsTest.AppendArguments (1108 of 2134)
PASS: lldb-unit :: Utility/./UtilityTests/TimeoutTest.Format (1109 of 2134)
PASS: lldb-unit :: Utility/./UtilityTests/StreamTest.ShiftOperatorChars (1110 of 2134)
PASS: lldb-api :: types/TestLongTypesExpr.py (1111 of 2134)
PASS: lldb-api :: lang/cpp/enum_types/TestCPP11EnumTypes.py (1112 of 2134)
PASS: lldb-unit :: Utility/./UtilityTests/DataExtractorTest.GetBitfield (1113 of 2134)
PASS: lldb-shell :: Reproducer/TestDump.test (1114 of 2134)
PASS: lldb-unit :: Utility/./UtilityTests/StreamTest.AddressPrefix (1115 of 2134)
PASS: lldb-shell :: SymbolFile/DWARF/compilercontext.ll (1116 of 2134)
PASS: lldb-unit :: Utility/./UtilityTests/UriParserTest.MinimalPath (1117 of 2134)
TIMEOUT: lldb-api :: macosx/simulator/TestSimulatorPlatform.py (1118 of 2134)
******************** TEST 'lldb-api :: macosx/simulator/TestSimulatorPlatform.py' FAILED ********************
Script:
--
/usr/local/Frameworks/Python.framework/Versions/3.7/bin/python3.7 /Users/buildslave/jenkins/workspace/lldb-cmake@2/llvm-project/lldb/test/API/dotest.py -s /Users/buildslave/jenkins/workspace/lldb-cmake@2/lldb-build/lldb-test-traces -S nm -u CXXFLAGS -u CFLAGS --codesign-identity - --server /Users/buildslave/jenkins/workspace/lldb-cmake@2/lldb-build/./bin/debugserver --arch x86_64 --build-dir /Users/buildslave/jenkins/workspace/lldb-cmake@2/lldb-build/lldb-test-build.noindex -s=/Users/buildslave/jenkins/workspace/lldb-cmake@2/test/logs -t --env TERM=vt100 --env LLVM_LIBS_DIR=/Users/buildslave/jenkins/workspace/lldb-cmake@2/lldb-build/./lib --arch x86_64 --build-dir /Users/buildslave/jenkins/workspace/lldb-cmake@2/lldb-build/lldb-test-build.noindex --lldb-module-cache-dir /Users/buildslave/jenkins/workspace/lldb-cmake@2/lldb-build/lldb-test-build.noindex/module-cache-lldb/lldb-api --clang-module-cache-dir /Users/buildslave/jenkins/workspace/lldb-cmake@2/lldb-build/lldb-test-build.noindex/module-cache-clang/lldb-api --executable /Users/buildslave/jenkins/workspace/lldb-cmake@2/lldb-build/./bin/lldb --compiler /Users/buildslave/jenkins/workspace/lldb-cmake@2/lldb-build/./bin/clang --dsymutil /Users/buildslave/jenkins/workspace/lldb-cmake@2/lldb-build/./bin/dsymutil --filecheck /Users/buildslave/jenkins/workspace/lldb-cmake@2/lldb-build/./bin/FileCheck --yaml2obj /Users/buildslave/jenkins/workspace/lldb-cmake@2/lldb-build/./bin/yaml2obj --lldb-libs-dir /Users/buildslave/jenkins/workspace/lldb-cmake@2/lldb-build/./lib /Users/buildslave/jenkins/workspace/lldb-cmake@2/llvm-project/lldb/test/API/macosx/simulator -p TestSimulatorPlatform.py
--
Exit Code: -9
Timeout: Reached timeout of 600 seconds

Hide Details

Command Output (stdout): -- lldb version 12.0.99 clang revision f72121254da48bf668c35918b53c96cf8c568342 llvm revision f72121254da48bf668c35918b53c96cf8c568342

Hide Details

-- Command Output (stderr): --

Hide Details

Session logs for test failures/errors/unexpected successes will go into directory '/Users/buildslave/jenkins/workspace/lldb-cmake@2/test/logs' Change dir to: /Users/buildslave/jenkins/workspace/lldb-cmake@2/llvm-project/lldb/test/API/macosx/simulator runCmd: settings clear -all output:

Hide Details

runCmd: settings set symbols.enable-external-lookup false output:

Hide Details

runCmd: settings set target.inherit-tcc true output:

Hide Details

runCmd: settings set target.auto-apply-fixits false output:

Hide Details

runCmd: settings set plugin.process.gdb-remote.packet-timeout 60 output:

Hide Details

runCmd: settings set symbols.clang-modules-cache-path "/Users/buildslave/jenkins/workspace/lldb-cmake@2/lldb-build/lldb-test-build.noindex/module-cache-lldb/lldb-api" output:

Hide Details

runCmd: settings set use-color false output:

Hide Details

runCmd: setting set target.prefer-dynamic-value no-dynamic-values output:

Hide Details

runCmd: log enable gdb-remote packets -f /Users/buildslave/jenkins/workspace/lldb-cmake@2/lldb-build/lldb-test-build.noindex/macosx/simulator/TestSimulatorPlatform.test_ios/packets.log output:

Hide Details

runCmd: image list -b -t output: [ 0] a.out x86_64-apple-ios13.5.0-simulator [ 1] dyld x86_64-apple-macosx10.15.0 [ 2] dyld_sim x86_64-apple-ios13.5.0-simulator [ 3] libc++.1.dylib x86_64-apple-ios13.5.0-simulator [ 4] libSystem.B.dylib x86_64-apple-ios13.5.0-simulator [ 5] libc++abi.dylib x86_64-apple-ios13.5.0-simulator [ 6] libcache.dylib x86_64-apple-ios13.5.0-simulator [ 7] libcommonCrypto.dylib x86_64-apple-ios13.5.0-simulator [ 8] libcompiler_rt.dylib x86_64-apple-ios13.5.0-simulator [ 9] libcopyfile.dylib x86_64-apple-ios13.5.0-simulator [ 10] libcorecrypto.dylib x86_64-apple-ios13.5.0-simulator [ 11] libdispatch.dylib x86_64-apple-ios13.5.0-simulator [ 12] libdyld.dylib x86_64-apple-ios13.5.0-simulator [ 13] liblaunch.dylib x86_64-apple-ios13.5.0-simulator [ 14] libmacho.dylib x86_64-apple-ios13.5.0-simulator [ 15] libremovefile.dylib x86_64-apple-ios13.5.0-simulator [ 16] libsystem_asl.dylib x86_64-apple-ios13.5.0-simulator [ 17] libsystem_blocks.dylib x86_64-apple-ios13.5.0-simulator [ 18] libsystem_c.dylib x86_64-apple-ios13.5.0-simulator [ 19] libsystem_configuration.dylib x86_64-apple-ios13.5.0-simulator [ 20] libsystem_containermanager.dylib x86_64-apple-ios13.5.0-simulator [ 21] libsystem_coreservices.dylib x86_64-apple-ios13.5.0-simulator [ 22] libsystem_darwin.dylib x86_64-apple-ios13.5.0-simulator [ 23] libsystem_dnssd.dylib x86_64-apple-ios13.5.0-simulator [ 24] libsystem_featureflags.dylib x86_64-apple-ios13.5.0-simulator [ 25] libsystem_info.dylib x86_64-apple-ios13.5.0-simulator [ 26] libsystem_m.dylib x86_64-apple-ios13.5.0-simulator [ 27] libsystem_malloc.dylib x86_64-apple-ios13.5.0-simulator [ 28] libsystem_notify.dylib x86_64-apple-ios13.5.0-simulator [ 29] libsystem_sandbox.dylib x86_64-apple-ios13.5.0-simulator [ 30] libsystem_sim_kernel.dylib x86_64-apple-ios13.5.0-simulator [ 31] libsystem_sim_platform.dylib x86_64-apple-ios13.5.0-simulator [ 32] libsystem_sim_pthread.dylib x86_64-apple-ios13.5.0-simulator [ 33] libsystem_trace.dylib x86_64-apple-ios13.5.0-simulator [ 34] libunwind.dylib x86_64-apple-ios13.5.0-simulator [ 35] libxpc.dylib x86_64-apple-ios13.5.0-simulator [ 36] libsystem_sim_pthread_host.dylib x86_64-apple-ios13.5.0-simulator [ 37] libsystem_sim_platform_host.dylib x86_64-apple-ios13.5.0-simulator [ 38] libsystem_sim_kernel_host.dylib x86_64-apple-ios13.5.0-simulator [ 39] libsystem_kernel.dylib x86_64-apple-macosx10.15.0-simulator(0x00007fff51b5a000) [ 40] libobjc.A.dylib x86_64-apple-ios13.5.0-simulator [ 41] libsystem_platform.dylib x86_64-apple-macosx10.15.0-simulator(0x00007fff51bfd000) [ 42] libsystem_pthread.dylib x86_64-apple-macosx10.15.0-simulator(0x00007fff51c06000)

Hide Details

Hide Details

Expecting pattern: a\.out x86_64-apple-ios13.5.*-simulator Matched

Hide Details

<bound method SBProcess.Kill of <lldb.SBProcess; proxy of <Swig Object of type 'lldb::SBProcess *' at 0x10c368ed0> >>: success

Hide Details

PASS: LLDB (/Users/buildslave/jenkins/workspace/lldb-cmake@2/lldb-build/bin/clang-x86_64) :: test_ios (TestSimulatorPlatform.TestSimulatorPlatformLaunching) runCmd: settings clear -all output:

Hide Details

runCmd: settings set symbols.enable-external-lookup false output:

Hide Details

runCmd: settings set target.inherit-tcc true output:

Hide Details

runCmd: settings set target.auto-apply-fixits false output:

Hide Details

runCmd: settings set plugin.process.gdb-remote.packet-timeout 60 output:

Hide Details

runCmd: settings set symbols.clang-modules-cache-path "/Users/buildslave/jenkins/workspace/lldb-cmake@2/lldb-build/lldb-test-build.noindex/module-cache-lldb/lldb-api" output:

Hide Details

runCmd: settings set use-color false output:

Hide Details

runCmd: setting set target.prefer-dynamic-value no-dynamic-values output:

Hide Details

UNSUPPORTED: LLDB (/Users/buildslave/jenkins/workspace/lldb-cmake@2/lldb-build/bin/clang-x86_64) :: test_ios_backdeploy_apple_silicon (TestSimulatorPlatform.TestSimulatorPlatformLaunching) (skipping due to the following parameter(s): architecture) runCmd: settings clear -all output:

Hide Details

runCmd: settings set symbols.enable-external-lookup false output:

Hide Details

runCmd: settings set target.inherit-tcc true output:

Hide Details

runCmd: settings set target.auto-apply-fixits false output:

Hide Details

runCmd: settings set plugin.process.gdb-remote.packet-timeout 60 output:

Hide Details

runCmd: settings set symbols.clang-modules-cache-path "/Users/buildslave/jenkins/workspace/lldb-cmake@2/lldb-build/lldb-test-build.noindex/module-cache-lldb/lldb-api" output:

Hide Details

runCmd: settings set use-color false output:

Hide Details

runCmd: setting set target.prefer-dynamic-value no-dynamic-values output:

Hide Details

runCmd: log enable gdb-remote packets -f /Users/buildslave/jenkins/workspace/lldb-cmake@2/lldb-build/lldb-test-build.noindex/macosx/simulator/TestSimulatorPlatform.test_ios_backdeploy_x86/packets.log output:

Hide Details

runCmd: image list -b -t output: [ 0] a.out x86_64-apple-ios13.0.0-simulator [ 1] dyld x86_64-apple-macosx10.15.0 [ 2] dyld_sim x86_64-apple-ios13.5.0-simulator [ 3] libc++.1.dylib x86_64-apple-ios13.5.0-simulator [ 4] libSystem.B.dylib x86_64-apple-ios13.5.0-simulator [ 5] libc++abi.dylib x86_64-apple-ios13.5.0-simulator [ 6] libcache.dylib x86_64-apple-ios13.5.0-simulator [ 7] libcommonCrypto.dylib x86_64-apple-ios13.5.0-simulator [ 8] libcompiler_rt.dylib x86_64-apple-ios13.5.0-simulator [ 9] libcopyfile.dylib x86_64-apple-ios13.5.0-simulator [ 10] libcorecrypto.dylib x86_64-apple-ios13.5.0-simulator [ 11] libdispatch.dylib x86_64-apple-ios13.5.0-simulator [ 12] libdyld.dylib x86_64-apple-ios13.5.0-simulator [ 13] liblaunch.dylib x86_64-apple-ios13.5.0-simulator [ 14] libmacho.dylib x86_64-apple-ios13.5.0-simulator [ 15] libremovefile.dylib x86_64-apple-ios13.5.0-simulator [ 16] libsystem_asl.dylib x86_64-apple-ios13.5.0-simulator [ 17] libsystem_blocks.dylib x86_64-apple-ios13.5.0-simulator [ 18] libsystem_c.dylib x86_64-apple-ios13.5.0-simulator [ 19] libsystem_configuration.dylib x86_64-apple-ios13.5.0-simulator [ 20] libsystem_containermanager.dylib x86_64-apple-ios13.5.0-simulator [ 21] libsystem_coreservices.dylib x86_64-apple-ios13.5.0-simulator [ 22] libsystem_darwin.dylib x86_64-apple-ios13.5.0-simulator [ 23] libsystem_dnssd.dylib x86_64-apple-ios13.5.0-simulator [ 24] libsystem_featureflags.dylib x86_64-apple-ios13.5.0-simulator [ 25] libsystem_info.dylib x86_64-apple-ios13.5.0-simulator [ 26] libsystem_m.dylib x86_64-apple-ios13.5.0-simulator [ 27] libsystem_malloc.dylib x86_64-apple-ios13.5.0-simulator [ 28] libsystem_notify.dylib x86_64-apple-ios13.5.0-simulator [ 29] libsystem_sandbox.dylib x86_64-apple-ios13.5.0-simulator [ 30] libsystem_sim_kernel.dylib x86_64-apple-ios13.5.0-simulator [ 31] libsystem_sim_platform.dylib x86_64-apple-ios13.5.0-simulator [ 32] libsystem_sim_pthread.dylib x86_64-apple-ios13.5.0-simulator [ 33] libsystem_trace.dylib x86_64-apple-ios13.5.0-simulator [ 34] libunwind.dylib x86_64-apple-ios13.5.0-simulator [ 35] libxpc.dylib x86_64-apple-ios13.5.0-simulator [ 36] libsystem_sim_pthread_host.dylib x86_64-apple-ios13.5.0-simulator [ 37] libsystem_sim_platform_host.dylib x86_64-apple-ios13.5.0-simulator [ 38] libsystem_sim_kernel_host.dylib x86_64-apple-ios13.5.0-simulator [ 39] libsystem_kernel.dylib x86_64-apple-macosx10.15.0-simulator(0x00007fff51b5a000) [ 40] libobjc.A.dylib x86_64-apple-ios13.5.0-simulator [ 41] libsystem_platform.dylib x86_64-apple-macosx10.15.0-simulator(0x00007fff51bfd000) [ 42] libsystem_pthread.dylib x86_64-apple-macosx10.15.0-simulator(0x00007fff51c06000)

Hide Details

Hide Details

--

Hide Details

******************** PASS: lldb-shell :: Breakpoint/implicit_const_form_support.test (1119 of 2134) PASS: lldb-api :: commands/session/save/TestSessionSave.py (1120 of 2134) PASS: lldb-api :: functionalities/pointer_num_children/TestPointerNumChildren.py (1121 of 2134) PASS: lldb-api :: commands/expression/scoped_enums/TestScopedEnumType.py (1122 of 2134) PASS: lldb-api :: functionalities/jitloader_gdb/TestJITLoaderGDB.py (1123 of 2134) UNSUPPORTED: lldb-shell :: Register/x86-64-ymm16-read.test (1124 of 2134) PASS: lldb-api :: python_api/frame/TestFrames.py (1125 of 2134) PASS: lldb-api :: functionalities/thread/concurrent_events/TestConcurrentWatchBreakDelay.py (1126 of 2134) PASS: lldb-unit :: ScriptInterpreter/Python/./ScriptInterpreterPythonTests/PythonDataObjectsTest.TestPythonDictionaryManipulation (1127 of 2134) PASS: lldb-api :: functionalities/set-data/TestSetData.py (1128 of 2134) PASS: lldb-unit :: Utility/./UtilityTests/ArchSpecTest.TestSetTriple (1129 of 2134) PASS: lldb-api :: functionalities/data-formatter/synthupdate/TestSyntheticFilterRecompute.py (1130 of 2134) UNSUPPORTED: lldb-api :: functionalities/darwin_log/filter/regex/subsystem/TestDarwinLogFilterRegexSubsystem.py (1131 of 2134) PASS: lldb-api :: lang/objc/objc-super/TestObjCSuper.py (1132 of 2134) PASS: lldb-shell :: Breakpoint/split-dwarf-5-addrbase.test (1133 of 2134) UNSUPPORTED: lldb-shell :: Register/x86-gp-write.test (1134 of 2134) UNSUPPORTED: lldb-shell :: ScriptInterpreter/Lua/bindings.test (1135 of 2134) PASS: lldb-api :: functionalities/thread/concurrent_events/TestConcurrentSignalBreak.py (1136 of 2134) PASS: lldb-unit :: ObjectFile/ELF/./ObjectFileELFTests/ObjectFileELFTest.GetSymtab_NoSymEntryPointArmThumbAddressClass (1137 of 2134) PASS: lldb-unit :: Utility/./UtilityTests/RangeTest.SizeTypes (1138 of 2134) PASS: lldb-unit :: Process/minidump/./LLDBMinidumpTests/MinidumpParserTest.GetMemoryRegionInfoLinuxMaps (1139 of 2134) UNSUPPORTED: lldb-shell :: SymbolFile/DWARF/debug-types-expressions.test (1140 of 2134) UNSUPPORTED: lldb-api :: functionalities/thread/state/TestThreadStates.py (1141 of 2134) PASS: lldb-api :: functionalities/thread/concurrent_events/TestConcurrentManyCrash.py (1142 of 2134) PASS: lldb-unit :: Core/./LLDBCoreTests/RichManglingContextTest.FromCxxMethodName (1143 of 2134) PASS: lldb-unit :: Utility/./UtilityTests/BinaryStreamTest.PutSLEB128EightBytes (1144 of 2134) PASS: lldb-api :: functionalities/data-formatter/data-formatter-stl/libcxx/atomic/TestLibCxxAtomic.py (1145 of 2134) PASS: lldb-api :: commands/watchpoints/watchpoint_set_command/TestWatchLocationWithWatchSet.py (1146 of 2134) PASS: lldb-api :: lang/c/bitfields/TestBitfields.py (1147 of 2134) UNSUPPORTED: lldb-shell :: BuildScript/toolchain-msvc.test (1148 of 2134) PASS: lldb-api :: lang/objc/print-obj/TestPrintObj.py (1149 of 2134) PASS: lldb-unit :: Utility/./UtilityTests/GeneratorTest.Create (1150 of 2134) PASS: lldb-shell :: ObjectFile/MachO/subsections.yaml (1151 of 2134) PASS: lldb-api :: iohandler/autosuggestion/TestAutosuggestion.py (1152 of 2134) PASS: lldb-api :: functionalities/postmortem/minidump/TestMiniDump.py (1153 of 2134) PASS: lldb-api :: commands/expression/save_jit_objects/TestSaveJITObjects.py (1154 of 2134) PASS: lldb-unit :: Process/gdb-remote/./ProcessGdbRemoteTests/GDBRemoteCommunicationClientTest.ReadRegister (1155 of 2134) PASS: lldb-api :: functionalities/gdb_remote_client/TestGDBRemoteDiskFileCompletion.py (1156 of 2134) PASS: lldb-api :: functionalities/breakpoint/breakpoint_by_file_colon_line/TestBreakpointByFileColonLine.py (1157 of 2134) PASS: lldb-unit :: SymbolFile/DWARF/./SymbolFileDWARFTests/SymbolFileDWARFTests.TestAbbrevOutOfOrder (1158 of 2134) UNSUPPORTED: lldb-api :: lang/objc/objc-dynamic-value/TestObjCDynamicValue.py (1159 of 2134) PASS: lldb-unit :: Symbol/./SymbolTests/TestTypeSystemClang.TestGetEnumIntegerTypeInvalid (1160 of 2134) PASS: lldb-unit :: Utility/./UtilityTests/DataExtractorTest.GetDouble (1161 of 2134) PASS: lldb-api :: python_api/symbol-context/two-files/TestSymbolContextTwoFiles.py (1162 of 2134) PASS: lldb-api :: lang/cpp/symbols/TestSymbols.py (1163 of 2134) PASS: lldb-shell :: ObjectFile/PECOFF/dep-modules.yaml (1164 of 2134) PASS: lldb-unit :: Utility/./UtilityTests/StringListTest.AppendListCStringArrayEmpty (1165 of 2134) PASS: lldb-unit :: Utility/./UtilityTests/NameMatchesTest.EndsWith (1166 of 2134) PASS: lldb-unit :: Utility/./UtilityTests/DataExtractorTest.GetCStrUnterminated (1167 of 2134) PASS: lldb-unit :: Utility/./UtilityTests/StreamTest.PutHex16ByteOrderLittle (1168 of 2134) PASS: lldb-unit :: Utility/./UtilityTests/ReproducerTest.SetCapture (1169 of 2134) PASS: lldb-unit :: Utility/./UtilityTests/AnsiTerminal.AtStart (1170 of 2134) PASS: lldb-unit :: ScriptInterpreter/Python/./ScriptInterpreterPythonTests/PythonDataObjectsTest.TestPythonBytes (1171 of 2134) PASS: lldb-api :: functionalities/abbreviation/TestAbbreviations.py (1172 of 2134) UNSUPPORTED: lldb-api :: commands/watchpoints/multi_watchpoint_slots/TestWatchpointMultipleSlots.py (1173 of 2134) PASS: lldb-shell :: SymbolFile/DWARF/array-sizes.s (1174 of 2134) PASS: lldb-unit :: Utility/./UtilityTests/ProcessInstanceInfo.Dump (1175 of 2134) PASS: lldb-shell :: Settings/TestFrameFormatColor.test (1176 of 2134) PASS: lldb-unit :: Process/gdb-remote/./ProcessGdbRemoteTests/GDBRemoteClientBaseTest.SendContinueDelegateStructuredDataReceipt (1177 of 2134) PASS: lldb-api :: lang/objc/single-entry-dictionary/TestObjCSingleEntryDictionary.py (1178 of 2134) PASS: lldb-api :: lang/objc/objc-new-syntax/TestObjCNewSyntaxArray.py (1179 of 2134) PASS: lldb-unit :: Utility/./UtilityTests/VASprintfTest.EncodingError (1180 of 2134) PASS: lldb-api :: functionalities/thread/thread_specific_break/TestThreadSpecificBreakpoint.py (1181 of 2134) PASS: lldb-unit :: UnwindAssembly/x86/./UnwindAssemblyx86Tests/Testx86AssemblyInspectionEngine.TestCALLNextInsn (1182 of 2134) UNSUPPORTED: lldb-api :: functionalities/data-formatter/data-formatter-stl/libstdcpp/tuple/TestDataFormatterStdTuple.py (1183 of 2134) PASS: lldb-shell :: SymbolFile/DWARF/deterministic-build.cpp (1184 of 2134) PASS: lldb-api :: lang/cpp/bitfields/TestCppBitfields.py (1185 of 2134) UNSUPPORTED: lldb-api :: tools/lldb-server/TestGdbRemote_vContThreads.py (1186 of 2134) PASS: lldb-api :: lang/objc/hidden-ivars/TestHiddenIvars.py (1187 of 2134) PASS: lldb-unit :: Expression/./ExpressionTests/CppModuleConfigurationTest.Linux (1188 of 2134) PASS: lldb-unit :: SymbolFile/DWARF/./SymbolFileDWARFTests/DWARFASTParserClangTests.EnsureAllDIEsInDeclContextHaveBeenParsedParsesOnlyMatchingEntries (1189 of 2134) PASS: lldb-api :: functionalities/thread/concurrent_events/TestConcurrentDelayWatchBreak.py (1190 of 2134) PASS: lldb-api :: functionalities/gdb_remote_client/TestJLink6Armv7RegisterDefinition.py (1191 of 2134) PASS: lldb-unit :: debugserver/./debugserverTests/RNBSocket.LoopBackListenIPv4 (1192 of 2134) PASS: lldb-api :: commands/watchpoints/watchpoint_commands/command/TestWatchpointCommandPython.py (1193 of 2134) PASS: lldb-unit :: Utility/./UtilityTests/BinaryStreamTest.PutULEB128OneByte (1194 of 2134) PASS: lldb-api :: commands/expression/call-throws/TestCallThatThrows.py (1195 of 2134) PASS: lldb-api :: functionalities/breakpoint/breakpoint_options/TestBreakpointOptions.py (1196 of 2134) PASS: lldb-unit :: Target/./TargetTests/MCBasedABI.MapRegisterName (1197 of 2134) PASS: lldb-unit :: SymbolFile/DWARF/./SymbolFileDWARFTests/SymbolFileDWARFTests.TestAbbrevOrder1Start5 (1198 of 2134) PASS: lldb-shell :: SymbolFile/NativePDB/function-types-calling-conv.cpp (1199 of 2134) PASS: lldb-api :: functionalities/data-formatter/compactvectors/TestCompactVectors.py (1200 of 2134) PASS: lldb-api :: functionalities/gdb_remote_client/TestStopPCs.py (1201 of 2134) PASS: lldb-unit :: Utility/./UtilityTests/UUIDTest.StringConverion (1202 of 2134) PASS: lldb-api :: macosx/thread-names/TestInterruptThreadNames.py (1203 of 2134) PASS: lldb-api :: functionalities/breakpoint/cpp/TestCPPBreakpointLocations.py (1204 of 2134) PASS: lldb-unit :: Utility/./UtilityTests/StreamTest.PutBytesAsRawHex8ToLittleEndian (1205 of 2134) PASS: lldb-unit :: Utility/./UtilityTests/BroadcasterTest.BroadcastEvent (1206 of 2134) PASS: lldb-shell :: Breakpoint/case-sensitive.test (1207 of 2134) PASS: lldb-unit :: Host/./HostTests/SocketTest.TCPGetConnectURI (1208 of 2134) PASS: lldb-unit :: Utility/./UtilityTests/VASprintfTest.NoBufferResize (1209 of 2134) PASS: lldb-api :: commands/expression/dont_allow_jit/TestAllowJIT.py (1210 of 2134) PASS: lldb-api :: lang/c/unicode/TestUnicodeSymbols.py (1211 of 2134) PASS: lldb-api :: lang/cpp/lambdas/TestLambdas.py (1212 of 2134) PASS: lldb-unit :: Host/./HostTests/HostInfoTest.GetAugmentedArchSpec (1213 of 2134) PASS: lldb-api :: macosx/load-kext/TestLoadKext.py (1214 of 2134) PASS: lldb-api :: functionalities/thread/jump/TestThreadJump.py (1215 of 2134) PASS: lldb-unit :: Utility/./UtilityTests/ProcessInfoTest.Constructor (1216 of 2134) PASS: lldb-unit :: Utility/./UtilityTests/StringListTest.ShiftStdString (1217 of 2134) PASS: lldb-unit :: Process/gdb-remote/./ProcessGdbRemoteTests/GDBRemoteClientBaseTest.SendContinueAndAsyncPacket (1218 of 2134) PASS: lldb-api :: functionalities/data-formatter/data-formatter-objc/TestDataFormatterObjCExpr.py (1219 of 2134) PASS: lldb-shell :: Breakpoint/debug_rnglist_basic.test (1220 of 2134) PASS: lldb-unit :: Utility/./UtilityTests/ArgsTest.ReplaceArgumentAtIndexEqual (1221 of 2134) PASS: lldb-api :: functionalities/data-formatter/data-formatter-objc/TestDataFormatterObjCPlain.py (1222 of 2134) PASS: lldb-unit :: Utility/./UtilityTests/StreamTeeTest.AppendStream (1223 of 2134) PASS: lldb-api :: functionalities/thread/concurrent_events/TestConcurrentCrashWithWatchpoint.py (1224 of 2134) PASS: lldb-shell :: Reproducer/TestDSYM.test (1225 of 2134) PASS: lldb-unit :: Utility/./UtilityTests/StringExtractorTest.GetU64LittleEndian (1226 of 2134) PASS: lldb-shell :: SymbolFile/Breakpad/symtab-macho.test (1227 of 2134) PASS: lldb-shell :: ScriptInterpreter/Python/sb_address_exception.test (1228 of 2134) PASS: lldb-api :: commands/expression/char/TestExprsChar.py (1229 of 2134) PASS: lldb-unit :: tools/lldb-server/tests/./LLDBServerTests/TestBase.LaunchModePreservesEnvironment (1230 of 2134) PASS: lldb-api :: lang/cpp/type_lookup/TestCppTypeLookup.py (1231 of 2134) PASS: lldb-unit :: Process/gdb-remote/./ProcessGdbRemoteTests/GDBRemoteClientBaseTest.SendContinueAndWait (1232 of 2134) PASS: lldb-unit :: Utility/./UtilityTests/RangeTest.DoesIntersect (1233 of 2134) PASS: lldb-api :: functionalities/gdb_remote_client/TestArmRegisterDefinition.py (1234 of 2134) PASS: lldb-api :: functionalities/unwind/noreturn/TestNoreturnUnwind.py (1235 of 2134) PASS: lldb-unit :: Interpreter/./InterpreterTests/CompletionTest.DirCompletionUsername (1236 of 2134) PASS: lldb-api :: api/multiple-targets/TestMultipleTargets.py (1237 of 2134) PASS: lldb-unit :: ScriptInterpreter/Python/./ScriptInterpreterPythonTests/PythonDataObjectsTest.TestPythonBoolean (1238 of 2134) PASS: lldb-unit :: Utility/./UtilityTests/ScalarTest.ComparisonFloat (1239 of 2134) PASS: lldb-api :: lang/objc/objc-static-method/TestObjCStaticMethod.py (1240 of 2134) UNSUPPORTED: lldb-shell :: SymbolFile/PDB/function-level-linking.test (1241 of 2134) PASS: lldb-api :: lang/objc/objc_direct-methods/TestObjCDirectMethods.py (1242 of 2134) PASS: lldb-api :: commands/expression/import_base_class_when_class_has_derived_member/TestImportBaseClassWhenClassHasDerivedMember.py (1243 of 2134) PASS: lldb-api :: functionalities/gdb_remote_client/TestPlatformClient.py (1244 of 2134) PASS: lldb-unit :: Utility/./UtilityTests/LogTest.LLDB_LOG_nullptr (1245 of 2134) PASS: lldb-api :: functionalities/tail_call_frames/thread_step_out_message/TestArtificialFrameStepOutMessage.py (1246 of 2134) PASS: lldb-shell :: SymbolFile/NativePDB/globals-bss.cpp (1247 of 2134) PASS: lldb-unit :: Utility/./UtilityTests/AnsiTerminal.Twice (1248 of 2134) PASS: lldb-unit :: Expression/./ExpressionTests/DiagnosticManagerTest.GetStringMultipleDiags (1249 of 2134) PASS: lldb-unit :: Utility/./UtilityTests/ArgsTest.TestSingleQuotedArgWithSpace (1250 of 2134) PASS: lldb-api :: functionalities/data-formatter/nsdictionarysynth/TestNSDictionarySynthetic.py (1251 of 2134) PASS: lldb-api :: commands/expression/context-object/TestContextObject.py (1252 of 2134) PASS: lldb-unit :: Symbol/./SymbolTests/PostfixExpression.ToDWARF (1253 of 2134) PASS: lldb-unit :: Utility/./UtilityTests/LogChannelTest.Enable (1254 of 2134) PASS: lldb-api :: functionalities/data-formatter/data-formatter-stl/libcxx/multiset/TestDataFormatterLibcxxMultiSet.py (1255 of 2134) PASS: lldb-api :: lang/objc/objc-new-syntax/TestObjCNewSyntaxLiteral.py (1256 of 2134) PASS: lldb-api :: functionalities/data-formatter/data-formatter-stl/libcxx/list/loop/TestDataFormatterLibcxxListLoop.py (1257 of 2134) PASS: lldb-unit :: Host/./HostTests/MainLoopTest.DetectsEOF (1258 of 2134) PASS: lldb-shell :: ObjectFile/ELF/compressed-sections.yaml (1259 of 2134) PASS: lldb-unit :: Utility/./UtilityTests/ConstStringTest.YAML (1260 of 2134) PASS: lldb-unit :: Host/./HostTests/ConnectionFileDescriptorTest.TCPGetURIv6 (1261 of 2134) PASS: lldb-shell :: Breakpoint/debug_rnglist_rlestartend.test (1262 of 2134) PASS: lldb-unit :: Language/Highlighting/./HighlighterTests/HighlighterTest.ClangCursorPosEndOfLine (1263 of 2134) PASS: lldb-api :: terminal/TestSTTYBeforeAndAfter.py (1264 of 2134) PASS: lldb-unit :: Utility/./UtilityTests/CompletionRequest.DuplicateFilteringWithComments (1265 of 2134) PASS: lldb-api :: sanity/TestModuleCacheSanity.py (1266 of 2134) PASS: lldb-shell :: SymbolFile/DWARF/find-basic-variable.cpp (1267 of 2134) UNSUPPORTED: lldb-api :: commands/register/register/intel_xtended_registers/TestMPXRegisters.py (1268 of 2134) PASS: lldb-unit :: Utility/./UtilityTests/StreamTest.PutStringAsRawHex8 (1269 of 2134) PASS: lldb-unit :: Utility/./UtilityTests/StringExtractorTest.GetU32LittleEndian (1270 of 2134) PASS: lldb-api :: macosx/universal/TestUniversal.py (1271 of 2134) PASS: lldb-api :: commands/watchpoints/hello_watchpoint/TestMyFirstWatchpoint.py (1272 of 2134) PASS: lldb-unit :: Utility/./UtilityTests/StringExtractorTest.GetHexBytesAvail_OddPair2 (1273 of 2134) PASS: lldb-api :: functionalities/data-formatter/poarray/TestPrintObjectArray.py (1274 of 2134) PASS: lldb-api :: functionalities/gdb_remote_client/TestRecognizeBreakpoint.py (1275 of 2134) PASS: lldb-unit :: Utility/./UtilityTests/CompletionRequest.FakeLastArg (1276 of 2134) PASS: lldb-shell :: Register/x86-64-ymm-read.test (1277 of 2134) PASS: lldb-shell :: Reproducer/Functionalities/TestStepping.test (1278 of 2134) PASS: lldb-unit :: ObjectFile/Breakpad/./ObjectFileBreakpadTests/FuncRecord.parse (1279 of 2134) PASS: lldb-unit :: ObjectFile/Breakpad/./ObjectFileBreakpadTests/StackWinRecord.parse (1280 of 2134) PASS: lldb-unit :: UnwindAssembly/ARM64/./Arm64InstEmulationTests/TestArm64InstEmulation.TestFramelessThreeEpilogueFunction (1281 of 2134) PASS: lldb-api :: lang/cpp/operator-overload/TestOperatorOverload.py (1282 of 2134) PASS: lldb-api :: functionalities/gdb_remote_client/TestTargetXMLArch.py (1283 of 2134) PASS: lldb-unit :: Target/./TargetTests/ExecutionContextTest.GetByteOrder (1284 of 2134) PASS: lldb-unit :: Symbol/./SymbolTests/PostfixExpression.ParseFPOProgram (1285 of 2134) PASS: lldb-api :: commands/target/dump-symtab-demangle/TestDumpSymtabDemangle.py (1286 of 2134) PASS: lldb-api :: lang/c/stepping/TestThreadStepping.py (1287 of 2134) PASS: lldb-api :: lang/cpp/rvalue-references/TestRvalueReferences.py (1288 of 2134) PASS: lldb-api :: functionalities/data-formatter/ostypeformatting/TestFormattersOsType.py (1289 of 2134) PASS: lldb-api :: lang/objc/foundation/TestSymbolTable.py (1290 of 2134) PASS: lldb-shell :: SymbolFile/DWARF/dwarf5-atomic.s (1291 of 2134) PASS: lldb-unit :: Utility/./UtilityTests/BinaryStreamTest.PutSLEB128OneByte (1292 of 2134) PASS: lldb-shell :: Minidump/Windows/broken-unwind.test (1293 of 2134) PASS: lldb-unit :: Symbol/./SymbolTests/TestTypeSystemClang.TestRemoveFastQualifiers (1294 of 2134) PASS: lldb-api :: lang/cpp/subst_template_type_param/TestSubstTemplateTypeParam.py (1295 of 2134) PASS: lldb-unit :: Utility/./UtilityTests/BinaryStreamTest.PutULEB128TwoBytes (1296 of 2134) PASS: lldb-unit :: Utility/./UtilityTests/StringLexerTest.GetUnlexed (1297 of 2134) PASS: lldb-unit :: Host/./HostTests/MainLoopTest.UnmonitoredSignal (1298 of 2134) PASS: lldb-api :: functionalities/breakpoint/breakpoint_set_restart/TestBreakpointSetRestart.py (1299 of 2134) PASS: lldb-unit :: Utility/./UtilityTests/RangeTest.LessThan (1300 of 2134) PASS: lldb-api :: functionalities/data-formatter/refpointer-recursion/TestDataFormatterRefPtrRecursion.py (1301 of 2134) PASS: lldb-api :: functionalities/data-formatter/data-formatter-stl/libcxx/string/TestDataFormatterLibcxxString.py (1302 of 2134) PASS: lldb-unit :: Utility/./UtilityTests/StreamTest.AddressRangeEmptyRange (1303 of 2134) UNSUPPORTED: lldb-shell :: SymbolFile/PDB/typedefs.test (1304 of 2134) PASS: lldb-api :: lang/cpp/gmodules/TestWithModuleDebugging.py (1305 of 2134) PASS: lldb-unit :: UnwindAssembly/x86/./UnwindAssemblyx86Tests/Testx86AssemblyInspectionEngine.TestPopR13 (1306 of 2134) PASS: lldb-unit :: Utility/./UtilityTests/LogChannelEnabledTest.LogThread (1307 of 2134) PASS: lldb-unit :: Utility/./UtilityTests/ConstStringTest.FromMidOfBufferStringRef (1308 of 2134) PASS: lldb-unit :: Utility/./UtilityTests/ArgsTest.ReplaceArgumentAtIndexOutOfRange (1309 of 2134) PASS: lldb-shell :: ObjectFile/ELF/PT_LOAD-overlap.yaml (1310 of 2134) PASS: lldb-shell :: SymbolFile/NativePDB/break-by-function.cpp (1311 of 2134) PASS: lldb-unit :: Utility/./UtilityTests/ConstStringTest.format_provider (1312 of 2134) PASS: lldb-unit :: Utility/./UtilityTests/StreamTeeTest.Write (1313 of 2134) PASS: lldb-unit :: Utility/./UtilityTests/RegularExpression.CopyAssignment (1314 of 2134) PASS: lldb-api :: functionalities/gdb_remote_client/TestGDBRemoteClient.py (1315 of 2134) PASS: lldb-api :: functionalities/reproducers/attach/TestReproducerAttach.py (1316 of 2134) PASS: lldb-api :: lang/cpp/nsimport/TestCppNsImport.py (1317 of 2134) PASS: lldb-shell :: Reproducer/TestGDBRemoteRepro.test (1318 of 2134) PASS: lldb-api :: api/multiple-debuggers/TestMultipleDebuggers.py (1319 of 2134) PASS: lldb-shell :: ScriptInterpreter/None/none.test (1320 of 2134) PASS: lldb-unit :: Process/minidump/./LLDBMinidumpTests/MinidumpParserTest.MinidumpDuplicateModuleMappedFirst (1321 of 2134) PASS: lldb-api :: functionalities/thread/concurrent_events/TestConcurrentBreakpointDelayBreakpointOneSignal.py (1322 of 2134) PASS: lldb-unit :: Symbol/./SymbolTests/TestClangASTImporter.CanImportInvalidType (1323 of 2134) PASS: lldb-api :: commands/log/invalid-args/TestInvalidArgsLog.py (1324 of 2134) PASS: lldb-api :: commands/expression/import-std-module/vector-bool/TestVectorBoolFromStdModule.py (1325 of 2134) PASS: lldb-shell :: ObjectFile/ELF/PT_LOAD-overlap-PT_TLS.yaml (1326 of 2134) PASS: lldb-shell :: Reproducer/TestRelativePath.test (1327 of 2134) PASS: lldb-api :: commands/frame/recognizer/TestFrameRecognizer.py (1328 of 2134) PASS: lldb-unit :: SymbolFile/NativePDB/./SymbolFileNativePDBTests/PDBFPOProgramToDWARFExpressionTests.UnsupportedRASearch (1329 of 2134) PASS: lldb-unit :: Process/minidump/./LLDBMinidumpTests/MinidumpParserTest.GetMemoryRegionInfo (1330 of 2134) PASS: lldb-unit :: UnwindAssembly/x86/./UnwindAssemblyx86Tests/Testx86AssemblyInspectionEngine.TestSimplex86_64Augmented (1331 of 2134) PASS: lldb-api :: commands/expression/import-std-module/vector-dbg-info-content/TestDbgInfoContentVectorFromStdModule.py (1332 of 2134) PASS: lldb-unit :: Utility/./UtilityTests/OptionsWithRawTest.LeadingSpaceArgs (1333 of 2134) PASS: lldb-api :: functionalities/thread/ignore_suspended/TestIgnoreSuspendedThread.py (1334 of 2134) PASS: lldb-api :: macosx/find-dsym/bundle-with-dot-in-filename/TestBundleWithDotInFilename.py (1335 of 2134) PASS: lldb-unit :: Utility/./UtilityTests/StreamTest.PutULEB128 (1336 of 2134) PASS: lldb-unit :: Utility/./UtilityTests/ScalarTest.Comparison (1337 of 2134) PASS: lldb-api :: commands/expression/cast_int_to_anonymous_enum/TestCastIntToAnonymousEnum.py (1338 of 2134) PASS: lldb-unit :: Utility/./UtilityTests/UriParserTest.SchemeHostSeparator3 (1339 of 2134) PASS: lldb-unit :: UnwindAssembly/x86/./UnwindAssemblyx86Tests/Testx86AssemblyInspectionEngine.TestPopEDI (1340 of 2134) PASS: lldb-api :: commands/expression/import-std-module/vector-of-vectors/TestVectorOfVectorsFromStdModule.py (1341 of 2134) PASS: lldb-unit :: Utility/./UtilityTests/IndexToObjectTest.ObjectForIndex (1342 of 2134) PASS: lldb-api :: commands/process/launch-with-shellexpand/TestLaunchWithShellExpand.py (1343 of 2134) PASS: lldb-unit :: Utility/./UtilityTests/ScalarTest.SetValueFromCString (1344 of 2134) PASS: lldb-unit :: Utility/./UtilityTests/TildeExpressionResolver.ResolveFullPath (1345 of 2134) PASS: lldb-unit :: Expression/./ExpressionTests/CppModuleConfigurationTest.LinuxLocalLibCpp (1346 of 2134) PASS: lldb-api :: commands/command/script/import/rdar-12586188/TestRdar12586188.py (1347 of 2134) PASS: lldb-api :: functionalities/thread/crash_during_step/TestCrashDuringStep.py (1348 of 2134) PASS: lldb-api :: lang/c/blocks/TestBlocks.py (1349 of 2134) PASS: lldb-unit :: Utility/./UtilityTests/Flags.Clear (1350 of 2134) PASS: lldb-unit :: ScriptInterpreter/Python/./ScriptInterpreterPythonTests/PythonDataObjectsTest.TestPythonListToStructuredList (1351 of 2134) UNSUPPORTED: lldb-shell :: Register/arm-gp-read.test (1352 of 2134) UNSUPPORTED: lldb-shell :: SymbolFile/NativePDB/typedefs.cpp (1353 of 2134) PASS: lldb-unit :: Expression/./ExpressionTests/ClangExpressionDeclMapTest.TestUnknownIdentifierLookup (1354 of 2134) PASS: lldb-api :: python_api/process/read-mem-cstring/TestReadMemCString.py (1355 of 2134) PASS: lldb-shell :: Driver/TestTarget.test (1356 of 2134) PASS: lldb-shell :: Settings/TestDisableColor.test (1357 of 2134) PASS: lldb-api :: functionalities/breakpoint/breakpoint_command/TestBreakpointCommand.py (1358 of 2134) PASS: lldb-shell :: SymbolFile/NativePDB/nested-types.cpp (1359 of 2134) PASS: lldb-api :: functionalities/tsan/basic/TestTsanBasic.py (1360 of 2134) PASS: lldb-api :: functionalities/asan/TestReportData.py (1361 of 2134) PASS: lldb-api :: functionalities/postmortem/wow64_minidump/TestWow64MiniDump.py (1362 of 2134) PASS: lldb-unit :: Utility/./UtilityTests/FileSpecTest.Yaml (1363 of 2134) PASS: lldb-shell :: Breakpoint/debug_addrx.test (1364 of 2134) PASS: lldb-unit :: Utility/./UtilityTests/StringListTest.DefaultConstructor (1365 of 2134) PASS: lldb-unit :: Utility/./UtilityTests/RangeDataVector.FindEntryIndexesThatContain_Overlap (1366 of 2134) PASS: lldb-unit :: Utility/./UtilityTests/StringListTest.AppendList (1367 of 2134) PASS: lldb-api :: commands/expression/test/TestExprs2.py (1368 of 2134) PASS: lldb-api :: lang/c/step-target/TestStepTarget.py (1369 of 2134) PASS: lldb-unit :: Process/minidump/./LLDBMinidumpTests/MinidumpParserTest.GetFilteredModuleList (1370 of 2134) PASS: lldb-unit :: Utility/./UtilityTests/ArgsTest.StringListConstructor (1371 of 2134) PASS: lldb-api :: functionalities/thread/concurrent_events/TestConcurrentBreakpointsDelayedBreakpointOneWatchpoint.py (1372 of 2134) UNSUPPORTED: lldb-shell :: ScriptInterpreter/Lua/breakpoint_callback.test (1373 of 2134) PASS: lldb-api :: tools/lldb-vscode/module/TestVSCode_module.py (1374 of 2134) PASS: lldb-shell :: SymbolFile/DWARF/inline-function-address-shared.test (1375 of 2134) PASS: lldb-api :: python_api/watchpoint/TestWatchpointIter.py (1376 of 2134) UNSUPPORTED: lldb-shell :: Breakpoint/case-insensitive.test (1377 of 2134) PASS: lldb-api :: commands/watchpoints/multiple_hits/TestMultipleHits.py (1378 of 2134) PASS: lldb-api :: commands/expression/regression-access-function-template-in-record/TestRegressionAccessFunctionTemplateInRecord.py (1379 of 2134) PASS: lldb-unit :: UnwindAssembly/x86/./UnwindAssemblyx86Tests/Testx86AssemblyInspectionEngine.TestPushR12 (1380 of 2134) PASS: lldb-unit :: Utility/./UtilityTests/StringListTest.JoinMultiCharSeparator (1381 of 2134) PASS: lldb-shell :: Settings/TestEchoCommands.test (1382 of 2134) PASS: lldb-shell :: SymbolFile/DWARF/debug_rnglists.s (1383 of 2134) PASS: lldb-api :: commands/command/invalid-args/TestInvalidArgsCommand.py (1384 of 2134) PASS: lldb-unit :: Utility/./UtilityTests/StreamTest.AddressPrefixAndSuffix (1385 of 2134) UNSUPPORTED: lldb-api :: arm/breakpoint-thumb-codesection/TestBreakpointThumbCodesection.py (1386 of 2134) PASS: lldb-unit :: debugserver/./debugserverTests/RNBSocket.LoopBackConnectIPv6 (1387 of 2134) PASS: lldb-unit :: Utility/./UtilityTests/Flags.IsClear (1388 of 2134) PASS: lldb-unit :: Utility/./UtilityTests/StreamTest.PutRawBytesToLittleEndian (1389 of 2134) PASS: lldb-unit :: Utility/./UtilityTests/FileSpecTest.AppendPathComponent (1390 of 2134) PASS: lldb-api :: functionalities/tsan/thread_numbers/TestTsanThreadNumbers.py (1391 of 2134) PASS: lldb-unit :: Utility/./UtilityTests/FileSpecTest.Equal (1392 of 2134) PASS: lldb-api :: functionalities/history/TestHistoryRecall.py (1393 of 2134) PASS: lldb-api :: lang/cpp/dynamic-value/TestDynamicValue.py (1394 of 2134) PASS: lldb-unit :: Symbol/./SymbolTests/SymbolsTest.TerminateLocateExecutableSymbolFileForUnknownExecutableAndUnknownSymbolFile (1395 of 2134) UNSUPPORTED: lldb-shell :: SymbolFile/PDB/enums-layout.test (1396 of 2134) PASS: lldb-unit :: Process/gdb-remote/./ProcessGdbRemoteTests/GDBRemoteCommunicationClientTest.SyncThreadState (1397 of 2134) PASS: lldb-unit :: Utility/./UtilityTests/PassiveReplayTest.InstrumentedBarPtr (1398 of 2134) PASS: lldb-unit :: Host/./HostTests/FileActionTest.Open (1399 of 2134) PASS: lldb-api :: lang/c/local_variables/TestLocalVariables.py (1400 of 2134) PASS: lldb-api :: tools/lldb-server/TestGdbRemoteThreadsInStopReply.py (1401 of 2134) PASS: lldb-unit :: debugserver/./debugserverTests/RNBSocket.LoopBackConnectIPv4 (1402 of 2134) PASS: lldb-unit :: Process/gdb-remote/./ProcessGdbRemoteTests/GDBRemoteCommunicationClientTest.WriteRegister (1403 of 2134) PASS: lldb-api :: lang/c/inlines/TestRedefinitionsInInlines.py (1404 of 2134) PASS: lldb-unit :: Utility/./UtilityTests/Flags.AllClear (1405 of 2134) PASS: lldb-api :: functionalities/breakpoint/address_breakpoints/TestAddressBreakpoints.py (1406 of 2134) PASS: lldb-unit :: Utility/./UtilityTests/StringListTest.JoinSingle (1407 of 2134) PASS: lldb-shell :: SymbolFile/DWARF/find-variable-file.cpp (1408 of 2134) PASS: lldb-unit :: SymbolFile/NativePDB/./SymbolFileNativePDBTests/PDBFPOProgramToDWARFExpressionTests.SingleAssignmentRegisterRef (1409 of 2134) PASS: lldb-shell :: Driver/TestConvenienceVariables.test (1410 of 2134) PASS: lldb-api :: types/TestShortTypeExpr.py (1411 of 2134) PASS: lldb-unit :: Utility/./UtilityTests/ArgsTest.ReplaceArgumentAtIndexFarOutOfRange (1412 of 2134) PASS: lldb-api :: functionalities/ptr_refs/TestPtrRefs.py (1413 of 2134) PASS: lldb-unit :: SymbolFile/NativePDB/./SymbolFileNativePDBTests/PDBFPOProgramToDWARFExpressionTests.MissingTargetRegister (1414 of 2134) PASS: lldb-api :: driver/batch_mode/TestBatchMode.py (1415 of 2134) PASS: lldb-shell :: ObjectFile/wasm/unified-debug-sections.yaml (1416 of 2134) PASS: lldb-unit :: Utility/./UtilityTests/StringExtractorTest.GetHexBytesAvail_FullString (1417 of 2134) PASS: lldb-unit :: Utility/./UtilityTests/StringExtractorTest.GetHexBytesAvail_OddPair (1418 of 2134) PASS: lldb-api :: functionalities/breakpoint/objc/TestObjCBreakpoints.py (1419 of 2134) PASS: lldb-api :: lang/cpp/char8_t/TestCxxChar8_t.py (1420 of 2134) PASS: lldb-shell :: SymbolFile/DWARF/dwarf5-debug_line.s (1421 of 2134) PASS: lldb-unit :: Expression/./ExpressionTests/DWARFExpression.DW_OP_convert (1422 of 2134) PASS: lldb-unit :: Utility/./UtilityTests/BinaryStreamTest.PutSLEB128FourBytes (1423 of 2134) PASS: lldb-api :: python_api/findvalue_duplist/TestSBFrameFindValue.py (1424 of 2134) PASS: lldb-shell :: SymbolFile/NativePDB/bitfields.cpp (1425 of 2134) PASS: lldb-api :: lang/cpp/unsigned_types/TestUnsignedTypes.py (1426 of 2134) PASS: lldb-shell :: Unwind/eh-frame-dwarf-unwind.test (1427 of 2134) PASS: lldb-unit :: Process/gdb-remote/./ProcessGdbRemoteTests/GDBRemoteClientBaseTest.SendContinueAndInterrupt2PacketBug (1428 of 2134) PASS: lldb-unit :: Language/Highlighting/./HighlighterTests/HighlighterTest.ClangBraces (1429 of 2134) PASS: lldb-unit :: Utility/./UtilityTests/DataExtractorTest.GetULEB128_bit63 (1430 of 2134) PASS: lldb-shell :: SymbolFile/DWARF/find-qualified-variable.cpp (1431 of 2134) PASS: lldb-unit :: UnwindAssembly/x86/./UnwindAssemblyx86Tests/Testx86AssemblyInspectionEngine.TestPopESI (1432 of 2134) PASS: lldb-api :: python_api/target/TestTargetAPI.py (1433 of 2134) PASS: lldb-unit :: ObjectFile/ELF/./ObjectFileELFTests/ObjectFileELFTest.GetModuleSpecifications_EarlySectionHeaders (1434 of 2134) PASS: lldb-shell :: ObjectFile/wasm/basic.yaml (1435 of 2134) PASS: lldb-shell :: Expr/TestMultilineExpr.test (1436 of 2134) PASS: lldb-api :: commands/frame/diagnose/dereference-function-return/TestDiagnoseDereferenceFunctionReturn.py (1437 of 2134) PASS: lldb-unit :: Utility/./UtilityTests/ArchSpecTest.TestParseMachCPUDashSubtypeTripleExtra (1438 of 2134) PASS: lldb-shell :: Driver/TestCommands.test (1439 of 2134) PASS: lldb-unit :: Utility/./UtilityTests/StreamTest.ShiftOperatorStrings (1440 of 2134) PASS: lldb-unit :: Utility/./UtilityTests/StreamTest.AddressNoSuffix (1441 of 2134) PASS: lldb-api :: functionalities/inferior-crashing/recursive-inferior/TestRecursiveInferiorStep.py (1442 of 2134) PASS: lldb-api :: functionalities/data-formatter/data-formatter-stl/libcxx/list/TestDataFormatterLibcxxList.py (1443 of 2134) PASS: lldb-api :: commands/process/attach/TestProcessAttach.py (1444 of 2134) PASS: lldb-shell :: SymbolFile/DWARF/debug_line-relative_path.s (1445 of 2134) PASS: lldb-api :: commands/gui/basic/TestGuiBasic.py (1446 of 2134) PASS: lldb-unit :: UnwindAssembly/x86/./UnwindAssemblyx86Tests/Testx86AssemblyInspectionEngine.TestDisassemblyJunkBytes (1447 of 2134) PASS: lldb-api :: lang/c/const_variables/TestConstVariables.py (1448 of 2134) PASS: lldb-unit :: Utility/./UtilityTests/StringExtractorTest.GetHexU8_Underflow2_NoEof (1449 of 2134) PASS: lldb-shell :: ObjectFile/PECOFF/export-dllfunc.yaml (1450 of 2134) UNSUPPORTED: lldb-api :: functionalities/data-formatter/data-formatter-stl/libstdcpp/string/TestDataFormatterStdString.py (1451 of 2134) PASS: lldb-api :: python_api/type/TestTypeList.py (1452 of 2134) PASS: lldb-api :: python_api/interpreter/TestRunCommandInterpreterAPI.py (1453 of 2134) PASS: lldb-unit :: Host/./HostTests/MainLoopTest.TerminatesImmediately (1454 of 2134) PASS: lldb-unit :: Symbol/./SymbolTests/SymbolsTest.LocateExecutableSymbolFileForUnknownExecutableAndMissingSymbolFile (1455 of 2134) PASS: lldb-unit :: Utility/./UtilityTests/RangeTest.Equal (1456 of 2134) PASS: lldb-unit :: Utility/./UtilityTests/ArgsTest.TestSingleArg (1457 of 2134) PASS: lldb-unit :: Language/Highlighting/./HighlighterTests/HighlighterTest.ClangTrailingBackslashMissingNewLine (1458 of 2134) PASS: lldb-api :: commands/expression/unwind_expression/TestUnwindExpression.py (1459 of 2134) PASS: lldb-unit :: Process/minidump/./LLDBMinidumpTests/MinidumpParserTest.GetThreadsAndGetThreadContext (1460 of 2134) PASS: lldb-unit :: Utility/./UtilityTests/StreamTest.PutCString (1461 of 2134) PASS: lldb-api :: functionalities/gdb_remote_client/TestIOSSimulator.py (1462 of 2134) PASS: lldb-api :: lang/cpp/frame-var-anon-unions/TestFrameVariableAnonymousUnions.py (1463 of 2134) PASS: lldb-api :: lang/c/forward/TestForwardDeclaration.py (1464 of 2134) PASS: lldb-unit :: Expression/./ExpressionTests/CppModuleConfigurationTest.IgnoreLibStdCpp (1465 of 2134) PASS: lldb-api :: lang/c/set_values/TestSetValues.py (1466 of 2134) PASS: lldb-unit :: Process/gdb-remote/./ProcessGdbRemoteTests/GDBRemoteClientBaseTest.SendPacketAndReceiveResponseWithOutputSupport (1467 of 2134) PASS: lldb-api :: commands/source/info/TestSourceInfo.py (1468 of 2134) PASS: lldb-api :: commands/log/basic/TestLogging.py (1469 of 2134) UNSUPPORTED: lldb-api :: tools/lldb-vscode/completions/TestVSCode_completions.py (1470 of 2134) PASS: lldb-unit :: Process/gdb-remote/./ProcessGdbRemoteTests/GDBRemoteCommunicationClientTest.GetMemoryRegionInfoInvalidResponse (1471 of 2134) PASS: lldb-unit :: Utility/./UtilityTests/FileSpecTest.EqualDotsPosixRoot (1472 of 2134) PASS: lldb-unit :: Host/./HostTests/FileSystemTest.FileAndDirectoryComponents (1473 of 2134) PASS: lldb-unit :: Process/minidump/./LLDBMinidumpTests/MinidumpParserTest.GetArchitectureWindows (1474 of 2134) UNSUPPORTED: lldb-shell :: Reproducer/TestLuaImport.test (1475 of 2134) PASS: lldb-api :: functionalities/breakpoint/breakpoint_command/TestRegexpBreakCommand.py (1476 of 2134) PASS: lldb-shell :: Breakpoint/single-file-split-dwarf.test (1477 of 2134) PASS: lldb-unit :: Core/./LLDBCoreTests/ModuleSpecTest.TestMachOFile (1478 of 2134) PASS: lldb-api :: sample_test/TestSampleInlineTest.py (1479 of 2134) PASS: lldb-api :: functionalities/completion/TestCompletion.py (1480 of 2134) PASS: lldb-unit :: Utility/./UtilityTests/RangeTest.ContainsRange (1481 of 2134) PASS: lldb-unit :: Language/Highlighting/./HighlighterTests/HighlighterTest.ClangCursorPosAfterOtherToken (1482 of 2134) UNSUPPORTED: lldb-api :: commands/expression/macros/TestMacros.py (1483 of 2134) PASS: lldb-unit :: SymbolFile/NativePDB/./SymbolFileNativePDBTests/PDBFPOProgramToDWARFExpressionTests.UnresolvedRegisterReference (1484 of 2134) PASS: lldb-unit :: Utility/./UtilityTests/ScalarTest.Promotion (1485 of 2134) PASS: lldb-shell :: SymbolFile/Breakpad/line-table-discontinuous-file-ids.test (1486 of 2134) PASS: lldb-api :: functionalities/tail_call_frames/cross_dso/TestCrossDSOTailCalls.py (1487 of 2134) PASS: lldb-shell :: SymbolFile/DWARF/debug-types-address-ranges.s (1488 of 2134) PASS: lldb-api :: lang/cpp/global_variables/TestCPPGlobalVariables.py (1489 of 2134) PASS: lldb-api :: functionalities/data-formatter/data-formatter-objc/TestDataFormatterObjCNSError.py (1490 of 2134) PASS: lldb-api :: lang/objc/objc-ivar-stripped/TestObjCIvarStripped.py (1491 of 2134) PASS: lldb-api :: lang/cpp/operators/TestCppOperators.py (1492 of 2134) PASS: lldb-api :: functionalities/thread/concurrent_events/TestConcurrentSignalWatchBreak.py (1493 of 2134) PASS: lldb-unit :: Utility/./UtilityTests/StringExtractorTest.GetNameColonValueNoColon (1494 of 2134) PASS: lldb-unit :: Language/Highlighting/./HighlighterTests/HighlighterTest.DefaultHighlighter (1495 of 2134) PASS: lldb-api :: functionalities/data-formatter/nsarraysynth/TestNSArraySynthetic.py (1496 of 2134) PASS: lldb-unit :: Disassembler/./DisassemblerTests/TestArmv7Disassembly.TestCortexFPDisass (1497 of 2134) PASS: lldb-api :: commands/command/script/TestCommandScript.py (1498 of 2134) PASS: lldb-shell :: BuildScript/compiler-full-path.test (1499 of 2134) PASS: lldb-unit :: Symbol/./SymbolTests/Type.GetTypeScopeAndBasename (1500 of 2134) PASS: lldb-unit :: Utility/./UtilityTests/StreamTeeTest.GetStreamAtIndexOutOfBoundsEmpty (1501 of 2134) PASS: lldb-unit :: Utility/./UtilityTests/ArgsTest.TestMultipleArgs (1502 of 2134) PASS: lldb-unit :: UnwindAssembly/x86/./UnwindAssemblyx86Tests/Testx86AssemblyInspectionEngine.TestPopEBP (1503 of 2134) PASS: lldb-unit :: Symbol/./SymbolTests/TestTypeSystemClang.TestFunctionTemplateInRecordConstruction (1504 of 2134) PASS: lldb-api :: lang/cpp/member-and-local-vars-with-same-name/TestMembersAndLocalsWithSameName.py (1505 of 2134) PASS: lldb-unit :: Utility/./UtilityTests/StringExtractorTest.GetHexBytes (1506 of 2134) PASS: lldb-api :: lang/cpp/typedef/TestCppTypedef.py (1507 of 2134) UNSUPPORTED: lldb-api :: functionalities/tty/TestTerminal.py (1508 of 2134) PASS: lldb-shell :: Process/Optimization.test (1509 of 2134) UNSUPPORTED: lldb-api :: functionalities/darwin_log/filter/exact_match/message/TestDarwinLogFilterMatchMessage.py (1510 of 2134) PASS: lldb-unit :: Process/gdb-remote/./ProcessGdbRemoteTests/GDBRemoteCommunicationClientTest.GetModulesInfo (1511 of 2134) PASS: lldb-shell :: Watchpoint/SetErrorCases.test (1512 of 2134) PASS: lldb-shell :: SymbolFile/DWARF/gnu-style-compression.cpp (1513 of 2134) PASS: lldb-shell :: SymbolFile/DWARF/static_scope.s (1514 of 2134) PASS: lldb-api :: lang/cpp/offsetof/TestOffsetofCpp.py (1515 of 2134) PASS: lldb-unit :: Expression/./ExpressionTests/DiagnosticManagerTest.GetStringSeverityLabels (1516 of 2134) PASS: lldb-api :: python_api/watchpoint/watchlocation/TestSetWatchlocation.py (1517 of 2134) PASS: lldb-unit :: DataFormatter/./LLDBFormatterTests/StringPrinterTests.CxxUTF8 (1518 of 2134) PASS: lldb-shell :: Commands/command-target-modules-dump-sections.yaml (1519 of 2134) PASS: lldb-api :: commands/expression/diagnostics/TestExprDiagnostics.py (1520 of 2134) PASS: lldb-unit :: Utility/./UtilityTests/StreamTest.PutRawBytesToMixedEndian (1521 of 2134) PASS: lldb-api :: commands/command/source/TestCommandSource.py (1522 of 2134) PASS: lldb-unit :: Utility/./UtilityTests/StreamTest.AddressRangeInvalidRange (1523 of 2134) PASS: lldb-unit :: Expression/./ExpressionTests/DWARFExpression.DW_OP_pick (1524 of 2134) PASS: lldb-unit :: Host/./HostTests/NativeProcessProtocolTest.SetBreakpointFailRead (1525 of 2134) PASS: lldb-api :: commands/gui/viewlarge/TestGuiViewLarge.py (1526 of 2134) PASS: lldb-api :: lang/cpp/chained-calls/TestCppChainedCalls.py (1527 of 2134) PASS: lldb-api :: lang/cpp/static_methods/TestCPPStaticMethods.py (1528 of 2134) PASS: lldb-api :: commands/expression/top-level/TestTopLevelExprs.py (1529 of 2134) PASS: lldb-api :: lang/cpp/namespace/TestNamespace.py (1530 of 2134) PASS: lldb-unit :: Utility/./UtilityTests/UriParserTest.SchemeHostSeparator4 (1531 of 2134) PASS: lldb-unit :: Symbol/./SymbolTests/TestTypeSystemClang.TestGetBasicTypeFromEnum (1532 of 2134) PASS: lldb-api :: functionalities/data-formatter/data-formatter-stl/libcxx/set/TestDataFormatterLibcxxSet.py (1533 of 2134) UNSUPPORTED: lldb-api :: benchmarks/expression/TestRepeatedExprs.py (1534 of 2134) PASS: lldb-shell :: Settings/TestLineMarkerColor.test (1535 of 2134) PASS: lldb-shell :: SymbolFile/Breakpad/line-table-edgecases.test (1536 of 2134) PASS: lldb-unit :: UnwindAssembly/x86/./UnwindAssemblyx86Tests/Testx86AssemblyInspectionEngine.TestPopR12 (1537 of 2134) PASS: lldb-shell :: Settings/TestStopCommandSourceOnError.test (1538 of 2134) PASS: lldb-api :: functionalities/inferior-crashing/recursive-inferior/TestRecursiveInferior.py (1539 of 2134) PASS: lldb-unit :: Utility/./UtilityTests/BinaryStreamTest.PutULEB128FourBytes (1540 of 2134) PASS: lldb-shell :: SymbolFile/DWARF/DW_TAG_variable-DW_AT_const_value.s (1541 of 2134) PASS: lldb-unit :: Core/./LLDBCoreTests/SourceFileCache.FindSourceFileFound (1542 of 2134) PASS: lldb-unit :: Expression/./ExpressionTests/CppModuleConfigurationTest.Xcode (1543 of 2134) UNSUPPORTED: lldb-shell :: SymbolFile/NativePDB/local-variables.cpp (1544 of 2134) PASS: lldb-unit :: Utility/./UtilityTests/FileSpecTest.GuessPathStyle (1545 of 2134) PASS: lldb-shell :: Driver/TestHelp.test (1546 of 2134) PASS: lldb-api :: tools/lldb-vscode/variables/TestVSCode_variables.py (1547 of 2134) PASS: lldb-api :: functionalities/tail_call_frames/sbapi_support/TestTailCallFrameSBAPI.py (1548 of 2134) PASS: lldb-api :: functionalities/gdb_remote_client/TestNestedRegDefinitions.py (1549 of 2134) UNSUPPORTED: lldb-shell :: SymbolFile/PDB/compilands.test (1550 of 2134) PASS: lldb-unit :: Host/./HostTests/SocketAddressTest.GetAddressInfo (1551 of 2134) PASS: lldb-api :: lang/objc/objc-foundation-dictionary-empty/TestNSDictionary0.py (1552 of 2134) PASS: lldb-unit :: Host/./HostTests/FileSystemTest.GetByteSize (1553 of 2134) PASS: lldb-unit :: Host/./HostTests/NativeProcessProtocolTest.ReadCStringFromMemory_MaxSize (1554 of 2134) PASS: lldb-unit :: Utility/./UtilityTests/ArchSpecTest.Compatibility (1555 of 2134) PASS: lldb-api :: lang/cpp/wchar_t/TestCxxWCharT.py (1556 of 2134) PASS: lldb-unit :: Utility/./UtilityTests/StringExtractorTest.InitMisc (1557 of 2134) PASS: lldb-unit :: Process/minidump/./LLDBMinidumpTests/MinidumpParserTest.GetMiscInfoWindows (1558 of 2134) PASS: lldb-shell :: SymbolFile/DWARF/apple-index-is-used.cpp (1559 of 2134) PASS: lldb-unit :: Core/./LLDBCoreTests/SourceFileCache.FindSourceFileNotFound (1560 of 2134) PASS: lldb-api :: python_api/symbol-context/TestSymbolContext.py (1561 of 2134) PASS: lldb-unit :: UnwindAssembly/x86/./UnwindAssemblyx86Tests/Testx86AssemblyInspectionEngine.TestPushRBX (1562 of 2134) PASS: lldb-shell :: SymbolFile/DWARF/find-method-local-struct.cpp (1563 of 2134) PASS: lldb-api :: functionalities/tsan/cpp_global_location/TestTsanCPPGlobalLocation.py (1564 of 2134) PASS: lldb-unit :: Process/gdb-remote/./ProcessGdbRemoteTests/GDBRemoteClientBaseTest.SendContinueDelegateInterface (1565 of 2134) UNSUPPORTED: lldb-shell :: ScriptInterpreter/Lua/watchpoint_callback.test (1566 of 2134) PASS: lldb-api :: python_api/file_handle/TestFileHandle.py (1567 of 2134) PASS: lldb-unit :: Utility/./UtilityTests/StreamTest.PutHex64ByteOrderBig (1568 of 2134) PASS: lldb-api :: functionalities/thread/step_out/TestThreadStepOut.py (1569 of 2134) PASS: lldb-unit :: UnwindAssembly/x86/./UnwindAssemblyx86Tests/Testx86AssemblyInspectionEngine.TestPushImm (1570 of 2134) PASS: lldb-api :: commands/watchpoints/watchpoint_commands/TestWatchpointCommands.py (1571 of 2134) PASS: lldb-api :: python_api/watchpoint/TestSetWatchpoint.py (1572 of 2134) PASS: lldb-api :: lang/c/anonymous/TestAnonymous.py (1573 of 2134) PASS: lldb-unit :: Host/./HostTests/SocketTest.DomainGetConnectURI (1574 of 2134) PASS: lldb-api :: tools/lldb-server/inferior-crash/TestGdbRemoteSegFault.py (1575 of 2134) PASS: lldb-unit :: Platform/./LLDBPlatformTests/PlatformDarwinTest.TestParseVersionBuildDir (1576 of 2134) PASS: lldb-api :: lang/cpp/namespace/TestNamespaceLookup.py (1577 of 2134) PASS: lldb-shell :: SymbolFile/DWARF/debug_ranges-missing-section.s (1578 of 2134) PASS: lldb-unit :: Language/Highlighting/./HighlighterTests/HighlighterTest.ClangIdentifiers (1579 of 2134) PASS: lldb-unit :: Utility/./UtilityTests/DataExtractorTest.GetCStrEmpty (1580 of 2134) PASS: lldb-api :: functionalities/tail_call_frames/ambiguous_tail_call_seq1/TestAmbiguousTailCallSeq1.py (1581 of 2134) PASS: lldb-unit :: SymbolFile/NativePDB/./SymbolFileNativePDBTests/PDBFPOProgramToDWARFExpressionTests.UnresolvedCyclicRegisterAssignmentReference (1582 of 2134) PASS: lldb-api :: python_api/function_symbol/TestDisasmAPI.py (1583 of 2134) PASS: lldb-api :: functionalities/data-formatter/data-formatter-objc/TestDataFormatterObjCNSData.py (1584 of 2134) PASS: lldb-unit :: Language/Highlighting/./HighlighterTests/HighlighterTest.ClangCursorPos (1585 of 2134) PASS: lldb-unit :: Utility/./UtilityTests/Predicate.WaitForValueNotEqualTo (1586 of 2134) PASS: lldb-api :: functionalities/gdb_remote_client/TestWriteMemory.py (1587 of 2134) PASS: lldb-shell :: ObjectFile/ELF/PT_LOAD-overlap-PT_INTERP.yaml (1588 of 2134) PASS: lldb-unit :: UnwindAssembly/x86/./UnwindAssemblyx86Tests/Testx86AssemblyInspectionEngine.Testi386IgnoredRegisters (1589 of 2134) PASS: lldb-api :: functionalities/data-formatter/data-formatter-stl/libcxx/queue/TestDataFormatterLibcxxQueue.py (1590 of 2134) PASS: lldb-unit :: Utility/./UtilityTests/RecordReplayTest.InstrumentedFooSameThis (1591 of 2134) PASS: lldb-shell :: Heap/heap-cstr.test (1592 of 2134) PASS: lldb-api :: functionalities/signal/TestSendSignal.py (1593 of 2134) UNSUPPORTED: lldb-shell :: Unwind/unwind-plan-dwarf-dump.test (1594 of 2134) PASS: lldb-api :: functionalities/tail_call_frames/cross_object/TestCrossObjectTailCalls.py (1595 of 2134) PASS: lldb-api :: functionalities/optimized_code/TestNoASanExceptionAfterEvalOP_piece.py (1596 of 2134) PASS: lldb-shell :: SymbolFile/DWARF/debug_loc_and_loclists.s (1597 of 2134) PASS: lldb-unit :: Process/minidump/./LLDBMinidumpTests/MinidumpParserTest.GetPidWindows (1598 of 2134) XFAIL: lldb-shell :: SymbolFile/DWARF/find-type-in-function.cpp (1599 of 2134) PASS: lldb-unit :: Utility/./UtilityTests/CompletionRequest.ShiftArguments (1600 of 2134) PASS: lldb-api :: functionalities/tsan/thread_leak/TestTsanThreadLeak.py (1601 of 2134) PASS: lldb-api :: functionalities/breakpoint/breakpoint_by_line_and_column/TestBreakpointByLineAndColumn.py (1602 of 2134) PASS: lldb-unit :: Utility/./UtilityTests/RangeDataVector.CustomSort (1603 of 2134) PASS: lldb-api :: commands/watchpoints/watchpoint_commands/condition/TestWatchpointConditionCmd.py (1604 of 2134) PASS: lldb-api :: python_api/default-constructor/TestDefaultConstructorForAPIObjects.py (1605 of 2134) PASS: lldb-unit :: Utility/./UtilityTests/LogChannelEnabledTest.LLDB_LOG_ERROR (1606 of 2134) PASS: lldb-unit :: Language/Highlighting/./HighlighterTests/HighlighterTest.ClangCursorOutOfBounds (1607 of 2134) PASS: lldb-unit :: Utility/./UtilityTests/UriParserTest.BracketedHostnameWithPortIPv4 (1608 of 2134) PASS: lldb-api :: commands/watchpoints/watchpoint_events/TestWatchpointEvents.py (1609 of 2134) PASS: lldb-api :: functionalities/data-formatter/pyobjsynthprovider/TestPyObjSynthProvider.py (1610 of 2134) PASS: lldb-unit :: Process/gdb-remote/./ProcessGdbRemoteTests/GDBRemoteCommunicationClientTest.GetQOffsets (1611 of 2134) UNSUPPORTED: lldb-api :: tools/lldb-server/platform-process-connect/TestPlatformProcessConnect.py (1612 of 2134) PASS: lldb-api :: functionalities/thread/backtrace_all/TestBacktraceAll.py (1613 of 2134) PASS: lldb-unit :: DataFormatter/./LLDBFormatterTests/TypeMatcherTests.RegexName (1614 of 2134) PASS: lldb-unit :: Utility/./UtilityTests/TimerTest.CategoryTimes2 (1615 of 2134) PASS: lldb-unit :: ScriptInterpreter/Python/./ScriptInterpreterPythonTests/PythonDataObjectsTest.TestCallable (1616 of 2134) PASS: lldb-unit :: SymbolFile/NativePDB/./SymbolFileNativePDBTests/PDBFPOProgramToDWARFExpressionTests.MultipleDependentAssignments (1617 of 2134) PASS: lldb-unit :: Utility/./UtilityTests/StringListTest.GetMaxStringLengthMixed (1618 of 2134) PASS: lldb-shell :: Breakpoint/split-dwarf5-debug-stroffsets.test (1619 of 2134) PASS: lldb-api :: lang/objc/foundation/TestObjCMethods2.py (1620 of 2134) PASS: lldb-unit :: Instruction/./EmulatorTests/TestAArch64Emulator.TestOverflow (1621 of 2134) PASS: lldb-shell :: Reproducer/TestDiscard.test (1622 of 2134) PASS: lldb-unit :: UnwindAssembly/x86/./UnwindAssemblyx86Tests/Testx86AssemblyInspectionEngine.TestPushEBP (1623 of 2134) PASS: lldb-unit :: SymbolFile/NativePDB/./SymbolFileNativePDBTests/PDBFPOProgramToDWARFExpressionTests.InvalidAssignmentSingle (1624 of 2134) PASS: lldb-api :: functionalities/object-file/TestImageListMultiArchitecture.py (1625 of 2134) PASS: lldb-api :: commands/expression/import-std-module/basic/TestImportStdModule.py (1626 of 2134) PASS: lldb-unit :: ScriptInterpreter/Python/./ScriptInterpreterPythonTests/PythonDataObjectsTest.TestPythonTupleToStructuredList (1627 of 2134) PASS: lldb-shell :: SymbolFile/DWARF/find-variable-dwo.cpp (1628 of 2134) PASS: lldb-unit :: Symbol/./SymbolTests/Type.CompilerContextPattern (1629 of 2134) PASS: lldb-unit :: Language/Highlighting/./HighlighterTests/HighlighterTest.Colons (1630 of 2134) PASS: lldb-api :: python_api/sbtype_typeclass/TestSBTypeTypeClass.py (1631 of 2134) PASS: lldb-shell :: Commands/command-script-import.test (1632 of 2134) PASS: lldb-api :: functionalities/breakpoint/source_regexp/TestSourceRegexBreakpoints.py (1633 of 2134) PASS: lldb-unit :: Utility/./UtilityTests/LogChannelEnabledTest.LogGetLogThread (1634 of 2134) PASS: lldb-api :: commands/expression/context-object-objc/TestContextObjectObjc.py (1635 of 2134) PASS: lldb-unit :: Utility/./UtilityTests/StringListTest.InsertStringAtIndexStdString (1636 of 2134) PASS: lldb-api :: lang/objc/modules-incomplete/TestIncompleteModules.py (1637 of 2134) PASS: lldb-shell :: SymbolFile/Breakpad/unwind-via-stack-win.test (1638 of 2134) PASS: lldb-shell :: SymbolFile/DWARF/anon_class_w_and_wo_export_symbols.ll (1639 of 2134) PASS: lldb-api :: commands/expression/call-function/TestCallStopAndContinue.py (1640 of 2134) PASS: lldb-api :: functionalities/lazy-loading/TestLazyLoading.py (1641 of 2134) UNSUPPORTED: lldb-api :: functionalities/darwin_log/filter/regex/activity-chain/TestDarwinLogFilterRegexActivityChain.py (1642 of 2134) PASS: lldb-api :: functionalities/gdb_remote_client/TestWasm.py (1643 of 2134) PASS: lldb-api :: tools/lldb-vscode/step/TestVSCode_step.py (1644 of 2134) PASS: lldb-unit :: Symbol/./SymbolTests/TestTypeSystemClang.TestBuiltinTypeForEncodingAndBitSize (1645 of 2134) PASS: lldb-unit :: Process/minidump/./LLDBMinidumpTests/MinidumpParserTest.GetMemoryRegionInfoFromMemory64List (1646 of 2134) PASS: lldb-shell :: ObjectFile/wasm/embedded-debug-sections.yaml (1647 of 2134) PASS: lldb-shell :: SymbolFile/DWARF/debug-types-dwarf5.s (1648 of 2134) UNSUPPORTED: lldb-shell :: Register/arm-fp-read.test (1649 of 2134) PASS: lldb-api :: commands/frame/diagnose/local-variable/TestLocalVariable.py (1650 of 2134) PASS: lldb-unit :: Utility/./UtilityTests/Flags.AllSet (1651 of 2134) PASS: lldb-api :: functionalities/thread/exit_during_expression/TestExitDuringExpression.py (1652 of 2134) PASS: lldb-api :: macosx/lc-note/kern-ver-str/TestKernVerStrLCNOTE.py (1653 of 2134) PASS: lldb-unit :: Utility/./UtilityTests/VMRange.ContainsAddr (1654 of 2134) PASS: lldb-unit :: Utility/./UtilityTests/StringExtractorTest.GetHexU8_Underflow2 (1655 of 2134) PASS: lldb-unit :: SymbolFile/NativePDB/./SymbolFileNativePDBTests/PDBFPOProgramToDWARFExpressionTests.DependencyChain (1656 of 2134) PASS: lldb-api :: commands/command/delete/TestCommandDelete.py (1657 of 2134) PASS: lldb-api :: tools/lldb-server/TestGdbRemoteHostInfo.py (1658 of 2134) PASS: lldb-unit :: tools/lldb-server/tests/./LLDBServerTests/TestBase.DebugserverEnv (1659 of 2134) PASS: lldb-api :: tools/lldb-vscode/breakpoint-events/TestVSCode_breakpointEvents.py (1660 of 2134) PASS: lldb-api :: functionalities/data-formatter/frameformat_smallstruct/TestFrameFormatSmallStruct.py (1661 of 2134) PASS: lldb-api :: lang/objc/bitfield_ivars/TestBitfieldIvars.py (1662 of 2134) PASS: lldb-api :: functionalities/postmortem/minidump-new/TestMiniDumpNew.py (1663 of 2134) UNSUPPORTED: lldb-shell :: SymbolFile/PDB/func-symbols.test (1664 of 2134) PASS: lldb-unit :: Expression/./ExpressionTests/DiagnosticManagerTest.PutString (1665 of 2134) PASS: lldb-api :: types/TestDoubleTypes.py (1666 of 2134) UNSUPPORTED: lldb-api :: tools/lldb-server/registers-target-xml-reading/TestGdbRemoteTargetXmlPacket.py (1667 of 2134) PASS: lldb-api :: functionalities/value_md5_crash/TestValueMD5Crash.py (1668 of 2134) PASS: lldb-api :: lang/cpp/namespace_definitions/TestNamespaceDefinitions.py (1669 of 2134) PASS: lldb-api :: commands/expression/import-std-module/empty-module/TestEmptyStdModule.py (1670 of 2134) PASS: lldb-api :: lang/cpp/gmodules-templates/TestGModules.py (1671 of 2134) PASS: lldb-unit :: Utility/./UtilityTests/TimeoutTest.Construction (1672 of 2134) PASS: lldb-unit :: UnwindAssembly/ARM64/./Arm64InstEmulationTests/TestArm64InstEmulation.TestRegisterSavedTwice (1673 of 2134) PASS: lldb-unit :: Utility/./UtilityTests/StringListTest.CopyListEmpty (1674 of 2134) PASS: lldb-unit :: Utility/./UtilityTests/EnvironmentTest.EnvpConstruction (1675 of 2134) PASS: lldb-shell :: Settings/TestFrameFormatNoColor.test (1676 of 2134) PASS: lldb-unit :: Utility/./UtilityTests/UriParserTest.SchemeHostSeparator2 (1677 of 2134) PASS: lldb-api :: functionalities/thread/concurrent_events/TestConcurrentCrashWithSignal.py (1678 of 2134) PASS: lldb-unit :: Language/CPlusPlus/./LanguageCPlusPlusTests/CPlusPlusLanguage.CPlusPlusNameParser (1679 of 2134) PASS: lldb-unit :: Utility/./UtilityTests/OptionsWithRawTest.QuotedSuffix (1680 of 2134) PASS: lldb-unit :: tools/lldb-server/tests/./LLDBServerTests/StandardStartupTest.TestStopReplyContainsThreadPcs (1681 of 2134) PASS: lldb-unit :: Utility/./UtilityTests/ArgsTest.ReplaceArgumentAtIndexShort (1682 of 2134) PASS: lldb-unit :: Utility/./UtilityTests/ArgsTest.TestArgv (1683 of 2134) PASS: lldb-api :: commands/expression/import-std-module/weak_ptr/TestWeakPtrFromStdModule.py (1684 of 2134) UNSUPPORTED: lldb-shell :: SymbolFile/DWARF/split-dwarf-expression-eval-bug.cpp (1685 of 2134) PASS: lldb-unit :: Interpreter/./InterpreterTests/CompletionTest.FileCompletionAbsolute (1686 of 2134) PASS: lldb-shell :: ScriptInterpreter/Python/scripted_breakpoint.test (1687 of 2134) PASS: lldb-api :: commands/expression/ir-interpreter-phi-nodes/TestIRInterpreterPHINodes.py (1688 of 2134) PASS: lldb-unit :: Utility/./UtilityTests/StringExtractorTest.GetHexU8_InvalidHex (1689 of 2134) PASS: lldb-api :: macosx/version_zero/TestGetVersionZeroVersion.py (1690 of 2134) PASS: lldb-api :: functionalities/thread/concurrent_events/TestConcurrentDelayedCrashWithBreakpointWatchpoint.py (1691 of 2134) PASS: lldb-unit :: Utility/./UtilityTests/UserIDResolver.GetUserName (1692 of 2134) PASS: lldb-unit :: Symbol/./SymbolTests/TestTypeSystemClang.TestGetBasicTypeFromName (1693 of 2134) PASS: lldb-api :: lang/objc/objc-baseclass-sbtype/TestObjCBaseClassSBType.py (1694 of 2134) PASS: lldb-api :: commands/expression/import-std-module/shared_ptr-dbg-info-content/TestSharedPtrDbgInfoContentFromStdModule.py (1695 of 2134) PASS: lldb-unit :: Utility/./UtilityTests/AnsiTerminal.KnownPrefix (1696 of 2134) PASS: lldb-unit :: Utility/./UtilityTests/StringListTest.InsertStringAtIndexOutOfBounds (1697 of 2134) PASS: lldb-unit :: ScriptInterpreter/Python/./ScriptInterpreterPythonTests/PythonDataObjectsTest.TestGlobalNameResolutionWithDot (1698 of 2134) PASS: lldb-unit :: Utility/./UtilityTests/StringListTest.Join (1699 of 2134) PASS: lldb-shell :: SymbolFile/DWARF/debug_loc-aslr.s (1700 of 2134) PASS: lldb-api :: functionalities/data-formatter/varscript_formatting/TestDataFormatterVarScriptFormatting.py (1701 of 2134) PASS: lldb-unit :: Process/minidump/./LLDBMinidumpTests/MinidumpParserTest.GetLinuxProcStatus_no_stream (1702 of 2134) PASS: lldb-unit :: Utility/./UtilityTests/FileSpecTest.RemoveLastPathComponent (1703 of 2134) UNSUPPORTED: lldb-api :: tools/intel-features/intel-pt/test/TestIntelPTSimpleBinary.py (1704 of 2134) PASS: lldb-unit :: Core/./LLDBCoreTests/RichManglingContextTest.IPDRealloc (1705 of 2134) PASS: lldb-unit :: Utility/./UtilityTests/RangeTest.LessThanInvalid (1706 of 2134) PASS: lldb-api :: python_api/lldbutil/iter/TestLLDBIterator.py (1707 of 2134) PASS: lldb-shell :: VSCode/TestOptions.test (1708 of 2134) PASS: lldb-shell :: Minidump/memory-region-from-module.yaml (1709 of 2134) PASS: lldb-api :: functionalities/limit-debug-info/TestLimitDebugInfo.py (1710 of 2134) PASS: lldb-unit :: Process/minidump/./LLDBMinidumpTests/MinidumpParserTest.GetPid (1711 of 2134) PASS: lldb-api :: lang/objc/objc-ivar-protocols/TestIvarProtocols.py (1712 of 2134) PASS: lldb-api :: commands/settings/quoting/TestQuoting.py (1713 of 2134) PASS: lldb-api :: commands/expression/multiline-navigation/TestMultilineNavigation.py (1714 of 2134) PASS: lldb-api :: functionalities/unwind/zeroth_frame/TestZerothFrame.py (1715 of 2134) PASS: lldb-unit :: Utility/./UtilityTests/RangeDataVector.FindEntryThatContains (1716 of 2134) PASS: lldb-unit :: Utility/./UtilityTests/Flags.AnyClear (1717 of 2134) UNSUPPORTED: lldb-shell :: SymbolFile/PDB/type-quals.test (1718 of 2134) PASS: lldb-unit :: Utility/./UtilityTests/ProcessInstanceInfo.DumpTable_invalidUID (1719 of 2134) UNSUPPORTED: lldb-api :: arm/breakpoint-it/TestBreakpointIt.py (1720 of 2134) PASS: lldb-unit :: DataFormatter/./LLDBFormatterTests/TypeMatcherTests.GetMatchStringExactName (1721 of 2134) PASS: lldb-unit :: Process/minidump/./LLDBMinidumpTests/MinidumpParserTest.MinidumpModuleOrder (1722 of 2134) PASS: lldb-shell :: SymbolFile/NativePDB/globals-fundamental.cpp (1723 of 2134) PASS: lldb-api :: commands/version/TestVersion.py (1724 of 2134) PASS: lldb-api :: functionalities/data-formatter/data-formatter-objc/TestDataFormatterObjCCF.py (1725 of 2134) PASS: lldb-unit :: Host/./HostTests/FileSystemTest.Exists (1726 of 2134) PASS: lldb-api :: commands/breakpoint/command/list/TestBreakpointCommandList.py (1727 of 2134) PASS: lldb-shell :: Commands/command-source.test (1728 of 2134) PASS: lldb-unit :: Process/gdb-remote/./ProcessGdbRemoteTests/GDBRemoteCommunicationServerTest.SendErrorResponse_Status (1729 of 2134) PASS: lldb-unit :: Language/Highlighting/./HighlighterTests/HighlighterTest.ClangSquareBrackets (1730 of 2134) PASS: lldb-shell :: ObjectFile/ELF/duplicate-section.yaml (1731 of 2134) PASS: lldb-api :: lang/objcxx/class-name-clash/TestNameClash.py (1732 of 2134) PASS: lldb-unit :: Utility/./UtilityTests/VMRange.Reset (1733 of 2134) PASS: lldb-api :: lang/objc/modules-auto-import/TestModulesAutoImport.py (1734 of 2134) PASS: lldb-shell :: SymbolFile/DWARF/find-basic-type.cpp (1735 of 2134) PASS: lldb-api :: functionalities/data-formatter/data-formatter-objc/TestDataFormatterObjCNSBundle.py (1736 of 2134) PASS: lldb-unit :: Symbol/./SymbolTests/TestClangASTImporter.MetadataPropagationIndirectImport (1737 of 2134) PASS: lldb-api :: commands/expression/po_verbosity/TestPoVerbosity.py (1738 of 2134) PASS: lldb-unit :: Platform/./LLDBPlatformTests/PlatformAppleSimulatorTest.TestHostPlatformToSim (1739 of 2134) PASS: lldb-unit :: Utility/./UtilityTests/TimerTest.CategoryTimesNested (1740 of 2134) PASS: lldb-api :: functionalities/breakpoint/breakpoint_command/TestBreakpointCommandsFromPython.py (1741 of 2134) PASS: lldb-unit :: ScriptInterpreter/Python/./ScriptInterpreterPythonTests/PythonDataObjectsTest.TestOwnedReferences (1742 of 2134) PASS: lldb-api :: lang/c/global_variables/TestGlobalVariables.py (1743 of 2134) PASS: lldb-api :: commands/expression/persist_objc_pointeetype/TestPersistObjCPointeeType.py (1744 of 2134) PASS: lldb-unit :: Utility/./UtilityTests/RangeTest.ContainsEndInclusiveInvalid (1745 of 2134) PASS: lldb-api :: functionalities/breakpoint/address_breakpoints/TestBadAddressBreakpoints.py (1746 of 2134) PASS: lldb-shell :: ObjectFile/PECOFF/disassemble-thumb.yaml (1747 of 2134) PASS: lldb-unit :: UnwindAssembly/x86/./UnwindAssemblyx86Tests/Testx86AssemblyInspectionEngine.TestMovRSPtoRBP (1748 of 2134) PASS: lldb-api :: python_api/lldbutil/iter/TestRegistersIterator.py (1749 of 2134) PASS: lldb-unit :: ObjectFile/MachO/./ObjectFileMachOTests/ObjectFileMachOTest.ModuleFromSharedCacheInfo (1750 of 2134) PASS: lldb-unit :: Host/./HostTests/HostInfoTest.GetXcodeSDK (1751 of 2134) PASS: lldb-unit :: Utility/./UtilityTests/ArgsTest.DoubleQuotedItem (1752 of 2134) PASS: lldb-api :: commands/platform/file/read/TestPlatformFileRead.py (1753 of 2134) PASS: lldb-api :: lang/objc/objc-checker/TestObjCCheckers.py (1754 of 2134) PASS: lldb-api :: lang/cpp/breakpoint_in_member_func_w_non_primitive_params/TestBreakpointInMemberFuncWNonPrimitiveParams.py (1755 of 2134) PASS: lldb-unit :: DataFormatter/./LLDBFormatterTests/TypeMatcherTests.CreatedBySameMatchString (1756 of 2134) PASS: lldb-unit :: Utility/./UtilityTests/LogTest.Unregister (1757 of 2134) PASS: lldb-api :: lang/c/strings/TestCStrings.py (1758 of 2134) PASS: lldb-unit :: Utility/./UtilityTests/StreamTest.QuotedCString (1759 of 2134) PASS: lldb-api :: lang/cpp/unicode-literals/TestUnicodeLiterals.py (1760 of 2134) PASS: lldb-api :: commands/expression/import-std-module/no-std-module/TestMissingStdModule.py (1761 of 2134) PASS: lldb-unit :: Process/minidump/./LLDBMinidumpTests/RegisterContextMinidump.ConvertMinidumpContext_x86_64 (1762 of 2134) PASS: lldb-api :: functionalities/memory-region/TestMemoryRegion.py (1763 of 2134) PASS: lldb-unit :: Utility/./UtilityTests/StreamTest.ChangingByteOrder (1764 of 2134) PASS: lldb-unit :: Utility/./UtilityTests/StreamTest.AddressSize (1765 of 2134) PASS: lldb-shell :: SymbolFile/DWARF/debug_loc.s (1766 of 2134) PASS: lldb-api :: functionalities/thread/concurrent_events/TestConcurrentTwoBreakpointsOneWatchpoint.py (1767 of 2134) PASS: lldb-unit :: Process/minidump/./LLDBMinidumpTests/MinidumpParserTest.GetMiscInfo_no_stream (1768 of 2134) PASS: lldb-unit :: Language/Highlighting/./HighlighterTests/HighlighterTest.ClangUnterminatedString (1769 of 2134) PASS: lldb-unit :: Expression/./ExpressionTests/ClangHostTest.ComputeClangResourceDirectory (1770 of 2134) PASS: lldb-api :: commands/watchpoints/step_over_watchpoint/TestStepOverWatchpoint.py (1771 of 2134) PASS: lldb-api :: functionalities/postmortem/mach-core/TestMachCore.py (1772 of 2134) PASS: lldb-unit :: API/./APITests/SBCommandInterpreterTest.MultiWordCommand (1773 of 2134) PASS: lldb-api :: functionalities/data-formatter/nssetsynth/TestNSSetSynthetic.py (1774 of 2134) PASS: lldb-shell :: SymbolFile/Breakpad/line-table-missing-file.test (1775 of 2134) PASS: lldb-unit :: Utility/./UtilityTests/StatusTest.Formatv (1776 of 2134) PASS: lldb-unit :: Process/gdb-remote/./ProcessGdbRemoteTests/GDBRemoteCommunicationServerTest.SendErrorResponse_StringError (1777 of 2134) PASS: lldb-unit :: UnwindAssembly/x86/./UnwindAssemblyx86Tests/Testx86AssemblyInspectionEngine.TestPushRBP (1778 of 2134) PASS: lldb-unit :: UnwindAssembly/x86/./UnwindAssemblyx86Tests/Testx86AssemblyInspectionEngine.TestLEAVE (1779 of 2134) PASS: lldb-unit :: Core/./LLDBCoreTests/StreamCallbackTest.Callback (1780 of 2134) PASS: lldb-unit :: Utility/./UtilityTests/StreamTest.PutMaxHex64ByteOrderBig (1781 of 2134) PASS: lldb-api :: functionalities/data-formatter/typedef_array/TestTypedefArray.py (1782 of 2134) PASS: lldb-api :: python_api/lldbutil/frame/TestFrameUtils.py (1783 of 2134) PASS: lldb-unit :: Expression/./ExpressionTests/DiagnosticManagerTest.AppendMessageAttachToLastDiag (1784 of 2134) PASS: lldb-api :: functionalities/stats_api/TestStatisticsAPI.py (1785 of 2134) UNSUPPORTED: lldb-shell :: ObjectFile/ELF/minidebuginfo-no-lzma.yaml (1786 of 2134) PASS: lldb-shell :: SymbolFile/Breakpad/line-table-mixed-path-styles.test (1787 of 2134) PASS: lldb-api :: python_api/value/change_values/TestChangeValueAPI.py (1788 of 2134) UNSUPPORTED: lldb-api :: functionalities/darwin_log/filter/exact_match/activity-chain/TestDarwinLogFilterMatchActivityChain.py (1789 of 2134) PASS: lldb-api :: commands/expression/dollar-in-variable/TestDollarInVariable.py (1790 of 2134) PASS: lldb-shell :: Minidump/breakpad-symbols.test (1791 of 2134) PASS: lldb-api :: functionalities/multiword-commands/TestMultiWordCommands.py (1792 of 2134) PASS: lldb-unit :: Utility/./UtilityTests/StreamTest.PutPtr (1793 of 2134) PASS: lldb-unit :: Utility/./UtilityTests/BinaryStreamTest.PutULEB128Zero (1794 of 2134) PASS: lldb-unit :: Utility/./UtilityTests/SubsystemRAIITest.SubsystemWithErrorFailure (1795 of 2134) PASS: lldb-api :: functionalities/breakpoint/breakpoint_locations/TestBreakpointLocations.py (1796 of 2134) PASS: lldb-unit :: Core/./LLDBCoreTests/MangledTest.NameIndexes_FindFunctionSymbols (1797 of 2134) PASS: lldb-api :: commands/frame/select/TestFrameSelect.py (1798 of 2134) PASS: lldb-api :: commands/watchpoints/watchpoint_on_vectors/TestValueOfVectorVariable.py (1799 of 2134) PASS: lldb-unit :: ScriptInterpreter/Python/./ScriptInterpreterPythonTests/PythonDataObjectsTest.TestInstanceNameResolutionNoDot (1800 of 2134) PASS: lldb-shell :: Breakpoint/debug_rnglistx_rlex.test (1801 of 2134) PASS: lldb-api :: functionalities/data-formatter/data-formatter-stl/libcxx/vector/TestDataFormatterLibcxxVector.py (1802 of 2134) PASS: lldb-unit :: UnwindAssembly/x86/./UnwindAssemblyx86Tests/Testx86AssemblyInspectionEngine.TestPushEBX (1803 of 2134) PASS: lldb-shell :: Recognizer/assert.test (1804 of 2134) PASS: lldb-api :: functionalities/breakpoint/move_nearest/TestMoveNearest.py (1805 of 2134) PASS: lldb-api :: lang/c/shared_lib/TestSharedLib.py (1806 of 2134) PASS: lldb-api :: functionalities/avoids-fd-leak/TestFdLeak.py (1807 of 2134) PASS: lldb-unit :: Language/Highlighting/./HighlighterTests/HighlighterTest.ClangCursorPosInOtherToken (1808 of 2134) PASS: lldb-unit :: Utility/./UtilityTests/XcodeSDKTest.GetCanonicalNameAndConstruct (1809 of 2134) PASS: lldb-unit :: Host/./HostTests/SocketTest.DecodeHostAndPort (1810 of 2134) PASS: lldb-shell :: Reproducer/Functionalities/TestExpressionEvaluation.test (1811 of 2134) PASS: lldb-shell :: ObjectFile/ELF/section-types-edgecases.yaml (1812 of 2134) PASS: lldb-api :: lang/c/shared_lib_stripped_symbols/TestSharedLibStrippedSymbols.py (1813 of 2134) PASS: lldb-api :: types/TestFloatTypes.py (1814 of 2134) PASS: lldb-unit :: Utility/./UtilityTests/DataExtractorTest.GetDoubleUnaligned (1815 of 2134) UNSUPPORTED: lldb-shell :: ScriptInterpreter/Lua/convenience_variables.test (1816 of 2134) PASS: lldb-unit :: Utility/./UtilityTests/VMRange.Clear (1817 of 2134) PASS: lldb-unit :: Host/./HostTests/FileSystemTest.EnumerateDirectory (1818 of 2134) PASS: lldb-unit :: Utility/./UtilityTests/GeneratorTest.YamlMultiProvider (1819 of 2134) PASS: lldb-shell :: Commands/command-disassemble.s (1820 of 2134) PASS: lldb-unit :: Utility/./UtilityTests/StringExtractorTest.GetHexBytes_FullString (1821 of 2134) PASS: lldb-api :: functionalities/data-formatter/ptr_ref_typedef/TestPtrRef2Typedef.py (1822 of 2134) PASS: lldb-api :: commands/expression/call-function/TestCallStdStringFunction.py (1823 of 2134) PASS: lldb-unit :: Utility/./UtilityTests/CompletionRequest.TryCompleteCurrentArgGood (1824 of 2134) PASS: lldb-api :: lang/objc/objc-new-syntax/TestObjCNewSyntaxDictionary.py (1825 of 2134) PASS: lldb-api :: functionalities/thread/step_until/TestStepUntil.py (1826 of 2134) PASS: lldb-unit :: Utility/./UtilityTests/StringListTest.InsertStringAtIndexStart (1827 of 2134) PASS: lldb-unit :: Utility/./UtilityTests/ArgsTest.TestAppendArg (1828 of 2134) PASS: lldb-unit :: UnwindAssembly/x86/./UnwindAssemblyx86Tests/Testx86AssemblyInspectionEngine.TestStackRealignMSVC_i386 (1829 of 2134) PASS: lldb-api :: commands/command/script_alias/TestCommandScriptAlias.py (1830 of 2134) PASS: lldb-api :: commands/watchpoints/watchpoint_count/TestWatchpointCount.py (1831 of 2134) PASS: lldb-shell :: SymbolFile/DWARF/split-dwarf-multiple-cu.ll (1832 of 2134) PASS: lldb-unit :: Utility/./UtilityTests/PassiveReplayTest.InstrumentedBar (1833 of 2134) PASS: lldb-unit :: Utility/./UtilityTests/UriParserTest.BracketedHostname (1834 of 2134) PASS: lldb-shell :: ObjectFile/ELF/build-id-case.yaml (1835 of 2134) PASS: lldb-api :: lang/c/vla/TestVLA.py (1836 of 2134) PASS: lldb-shell :: SymbolFile/Breakpad/unwind-via-stack-win-no-memory-info.yaml (1837 of 2134) PASS: lldb-shell :: SymbolFile/NativePDB/global-classes.cpp (1838 of 2134) UNSUPPORTED: lldb-shell :: SymbolFile/PDB/expressions.test (1839 of 2134) PASS: lldb-api :: functionalities/dead-strip/TestDeadStrip.py (1840 of 2134) PASS: lldb-shell :: Reproducer/Functionalities/TestImageList.test (1841 of 2134) PASS: lldb-unit :: Utility/./UtilityTests/DataExtractorTest.GetFloat (1842 of 2134) PASS: lldb-api :: functionalities/gdb_remote_client/TestqOffsets.py (1843 of 2134) PASS: lldb-unit :: Expression/./ExpressionTests/CppModuleConfigurationTest.AmbiguousCLib (1844 of 2134) UNSUPPORTED: lldb-api :: commands/register/register/intel_xtended_registers/mpx_offset_intersection/TestMPXOffsetIntersection.py (1845 of 2134) PASS: lldb-unit :: Symbol/./SymbolTests/TestTypeSystemClang.TestGetEnumIntegerTypeBasicTypes (1846 of 2134) PASS: lldb-unit :: Utility/./UtilityTests/StreamTest.PutRawBytesToBigEndian (1847 of 2134) PASS: lldb-unit :: Utility/./UtilityTests/StringExtractorTest.GetHexU8_Underflow_NoEof (1848 of 2134) PASS: lldb-unit :: Utility/./UtilityTests/SerializationRountripTest.SerializeDeserializeCStringArrayNullptrElem (1849 of 2134) PASS: lldb-unit :: Process/minidump/./LLDBMinidumpTests/RegisterContextMinidump.ConvertMinidumpContext_x86_32 (1850 of 2134) PASS: lldb-api :: commands/command/nested_alias/TestNestedAlias.py (1851 of 2134) PASS: lldb-api :: lang/cpp/const_this/TestConstThis.py (1852 of 2134) PASS: lldb-api :: sanity/TestSettingSkipping.py (1853 of 2134) PASS: lldb-api :: commands/process/launch/TestProcessLaunch.py (1854 of 2134) PASS: lldb-api :: lang/c/local_types/TestUseClosestType.py (1855 of 2134) PASS: lldb-api :: commands/reproducer/invalid-args/TestInvalidArgsReproducer.py (1856 of 2134) UNSUPPORTED: lldb-api :: benchmarks/turnaround/TestCompileRunToBreakpointTurnaround.py (1857 of 2134) PASS: lldb-unit :: Utility/./UtilityTests/CompletionRequest.DuplicateFiltering (1858 of 2134) PASS: lldb-api :: lang/objc/forward-decl/TestForwardDecl.py (1859 of 2134) UNSUPPORTED: lldb-api :: tools/lldb-server/libraries-svr4/TestGdbRemoteLibrariesSvr4Support.py (1860 of 2134) PASS: lldb-unit :: Utility/./UtilityTests/NameMatchesTest.Ignore (1861 of 2134) PASS: lldb-unit :: Process/minidump/./LLDBMinidumpTests/MinidumpParserTest.GetThreadContext_x86_64 (1862 of 2134) PASS: lldb-api :: lang/objc/objc-property/TestObjCProperty.py (1863 of 2134) PASS: lldb-api :: commands/target/select/TestTargetSelect.py (1864 of 2134) PASS: lldb-unit :: Utility/./UtilityTests/OptionsWithRawTest.EmptyArgsOnlySuffix (1865 of 2134) PASS: lldb-api :: functionalities/data-formatter/cstring-utf8-summary/TestCstringUnicode.py (1866 of 2134) PASS: lldb-api :: commands/target/modules/search-paths/insert/TestTargetModulesSearchpathsInsert.py (1867 of 2134) PASS: lldb-api :: lang/objc/modules-update/TestClangModulesUpdate.py (1868 of 2134) PASS: lldb-unit :: Symbol/./SymbolTests/LineEntryTest.GetSameLineContiguousAddressRangeNestedInline (1869 of 2134) PASS: lldb-unit :: Process/gdb-remote/./ProcessGdbRemoteTests/GDBRemoteCommunicationClientTest.TestPacketSpeedJSON (1870 of 2134) PASS: lldb-unit :: Utility/./UtilityTests/Flags.Reset (1871 of 2134) PASS: lldb-unit :: SymbolFile/NativePDB/./SymbolFileNativePDBTests/PDBFPOProgramToDWARFExpressionTests.InvalidOpBinary (1872 of 2134) PASS: lldb-api :: functionalities/data-formatter/vector-types/TestVectorTypesFormatting.py (1873 of 2134) PASS: lldb-api :: macosx/queues/TestQueues.py (1874 of 2134) PASS: lldb-unit :: Utility/./UtilityTests/BinaryStreamTest.PutULEB128MaxValue (1875 of 2134) PASS: lldb-unit :: Symbol/./SymbolTests/LineEntryTest.GetSameLineContiguousAddressRangeNoInlines (1876 of 2134) PASS: lldb-unit :: Language/Highlighting/./HighlighterTests/HighlighterTest.ClangOperators (1877 of 2134) PASS: lldb-api :: python_api/signals/TestSignalsAPI.py (1878 of 2134) PASS: lldb-api :: python_api/section/TestSectionAPI.py (1879 of 2134) PASS: lldb-shell :: ObjectFile/ELF/base-address.yaml (1880 of 2134) PASS: lldb-api :: functionalities/type_completion/TestTypeCompletion.py (1881 of 2134) UNSUPPORTED: lldb-shell :: SymbolFile/PDB/variables-locations.test (1882 of 2134) PASS: lldb-unit :: ScriptInterpreter/Python/./ScriptInterpreterPythonTests/PythonDataObjectsTest.TestPythonStringToStructuredString (1883 of 2134) PASS: lldb-shell :: SymbolFile/DWARF/debug-types-basic.test (1884 of 2134) PASS: lldb-api :: python_api/formatters/TestFormattersSBAPI.py (1885 of 2134) PASS: lldb-shell :: SymbolFile/DWARF/debug-types-missing-signature.test (1886 of 2134) PASS: lldb-api :: lang/cpp/dynamic-value-same-basename/TestDynamicValueSameBase.py (1887 of 2134) PASS: lldb-shell :: SymbolFile/DWARF/DW_AT_declaration-with-children.s (1888 of 2134) PASS: lldb-api :: iohandler/unicode/TestUnicode.py (1889 of 2134) PASS: lldb-api :: types/TestCharType.py (1890 of 2134) PASS: lldb-unit :: Utility/./UtilityTests/StringListTest.GetMaxStringLengthEmpty (1891 of 2134) PASS: lldb-unit :: Utility/./UtilityTests/StringExtractorTest.GetU32BigEndian (1892 of 2134) PASS: lldb-api :: functionalities/load_unload/TestLoadUnload.py (1893 of 2134) PASS: lldb-api :: python_api/module_section/TestModuleAndSection.py (1894 of 2134) UNSUPPORTED: lldb-api :: lang/c/typedef/Testtypedef.py (1895 of 2134) PASS: lldb-api :: lang/cpp/class_types/TestClassTypesDisassembly.py (1896 of 2134) PASS: lldb-api :: functionalities/breakpoint/serialize/TestBreakpointSerialization.py (1897 of 2134) PASS: lldb-api :: lang/cpp/stl/TestStdCXXDisassembly.py (1898 of 2134) PASS: lldb-shell :: Driver/TestCore.test (1899 of 2134) PASS: lldb-api :: commands/frame/diagnose/virtual-method-call/TestDiagnoseDereferenceVirtualMethodCall.py (1900 of 2134) PASS: lldb-unit :: Utility/./UtilityTests/BinaryStreamTest.PutULEB128SevenBytes (1901 of 2134) PASS: lldb-api :: types/TestIntegerType.py (1902 of 2134) UNSUPPORTED: lldb-shell :: Register/x86-64-xmm16-read.test (1903 of 2134) PASS: lldb-unit :: Utility/./UtilityTests/XcodeSDKTest.SDKSupportsSwift (1904 of 2134) PASS: lldb-api :: commands/target/create-deps/TestTargetCreateDeps.py (1905 of 2134) PASS: lldb-api :: lang/cpp/stl/TestSTL.py (1906 of 2134) PASS: lldb-api :: functionalities/plugins/python_os_plugin/TestPythonOSPlugin.py (1907 of 2134) PASS: lldb-unit :: ScriptInterpreter/Python/./ScriptInterpreterPythonTests/PythonDataObjectsTest.TestPythonStringToStr (1908 of 2134) PASS: lldb-unit :: Utility/./UtilityTests/RegisterValueTest.GetSet8 (1909 of 2134) PASS: lldb-unit :: Expression/./ExpressionTests/DiagnosticManagerTest.PutStringSeverities (1910 of 2134) PASS: lldb-unit :: Utility/./UtilityTests/VMRange.IsValid (1911 of 2134) PASS: lldb-unit :: Host/./HostTests/MainLoopTest.Signal (1912 of 2134) PASS: lldb-shell :: BuildScript/modes.test (1913 of 2134) PASS: lldb-unit :: Target/./TargetTests/MemoryRegionInfoTest.Formatv (1914 of 2134) PASS: lldb-shell :: ObjectFile/PECOFF/invalid-export-table.yaml (1915 of 2134) UNSUPPORTED: lldb-api :: functionalities/thread/break_after_join/TestBreakAfterJoin.py (1916 of 2134) PASS: lldb-unit :: Host/./HostTests/FileSystemTest.Resolve (1917 of 2134) PASS: lldb-shell :: ObjectFile/ELF/many-sections.s (1918 of 2134) PASS: lldb-api :: functionalities/breakpoint/breakpoint_ignore_count/TestBreakpointIgnoreCount.py (1919 of 2134) PASS: lldb-unit :: Symbol/./SymbolTests/TestTypeSystemClang.TestRecordHasFields (1920 of 2134) PASS: lldb-api :: lang/c/modules/TestCModules.py (1921 of 2134) UNSUPPORTED: lldb-shell :: SymbolFile/PDB/ast-restore.test (1922 of 2134) PASS: lldb-shell :: SymbolFile/Breakpad/stack-cfi-arm.yaml (1923 of 2134) PASS: lldb-unit :: Utility/./UtilityTests/StreamTest.PutSLEB128 (1924 of 2134) PASS: lldb-api :: functionalities/data-formatter/data-formatter-objc/TestDataFormatterObjNSException.py (1925 of 2134) PASS: lldb-unit :: Utility/./UtilityTests/OptionsWithRawTest.TerminatedQuote (1926 of 2134) PASS: lldb-shell :: SymbolFile/DWARF/debug_loclists-dwo.s (1927 of 2134) PASS: lldb-shell :: SymbolFile/DWARF/inline-function-address.ll (1928 of 2134) PASS: lldb-unit :: Process/gdb-remote/./ProcessGdbRemoteTests/GDBRemoteCommunicationTest.ReadPacket_checksum (1929 of 2134) PASS: lldb-api :: lang/objc/blocks/TestObjCIvarsInBlocks.py (1930 of 2134) UNSUPPORTED: lldb-shell :: Register/x86-zmm-read.test (1931 of 2134) PASS: lldb-shell :: SymbolFile/Breakpad/line-table.test (1932 of 2134) PASS: lldb-api :: commands/expression/pr35310/TestExprsBug35310.py (1933 of 2134) UNSUPPORTED: lldb-api :: commands/watchpoints/hello_watchlocation/TestWatchLocation.py (1934 of 2134) UNSUPPORTED: lldb-shell :: ScriptInterpreter/Lua/persistent_state.test (1935 of 2134) PASS: lldb-api :: functionalities/signal/handle-abrt/TestHandleAbort.py (1936 of 2134) PASS: lldb-unit :: Utility/./UtilityTests/UserIDResolver.GetGroupName (1937 of 2134) PASS: lldb-api :: functionalities/postmortem/elf-core/TestLinuxCore.py (1938 of 2134) PASS: lldb-unit :: Target/./TargetTests/ModuleCacheTest.GetAndPutStrangeHostname (1939 of 2134) PASS: lldb-shell :: SymbolFile/DWARF/DW_AT_location-DW_AT_const_value.s (1940 of 2134) PASS: lldb-unit :: Symbol/./SymbolTests/TestTypeSystemClang.TestIsClangType (1941 of 2134) PASS: lldb-api :: functionalities/data-formatter/data-formatter-stl/libcxx/unordered/TestDataFormatterUnordered.py (1942 of 2134) PASS: lldb-unit :: Utility/./UtilityTests/StringListTest.JoinEmpty (1943 of 2134) PASS: lldb-api :: functionalities/thread/concurrent_events/TestConcurrentWatchpointWithDelayWatchpointThreads.py (1944 of 2134) PASS: lldb-unit :: Utility/./UtilityTests/UriParserTest.LongPath (1945 of 2134) PASS: lldb-shell :: SymbolFile/DWARF/dwarf5_locations.s (1946 of 2134) PASS: lldb-shell :: SymbolFile/DWARF/debug-line-basic.s (1947 of 2134) PASS: lldb-api :: lang/cpp/class_types/TestClassTypes.py (1948 of 2134) PASS: lldb-unit :: Utility/./UtilityTests/AnsiTerminal.Unknown (1949 of 2134) PASS: lldb-unit :: Utility/./UtilityTests/StringExtractorTest.GetHexU8_Exact_NoEof (1950 of 2134) PASS: lldb-api :: tools/lldb-server/TestAppleSimulatorOSType.py (1951 of 2134) PASS: lldb-unit :: Symbol/./SymbolTests/TestClangASTImporter.MetadataPropagation (1952 of 2134) PASS: lldb-unit :: Core/./LLDBCoreTests/ModuleSpecTest.TestCOFFFile (1953 of 2134) PASS: lldb-api :: functionalities/dlopen_other_executable/TestDlopenOtherExecutable.py (1954 of 2134) PASS: lldb-api :: commands/expression/call-function/TestCallBuiltinFunction.py (1955 of 2134) PASS: lldb-api :: functionalities/data-formatter/dump_dynamic/TestDumpDynamic.py (1956 of 2134) PASS: lldb-api :: python_api/objc_type/TestObjCType.py (1957 of 2134) PASS: lldb-unit :: Utility/./UtilityTests/StreamTest.PutCharWhitespace (1958 of 2134) PASS: lldb-api :: lang/objc/objc-dyn-sbtype/TestObjCDynamicSBType.py (1959 of 2134) PASS: lldb-api :: tools/lldb-server/register-reading/TestGdbRemoteGPacket.py (1960 of 2134) PASS: lldb-api :: functionalities/data-formatter/format-propagation/TestFormatPropagation.py (1961 of 2134) PASS: lldb-shell :: ScriptInterpreter/None/import_module.test (1962 of 2134) PASS: lldb-unit :: Utility/./UtilityTests/GeneratorTest.Get (1963 of 2134) PASS: lldb-unit :: Utility/./UtilityTests/StringListTest.AppendListCStringArray (1964 of 2134) PASS: lldb-unit :: ScriptInterpreter/Python/./ScriptInterpreterPythonTests/PythonDataObjectsTest.TestResetting (1965 of 2134) PASS: lldb-unit :: UnwindAssembly/x86/./UnwindAssemblyx86Tests/Testx86AssemblyInspectionEngine.TestPushECX (1966 of 2134) PASS: lldb-unit :: Utility/./UtilityTests/StringListTest.InsertStringAtIndexEnd (1967 of 2134) PASS: lldb-api :: commands/frame/diagnose/dereference-this/TestDiagnoseDereferenceThis.py (1968 of 2134) PASS: lldb-unit :: Utility/./UtilityTests/UriParserTest.BracketedHostnamePort (1969 of 2134) PASS: lldb-api :: functionalities/data-formatter/data-formatter-advanced/TestDataFormatterAdv.py (1970 of 2134) PASS: lldb-api :: commands/target/stop-hook/delete/TestTargetStopHookDelete.py (1971 of 2134) PASS: lldb-unit :: Utility/./UtilityTests/CompletionRequest.TestCompletionOwnership (1972 of 2134) PASS: lldb-unit :: ScriptInterpreter/Python/./ScriptInterpreterPythonTests/PythonDataObjectsTest.TestPythonListManipulation (1973 of 2134) PASS: lldb-api :: functionalities/data-formatter/data-formatter-python-synth/TestDataFormatterPythonSynth.py (1974 of 2134) PASS: lldb-unit :: Utility/./UtilityTests/StringListTest.SetSize (1975 of 2134) PASS: lldb-unit :: Target/./TargetTests/ModuleCacheTest.GetAndPut (1976 of 2134) PASS: lldb-unit :: UnwindAssembly/x86/./UnwindAssemblyx86Tests/Testx86AssemblyInspectionEngine.TestPopRBX (1977 of 2134) PASS: lldb-api :: functionalities/plugins/python_os_plugin/stepping_plugin_threads/TestOSPluginStepping.py (1978 of 2134) PASS: lldb-api :: functionalities/data-formatter/data-formatter-synthtype/TestDataFormatterSynthType.py (1979 of 2134) UNSUPPORTED: lldb-api :: functionalities/data-formatter/data-formatter-stl/libstdcpp/smart_ptr/TestDataFormatterStdSmartPtr.py (1980 of 2134) UNSUPPORTED: lldb-api :: functionalities/process_save_core/TestProcessSaveCore.py (1981 of 2134) PASS: lldb-api :: lang/cpp/nested-class-other-compilation-unit/TestNestedClassWithParentInAnotherCU.py (1982 of 2134) PASS: lldb-unit :: Utility/./UtilityTests/NameMatchesTest.RegularExpression (1983 of 2134) PASS: lldb-unit :: Utility/./UtilityTests/StreamTest.PutHex16ByteOrderBig (1984 of 2134) PASS: lldb-unit :: Core/./LLDBCoreTests/CommunicationTest.SynchronizeWhileClosing (1985 of 2134) PASS: lldb-api :: lang/objcxx/objcxx-ivar-vector/TestIvarVector.py (1986 of 2134) XFAIL: lldb-shell :: Unwind/prefer-debug-over-eh-frame.test (1987 of 2134) PASS: lldb-shell :: SymbolFile/DWARF/debug-names-compressed.cpp (1988 of 2134) PASS: lldb-unit :: SymbolFile/DWARF/./SymbolFileDWARFTests/SymbolFileDWARFTests.TestAbbrevMissingTerminator (1989 of 2134) PASS: lldb-shell :: SymbolFile/DWARF/find-basic-function.cpp (1990 of 2134) XFAIL: lldb-shell :: Register/x86-64-ymm-write.test (1991 of 2134) PASS: lldb-api :: functionalities/wrong_commands/TestWrongCommands.py (1992 of 2134) PASS: lldb-api :: lang/cpp/call-function/TestCallCPPFunction.py (1993 of 2134) PASS: lldb-unit :: Symbol/./SymbolTests/TestTypeSystemClang.AddMethodToObjCObjectType (1994 of 2134) PASS: lldb-api :: commands/expression/issue_11588/Test11588.py (1995 of 2134) PASS: lldb-api :: lang/objc/variadic_methods/TestVariadicMethods.py (1996 of 2134) UNSUPPORTED: lldb-api :: linux/add-symbols/TestTargetSymbolsAddCommand.py (1997 of 2134) PASS: lldb-api :: functionalities/data-formatter/data-formatter-stl/libcxx/bitset/TestDataFormatterLibcxxBitset.py (1998 of 2134) PASS: lldb-unit :: Thread/./ThreadTests/ThreadTest.SetStopInfo (1999 of 2134) UNSUPPORTED: lldb-api :: tools/lldb-server/TestGdbRemoteAuxvSupport.py (2000 of 2134) PASS: lldb-unit :: Process/gdb-remote/./ProcessGdbRemoteTests/GDBRemoteCommunicationClientTest.WriteRegisterNoSuffix (2001 of 2134) PASS: lldb-api :: functionalities/thread/concurrent_events/TestConcurrentBreakpointOneDelayBreakpointThreads.py (2002 of 2134) PASS: lldb-unit :: Utility/./UtilityTests/RangeTest.NotEqual (2003 of 2134) PASS: lldb-api :: lang/cpp/unique-types/TestUniqueTypes.py (2004 of 2134) UNSUPPORTED: lldb-api :: tools/lldb-server/TestGdbRemoteCompletion.py (2005 of 2134) PASS: lldb-api :: lang/cpp/this_class_type_mixing/TestThisClassTypeMixing.py (2006 of 2134) PASS: lldb-api :: commands/help/TestHelp.py (2007 of 2134) PASS: lldb-api :: commands/expression/invalid-args/TestInvalidArgsExpression.py (2008 of 2134) PASS: lldb-unit :: Utility/./UtilityTests/ArgsTest.BareSingleQuote (2009 of 2134) PASS: lldb-unit :: Symbol/./SymbolTests/TestTypeSystemClang.TestGetTypeClassTypeOf (2010 of 2134) PASS: lldb-unit :: Expression/./ExpressionTests/ClangExpressionDeclMapTest.TestPersistentDeclLookup (2011 of 2134) PASS: lldb-unit :: Utility/./UtilityTests/StringListTest.LongestCommonPrefix (2012 of 2134) PASS: lldb-unit :: Utility/./UtilityTests/StatusTest.ErrorConversion (2013 of 2134) PASS: lldb-api :: lang/cpp/virtual-overload/TestVirtualOverload.py (2014 of 2134) UNSUPPORTED: lldb-shell :: Register/x86-ymm-write.test (2015 of 2134) PASS: lldb-shell :: SymbolFile/NativePDB/break-by-line.cpp (2016 of 2134) PASS: lldb-unit :: Utility/./UtilityTests/LogChannelEnabledTest.log_options (2017 of 2134) PASS: lldb-unit :: Utility/./UtilityTests/StringExtractorTest.GetHexBytes_OddPair (2018 of 2134) PASS: lldb-unit :: Core/./LLDBCoreTests/MangledTest.EmptyForInvalidName (2019 of 2134) PASS: lldb-unit :: Utility/./UtilityTests/BinaryStreamTest.PutSLEB128ThreeBytes (2020 of 2134) PASS: lldb-api :: functionalities/source-map/TestTargetSourceMap.py (2021 of 2134) PASS: lldb-api :: functionalities/data-formatter/type_summary_list_script/TestTypeSummaryListScript.py (2022 of 2134) UNSUPPORTED: lldb-api :: functionalities/darwin_log/filter/exact_match/category/TestDarwinLogFilterMatchCategory.py (2023 of 2134) PASS: lldb-shell :: ObjectFile/PECOFF/basic-info.yaml (2024 of 2134) PASS: lldb-unit :: Expression/./ExpressionTests/DiagnosticManagerTest.AppendMessageNoDiag (2025 of 2134) PASS: lldb-api :: functionalities/thread/concurrent_events/TestConcurrentManyBreakpoints.py (2026 of 2134) PASS: lldb-shell :: SymbolFile/NativePDB/s_constant.cpp (2027 of 2134) UNSUPPORTED: lldb-shell :: ScriptInterpreter/Lua/independent_state.test (2028 of 2134) PASS: lldb-unit :: Interpreter/./InterpreterTests/OptionValueFileColonLine.setFromString (2029 of 2134) PASS: lldb-shell :: SymbolFile/DWARF/find-basic-namespace.cpp (2030 of 2134) PASS: lldb-unit :: Process/gdb-remote/./ProcessGdbRemoteTests/GDBRemoteClientBaseTest.SendContinueAndLateInterrupt (2031 of 2134) UNSUPPORTED: lldb-shell :: ScriptInterpreter/Lua/io.test (2032 of 2134) PASS: lldb-unit :: Utility/./UtilityTests/StreamTest.PutNHex8 (2033 of 2134) PASS: lldb-unit :: Utility/./UtilityTests/UUIDTest.SetFromStringRef (2034 of 2134) PASS: lldb-api :: commands/expression/radar_8638051/Test8638051.py (2035 of 2134) PASS: lldb-shell :: Commands/command-disassemble-process.yaml (2036 of 2134) PASS: lldb-unit :: Expression/./ExpressionTests/DWARFExpression.DW_OP_unknown (2037 of 2134) PASS: lldb-api :: macosx/find-dsym/deep-bundle/TestDeepBundle.py (2038 of 2134) PASS: lldb-shell :: ObjectFile/ELF/PT_LOAD-overlap-section.yaml (2039 of 2134) PASS: lldb-api :: functionalities/archives/TestBSDArchives.py (2040 of 2134) PASS: lldb-unit :: Language/Highlighting/./HighlighterTests/HighlighterTest.ClangEmptyInput (2041 of 2134) PASS: lldb-unit :: UnwindAssembly/x86/./UnwindAssemblyx86Tests/Testx86AssemblyInspectionEngine.TestPopR15 (2042 of 2134) PASS: lldb-unit :: Expression/./ExpressionTests/CppModuleConfigurationTest.MissingUsrInclude (2043 of 2134) PASS: lldb-api :: lang/c/unions/TestUnionMembers.py (2044 of 2134) PASS: lldb-unit :: Utility/./UtilityTests/RangeTest.ContainsEndInclusive (2045 of 2134) PASS: lldb-unit :: Utility/./UtilityTests/XcodeSDKTest.SDKSupportsModules (2046 of 2134) PASS: lldb-api :: lang/objc/objc-static-method-stripped/TestObjCStaticMethodStripped.py (2047 of 2134) PASS: lldb-api :: lang/cpp/constructors/TestCppConstructors.py (2048 of 2134) PASS: lldb-unit :: Utility/./UtilityTests/RecordReplayTest.InstrumentedBarPtr (2049 of 2134) PASS: lldb-api :: functionalities/breakpoint/global_constructor/TestBreakpointInGlobalConstructor.py (2050 of 2134) PASS: lldb-shell :: ObjectFile/ELF/PT_LOAD-empty.yaml (2051 of 2134) PASS: lldb-unit :: Utility/./UtilityTests/OptionsWithRawTest.SingleWordSuffix (2052 of 2134) PASS: lldb-unit :: Utility/./UtilityTests/ArgsTest.EscapeLLDBCommandArgument (2053 of 2134) PASS: lldb-unit :: Symbol/./SymbolTests/TestTypeSystemClang.TestConvertAccessTypeToAccessSpecifier (2054 of 2134) PASS: lldb-shell :: Settings/TestSettingsSet.test (2055 of 2134) PASS: lldb-unit :: Host/./HostTests/FileSystemTest.GetPermissions (2056 of 2134) PASS: lldb-shell :: Reproducer/TestMultipleTargets.test (2057 of 2134) PASS: lldb-api :: python_api/value_var_update/TestValueVarUpdate.py (2058 of 2134) PASS: lldb-unit :: Utility/./UtilityTests/ScalarTest.CastOperations (2059 of 2134) PASS: lldb-api :: tools/lldb-server/TestGdbRemote_qThreadStopInfo.py (2060 of 2134) PASS: lldb-api :: commands/expression/import-std-module/shared_ptr/TestSharedPtrFromStdModule.py (2061 of 2134) PASS: lldb-api :: commands/expression/completion-crash-incomplete-record/TestCompletionCrashIncompleteRecord.py (2062 of 2134) PASS: lldb-unit :: Utility/./UtilityTests/StringListTest.Clear (2063 of 2134) PASS: lldb-api :: functionalities/var_path/TestVarPath.py (2064 of 2134) PASS: lldb-api :: macosx/profile_vrs_detach/TestDetachVrsProfile.py (2065 of 2134) PASS: lldb-api :: tools/lldb-vscode/coreFile/TestVSCode_coreFile.py (2066 of 2134) PASS: lldb-api :: lang/cpp/typeof/TestTypeOfDeclTypeExpr.py (2067 of 2134) PASS: lldb-unit :: SymbolFile/DWARF/./SymbolFileDWARFTests/SymbolFileDWARFTests.TestAbbrevNullAttrValidForm (2068 of 2134) PASS: lldb-unit :: Utility/./UtilityTests/GeneratorTest.GetOrCreate (2069 of 2134) UNSUPPORTED: lldb-shell :: Unwind/eh-frame-augment-noop.test (2070 of 2134) PASS: lldb-api :: lang/c/complex/TestComplexC99.py (2071 of 2134) PASS: lldb-unit :: Utility/./UtilityTests/StringListTest.GetSize (2072 of 2134) PASS: lldb-unit :: Utility/./UtilityTests/StringLexerTest.HasAtLeast (2073 of 2134) PASS: lldb-api :: commands/process/attach/attach_denied/TestAttachDenied.py (2074 of 2134) PASS: lldb-unit :: Utility/./UtilityTests/DataExtractorTest.GetMaxU64_unchecked (2075 of 2134) PASS: lldb-unit :: Utility/./UtilityTests/ArgsTest.GetQuotedCommandString (2076 of 2134) PASS: lldb-unit :: DataFormatter/./LLDBFormatterTests/TypeMatcherTests.CreatedBySameMatchStringExactNamePrefixes (2077 of 2134) PASS: lldb-unit :: Utility/./UtilityTests/ArchSpecTest.MergeFromMachOUnknown (2078 of 2134) PASS: lldb-api :: lang/cpp/function_refs/TestFunctionRefs.py (2079 of 2134) PASS: lldb-api :: commands/expression/codegen-crash-typedefdecl-not-in_declcontext/TestCodegenCrashTypedefDeclNotInDeclContext.py (2080 of 2134) PASS: lldb-unit :: Utility/./UtilityTests/StreamTeeTest.Constructor1Stream (2081 of 2134) PASS: lldb-unit :: Utility/./UtilityTests/StringListTest.AppendStringStdString (2082 of 2134) PASS: lldb-api :: lang/objc/unicode-string/TestUnicodeString.py (2083 of 2134) PASS: lldb-shell :: SymbolFile/DWARF/limit-debug-info.s (2084 of 2134) PASS: lldb-unit :: Utility/./UtilityTests/ScalarTest.LongLongAssigmentOperator (2085 of 2134) PASS: lldb-api :: functionalities/ubsan/user-expression/TestUbsanUserExpression.py (2086 of 2134) PASS: lldb-unit :: Signals/./SignalsTests/UnixSignalsTest.VersionChange (2087 of 2134) PASS: lldb-unit :: Host/./HostTests/ConnectionFileDescriptorTest.TCPGetURIv4 (2088 of 2134) PASS: lldb-unit :: Utility/./UtilityTests/StructuredDataTest.ParseJSONFromFile (2089 of 2134) PASS: lldb-shell :: ObjectFile/MachO/lc_build_version_notools.yaml (2090 of 2134) PASS: lldb-shell :: ObjectFile/wasm/stripped-debug-sections.yaml (2091 of 2134) PASS: lldb-api :: commands/expression/argument_passing_restrictions/TestArgumentPassingRestrictions.py (2092 of 2134) PASS: lldb-unit :: Utility/./UtilityTests/StringLexerTest.PutBack (2093 of 2134) PASS: lldb-unit :: ScriptInterpreter/Python/./ScriptInterpreterPythonTests/PythonDataObjectsTest.TestPythonDictionaryValueEquality (2094 of 2134) PASS: lldb-api :: functionalities/breakpoint/breakpoint_callback_command_source/TestBreakpointCallbackCommandSource.py (2095 of 2134) PASS: lldb-unit :: Utility/./UtilityTests/StringLexerTest.Peek (2096 of 2134) PASS: lldb-unit :: UnwindAssembly/x86/./UnwindAssemblyx86Tests/Testx86AssemblyInspectionEngine.Test32bitFramelessBigStackFrame (2097 of 2134) PASS: lldb-api :: functionalities/data-formatter/setvaluefromcstring/TestSetValueFromCString.py (2098 of 2134) PASS: lldb-api :: commands/platform/basic/TestPlatformCommand.py (2099 of 2134) PASS: lldb-unit :: Host/./HostTests/FileSystemTest.EmptyTest (2100 of 2134) PASS: lldb-api :: functionalities/postmortem/minidump-new/TestMiniDumpUUID.py (2101 of 2134) PASS: lldb-api :: commands/apropos/basic/TestApropos.py (2102 of 2134) PASS: lldb-unit :: Utility/./UtilityTests/UriParserTest.MinimalPort (2103 of 2134) UNSUPPORTED: lldb-api :: linux/sepdebugsymlink/TestTargetSymbolsSepDebugSymlink.py (2104 of 2134) PASS: lldb-api :: functionalities/conditional_break/TestConditionalBreak.py (2105 of 2134) PASS: lldb-unit :: Process/gdb-remote/./ProcessGdbRemoteTests/GDBRemoteCommunicationClientTest.SendSignalsToIgnore (2106 of 2134) UNSUPPORTED: lldb-shell :: ScriptInterpreter/Lua/quit.test (2107 of 2134) PASS: lldb-api :: functionalities/breakpoint/breakpoint_conditions/TestBreakpointConditions.py (2108 of 2134) PASS: lldb-unit :: Utility/./UtilityTests/FileSpecTest.OperatorBool (2109 of 2134) PASS: lldb-shell :: Minidump/no-process-id.yaml (2110 of 2134) UNSUPPORTED: lldb-shell :: SymbolFile/PDB/udt-layout.test (2111 of 2134) PASS: lldb-api :: lang/cpp/overloaded-functions/TestOverloadedFunctions.py (2112 of 2134) PASS: lldb-api :: commands/frame/language/TestGuessLanguage.py (2113 of 2134) PASS: lldb-api :: functionalities/param_entry_vals/basic_entry_values/TestBasicEntryValues.py (2114 of 2134) PASS: lldb-api :: lang/cpp/accelerator-table/TestCPPAccelerator.py (2115 of 2134) XFAIL: lldb-shell :: Register/x86-mm-xmm-read.test (2116 of 2134) PASS: lldb-shell :: ObjectFile/ELF/short-build-id.yaml (2117 of 2134) PASS: lldb-api :: commands/target/stop-hook/disable/TestTargetStopHookDisable.py (2118 of 2134) PASS: lldb-shell :: SymbolFile/DWARF/DW_AT_const_value.s (2119 of 2134) PASS: lldb-api :: commands/expression/result_numbering/TestResultNumbering.py (2120 of 2134) PASS: lldb-unit :: Utility/./UtilityTests/StringExtractorTest.DecodeHexU8_Exact (2121 of 2134) PASS: lldb-unit :: Process/minidump/./LLDBMinidumpTests/MinidumpParserTest.GetThreadContext_x86_32 (2122 of 2134) PASS: lldb-unit :: Host/./HostTests/FileSystemTest.OpenErrno (2123 of 2134) PASS: lldb-unit :: UnwindAssembly/x86/./UnwindAssemblyx86Tests/Testx86AssemblyInspectionEngine.TestSpillRegToStackViaMOVx86_64 (2124 of 2134) PASS: lldb-unit :: Core/./LLDBCoreTests/MangledTest.ResultForValidName (2125 of 2134) PASS: lldb-api :: functionalities/thread/concurrent_events/TestConcurrentDelaySignalWatch.py (2126 of 2134) PASS: lldb-api :: lang/objc/foundation/TestRuntimeTypes.py (2127 of 2134) PASS: lldb-unit :: Platform/./LLDBPlatformTests/PlatformAppleSimulatorTest.TestSimHasSimEnvionament (2128 of 2134) PASS: lldb-api :: lang/objc/ptr_refs/TestPtrRefsObjC.py (2129 of 2134) PASS: lldb-unit :: Utility/./UtilityTests/UriParserTest.TypicalPortPathIPv4 (2130 of 2134) PASS: lldb-unit :: Utility/./UtilityTests/StreamTest.PutCharNull (2131 of 2134) PASS: lldb-api :: commands/add-dsym/uuid/TestAddDsymCommand.py (2132 of 2134) PASS: lldb-api :: commands/expression/import_builtin_fileid/TestImportBuiltinFileID.py (2133 of 2134) PASS: lldb-api :: functionalities/type_lookup/TestTypeLookup.py (2134 of 2134) Slowest Tests: -------------------------------------------------------------------------- 601.12s: lldb-api :: macosx/simulator/TestSimulatorPlatform.py 258.64s: lldb-api :: lang/cpp/enum_types/TestCPP11EnumTypes.py 231.79s: lldb-api :: types/TestLongTypesExpr.py 174.74s: lldb-api :: lang/objc/rdar-11355592/TestRdar11355592.py 99.43s: lldb-api :: tools/lldb-server/TestLldbGdbServer.py 98.78s: lldb-api :: commands/session/save/TestSessionSave.py 90.23s: lldb-api :: lang/objc/objc-struct-argument/TestObjCStructArgument.py 87.16s: lldb-api :: functionalities/postmortem/mach-core/TestMachCore.py 77.64s: lldb-api :: types/TestShortType.py 64.91s: lldb-api :: functionalities/pointer_num_children/TestPointerNumChildren.py 63.76s: lldb-api :: commands/expression/persist_objc_pointeetype/TestPersistObjCPointeeType.py 56.76s: lldb-api :: lang/objc/hidden-ivars/TestHiddenIvars.py 52.82s: lldb-api :: lang/objc/exceptions/TestObjCExceptions.py 51.29s: lldb-api :: commands/expression/scoped_enums/TestScopedEnumType.py 49.51s: lldb-api :: lang/objc/foundation/TestFoundationDisassembly.py 48.75s: lldb-api :: api/multithreaded/TestMultithreaded.py 48.12s: lldb-api :: lang/objc/foundation/TestObjCMethods.py 47.09s: lldb-shell :: SymbolFile/NativePDB/disassembly.cpp 44.50s: lldb-unit :: Platform/./LLDBPlatformTests/PlatformAppleSimulatorTest.TestHostPlatformToSim 43.80s: lldb-api :: commands/expression/po_verbosity/TestPoVerbosity.py

Hide Details

Tests Times: -------------------------------------------------------------------------- [ Range ] :: [ Percentage ] :: [ Count ] -------------------------------------------------------------------------- [600s,650s) :: [ ] :: [ 1/2134] [550s,600s) :: [ ] :: [ 0/2134] [500s,550s) :: [ ] :: [ 0/2134] [450s,500s) :: [ ] :: [ 0/2134] [400s,450s) :: [ ] :: [ 0/2134] [350s,400s) :: [ ] :: [ 0/2134] [300s,350s) :: [ ] :: [ 0/2134] [250s,300s) :: [ ] :: [ 2/2134] [200s,250s) :: [ ] :: [ 0/2134] [150s,200s) :: [ ] :: [ 1/2134] [100s,150s) :: [ ] :: [ 2/2134] [ 50s,100s) :: [ ] :: [ 12/2134] [ 0s, 50s) :: [*************************************** ] :: [2116/2134] -------------------------------------------------------------------------- ******************** Timed Out Tests (1): lldb-api :: macosx/simulator/TestSimulatorPlatform.py

Hide Details

Hide Details

Testing Time: 2058.11s Unsupported : 150 Passed : 1977 Expectedly Failed: 6 Timed Out : 1 FAILED: tools/lldb/test/CMakeFiles/check-lldb-lit cd /Users/buildslave/jenkins/workspace/lldb-cmake@2/lldb-build/tools/lldb/test && /usr/local/Frameworks/Python.framework/Versions/3.7/bin/python3.7 /Users/buildslave/jenkins/workspace/lldb-cmake@2/lldb-build/./bin/llvm-lit -v --time-tests --shuffle --xunit-xml-output=/Users/buildslave/jenkins/workspace/lldb-cmake@2/test/results.xml -v -j 4 /Users/buildslave/jenkins/workspace/lldb-cmake@2/lldb-build/tools/lldb/test ninja: build stopped: subcommand failed. Command failed: Command '['/usr/bin/env', 'TERM=vt100', '/usr/local/bin/ninja', '-v', 'check-lldb']' returned non-zero exit status 1 Command: ['/usr/bin/env', 'TERM=vt100', '/usr/local/bin/ninja', '-v', 'check-lldb'] [Pipeline] } [Pipeline] // timeout [Pipeline] } [Pipeline] // stage [Pipeline] stage [Pipeline] { (Declarative: Post Actions) [Pipeline] scanForIssues [Clang (LLVM based)] Sleeping for 5 seconds due to JENKINS-32191... [Clang (LLVM based)] Parsing console log (workspace: '/Users/buildslave/jenkins/workspace/lldb-cmake@2') [Clang (LLVM based)] Successfully parsed console log [Clang (LLVM based)] -> found 13 issues (skipped 12 duplicates) [Clang (LLVM based)] Post processing issues on 'green-dragon-10' with source code encoding 'UTF-8' [Clang (LLVM based)] Creating SCM blamer to obtain author and commit information for affected files [Clang (LLVM based)] Creating SCM miner to obtain statistics for affected repository files [Clang (LLVM based)] Resolving file names for all issues in source directory '/Users/buildslave/jenkins/workspace/lldb-cmake@2' [Clang (LLVM based)] -> resolved paths in source directory (9 found, 0 not found) [Clang (LLVM based)] Resolving module names from module definitions (build.xml, pom.xml, or Manifest.mf files) [Clang (LLVM based)] -> resolved module names for 13 issues [Clang (LLVM based)] Resolving package names (or namespaces) by parsing the affected files [Clang (LLVM based)] -> resolved package names of 9 affected files [Clang (LLVM based)] No filter has been set, publishing all 13 issues [Clang (LLVM based)] Creating fingerprints for all affected code blocks to track issues over different builds [Clang (LLVM based)] -> created fingerprints for 13 issues (skipped 0 issues) [Clang (LLVM based)] Copying affected files to Jenkins' build folder '/Users/Shared/Jenkins/Home/jobs/lldb-cmake/builds/23644/files-with-issues' [Clang (LLVM based)] -> 7 copied, 2 not in workspace, 0 not-found, 0 with I/O error [Pipeline] junit Recording test results [Pipeline] } [Pipeline] // stage [Pipeline] } [Pipeline] // withEnv [Pipeline] } [Pipeline] // node [Pipeline] End of Pipeline ERROR: script returned exit code 1 Finished: FAILURE