FailedConsole Output

Skipping 9,531 KB.. Full Log
t :: Host/./HostTests/SocketTest.DomainGetConnectURI (905 of 2137)
PASS: lldb-unit :: Utility/./UtilityTests/FileSpecTest.Match (906 of 2137)
PASS: lldb-unit :: Symbol/./SymbolTests/PostfixExpression.ParseOneExpression (907 of 2137)
PASS: lldb-api :: lang/objc/bitfield_ivars/TestBitfieldIvars.py (908 of 2137)
PASS: lldb-shell :: Process/TestEnvironment.test (909 of 2137)
PASS: lldb-unit :: Core/./LLDBCoreTests/RichManglingContextTest.SwitchProvider (910 of 2137)
PASS: lldb-unit :: Utility/./UtilityTests/BinaryStreamTest.PutSLEB128Zero (911 of 2137)
PASS: lldb-unit :: Host/./HostTests/HostInfoTest.GetAugmentedArchSpec (912 of 2137)
PASS: lldb-unit :: Host/./HostTests/HostInfoTest.GetHostname (913 of 2137)
PASS: lldb-api :: lang/objc/objc-stepping/TestObjCStepping.py (914 of 2137)
PASS: lldb-unit :: Symbol/./SymbolTests/TestClangASTImporter.DeportDeclTagDecl (915 of 2137)
UNSUPPORTED: lldb-api :: commands/watchpoints/variable_out_of_scope/TestWatchedVarHitWhenInScope.py (916 of 2137)
PASS: lldb-api :: iohandler/autosuggestion/TestAutosuggestion.py (917 of 2137)
PASS: lldb-api :: functionalities/breakpoint/breakpoint_conditions/TestBreakpointConditions.py (918 of 2137)
PASS: lldb-shell :: SymbolFile/NativePDB/bitfields.cpp (919 of 2137)
PASS: lldb-api :: functionalities/tail_call_frames/disambiguate_call_site/TestDisambiguateCallSite.py (920 of 2137)
PASS: lldb-api :: lang/c/local_types/TestUseClosestType.py (921 of 2137)
PASS: lldb-shell :: SymbolFile/Breakpad/stack-cfi-parsing.test (922 of 2137)
PASS: lldb-api :: functionalities/thread/concurrent_events/TestConcurrentDelayedCrashWithBreakpointSignal.py (923 of 2137)
PASS: lldb-unit :: ScriptInterpreter/Python/./ScriptInterpreterPythonTests/PythonDataObjectsTest.TestRun (924 of 2137)
PASS: lldb-unit :: Utility/./UtilityTests/StringListTest.InsertStringAtIndexMove (925 of 2137)
PASS: lldb-unit :: ScriptInterpreter/Python/./ScriptInterpreterPythonTests/PythonDataObjectsTest.TestCallable (926 of 2137)
PASS: lldb-api :: types/TestLongTypes.py (927 of 2137)
PASS: lldb-unit :: Host/./HostTests/FileActionTest.Open (928 of 2137)
PASS: lldb-unit :: Utility/./UtilityTests/StringExtractorTest.GetHexBytesAvail_Partial (929 of 2137)
PASS: lldb-unit :: Utility/./UtilityTests/StreamTest.PutStringAsRawHex8 (930 of 2137)
PASS: lldb-api :: functionalities/value_md5_crash/TestValueMD5Crash.py (931 of 2137)
XFAIL: lldb-shell :: SymbolFile/DWARF/find-type-in-function.cpp (932 of 2137)
PASS: lldb-api :: commands/statistics/basic/TestStats.py (933 of 2137)
PASS: lldb-api :: api/listeners/TestListener.py (934 of 2137)
PASS: lldb-unit :: Utility/./UtilityTests/ArgsTest.ReplaceArgumentAtIndexShort (935 of 2137)
PASS: lldb-api :: python_api/lldbutil/TestSwigVersion.py (936 of 2137)
PASS: lldb-api :: functionalities/breakpoint/breakpoint_names/TestBreakpointNames.py (937 of 2137)
PASS: lldb-shell :: SymbolFile/Breakpad/line-table-edgecases.test (938 of 2137)
PASS: lldb-unit :: Utility/./UtilityTests/ArgsTest.TestQuotedTrailingBackslash (939 of 2137)
PASS: lldb-unit :: Utility/./UtilityTests/StringExtractorTest.GetNameColonValueContainsColon (940 of 2137)
PASS: lldb-unit :: Utility/./UtilityTests/OptionsWithRawTest.SingleWordSuffix (941 of 2137)
PASS: lldb-shell :: BuildScript/script-args.test (942 of 2137)
PASS: lldb-unit :: Symbol/./SymbolTests/TestClangASTImporter.DeportTypeTagDecl (943 of 2137)
PASS: lldb-unit :: Process/gdb-remote/./ProcessGdbRemoteTests/GDBRemoteCommunicationClientTest.GetModulesInfo (944 of 2137)
PASS: lldb-api :: macosx/nslog/TestDarwinNSLogOutput.py (945 of 2137)
PASS: lldb-unit :: SymbolFile/DWARF/./SymbolFileDWARFTests/DWARFASTParserClangTests.EnsureAllDIEsInDeclContextHaveBeenParsedParsesOnlyMatchingEntries (946 of 2137)
PASS: lldb-api :: lang/objc/real-definition/TestRealDefinition.py (947 of 2137)
PASS: lldb-unit :: Symbol/./SymbolTests/TestTypeSystemClang.TestConvertAccessTypeToAccessSpecifier (948 of 2137)
PASS: lldb-shell :: ObjectFile/Breakpad/discontiguous-sections.test (949 of 2137)
UNSUPPORTED: lldb-api :: functionalities/data-formatter/data-formatter-stl/libstdcpp/tuple/TestDataFormatterStdTuple.py (950 of 2137)
PASS: lldb-api :: commands/session/history/TestSessionHistory.py (951 of 2137)
PASS: lldb-unit :: Process/minidump/./LLDBMinidumpTests/MinidumpParserTest.GetMemoryRegionInfoLinuxMaps (952 of 2137)
PASS: lldb-unit :: Process/minidump/./LLDBMinidumpTests/MinidumpParserTest.GetMemoryRegionInfoFromMemory64List (953 of 2137)
PASS: lldb-api :: commands/source/info/TestSourceInfo.py (954 of 2137)
UNSUPPORTED: lldb-api :: functionalities/longjmp/TestLongjmp.py (955 of 2137)
PASS: lldb-unit :: Utility/./UtilityTests/Flags.Clear (956 of 2137)
PASS: lldb-unit :: ScriptInterpreter/Python/./ScriptInterpreterPythonTests/PythonDataObjectsTest.TestPythonStringToStructuredString (957 of 2137)
PASS: lldb-api :: lang/cpp/gmodules-templates/TestGModules.py (958 of 2137)
PASS: lldb-api :: functionalities/gdb_remote_client/TestThreadSelectionBug.py (959 of 2137)
PASS: lldb-api :: functionalities/type_lookup/TestTypeLookup.py (960 of 2137)
PASS: lldb-api :: python_api/frame/get-variables/TestGetVariables.py (961 of 2137)
PASS: lldb-unit :: Process/minidump/./LLDBMinidumpTests/MinidumpParserTest.GetThreadContext_x86_64 (962 of 2137)
PASS: lldb-unit :: Language/Highlighting/./HighlighterTests/HighlighterTest.ClangIdentifiers (963 of 2137)
PASS: lldb-api :: functionalities/data-formatter/data-formatter-stl/libcxx/function/TestLibCxxFunction.py (964 of 2137)
PASS: lldb-api :: commands/frame/var/TestFrameVar.py (965 of 2137)
PASS: lldb-shell :: SymbolFile/DWARF/dwp.s (966 of 2137)
UNSUPPORTED: lldb-api :: functionalities/breakpoint/breakpoint_in_delayslot/TestAvoidBreakpointInDelaySlot.py (967 of 2137)
PASS: lldb-api :: functionalities/non-overlapping-index-variable-i/TestIndexVariable.py (968 of 2137)
PASS: lldb-api :: python_api/module_section/TestModuleAndSection.py (969 of 2137)
PASS: lldb-unit :: Utility/./UtilityTests/DataExtractorTest.GetCStrEmpty (970 of 2137)
UNSUPPORTED: lldb-api :: tools/lldb-server/thread-name/TestGdbRemoteThreadName.py (971 of 2137)
PASS: lldb-unit :: Utility/./UtilityTests/ScalarTest.SetValueFromCString (972 of 2137)
PASS: lldb-unit :: Utility/./UtilityTests/RecordReplayTest.InstrumentedBarRef (973 of 2137)
PASS: lldb-api :: functionalities/data-formatter/data-formatter-stl/libcxx/list/TestDataFormatterLibcxxList.py (974 of 2137)
PASS: lldb-unit :: Process/gdb-remote/./ProcessGdbRemoteTests/GDBRemoteClientBaseTest.SendPacketAndReceiveResponseWithOutputSupport (975 of 2137)
PASS: lldb-unit :: Host/./HostTests/FileSystemTest.GetByteSize (976 of 2137)
PASS: lldb-unit :: Utility/./UtilityTests/ArchSpecTest.TestParseMachCPUDashSubtypeTripleSimple (977 of 2137)
PASS: lldb-api :: lang/cpp/constructors/TestCppConstructors.py (978 of 2137)
PASS: lldb-api :: tools/lldb-vscode/attach/TestVSCode_attach.py (979 of 2137)
PASS: lldb-unit :: Expression/./ExpressionTests/DWARFExpression.DW_OP_stack_value (980 of 2137)
PASS: lldb-unit :: ObjectFile/ELF/./ObjectFileELFTests/ObjectFileELFTest.GetSymtab_NoSymEntryPointArmThumbAddressClass (981 of 2137)
PASS: lldb-unit :: Utility/./UtilityTests/CompletionRequest.ShiftArguments (982 of 2137)
PASS: lldb-unit :: SymbolFile/DWARF/./SymbolFileDWARFTests/SymbolFileDWARFTests.TestAbbrevOutOfOrder (983 of 2137)
PASS: lldb-shell :: ObjectFile/Breakpad/breakpad-identification.test (984 of 2137)
PASS: lldb-unit :: Core/./LLDBCoreTests/SourceFileCache.FindSourceFileNotFound (985 of 2137)
PASS: lldb-unit :: Process/minidump/./LLDBMinidumpTests/MinidumpParserTest.GetThreadContext_x86_32 (986 of 2137)
PASS: lldb-unit :: Process/gdb-remote/./ProcessGdbRemoteTests/GDBRemoteClientBaseTest.SendContinueDelegateStructuredDataReceipt (987 of 2137)
PASS: lldb-unit :: Utility/./UtilityTests/RecordReplayTest.InstrumentedFooSameThis (988 of 2137)
PASS: lldb-unit :: Process/gdb-remote/./ProcessGdbRemoteTests/GDBRemoteCommunicationClientTest.WriteRegisterNoSuffix (989 of 2137)
PASS: lldb-unit :: Utility/./UtilityTests/RangeTest.ContainsRangeStartingFromZero (990 of 2137)
PASS: lldb-api :: lang/objc/orderedset/TestOrderedSet.py (991 of 2137)
PASS: lldb-unit :: Language/Highlighting/./HighlighterTests/HighlighterTest.ClangCursorPosEndOfLine (992 of 2137)
PASS: lldb-api :: lang/cpp/type_lookup/TestCppTypeLookup.py (993 of 2137)
PASS: lldb-unit :: Utility/./UtilityTests/PassiveReplayTest.InstrumentedBarRef (994 of 2137)
PASS: lldb-api :: lang/cpp/modules-import/TestCXXModulesImport.py (995 of 2137)
PASS: lldb-api :: functionalities/data-formatter/data-formatter-globals/TestDataFormatterGlobals.py (996 of 2137)
PASS: lldb-shell :: Reproducer/TestRelativePath.test (997 of 2137)
PASS: lldb-api :: python_api/watchpoint/condition/TestWatchpointConditionAPI.py (998 of 2137)
PASS: lldb-unit :: Utility/./UtilityTests/UriParserTest.TypicalPortPathIPv4 (999 of 2137)
PASS: lldb-api :: macosx/queues/TestQueues.py (1000 of 2137)
PASS: lldb-api :: lang/cpp/alignas_base_class/TestAlignAsBaseClass.py (1001 of 2137)
PASS: lldb-unit :: Expression/./ExpressionTests/ClangHostTest.MacOSX (1002 of 2137)
PASS: lldb-unit :: Process/minidump/./LLDBMinidumpTests/MinidumpParserTest.GetMemoryRegionInfoFromMemoryList (1003 of 2137)
PASS: lldb-shell :: SymbolFile/NativePDB/break-by-function.cpp (1004 of 2137)
UNSUPPORTED: lldb-shell :: SymbolFile/PDB/vbases.test (1005 of 2137)
PASS: lldb-shell :: SymbolFile/DWARF/dwarf5-partial-index.cpp (1006 of 2137)
UNSUPPORTED: lldb-api :: functionalities/breakpoint/hardware_breakpoints/write_memory_with_hw_breakpoint/TestWriteMemoryWithHWBreakpoint.py (1007 of 2137)
PASS: lldb-api :: commands/expression/save_jit_objects/TestSaveJITObjects.py (1008 of 2137)
PASS: lldb-shell :: SymbolFile/DWARF/debug_loc_and_loclists.s (1009 of 2137)
PASS: lldb-unit :: UnwindAssembly/x86/./UnwindAssemblyx86Tests/Testx86AssemblyInspectionEngine.TestPopRBPWithREX (1010 of 2137)
PASS: lldb-api :: python_api/function_symbol/TestSymbolAPI.py (1011 of 2137)
PASS: lldb-api :: commands/gui/breakpoints/TestGuiBreakpoints.py (1012 of 2137)
PASS: lldb-api :: lang/cpp/breakpoint_in_member_func_w_non_primitive_params/TestBreakpointInMemberFuncWNonPrimitiveParams.py (1013 of 2137)
PASS: lldb-api :: functionalities/data-formatter/data-formatter-stl/libcxx/bitset/TestDataFormatterLibcxxBitset.py (1014 of 2137)
PASS: lldb-api :: python_api/watchpoint/TestWatchpointIgnoreCount.py (1015 of 2137)
PASS: lldb-api :: lang/cpp/bitfields/TestCppBitfields.py (1016 of 2137)
PASS: lldb-shell :: SymbolFile/DWARF/dir-separator-windows.s (1017 of 2137)
PASS: lldb-unit :: Interpreter/./InterpreterTests/OptionArgParserTest.toBoolean (1018 of 2137)
PASS: lldb-shell :: Quit/TestQuitExitCodeHexA.test (1019 of 2137)
PASS: lldb-unit :: Utility/./UtilityTests/BinaryStreamTest.PutULEB128FourBytes (1020 of 2137)
UNSUPPORTED: lldb-shell :: SymbolFile/PDB/ast-restore.test (1021 of 2137)
PASS: lldb-api :: functionalities/data-formatter/ptr_ref_typedef/TestPtrRef2Typedef.py (1022 of 2137)
PASS: lldb-unit :: ObjectFile/ELF/./ObjectFileELFTests/ObjectFileELFTest.GetModuleSpecifications_EarlySectionHeaders (1023 of 2137)
PASS: lldb-api :: functionalities/data-formatter/vector-types/TestVectorTypesFormatting.py (1024 of 2137)
PASS: lldb-unit :: Utility/./UtilityTests/OptionsWithRawTest.MultiWordSuffix (1025 of 2137)
PASS: lldb-api :: functionalities/gdb_remote_client/TestNoGPacketSupported.py (1026 of 2137)
PASS: lldb-api :: functionalities/data-formatter/data-formatter-stl/libcxx/forward_list/TestDataFormatterLibcxxForwardList.py (1027 of 2137)
PASS: lldb-api :: functionalities/thread/concurrent_events/TestConcurrentDelayWatchBreak.py (1028 of 2137)
PASS: lldb-unit :: Utility/./UtilityTests/UriParserTest.SchemeHostSeparator4 (1029 of 2137)
PASS: lldb-unit :: Utility/./UtilityTests/StreamTest.PutCharNull (1030 of 2137)
PASS: lldb-unit :: ScriptInterpreter/Python/./ScriptInterpreterPythonTests/PythonDataObjectsTest.TestPythonListToStructuredList (1031 of 2137)
PASS: lldb-api :: python_api/hello_world/TestHelloWorld.py (1032 of 2137)
PASS: lldb-unit :: Editline/./EditlineTests/EditlineTestFixture.EditlineReceivesSingleLineText (1033 of 2137)
UNSUPPORTED: lldb-shell :: Reproducer/TestLuaImport.test (1034 of 2137)
PASS: lldb-unit :: Utility/./UtilityTests/TimeoutTest.Format (1035 of 2137)
PASS: lldb-api :: commands/gui/viewlarge/TestGuiViewLarge.py (1036 of 2137)
PASS: lldb-api :: commands/command/script/import/rdar-12586188/TestRdar12586188.py (1037 of 2137)
PASS: lldb-api :: functionalities/postmortem/minidump-new/TestMiniDumpNew.py (1038 of 2137)
PASS: lldb-unit :: Utility/./UtilityTests/DataExtractorTest.GetBitfield (1039 of 2137)
UNSUPPORTED: lldb-api :: functionalities/data-formatter/data-formatter-stl/libstdcpp/unique_ptr/TestDataFormatterStdUniquePtr.py (1040 of 2137)
UNSUPPORTED: lldb-shell :: SymbolFile/DWARF/debug-types-expressions.test (1041 of 2137)
PASS: lldb-unit :: Utility/./UtilityTests/Flags.Reset (1042 of 2137)
PASS: lldb-shell :: ObjectFile/PECOFF/invalid-export-table.yaml (1043 of 2137)
PASS: lldb-api :: lang/cpp/thread_local/TestThreadLocal.py (1044 of 2137)
PASS: lldb-api :: lang/c/vla/TestVLA.py (1045 of 2137)
PASS: lldb-api :: commands/command/script_alias/TestCommandScriptAlias.py (1046 of 2137)
PASS: lldb-unit :: Utility/./UtilityTests/BinaryStreamTest.PutSLEB128EightBytes (1047 of 2137)
PASS: lldb-api :: macosx/find-dsym/deep-bundle/TestDeepBundle.py (1048 of 2137)
PASS: lldb-unit :: Utility/./UtilityTests/FileSpecTest.EqualDotsPosixRoot (1049 of 2137)
PASS: lldb-unit :: Utility/./UtilityTests/StreamTeeTest.Constructor1Stream (1050 of 2137)
PASS: lldb-api :: commands/command/source/TestCommandSource.py (1051 of 2137)
PASS: lldb-api :: functionalities/memory/cache/TestMemoryCache.py (1052 of 2137)
PASS: lldb-unit :: Utility/./UtilityTests/OptionsWithRawTest.LeadingSpaceArgs (1053 of 2137)
PASS: lldb-api :: lang/objc/objc-optimized/TestObjcOptimized.py (1054 of 2137)
PASS: lldb-api :: functionalities/plugins/python_os_plugin/TestPythonOSPlugin.py (1055 of 2137)
PASS: lldb-api :: functionalities/asan/TestReportData.py (1056 of 2137)
PASS: lldb-shell :: SymbolFile/DWARF/find-basic-type.cpp (1057 of 2137)
PASS: lldb-shell :: ObjectFile/MachO/lc_build_version_notools.yaml (1058 of 2137)
PASS: lldb-unit :: Utility/./UtilityTests/StringListTest.GetMaxStringLengthDecreasingSize (1059 of 2137)
PASS: lldb-api :: functionalities/data-formatter/boolreference/TestFormattersBoolRefPtr.py (1060 of 2137)
PASS: lldb-api :: tools/lldb-server/register-reading/TestGdbRemoteGPacket.py (1061 of 2137)
PASS: lldb-api :: functionalities/tail_call_frames/cross_dso/TestCrossDSOTailCalls.py (1062 of 2137)
UNSUPPORTED: lldb-api :: functionalities/unwind/ehframe/TestEhFrameUnwind.py (1063 of 2137)
PASS: lldb-unit :: Utility/./UtilityTests/EventTest.DumpEventDataBytes (1064 of 2137)
UNSUPPORTED: lldb-api :: commands/register/register/aarch64_sve_registers/rw_access_static_config/TestSVERegisters.py (1065 of 2137)
PASS: lldb-api :: commands/platform/file/close/TestPlatformFileClose.py (1066 of 2137)
PASS: lldb-unit :: Utility/./UtilityTests/VMRange.Ordering (1067 of 2137)
PASS: lldb-api :: lang/cpp/nsimport/TestCppNsImport.py (1068 of 2137)
PASS: lldb-shell :: SymbolFile/DWARF/debug-types-missing-signature.test (1069 of 2137)
PASS: lldb-unit :: SymbolFile/DWARF/./SymbolFileDWARFTests/SymbolFileDWARFTests.TestAbbrevOrder1Start5 (1070 of 2137)
PASS: lldb-unit :: Utility/./UtilityTests/StreamTest.PutBytesAsRawHex8ToLittleEndian (1071 of 2137)
PASS: lldb-unit :: Utility/./UtilityTests/VMRange.ContainsRange (1072 of 2137)
PASS: lldb-api :: commands/command/script/TestCommandScript.py (1073 of 2137)
UNSUPPORTED: lldb-api :: functionalities/thread/break_after_join/TestBreakAfterJoin.py (1074 of 2137)
PASS: lldb-unit :: Utility/./UtilityTests/RecordReplayTest.InstrumentedBar (1075 of 2137)
PASS: lldb-api :: commands/target/basic/TestTargetCommand.py (1076 of 2137)
PASS: lldb-unit :: Process/gdb-remote/./ProcessGdbRemoteTests/GDBRemoteCommunicationClientTest.SendGetTraceConfigPacket (1077 of 2137)
PASS: lldb-api :: lang/objc/objc_direct-methods/TestObjCDirectMethods.py (1078 of 2137)
PASS: lldb-api :: lang/c/register_variables/TestRegisterVariables.py (1079 of 2137)
UNSUPPORTED: lldb-shell :: Register/x86-zmm-read.test (1080 of 2137)
PASS: lldb-shell :: ScriptInterpreter/None/import_module.test (1081 of 2137)
PASS: lldb-api :: commands/expression/multiline-navigation/TestMultilineNavigation.py (1082 of 2137)
PASS: lldb-unit :: Utility/./UtilityTests/StreamTest.ShiftOperatorChars (1083 of 2137)
UNSUPPORTED: lldb-api :: functionalities/darwin_log/filter/regex/activity-chain/TestDarwinLogFilterRegexActivityChain.py (1084 of 2137)
PASS: lldb-api :: functionalities/conditional_break/TestConditionalBreak.py (1085 of 2137)
PASS: lldb-unit :: Process/gdb-remote/./ProcessGdbRemoteTests/GDBRemoteCommunicationServerTest.SendErrorResponse_StringError (1086 of 2137)
PASS: lldb-unit :: Utility/./UtilityTests/StringListTest.RemoveBlankLines (1087 of 2137)
PASS: lldb-shell :: Breakpoint/ppc64-localentry.test (1088 of 2137)
UNSUPPORTED: lldb-api :: functionalities/darwin_log/format/TestDarwinLogMessageFormat.py (1089 of 2137)
PASS: lldb-unit :: Utility/./UtilityTests/ReproducerTest.SetCapture (1090 of 2137)
PASS: lldb-api :: functionalities/deleted-executable/TestDeletedExecutable.py (1091 of 2137)
PASS: lldb-api :: functionalities/data-formatter/parray/TestPrintArray.py (1092 of 2137)
PASS: lldb-api :: commands/expression/persistent_types/TestNestedPersistentTypes.py (1093 of 2137)
PASS: lldb-api :: functionalities/gdb_remote_client/TestGDBRemoteLoad.py (1094 of 2137)
PASS: lldb-unit :: UnwindAssembly/x86/./UnwindAssemblyx86Tests/Testx86AssemblyInspectionEngine.TestSimplex86_64Augmented (1095 of 2137)
PASS: lldb-api :: lang/c/step_over_no_deadlock/TestStepOverDoesntBlock.py (1096 of 2137)
PASS: lldb-api :: python_api/function_symbol/TestDisasmAPI.py (1097 of 2137)
PASS: lldb-unit :: Utility/./UtilityTests/ProcessInfoTest.Constructor (1098 of 2137)
PASS: lldb-unit :: Utility/./UtilityTests/BinaryStreamTest.PutSLEB128One (1099 of 2137)
PASS: lldb-api :: functionalities/unwind/noreturn/module-end/TestNoReturnModuleEnd.py (1100 of 2137)
PASS: lldb-api :: lang/objc/unicode-string/TestUnicodeString.py (1101 of 2137)
PASS: lldb-shell :: Breakpoint/case-sensitive.test (1102 of 2137)
PASS: lldb-api :: lang/cpp/class_types/TestClassTypesDisassembly.py (1103 of 2137)
PASS: lldb-unit :: UnwindAssembly/x86/./UnwindAssemblyx86Tests/Testx86AssemblyInspectionEngine.TestPopEDI (1104 of 2137)
PASS: lldb-unit :: Expression/./ExpressionTests/DiagnosticManagerTest.AppendMessageNoDiag (1105 of 2137)
PASS: lldb-unit :: UnwindAssembly/PPC64/./PPC64InstEmulationTests/TestPPC64InstEmulation.TestMediumFunction (1106 of 2137)
UNSUPPORTED: lldb-api :: functionalities/darwin_log/filter/exact_match/subsystem/TestDarwinLogFilterMatchSubsystem.py (1107 of 2137)
PASS: lldb-api :: functionalities/thread/concurrent_events/TestConcurrentWatchpointDelayWatchpointOneBreakpoint.py (1108 of 2137)
PASS: lldb-unit :: Utility/./UtilityTests/UriParserTest.PortOverflow (1109 of 2137)
PASS: lldb-api :: python_api/thread/TestThreadAPI.py (1110 of 2137)
UNSUPPORTED: lldb-api :: benchmarks/turnaround/TestCompileRunToBreakpointTurnaround.py (1111 of 2137)
PASS: lldb-unit :: Expression/./ExpressionTests/DiagnosticManagerTest.PutString (1112 of 2137)
PASS: lldb-api :: commands/expression/import-std-module/basic/TestImportStdModule.py (1113 of 2137)
PASS: lldb-unit :: Symbol/./SymbolTests/TestTypeSystemClang.TestGetTypeClassTypeOfExpr (1114 of 2137)
UNSUPPORTED: lldb-api :: tools/lldb-server/TestGdbRemoteCompletion.py (1115 of 2137)
PASS: lldb-unit :: Utility/./UtilityTests/BinaryStreamTest.PutULEB128EightBytes (1116 of 2137)
PASS: lldb-api :: macosx/thread-names/TestInterruptThreadNames.py (1117 of 2137)
PASS: lldb-unit :: Utility/./UtilityTests/ArgsTest.StringListConstructor (1118 of 2137)
PASS: lldb-shell :: SymbolFile/DWARF/parallel-indexing-stress.s (1119 of 2137)
PASS: lldb-shell :: SymbolFile/DWARF/find-basic-variable.cpp (1120 of 2137)
PASS: lldb-unit :: Utility/./UtilityTests/ArgsTest.TestQuotedUnknownEscape (1121 of 2137)
PASS: lldb-api :: lang/objc/modules-hash-mismatch/TestClangModulesHashMismatch.py (1122 of 2137)
UNSUPPORTED: lldb-api :: benchmarks/frame_variable/TestFrameVariableResponse.py (1123 of 2137)
PASS: lldb-unit :: Utility/./UtilityTests/StreamTest.PutHex32ByteOrderLittle (1124 of 2137)
PASS: lldb-api :: functionalities/inferior-crashing/recursive-inferior/TestRecursiveInferior.py (1125 of 2137)
PASS: lldb-unit :: Process/minidump/./LLDBMinidumpTests/MinidumpParserTest.GetThreadContext_x86_32_wow64 (1126 of 2137)
PASS: lldb-api :: functionalities/data-formatter/data-formatter-objc/TestDataFormatterObjCNSURL.py (1127 of 2137)
PASS: lldb-unit :: Host/./HostTests/NativeProcessProtocolTest.SetBreakpointFailVerify (1128 of 2137)
PASS: lldb-unit :: Symbol/./SymbolTests/SymbolsTest.LocateExecutableSymbolFileForUnknownExecutableAndMissingSymbolFile (1129 of 2137)
PASS: lldb-shell :: Commands/command-backtrace.test (1130 of 2137)
PASS: lldb-unit :: Symbol/./SymbolTests/TestClangASTImporter.MetadataPropagationAfterCopying (1131 of 2137)
PASS: lldb-api :: lang/c/tls_globals/TestTlsGlobals.py (1132 of 2137)
PASS: lldb-api :: commands/watchpoints/watchpoint_events/TestWatchpointEvents.py (1133 of 2137)
PASS: lldb-unit :: Utility/./UtilityTests/Flags.IsClear (1134 of 2137)
PASS: lldb-shell :: ObjectFile/ELF/avr-basic-info.yaml (1135 of 2137)
PASS: lldb-unit :: Process/gdb-remote/./ProcessGdbRemoteTests/GDBRemoteCommunicationClientTest.WriteRegister (1136 of 2137)
PASS: lldb-unit :: Utility/./UtilityTests/RangeVector.CombineConsecutiveRanges (1137 of 2137)
PASS: lldb-api :: commands/expression/xvalue/TestXValuePrinting.py (1138 of 2137)
PASS: lldb-unit :: Utility/./UtilityTests/BinaryStreamTest.PutULEB128TwoBytes (1139 of 2137)
PASS: lldb-api :: functionalities/thread/num_threads/TestNumThreads.py (1140 of 2137)
PASS: lldb-api :: lang/objc/variadic_methods/TestVariadicMethods.py (1141 of 2137)
PASS: lldb-unit :: Utility/./UtilityTests/OptionsWithRawTest.ArgsButNoDelimiter (1142 of 2137)
PASS: lldb-shell :: Register/x86-64-read.test (1143 of 2137)
PASS: lldb-unit :: Utility/./UtilityTests/StringListTest.Clear (1144 of 2137)
PASS: lldb-api :: lang/cpp/llvm-style/TestLLVMStyle.py (1145 of 2137)
PASS: lldb-api :: commands/expression/issue_11588/Test11588.py (1146 of 2137)
PASS: lldb-unit :: Host/./HostTests/MainLoopTest.TerminatesImmediately (1147 of 2137)
PASS: lldb-api :: functionalities/data-formatter/stringprinter/TestStringPrinter.py (1148 of 2137)
PASS: lldb-unit :: Utility/./UtilityTests/StringExtractorTest.GetHexU8_Underflow2 (1149 of 2137)
PASS: lldb-unit :: Utility/./UtilityTests/StringListTest.AppendListCStringArrayEmpty (1150 of 2137)
PASS: lldb-api :: lang/objc/objc++/TestObjCXX.py (1151 of 2137)
PASS: lldb-api :: functionalities/object-file/TestImageListMultiArchitecture.py (1152 of 2137)
PASS: lldb-shell :: SymbolFile/DWARF/find-inline-method.s (1153 of 2137)
PASS: lldb-unit :: SymbolFile/NativePDB/./SymbolFileNativePDBTests/PDBFPOProgramToDWARFExpressionTests.UnresolvedRegisterReference (1154 of 2137)
PASS: lldb-shell :: ObjectFile/ELF/build-id-case.yaml (1155 of 2137)
PASS: lldb-api :: lang/cpp/wchar_t/TestCxxWCharT.py (1156 of 2137)
PASS: lldb-api :: commands/expression/ir-interpreter/TestIRInterpreter.py (1157 of 2137)
PASS: lldb-unit :: Process/minidump/./LLDBMinidumpTests/MinidumpParserTest.MinidumpModuleOrder (1158 of 2137)
PASS: lldb-shell :: SymbolFile/DWARF/find-method.cpp (1159 of 2137)
PASS: lldb-unit :: Disassembler/./DisassemblerTests/TestArm64Disassembly.TestArmv81Instruction (1160 of 2137)
PASS: lldb-api :: python_api/watchpoint/TestSetWatchpoint.py (1161 of 2137)
PASS: lldb-unit :: Utility/./UtilityTests/ArgsTest.GetArgumentArrayRef (1162 of 2137)
PASS: lldb-api :: lang/objc/blocks/TestObjCIvarsInBlocks.py (1163 of 2137)
PASS: lldb-api :: functionalities/breakpoint/breakpoint_command/TestBreakpointCommand.py (1164 of 2137)
PASS: lldb-api :: functionalities/breakpoint/comp_dir_symlink/TestCompDirSymLink.py (1165 of 2137)
PASS: lldb-api :: functionalities/thread/concurrent_events/TestConcurrentBreakpointOneDelayBreakpointThreads.py (1166 of 2137)
PASS: lldb-api :: commands/expression/diagnostics/TestExprDiagnostics.py (1167 of 2137)
PASS: lldb-unit :: Host/./HostTests/MainLoopTest.UnmonitoredSignal (1168 of 2137)
PASS: lldb-unit :: Utility/./UtilityTests/StreamTeeTest.AppendStream (1169 of 2137)
PASS: lldb-api :: lang/cpp/member-and-local-vars-with-same-name/TestMembersAndLocalsWithSameName.py (1170 of 2137)
PASS: lldb-unit :: Language/Highlighting/./HighlighterTests/HighlighterTest.ClangOperators (1171 of 2137)
PASS: lldb-api :: commands/watchpoints/watchpoint_commands/command/TestWatchpointCommandPython.py (1172 of 2137)
PASS: lldb-api :: lang/c/shared_lib/TestSharedLib.py (1173 of 2137)
PASS: lldb-api :: functionalities/data-formatter/data-formatter-caching/TestDataFormatterCaching.py (1174 of 2137)
PASS: lldb-api :: lang/objc/self/TestObjCSelf.py (1175 of 2137)
PASS: lldb-unit :: Utility/./UtilityTests/RangeTest.EqualInvalid (1176 of 2137)
PASS: lldb-unit :: Process/minidump/./LLDBMinidumpTests/MinidumpParserTest.MinidumpDuplicateModuleMappedFirst (1177 of 2137)
PASS: lldb-unit :: Utility/./UtilityTests/StatusTest.ErrorConversion (1178 of 2137)
PASS: lldb-unit :: Process/minidump/./LLDBMinidumpTests/MinidumpParserTest.MinidumpDuplicateModuleMappedSecond (1179 of 2137)
PASS: lldb-unit :: Utility/./UtilityTests/TimerTest.CategoryTimesStats (1180 of 2137)
PASS: lldb-shell :: SymbolFile/DWARF/debug-line-basic.s (1181 of 2137)
PASS: lldb-unit :: SymbolFile/DWARF/./SymbolFileDWARFTests/SymbolFileDWARFTests.TestAbbrevNullAttrValidForm (1182 of 2137)
PASS: lldb-shell :: SymbolFile/DWARF/debug-types-line-tables.s (1183 of 2137)
PASS: lldb-shell :: SymbolFile/DWARF/split-dwarf-inlining.cpp (1184 of 2137)
PASS: lldb-unit :: Utility/./UtilityTests/StreamTest.AddressEmptyPrefix (1185 of 2137)
PASS: lldb-unit :: UnwindAssembly/x86/./UnwindAssemblyx86Tests/Testx86AssemblyInspectionEngine.TestPushRBPWithREX (1186 of 2137)
PASS: lldb-unit :: ObjectFile/MachO/./ObjectFileMachOTests/ObjectFileMachOTest.ModuleFromSharedCacheInfo (1187 of 2137)
PASS: lldb-unit :: Signals/./SignalsTests/UnixSignalsTest.GetInfo (1188 of 2137)
PASS: lldb-unit :: Utility/./UtilityTests/AnsiTerminal.AtStart (1189 of 2137)
PASS: lldb-api :: commands/expression/rdar44436068/Test128BitsInteger.py (1190 of 2137)
PASS: lldb-api :: commands/expression/result_numbering/TestResultNumbering.py (1191 of 2137)
PASS: lldb-api :: commands/watchpoints/hello_watchpoint/TestMyFirstWatchpoint.py (1192 of 2137)
PASS: lldb-api :: functionalities/plugins/python_os_plugin/stepping_plugin_threads/TestOSPluginStepping.py (1193 of 2137)
PASS: lldb-shell :: ObjectFile/PECOFF/export-dllfunc.yaml (1194 of 2137)
PASS: lldb-api :: api/multithreaded/TestMultithreaded.py (1195 of 2137)
PASS: lldb-unit :: ScriptInterpreter/Python/./ScriptInterpreterPythonTests/PythonDataObjectsTest.TestGlobalNameResolutionNoDot (1196 of 2137)
PASS: lldb-shell :: Reproducer/TestWorkingDir.test (1197 of 2137)
PASS: lldb-unit :: Utility/./UtilityTests/UserIDResolver.GetGroupName (1198 of 2137)
PASS: lldb-unit :: Process/gdb-remote/./ProcessGdbRemoteTests/GDBRemoteCommunicationServerTest.SendErrorResponse_UnimplementedError (1199 of 2137)
PASS: lldb-shell :: SymbolFile/Breakpad/unwind-via-stack-win-no-memory-info.yaml (1200 of 2137)
PASS: lldb-unit :: Utility/./UtilityTests/RangeDataVector.FindEntryThatContains_Overlap (1201 of 2137)
UNSUPPORTED: lldb-api :: functionalities/darwin_log/source/info/TestDarwinLogSourceInfo.py (1202 of 2137)
PASS: lldb-api :: commands/watchpoints/watchpoint_commands/TestWatchpointCommands.py (1203 of 2137)
PASS: lldb-api :: lang/cpp/namespace/TestNamespaceLookup.py (1204 of 2137)
PASS: lldb-unit :: ScriptInterpreter/Python/./ScriptInterpreterPythonTests/PythonDataObjectsTest.TestDictionaryResolutionWithDot (1205 of 2137)
PASS: lldb-shell :: Commands/command-disassemble-process.yaml (1206 of 2137)
PASS: lldb-unit :: Host/./HostTests/SocketTest.DecodeHostAndPort (1207 of 2137)
PASS: lldb-unit :: Host/./HostTests/NativeProcessProtocolTest.ReadCStringFromMemory_MaxSize (1208 of 2137)
PASS: lldb-unit :: Utility/./UtilityTests/StringListTest.LongestCommonPrefixNoPrefix (1209 of 2137)
PASS: lldb-unit :: Utility/./UtilityTests/StreamTest.AddressRangeInvalidRange (1210 of 2137)
PASS: lldb-api :: commands/watchpoints/step_over_watchpoint/TestStepOverWatchpoint.py (1211 of 2137)
PASS: lldb-unit :: Signals/./SignalsTests/UnixSignalsTest.Iteration (1212 of 2137)
PASS: lldb-unit :: Instruction/./EmulatorTests/TestAArch64Emulator.TestOverflow (1213 of 2137)
PASS: lldb-shell :: ObjectFile/ELF/PT_LOAD-empty.yaml (1214 of 2137)
PASS: lldb-unit :: API/./APITests/SBCommandInterpreterTest.MultiWordCommand (1215 of 2137)
PASS: lldb-unit :: Utility/./UtilityTests/SerializationRountripTest.SerializeDeserializeObjectReference (1216 of 2137)
PASS: lldb-unit :: Utility/./UtilityTests/StringListTest.SplitIntoLinesEmpty (1217 of 2137)
UNSUPPORTED: lldb-api :: functionalities/darwin_log/filter/regex/category/TestDarwinLogFilterRegexCategory.py (1218 of 2137)
UNSUPPORTED: lldb-api :: functionalities/thread/state/TestThreadStates.py (1219 of 2137)
PASS: lldb-unit :: Process/minidump/./LLDBMinidumpTests/MinidumpParserTest.GetMemoryRegionInfo (1220 of 2137)
PASS: lldb-unit :: Utility/./UtilityTests/UriParserTest.TypicalPortPathIPv6 (1221 of 2137)
PASS: lldb-unit :: Utility/./UtilityTests/StringListTest.ShiftMove (1222 of 2137)
PASS: lldb-unit :: Language/Highlighting/./HighlighterTests/HighlighterTest.ClangCommas (1223 of 2137)
PASS: lldb-unit :: Language/Highlighting/./HighlighterTests/HighlighterTest.DefaultHighlighterWithCursorOutOfBounds (1224 of 2137)
PASS: lldb-shell :: ObjectFile/ELF/section-addresses.yaml (1225 of 2137)
PASS: lldb-api :: lang/objc/rdar-11355592/TestRdar11355592.py (1226 of 2137)
PASS: lldb-api :: commands/expression/top-level/TestTopLevelExprs.py (1227 of 2137)
PASS: lldb-shell :: SymbolFile/NativePDB/s_constant.cpp (1228 of 2137)
PASS: lldb-api :: functionalities/data-formatter/data-formatter-stl/libstdcpp/unique_ptr/invalid/TestDataFormatterInvalidStdUniquePtr.py (1229 of 2137)
UNSUPPORTED: lldb-api :: commands/expression/call-restarts/TestCallThatRestarts.py (1230 of 2137)
PASS: lldb-unit :: Language/Highlighting/./HighlighterTests/HighlighterTest.ClangEmptyInput (1231 of 2137)
PASS: lldb-unit :: Process/gdb-remote/./ProcessGdbRemoteTests/GDBRemoteCommunicationClientTest.SendStopTracePacket (1232 of 2137)
PASS: lldb-api :: commands/expression/radar_8638051/Test8638051.py (1233 of 2137)
PASS: lldb-unit :: UnwindAssembly/x86/./UnwindAssemblyx86Tests/Testx86AssemblyInspectionEngine.TestAddRSP (1234 of 2137)
PASS: lldb-api :: commands/expression/import-std-module/unique_ptr/TestUniquePtrFromStdModule.py (1235 of 2137)
UNSUPPORTED: lldb-shell :: Process/Windows/exception_access_violation.cpp (1236 of 2137)
PASS: lldb-unit :: Utility/./UtilityTests/StreamTest.PutBytesAsRawHex8ToMixedEndian (1237 of 2137)
PASS: lldb-api :: commands/expression/cast_int_to_anonymous_enum/TestCastIntToAnonymousEnum.py (1238 of 2137)
PASS: lldb-unit :: Symbol/./SymbolTests/TestTypeSystemClang.TestGetTypeClassNested (1239 of 2137)
PASS: lldb-unit :: Utility/./UtilityTests/StreamTest.AddressPrefix (1240 of 2137)
PASS: lldb-api :: functionalities/tsan/global_location/TestTsanGlobalLocation.py (1241 of 2137)
UNSUPPORTED: lldb-shell :: Register/aarch64-fp-read.test (1242 of 2137)
PASS: lldb-unit :: Utility/./UtilityTests/StreamTest.PutULEB128 (1243 of 2137)
PASS: lldb-api :: functionalities/data-formatter/data-formatter-python-synth/TestDataFormatterPythonSynth.py (1244 of 2137)
PASS: lldb-api :: functionalities/rerun/TestRerun.py (1245 of 2137)
PASS: lldb-api :: types/TestIntegerType.py (1246 of 2137)
PASS: lldb-unit :: Utility/./UtilityTests/StringListTest.LongestCommonPrefixEmpty (1247 of 2137)
PASS: lldb-unit :: Utility/./UtilityTests/PassiveReplayTest.InstrumentedFoo (1248 of 2137)
PASS: lldb-unit :: Process/gdb-remote/./ProcessGdbRemoteTests/GDBRemoteCommunicationTest.ReadPacket_checksum (1249 of 2137)
PASS: lldb-api :: commands/expression/import-std-module/shared_ptr/TestSharedPtrFromStdModule.py (1250 of 2137)
PASS: lldb-unit :: Utility/./UtilityTests/XcodeSDKTest.SDKSupportsModules (1251 of 2137)
PASS: lldb-shell :: SymbolFile/DWARF/childless-compile-unit.s (1252 of 2137)
PASS: lldb-api :: python_api/sbvalue_const_addrof/TestSBValueConstAddrOf.py (1253 of 2137)
PASS: lldb-unit :: Utility/./UtilityTests/CompletionRequest.TestCompletionOwnership (1254 of 2137)
PASS: lldb-api :: lang/objc/modules-compile-error/TestModulesCompileError.py (1255 of 2137)
PASS: lldb-shell :: Driver/LocalLLDBInit.test (1256 of 2137)
PASS: lldb-unit :: Utility/./UtilityTests/FileSpecTest.FormatFileSpec (1257 of 2137)
PASS: lldb-unit :: Utility/./UtilityTests/StringExtractorTest.GetHexBytes_Partial (1258 of 2137)
PASS: lldb-shell :: SymbolFile/Breakpad/line-table-mixed-path-styles.test (1259 of 2137)
UNSUPPORTED: lldb-shell :: SymbolFile/PDB/function-level-linking.test (1260 of 2137)
PASS: lldb-api :: python_api/type/TestTypeList.py (1261 of 2137)
PASS: lldb-api :: commands/process/attach-resume/TestAttachResume.py (1262 of 2137)
PASS: lldb-shell :: Driver/TestProcessAttach.test (1263 of 2137)
PASS: lldb-api :: functionalities/optimized_code/TestNoASanExceptionAfterEvalOP_piece.py (1264 of 2137)
PASS: lldb-api :: python_api/process/TestProcessAPI.py (1265 of 2137)
PASS: lldb-unit :: Platform/./LLDBPlatformTests/PlatformDarwinTest.FindComponentInPath (1266 of 2137)
PASS: lldb-unit :: UnwindAssembly/x86/./UnwindAssemblyx86Tests/Testx86AssemblyInspectionEngine.TestMovRSPtoRBP (1267 of 2137)
PASS: lldb-unit :: Utility/./UtilityTests/UriParserTest.BracketedHostname (1268 of 2137)
PASS: lldb-unit :: UnwindAssembly/x86/./UnwindAssemblyx86Tests/Testx86AssemblyInspectionEngine.TestPushRBP (1269 of 2137)
PASS: lldb-shell :: ObjectFile/ELF/duplicate-section.yaml (1270 of 2137)
PASS: lldb-api :: functionalities/data-formatter/data-formatter-stl/libcxx/queue/TestDataFormatterLibcxxQueue.py (1271 of 2137)
UNSUPPORTED: lldb-api :: arm/breakpoint-thumb-codesection/TestBreakpointThumbCodesection.py (1272 of 2137)
PASS: lldb-api :: commands/expression/import-std-module/vector-of-vectors/TestVectorOfVectorsFromStdModule.py (1273 of 2137)
PASS: lldb-api :: lang/cpp/global_variables/TestCPPGlobalVariables.py (1274 of 2137)
PASS: lldb-unit :: Utility/./UtilityTests/StreamTest.PutChar (1275 of 2137)
PASS: lldb-unit :: Utility/./UtilityTests/OptionsWithRawTest.EmptySuffix (1276 of 2137)
PASS: lldb-api :: functionalities/thread/concurrent_events/TestConcurrentTwoWatchpointsOneSignal.py (1277 of 2137)
PASS: lldb-unit :: Host/./HostTests/FileSystemTest.MakeAbsolute (1278 of 2137)
PASS: lldb-unit :: Utility/./UtilityTests/FileSpecTest.IsRelative (1279 of 2137)
PASS: lldb-unit :: Breakpoint/./LLDBBreakpointTests/BreakpointIDTest.StringIsBreakpointName (1280 of 2137)
PASS: lldb-unit :: UnwindAssembly/x86/./UnwindAssemblyx86Tests/Testx86AssemblyInspectionEngine.TestPushEDI (1281 of 2137)
PASS: lldb-api :: commands/expression/import-std-module/sysroot/TestStdModuleSysroot.py (1282 of 2137)
PASS: lldb-unit :: Expression/./ExpressionTests/DWARFExpression.DW_OP_convert (1283 of 2137)
UNSUPPORTED: lldb-shell :: BuildScript/toolchain-clang-cl.test (1284 of 2137)
PASS: lldb-unit :: Utility/./UtilityTests/ProcessInstanceInfo.Yaml (1285 of 2137)
PASS: lldb-shell :: Minidump/Windows/find-module.test (1286 of 2137)
PASS: lldb-api :: python_api/sbenvironment/TestSBEnvironment.py (1287 of 2137)
PASS: lldb-unit :: Process/minidump/./LLDBMinidumpTests/MinidumpParserTest.GetArchitecture (1288 of 2137)
PASS: lldb-shell :: SymbolFile/NativePDB/function-types-classes.cpp (1289 of 2137)
TIMEOUT: lldb-api :: macosx/simulator/TestSimulatorPlatform.py (1290 of 2137)
******************** TEST 'lldb-api :: macosx/simulator/TestSimulatorPlatform.py' FAILED ********************
Script:
--
/usr/local/Frameworks/Python.framework/Versions/3.7/bin/python3.7 /Users/buildslave/jenkins/workspace/lldb-cmake/llvm-project/lldb/test/API/dotest.py -s /Users/buildslave/jenkins/workspace/lldb-cmake/lldb-build/lldb-test-traces -S nm -u CXXFLAGS -u CFLAGS --codesign-identity - --server /Users/buildslave/jenkins/workspace/lldb-cmake/lldb-build/./bin/debugserver --arch x86_64 --build-dir /Users/buildslave/jenkins/workspace/lldb-cmake/lldb-build/lldb-test-build.noindex -s=/Users/buildslave/jenkins/workspace/lldb-cmake/test/logs -t --env TERM=vt100 --env LLVM_LIBS_DIR=/Users/buildslave/jenkins/workspace/lldb-cmake/lldb-build/./lib --arch x86_64 --build-dir /Users/buildslave/jenkins/workspace/lldb-cmake/lldb-build/lldb-test-build.noindex --lldb-module-cache-dir /Users/buildslave/jenkins/workspace/lldb-cmake/lldb-build/lldb-test-build.noindex/module-cache-lldb/lldb-api --clang-module-cache-dir /Users/buildslave/jenkins/workspace/lldb-cmake/lldb-build/lldb-test-build.noindex/module-cache-clang/lldb-api --executable /Users/buildslave/jenkins/workspace/lldb-cmake/lldb-build/./bin/lldb --compiler /Users/buildslave/jenkins/workspace/lldb-cmake/lldb-build/./bin/clang --dsymutil /Users/buildslave/jenkins/workspace/lldb-cmake/lldb-build/./bin/dsymutil --filecheck /Users/buildslave/jenkins/workspace/lldb-cmake/lldb-build/./bin/FileCheck --yaml2obj /Users/buildslave/jenkins/workspace/lldb-cmake/lldb-build/./bin/yaml2obj --lldb-libs-dir /Users/buildslave/jenkins/workspace/lldb-cmake/lldb-build/./lib /Users/buildslave/jenkins/workspace/lldb-cmake/llvm-project/lldb/test/API/macosx/simulator -p TestSimulatorPlatform.py
--
Exit Code: -9
Timeout: Reached timeout of 600 seconds

Hide Details

Command Output (stdout): -- lldb version 12.0.99 clang revision bef38e86b4e702a0c42e243d323fb7c09875e649 llvm revision bef38e86b4e702a0c42e243d323fb7c09875e649

Hide Details

-- Command Output (stderr): --

Hide Details

Session logs for test failures/errors/unexpected successes will go into directory '/Users/buildslave/jenkins/workspace/lldb-cmake/test/logs' Change dir to: /Users/buildslave/jenkins/workspace/lldb-cmake/llvm-project/lldb/test/API/macosx/simulator runCmd: settings clear -all output:

Hide Details

runCmd: settings set symbols.enable-external-lookup false output:

Hide Details

runCmd: settings set target.inherit-tcc true output:

Hide Details

runCmd: settings set target.auto-apply-fixits false output:

Hide Details

runCmd: settings set plugin.process.gdb-remote.packet-timeout 60 output:

Hide Details

runCmd: settings set symbols.clang-modules-cache-path "/Users/buildslave/jenkins/workspace/lldb-cmake/lldb-build/lldb-test-build.noindex/module-cache-lldb/lldb-api" output:

Hide Details

runCmd: settings set use-color false output:

Hide Details

runCmd: setting set target.prefer-dynamic-value no-dynamic-values output:

Hide Details

runCmd: log enable gdb-remote packets -f /Users/buildslave/jenkins/workspace/lldb-cmake/lldb-build/lldb-test-build.noindex/macosx/simulator/TestSimulatorPlatform.test_ios/packets.log output:

Hide Details

Ran command: "log enable gdb-remote packets -f /Users/buildslave/jenkins/workspace/lldb-cmake/lldb-build/lldb-test-build.noindex/macosx/simulator/TestSimulatorPlatform.test_ios/packets.log"

Hide Details

Got output:

Hide Details

Hide Details

runCmd: image list -b -t output: [ 0] a.out x86_64-apple-ios13.5.0-simulator [ 1] dyld x86_64-apple-macosx10.15.0 [ 2] dyld_sim x86_64-apple-ios13.5.0-simulator [ 3] libc++.1.dylib x86_64-apple-ios13.5.0-simulator [ 4] libSystem.B.dylib x86_64-apple-ios13.5.0-simulator [ 5] libc++abi.dylib x86_64-apple-ios13.5.0-simulator [ 6] libcache.dylib x86_64-apple-ios13.5.0-simulator [ 7] libcommonCrypto.dylib x86_64-apple-ios13.5.0-simulator [ 8] libcompiler_rt.dylib x86_64-apple-ios13.5.0-simulator [ 9] libcopyfile.dylib x86_64-apple-ios13.5.0-simulator [ 10] libcorecrypto.dylib x86_64-apple-ios13.5.0-simulator [ 11] libdispatch.dylib x86_64-apple-ios13.5.0-simulator [ 12] libdyld.dylib x86_64-apple-ios13.5.0-simulator [ 13] liblaunch.dylib x86_64-apple-ios13.5.0-simulator [ 14] libmacho.dylib x86_64-apple-ios13.5.0-simulator [ 15] libremovefile.dylib x86_64-apple-ios13.5.0-simulator [ 16] libsystem_asl.dylib x86_64-apple-ios13.5.0-simulator [ 17] libsystem_blocks.dylib x86_64-apple-ios13.5.0-simulator [ 18] libsystem_c.dylib x86_64-apple-ios13.5.0-simulator [ 19] libsystem_configuration.dylib x86_64-apple-ios13.5.0-simulator [ 20] libsystem_containermanager.dylib x86_64-apple-ios13.5.0-simulator [ 21] libsystem_coreservices.dylib x86_64-apple-ios13.5.0-simulator [ 22] libsystem_darwin.dylib x86_64-apple-ios13.5.0-simulator [ 23] libsystem_dnssd.dylib x86_64-apple-ios13.5.0-simulator [ 24] libsystem_featureflags.dylib x86_64-apple-ios13.5.0-simulator [ 25] libsystem_info.dylib x86_64-apple-ios13.5.0-simulator [ 26] libsystem_m.dylib x86_64-apple-ios13.5.0-simulator [ 27] libsystem_malloc.dylib x86_64-apple-ios13.5.0-simulator [ 28] libsystem_notify.dylib x86_64-apple-ios13.5.0-simulator [ 29] libsystem_sandbox.dylib x86_64-apple-ios13.5.0-simulator [ 30] libsystem_sim_kernel.dylib x86_64-apple-ios13.5.0-simulator [ 31] libsystem_sim_platform.dylib x86_64-apple-ios13.5.0-simulator [ 32] libsystem_sim_pthread.dylib x86_64-apple-ios13.5.0-simulator [ 33] libsystem_trace.dylib x86_64-apple-ios13.5.0-simulator [ 34] libunwind.dylib x86_64-apple-ios13.5.0-simulator [ 35] libxpc.dylib x86_64-apple-ios13.5.0-simulator [ 36] libsystem_sim_pthread_host.dylib x86_64-apple-ios13.5.0-simulator [ 37] libsystem_sim_platform_host.dylib x86_64-apple-ios13.5.0-simulator [ 38] libsystem_sim_kernel_host.dylib x86_64-apple-ios13.5.0-simulator [ 39] libsystem_kernel.dylib x86_64-apple-macosx10.15.0-simulator(0x00007fff51b5a000) [ 40] libobjc.A.dylib x86_64-apple-ios13.5.0-simulator [ 41] libsystem_platform.dylib x86_64-apple-macosx10.15.0-simulator(0x00007fff51bfd000) [ 42] libsystem_pthread.dylib x86_64-apple-macosx10.15.0-simulator(0x00007fff51c06000)

Hide Details

Hide Details

Ran command: "image list -b -t"

Hide Details

Got output: [ 0] a.out x86_64-apple-ios13.5.0-simulator [ 1] dyld x86_64-apple-macosx10.15.0 [ 2] dyld_sim x86_64-apple-ios13.5.0-simulator [ 3] libc++.1.dylib x86_64-apple-ios13.5.0-simulator [ 4] libSystem.B.dylib x86_64-apple-ios13.5.0-simulator [ 5] libc++abi.dylib x86_64-apple-ios13.5.0-simulator [ 6] libcache.dylib x86_64-apple-ios13.5.0-simulator [ 7] libcommonCrypto.dylib x86_64-apple-ios13.5.0-simulator [ 8] libcompiler_rt.dylib x86_64-apple-ios13.5.0-simulator [ 9] libcopyfile.dylib x86_64-apple-ios13.5.0-simulator [ 10] libcorecrypto.dylib x86_64-apple-ios13.5.0-simulator [ 11] libdispatch.dylib x86_64-apple-ios13.5.0-simulator [ 12] libdyld.dylib x86_64-apple-ios13.5.0-simulator [ 13] liblaunch.dylib x86_64-apple-ios13.5.0-simulator [ 14] libmacho.dylib x86_64-apple-ios13.5.0-simulator [ 15] libremovefile.dylib x86_64-apple-ios13.5.0-simulator [ 16] libsystem_asl.dylib x86_64-apple-ios13.5.0-simulator [ 17] libsystem_blocks.dylib x86_64-apple-ios13.5.0-simulator [ 18] libsystem_c.dylib x86_64-apple-ios13.5.0-simulator [ 19] libsystem_configuration.dylib x86_64-apple-ios13.5.0-simulator [ 20] libsystem_containermanager.dylib x86_64-apple-ios13.5.0-simulator [ 21] libsystem_coreservices.dylib x86_64-apple-ios13.5.0-simulator [ 22] libsystem_darwin.dylib x86_64-apple-ios13.5.0-simulator [ 23] libsystem_dnssd.dylib x86_64-apple-ios13.5.0-simulator [ 24] libsystem_featureflags.dylib x86_64-apple-ios13.5.0-simulator [ 25] libsystem_info.dylib x86_64-apple-ios13.5.0-simulator [ 26] libsystem_m.dylib x86_64-apple-ios13.5.0-simulator [ 27] libsystem_malloc.dylib x86_64-apple-ios13.5.0-simulator [ 28] libsystem_notify.dylib x86_64-apple-ios13.5.0-simulator [ 29] libsystem_sandbox.dylib x86_64-apple-ios13.5.0-simulator [ 30] libsystem_sim_kernel.dylib x86_64-apple-ios13.5.0-simulator [ 31] libsystem_sim_platform.dylib x86_64-apple-ios13.5.0-simulator [ 32] libsystem_sim_pthread.dylib x86_64-apple-ios13.5.0-simulator [ 33] libsystem_trace.dylib x86_64-apple-ios13.5.0-simulator [ 34] libunwind.dylib x86_64-apple-ios13.5.0-simulator [ 35] libxpc.dylib x86_64-apple-ios13.5.0-simulator [ 36] libsystem_sim_pthread_host.dylib x86_64-apple-ios13.5.0-simulator [ 37] libsystem_sim_platform_host.dylib x86_64-apple-ios13.5.0-simulator [ 38] libsystem_sim_kernel_host.dylib x86_64-apple-ios13.5.0-simulator [ 39] libsystem_kernel.dylib x86_64-apple-macosx10.15.0-simulator(0x00007fff51b5a000) [ 40] libobjc.A.dylib x86_64-apple-ios13.5.0-simulator [ 41] libsystem_platform.dylib x86_64-apple-macosx10.15.0-simulator(0x00007fff51bfd000) [ 42] libsystem_pthread.dylib x86_64-apple-macosx10.15.0-simulator(0x00007fff51c06000)

Hide Details

Expecting regex pattern: "a\.out x86_64-apple-ios13.5.*-simulator" (was found, matched "a.out x86_64-apple-ios13.5.0-simulator")

Hide Details

<bound method SBProcess.Kill of <lldb.SBProcess; proxy of <Swig Object of type 'lldb::SBProcess *' at 0x108101f60> >>: success

Hide Details

PASS: LLDB (/Users/buildslave/jenkins/workspace/lldb-cmake/lldb-build/bin/clang-x86_64) :: test_ios (TestSimulatorPlatform.TestSimulatorPlatformLaunching) runCmd: settings clear -all output:

Hide Details

runCmd: settings set symbols.enable-external-lookup false output:

Hide Details

runCmd: settings set target.inherit-tcc true output:

Hide Details

runCmd: settings set target.auto-apply-fixits false output:

Hide Details

runCmd: settings set plugin.process.gdb-remote.packet-timeout 60 output:

Hide Details

runCmd: settings set symbols.clang-modules-cache-path "/Users/buildslave/jenkins/workspace/lldb-cmake/lldb-build/lldb-test-build.noindex/module-cache-lldb/lldb-api" output:

Hide Details

runCmd: settings set use-color false output:

Hide Details

runCmd: setting set target.prefer-dynamic-value no-dynamic-values output:

Hide Details

UNSUPPORTED: LLDB (/Users/buildslave/jenkins/workspace/lldb-cmake/lldb-build/bin/clang-x86_64) :: test_ios_backdeploy_apple_silicon (TestSimulatorPlatform.TestSimulatorPlatformLaunching) (skipping due to the following parameter(s): architecture) runCmd: settings clear -all output:

Hide Details

runCmd: settings set symbols.enable-external-lookup false output:

Hide Details

runCmd: settings set target.inherit-tcc true output:

Hide Details

runCmd: settings set target.auto-apply-fixits false output:

Hide Details

runCmd: settings set plugin.process.gdb-remote.packet-timeout 60 output:

Hide Details

runCmd: settings set symbols.clang-modules-cache-path "/Users/buildslave/jenkins/workspace/lldb-cmake/lldb-build/lldb-test-build.noindex/module-cache-lldb/lldb-api" output:

Hide Details

runCmd: settings set use-color false output:

Hide Details

runCmd: setting set target.prefer-dynamic-value no-dynamic-values output:

Hide Details

runCmd: log enable gdb-remote packets -f /Users/buildslave/jenkins/workspace/lldb-cmake/lldb-build/lldb-test-build.noindex/macosx/simulator/TestSimulatorPlatform.test_ios_backdeploy_x86/packets.log output:

Hide Details

Ran command: "log enable gdb-remote packets -f /Users/buildslave/jenkins/workspace/lldb-cmake/lldb-build/lldb-test-build.noindex/macosx/simulator/TestSimulatorPlatform.test_ios_backdeploy_x86/packets.log"

Hide Details

Got output:

Hide Details

Hide Details

runCmd: image list -b -t output: [ 0] a.out x86_64-apple-ios13.0.0-simulator [ 1] dyld x86_64-apple-macosx10.15.0 [ 2] dyld_sim x86_64-apple-ios13.5.0-simulator [ 3] libc++.1.dylib x86_64-apple-ios13.5.0-simulator [ 4] libSystem.B.dylib x86_64-apple-ios13.5.0-simulator [ 5] libc++abi.dylib x86_64-apple-ios13.5.0-simulator [ 6] libcache.dylib x86_64-apple-ios13.5.0-simulator [ 7] libcommonCrypto.dylib x86_64-apple-ios13.5.0-simulator [ 8] libcompiler_rt.dylib x86_64-apple-ios13.5.0-simulator [ 9] libcopyfile.dylib x86_64-apple-ios13.5.0-simulator [ 10] libcorecrypto.dylib x86_64-apple-ios13.5.0-simulator [ 11] libdispatch.dylib x86_64-apple-ios13.5.0-simulator [ 12] libdyld.dylib x86_64-apple-ios13.5.0-simulator [ 13] liblaunch.dylib x86_64-apple-ios13.5.0-simulator [ 14] libmacho.dylib x86_64-apple-ios13.5.0-simulator [ 15] libremovefile.dylib x86_64-apple-ios13.5.0-simulator [ 16] libsystem_asl.dylib x86_64-apple-ios13.5.0-simulator [ 17] libsystem_blocks.dylib x86_64-apple-ios13.5.0-simulator [ 18] libsystem_c.dylib x86_64-apple-ios13.5.0-simulator [ 19] libsystem_configuration.dylib x86_64-apple-ios13.5.0-simulator [ 20] libsystem_containermanager.dylib x86_64-apple-ios13.5.0-simulator [ 21] libsystem_coreservices.dylib x86_64-apple-ios13.5.0-simulator [ 22] libsystem_darwin.dylib x86_64-apple-ios13.5.0-simulator [ 23] libsystem_dnssd.dylib x86_64-apple-ios13.5.0-simulator [ 24] libsystem_featureflags.dylib x86_64-apple-ios13.5.0-simulator [ 25] libsystem_info.dylib x86_64-apple-ios13.5.0-simulator [ 26] libsystem_m.dylib x86_64-apple-ios13.5.0-simulator [ 27] libsystem_malloc.dylib x86_64-apple-ios13.5.0-simulator [ 28] libsystem_notify.dylib x86_64-apple-ios13.5.0-simulator [ 29] libsystem_sandbox.dylib x86_64-apple-ios13.5.0-simulator [ 30] libsystem_sim_kernel.dylib x86_64-apple-ios13.5.0-simulator [ 31] libsystem_sim_platform.dylib x86_64-apple-ios13.5.0-simulator [ 32] libsystem_sim_pthread.dylib x86_64-apple-ios13.5.0-simulator [ 33] libsystem_trace.dylib x86_64-apple-ios13.5.0-simulator [ 34] libunwind.dylib x86_64-apple-ios13.5.0-simulator [ 35] libxpc.dylib x86_64-apple-ios13.5.0-simulator [ 36] libsystem_sim_pthread_host.dylib x86_64-apple-ios13.5.0-simulator [ 37] libsystem_sim_platform_host.dylib x86_64-apple-ios13.5.0-simulator [ 38] libsystem_sim_kernel_host.dylib x86_64-apple-ios13.5.0-simulator [ 39] libsystem_kernel.dylib x86_64-apple-macosx10.15.0-simulator(0x00007fff51b5a000) [ 40] libobjc.A.dylib x86_64-apple-ios13.5.0-simulator [ 41] libsystem_platform.dylib x86_64-apple-macosx10.15.0-simulator(0x00007fff51bfd000) [ 42] libsystem_pthread.dylib x86_64-apple-macosx10.15.0-simulator(0x00007fff51c06000)

Hide Details

Hide Details

Ran command: "image list -b -t"

Hide Details

Got output: [ 0] a.out x86_64-apple-ios13.0.0-simulator [ 1] dyld x86_64-apple-macosx10.15.0 [ 2] dyld_sim x86_64-apple-ios13.5.0-simulator [ 3] libc++.1.dylib x86_64-apple-ios13.5.0-simulator [ 4] libSystem.B.dylib x86_64-apple-ios13.5.0-simulator [ 5] libc++abi.dylib x86_64-apple-ios13.5.0-simulator [ 6] libcache.dylib x86_64-apple-ios13.5.0-simulator [ 7] libcommonCrypto.dylib x86_64-apple-ios13.5.0-simulator [ 8] libcompiler_rt.dylib x86_64-apple-ios13.5.0-simulator [ 9] libcopyfile.dylib x86_64-apple-ios13.5.0-simulator [ 10] libcorecrypto.dylib x86_64-apple-ios13.5.0-simulator [ 11] libdispatch.dylib x86_64-apple-ios13.5.0-simulator [ 12] libdyld.dylib x86_64-apple-ios13.5.0-simulator [ 13] liblaunch.dylib x86_64-apple-ios13.5.0-simulator [ 14] libmacho.dylib x86_64-apple-ios13.5.0-simulator [ 15] libremovefile.dylib x86_64-apple-ios13.5.0-simulator [ 16] libsystem_asl.dylib x86_64-apple-ios13.5.0-simulator [ 17] libsystem_blocks.dylib x86_64-apple-ios13.5.0-simulator [ 18] libsystem_c.dylib x86_64-apple-ios13.5.0-simulator [ 19] libsystem_configuration.dylib x86_64-apple-ios13.5.0-simulator [ 20] libsystem_containermanager.dylib x86_64-apple-ios13.5.0-simulator [ 21] libsystem_coreservices.dylib x86_64-apple-ios13.5.0-simulator [ 22] libsystem_darwin.dylib x86_64-apple-ios13.5.0-simulator [ 23] libsystem_dnssd.dylib x86_64-apple-ios13.5.0-simulator [ 24] libsystem_featureflags.dylib x86_64-apple-ios13.5.0-simulator [ 25] libsystem_info.dylib x86_64-apple-ios13.5.0-simulator [ 26] libsystem_m.dylib x86_64-apple-ios13.5.0-simulator [ 27] libsystem_malloc.dylib x86_64-apple-ios13.5.0-simulator [ 28] libsystem_notify.dylib x86_64-apple-ios13.5.0-simulator [ 29] libsystem_sandbox.dylib x86_64-apple-ios13.5.0-simulator [ 30] libsystem_sim_kernel.dylib x86_64-apple-ios13.5.0-simulator [ 31] libsystem_sim_platform.dylib x86_64-apple-ios13.5.0-simulator [ 32] libsystem_sim_pthread.dylib x86_64-apple-ios13.5.0-simulator [ 33] libsystem_trace.dylib x86_64-apple-ios13.5.0-simulator [ 34] libunwind.dylib x86_64-apple-ios13.5.0-simulator [ 35] libxpc.dylib x86_64-apple-ios13.5.0-simulator [ 36] libsystem_sim_pthread_host.dylib x86_64-apple-ios13.5.0-simulator [ 37] libsystem_sim_platform_host.dylib x86_64-apple-ios13.5.0-simulator [ 38] libsystem_sim_kernel_host.dylib x86_64-apple-ios13.5.0-simulator [ 39] libsystem_kernel.dylib x86_64-apple-macosx10.15.0-simulator(0x00007fff51b5a000) [ 40] libobjc.A.dylib x86_64-apple-ios13.5.0-simulator [ 41] libsystem_platform.dylib x86_64-apple-macosx10.15.0-simulator(0x00007fff51bfd000) [ 42] libsystem_pthread.dylib x86_64-apple-macosx10.15.0-simulator(0x00007fff51c06000)

Hide Details

Expecting regex pattern: "a\.out x86_64-apple-ios13.0.*-simulator" (was found, matched "a.out x86_64-apple-ios13.0.0-simulator")

Hide Details

<bound method SBProcess.Kill of <lldb.SBProcess; proxy of <Swig Object of type 'lldb::SBProcess *' at 0x108033d50> >>: success

Hide Details

PASS: LLDB (/Users/buildslave/jenkins/workspace/lldb-cmake/lldb-build/bin/clang-x86_64) :: test_ios_backdeploy_x86 (TestSimulatorPlatform.TestSimulatorPlatformLaunching) runCmd: settings clear -all output:

Hide Details

runCmd: settings set symbols.enable-external-lookup false output:

Hide Details

runCmd: settings set target.inherit-tcc true output:

Hide Details

runCmd: settings set target.auto-apply-fixits false output:

Hide Details

runCmd: settings set plugin.process.gdb-remote.packet-timeout 60 output:

Hide Details

runCmd: settings set symbols.clang-modules-cache-path "/Users/buildslave/jenkins/workspace/lldb-cmake/lldb-build/lldb-test-build.noindex/module-cache-lldb/lldb-api" output:

Hide Details

runCmd: settings set use-color false output:

Hide Details

runCmd: setting set target.prefer-dynamic-value no-dynamic-values output:

Hide Details

runCmd: log enable gdb-remote packets -f /Users/buildslave/jenkins/workspace/lldb-cmake/lldb-build/lldb-test-build.noindex/macosx/simulator/TestSimulatorPlatform.test_lc_version_min_iphoneos/packets.log output:

Hide Details

Ran command: "log enable gdb-remote packets -f /Users/buildslave/jenkins/workspace/lldb-cmake/lldb-build/lldb-test-build.noindex/macosx/simulator/TestSimulatorPlatform.test_lc_version_min_iphoneos/packets.log"

Hide Details

Got output:

Hide Details

Hide Details

runCmd: image list -b -t output: [ 0] a.out x86_64-apple-ios11.0.0-simulator [ 1] dyld x86_64-apple-macosx10.15.0 [ 2] dyld_sim x86_64-apple-ios13.5.0-simulator [ 3] libc++.1.dylib x86_64-apple-ios13.5.0-simulator [ 4] libSystem.B.dylib x86_64-apple-ios13.5.0-simulator [ 5] libc++abi.dylib x86_64-apple-ios13.5.0-simulator [ 6] libcache.dylib x86_64-apple-ios13.5.0-simulator [ 7] libcommonCrypto.dylib x86_64-apple-ios13.5.0-simulator [ 8] libcompiler_rt.dylib x86_64-apple-ios13.5.0-simulator [ 9] libcopyfile.dylib x86_64-apple-ios13.5.0-simulator [ 10] libcorecrypto.dylib x86_64-apple-ios13.5.0-simulator [ 11] libdispatch.dylib x86_64-apple-ios13.5.0-simulator [ 12] libdyld.dylib x86_64-apple-ios13.5.0-simulator [ 13] liblaunch.dylib x86_64-apple-ios13.5.0-simulator [ 14] libmacho.dylib x86_64-apple-ios13.5.0-simulator [ 15] libremovefile.dylib x86_64-apple-ios13.5.0-simulator [ 16] libsystem_asl.dylib x86_64-apple-ios13.5.0-simulator [ 17] libsystem_blocks.dylib x86_64-apple-ios13.5.0-simulator [ 18] libsystem_c.dylib x86_64-apple-ios13.5.0-simulator [ 19] libsystem_configuration.dylib x86_64-apple-ios13.5.0-simulator [ 20] libsystem_containermanager.dylib x86_64-apple-ios13.5.0-simulator [ 21] libsystem_coreservices.dylib x86_64-apple-ios13.5.0-simulator [ 22] libsystem_darwin.dylib x86_64-apple-ios13.5.0-simulator [ 23] libsystem_dnssd.dylib x86_64-apple-ios13.5.0-simulator [ 24] libsystem_featureflags.dylib x86_64-apple-ios13.5.0-simulator [ 25] libsystem_info.dylib x86_64-apple-ios13.5.0-simulator [ 26] libsystem_m.dylib x86_64-apple-ios13.5.0-simulator [ 27] libsystem_malloc.dylib x86_64-apple-ios13.5.0-simulator [ 28] libsystem_notify.dylib x86_64-apple-ios13.5.0-simulator [ 29] libsystem_sandbox.dylib x86_64-apple-ios13.5.0-simulator [ 30] libsystem_sim_kernel.dylib x86_64-apple-ios13.5.0-simulator [ 31] libsystem_sim_platform.dylib x86_64-apple-ios13.5.0-simulator [ 32] libsystem_sim_pthread.dylib x86_64-apple-ios13.5.0-simulator [ 33] libsystem_trace.dylib x86_64-apple-ios13.5.0-simulator [ 34] libunwind.dylib x86_64-apple-ios13.5.0-simulator [ 35] libxpc.dylib x86_64-apple-ios13.5.0-simulator [ 36] libsystem_sim_pthread_host.dylib x86_64-apple-ios13.5.0-simulator [ 37] libsystem_sim_platform_host.dylib x86_64-apple-ios13.5.0-simulator [ 38] libsystem_sim_kernel_host.dylib x86_64-apple-ios13.5.0-simulator [ 39] libsystem_kernel.dylib x86_64-apple-macosx10.15.0-simulator(0x00007fff51b5a000) [ 40] libobjc.A.dylib x86_64-apple-ios13.5.0-simulator [ 41] libsystem_platform.dylib x86_64-apple-macosx10.15.0-simulator(0x00007fff51bfd000) [ 42] libsystem_pthread.dylib x86_64-apple-macosx10.15.0-simulator(0x00007fff51c06000)

Hide Details

Hide Details

Ran command: "image list -b -t"

Hide Details

Got output: [ 0] a.out x86_64-apple-ios11.0.0-simulator [ 1] dyld x86_64-apple-macosx10.15.0 [ 2] dyld_sim x86_64-apple-ios13.5.0-simulator [ 3] libc++.1.dylib x86_64-apple-ios13.5.0-simulator [ 4] libSystem.B.dylib x86_64-apple-ios13.5.0-simulator [ 5] libc++abi.dylib x86_64-apple-ios13.5.0-simulator [ 6] libcache.dylib x86_64-apple-ios13.5.0-simulator [ 7] libcommonCrypto.dylib x86_64-apple-ios13.5.0-simulator [ 8] libcompiler_rt.dylib x86_64-apple-ios13.5.0-simulator [ 9] libcopyfile.dylib x86_64-apple-ios13.5.0-simulator [ 10] libcorecrypto.dylib x86_64-apple-ios13.5.0-simulator [ 11] libdispatch.dylib x86_64-apple-ios13.5.0-simulator [ 12] libdyld.dylib x86_64-apple-ios13.5.0-simulator [ 13] liblaunch.dylib x86_64-apple-ios13.5.0-simulator [ 14] libmacho.dylib x86_64-apple-ios13.5.0-simulator [ 15] libremovefile.dylib x86_64-apple-ios13.5.0-simulator [ 16] libsystem_asl.dylib x86_64-apple-ios13.5.0-simulator [ 17] libsystem_blocks.dylib x86_64-apple-ios13.5.0-simulator [ 18] libsystem_c.dylib x86_64-apple-ios13.5.0-simulator [ 19] libsystem_configuration.dylib x86_64-apple-ios13.5.0-simulator [ 20] libsystem_containermanager.dylib x86_64-apple-ios13.5.0-simulator [ 21] libsystem_coreservices.dylib x86_64-apple-ios13.5.0-simulator [ 22] libsystem_darwin.dylib x86_64-apple-ios13.5.0-simulator [ 23] libsystem_dnssd.dylib x86_64-apple-ios13.5.0-simulator [ 24] libsystem_featureflags.dylib x86_64-apple-ios13.5.0-simulator [ 25] libsystem_info.dylib x86_64-apple-ios13.5.0-simulator [ 26] libsystem_m.dylib x86_64-apple-ios13.5.0-simulator [ 27] libsystem_malloc.dylib x86_64-apple-ios13.5.0-simulator [ 28] libsystem_notify.dylib x86_64-apple-ios13.5.0-simulator [ 29] libsystem_sandbox.dylib x86_64-apple-ios13.5.0-simulator [ 30] libsystem_sim_kernel.dylib x86_64-apple-ios13.5.0-simulator [ 31] libsystem_sim_platform.dylib x86_64-apple-ios13.5.0-simulator [ 32] libsystem_sim_pthread.dylib x86_64-apple-ios13.5.0-simulator [ 33] libsystem_trace.dylib x86_64-apple-ios13.5.0-simulator [ 34] libunwind.dylib x86_64-apple-ios13.5.0-simulator [ 35] libxpc.dylib x86_64-apple-ios13.5.0-simulator [ 36] libsystem_sim_pthread_host.dylib x86_64-apple-ios13.5.0-simulator [ 37] libsystem_sim_platform_host.dylib x86_64-apple-ios13.5.0-simulator [ 38] libsystem_sim_kernel_host.dylib x86_64-apple-ios13.5.0-simulator [ 39] libsystem_kernel.dylib x86_64-apple-macosx10.15.0-simulator(0x00007fff51b5a000) [ 40] libobjc.A.dylib x86_64-apple-ios13.5.0-simulator [ 41] libsystem_platform.dylib x86_64-apple-macosx10.15.0-simulator(0x00007fff51bfd000) [ 42] libsystem_pthread.dylib x86_64-apple-macosx10.15.0-simulator(0x00007fff51c06000)

Hide Details

Expecting regex pattern: "a\.out x86_64-apple-ios11.0.*-simulator" (was found, matched "a.out x86_64-apple-ios11.0.0-simulator")

Hide Details

<bound method SBProcess.Kill of <lldb.SBProcess; proxy of <Swig Object of type 'lldb::SBProcess *' at 0x107ebdfc0> >>: success

Hide Details

PASS: LLDB (/Users/buildslave/jenkins/workspace/lldb-cmake/lldb-build/bin/clang-x86_64) :: test_lc_version_min_iphoneos (TestSimulatorPlatform.TestSimulatorPlatformLaunching) runCmd: settings clear -all output:

Hide Details

runCmd: settings set symbols.enable-external-lookup false output:

Hide Details

runCmd: settings set target.inherit-tcc true output:

Hide Details

runCmd: settings set target.auto-apply-fixits false output:

Hide Details

runCmd: settings set plugin.process.gdb-remote.packet-timeout 60 output:

Hide Details

runCmd: settings set symbols.clang-modules-cache-path "/Users/buildslave/jenkins/workspace/lldb-cmake/lldb-build/lldb-test-build.noindex/module-cache-lldb/lldb-api" output:

Hide Details

runCmd: settings set use-color false output:

Hide Details

runCmd: setting set target.prefer-dynamic-value no-dynamic-values output:

Hide Details

runCmd: log enable gdb-remote packets -f /Users/buildslave/jenkins/workspace/lldb-cmake/lldb-build/lldb-test-build.noindex/macosx/simulator/TestSimulatorPlatform.test_lc_version_min_macosx/packets.log output:

Hide Details

Ran command: "log enable gdb-remote packets -f /Users/buildslave/jenkins/workspace/lldb-cmake/lldb-build/lldb-test-build.noindex/macosx/simulator/TestSimulatorPlatform.test_lc_version_min_macosx/packets.log"

Hide Details

Got output:

Hide Details

Hide Details

runCmd: image list -b -t output: [ 0] a.out x86_64-apple-macosx10.9.0 [ 1] dyld x86_64-apple-macosx10.15.0 [ 2] libc++.1.dylib x86_64-apple-macosx10.15.0 [ 3] libSystem.B.dylib x86_64-apple-macosx10.15.0 [ 4] libc++abi.dylib x86_64-apple-macosx10.15.0 [ 5] libcache.dylib x86_64-apple-macosx10.15.0 [ 6] libcommonCrypto.dylib x86_64-apple-macosx10.15.0 [ 7] libcompiler_rt.dylib x86_64-apple-macosx10.15.0 [ 8] libcopyfile.dylib x86_64-apple-macosx10.15.0 [ 9] libcorecrypto.dylib x86_64-apple-macosx10.15.0 [ 10] libdispatch.dylib x86_64-apple-macosx10.15.0 [ 11] libdyld.dylib x86_64-apple-macosx10.15.0 [ 12] libkeymgr.dylib x86_64-apple-macosx10.15.0 [ 13] liblaunch.dylib x86_64-apple-macosx10.15.0 [ 14] libmacho.dylib x86_64-apple-macosx10.15.0 [ 15] libquarantine.dylib x86_64-apple-macosx10.15.0 [ 16] libremovefile.dylib x86_64-apple-macosx10.15.0 [ 17] libsystem_asl.dylib x86_64-apple-macosx10.15.0 [ 18] libsystem_blocks.dylib x86_64-apple-macosx10.15.0 [ 19] libsystem_c.dylib x86_64-apple-macosx10.15.0 [ 20] libsystem_configuration.dylib x86_64-apple-macosx10.15.0 [ 21] libsystem_coreservices.dylib x86_64-apple-macosx10.15.0 [ 22] libsystem_darwin.dylib x86_64-apple-macosx10.15.0 [ 23] libsystem_dnssd.dylib x86_64-apple-macosx10.15.0 [ 24] libsystem_featureflags.dylib x86_64-apple-macosx10.15.0 [ 25] libsystem_info.dylib x86_64-apple-macosx10.15.0 [ 26] libsystem_m.dylib x86_64-apple-macosx10.15.0 [ 27] libsystem_malloc.dylib x86_64-apple-macosx10.15.0 [ 28] libsystem_networkextension.dylib x86_64-apple-macosx10.15.0 [ 29] libsystem_notify.dylib x86_64-apple-macosx10.15.0 [ 30] libsystem_sandbox.dylib x86_64-apple-macosx10.15.0 [ 31] libsystem_secinit.dylib x86_64-apple-macosx10.15.0 [ 32] libsystem_kernel.dylib x86_64-apple-macosx10.15.0 [ 33] libsystem_platform.dylib x86_64-apple-macosx10.15.0 [ 34] libsystem_pthread.dylib x86_64-apple-macosx10.15.0 [ 35] libsystem_symptoms.dylib x86_64-apple-macosx10.15.0 [ 36] libsystem_trace.dylib x86_64-apple-macosx10.15.0 [ 37] libunwind.dylib x86_64-apple-macosx10.15.0 [ 38] libxpc.dylib x86_64-apple-macosx10.15.0 [ 39] libobjc.A.dylib x86_64-apple-macosx10.15.0

Hide Details

Hide Details

Ran command: "image list -b -t"

Hide Details

Got output: [ 0] a.out x86_64-apple-macosx10.9.0 [ 1] dyld x86_64-apple-macosx10.15.0 [ 2] libc++.1.dylib x86_64-apple-macosx10.15.0 [ 3] libSystem.B.dylib x86_64-apple-macosx10.15.0 [ 4] libc++abi.dylib x86_64-apple-macosx10.15.0 [ 5] libcache.dylib x86_64-apple-macosx10.15.0 [ 6] libcommonCrypto.dylib x86_64-apple-macosx10.15.0 [ 7] libcompiler_rt.dylib x86_64-apple-macosx10.15.0 [ 8] libcopyfile.dylib x86_64-apple-macosx10.15.0 [ 9] libcorecrypto.dylib x86_64-apple-macosx10.15.0 [ 10] libdispatch.dylib x86_64-apple-macosx10.15.0 [ 11] libdyld.dylib x86_64-apple-macosx10.15.0 [ 12] libkeymgr.dylib x86_64-apple-macosx10.15.0 [ 13] liblaunch.dylib x86_64-apple-macosx10.15.0 [ 14] libmacho.dylib x86_64-apple-macosx10.15.0 [ 15] libquarantine.dylib x86_64-apple-macosx10.15.0 [ 16] libremovefile.dylib x86_64-apple-macosx10.15.0 [ 17] libsystem_asl.dylib x86_64-apple-macosx10.15.0 [ 18] libsystem_blocks.dylib x86_64-apple-macosx10.15.0 [ 19] libsystem_c.dylib x86_64-apple-macosx10.15.0 [ 20] libsystem_configuration.dylib x86_64-apple-macosx10.15.0 [ 21] libsystem_coreservices.dylib x86_64-apple-macosx10.15.0 [ 22] libsystem_darwin.dylib x86_64-apple-macosx10.15.0 [ 23] libsystem_dnssd.dylib x86_64-apple-macosx10.15.0 [ 24] libsystem_featureflags.dylib x86_64-apple-macosx10.15.0 [ 25] libsystem_info.dylib x86_64-apple-macosx10.15.0 [ 26] libsystem_m.dylib x86_64-apple-macosx10.15.0 [ 27] libsystem_malloc.dylib x86_64-apple-macosx10.15.0 [ 28] libsystem_networkextension.dylib x86_64-apple-macosx10.15.0 [ 29] libsystem_notify.dylib x86_64-apple-macosx10.15.0 [ 30] libsystem_sandbox.dylib x86_64-apple-macosx10.15.0 [ 31] libsystem_secinit.dylib x86_64-apple-macosx10.15.0 [ 32] libsystem_kernel.dylib x86_64-apple-macosx10.15.0 [ 33] libsystem_platform.dylib x86_64-apple-macosx10.15.0 [ 34] libsystem_pthread.dylib x86_64-apple-macosx10.15.0 [ 35] libsystem_symptoms.dylib x86_64-apple-macosx10.15.0 [ 36] libsystem_trace.dylib x86_64-apple-macosx10.15.0 [ 37] libunwind.dylib x86_64-apple-macosx10.15.0 [ 38] libxpc.dylib x86_64-apple-macosx10.15.0 [ 39] libobjc.A.dylib x86_64-apple-macosx10.15.0

Hide Details

Expecting regex pattern: "a\.out x86_64-apple-macosx10.9.*" (was found, matched "a.out x86_64-apple-macosx10.9.0")

Hide Details

--

Hide Details

******************** PASS: lldb-api :: macosx/universal/TestUniversal.py (1291 of 2137) PASS: lldb-unit :: Utility/./UtilityTests/TimerTest.CategoryTimes (1292 of 2137) PASS: lldb-unit :: Utility/./UtilityTests/StreamTeeTest.Flush (1293 of 2137) PASS: lldb-unit :: Utility/./UtilityTests/VASprintfTest.BufferResize (1294 of 2137) PASS: lldb-unit :: Utility/./UtilityTests/CompletionRequest.DuplicateFilteringWithComments (1295 of 2137) PASS: lldb-unit :: Utility/./UtilityTests/StringLexerTest.GetUnlexed (1296 of 2137) PASS: lldb-unit :: Target/./TargetTests/PathMappingListTest.AbsoluteTests (1297 of 2137) PASS: lldb-unit :: Process/gdb-remote/./ProcessGdbRemoteTests/GDBRemoteCommunicationClientTest.SyncThreadState (1298 of 2137) PASS: lldb-api :: commands/frame/diagnose/dereference-function-return/TestDiagnoseDereferenceFunctionReturn.py (1299 of 2137) PASS: lldb-unit :: DataFormatter/./LLDBFormatterTests/TypeMatcherTests.CreatedBySameMatchString (1300 of 2137) PASS: lldb-unit :: DataFormatter/./LLDBFormatterTests/StringPrinterTests.SwiftUTF8 (1301 of 2137) PASS: lldb-shell :: SymbolFile/DWARF/debug_loc-aslr.s (1302 of 2137) PASS: lldb-api :: lang/objc/radar-9691614/TestObjCMethodReturningBOOL.py (1303 of 2137) PASS: lldb-unit :: Utility/./UtilityTests/OptionsWithRawTest.EmptyArgsOnlySuffix (1304 of 2137) PASS: lldb-api :: functionalities/memory-region/TestMemoryRegion.py (1305 of 2137) PASS: lldb-unit :: Utility/./UtilityTests/SerializationRountripTest.SerializeDeserializeCString (1306 of 2137) PASS: lldb-api :: functionalities/data-formatter/data-formatter-objc/TestDataFormatterObjCNSContainer.py (1307 of 2137) PASS: lldb-unit :: UnwindAssembly/x86/./UnwindAssemblyx86Tests/Testx86AssemblyInspectionEngine.TestReturnDetect (1308 of 2137) PASS: lldb-unit :: UnwindAssembly/x86/./UnwindAssemblyx86Tests/Testx86AssemblyInspectionEngine.TestPopR15 (1309 of 2137) PASS: lldb-shell :: SymbolFile/DWARF/win-i386-line-table.s (1310 of 2137) UNSUPPORTED: lldb-api :: functionalities/darwin_log/filter/exact_match/message/TestDarwinLogFilterMatchMessage.py (1311 of 2137) PASS: lldb-unit :: UnwindAssembly/x86/./UnwindAssemblyx86Tests/Testx86AssemblyInspectionEngine.TestPushEBX (1312 of 2137) PASS: lldb-unit :: Host/./HostTests/FileSystemTest.EnumerateDirectory (1313 of 2137) PASS: lldb-unit :: Host/./HostTests/SocketTest.TCPGetAddress (1314 of 2137) PASS: lldb-api :: lang/cpp/stl/TestStdCXXDisassembly.py (1315 of 2137) PASS: lldb-unit :: Symbol/./SymbolTests/TestTypeSystemClang.TestDisplayName (1316 of 2137) PASS: lldb-unit :: Process/minidump/./LLDBMinidumpTests/MinidumpParserTest.GetPid (1317 of 2137) PASS: lldb-unit :: Host/./HostTests/FileSystemTest.GetPermissions (1318 of 2137) PASS: lldb-api :: lang/objc/rdar-10967107/TestRdar10967107.py (1319 of 2137) PASS: lldb-unit :: Utility/./UtilityTests/StringListTest.GetMaxStringLengthEqualSize (1320 of 2137) PASS: lldb-api :: functionalities/gdb_remote_client/TestTargetXMLArch.py (1321 of 2137) PASS: lldb-api :: functionalities/testid/TestTestId.py (1322 of 2137) PASS: lldb-unit :: ScriptInterpreter/Python/./ScriptInterpreterPythonTests/PythonDataObjectsTest.TestResetting (1323 of 2137) PASS: lldb-api :: commands/process/launch-with-shellexpand/TestLaunchWithShellExpand.py (1324 of 2137) PASS: lldb-unit :: Utility/./UtilityTests/ConstStringTest.FromMidOfBufferStringRef (1325 of 2137) PASS: lldb-api :: lang/objc/foundation/TestSymbolTable.py (1326 of 2137) PASS: lldb-unit :: Utility/./UtilityTests/LogChannelTest.Disable (1327 of 2137) UNSUPPORTED: lldb-api :: tools/lldb-vscode/completions/TestVSCode_completions.py (1328 of 2137) PASS: lldb-api :: functionalities/data-formatter/frameformat_smallstruct/TestFrameFormatSmallStruct.py (1329 of 2137) PASS: lldb-unit :: Host/./HostTests/NativeProcessProtocolTest.SetBreakpoint (1330 of 2137) PASS: lldb-shell :: SymbolFile/DWARF/limit-debug-info.s (1331 of 2137) PASS: lldb-api :: functionalities/breakpoint/hardware_breakpoints/require_hw_breakpoints/TestRequireHWBreakpoints.py (1332 of 2137) PASS: lldb-unit :: Core/./LLDBCoreTests/MangledTest.ResultForValidName (1333 of 2137) PASS: lldb-unit :: Utility/./UtilityTests/SerializationRountripTest.SerializeDeserializeObjectPointer (1334 of 2137) PASS: lldb-unit :: Utility/./UtilityTests/LogChannelEnabledTest.log_options (1335 of 2137) PASS: lldb-unit :: Utility/./UtilityTests/TimeoutTest.Construction (1336 of 2137) PASS: lldb-unit :: Utility/./UtilityTests/StringExtractorTest.DecodeHexU8_Exact (1337 of 2137) PASS: lldb-api :: functionalities/thread/concurrent_events/TestConcurrentWatchBreakDelay.py (1338 of 2137) PASS: lldb-unit :: UnwindAssembly/x86/./UnwindAssemblyx86Tests/Testx86AssemblyInspectionEngine.TestDisassemblyMidFunctionEpilogues (1339 of 2137) PASS: lldb-api :: tools/lldb-server/inferior-crash/TestGdbRemoteSegFault.py (1340 of 2137) PASS: lldb-api :: commands/expression/import-std-module/empty-module/TestEmptyStdModule.py (1341 of 2137) PASS: lldb-api :: macosx/thread_suspend/TestInternalThreadSuspension.py (1342 of 2137) PASS: lldb-unit :: UnwindAssembly/x86/./UnwindAssemblyx86Tests/Testx86AssemblyInspectionEngine.TestSpillRegToStackViaMOVx86_64 (1343 of 2137) PASS: lldb-api :: functionalities/tail_call_frames/inlining_and_tail_calls/TestInliningAndTailCalls.py (1344 of 2137) PASS: lldb-api :: python_api/sbvalue_persist/TestSBValuePersist.py (1345 of 2137) PASS: lldb-unit :: Language/Highlighting/./HighlighterTests/HighlighterTest.ClangBraces (1346 of 2137) PASS: lldb-api :: commands/watchpoints/multiple_threads/TestWatchpointMultipleThreads.py (1347 of 2137) PASS: lldb-api :: tools/lldb-server/TestGdbRemoteRegisterState.py (1348 of 2137) PASS: lldb-shell :: ObjectFile/PECOFF/basic-info-arm64.yaml (1349 of 2137) PASS: lldb-unit :: Symbol/./SymbolTests/DWARFCallFrameInfoTest.Basic_dwarf4 (1350 of 2137) PASS: lldb-shell :: SymbolFile/Breakpad/symtab.test (1351 of 2137) PASS: lldb-api :: functionalities/type_completion/TestTypeCompletion.py (1352 of 2137) PASS: lldb-api :: functionalities/thread/concurrent_events/TestConcurrentSignalDelayWatch.py (1353 of 2137) UNSUPPORTED: lldb-shell :: SymbolFile/PDB/typedefs.test (1354 of 2137) PASS: lldb-shell :: SymbolFile/DWARF/DW_OP_piece-smaller-than-struct.s (1355 of 2137) PASS: lldb-unit :: Utility/./UtilityTests/Flags.Test (1356 of 2137) PASS: lldb-unit :: Target/./TargetTests/ExecutionContextTest.GetByteOrderProcess (1357 of 2137) PASS: lldb-unit :: ScriptInterpreter/Python/./ScriptInterpreterPythonTests/PythonDataObjectsTest.TestPythonIntegerToStr (1358 of 2137) PASS: lldb-shell :: Settings/TestFrameFormatColor.test (1359 of 2137) PASS: lldb-api :: lang/objc/modules-inline-functions/TestModulesInlineFunctions.py (1360 of 2137) UNSUPPORTED: lldb-shell :: Register/x86-ymm-read.test (1361 of 2137) PASS: lldb-api :: lang/objcxx/hide-runtime-values/TestObjCXXHideRuntimeValues.py (1362 of 2137) PASS: lldb-unit :: Utility/./UtilityTests/StatusTest.ErrorConstructor (1363 of 2137) PASS: lldb-unit :: Process/gdb-remote/./ProcessGdbRemoteTests/GDBRemoteClientBaseTest.SendContinueAndAsyncSignal (1364 of 2137) PASS: lldb-unit :: Utility/./UtilityTests/RangeTest.NotEqualInvalid (1365 of 2137) PASS: lldb-api :: python_api/name_lookup/TestNameLookup.py (1366 of 2137) PASS: lldb-shell :: Breakpoint/split-dwarf-5-addrbase.test (1367 of 2137) PASS: lldb-api :: python_api/watchpoint/watchlocation/TestTargetWatchAddress.py (1368 of 2137) PASS: lldb-unit :: Utility/./UtilityTests/ArchSpecTest.Compatibility (1369 of 2137) PASS: lldb-unit :: Utility/./UtilityTests/StreamTest.AddressSuffix (1370 of 2137) PASS: lldb-api :: functionalities/breakpoint/breakpoint_by_line_and_column/TestBreakpointByLineAndColumn.py (1371 of 2137) PASS: lldb-shell :: SymbolFile/DWARF/dwarf5-debug_line.s (1372 of 2137) PASS: lldb-unit :: Language/Highlighting/./HighlighterTests/HighlighterTest.ClangPPDirectives (1373 of 2137) PASS: lldb-api :: functionalities/data-formatter/data-formatter-proper-plurals/TestFormattersOneIsSingular.py (1374 of 2137) PASS: lldb-unit :: Utility/./UtilityTests/ConstStringTest.CompareConstString (1375 of 2137) PASS: lldb-api :: commands/expression/argument_passing_restrictions/TestArgumentPassingRestrictions.py (1376 of 2137) UNSUPPORTED: lldb-shell :: Register/x86-64-gp-write.test (1377 of 2137) PASS: lldb-unit :: Symbol/./SymbolTests/TestTypeSystemClang.TestFunctionTemplateConstruction (1378 of 2137) PASS: lldb-unit :: Utility/./UtilityTests/StringListTest.SetSize (1379 of 2137) PASS: lldb-unit :: Utility/./UtilityTests/StringListTest.SplitIntoLinesSingleTrailingCR (1380 of 2137) PASS: lldb-api :: commands/target/create-no-such-arch/TestNoSuchArch.py (1381 of 2137) PASS: lldb-api :: lang/objc/modules-update/TestClangModulesUpdate.py (1382 of 2137) PASS: lldb-api :: lang/cpp/multiple-inheritance/TestCppMultipleInheritance.py (1383 of 2137) PASS: lldb-unit :: Utility/./UtilityTests/AnsiTerminal.Twice (1384 of 2137) UNSUPPORTED: lldb-api :: functionalities/thread/thread_specific_break_plus_condition/TestThreadSpecificBpPlusCondition.py (1385 of 2137) PASS: lldb-unit :: Symbol/./SymbolTests/TestClangASTImporter.CopyDeclTagDecl (1386 of 2137) UNSUPPORTED: lldb-shell :: Register/x86-64-zmm-read.test (1387 of 2137) PASS: lldb-unit :: Expression/./ExpressionTests/DiagnosticManagerTest.PutStringSeverities (1388 of 2137) UNSUPPORTED: lldb-shell :: Expr/TestIRMemoryMapWindows.test (1389 of 2137) PASS: lldb-unit :: SymbolFile/NativePDB/./SymbolFileNativePDBTests/PDBFPOProgramToDWARFExpressionTests.InvalidAssignmentSingle (1390 of 2137) UNSUPPORTED: lldb-api :: functionalities/darwin_log/basic/TestDarwinLogBasic.py (1391 of 2137) UNSUPPORTED: lldb-api :: functionalities/darwin_log/filter/exact_match/category/TestDarwinLogFilterMatchCategory.py (1392 of 2137) PASS: lldb-api :: lang/cpp/virtual-functions/TestCppVirtualFunctions.py (1393 of 2137) PASS: lldb-api :: commands/expression/call-function/TestCallUserDefinedFunction.py (1394 of 2137) PASS: lldb-unit :: Interpreter/./InterpreterTests/CompletionTest.FileCompletionAbsolute (1395 of 2137) PASS: lldb-shell :: Register/x86-64-gp-read.test (1396 of 2137) PASS: lldb-unit :: DataFormatter/./LLDBFormatterTests/StringPrinterTests.CxxUTF8 (1397 of 2137) PASS: lldb-api :: commands/target/select/TestTargetSelect.py (1398 of 2137) PASS: lldb-unit :: Utility/./UtilityTests/StreamTest.PutCStringWithStringRef (1399 of 2137) PASS: lldb-shell :: SymbolFile/DWARF/module-ownership.mm (1400 of 2137) PASS: lldb-unit :: Utility/./UtilityTests/StreamTeeTest.Constructor2Streams (1401 of 2137) PASS: lldb-api :: python_api/interpreter/TestRunCommandInterpreterAPI.py (1402 of 2137) PASS: lldb-unit :: Utility/./UtilityTests/RangeTest.Slide (1403 of 2137) PASS: lldb-shell :: ScriptInterpreter/Python/eof.test (1404 of 2137) PASS: lldb-api :: functionalities/thread/concurrent_events/TestConcurrentSignalDelayBreak.py (1405 of 2137) PASS: lldb-api :: commands/frame/diagnose/dereference-argument/TestDiagnoseDereferenceArgument.py (1406 of 2137) PASS: lldb-api :: lang/cpp/limit-debug-info/TestWithLimitDebugInfo.py (1407 of 2137) PASS: lldb-api :: functionalities/tail_call_frames/sbapi_support/TestTailCallFrameSBAPI.py (1408 of 2137) PASS: lldb-api :: lang/objc/objc-new-syntax/TestObjCNewSyntaxLiteral.py (1409 of 2137) PASS: lldb-api :: lang/c/unicode/TestUnicodeSymbols.py (1410 of 2137) PASS: lldb-unit :: Utility/./UtilityTests/RangeTest.DoesAdjoinOrIntersect (1411 of 2137) PASS: lldb-api :: functionalities/breakpoint/move_nearest/TestMoveNearest.py (1412 of 2137) PASS: lldb-api :: lang/c/set_values/TestSetValues.py (1413 of 2137) PASS: lldb-unit :: Utility/./UtilityTests/StringListTest.LongestCommonPrefixSingleElement (1414 of 2137) PASS: lldb-unit :: Utility/./UtilityTests/BroadcasterTest.EventTypeHasListeners (1415 of 2137) PASS: lldb-api :: python_api/value_var_update/TestValueVarUpdate.py (1416 of 2137) PASS: lldb-api :: lang/objc/objc-new-syntax/TestObjCNewSyntaxArray.py (1417 of 2137) PASS: lldb-api :: lang/c/anonymous/TestAnonymous.py (1418 of 2137) PASS: lldb-unit :: Symbol/./SymbolTests/DWARFCallFrameInfoTest.Basic_eh (1419 of 2137) PASS: lldb-shell :: SymbolFile/DWARF/debug_loc.s (1420 of 2137) PASS: lldb-unit :: Process/gdb-remote/./ProcessGdbRemoteTests/GDBRemoteCommunicationClientTest.GetQOffsets (1421 of 2137) PASS: lldb-unit :: Utility/./UtilityTests/XcodeSDKTest.SDKSupportsSwift (1422 of 2137) PASS: lldb-api :: functionalities/postmortem/elf-core/gcore/TestGCore.py (1423 of 2137) PASS: lldb-unit :: Utility/./UtilityTests/Predicate.WaitForValueNotEqualTo (1424 of 2137) PASS: lldb-api :: commands/watchpoints/watchpoint_size/TestWatchpointSizes.py (1425 of 2137) PASS: lldb-unit :: Utility/./UtilityTests/OptionsWithRawTest.UnterminatedQuote (1426 of 2137) PASS: lldb-shell :: SymbolFile/Breakpad/stack-cfi-arm.yaml (1427 of 2137) PASS: lldb-api :: lang/objc/objc-runtime-ivars/TestRuntimeIvars.py (1428 of 2137) PASS: lldb-unit :: Utility/./UtilityTests/DataExtractorTest.GetCStrUnterminated (1429 of 2137) PASS: lldb-api :: commands/expression/function_template_specialization_temp_args/TestFunctionTemplateSpecializationTempArgs.py (1430 of 2137) PASS: lldb-api :: functionalities/breakpoint/scripted_bkpt/TestScriptedResolver.py (1431 of 2137) PASS: lldb-api :: tools/lldb-server/TestGdbRemoteKill.py (1432 of 2137) PASS: lldb-unit :: Utility/./UtilityTests/DataExtractorTest.GetMaxU64 (1433 of 2137) PASS: lldb-unit :: Process/./ProcessEventDataTests/ProcessEventDataTest.DoOnRemoval (1434 of 2137) PASS: lldb-unit :: ScriptInterpreter/Python/./ScriptInterpreterPythonTests/PythonDataObjectsTest.TestPythonDictionaryManipulation (1435 of 2137) PASS: lldb-api :: python_api/symbol-context/TestSymbolContext.py (1436 of 2137) PASS: lldb-unit :: Utility/./UtilityTests/StreamTest.PutMaxHex64ByteOrderBig (1437 of 2137) PASS: lldb-shell :: SymbolFile/DWARF/DW_AT_loclists_base.s (1438 of 2137) PASS: lldb-shell :: ObjectFile/PECOFF/disassemble-thumb.yaml (1439 of 2137) PASS: lldb-unit :: SymbolFile/DWARF/./SymbolFileDWARFTests/SymbolFileDWARFTests.TestAbbrevInvalidNULLTag (1440 of 2137) PASS: lldb-unit :: Utility/./UtilityTests/StreamTest.PutCharWhitespace (1441 of 2137) PASS: lldb-api :: lang/cpp/namespace/TestNamespace.py (1442 of 2137) PASS: lldb-unit :: DataFormatter/./LLDBFormatterTests/StringPrinterTests.CxxASCII (1443 of 2137) PASS: lldb-shell :: Breakpoint/debug_rnglist_basic.test (1444 of 2137) PASS: lldb-api :: macosx/duplicate-archive-members/TestDuplicateMembers.py (1445 of 2137) XFAIL: lldb-shell :: Unwind/prefer-debug-over-eh-frame.test (1446 of 2137) PASS: lldb-shell :: ObjectFile/Breakpad/sections.test (1447 of 2137) PASS: lldb-unit :: Utility/./UtilityTests/GeneratorTest.YamlMultiProvider (1448 of 2137) UNSUPPORTED: lldb-api :: functionalities/thread/multi_break/TestMultipleBreakpoints.py (1449 of 2137) PASS: lldb-unit :: Utility/./UtilityTests/RangeTest.ContainsEndInclusive (1450 of 2137) PASS: lldb-api :: functionalities/gdb_remote_client/TestArmRegisterDefinition.py (1451 of 2137) PASS: lldb-api :: functionalities/thread/concurrent_events/TestConcurrentManyBreakpoints.py (1452 of 2137) PASS: lldb-api :: lang/cpp/this_class_type_mixing/TestThisClassTypeMixing.py (1453 of 2137) PASS: lldb-api :: functionalities/inferior-assert/TestInferiorAssert.py (1454 of 2137) PASS: lldb-unit :: Utility/./UtilityTests/StreamTest.PutCString (1455 of 2137) PASS: lldb-unit :: UnwindAssembly/x86/./UnwindAssemblyx86Tests/Testx86AssemblyInspectionEngine.TestLEAVE (1456 of 2137) UNSUPPORTED: lldb-api :: functionalities/data-formatter/data-formatter-stl/libstdcpp/vector/TestDataFormatterStdVector.py (1457 of 2137) PASS: lldb-api :: python_api/value/linked_list/TestValueAPILinkedList.py (1458 of 2137) PASS: lldb-unit :: Symbol/./SymbolTests/PostfixExpression.ToDWARF (1459 of 2137) PASS: lldb-api :: commands/expression/radar_9531204/TestPrintfAfterUp.py (1460 of 2137) PASS: lldb-unit :: Utility/./UtilityTests/StructuredDataTest.StringDump (1461 of 2137) PASS: lldb-api :: sanity/TestSettingSkipping.py (1462 of 2137) PASS: lldb-unit :: debugserver/./debugserverTests/RNBSocket.LoopBackListenIPv4 (1463 of 2137) PASS: lldb-shell :: ObjectFile/ELF/PT_LOAD-overlap-PT_INTERP.yaml (1464 of 2137) PASS: lldb-unit :: Symbol/./SymbolTests/Type.CompilerContextPattern (1465 of 2137) PASS: lldb-api :: functionalities/breakpoint/global_constructor/TestBreakpointInGlobalConstructor.py (1466 of 2137) PASS: lldb-unit :: Utility/./UtilityTests/RangeDataVector.FindEntryIndexesThatContain_Overlap (1467 of 2137) PASS: lldb-unit :: debugserver/./debugserverTests/RNBSocket.LoopBackConnectIPv6 (1468 of 2137) PASS: lldb-api :: macosx/indirect_symbol/TestIndirectSymbols.py (1469 of 2137) PASS: lldb-unit :: Utility/./UtilityTests/TimerTest.CategoryTimesNested (1470 of 2137) PASS: lldb-unit :: ObjectFile/ELF/./ObjectFileELFTests/ObjectFileELFTest.GetSymtab_NoSymEntryPointArmAddressClass (1471 of 2137) PASS: lldb-unit :: debugserver/./debugserverTests/RNBSocket.LoopBackListenIPv6 (1472 of 2137) PASS: lldb-unit :: Utility/./UtilityTests/DeserializerTest.HasData (1473 of 2137) PASS: lldb-unit :: Utility/./UtilityTests/OptionsWithRawTest.EmptySuffixSingleWhitespace (1474 of 2137) UNSUPPORTED: lldb-api :: functionalities/darwin_log/filter/regex/activity/TestDarwinLogFilterRegexActivity.py (1475 of 2137) UNSUPPORTED: lldb-shell :: Register/x86-zmm-write.test (1476 of 2137) PASS: lldb-shell :: Minidump/memory-region.yaml (1477 of 2137) PASS: lldb-api :: functionalities/breakpoint/address_breakpoints/TestAddressBreakpoints.py (1478 of 2137) PASS: lldb-api :: commands/platform/process/list/TestProcessList.py (1479 of 2137) PASS: lldb-api :: commands/breakpoint/set/func-regex/TestBreakpointRegexError.py (1480 of 2137) PASS: lldb-shell :: Minidump/breakpad-symbols.test (1481 of 2137) PASS: lldb-api :: functionalities/gdb_remote_client/TestPlatformClient.py (1482 of 2137) PASS: lldb-unit :: Host/./HostTests/NativeProcessProtocolTest.SetBreakpointFailWrite (1483 of 2137) PASS: lldb-unit :: Process/gdb-remote/./ProcessGdbRemoteTests/GDBRemoteCommunicationClientTest.GetMemoryRegionInfo (1484 of 2137) UNSUPPORTED: lldb-shell :: Register/x86-64-xmm16-read.test (1485 of 2137) PASS: lldb-api :: python_api/target/TestTargetAPI.py (1486 of 2137) PASS: lldb-api :: commands/command/delete/TestCommandDelete.py (1487 of 2137) PASS: lldb-api :: lang/objc/objc-static-method/TestObjCStaticMethod.py (1488 of 2137) PASS: lldb-unit :: Utility/./UtilityTests/StringExtractorTest.InitEmpty (1489 of 2137) PASS: lldb-unit :: Utility/./UtilityTests/StringListTest.InsertStringAtIndexStart (1490 of 2137) UNSUPPORTED: lldb-api :: tools/lldb-server/TestGdbRemoteAuxvSupport.py (1491 of 2137) PASS: lldb-unit :: tools/lldb-server/tests/./LLDBServerTests/TestBase.DebugserverEnv (1492 of 2137) PASS: lldb-api :: functionalities/data-formatter/data-formatter-stl/libcxx/variant/TestDataFormatterLibcxxVariant.py (1493 of 2137) PASS: lldb-api :: functionalities/ubsan/user-expression/TestUbsanUserExpression.py (1494 of 2137) PASS: lldb-unit :: UnwindAssembly/x86/./UnwindAssemblyx86Tests/Testx86AssemblyInspectionEngine.TestPushR12 (1495 of 2137) PASS: lldb-unit :: Utility/./UtilityTests/SerializationRountripTest.SerializeDeserializePod (1496 of 2137) PASS: lldb-unit :: Target/./TargetTests/ModuleCacheTest.GetAndPutUuidExists (1497 of 2137) PASS: lldb-unit :: SymbolFile/DWARF/./SymbolFileDWARFTests/SymbolFileDWARFTests.TestAbbrevMissingTerminator (1498 of 2137) PASS: lldb-shell :: ExecControl/StopHook/stop-hook.test (1499 of 2137) PASS: lldb-api :: lang/objcxx/cxx-bridged-po/TestObjCXXBridgedPO.py (1500 of 2137) PASS: lldb-unit :: Utility/./UtilityTests/Predicate.WaitForValueEqualTo (1501 of 2137) PASS: lldb-api :: lang/objc/ivar-IMP/TestObjCiVarIMP.py (1502 of 2137) PASS: lldb-api :: api/multiple-debuggers/TestMultipleDebuggers.py (1503 of 2137) PASS: lldb-unit :: Utility/./UtilityTests/SubsystemRAIITest.SubsystemWithErrorFailure (1504 of 2137) PASS: lldb-unit :: Utility/./UtilityTests/StreamTeeTest.GetStreamAtIndexOutOfBoundsEmpty (1505 of 2137) PASS: lldb-unit :: Utility/./UtilityTests/StreamTest.PutNHex8 (1506 of 2137) PASS: lldb-api :: functionalities/tsan/cpp_global_location/TestTsanCPPGlobalLocation.py (1507 of 2137) PASS: lldb-api :: commands/expression/regression-access-function-template-in-record/TestRegressionAccessFunctionTemplateInRecord.py (1508 of 2137) PASS: lldb-shell :: Commands/command-breakpoint-col.test (1509 of 2137) PASS: lldb-api :: lang/c/conflicting-symbol/TestConflictingSymbol.py (1510 of 2137) PASS: lldb-unit :: Utility/./UtilityTests/StreamTest.AddressPrefixAndSuffix (1511 of 2137) UNSUPPORTED: lldb-shell :: Register/x86-64-xmm16-write.test (1512 of 2137) PASS: lldb-api :: lang/cpp/dynamic-value/TestCppValueCast.py (1513 of 2137) PASS: lldb-unit :: Target/./TargetTests/StackFrameRecognizerTest.NullModuleRegex (1514 of 2137) PASS: lldb-api :: lang/c/struct_types/TestStructTypes.py (1515 of 2137) PASS: lldb-shell :: Unwind/trap_frame_sym_ctx.test (1516 of 2137) PASS: lldb-shell :: Process/TestAbortExitCode.test (1517 of 2137) PASS: lldb-unit :: Utility/./UtilityTests/StringExtractorTest.GetHexU8_Extra_NoEof (1518 of 2137) PASS: lldb-unit :: SymbolFile/NativePDB/./SymbolFileNativePDBTests/PDBFPOProgramToDWARFExpressionTests.MultipleIndependentAssignments (1519 of 2137) PASS: lldb-unit :: Host/./HostTests/File.GetStreamFromDescriptor (1520 of 2137) PASS: lldb-api :: commands/frame/var-scope/TestFrameVariableScope.py (1521 of 2137) PASS: lldb-api :: functionalities/breakpoint/objc/TestObjCBreakpoints.py (1522 of 2137) PASS: lldb-api :: functionalities/source-map/TestTargetSourceMap.py (1523 of 2137) PASS: lldb-unit :: UnwindAssembly/x86/./UnwindAssemblyx86Tests/Testx86AssemblyInspectionEngine.TestPopR13 (1524 of 2137) PASS: lldb-shell :: SymbolFile/DWARF/deterministic-build.cpp (1525 of 2137) PASS: lldb-shell :: ObjectFile/PECOFF/section-types.yaml (1526 of 2137) PASS: lldb-api :: commands/expression/persistent_types/TestPersistentTypes.py (1527 of 2137) PASS: lldb-shell :: Driver/TestCommands.test (1528 of 2137) PASS: lldb-unit :: Utility/./UtilityTests/FileSpecTest.PrependPathComponent (1529 of 2137) PASS: lldb-api :: functionalities/thread/concurrent_events/TestConcurrentTwoBreakpointsOneDelaySignal.py (1530 of 2137) PASS: lldb-unit :: Utility/./UtilityTests/StringListTest.JoinMultiCharSeparator (1531 of 2137) PASS: lldb-unit :: UnwindAssembly/x86/./UnwindAssemblyx86Tests/Testx86AssemblyInspectionEngine.Test32bitFramelessBigStackFrame (1532 of 2137) PASS: lldb-shell :: Commands/CommandScriptImmediateOutput/CommandScriptImmediateOutputConsole.test (1533 of 2137) PASS: lldb-unit :: Utility/./UtilityTests/ArgsTest.ReplaceArgumentAtIndexFarOutOfRange (1534 of 2137) PASS: lldb-api :: lang/objc/objc-dyn-sbtype/TestObjCDynamicSBType.py (1535 of 2137) PASS: lldb-api :: tools/lldb-vscode/coreFile/TestVSCode_coreFile.py (1536 of 2137) PASS: lldb-unit :: Utility/./UtilityTests/LogTest.Register (1537 of 2137) XFAIL: lldb-shell :: Register/x86-64-ymm-write.test (1538 of 2137) PASS: lldb-unit :: Utility/./UtilityTests/RangeTest.DoesIntersect (1539 of 2137) PASS: lldb-api :: lang/cpp/subst_template_type_param/TestSubstTemplateTypeParam.py (1540 of 2137) PASS: lldb-shell :: Breakpoint/debug_rnglist_offset_pair.test (1541 of 2137) PASS: lldb-unit :: Utility/./UtilityTests/VMRange.SetEndAddress (1542 of 2137) PASS: lldb-api :: macosx/find-app-in-bundle/TestFindAppInBundle.py (1543 of 2137) PASS: lldb-api :: types/TestIntegerTypeExpr.py (1544 of 2137) PASS: lldb-unit :: Utility/./UtilityTests/ScalarTest.ExtractBitfield (1545 of 2137) PASS: lldb-api :: commands/expression/dont_allow_jit/TestAllowJIT.py (1546 of 2137) PASS: lldb-unit :: Expression/./ExpressionTests/DWARFExpression.DW_OP_pick (1547 of 2137) PASS: lldb-api :: commands/target/stop-hook/disable/TestTargetStopHookDisable.py (1548 of 2137) PASS: lldb-unit :: Core/./LLDBCoreTests/ModuleSpecTest.TestELFFile (1549 of 2137) PASS: lldb-api :: lang/objc/global_ptrs/TestGlobalObjects.py (1550 of 2137) PASS: lldb-api :: functionalities/breakpoint/breakpoint_command/TestRegexpBreakCommand.py (1551 of 2137) UNSUPPORTED: lldb-shell :: SymbolFile/PDB/compilands.test (1552 of 2137) PASS: lldb-api :: lang/cpp/virtual-overload/TestVirtualOverload.py (1553 of 2137) PASS: lldb-unit :: Utility/./UtilityTests/OptionsWithRawTest.ArgsButNoLeadingDash (1554 of 2137) UNSUPPORTED: lldb-shell :: SymbolFile/PDB/calling-conventions.test (1555 of 2137) PASS: lldb-api :: functionalities/postmortem/elf-core/TestLinuxCore.py (1556 of 2137) PASS: lldb-unit :: Expression/./ExpressionTests/CppModuleConfigurationTest.IgnoreLibStdCpp (1557 of 2137) PASS: lldb-shell :: Settings/TestFrameFormatMangling.test (1558 of 2137) PASS: lldb-api :: functionalities/float-display/TestFloatDisplay.py (1559 of 2137) PASS: lldb-api :: functionalities/breakpoint/inlined_breakpoints/TestInlinedBreakpoints.py (1560 of 2137) PASS: lldb-api :: functionalities/data-formatter/var-in-aggregate-misuse/TestVarInAggregateMisuse.py (1561 of 2137) PASS: lldb-shell :: ObjectFile/PECOFF/basic-info.yaml (1562 of 2137) PASS: lldb-api :: tools/lldb-vscode/module/TestVSCode_module.py (1563 of 2137) PASS: lldb-shell :: SymbolFile/Breakpad/line-table-missing-file.test (1564 of 2137) UNSUPPORTED: lldb-api :: lang/cpp/function-template-parameter-pack/TestFunctionTemplateParameterPack.py (1565 of 2137) PASS: lldb-unit :: ObjectFile/Breakpad/./ObjectFileBreakpadTests/StackWinRecord.parse (1566 of 2137) PASS: lldb-unit :: Utility/./UtilityTests/TimerTest.CategoryTimes2 (1567 of 2137) UNSUPPORTED: lldb-api :: linux/mix-dwo-and-regular-objects/TestMixedDwarfBinary.py (1568 of 2137) PASS: lldb-unit :: Language/Highlighting/./HighlighterTests/HighlighterTest.ClangCursorPosInOtherToken (1569 of 2137) PASS: lldb-api :: functionalities/thread/concurrent_events/TestConcurrentTwoWatchpointsOneBreakpoint.py (1570 of 2137) PASS: lldb-api :: functionalities/breakpoint/consecutive_breakpoints/TestConsecutiveBreakpoints.py (1571 of 2137) PASS: lldb-unit :: Core/./LLDBCoreTests/RichManglingContextTest.FromCxxMethodName (1572 of 2137) PASS: lldb-unit :: Utility/./UtilityTests/StringExtractorTest.GetHexBytes_Underflow (1573 of 2137) PASS: lldb-shell :: Minidump/Windows/arm-fp-unwind.test (1574 of 2137) UNSUPPORTED: lldb-shell :: ScriptInterpreter/Lua/quit.test (1575 of 2137) PASS: lldb-unit :: Utility/./UtilityTests/StringListTest.ShiftStdString (1576 of 2137) PASS: lldb-unit :: Symbol/./SymbolTests/TestTypeSystemClang.TestGetTypeClassTypeOf (1577 of 2137) PASS: lldb-shell :: SymbolFile/NativePDB/ast-types.cpp (1578 of 2137) PASS: lldb-unit :: Utility/./UtilityTests/NameMatchesTest.Equals (1579 of 2137) PASS: lldb-unit :: Language/Highlighting/./HighlighterTests/HighlighterTest.DefaultHighlighterWithCursor (1580 of 2137) PASS: lldb-unit :: Utility/./UtilityTests/StringListTest.JoinThree (1581 of 2137) UNSUPPORTED: lldb-shell :: ExecControl/StopHook/stop-hook-threads.test (1582 of 2137) PASS: lldb-api :: tools/lldb-server/commandline/TestStubReverseConnect.py (1583 of 2137) PASS: lldb-api :: functionalities/gdb_remote_client/TestProcessConnect.py (1584 of 2137) PASS: lldb-shell :: SymbolFile/DWARF/static_scope.s (1585 of 2137) PASS: lldb-api :: lang/objc/foundation/TestRuntimeTypes.py (1586 of 2137) PASS: lldb-api :: commands/gui/basicdebug/TestGuiBasicDebug.py (1587 of 2137) PASS: lldb-api :: functionalities/postmortem/minidump/TestMiniDump.py (1588 of 2137) PASS: lldb-api :: functionalities/data-formatter/data-formatter-stl/libcxx/initializerlist/TestInitializerList.py (1589 of 2137) PASS: lldb-unit :: Utility/./UtilityTests/RangeDataVector.FindEntryIndexesThatContain (1590 of 2137) PASS: lldb-shell :: Process/UnsupportedLanguage.test (1591 of 2137) PASS: lldb-api :: commands/expression/options/TestExprOptions.py (1592 of 2137) UNSUPPORTED: lldb-shell :: Register/arm-fp-read.test (1593 of 2137) PASS: lldb-api :: lang/cpp/class_types/TestClassTypes.py (1594 of 2137) PASS: lldb-api :: commands/frame/language/TestGuessLanguage.py (1595 of 2137) PASS: lldb-shell :: Reproducer/TestDiscard.test (1596 of 2137) PASS: lldb-unit :: UnwindAssembly/x86/./UnwindAssemblyx86Tests/Testx86AssemblyInspectionEngine.TestStackRealignMSVC_i386 (1597 of 2137) PASS: lldb-unit :: Host/./HostTests/SocketAddressTest.GetAddressInfo (1598 of 2137) PASS: lldb-api :: functionalities/data-formatter/user-format-vs-summary/TestUserFormatVsSummary.py (1599 of 2137) PASS: lldb-unit :: Utility/./UtilityTests/SerializationRountripTest.SerializeDeserializeCStringArray (1600 of 2137) PASS: lldb-api :: commands/process/attach/TestProcessAttach.py (1601 of 2137) PASS: lldb-unit :: Utility/./UtilityTests/NameMatchesTest.StartsWith (1602 of 2137) PASS: lldb-api :: functionalities/thread/concurrent_events/TestConcurrentBreakpointsDelayedBreakpointOneWatchpoint.py (1603 of 2137) PASS: lldb-api :: functionalities/data-formatter/compactvectors/TestCompactVectors.py (1604 of 2137) PASS: lldb-shell :: Breakpoint/implicit_const_form_support.test (1605 of 2137) PASS: lldb-api :: commands/expression/expr-in-syscall/TestExpressionInSyscall.py (1606 of 2137) PASS: lldb-unit :: Utility/./UtilityTests/ReproducerTest.SetReplay (1607 of 2137) PASS: lldb-unit :: Process/minidump/./LLDBMinidumpTests/MinidumpParserTest.GetLinuxProcStatus (1608 of 2137) PASS: lldb-api :: commands/frame/diagnose/dereference-this/TestDiagnoseDereferenceThis.py (1609 of 2137) PASS: lldb-unit :: Utility/./UtilityTests/ArgsTest.ReplaceArgumentAtIndexLonger (1610 of 2137) PASS: lldb-unit :: Utility/./UtilityTests/AnsiTerminal.KnownPrefix (1611 of 2137) PASS: lldb-unit :: SymbolFile/NativePDB/./SymbolFileNativePDBTests/PDBFPOProgramToDWARFExpressionTests.MultipleDependentAssignments (1612 of 2137) PASS: lldb-unit :: Process/minidump/./LLDBMinidumpTests/MinidumpParserTest.GetMemory (1613 of 2137) PASS: lldb-api :: tools/lldb-vscode/breakpoint/TestVSCode_setFunctionBreakpoints.py (1614 of 2137) PASS: lldb-shell :: ObjectFile/MachO/lc_build_version.yaml (1615 of 2137) PASS: lldb-shell :: SymbolFile/NativePDB/disassembly.cpp (1616 of 2137) PASS: lldb-api :: commands/target/modules/search-paths/insert/TestTargetModulesSearchpathsInsert.py (1617 of 2137) PASS: lldb-unit :: Utility/./UtilityTests/StringExtractorTest.GetHexU8_Exact (1618 of 2137) PASS: lldb-api :: functionalities/thread/concurrent_events/TestConcurrentDelayedCrashWithBreakpointWatchpoint.py (1619 of 2137) PASS: lldb-unit :: Host/./HostTests/FileSystemTest.Resolve (1620 of 2137) PASS: lldb-shell :: Driver/TestHelp.test (1621 of 2137) PASS: lldb-shell :: SymbolFile/DWARF/debug-types-basic.test (1622 of 2137) PASS: lldb-shell :: Reproducer/TestFileRepro.test (1623 of 2137) PASS: lldb-api :: tools/lldb-vscode/breakpoint/TestVSCode_setBreakpoints.py (1624 of 2137) PASS: lldb-api :: lang/objc/objc-ivar-stripped/TestObjCIvarStripped.py (1625 of 2137) PASS: lldb-unit :: Utility/./UtilityTests/UriParserTest.BadPort2 (1626 of 2137) PASS: lldb-api :: commands/expression/import-std-module/deque-basic/TestDequeFromStdModule.py (1627 of 2137) PASS: lldb-unit :: ObjectFile/Breakpad/./ObjectFileBreakpadTests/FileRecord.parse (1628 of 2137) PASS: lldb-unit :: UnwindAssembly/ARM64/./Arm64InstEmulationTests/TestArm64InstEmulation.TestFramelessThreeEpilogueFunction (1629 of 2137) PASS: lldb-unit :: Utility/./UtilityTests/StringLexerTest.Next (1630 of 2137) PASS: lldb-api :: lang/cpp/global_operators/TestCppGlobalOperators.py (1631 of 2137) PASS: lldb-unit :: Utility/./UtilityTests/LogChannelEnabledTest.LogVerboseThread (1632 of 2137) PASS: lldb-api :: functionalities/thread/concurrent_events/TestConcurrentCrashWithBreak.py (1633 of 2137) PASS: lldb-unit :: Utility/./UtilityTests/StringExtractorTest.GetHexBytes_OddPair (1634 of 2137) PASS: lldb-api :: macosx/macCatalyst/TestMacCatalyst.py (1635 of 2137) PASS: lldb-api :: functionalities/gdb_remote_client/TestIOSSimulator.py (1636 of 2137) PASS: lldb-unit :: Utility/./UtilityTests/StringListTest.GetMaxStringLengthMixed (1637 of 2137) PASS: lldb-unit :: SymbolFile/DWARF/./SymbolFileDWARFTests/SymbolFileDWARFTests.TestAbbrevOrder1Start1 (1638 of 2137) PASS: lldb-api :: functionalities/data-formatter/nsarraysynth/TestNSArraySynthetic.py (1639 of 2137) PASS: lldb-api :: functionalities/breakpoint/debugbreak/TestDebugBreak.py (1640 of 2137) PASS: lldb-unit :: Utility/./UtilityTests/StreamTest.QuotedCString (1641 of 2137) PASS: lldb-unit :: Core/./LLDBCoreTests/RichManglingContextTest.IPDRealloc (1642 of 2137) PASS: lldb-unit :: Process/minidump/./LLDBMinidumpTests/RegisterContextMinidump.ConvertMinidumpContext_x86_64 (1643 of 2137) PASS: lldb-api :: commands/expression/import-std-module/conflicts/TestStdModuleWithConflicts.py (1644 of 2137) XFAIL: lldb-shell :: Register/x86-mm-xmm-read.test (1645 of 2137) PASS: lldb-unit :: Utility/./UtilityTests/BinaryStreamTest.PutSLEB128FourBytes (1646 of 2137) PASS: lldb-api :: macosx/save_crashlog/TestSaveCrashlog.py (1647 of 2137) PASS: lldb-unit :: Utility/./UtilityTests/BinaryStreamTest.PutSLEB128FiveBytes (1648 of 2137) PASS: lldb-unit :: Expression/./ExpressionTests/DiagnosticManagerTest.HasFixits (1649 of 2137) PASS: lldb-unit :: ScriptInterpreter/Python/./ScriptInterpreterPythonTests/PythonDataObjectsTest.TestPythonListValueEquality (1650 of 2137) PASS: lldb-api :: python_api/lldbutil/frame/TestFrameUtils.py (1651 of 2137) PASS: lldb-unit :: Utility/./UtilityTests/StreamTest.PutRawBytesToBigEndian (1652 of 2137) PASS: lldb-api :: functionalities/data-formatter/setvaluefromcstring/TestSetValueFromCString.py (1653 of 2137) PASS: lldb-unit :: Language/Highlighting/./HighlighterTests/HighlighterTest.ClangSquareBrackets (1654 of 2137) PASS: lldb-api :: functionalities/gdb_remote_client/TestRecognizeBreakpoint.py (1655 of 2137) PASS: lldb-api :: tools/lldb-server/TestAppleSimulatorOSType.py (1656 of 2137) PASS: lldb-api :: functionalities/data-formatter/format-propagation/TestFormatPropagation.py (1657 of 2137) PASS: lldb-unit :: Host/./HostTests/Host.WaitStatusFormat (1658 of 2137) PASS: lldb-unit :: Utility/./UtilityTests/ArgsTest.TestSingleArg (1659 of 2137) PASS: lldb-shell :: Unwind/eh-frame-dwarf-unwind.test (1660 of 2137) PASS: lldb-api :: functionalities/data-formatter/data-formatter-ptr-to-array/TestPtrToArrayFormatting.py (1661 of 2137) PASS: lldb-api :: commands/expression/test/TestExprs2.py (1662 of 2137) PASS: lldb-api :: source-manager/TestSourceManager.py (1663 of 2137) PASS: lldb-api :: lang/cpp/symbols/TestSymbols.py (1664 of 2137) UNSUPPORTED: lldb-api :: functionalities/darwin_log/filter/regex/subsystem/TestDarwinLogFilterRegexSubsystem.py (1665 of 2137) PASS: lldb-api :: functionalities/gdb_remote_client/TestRestartBug.py (1666 of 2137) PASS: lldb-unit :: Expression/./ExpressionTests/CppModuleConfigurationTest.MissingLibCpp (1667 of 2137) PASS: lldb-shell :: SymbolFile/DWARF/debug-types-address-ranges.s (1668 of 2137) PASS: lldb-shell :: ObjectFile/ELF/gnu-debuglink.yaml (1669 of 2137) PASS: lldb-unit :: Process/gdb-remote/./ProcessGdbRemoteTests/GDBRemoteCommunicationClientTest.SendStartTracePacket (1670 of 2137) PASS: lldb-shell :: SymbolFile/DWARF/dwo-type-in-main-file.s (1671 of 2137) PASS: lldb-unit :: Utility/./UtilityTests/ListenerTest.GetEventWait (1672 of 2137) PASS: lldb-api :: terminal/TestEditline.py (1673 of 2137) PASS: lldb-unit :: DataFormatter/./LLDBFormatterTests/TypeMatcherTests.ExactName (1674 of 2137) UNSUPPORTED: lldb-api :: benchmarks/continue/TestBenchmarkContinue.py (1675 of 2137) PASS: lldb-api :: functionalities/data-formatter/summary-string-onfail/Test-rdar-9974002.py (1676 of 2137) PASS: lldb-api :: lang/cpp/this/TestCPPThis.py (1677 of 2137) PASS: lldb-api :: lang/objc/objc-super/TestObjCSuper.py (1678 of 2137) PASS: lldb-unit :: Target/./TargetTests/ModuleCacheTest.GetAndPut (1679 of 2137) PASS: lldb-unit :: Utility/./UtilityTests/BinaryStreamTest.PutSLEB128SixBytes (1680 of 2137) PASS: lldb-api :: python_api/value/change_values/TestChangeValueAPI.py (1681 of 2137) PASS: lldb-api :: functionalities/data-formatter/varscript_formatting/TestDataFormatterVarScriptFormatting.py (1682 of 2137) PASS: lldb-api :: functionalities/archives/TestBSDArchives.py (1683 of 2137) PASS: lldb-api :: functionalities/recursion/TestValueObjectRecursion.py (1684 of 2137) PASS: lldb-unit :: Utility/./UtilityTests/EnvironmentTest.EnvpConstruction (1685 of 2137) PASS: lldb-unit :: Utility/./UtilityTests/StreamTest.AddressRangeEmptyRange (1686 of 2137) PASS: lldb-unit :: Utility/./UtilityTests/UriParserTest.MinimalPort (1687 of 2137) PASS: lldb-api :: commands/expression/import-std-module/shared_ptr-dbg-info-content/TestSharedPtrDbgInfoContentFromStdModule.py (1688 of 2137) PASS: lldb-unit :: Utility/./UtilityTests/CompletionRequest.FakeLastArg (1689 of 2137) PASS: lldb-unit :: Utility/./UtilityTests/ProcessInstanceInfoMatch.Name (1690 of 2137) PASS: lldb-api :: lang/objc/modules/TestObjCModules.py (1691 of 2137) PASS: lldb-unit :: Utility/./UtilityTests/FileSpecTest.GuessPathStyle (1692 of 2137) PASS: lldb-unit :: Symbol/./SymbolTests/TestTypeSystemClang.TestGetEnumIntegerTypeBasicTypes (1693 of 2137) PASS: lldb-api :: lang/cpp/frame-var-anon-unions/TestFrameVariableAnonymousUnions.py (1694 of 2137) PASS: lldb-api :: lang/objc/foundation/TestObjCMethods2.py (1695 of 2137) PASS: lldb-unit :: Utility/./UtilityTests/IndexToObjectTest.ObjectForIndex (1696 of 2137) PASS: lldb-api :: lang/cpp/dynamic-value/TestDynamicValue.py (1697 of 2137) PASS: lldb-shell :: Commands/command-thread-select.test (1698 of 2137) PASS: lldb-api :: commands/settings/TestSettings.py (1699 of 2137) PASS: lldb-unit :: Utility/./UtilityTests/LogChannelTest.EnableOptions (1700 of 2137) PASS: lldb-api :: functionalities/postmortem/minidump-new/TestMiniDumpUUID.py (1701 of 2137) PASS: lldb-api :: lang/cpp/class_static/TestStaticVariables.py (1702 of 2137) PASS: lldb-api :: tools/lldb-vscode/launch/TestVSCode_launch.py (1703 of 2137) UNSUPPORTED: lldb-shell :: SymbolFile/DWARF/DW_TAG_GNU_call_site-DW_AT_low_pc.s (1704 of 2137) PASS: lldb-api :: functionalities/memory/read/TestMemoryRead.py (1705 of 2137) PASS: lldb-shell :: SymbolFile/NativePDB/tag-types.cpp (1706 of 2137) PASS: lldb-api :: macosx/function-starts/TestFunctionStarts.py (1707 of 2137) PASS: lldb-unit :: Utility/./UtilityTests/RangeDataVector.FindEntryThatContains (1708 of 2137) PASS: lldb-unit :: Symbol/./SymbolTests/TestTypeSystemClang.TestGetBasicTypeFromName (1709 of 2137) PASS: lldb-shell :: Reproducer/TestReuseDirectory.test (1710 of 2137) PASS: lldb-shell :: Settings/TestEchoCommands.test (1711 of 2137) PASS: lldb-unit :: Utility/./UtilityTests/StringListTest.CopyList (1712 of 2137) PASS: lldb-unit :: Symbol/./SymbolTests/TestTypeSystemClang.TestUnifyAccessSpecifiers (1713 of 2137) PASS: lldb-api :: functionalities/thread/concurrent_events/TestConcurrentManyWatchpoints.py (1714 of 2137) PASS: lldb-shell :: Breakpoint/split-dwarf5-debug-stroffsets.test (1715 of 2137) PASS: lldb-api :: python_api/signals/TestSignalsAPI.py (1716 of 2137) PASS: lldb-unit :: UnwindAssembly/ARM64/./Arm64InstEmulationTests/TestArm64InstEmulation.TestMediumDarwinFunction (1717 of 2137) PASS: lldb-unit :: Symbol/./SymbolTests/TestTypeSystemClang.TestGetBasicTypeFromEnum (1718 of 2137) PASS: lldb-api :: functionalities/memory/find/TestMemoryFind.py (1719 of 2137) PASS: lldb-shell :: SymbolFile/DWARF/debug-types-dwarf5.s (1720 of 2137) PASS: lldb-unit :: Utility/./UtilityTests/RangeTest.ContainsAddr (1721 of 2137) PASS: lldb-shell :: Reproducer/TestCaptureEnvOverride.test (1722 of 2137) PASS: lldb-api :: python_api/sbdata/TestSBData.py (1723 of 2137) PASS: lldb-api :: lang/cpp/namespace_definitions/TestNamespaceDefinitions.py (1724 of 2137) PASS: lldb-unit :: Utility/./UtilityTests/SharedCluster.ClusterManager (1725 of 2137) PASS: lldb-api :: functionalities/data-formatter/nssetsynth/TestNSSetSynthetic.py (1726 of 2137) PASS: lldb-shell :: SymbolFile/DWARF/DW_AT_location-DW_AT_const_value.s (1727 of 2137) PASS: lldb-shell :: Quit/TestQuitExitCode30.test (1728 of 2137) PASS: lldb-unit :: Process/gdb-remote/./ProcessGdbRemoteTests/GDBRemoteClientBaseTest.SendContinueAndAsyncPacket (1729 of 2137) PASS: lldb-shell :: SymbolFile/DWARF/find-qualified-variable.cpp (1730 of 2137) PASS: lldb-shell :: Minidump/Windows/broken-unwind.test (1731 of 2137) PASS: lldb-unit :: UnwindAssembly/x86/./UnwindAssemblyx86Tests/Testx86AssemblyInspectionEngine.TestSimplei386ugmented (1732 of 2137) PASS: lldb-unit :: Host/./HostTests/MainLoopTest.Signal (1733 of 2137) PASS: lldb-api :: commands/expression/import-std-module/unique_ptr-dbg-info-content/TestUniquePtrDbgInfoContent.py (1734 of 2137) PASS: lldb-api :: lang/cpp/accelerator-table/TestCPPAccelerator.py (1735 of 2137) PASS: lldb-unit :: Utility/./UtilityTests/StreamTest.PutHex64ByteOrderLittle (1736 of 2137) PASS: lldb-unit :: Expression/./ExpressionTests/CppModuleConfigurationTest.Sysroot (1737 of 2137) PASS: lldb-api :: commands/disassemble/basic/TestFrameDisassemble.py (1738 of 2137) PASS: lldb-unit :: Utility/./UtilityTests/XcodeSDKTest.GetSDKTypeForTriple (1739 of 2137) PASS: lldb-unit :: Process/gdb-remote/./ProcessGdbRemoteTests/GDBRemoteCommunicationClientTest.GetModulesInfoInvalidResponse (1740 of 2137) PASS: lldb-api :: functionalities/breakpoint/address_breakpoints/TestBadAddressBreakpoints.py (1741 of 2137) UNSUPPORTED: lldb-api :: lang/objc/objc-dynamic-value/TestObjCDynamicValue.py (1742 of 2137) PASS: lldb-api :: lang/objc/modules-incomplete/TestIncompleteModules.py (1743 of 2137) PASS: lldb-api :: functionalities/ubsan/basic/TestUbsanBasic.py (1744 of 2137) PASS: lldb-unit :: Process/minidump/./LLDBMinidumpTests/MinidumpParserTest.GetLinuxProcStatus_no_stream (1745 of 2137) PASS: lldb-api :: commands/frame/diagnose/bad-reference/TestBadReference.py (1746 of 2137) PASS: lldb-shell :: Commands/command-target-modules-dump-sections.yaml (1747 of 2137) PASS: lldb-unit :: Utility/./UtilityTests/ScalarTest.Getters (1748 of 2137) PASS: lldb-unit :: Utility/./UtilityTests/FileSpecTest.RemoveLastPathComponent (1749 of 2137) PASS: lldb-unit :: ScriptInterpreter/Python/./ScriptInterpreterPythonTests/PythonDataObjectsTest.TestPythonTupleInitializerList2 (1750 of 2137) PASS: lldb-api :: tools/lldb-server/TestLldbGdbServer.py (1751 of 2137) PASS: lldb-api :: functionalities/target-new-solib-notifications/TestModuleLoadedNotifys.py (1752 of 2137) PASS: lldb-api :: functionalities/thread/exit_during_step/TestExitDuringStep.py (1753 of 2137) PASS: lldb-unit :: Utility/./UtilityTests/ArgsTest.DoubleQuotedItem (1754 of 2137) PASS: lldb-shell :: SymbolFile/DWARF/compilercontext.ll (1755 of 2137) PASS: lldb-api :: functionalities/gdb_remote_client/TestJLink6Armv7RegisterDefinition.py (1756 of 2137) PASS: lldb-shell :: SymbolFile/Breakpad/line-table-discontinuous-file-ids.test (1757 of 2137) PASS: lldb-unit :: Utility/./UtilityTests/RangeTest.Constructor (1758 of 2137) PASS: lldb-api :: lang/objc/objc-class-method/TestObjCClassMethod.py (1759 of 2137) PASS: lldb-api :: types/TestCharTypeExpr.py (1760 of 2137) PASS: lldb-api :: functionalities/thread/concurrent_events/TestConcurrentDelaySignalWatch.py (1761 of 2137) PASS: lldb-unit :: Process/minidump/./LLDBMinidumpTests/MinidumpParserTest.GetFilteredModuleList (1762 of 2137) PASS: lldb-api :: python_api/watchpoint/watchlocation/TestSetWatchlocation.py (1763 of 2137) UNSUPPORTED: lldb-api :: lang/objc/rdar-12408181/TestRdar12408181.py (1764 of 2137) PASS: lldb-api :: lang/objc/foundation/TestObjCMethodsNSError.py (1765 of 2137) PASS: lldb-api :: lang/objc/print-obj/TestPrintObj.py (1766 of 2137) PASS: lldb-unit :: ScriptInterpreter/Python/./ScriptInterpreterPythonTests/PythonDataObjectsTest.TestPythonInteger (1767 of 2137) PASS: lldb-shell :: Commands/CommandScriptImmediateOutput/CommandScriptImmediateOutputFile.test (1768 of 2137) PASS: lldb-api :: lang/objcxx/class-name-clash/TestNameClash.py (1769 of 2137) PASS: lldb-api :: lang/cpp/exceptions/TestCPPExceptionBreakpoints.py (1770 of 2137) PASS: lldb-unit :: Utility/./UtilityTests/ScalarTest.Scalar_512 (1771 of 2137) PASS: lldb-shell :: ObjectFile/ELF/compressed-sections.yaml (1772 of 2137) PASS: lldb-api :: commands/expression/namespace_local_var_same_name_cpp_and_c/TestNamespaceLocalVarSameNameCppAndC.py (1773 of 2137) PASS: lldb-api :: lang/objc/objc-builtin-types/TestObjCBuiltinTypes.py (1774 of 2137) PASS: lldb-api :: lang/cpp/const_this/TestConstThis.py (1775 of 2137) PASS: lldb-api :: tools/lldb-server/commandline/TestStubSetSID.py (1776 of 2137) PASS: lldb-api :: commands/process/attach/attach_denied/TestAttachDenied.py (1777 of 2137) PASS: lldb-shell :: ObjectFile/PECOFF/basic-info-arm.yaml (1778 of 2137) PASS: lldb-unit :: Expression/./ExpressionTests/DiagnosticManagerTest.FixedExpression (1779 of 2137) PASS: lldb-api :: lang/objc/objc-struct-argument/TestObjCStructArgument.py (1780 of 2137) PASS: lldb-shell :: ObjectFile/MachO/symtab.yaml (1781 of 2137) PASS: lldb-unit :: Host/./HostTests/Host.GetEnvironment (1782 of 2137) PASS: lldb-unit :: Symbol/./SymbolTests/SymbolsTest.TerminateLocateExecutableSymbolFileForUnknownExecutableAndUnknownSymbolFile (1783 of 2137) PASS: lldb-api :: commands/watchpoints/watchpoint_count/TestWatchpointCount.py (1784 of 2137) PASS: lldb-unit :: Utility/./UtilityTests/UriParserTest.BracketedHostnameWithColon (1785 of 2137) UNSUPPORTED: lldb-shell :: ScriptInterpreter/Lua/io.test (1786 of 2137) PASS: lldb-api :: commands/expression/pr35310/TestExprsBug35310.py (1787 of 2137) UNSUPPORTED: lldb-api :: commands/register/register/intel_xtended_registers/TestMPXRegisters.py (1788 of 2137) PASS: lldb-api :: functionalities/data-formatter/type_summary_list_arg/TestTypeSummaryListArg.py (1789 of 2137) PASS: lldb-api :: commands/watchpoints/multiple_hits/TestMultipleHits.py (1790 of 2137) PASS: lldb-unit :: Utility/./UtilityTests/StreamTest.AddressRangeSize (1791 of 2137) PASS: lldb-unit :: Utility/./UtilityTests/ScalarTest.LongLongAssigmentOperator (1792 of 2137) PASS: lldb-unit :: Utility/./UtilityTests/UserIDResolver.GetUserName (1793 of 2137) PASS: lldb-unit :: Expression/./ExpressionTests/CppModuleConfigurationTest.UnrelatedLibrary (1794 of 2137) PASS: lldb-api :: python_api/findvalue_duplist/TestSBFrameFindValue.py (1795 of 2137) PASS: lldb-unit :: Core/./LLDBCoreTests/MangledTest.NameIndexes_FindFunctionSymbols (1796 of 2137) PASS: lldb-unit :: Utility/./UtilityTests/RecordReplayTest.InstrumentedFoo (1797 of 2137) PASS: lldb-unit :: Utility/./UtilityTests/RangeTest.ContainsEndInclusiveInvalid (1798 of 2137) UNSUPPORTED: lldb-shell :: ObjectFile/ELF/minidebuginfo-no-lzma.yaml (1799 of 2137) PASS: lldb-unit :: Utility/./UtilityTests/ArgsTest.TestUnknownEscape (1800 of 2137) PASS: lldb-api :: functionalities/lazy-loading/TestLazyLoading.py (1801 of 2137) PASS: lldb-api :: commands/platform/basic/TestPlatformCommand.py (1802 of 2137) PASS: lldb-api :: commands/expression/calculator_mode/TestCalculatorMode.py (1803 of 2137) PASS: lldb-api :: macosx/find-dsym/bundle-with-dot-in-filename/TestBundleWithDotInFilename.py (1804 of 2137) PASS: lldb-unit :: Expression/./ExpressionTests/DWARFExpression.DW_OP_piece (1805 of 2137) PASS: lldb-api :: lang/cpp/covariant-return-types/TestCovariantReturnTypes.py (1806 of 2137) UNSUPPORTED: lldb-shell :: SymbolFile/PDB/class-layout.test (1807 of 2137) PASS: lldb-unit :: Utility/./UtilityTests/AnsiTerminal.AtEnd (1808 of 2137) PASS: lldb-unit :: Utility/./UtilityTests/BinaryStreamTest.PutULEB128MaxValue (1809 of 2137) PASS: lldb-api :: functionalities/data-formatter/data-formatter-skip-summary/TestDataFormatterSkipSummary.py (1810 of 2137) PASS: lldb-unit :: Utility/./UtilityTests/RegularExpression.CopyAssignment (1811 of 2137) PASS: lldb-api :: functionalities/gdb_remote_client/TestStopPCs.py (1812 of 2137) PASS: lldb-unit :: Host/./HostTests/ProcessLaunchInfoTest.Constructor (1813 of 2137) PASS: lldb-unit :: tools/lldb-server/tests/./LLDBServerTests/StandardStartupTest.TestStopReplyContainsThreadPcs (1814 of 2137) PASS: lldb-api :: functionalities/breakpoint/breakpoint_command/TestBreakpointCommandsFromPython.py (1815 of 2137) PASS: lldb-unit :: Utility/./UtilityTests/RegisterValueTest.GetSet8 (1816 of 2137) PASS: lldb-unit :: Process/gdb-remote/./ProcessGdbRemoteTests/GDBRemoteCommunicationServerTest.SendErrorResponse_Status (1817 of 2137) PASS: lldb-api :: types/TestFloatTypes.py (1818 of 2137) PASS: lldb-unit :: Utility/./UtilityTests/StringExtractorTest.GetNameColonValueSuccess (1819 of 2137) PASS: lldb-unit :: Host/./HostTests/SocketTest.UDPGetConnectURI (1820 of 2137) PASS: lldb-api :: lang/cpp/function-qualifiers/TestCppFunctionQualifiers.py (1821 of 2137) PASS: lldb-unit :: Utility/./UtilityTests/RegularExpression.Invalid (1822 of 2137) PASS: lldb-unit :: UnwindAssembly/x86/./UnwindAssemblyx86Tests/Testx86AssemblyInspectionEngine.TestSimple64bitFrameFunction (1823 of 2137) PASS: lldb-unit :: Utility/./UtilityTests/FileSpecTest.OperatorBool (1824 of 2137) PASS: lldb-api :: functionalities/multidebugger_commands/TestMultipleDebuggersCommands.py (1825 of 2137) PASS: lldb-api :: commands/expression/test/TestExprs.py (1826 of 2137) PASS: lldb-shell :: SymbolFile/Breakpad/line-table.test (1827 of 2137) PASS: lldb-unit :: Expression/./ExpressionTests/CppModuleConfigurationTest.UnknownLibCppFile (1828 of 2137) PASS: lldb-shell :: Settings/TestDisableColor.test (1829 of 2137) PASS: lldb-api :: commands/expression/formatters/TestFormatters.py (1830 of 2137) PASS: lldb-unit :: Utility/./UtilityTests/StringExtractorTest.GetHexU8_Underflow2_NoEof (1831 of 2137) PASS: lldb-api :: commands/expression/dollar-in-variable/TestDollarInVariable.py (1832 of 2137) PASS: lldb-unit :: Utility/./UtilityTests/CompletionRequest.Constructor (1833 of 2137) PASS: lldb-unit :: Utility/./UtilityTests/RangeTest.SizeTypes (1834 of 2137) PASS: lldb-unit :: Utility/./UtilityTests/FileSpecTest.GetPath (1835 of 2137) PASS: lldb-api :: functionalities/thread/concurrent_events/TestConcurrentBreakpointDelayBreakpointOneSignal.py (1836 of 2137) PASS: lldb-unit :: Utility/./UtilityTests/ProcessInstanceInfoList.Yaml (1837 of 2137) PASS: lldb-api :: lang/cpp/diamond/TestDiamond.py (1838 of 2137) PASS: lldb-unit :: Utility/./UtilityTests/DataExtractorTest.UncommonAddressSize (1839 of 2137) PASS: lldb-api :: commands/expression/import-std-module/forward_list/TestForwardListFromStdModule.py (1840 of 2137) PASS: lldb-shell :: Reproducer/Functionalities/TestDataFormatter.test (1841 of 2137) PASS: lldb-unit :: Utility/./UtilityTests/StringListTest.JoinNonSpace (1842 of 2137) PASS: lldb-unit :: Utility/./UtilityTests/ListenerTest.GetEventImmediate (1843 of 2137) PASS: lldb-unit :: Utility/./UtilityTests/StringListTest.JoinEmpty (1844 of 2137) PASS: lldb-api :: functionalities/data-formatter/data-formatter-objc/TestDataFormatterObjCNSBundle.py (1845 of 2137) PASS: lldb-shell :: ObjectFile/MachO/subsections.yaml (1846 of 2137) PASS: lldb-api :: types/TestLongTypesExpr.py (1847 of 2137) PASS: lldb-unit :: Expression/./ExpressionTests/CppModuleConfigurationTest.Xcode (1848 of 2137) PASS: lldb-api :: sanity/TestModuleCacheSanity.py (1849 of 2137) PASS: lldb-api :: lang/c/stepping/TestStepAndBreakpoints.py (1850 of 2137) PASS: lldb-api :: tools/lldb-vscode/console/TestVSCode_console.py (1851 of 2137) PASS: lldb-unit :: Utility/./UtilityTests/DataExtractorTest.GetFloatUnaligned (1852 of 2137) PASS: lldb-api :: arm/emulation/TestEmulations.py (1853 of 2137) PASS: lldb-unit :: Utility/./UtilityTests/Flags.AllSet (1854 of 2137) PASS: lldb-api :: python_api/sbstructureddata/TestStructuredDataAPI.py (1855 of 2137) PASS: lldb-shell :: SymbolFile/DWARF/gnu-style-compression.cpp (1856 of 2137) PASS: lldb-shell :: Reproducer/TestDebugSymbols.test (1857 of 2137) UNSUPPORTED: lldb-api :: benchmarks/libcxxmap/TestBenchmarkLibcxxMap.py (1858 of 2137) PASS: lldb-api :: commands/breakpoint/command/list/TestBreakpointCommandList.py (1859 of 2137) PASS: lldb-api :: functionalities/data-formatter/synthcapping/TestSyntheticCapping.py (1860 of 2137) PASS: lldb-unit :: Utility/./UtilityTests/StringExtractorTest.GetNameColonValueNoSemicolon (1861 of 2137) PASS: lldb-shell :: SymbolFile/DWARF/debug-names-compressed.cpp (1862 of 2137) PASS: lldb-unit :: Utility/./UtilityTests/StringListTest.AppendStringCString (1863 of 2137) PASS: lldb-unit :: Process/gdb-remote/./ProcessGdbRemoteTests/GDBRemoteCommunicationClientTest.SendSignalsToIgnore (1864 of 2137) PASS: lldb-unit :: Language/CLanguages/./LanguageCLanguagesTests/CLanguages.LookupCLanguagesByLanguageType (1865 of 2137) PASS: lldb-unit :: Expression/./ExpressionTests/ClangExpressionDeclMapTest.TestUnknownIdentifierLookup (1866 of 2137) PASS: lldb-api :: commands/expression/namespace_local_var_same_name_obj_c/TestNamespaceLocalVarSameNameObjC.py (1867 of 2137) PASS: lldb-api :: macosx/load-kext/TestLoadKext.py (1868 of 2137) PASS: lldb-unit :: Core/./LLDBCoreTests/CommunicationTest.SynchronizeWhileClosing (1869 of 2137) PASS: lldb-api :: functionalities/abbreviation/TestAbbreviations.py (1870 of 2137) PASS: lldb-unit :: ScriptInterpreter/Python/./ScriptInterpreterPythonTests/PythonDataObjectsTest.TestExceptions (1871 of 2137) PASS: lldb-unit :: Utility/./UtilityTests/ConstStringTest.CompareStringRef (1872 of 2137) PASS: lldb-api :: functionalities/breakpoint/dummy_target_breakpoints/TestBreakpointsWithNoTargets.py (1873 of 2137) PASS: lldb-api :: functionalities/data-formatter/data-formatter-stl/libcxx/set/TestDataFormatterLibcxxSet.py (1874 of 2137) PASS: lldb-shell :: ObjectFile/ELF/PT_LOAD-overlap-section.yaml (1875 of 2137) UNSUPPORTED: lldb-shell :: SymbolFile/PDB/pointers.test (1876 of 2137) PASS: lldb-unit :: Utility/./UtilityTests/DataExtractorTest.GetULEB128_bit63 (1877 of 2137) PASS: lldb-unit :: ScriptInterpreter/Python/./ScriptInterpreterPythonTests/PythonDataObjectsTest.TestModuleNameResolutionNoDot (1878 of 2137) PASS: lldb-api :: lang/cpp/static_methods/TestCPPStaticMethods.py (1879 of 2137) PASS: lldb-unit :: Symbol/./SymbolTests/TestTypeSystemClang.TestGetEnumIntegerTypeInvalid (1880 of 2137) PASS: lldb-api :: lang/cpp/lambdas/TestLambdas.py (1881 of 2137) PASS: lldb-unit :: Expression/./ExpressionTests/DiagnosticManagerTest.GetStringPreserveOrder (1882 of 2137) PASS: lldb-api :: lang/c/const_variables/TestConstVariables.py (1883 of 2137) PASS: lldb-unit :: Host/./HostTests/SocketTest.TCPListen0GetPort (1884 of 2137) PASS: lldb-api :: functionalities/gdb_remote_client/TestRegDefinitionInParts.py (1885 of 2137) PASS: lldb-api :: functionalities/thread/concurrent_events/TestConcurrentDelaySignalBreak.py (1886 of 2137) PASS: lldb-shell :: Reproducer/TestMultipleTargets.test (1887 of 2137) PASS: lldb-api :: commands/thread/select/TestThreadSelect.py (1888 of 2137) PASS: lldb-shell :: Minidump/no-process-id.yaml (1889 of 2137) PASS: lldb-unit :: Platform/./LLDBPlatformTests/PlatformAppleSimulatorTest.TestSimHasSimEnvionament (1890 of 2137) PASS: lldb-shell :: Driver/TestUseColor.test (1891 of 2137) PASS: lldb-shell :: Commands/command-regex-delete.test (1892 of 2137) PASS: lldb-api :: python_api/disassemble-raw-data/TestDisassemble_VST1_64.py (1893 of 2137) PASS: lldb-api :: commands/apropos/with-process/TestAproposWithProcess.py (1894 of 2137) PASS: lldb-unit :: UnwindAssembly/x86/./UnwindAssemblyx86Tests/Testx86AssemblyInspectionEngine.TestPushEDX (1895 of 2137) PASS: lldb-unit :: Utility/./UtilityTests/RangeTest.Equal (1896 of 2137) PASS: lldb-api :: python_api/frame/TestFrames.py (1897 of 2137) PASS: lldb-unit :: Utility/./UtilityTests/ConstStringTest.format_provider (1898 of 2137) PASS: lldb-unit :: Utility/./UtilityTests/LogTest.LLDB_LOG_nullptr (1899 of 2137) UNSUPPORTED: lldb-api :: functionalities/darwin_log/source/debug/TestDarwinLogSourceDebug.py (1900 of 2137) PASS: lldb-unit :: Utility/./UtilityTests/ScalarTest.GetBytes (1901 of 2137) PASS: lldb-api :: types/TestShortTypeExpr.py (1902 of 2137) PASS: lldb-api :: commands/expression/completion-crash-incomplete-record/TestCompletionCrashIncompleteRecord.py (1903 of 2137) PASS: lldb-api :: functionalities/thread/concurrent_events/TestConcurrentTwoWatchpointThreads.py (1904 of 2137) PASS: lldb-unit :: Utility/./UtilityTests/StreamTest.AddressNoSuffix (1905 of 2137) PASS: lldb-unit :: Interpreter/./InterpreterTests/CompletionTest.DirCompletionAbsolute (1906 of 2137) PASS: lldb-api :: functionalities/data-formatter/language_category_updates/TestDataFormatterLanguageCategoryUpdates.py (1907 of 2137) PASS: lldb-unit :: Disassembler/./DisassemblerTests/TestArmv7Disassembly.TestCortexFPDisass (1908 of 2137) PASS: lldb-unit :: Utility/./UtilityTests/StateTest.Formatv (1909 of 2137) PASS: lldb-api :: functionalities/signal/raise/TestRaise.py (1910 of 2137) PASS: lldb-shell :: Settings/TestFrameFormatNoColor.test (1911 of 2137) PASS: lldb-shell :: Watchpoint/SetErrorCases.test (1912 of 2137) PASS: lldb-unit :: Process/minidump/./LLDBMinidumpTests/MinidumpParserTest.GetMiscInfo_no_stream (1913 of 2137) PASS: lldb-unit :: Utility/./UtilityTests/OptionsWithRawTest.QuotedSuffix (1914 of 2137) PASS: lldb-unit :: ScriptInterpreter/Python/./ScriptInterpreterPythonTests/PythonDataObjectsTest.TestPythonTupleToStructuredList (1915 of 2137) PASS: lldb-api :: lang/cpp/unique-types/TestUniqueTypes.py (1916 of 2137) UNSUPPORTED: lldb-shell :: BuildScript/toolchain-msvc.test (1917 of 2137) PASS: lldb-unit :: Utility/./UtilityTests/StreamTest.PutBytesAsRawHex8ToBigEndian (1918 of 2137) PASS: lldb-shell :: BuildScript/compiler-full-path.test (1919 of 2137) PASS: lldb-unit :: UnwindAssembly/x86/./UnwindAssemblyx86Tests/Testx86AssemblyInspectionEngine.Test64bitFramelessSmallStackFrame (1920 of 2137) PASS: lldb-unit :: Utility/./UtilityTests/FileSpecTest.CopyByAppendingPathComponent (1921 of 2137) PASS: lldb-unit :: Expression/./ExpressionTests/DiagnosticManagerTest.GetStringSeverityLabels (1922 of 2137) PASS: lldb-unit :: Utility/./UtilityTests/DataExtractorTest.GetDouble (1923 of 2137) PASS: lldb-unit :: Utility/./UtilityTests/StringExtractorTest.InitMisc (1924 of 2137) UNSUPPORTED: lldb-api :: tools/lldb-server/signal-filtering/TestGdbRemote_QPassSignals.py (1925 of 2137) PASS: lldb-unit :: Utility/./UtilityTests/FileSpecTest.FileAndDirectoryComponents (1926 of 2137) UNSUPPORTED: lldb-api :: commands/watchpoints/multi_watchpoint_slots/TestWatchpointMultipleSlots.py (1927 of 2137) PASS: lldb-unit :: Utility/./UtilityTests/StringExtractorTest.GetHexBytes_FullString (1928 of 2137) UNSUPPORTED: lldb-shell :: Breakpoint/case-insensitive.test (1929 of 2137) PASS: lldb-unit :: Utility/./UtilityTests/AnsiTerminal.Unknown (1930 of 2137) PASS: lldb-unit :: UnwindAssembly/x86/./UnwindAssemblyx86Tests/Testx86AssemblyInspectionEngine.TestDisassemblyJunkBytes (1931 of 2137) PASS: lldb-unit :: Process/gdb-remote/./ProcessGdbRemoteTests/GDBRemoteCommunicationClientTest.SendGetMetaDataPacket (1932 of 2137) PASS: lldb-api :: commands/target/stop-hooks/TestStopHooks.py (1933 of 2137) PASS: lldb-unit :: SymbolFile/NativePDB/./SymbolFileNativePDBTests/PDBFPOProgramToDWARFExpressionTests.UnresolvedCyclicRegisterAssignmentReference (1934 of 2137) PASS: lldb-api :: functionalities/thread/concurrent_events/TestConcurrentWatchBreak.py (1935 of 2137) PASS: lldb-api :: lang/objc/conflicting-definition/TestConflictingDefinition.py (1936 of 2137) PASS: lldb-api :: lang/cpp/operators/TestCppOperators.py (1937 of 2137) PASS: lldb-unit :: Expression/./ExpressionTests/CppModuleConfigurationTest.MissingUsrInclude (1938 of 2137) PASS: lldb-unit :: UnwindAssembly/x86/./UnwindAssemblyx86Tests/Testx86AssemblyInspectionEngine.TestPushImm (1939 of 2137) PASS: lldb-unit :: SymbolFile/NativePDB/./SymbolFileNativePDBTests/PDBFPOProgramToDWARFExpressionTests.SingleAssignmentRegisterRef (1940 of 2137) PASS: lldb-api :: lang/cpp/namespace_conflicts/TestNamespaceConflicts.py (1941 of 2137) PASS: lldb-unit :: Core/./LLDBCoreTests/RichManglingContextTest.Basic (1942 of 2137) PASS: lldb-unit :: ScriptInterpreter/Python/./ScriptInterpreterPythonTests/PythonDataObjectsTest.TestBorrowedReferences (1943 of 2137) PASS: lldb-unit :: Utility/./UtilityTests/ArgsTest.GetQuotedCommandString (1944 of 2137) PASS: lldb-api :: functionalities/fat_archives/TestFatArchives.py (1945 of 2137) PASS: lldb-unit :: SymbolFile/NativePDB/./SymbolFileNativePDBTests/PDBFPOProgramToDWARFExpressionTests.UnsupportedRASearch (1946 of 2137) PASS: lldb-api :: lang/cpp/unsigned_types/TestUnsignedTypes.py (1947 of 2137) PASS: lldb-api :: functionalities/data-formatter/pyobjsynthprovider/TestPyObjSynthProvider.py (1948 of 2137) PASS: lldb-unit :: UnwindAssembly/x86/./UnwindAssemblyx86Tests/Testx86AssemblyInspectionEngine.Test64bitFramelessBigStackFrame (1949 of 2137) PASS: lldb-unit :: Utility/./UtilityTests/RangeTest.Clear (1950 of 2137) PASS: lldb-api :: commands/command/script/import/TestImport.py (1951 of 2137) PASS: lldb-shell :: Breakpoint/dummy-target.test (1952 of 2137) PASS: lldb-shell :: Minidump/disassemble-no-module.yaml (1953 of 2137) PASS: lldb-unit :: Utility/./UtilityTests/EnvironmentTest.EnvpConversion (1954 of 2137) PASS: lldb-shell :: SymbolFile/NativePDB/function-types-builtins.cpp (1955 of 2137) PASS: lldb-api :: commands/expression/completion-in-lambda-and-unnamed-class/TestCompletionInLambdaAndUnnamedClass.py (1956 of 2137) PASS: lldb-api :: lang/c/shared_lib_stripped_symbols/TestSharedLibStrippedSymbols.py (1957 of 2137) PASS: lldb-unit :: SymbolFile/DWARF/./SymbolFileDWARFTests/SymbolFileDWARFTests.ParseArangesNonzeroSegmentSize (1958 of 2137) PASS: lldb-api :: types/TestRecursiveTypes.py (1959 of 2137) PASS: lldb-unit :: Symbol/./SymbolTests/TestClangASTImporter.CopyTypeTagDecl (1960 of 2137) PASS: lldb-shell :: Commands/command-source.test (1961 of 2137) PASS: lldb-api :: commands/process/launch/TestProcessLaunch.py (1962 of 2137) UNSUPPORTED: lldb-api :: functionalities/unwind/standard/TestStandardUnwind.py (1963 of 2137) PASS: lldb-api :: lang/c/modules/TestCModules.py (1964 of 2137) PASS: lldb-unit :: Symbol/./SymbolTests/Type.GetTypeScopeAndBasename (1965 of 2137) PASS: lldb-unit :: Utility/./UtilityTests/XcodeSDKTest.GetCanonicalNameAndConstruct (1966 of 2137) PASS: lldb-unit :: Utility/./UtilityTests/UUIDTest.Validity (1967 of 2137) PASS: lldb-api :: functionalities/tsan/thread_leak/TestTsanThreadLeak.py (1968 of 2137) PASS: lldb-unit :: Utility/./UtilityTests/ArgsTest.TestArgv (1969 of 2137) PASS: lldb-unit :: ScriptInterpreter/Python/./ScriptInterpreterPythonTests/PythonDataObjectsTest.TestPythonTupleInitializerList (1970 of 2137) UNSUPPORTED: lldb-api :: benchmarks/startup/TestStartupDelays.py (1971 of 2137) PASS: lldb-unit :: UnwindAssembly/x86/./UnwindAssemblyx86Tests/Testx86AssemblyInspectionEngine.TestPushR13 (1972 of 2137) PASS: lldb-shell :: Driver/TestFile.test (1973 of 2137) PASS: lldb-api :: commands/watchpoints/watchpoint_on_vectors/TestValueOfVectorVariable.py (1974 of 2137) PASS: lldb-shell :: ScriptInterpreter/Python/sb_address_exception.test (1975 of 2137) PASS: lldb-shell :: SymbolFile/NativePDB/function-types-calling-conv.cpp (1976 of 2137) PASS: lldb-unit :: Symbol/./SymbolTests/TestTypeSystemClang.TestBuiltinTypeForEncodingAndBitSize (1977 of 2137) PASS: lldb-shell :: Register/x86-64-ymm-read.test (1978 of 2137) PASS: lldb-api :: functionalities/thread/crash_during_step/TestCrashDuringStep.py (1979 of 2137) PASS: lldb-shell :: Driver/TestPositionalArgs.test (1980 of 2137) PASS: lldb-unit :: UnwindAssembly/x86/./UnwindAssemblyx86Tests/Testx86AssemblyInspectionEngine.TestSimple32bitFrameFunction (1981 of 2137) PASS: lldb-api :: functionalities/data-formatter/data-formatter-objc/TestDataFormatterObjCPlain.py (1982 of 2137) PASS: lldb-api :: functionalities/gdb_remote_client/TestWriteMemory.py (1983 of 2137) PASS: lldb-unit :: Utility/./UtilityTests/StructuredDataTest.ParseJSONFromFile (1984 of 2137) UNSUPPORTED: lldb-api :: lang/c/typedef/Testtypedef.py (1985 of 2137) PASS: lldb-api :: lang/cpp/gmodules/TestWithModuleDebugging.py (1986 of 2137) PASS: lldb-shell :: ObjectFile/wasm/stripped-debug-sections.yaml (1987 of 2137) UNSUPPORTED: lldb-api :: functionalities/data-formatter/data-formatter-stl/libstdcpp/string/TestDataFormatterStdString.py (1988 of 2137) PASS: lldb-unit :: API/./APITests/SBCommandInterpreterTest.SingleWordCommand (1989 of 2137) PASS: lldb-unit :: Utility/./UtilityTests/StringListTest.Join (1990 of 2137) PASS: lldb-unit :: Utility/./UtilityTests/StringExtractorTest.GetHexBytesAvail_FullString (1991 of 2137) PASS: lldb-unit :: UnwindAssembly/x86/./UnwindAssemblyx86Tests/Testx86AssemblyInspectionEngine.TestPopRBX (1992 of 2137) UNSUPPORTED: lldb-shell :: Register/aarch64-gp-read.test (1993 of 2137) PASS: lldb-shell :: SymbolFile/DWARF/dir-separator-no-comp-dir.s (1994 of 2137) PASS: lldb-unit :: Utility/./UtilityTests/FileSpecTest.Equal (1995 of 2137) PASS: lldb-unit :: Utility/./UtilityTests/StringLexerTest.AdvanceIf (1996 of 2137) PASS: lldb-unit :: UnwindAssembly/x86/./UnwindAssemblyx86Tests/Testx86AssemblyInspectionEngine.TestStackRealign32BitDisp_x86_64 (1997 of 2137) PASS: lldb-shell :: SymbolFile/symbol-binding.test (1998 of 2137) PASS: lldb-shell :: Minidump/dump-all.test (1999 of 2137) PASS: lldb-api :: lang/objc/foundation/TestFoundationDisassembly.py (2000 of 2137) PASS: lldb-shell :: SymbolFile/DWARF/DW_AT_const_value.s (2001 of 2137) PASS: lldb-unit :: ObjectFile/PECOFF/./ObjectFilePECOFFTests/PECallFrameInfoTest.Chained_eh (2002 of 2137) PASS: lldb-unit :: UnwindAssembly/x86/./UnwindAssemblyx86Tests/Testx86AssemblyInspectionEngine.TestSubRSP (2003 of 2137) PASS: lldb-api :: functionalities/mtc/simple/TestMTCSimple.py (2004 of 2137) PASS: lldb-api :: functionalities/breakpoint/step_over_breakpoint/TestStepOverBreakpoint.py (2005 of 2137) PASS: lldb-api :: commands/expression/persist_objc_pointeetype/TestPersistObjCPointeeType.py (2006 of 2137) PASS: lldb-shell :: Commands/command-regex-unalias.test (2007 of 2137) PASS: lldb-api :: functionalities/data-formatter/data-formatter-categories/TestDataFormatterCategories.py (2008 of 2137) PASS: lldb-unit :: SymbolFile/NativePDB/./SymbolFileNativePDBTests/PDBFPOProgramToDWARFExpressionTests.DependencyChain (2009 of 2137) PASS: lldb-api :: python_api/get-value-32bit-int/TestGetValue32BitInt.py (2010 of 2137) UNSUPPORTED: lldb-api :: benchmarks/expression/TestExpressionCmd.py (2011 of 2137) PASS: lldb-unit :: ScriptInterpreter/Python/./ScriptInterpreterPythonTests/PythonDataObjectsTest.TestPythonString (2012 of 2137) PASS: lldb-api :: commands/expression/persistent_variables/TestPersistentVariables.py (2013 of 2137) PASS: lldb-unit :: Utility/./UtilityTests/FileSpecTest.EqualDotsWindows (2014 of 2137) PASS: lldb-unit :: Utility/./UtilityTests/RangeTest.Copy (2015 of 2137) PASS: lldb-unit :: Utility/./UtilityTests/LogChannelTest.Enable (2016 of 2137) PASS: lldb-api :: lang/objc/foundation/TestObjCMethods.py (2017 of 2137) PASS: lldb-unit :: Utility/./UtilityTests/BinaryStreamTest.PutULEB128FiveBytes (2018 of 2137) PASS: lldb-unit :: Utility/./UtilityTests/UUIDTest.SetFromStringRef (2019 of 2137) PASS: lldb-shell :: Reproducer/Functionalities/TestStepping.test (2020 of 2137) UNSUPPORTED: lldb-shell :: ScriptInterpreter/Lua/bindings.test (2021 of 2137) PASS: lldb-api :: lang/cpp/operator-overload/TestOperatorOverload.py (2022 of 2137) PASS: lldb-unit :: Language/CPlusPlus/./LanguageCPlusPlusTests/CPlusPlusLanguage.MethodNameParsing (2023 of 2137) PASS: lldb-unit :: SymbolFile/NativePDB/./SymbolFileNativePDBTests/PDBFPOProgramToDWARFExpressionTests.InvalidAssignmentMultiple (2024 of 2137) PASS: lldb-unit :: Utility/./UtilityTests/ScalarTest.TruncOrExtendTo (2025 of 2137) PASS: lldb-api :: iohandler/completion/TestIOHandlerCompletion.py (2026 of 2137) PASS: lldb-shell :: SymbolFile/DWARF/find-variable-file.cpp (2027 of 2137) PASS: lldb-unit :: Utility/./UtilityTests/RangeTest.ClearWithStarAddress (2028 of 2137) PASS: lldb-unit :: Utility/./UtilityTests/ScalarTest.GetValue (2029 of 2137) PASS: lldb-unit :: Utility/./UtilityTests/StringListTest.AppendList (2030 of 2137) PASS: lldb-unit :: Utility/./UtilityTests/BinaryStreamTest.PutSLEB128NineBytes (2031 of 2137) PASS: lldb-api :: python_api/value/TestValueAPI.py (2032 of 2137) PASS: lldb-unit :: Utility/./UtilityTests/StringExtractorTest.GetHexU8_Exact_NoEof (2033 of 2137) PASS: lldb-unit :: Target/./TargetTests/RemoteAwarePlatformTest.TestResolveExecutabelOnClientByPlatform (2034 of 2137) PASS: lldb-api :: functionalities/thread/thread_specific_break/TestThreadSpecificBreakpoint.py (2035 of 2137) PASS: lldb-api :: functionalities/asan/TestMemoryHistory.py (2036 of 2137) PASS: lldb-api :: functionalities/data-formatter/data-formatter-stl/libcxx/list/loop/TestDataFormatterLibcxxListLoop.py (2037 of 2137) PASS: lldb-shell :: SymbolFile/DWARF/inline-function-address-shared.test (2038 of 2137) PASS: lldb-unit :: Utility/./UtilityTests/StringExtractorTest.GetHexU8_Underflow_NoEof (2039 of 2137) PASS: lldb-api :: commands/expression/fixits/TestFixIts.py (2040 of 2137) PASS: lldb-unit :: Utility/./UtilityTests/StreamTest.PutRawBytesToLittleEndian (2041 of 2137) PASS: lldb-api :: lang/cpp/scope/TestCppScope.py (2042 of 2137) PASS: lldb-shell :: ObjectFile/Breakpad/uuid-matching-mac.test (2043 of 2137) PASS: lldb-unit :: Host/./HostTests/SocketTest.DomainListenConnectAccept (2044 of 2137) PASS: lldb-unit :: Process/gdb-remote/./ProcessGdbRemoteTests/GDBRemoteClientBaseTest.SendContinueDelegateInterface (2045 of 2137) PASS: lldb-unit :: ScriptInterpreter/Python/./ScriptInterpreterPythonTests/PythonDataObjectsTest.TestPythonIntegerToStructuredInteger (2046 of 2137) PASS: lldb-unit :: Expression/./ExpressionTests/CppModuleConfigurationTest.LinuxLocalLibCpp (2047 of 2137) PASS: lldb-unit :: Expression/./ExpressionTests/ClangHostTest.ComputeClangResourceDirectory (2048 of 2137) PASS: lldb-api :: functionalities/ptr_refs/TestPtrRefs.py (2049 of 2137) PASS: lldb-api :: functionalities/breakpoint/serialize/TestBreakpointSerialization.py (2050 of 2137) PASS: lldb-shell :: ObjectFile/ELF/PT_LOAD.yaml (2051 of 2137) PASS: lldb-unit :: Utility/./UtilityTests/StreamTest.AddressRange (2052 of 2137) PASS: lldb-unit :: Utility/./UtilityTests/SubsystemRAIITest.NormalSubsystem (2053 of 2137) PASS: lldb-api :: lang/cpp/template/TestTemplateArgs.py (2054 of 2137) PASS: lldb-unit :: Utility/./UtilityTests/StringListTest.JoinSingle (2055 of 2137) PASS: lldb-api :: functionalities/postmortem/netbsd-core/TestNetBSDCore.py (2056 of 2137) PASS: lldb-shell :: Reproducer/Modules/TestModuleCXX.test (2057 of 2137) PASS: lldb-api :: lang/c/blocks/TestBlocks.py (2058 of 2137) PASS: lldb-unit :: SymbolFile/DWARF/./SymbolFileDWARFTests/SymbolFileDWARFTests.TestAbilitiesForDWARF (2059 of 2137) PASS: lldb-unit :: Core/./LLDBCoreTests/SourceFileCache.FindSourceFileFound (2060 of 2137) PASS: lldb-unit :: Utility/./UtilityTests/StreamTest.PutSLEB128 (2061 of 2137) PASS: lldb-api :: functionalities/tsan/multiple/TestTsanMultiple.py (2062 of 2137) UNSUPPORTED: lldb-api :: functionalities/process_save_core/TestProcessSaveCore.py (2063 of 2137) PASS: lldb-api :: functionalities/breakpoint/breakpoint_language/TestBreakpointLanguage.py (2064 of 2137) PASS: lldb-shell :: SymbolFile/DWARF/inline-function-address.ll (2065 of 2137) PASS: lldb-api :: functionalities/data-formatter/data-formatter-named-summaries/TestDataFormatterNamedSummaries.py (2066 of 2137) PASS: lldb-unit :: Target/./TargetTests/ModuleCacheTest.GetAndPutStrangeHostname (2067 of 2137) PASS: lldb-unit :: Utility/./UtilityTests/PassiveReplayTest.InstrumentedBar (2068 of 2137) PASS: lldb-api :: functionalities/step_scripted/TestStepScripted.py (2069 of 2137) PASS: lldb-unit :: UnwindAssembly/x86/./UnwindAssemblyx86Tests/Testx86AssemblyInspectionEngine.TestPushEBP (2070 of 2137) PASS: lldb-unit :: Utility/./UtilityTests/StreamTest.SetIndentLevel (2071 of 2137) UNSUPPORTED: lldb-api :: tools/lldb-server/libraries-svr4/TestGdbRemoteLibrariesSvr4Support.py (2072 of 2137) PASS: lldb-api :: functionalities/data-formatter/data-formatter-stl/libcxx/optional/TestDataFormatterLibcxxOptional.py (2073 of 2137) UNSUPPORTED: lldb-shell :: Register/x86-gp-read.test (2074 of 2137) PASS: lldb-api :: functionalities/data-formatter/data-formatter-synth/TestDataFormatterSynth.py (2075 of 2137) PASS: lldb-api :: python_api/default-constructor/TestDefaultConstructorForAPIObjects.py (2076 of 2137) PASS: lldb-unit :: Utility/./UtilityTests/OptionsWithRawTest.WhitespaceSuffix (2077 of 2137) PASS: lldb-unit :: Utility/./UtilityTests/UriParserTest.Minimal (2078 of 2137) PASS: lldb-unit :: SymbolFile/NativePDB/./SymbolFileNativePDBTests/PDBFPOProgramToDWARFExpressionTests.UnresolvedDependentCyclicRegisterAssignmentReference (2079 of 2137) PASS: lldb-shell :: ObjectFile/ELF/section-permissions.yaml (2080 of 2137) PASS: lldb-api :: functionalities/breakpoint/cpp_exception/TestCPPExceptionBreakpoint.py (2081 of 2137) PASS: lldb-unit :: Utility/./UtilityTests/UriParserTest.LongPath (2082 of 2137) PASS: lldb-api :: functionalities/thread/ignore_suspended/TestIgnoreSuspendedThread.py (2083 of 2137) PASS: lldb-shell :: ObjectFile/PECOFF/uuid.yaml (2084 of 2137) PASS: lldb-shell :: SymbolFile/dissassemble-entry-point.s (2085 of 2137) PASS: lldb-api :: functionalities/data-formatter/data-formatter-objc/TestDataFormatterObjCCF.py (2086 of 2137) PASS: lldb-shell :: Driver/TestSingleQuote.test (2087 of 2137) PASS: lldb-unit :: ScriptInterpreter/Python/./ScriptInterpreterPythonTests/PythonDataObjectsTest.TestPythonCallableCheck (2088 of 2137) PASS: lldb-shell :: ObjectFile/wasm/unified-debug-sections.yaml (2089 of 2137) PASS: lldb-shell :: SymbolFile/DWARF/dwarf5_locations.s (2090 of 2137) PASS: lldb-unit :: Language/CPlusPlus/./LanguageCPlusPlusTests/CPlusPlusLanguage.CPlusPlusNameParser (2091 of 2137) PASS: lldb-api :: functionalities/data-formatter/data-formatter-objc/cmtime/TestDataFormatterCMTime.py (2092 of 2137) PASS: lldb-unit :: Symbol/./SymbolTests/TestClangASTImporter.CanImportInvalidType (2093 of 2137) PASS: lldb-api :: types/TestDoubleTypes.py (2094 of 2137) PASS: lldb-api :: commands/expression/static-initializers/TestStaticInitializers.py (2095 of 2137) PASS: lldb-api :: assert_messages_test/TestAssertMessages.py (2096 of 2137) PASS: lldb-api :: commands/expression/codegen-crash-typedefdecl-not-in_declcontext/TestCodegenCrashTypedefDeclNotInDeclContext.py (2097 of 2137) PASS: lldb-unit :: Thread/./ThreadTests/ThreadTest.SetStopInfo (2098 of 2137) PASS: lldb-api :: functionalities/thread/concurrent_events/TestConcurrentTwoWatchpointsOneDelayBreakpoint.py (2099 of 2137) UNSUPPORTED: lldb-api :: commands/watchpoints/hello_watchlocation/TestWatchLocation.py (2100 of 2137) PASS: lldb-unit :: Utility/./UtilityTests/StringExtractorTest.GetHexBytesAvail_OddPair2 (2101 of 2137) PASS: lldb-shell :: Reproducer/TestPythonImport.test (2102 of 2137) PASS: lldb-unit :: Utility/./UtilityTests/StreamTeeTest.Write (2103 of 2137) PASS: lldb-api :: functionalities/avoids-fd-leak/TestFdLeak.py (2104 of 2137) UNSUPPORTED: lldb-api :: commands/target/auto-install-main-executable/TestAutoInstallMainExecutable.py (2105 of 2137) PASS: lldb-unit :: Process/gdb-remote/./ProcessGdbRemoteTests/GDBRemoteClientBaseTest.SendContinueAndInterrupt2PacketBug (2106 of 2137) PASS: lldb-unit :: DataFormatter/./LLDBFormatterTests/FormatManagerTests.CompatibleLangs (2107 of 2137) PASS: lldb-unit :: Utility/./UtilityTests/RangeTest.Union (2108 of 2137) PASS: lldb-api :: lang/cpp/function_refs/TestFunctionRefs.py (2109 of 2137) PASS: lldb-shell :: SymbolFile/NativePDB/break-by-line.cpp (2110 of 2137) PASS: lldb-unit :: Utility/./UtilityTests/XcodeSDKTest.ParseTest (2111 of 2137) PASS: lldb-unit :: Utility/./UtilityTests/ArchSpecTest.TestParseMachCPUDashSubtypeTripleExtra (2112 of 2137) PASS: lldb-unit :: Language/Highlighting/./HighlighterTests/HighlighterTest.HighlighterSelectionPath (2113 of 2137) PASS: lldb-api :: commands/expression/entry-bp/TestExprEntryBP.py (2114 of 2137) PASS: lldb-unit :: Host/./HostTests/ConnectionFileDescriptorTest.TCPGetURIv4 (2115 of 2137) UNSUPPORTED: lldb-api :: functionalities/thread/concurrent_events/TestConcurrentManySignals.py (2116 of 2137) PASS: lldb-api :: lang/cpp/typedef/TestCppTypedef.py (2117 of 2137) PASS: lldb-unit :: Core/./LLDBCoreTests/ModuleSpecTest.InvalidInMemoryBufferValidFile (2118 of 2137) PASS: lldb-api :: functionalities/data-formatter/data-formatter-script/TestDataFormatterScript.py (2119 of 2137) PASS: lldb-unit :: Utility/./UtilityTests/UriParserTest.SchemeHostSeparator (2120 of 2137) PASS: lldb-shell :: SymbolFile/DWARF/debug_rnglists-dwo.s (2121 of 2137) PASS: lldb-unit :: Utility/./UtilityTests/StringLexerTest.Peek (2122 of 2137) PASS: lldb-shell :: ObjectFile/Breakpad/sections-trailing-func.test (2123 of 2137) PASS: lldb-api :: lang/cpp/call-function/TestCallCPPFunction.py (2124 of 2137) UNSUPPORTED: lldb-api :: commands/expression/completion-crash-invalid-iterator/TestInvalidIteratorCompletionCrash.py (2125 of 2137) PASS: lldb-unit :: Utility/./UtilityTests/RangeTest.ContainsRange (2126 of 2137) PASS: lldb-api :: python_api/debugger/TestDebuggerAPI.py (2127 of 2137) PASS: lldb-api :: commands/expression/ignore-artificial-constructors/TestIgnoreArtificialConstructors.py (2128 of 2137) PASS: lldb-unit :: Language/Highlighting/./HighlighterTests/HighlighterTest.FallbackHighlighter (2129 of 2137) PASS: lldb-api :: functionalities/data-formatter/data-formatter-disabling/TestDataFormatterDisabling.py (2130 of 2137) PASS: lldb-unit :: UnwindAssembly/PPC64/./PPC64InstEmulationTests/TestPPC64InstEmulation.TestSimpleFunction (2131 of 2137) PASS: lldb-unit :: Utility/./UtilityTests/ScalarTest.RightShiftOperator (2132 of 2137) PASS: lldb-api :: commands/expression/call-function/TestCallStdStringFunction.py (2133 of 2137) PASS: lldb-unit :: Utility/./UtilityTests/ArgsTest.AppendArguments (2134 of 2137) PASS: lldb-api :: functionalities/data-formatter/ostypeformatting/TestFormattersOsType.py (2135 of 2137) PASS: lldb-api :: functionalities/thread/step_out/TestThreadStepOut.py (2136 of 2137) PASS: lldb-api :: commands/expression/import-std-module/vector/TestVectorFromStdModule.py (2137 of 2137) Slowest Tests: -------------------------------------------------------------------------- 600.84s: lldb-api :: macosx/simulator/TestSimulatorPlatform.py 455.94s: lldb-api :: lang/objc/radar-9691614/TestObjCMethodReturningBOOL.py 262.99s: lldb-api :: functionalities/thread/concurrent_events/TestConcurrentTwoWatchpointsOneSignal.py 247.74s: lldb-api :: commands/expression/import-std-module/sysroot/TestStdModuleSysroot.py 99.98s: lldb-api :: tools/lldb-server/TestLldbGdbServer.py 91.86s: lldb-api :: python_api/sbenvironment/TestSBEnvironment.py 71.49s: lldb-shell :: SymbolFile/NativePDB/function-types-classes.cpp 68.17s: lldb-api :: functionalities/data-formatter/data-formatter-objc/TestDataFormatterObjCNSContainer.py 67.68s: lldb-api :: functionalities/postmortem/mach-core/TestMachCore.py 64.21s: lldb-shell :: Minidump/Windows/find-module.test 62.82s: lldb-api :: lang/cpp/global_variables/TestCPPGlobalVariables.py 61.52s: lldb-api :: lang/objc/exceptions/TestObjCExceptions.py 60.44s: lldb-api :: lang/objc/objc-new-syntax/TestObjCNewSyntaxDictionary.py 59.49s: lldb-api :: lang/objc/hidden-ivars/TestHiddenIvars.py 52.49s: lldb-api :: lang/objc/foundation/TestFoundationDisassembly.py 51.34s: lldb-api :: lang/objc/foundation/TestObjCMethods.py 49.04s: lldb-api :: api/multithreaded/TestMultithreaded.py 47.35s: lldb-shell :: SymbolFile/NativePDB/s_constant.cpp 43.99s: lldb-api :: lang/cpp/namespace/TestNamespaceLookup.py 43.94s: lldb-api :: commands/expression/import-std-module/vector-of-vectors/TestVectorOfVectorsFromStdModule.py

Hide Details

Tests Times: -------------------------------------------------------------------------- [ Range ] :: [ Percentage ] :: [ Count ] -------------------------------------------------------------------------- [600s,650s) :: [ ] :: [ 1/2137] [550s,600s) :: [ ] :: [ 0/2137] [500s,550s) :: [ ] :: [ 0/2137] [450s,500s) :: [ ] :: [ 1/2137] [400s,450s) :: [ ] :: [ 0/2137] [350s,400s) :: [ ] :: [ 0/2137] [300s,350s) :: [ ] :: [ 0/2137] [250s,300s) :: [ ] :: [ 2/2137] [200s,250s) :: [ ] :: [ 0/2137] [150s,200s) :: [ ] :: [ 0/2137] [100s,150s) :: [ ] :: [ 1/2137] [ 50s,100s) :: [ ] :: [ 13/2137] [ 0s, 50s) :: [*************************************** ] :: [2119/2137] -------------------------------------------------------------------------- ******************** Timed Out Tests (1): lldb-api :: macosx/simulator/TestSimulatorPlatform.py

Hide Details

Hide Details

Testing Time: 2048.39s Unsupported : 150 Passed : 1980 Expectedly Failed: 6 Timed Out : 1 FAILED: tools/lldb/test/CMakeFiles/check-lldb-lit cd /Users/buildslave/jenkins/workspace/lldb-cmake/lldb-build/tools/lldb/test && /usr/local/Frameworks/Python.framework/Versions/3.7/bin/python3.7 /Users/buildslave/jenkins/workspace/lldb-cmake/lldb-build/./bin/llvm-lit -v --time-tests --shuffle --xunit-xml-output=/Users/buildslave/jenkins/workspace/lldb-cmake/test/results.xml -v -j 4 /Users/buildslave/jenkins/workspace/lldb-cmake/lldb-build/tools/lldb/test ninja: build stopped: subcommand failed. Command failed: Command '['/usr/bin/env', 'TERM=vt100', '/usr/local/bin/ninja', '-v', 'check-lldb']' returned non-zero exit status 1 Command: ['/usr/bin/env', 'TERM=vt100', '/usr/local/bin/ninja', '-v', 'check-lldb'] [Pipeline] } [Pipeline] // timeout [Pipeline] } [Pipeline] // stage [Pipeline] stage [Pipeline] { (Declarative: Post Actions) [Pipeline] scanForIssues [Clang (LLVM based)] Sleeping for 5 seconds due to JENKINS-32191... [Clang (LLVM based)] Parsing console log (workspace: '/Users/buildslave/jenkins/workspace/lldb-cmake') [Clang (LLVM based)] Successfully parsed console log [Clang (LLVM based)] -> found 8 issues (skipped 12 duplicates) [Clang (LLVM based)] Post processing issues on 'green-dragon-10' with source code encoding 'UTF-8' [Clang (LLVM based)] Creating SCM blamer to obtain author and commit information for affected files [Clang (LLVM based)] Creating SCM miner to obtain statistics for affected repository files [Clang (LLVM based)] Resolving file names for all issues in source directory '/Users/buildslave/jenkins/workspace/lldb-cmake' [Clang (LLVM based)] -> resolved paths in source directory (6 found, 0 not found) [Clang (LLVM based)] Resolving module names from module definitions (build.xml, pom.xml, or Manifest.mf files) [Clang (LLVM based)] -> resolved module names for 8 issues [Clang (LLVM based)] Resolving package names (or namespaces) by parsing the affected files [Clang (LLVM based)] -> resolved package names of 6 affected files [Clang (LLVM based)] No filter has been set, publishing all 8 issues [Clang (LLVM based)] Creating fingerprints for all affected code blocks to track issues over different builds [Clang (LLVM based)] -> created fingerprints for 8 issues (skipped 0 issues) [Clang (LLVM based)] Copying affected files to Jenkins' build folder '/Users/Shared/Jenkins/Home/jobs/lldb-cmake/builds/23699/files-with-issues' [Clang (LLVM based)] -> 4 copied, 2 not in workspace, 0 not-found, 0 with I/O error [Pipeline] junit Recording test results [Pipeline] } [Pipeline] // stage [Pipeline] } [Pipeline] // withEnv [Pipeline] } [Pipeline] // node [Pipeline] End of Pipeline ERROR: script returned exit code 1 Finished: FAILURE