FailedConsole Output

Skipping 9,159 KB.. Full Log
MutableStringRef:  NSString summary provider
NSMutableString:  NSString summary provider
__NSCFConstantString:  NSString summary provider
__NSCFString:  NSString summary provider
NSCFConstantString:  NSString summary provider
NSCFString:  NSString summary provider
NSPathStore2:  NSString summary provider
NSTaggedPointerString:  NSString summary provider
NSAttributedString:  NSAttributedString summary provider
NSMutableAttributedString:  NSMutableAttributedString summary provider
NSConcreteMutableAttributedString:  NSMutableAttributedString summary provider
NSBundle:  NSBundle summary provider
NSData:  NSData summary provider
_NSInlineData:  NSData summary provider
NSConcreteData:  NSData summary provider
NSConcreteMutableData:  NSData summary provider
NSMutableData:  NSData summary provider
__NSCFData:  NSData summary provider
CFDataRef:  NSData summary provider
CFMutableDataRef:  NSData summary provider
NSMachPort:  NSMachPort summary provider
NSNotification:  NSNotification summary provider
NSConcreteNotification:  NSNotification summary provider
NSNumber:  NSNumber summary provider
CFNumberRef:  CFNumberRef summary provider
__NSCFBoolean:  NSNumber summary provider
__NSCFNumber:  NSNumber summary provider
NSCFBoolean:  NSNumber summary provider
NSCFNumber:  NSNumber summary provider
NSDecimalNumber:  NSDecimalNumber summary provider
NSURL:  NSURL summary provider
CFURLRef:  NSURL summary provider
NSDate:  NSDate summary provider
__NSDate:  NSDate summary provider
__NSTaggedDate:  NSDate summary provider
NSCalendarDate:  NSDate summary provider
NSTimeZone:  NSTimeZone summary provider
CFTimeZoneRef:  NSTimeZone summary provider
__NSTimeZone:  NSTimeZone summary provider
CFAbsoluteTime:  (hide value) CFAbsoluteTime summary provider
NSIndexSet:  NSIndexSet summary provider
NSMutableIndexSet:  NSIndexSet summary provider
CFGregorianDate: `@"${var.month%d}/${var.day%d}/${var.year%d} ${var.hour%d}:${var.minute%d}:${var.second}"`
CFBitVectorRef:  CFBitVector summary provider
CFMutableBitVectorRef:  CFBitVector summary provider
__CFBitVector:  CFBitVector summary provider
__CFMutableBitVector:  CFBitVector summary provider
Named summaries:
AllUseIt: `AllUseIt: x=${var.x} {y=${var.y}} {z=${var.z}}`

Hide Details

Expecting sub string: "AllUseIt" (was found)

Hide Details

runCmd: frame variable first output: (First) first = First: x=12 y=34 dummy=3.1400001

Hide Details

Hide Details

Ran command: "frame variable first"

Hide Details

Got output: (First) first = First: x=12 y=34 dummy=3.1400001

Hide Details

Expecting sub string: "First: x=12" (was found)

Hide Details

runCmd: frame variable first --summary AllUseIt output: (First) first = AllUseIt: x=12 y=34

Hide Details

Hide Details

Ran command: "frame variable first --summary AllUseIt"

Hide Details

Got output: (First) first = AllUseIt: x=12 y=34

Hide Details

Expecting sub string: "AllUseIt: x=12" (was found)

Hide Details

runCmd: frame variable first output: (First) first = First: x=12 y=34 dummy=3.1400001

Hide Details

Hide Details

Ran command: "frame variable first"

Hide Details

Got output: (First) first = First: x=12 y=34 dummy=3.1400001

Hide Details

Not expecting sub string: "AllUseIt: x=12" (was not found)

Hide Details

runCmd: frame variable first output: (First) first = First: x=12 y=34 dummy=3.1400001

Hide Details

Hide Details

Ran command: "frame variable first"

Hide Details

Got output: (First) first = First: x=12 y=34 dummy=3.1400001

Hide Details

Expecting sub string: "First: x=12" (was found)

Hide Details

runCmd: thread step-over output: Process 86333 stopped * thread #1, queue = 'com.apple.main-thread', stop reason = step over frame #0: 0x0000000100000df6 a.out`main(argc=1, argv=0x00007ffeefbff820) at main.cpp:44:17 41 Third *third = new Third(96,'E'); 42 43 first.dummy = 1; // Set break point at this line. -> 44 first.dummy = 2; ^ 45 first.dummy = 3; 46 first.dummy = 4; 47 first.dummy = 5;

Hide Details

Hide Details

Hide Details

runCmd: frame variable first output: (First) first = First: x=12 y=34 dummy=1

Hide Details

Hide Details

Ran command: "frame variable first"

Hide Details

Got output: (First) first = First: x=12 y=34 dummy=1

Hide Details

Expecting sub string: "First: x=12" (was found)

Hide Details

runCmd: frame variable first --summary AllUseIt output: (First) first = AllUseIt: x=12 y=34

Hide Details

Hide Details

Ran command: "frame variable first --summary AllUseIt"

Hide Details

Got output: (First) first = AllUseIt: x=12 y=34

Hide Details

Expecting sub string: "AllUseIt: x=12" (was found) Expecting sub string: "y=34" (was found)

Hide Details

runCmd: frame variable second --summary AllUseIt output: (Second) second = AllUseIt: x=65 y=43.25

Hide Details

Hide Details

Ran command: "frame variable second --summary AllUseIt"

Hide Details

Got output: (Second) second = AllUseIt: x=65 y=43.25

Hide Details

Expecting sub string: "AllUseIt: x=65" (was found) Expecting sub string: "y=43.25" (was found)

Hide Details

runCmd: frame variable third --summary AllUseIt output: (Third *) third = 0x0000000100304240 AllUseIt: x=96 z='E'

Hide Details

Hide Details

Ran command: "frame variable third --summary AllUseIt"

Hide Details

Got output: (Third *) third = 0x0000000100304240 AllUseIt: x=96 z='E'

Hide Details

Expecting sub string: "AllUseIt: x=96" (was found) Expecting sub string: "z=" (was found) Expecting sub string: "E" (was found)

Hide Details

runCmd: thread step-over output: Process 86333 stopped * thread #1, queue = 'com.apple.main-thread', stop reason = step over frame #0: 0x0000000100000dfb a.out`main(argc=1, argv=0x00007ffeefbff820) at main.cpp:45:17 42 43 first.dummy = 1; // Set break point at this line. 44 first.dummy = 2; -> 45 first.dummy = 3; ^ 46 first.dummy = 4; 47 first.dummy = 5; 48

Hide Details

Hide Details

Hide Details

runCmd: frame variable second output: (Second) second = Second: x=65 y=0x422d0000

Hide Details

Hide Details

Ran command: "frame variable second"

Hide Details

Got output: (Second) second = Second: x=65 y=0x422d0000

Hide Details

Expecting sub string: "Second: x=65" (was found) Expecting sub string: "y=0x" (was found)

Hide Details

runCmd: frame variable second --summary NoSuchSummary check of return status not required runCmd failed! error: must specify a valid named summary

Hide Details

Hide Details

Ran command: "frame variable second --summary NoSuchSummary"

Hide Details

Got output: error: must specify a valid named summary

Hide Details

Expecting sub string: "must specify a valid named summary" (was found)

Hide Details

runCmd: thread step-over output: Process 86333 stopped * thread #1, queue = 'com.apple.main-thread', stop reason = step over frame #0: 0x0000000100000e00 a.out`main(argc=1, argv=0x00007ffeefbff820) at main.cpp:46:17 43 first.dummy = 1; // Set break point at this line. 44 first.dummy = 2; 45 first.dummy = 3; -> 46 first.dummy = 4; ^ 47 first.dummy = 5; 48 49 }

Hide Details

Hide Details

Hide Details

runCmd: type summary add --summary-string "FirstAndFriends: x=${var.x} {y=${var.y}} {z=${var.z}}" First --name FirstAndFriends output:

Hide Details

runCmd: frame variable first output: (First) first = FirstAndFriends: x=12 y=34

Hide Details

Hide Details

Ran command: "frame variable first"

Hide Details

Got output: (First) first = FirstAndFriends: x=12 y=34

Hide Details

Expecting sub string: "FirstAndFriends: x=12" (was found) Expecting sub string: "y=34" (was found)

Hide Details

runCmd: type summary delete First output:

Hide Details

runCmd: frame variable first --summary FirstAndFriends output: (First) first = FirstAndFriends: x=12 y=34

Hide Details

Hide Details

Ran command: "frame variable first --summary FirstAndFriends"

Hide Details

Got output: (First) first = FirstAndFriends: x=12 y=34

Hide Details

Expecting sub string: "FirstAndFriends: x=12" (was found) Expecting sub string: "y=34" (was found)

Hide Details

runCmd: frame variable first output: (First) first = (x = 12, y = 34, dummy = 3)

Hide Details

Hide Details

Ran command: "frame variable first"

Hide Details

Got output: (First) first = (x = 12, y = 34, dummy = 3)

Hide Details

Expecting sub string: "x = 12" (was found) Expecting sub string: "y = 34" (was found)

Hide Details

runCmd: type summary delete FirstAndFriends output:

Hide Details

runCmd: type summary delete NoSuchSummary check of return status not required runCmd failed! error: no custom formatter for NoSuchSummary.

Hide Details

Hide Details

Ran command: "type summary delete NoSuchSummary"

Hide Details

Got output: error: no custom formatter for NoSuchSummary.

Hide Details

Hide Details

runCmd: type summary delete AllUseIt output:

Hide Details

runCmd: frame variable first output: (First) first = (x = 12, y = 34, dummy = 3)

Hide Details

Hide Details

Ran command: "frame variable first"

Hide Details

Got output: (First) first = (x = 12, y = 34, dummy = 3)

Hide Details

Not expecting sub string: "FirstAndFriends" (was not found)

Hide Details

runCmd: thread step-over output: Process 86333 stopped * thread #1, queue = 'com.apple.main-thread', stop reason = step over frame #0: 0x0000000100000e05 a.out`main(argc=1, argv=0x00007ffeefbff820) at main.cpp:47:17 44 first.dummy = 2; 45 first.dummy = 3; 46 first.dummy = 4; -> 47 first.dummy = 5; ^ 48 49 } 50

Hide Details

Hide Details

Hide Details

runCmd: frame variable first output: (First) first = (x = 12, y = 34, dummy = 4)

Hide Details

Hide Details

Ran command: "frame variable first"

Hide Details

Got output: (First) first = (x = 12, y = 34, dummy = 4)

Hide Details

Not expecting sub string: "FirstAndFriends: x=12" (was not found) Not expecting sub string: "y=34" (was not found)

Hide Details

<bound method SBProcess.Kill of <lldb.SBProcess; proxy of <Swig Object of type 'lldb::SBProcess *' at 0x104dd2810> >>: success

Hide Details

Executing tearDown hook: def cleanup(): self.runCmd('type format clear', check=False) self.runCmd('type summary clear', check=False)

Hide Details

Hide Details

runCmd: type format clear check of return status not required output:

Hide Details

runCmd: type summary clear check of return status not required output:

Hide Details

PASS: LLDB (/Users/buildslave/jenkins/workspace/lldb-cmake/lldb-build/bin/clang-x86_64) :: test_with_run_command_gmodules (TestDataFormatterNamedSummaries.NamedSummariesDataFormatterTestCase) Restore dir to: /Users/buildslave/jenkins/workspace/lldb-cmake/lldb-build/tools/lldb/test ====================================================================== FAIL: test_with_run_command_dwarf (TestDataFormatterNamedSummaries.NamedSummariesDataFormatterTestCase) Test that that file and class static variables display correctly. ---------------------------------------------------------------------- Traceback (most recent call last): File "/Users/buildslave/jenkins/workspace/lldb-cmake/llvm-project/lldb/packages/Python/lldbsuite/test/lldbtest.py", line 1825, in test_method return attrvalue(self) File "/Users/buildslave/jenkins/workspace/lldb-cmake/llvm-project/lldb/test/API/functionalities/data-formatter/data-formatter-named-summaries/TestDataFormatterNamedSummaries.py", line 30, in test_with_run_command self.runCmd("run", RUN_SUCCEEDED) File "/Users/buildslave/jenkins/workspace/lldb-cmake/llvm-project/lldb/packages/Python/lldbsuite/test/lldbtest.py", line 2155, in runCmd msg if (msg) else CMD_MSG(cmd)) AssertionError: False is not True : Process is launched successfully Error output: error: shell expansion failed (reason: timed out waiting for shell command to complete). consider launching with 'process launch'.

Hide Details

Config=x86_64-/Users/buildslave/jenkins/workspace/lldb-cmake/lldb-build/bin/clang ---------------------------------------------------------------------- Ran 4 tests in 95.128s

Hide Details

RESULT: FAILED (2 passes, 1 failures, 0 errors, 1 skipped, 0 expected failures, 0 unexpected successes)

Hide Details

--

Hide Details

******************** UNSUPPORTED: lldb-shell :: Register/x86-64-zmm-read.test (731 of 2140) PASS: lldb-unit :: Host/./HostTests/SocketTest.DecodeHostAndPort (732 of 2140) PASS: lldb-shell :: ScriptInterpreter/None/none.test (733 of 2140) PASS: lldb-unit :: Utility/./UtilityTests/BinaryStreamTest.PutSLEB128ThreeBytes (734 of 2140) PASS: lldb-unit :: Core/./LLDBCoreTests/RichManglingContextTest.FromCxxMethodName (735 of 2140) PASS: lldb-unit :: Process/minidump/./LLDBMinidumpTests/RegisterContextMinidump.CheckRegisterContextMinidump_ARM (736 of 2140) PASS: lldb-shell :: Watchpoint/SetErrorCases.test (737 of 2140) PASS: lldb-shell :: Minidump/disassemble-no-module.yaml (738 of 2140) PASS: lldb-api :: functionalities/postmortem/elf-core/TestLinuxCore.py (739 of 2140) PASS: lldb-api :: python_api/watchpoint/TestSetWatchpoint.py (740 of 2140) PASS: lldb-unit :: Utility/./UtilityTests/ProcessInstanceInfo.DumpTable_invalidUID (741 of 2140) PASS: lldb-api :: functionalities/data-formatter/data-formatter-categories/TestDataFormatterCategories.py (742 of 2140) PASS: lldb-api :: commands/frame/diagnose/local-variable/TestLocalVariable.py (743 of 2140) PASS: lldb-unit :: SymbolFile/DWARF/./SymbolFileDWARFTests/DWARFASTParserClangTests.EnsureAllDIEsInDeclContextHaveBeenParsedParsesOnlyMatchingEntries (744 of 2140) PASS: lldb-unit :: Utility/./UtilityTests/CompletionRequest.DuplicateFiltering (745 of 2140) PASS: lldb-unit :: Utility/./UtilityTests/ListenerTest.GetEventImmediate (746 of 2140) PASS: lldb-api :: functionalities/data-formatter/data-formatter-objc/TestDataFormatterObjCNSDate.py (747 of 2140) PASS: lldb-unit :: Process/minidump/./LLDBMinidumpTests/MinidumpParserTest.GetLinuxProcStatus_no_stream (748 of 2140) PASS: lldb-api :: python_api/get-value-32bit-int/TestGetValue32BitInt.py (749 of 2140) PASS: lldb-api :: functionalities/multiword-commands/TestMultiWordCommands.py (750 of 2140) PASS: lldb-api :: functionalities/plugins/python_os_plugin/TestPythonOSPlugin.py (751 of 2140) PASS: lldb-unit :: Utility/./UtilityTests/StreamTest.PutSLEB128 (752 of 2140) PASS: lldb-api :: functionalities/thread/exit_during_step/TestExitDuringStep.py (753 of 2140) PASS: lldb-api :: functionalities/breakpoint/breakpoint_set_restart/TestBreakpointSetRestart.py (754 of 2140) PASS: lldb-api :: commands/expression/unicode-in-variable/TestUnicodeInVariable.py (755 of 2140) PASS: lldb-shell :: Host/TestCustomShell.test (756 of 2140) PASS: lldb-unit :: Utility/./UtilityTests/StreamTeeTest.Write (757 of 2140) PASS: lldb-unit :: Utility/./UtilityTests/AnsiTerminal.Incomplete (758 of 2140) PASS: lldb-unit :: Utility/./UtilityTests/SharedCluster.ClusterManager (759 of 2140) PASS: lldb-shell :: SymbolFile/DWARF/DW_OP_piece-struct.s (760 of 2140) UNSUPPORTED: lldb-shell :: SymbolFile/PDB/pointers.test (761 of 2140) PASS: lldb-unit :: Utility/./UtilityTests/VMRange.Ordering (762 of 2140) UNSUPPORTED: lldb-api :: functionalities/unwind/standard/TestStandardUnwind.py (763 of 2140) PASS: lldb-unit :: Utility/./UtilityTests/StringListTest.CopyListEmpty (764 of 2140) PASS: lldb-unit :: Process/gdb-remote/./ProcessGdbRemoteTests/GDBRemoteCommunicationClientTest.SendGetDataPacket (765 of 2140) PASS: lldb-api :: functionalities/postmortem/netbsd-core/TestNetBSDCore.py (766 of 2140) PASS: lldb-api :: tools/lldb-server/TestGdbRemoteProcessInfo.py (767 of 2140) PASS: lldb-unit :: UnwindAssembly/x86/./UnwindAssemblyx86Tests/Testx86AssemblyInspectionEngine.TestSpArithx86_64Augmented (768 of 2140) PASS: lldb-api :: functionalities/tail_call_frames/cross_dso/TestCrossDSOTailCalls.py (769 of 2140) PASS: lldb-api :: commands/frame/diagnose/bad-reference/TestBadReference.py (770 of 2140) PASS: lldb-unit :: Language/CPlusPlus/./LanguageCPlusPlusTests/CPlusPlusLanguage.MethodNameParsing (771 of 2140) PASS: lldb-unit :: Utility/./UtilityTests/UUIDTest.Validity (772 of 2140) PASS: lldb-unit :: ScriptInterpreter/Python/./ScriptInterpreterPythonTests/PythonDataObjectsTest.TestPythonIntegerToStr (773 of 2140) PASS: lldb-unit :: Target/./TargetTests/PathMappingListTest.RemapRoot (774 of 2140) PASS: lldb-api :: functionalities/thread/concurrent_events/TestConcurrentNWatchNBreak.py (775 of 2140) PASS: lldb-unit :: SymbolFile/DWARF/./SymbolFileDWARFTests/SymbolFileDWARFTests.TestAbilitiesForDWARF (776 of 2140) PASS: lldb-shell :: Minidump/memory-region.yaml (777 of 2140) PASS: lldb-api :: lang/cpp/dynamic-value/TestDynamicValue.py (778 of 2140) PASS: lldb-unit :: Process/gdb-remote/./ProcessGdbRemoteTests/GDBRemoteCommunicationClientTest.SendGetTraceConfigPacket (779 of 2140) PASS: lldb-api :: functionalities/thread/step_until/TestStepUntil.py (780 of 2140) PASS: lldb-api :: python_api/interpreter/TestRunCommandInterpreterAPI.py (781 of 2140) PASS: lldb-api :: macosx/nslog/TestDarwinNSLogOutput.py (782 of 2140) PASS: lldb-unit :: Process/minidump/./LLDBMinidumpTests/MinidumpParserTest.GetMemoryRegionInfo (783 of 2140) PASS: lldb-api :: lang/cpp/enum_types/TestCPP11EnumTypes.py (784 of 2140) PASS: lldb-unit :: Utility/./UtilityTests/UriParserTest.Minimal (785 of 2140) UNSUPPORTED: lldb-api :: macosx/macCatalystAppMacOSFramework/TestMacCatalystAppWithMacOSFramework.py (786 of 2140) PASS: lldb-api :: lang/objc/global_ptrs/TestGlobalObjects.py (787 of 2140) PASS: lldb-unit :: UnwindAssembly/ARM64/./Arm64InstEmulationTests/TestArm64InstEmulation.TestFramelessThreeEpilogueFunction (788 of 2140) PASS: lldb-unit :: Process/minidump/./LLDBMinidumpTests/MinidumpParserTest.GetThreadContext_x86_32_wow64 (789 of 2140) PASS: lldb-api :: commands/expression/timeout/TestCallWithTimeout.py (790 of 2140) PASS: lldb-unit :: Utility/./UtilityTests/DataExtractorTest.GetULEB128_bit63 (791 of 2140) PASS: lldb-api :: lang/objc/modules-cache/TestClangModulesCache.py (792 of 2140) PASS: lldb-unit :: Utility/./UtilityTests/UriParserTest.BracketedHostnamePort (793 of 2140) PASS: lldb-shell :: Breakpoint/dummy-target.test (794 of 2140) PASS: lldb-shell :: ObjectFile/PECOFF/basic-info.yaml (795 of 2140) PASS: lldb-shell :: SymbolFile/NativePDB/tag-types.cpp (796 of 2140) PASS: lldb-unit :: Utility/./UtilityTests/Flags.AnySet (797 of 2140) PASS: lldb-shell :: SymbolFile/Breakpad/stack-cfi-arm.yaml (798 of 2140) PASS: lldb-unit :: Utility/./UtilityTests/OptionsWithRawTest.WhitespaceInput (799 of 2140) PASS: lldb-unit :: ObjectFile/ELF/./ObjectFileELFTests/ObjectFileELFTest.GetSymtab_NoSymEntryPointArmAddressClass (800 of 2140) PASS: lldb-unit :: ObjectFile/Breakpad/./ObjectFileBreakpadTests/LineRecord.parse (801 of 2140) PASS: lldb-shell :: Settings/TestDisassemblyFormat.test (802 of 2140) PASS: lldb-api :: lang/cpp/class_types/TestClassTypesDisassembly.py (803 of 2140) PASS: lldb-unit :: UnwindAssembly/ARM64/./Arm64InstEmulationTests/TestArm64InstEmulation.TestMediumDarwinFunction (804 of 2140) PASS: lldb-api :: functionalities/data-formatter/data-formatter-python-synth/TestDataFormatterPythonSynth.py (805 of 2140) PASS: lldb-api :: commands/watchpoints/multiple_threads/TestWatchpointMultipleThreads.py (806 of 2140) PASS: lldb-api :: functionalities/tail_call_frames/cross_object/TestCrossObjectTailCalls.py (807 of 2140) PASS: lldb-api :: commands/expression/function_template_specialization_temp_args/TestFunctionTemplateSpecializationTempArgs.py (808 of 2140) PASS: lldb-shell :: ObjectFile/PECOFF/export-dllfunc.yaml (809 of 2140) UNSUPPORTED: lldb-api :: commands/register/register/intel_xtended_registers/TestMPXRegisters.py (810 of 2140) UNSUPPORTED: lldb-shell :: SymbolFile/PDB/typedefs.test (811 of 2140) UNSUPPORTED: lldb-api :: functionalities/data-formatter/data-formatter-stl/libstdcpp/tuple/TestDataFormatterStdTuple.py (812 of 2140) PASS: lldb-shell :: SymbolFile/DWARF/parallel-indexing-stress.s (813 of 2140) PASS: lldb-unit :: ObjectFile/Breakpad/./ObjectFileBreakpadTests/StackCFIRecord.parse (814 of 2140) PASS: lldb-api :: functionalities/breakpoint/breakpoint_hit_count/TestBreakpointHitCount.py (815 of 2140) PASS: lldb-shell :: ObjectFile/ELF/duplicate-section.yaml (816 of 2140) PASS: lldb-unit :: Utility/./UtilityTests/ScalarTest.ComparisonFloat (817 of 2140) PASS: lldb-unit :: Language/Highlighting/./HighlighterTests/HighlighterTest.DefaultHighlighterWithCursorOutOfBounds (818 of 2140) PASS: lldb-unit :: UnwindAssembly/x86/./UnwindAssemblyx86Tests/Testx86AssemblyInspectionEngine.TestPushEDX (819 of 2140) PASS: lldb-unit :: Language/Highlighting/./HighlighterTests/HighlighterTest.ClangIdentifiers (820 of 2140) PASS: lldb-api :: macosx/DBGSourcePathRemapping/TestDSYMSourcePathRemapping.py (821 of 2140) PASS: lldb-api :: macosx/queues/TestQueues.py (822 of 2140) PASS: lldb-unit :: Utility/./UtilityTests/FileSpecTest.Yaml (823 of 2140) PASS: lldb-api :: commands/frame/diagnose/dereference-function-return/TestDiagnoseDereferenceFunctionReturn.py (824 of 2140) PASS: lldb-unit :: Symbol/./SymbolTests/LineEntryTest.GetSameLineContiguousAddressRangeNoInlines (825 of 2140) PASS: lldb-unit :: ScriptInterpreter/Python/./ScriptInterpreterPythonTests/PythonDataObjectsTest.TestGlobalNameResolutionNoDot (826 of 2140) PASS: lldb-shell :: Register/x86-64-ymm-read.test (827 of 2140) PASS: lldb-unit :: Core/./LLDBCoreTests/MangledTest.ResultForBlockInvocation (828 of 2140) PASS: lldb-api :: commands/expression/persistent_types/TestNestedPersistentTypes.py (829 of 2140) PASS: lldb-unit :: Utility/./UtilityTests/StringExtractorTest.GetHexBytesAvail (830 of 2140) PASS: lldb-unit :: UnwindAssembly/x86/./UnwindAssemblyx86Tests/Testx86AssemblyInspectionEngine.TestPopR12 (831 of 2140) PASS: lldb-api :: python_api/watchpoint/TestWatchpointIgnoreCount.py (832 of 2140) PASS: lldb-unit :: Symbol/./SymbolTests/TestTypeSystemClang.TestDeletingImplicitCopyCstrDueToMoveCStr (833 of 2140) UNSUPPORTED: lldb-api :: commands/register/register/aarch64_sve_registers/rw_access_static_config/TestSVERegisters.py (834 of 2140) PASS: lldb-api :: commands/session/history/TestSessionHistory.py (835 of 2140) PASS: lldb-api :: types/TestCharType.py (836 of 2140) PASS: lldb-unit :: Symbol/./SymbolTests/TestTypeSystemClang.TestFunctionTemplateInRecordConstruction (837 of 2140) PASS: lldb-unit :: Utility/./UtilityTests/RangeDataVector.CustomSort (838 of 2140) PASS: lldb-unit :: Language/Highlighting/./HighlighterTests/HighlighterTest.ClangOperators (839 of 2140) PASS: lldb-unit :: Utility/./UtilityTests/StringExtractorTest.GetU32LittleEndian (840 of 2140) PASS: lldb-shell :: Settings/TestFrameFormatColor.test (841 of 2140) PASS: lldb-unit :: Thread/./ThreadTests/ThreadTest.GetPrivateStopInfo (842 of 2140) UNSUPPORTED: lldb-api :: functionalities/data-formatter/data-formatter-stl/libstdcpp/map/TestDataFormatterStdMap.py (843 of 2140) PASS: lldb-unit :: Utility/./UtilityTests/StringListTest.JoinNonSpace (844 of 2140) PASS: lldb-api :: lang/cpp/stl/TestStdCXXDisassembly.py (845 of 2140) PASS: lldb-shell :: Reproducer/TestPythonImport.test (846 of 2140) PASS: lldb-unit :: Symbol/./SymbolTests/TestClangASTImporter.CopyDeclTagDecl (847 of 2140) PASS: lldb-unit :: Process/gdb-remote/./ProcessGdbRemoteTests/GDBRemoteClientBaseTest.SendContinueDelegateInterface (848 of 2140) PASS: lldb-api :: functionalities/thread/concurrent_events/TestConcurrentTwoBreakpointThreads.py (849 of 2140) PASS: lldb-unit :: Utility/./UtilityTests/StringListTest.SplitIntoLines (850 of 2140) PASS: lldb-unit :: Utility/./UtilityTests/StreamTest.ShiftOperatorPtr (851 of 2140) PASS: lldb-unit :: Expression/./ExpressionTests/DiagnosticManagerTest.AppendMessageNoDiag (852 of 2140) PASS: lldb-api :: functionalities/tail_call_frames/sbapi_support/TestTailCallFrameSBAPI.py (853 of 2140) PASS: lldb-api :: functionalities/float-display/TestFloatDisplay.py (854 of 2140) PASS: lldb-api :: functionalities/gdb_remote_client/TestTargetXMLArch.py (855 of 2140) PASS: lldb-unit :: Host/./HostTests/SocketTest.UDPConnect (856 of 2140) PASS: lldb-unit :: Target/./TargetTests/RemoteAwarePlatformTest.TestResolveExecutabelOnClientByPlatform (857 of 2140) PASS: lldb-api :: functionalities/thread/concurrent_events/TestConcurrentSignalNWatchNBreak.py (858 of 2140) PASS: lldb-unit :: Core/./LLDBCoreTests/ModuleSpecTest.InvalidInMemoryBufferValidFile (859 of 2140) UNSUPPORTED: lldb-api :: functionalities/thread/thread_specific_break_plus_condition/TestThreadSpecificBpPlusCondition.py (860 of 2140) PASS: lldb-api :: tools/lldb-vscode/breakpoint/TestVSCode_setFunctionBreakpoints.py (861 of 2140) PASS: lldb-unit :: Utility/./UtilityTests/FileSpecTest.FormatFileSpec (862 of 2140) PASS: lldb-unit :: SymbolFile/NativePDB/./SymbolFileNativePDBTests/PDBFPOProgramToDWARFExpressionTests.InvalidOpBinary (863 of 2140) PASS: lldb-api :: commands/frame/var-scope/TestFrameVariableScope.py (864 of 2140) PASS: lldb-shell :: Unwind/thread-step-out-ret-addr-check.test (865 of 2140) PASS: lldb-shell :: ObjectFile/PECOFF/basic-info-arm64.yaml (866 of 2140) PASS: lldb-shell :: ObjectFile/ELF/many-sections.s (867 of 2140) PASS: lldb-unit :: debugserver/./debugserverTests/RNBSocket.LoopBackConnectIPv6 (868 of 2140) PASS: lldb-unit :: ScriptInterpreter/Python/./ScriptInterpreterPythonTests/PythonDataObjectsTest.TestPythonBytes (869 of 2140) PASS: lldb-api :: tools/lldb-server/inferior-crash/TestGdbRemoteSegFault.py (870 of 2140) PASS: lldb-api :: commands/command/script_alias/TestCommandScriptAlias.py (871 of 2140) PASS: lldb-unit :: Utility/./UtilityTests/StringLexerTest.PutBack (872 of 2140) PASS: lldb-unit :: Utility/./UtilityTests/ArgsTest.TestOverwriteArgs (873 of 2140) PASS: lldb-unit :: Expression/./ExpressionTests/DiagnosticManagerTest.GetStringMultipleDiags (874 of 2140) PASS: lldb-api :: functionalities/tsan/multiple/TestTsanMultiple.py (875 of 2140) PASS: lldb-shell :: Breakpoint/jitbp_elf.test (876 of 2140) PASS: lldb-shell :: Reproducer/TestHomeDir.test (877 of 2140) PASS: lldb-unit :: Language/CLanguages/./LanguageCLanguagesTests/CLanguages.LookupCLanguagesByLanguageType (878 of 2140) UNSUPPORTED: lldb-shell :: SymbolFile/target-symbols-add-unwind.test (879 of 2140) PASS: lldb-api :: commands/source/info/TestSourceInfo.py (880 of 2140) PASS: lldb-shell :: SymbolFile/NativePDB/function-types-builtins.cpp (881 of 2140) PASS: lldb-api :: commands/expression/radar_9673664/TestExprHelpExamples.py (882 of 2140) PASS: lldb-shell :: Quit/TestQuitExitCode0.test (883 of 2140) PASS: lldb-api :: lang/objc/foundation/TestObjCMethodsNSArray.py (884 of 2140) PASS: lldb-unit :: Utility/./UtilityTests/ProcessInstanceInfoList.Yaml (885 of 2140) PASS: lldb-api :: functionalities/thread/thread_exit/TestThreadExit.py (886 of 2140) PASS: lldb-api :: functionalities/data-formatter/data-formatter-objc/TestDataFormatterObjCNSContainer.py (887 of 2140) PASS: lldb-unit :: Utility/./UtilityTests/StringListTest.Assignment (888 of 2140) PASS: lldb-api :: functionalities/thread/concurrent_events/TestConcurrentTwoWatchpointsOneSignal.py (889 of 2140) PASS: lldb-unit :: Utility/./UtilityTests/RangeTest.Clear (890 of 2140) PASS: lldb-unit :: Utility/./UtilityTests/StringExtractorTest.DecodeHexU8_Exact (891 of 2140) PASS: lldb-api :: commands/expression/dont_allow_jit/TestAllowJIT.py (892 of 2140) PASS: lldb-api :: functionalities/signal/raise/TestRaise.py (893 of 2140) PASS: lldb-unit :: Host/./HostTests/MainLoopTest.Signal (894 of 2140) PASS: lldb-shell :: SymbolFile/DWARF/dwarf5-partial-index.cpp (895 of 2140) PASS: lldb-unit :: DataFormatter/./LLDBFormatterTests/StringPrinterTests.SwiftUTF8 (896 of 2140) PASS: lldb-api :: functionalities/data-formatter/varscript_formatting/TestDataFormatterVarScriptFormatting.py (897 of 2140) PASS: lldb-api :: lang/c/stepping/TestStepAndBreakpoints.py (898 of 2140) PASS: lldb-unit :: Utility/./UtilityTests/BinaryStreamTest.PutSLEB128SevenBytes (899 of 2140) PASS: lldb-unit :: Utility/./UtilityTests/StreamTest.PutHex8 (900 of 2140) PASS: lldb-unit :: Utility/./UtilityTests/StringExtractorTest.GetHexU8_Underflow2 (901 of 2140) PASS: lldb-unit :: ObjectFile/Breakpad/./ObjectFileBreakpadTests/FuncRecord.parse (902 of 2140) PASS: lldb-unit :: Utility/./UtilityTests/StreamTeeTest.GetStreamAtIndexOutOfBounds (903 of 2140) PASS: lldb-api :: functionalities/unwind/zeroth_frame/TestZerothFrame.py (904 of 2140) PASS: lldb-unit :: Utility/./UtilityTests/StreamTest.PutHex32ByteOrderLittle (905 of 2140) PASS: lldb-shell :: SymbolFile/DWARF/find-function-regex.cpp (906 of 2140) PASS: lldb-api :: macosx/thread_suspend/TestInternalThreadSuspension.py (907 of 2140) PASS: lldb-unit :: Utility/./UtilityTests/ProcessInfoTest.Constructor (908 of 2140) PASS: lldb-unit :: Symbol/./SymbolTests/TestClangASTImporter.CopyTypeTagDecl (909 of 2140) PASS: lldb-shell :: Register/x86-64-read.test (910 of 2140) PASS: lldb-api :: lang/cpp/member-and-local-vars-with-same-name/TestMembersAndLocalsWithSameName.py (911 of 2140) PASS: lldb-api :: functionalities/thread/concurrent_events/TestConcurrentBreakpointOneDelayBreakpointThreads.py (912 of 2140) PASS: lldb-api :: commands/expression/import-std-module/vector-bool/TestVectorBoolFromStdModule.py (913 of 2140) PASS: lldb-unit :: Utility/./UtilityTests/StringListTest.Join (914 of 2140) PASS: lldb-api :: commands/expression/save_jit_objects/TestSaveJITObjects.py (915 of 2140) PASS: lldb-api :: functionalities/tail_call_frames/ambiguous_tail_call_seq1/TestAmbiguousTailCallSeq1.py (916 of 2140) PASS: lldb-unit :: Core/./LLDBCoreTests/CommunicationTest.SynchronizeWhileClosing (917 of 2140) PASS: lldb-unit :: UnwindAssembly/x86/./UnwindAssemblyx86Tests/Testx86AssemblyInspectionEngine.TestPushEBX (918 of 2140) PASS: lldb-unit :: debugserver/./debugserverTests/RNBSocket.AnyListen (919 of 2140) PASS: lldb-api :: functionalities/gdb_remote_client/TestNestedRegDefinitions.py (920 of 2140) PASS: lldb-api :: commands/process/signal/TestProcessSignal.py (921 of 2140) PASS: lldb-unit :: Utility/./UtilityTests/UriParserTest.BracketedHostname (922 of 2140) PASS: lldb-api :: functionalities/deleted-executable/TestDeletedExecutable.py (923 of 2140) PASS: lldb-shell :: Minidump/memory-region-from-module.yaml (924 of 2140) PASS: lldb-unit :: Utility/./UtilityTests/ScalarTest.Comparison (925 of 2140) PASS: lldb-shell :: SymbolFile/DWARF/childless-compile-unit.s (926 of 2140) PASS: lldb-shell :: SymbolFile/DWARF/array-sizes.s (927 of 2140) PASS: lldb-api :: types/TestLongTypesExpr.py (928 of 2140) PASS: lldb-api :: python_api/file_handle/TestFileHandle.py (929 of 2140) PASS: lldb-api :: functionalities/pointer_num_children/TestPointerNumChildren.py (930 of 2140) PASS: lldb-unit :: Utility/./UtilityTests/StringListTest.ShiftCString (931 of 2140) PASS: lldb-unit :: Utility/./UtilityTests/TimerTest.CategoryTimesStats (932 of 2140) PASS: lldb-api :: types/TestRecursiveTypes.py (933 of 2140) PASS: lldb-api :: commands/add-dsym/uuid/TestAddDsymCommand.py (934 of 2140) PASS: lldb-api :: macosx/thread-names/TestInterruptThreadNames.py (935 of 2140) PASS: lldb-shell :: ScriptInterpreter/Python/sb_address_exception.test (936 of 2140) PASS: lldb-unit :: Utility/./UtilityTests/StringExtractorTest.GetHexU8_Underflow (937 of 2140) PASS: lldb-api :: functionalities/memory/read/TestMemoryRead.py (938 of 2140) UNSUPPORTED: lldb-shell :: Register/x86-ymm-read.test (939 of 2140) PASS: lldb-shell :: Breakpoint/single-file-split-dwarf.test (940 of 2140) PASS: lldb-api :: functionalities/thread/concurrent_events/TestConcurrentWatchpointDelayWatchpointOneBreakpoint.py (941 of 2140) PASS: lldb-api :: lang/objc/modules-inline-functions/TestModulesInlineFunctions.py (942 of 2140) PASS: lldb-unit :: Utility/./UtilityTests/SerializationRountripTest.SerializeDeserializeObjectReference (943 of 2140) PASS: lldb-api :: lang/objc/objc-checker/TestObjCCheckers.py (944 of 2140) PASS: lldb-unit :: Core/./LLDBCoreTests/ModuleSpecTest.TestCOFFFile (945 of 2140) PASS: lldb-api :: macosx/find-app-in-bundle/TestFindAppInBundle.py (946 of 2140) PASS: lldb-unit :: Utility/./UtilityTests/FileSpecTest.GetPath (947 of 2140) PASS: lldb-api :: functionalities/unwind/noreturn/module-end/TestNoReturnModuleEnd.py (948 of 2140) PASS: lldb-api :: sample_test/TestSampleInlineTest.py (949 of 2140) PASS: lldb-unit :: Utility/./UtilityTests/ScalarTest.TruncOrExtendTo (950 of 2140) PASS: lldb-api :: lang/cpp/diamond/TestDiamond.py (951 of 2140) PASS: lldb-unit :: Process/gdb-remote/./ProcessGdbRemoteTests/GDBRemoteCommunicationClientTest.GetMemoryRegionInfo (952 of 2140) UNSUPPORTED: lldb-api :: functionalities/breakpoint/breakpoint_in_delayslot/TestAvoidBreakpointInDelaySlot.py (953 of 2140) PASS: lldb-api :: commands/gui/viewlarge/TestGuiViewLarge.py (954 of 2140) PASS: lldb-api :: functionalities/breakpoint/objc/TestObjCBreakpoints.py (955 of 2140) UNSUPPORTED: lldb-api :: functionalities/darwin_log/filter/exact_match/activity-chain/TestDarwinLogFilterMatchActivityChain.py (956 of 2140) PASS: lldb-unit :: ScriptInterpreter/Python/./ScriptInterpreterPythonTests/PythonDataObjectsTest.TestPythonStringToStructuredString (957 of 2140) PASS: lldb-unit :: Utility/./UtilityTests/NameMatchesTest.StartsWith (958 of 2140) PASS: lldb-unit :: Utility/./UtilityTests/TildeExpressionResolver.ResolveFullPath (959 of 2140) PASS: lldb-api :: functionalities/data-formatter/parray/TestPrintArray.py (960 of 2140) PASS: lldb-unit :: Language/Highlighting/./HighlighterTests/HighlighterTest.ClangUnterminatedString (961 of 2140) PASS: lldb-api :: commands/watchpoints/watchpoint_commands/command/TestWatchpointCommandLLDB.py (962 of 2140) PASS: lldb-unit :: Process/minidump/./LLDBMinidumpTests/MinidumpParserTest.GetMemoryRegionInfoFromMemory64List (963 of 2140) PASS: lldb-shell :: Driver/TestRepl.test (964 of 2140) UNSUPPORTED: lldb-api :: commands/register/register/intel_xtended_registers/mpx_bound_violation/TestBoundViolation.py (965 of 2140) PASS: lldb-unit :: Utility/./UtilityTests/ArgsTest.ReplaceArgumentAtIndexShort (966 of 2140) PASS: lldb-unit :: Host/./HostTests/HostInfoTest.GetXcodeSDK (967 of 2140) PASS: lldb-api :: functionalities/data-formatter/cstring-utf8-summary/TestCstringUnicode.py (968 of 2140) PASS: lldb-unit :: UnwindAssembly/x86/./UnwindAssemblyx86Tests/Testx86AssemblyInspectionEngine.TestPopRBP (969 of 2140) PASS: lldb-unit :: Utility/./UtilityTests/ArgsTest.TestSingleArg (970 of 2140) PASS: lldb-unit :: Utility/./UtilityTests/TimeoutTest.Construction (971 of 2140) PASS: lldb-api :: python_api/value/empty_class/TestValueAPIEmptyClass.py (972 of 2140) PASS: lldb-api :: functionalities/unwind/sigtramp/TestSigtrampUnwind.py (973 of 2140) PASS: lldb-shell :: SymbolFile/DWARF/dwarf5-atomic.s (974 of 2140) PASS: lldb-shell :: SymbolFile/Breakpad/unwind-via-stack-win.test (975 of 2140) PASS: lldb-unit :: Utility/./UtilityTests/StringExtractorTest.GetHexBytesAvail_OddPair2 (976 of 2140) PASS: lldb-unit :: Utility/./UtilityTests/ScalarTest.CastOperations (977 of 2140) PASS: lldb-unit :: Utility/./UtilityTests/StreamTest.AddressRangeEmptyRange (978 of 2140) PASS: lldb-unit :: Utility/./UtilityTests/ArgsTest.TestAppendArg (979 of 2140) PASS: lldb-shell :: Breakpoint/implicit_const_form_support.test (980 of 2140) UNSUPPORTED: lldb-shell :: Process/Windows/exception_access_violation.cpp (981 of 2140) PASS: lldb-api :: commands/expression/formatters/TestFormatters.py (982 of 2140) PASS: lldb-unit :: Host/./HostTests/FileSystemTest.GetByteSize (983 of 2140) UNSUPPORTED: lldb-shell :: SymbolFile/PDB/function-level-linking.test (984 of 2140) PASS: lldb-unit :: SymbolFile/NativePDB/./SymbolFileNativePDBTests/PDBFPOProgramToDWARFExpressionTests.InvalidOpUnary (985 of 2140) XFAIL: lldb-shell :: Unwind/prefer-debug-over-eh-frame.test (986 of 2140) PASS: lldb-unit :: Utility/./UtilityTests/ConstStringTest.CompareStringRef (987 of 2140) PASS: lldb-api :: commands/expression/completion-in-lambda-and-unnamed-class/TestCompletionInLambdaAndUnnamedClass.py (988 of 2140) PASS: lldb-api :: tools/lldb-vscode/attach/TestVSCode_attach.py (989 of 2140) PASS: lldb-unit :: Symbol/./SymbolTests/PostfixExpression.ToDWARF (990 of 2140) PASS: lldb-shell :: SymbolFile/DWARF/debug-types-signature-loop.s (991 of 2140) PASS: lldb-api :: commands/thread/select/TestThreadSelect.py (992 of 2140) PASS: lldb-unit :: DataFormatter/./LLDBFormatterTests/StringPrinterTests.CxxUTF8 (993 of 2140) PASS: lldb-unit :: Utility/./UtilityTests/StreamTest.PutChar (994 of 2140) PASS: lldb-api :: commands/expression/vector_of_enums/TestVectorOfEnums.py (995 of 2140) PASS: lldb-unit :: debugserver/./debugserverTests/JSON.Parse (996 of 2140) PASS: lldb-shell :: SymbolFile/Breakpad/stack-cfi-parsing.test (997 of 2140) PASS: lldb-unit :: Utility/./UtilityTests/ArgsTest.TestMultipleArgs (998 of 2140) UNSUPPORTED: lldb-shell :: Watchpoint/netbsd-nouserdbregs.test (999 of 2140) PASS: lldb-api :: commands/breakpoint/command/list/TestBreakpointCommandList.py (1000 of 2140) PASS: lldb-unit :: Utility/./UtilityTests/FileSpecTest.EqualDotsWindows (1001 of 2140) PASS: lldb-api :: lang/objc/objc-builtin-types/TestObjCBuiltinTypes.py (1002 of 2140) PASS: lldb-unit :: Target/./TargetTests/ModuleCacheTest.GetAndPut (1003 of 2140) PASS: lldb-shell :: ObjectFile/wasm/stripped-debug-sections.yaml (1004 of 2140) PASS: lldb-unit :: Core/./LLDBCoreTests/UniqueCStringMap.NoDefaultConstructor (1005 of 2140) PASS: lldb-api :: commands/expression/import-std-module/shared_ptr-dbg-info-content/TestSharedPtrDbgInfoContentFromStdModule.py (1006 of 2140) PASS: lldb-api :: functionalities/breakpoint/breakpoint_callback_command_source/TestBreakpointCallbackCommandSource.py (1007 of 2140) PASS: lldb-api :: functionalities/thread/concurrent_events/TestConcurrentSignalWatch.py (1008 of 2140) PASS: lldb-api :: api/command-return-object/TestSBCommandReturnObject.py (1009 of 2140) PASS: lldb-unit :: Disassembler/./DisassemblerTests/TestArmv7Disassembly.TestCortexFPDisass (1010 of 2140) PASS: lldb-unit :: UnwindAssembly/x86/./UnwindAssemblyx86Tests/Testx86AssemblyInspectionEngine.TestPushImm (1011 of 2140) UNSUPPORTED: lldb-api :: lang/c/typedef/Testtypedef.py (1012 of 2140) PASS: lldb-api :: functionalities/dynamic_value_child_count/TestDynamicValueChildCount.py (1013 of 2140) PASS: lldb-api :: lang/c/blocks/TestBlocks.py (1014 of 2140) UNSUPPORTED: lldb-shell :: SymbolFile/NativePDB/local-variables.cpp (1015 of 2140) PASS: lldb-unit :: ScriptInterpreter/Python/./ScriptInterpreterPythonTests/PythonDataObjectsTest.TestExtractingUInt64ThroughStructuredData (1016 of 2140) PASS: lldb-unit :: UnwindAssembly/x86/./UnwindAssemblyx86Tests/Testx86AssemblyInspectionEngine.TestPushRBPWithREX (1017 of 2140) PASS: lldb-shell :: ObjectFile/ELF/section-overlap.yaml (1018 of 2140) PASS: lldb-api :: functionalities/plugins/python_os_plugin/stepping_plugin_threads/TestOSPluginStepping.py (1019 of 2140) PASS: lldb-unit :: Utility/./UtilityTests/StringExtractorTest.GetHexBytesAvail_Partial (1020 of 2140) UNSUPPORTED: lldb-shell :: SymbolFile/NativePDB/ast-functions-msvc.cpp (1021 of 2140) PASS: lldb-unit :: Utility/./UtilityTests/RangeTest.ContainsEndInclusive (1022 of 2140) PASS: lldb-unit :: Utility/./UtilityTests/DataExtractorTest.GetCStrAtEnd (1023 of 2140) UNSUPPORTED: lldb-api :: tools/lldb-server/libraries-svr4/TestGdbRemoteLibrariesSvr4Support.py (1024 of 2140) PASS: lldb-shell :: ObjectFile/ELF/PT_LOAD-empty.yaml (1025 of 2140) PASS: lldb-api :: functionalities/inferior-crashing/recursive-inferior/TestRecursiveInferior.py (1026 of 2140) PASS: lldb-api :: tools/lldb-vscode/module/TestVSCode_module.py (1027 of 2140) PASS: lldb-unit :: Core/./LLDBCoreTests/SourceFileCache.FindSourceFileNotFound (1028 of 2140) PASS: lldb-unit :: Host/./HostTests/ProcessLaunchInfoTest.Constructor (1029 of 2140) PASS: lldb-api :: commands/expression/radar_8638051/Test8638051.py (1030 of 2140) PASS: lldb-unit :: Utility/./UtilityTests/UriParserTest.SchemeHostSeparator4 (1031 of 2140) PASS: lldb-shell :: Unwind/eh-frame-dwarf-unwind.test (1032 of 2140) PASS: lldb-unit :: Utility/./UtilityTests/AnsiTerminal.Basic (1033 of 2140) PASS: lldb-unit :: ObjectFile/Breakpad/./ObjectFileBreakpadTests/PublicRecord.parse (1034 of 2140) PASS: lldb-api :: commands/gui/basicdebug/TestGuiBasicDebug.py (1035 of 2140) PASS: lldb-api :: functionalities/data-formatter/data-formatter-synthval/TestDataFormatterSynthVal.py (1036 of 2140) UNSUPPORTED: lldb-shell :: Unwind/unwind-plan-dwarf-dump.test (1037 of 2140) PASS: lldb-shell :: Breakpoint/debug_rnglistx_rlex.test (1038 of 2140) PASS: lldb-api :: functionalities/thread/concurrent_events/TestConcurrentTwoWatchpointsOneBreakpoint.py (1039 of 2140) PASS: lldb-api :: api/listeners/TestListener.py (1040 of 2140) PASS: lldb-api :: lang/c/function_types/TestFunctionTypes.py (1041 of 2140) PASS: lldb-unit :: Utility/./UtilityTests/OptionsWithRawTest.EmptySuffix (1042 of 2140) PASS: lldb-unit :: UnwindAssembly/x86/./UnwindAssemblyx86Tests/Testx86AssemblyInspectionEngine.TestLEAVE (1043 of 2140) PASS: lldb-unit :: Target/./TargetTests/ExecutionContextTest.GetByteOrderProcess (1044 of 2140) PASS: lldb-api :: commands/command/script/import/rdar-12586188/TestRdar12586188.py (1045 of 2140) PASS: lldb-unit :: Expression/./ExpressionTests/DiagnosticManagerTest.AddDiagnostic (1046 of 2140) PASS: lldb-unit :: Utility/./UtilityTests/StreamTest.PutMaxHex64ByteOrderLittle (1047 of 2140) PASS: lldb-unit :: Utility/./UtilityTests/ArgsTest.ReplaceArgumentAtIndexOutOfRange (1048 of 2140) PASS: lldb-unit :: debugserver/./debugserverTests/RNBSocket.LoopBackListenIPv4 (1049 of 2140) UNSUPPORTED: lldb-shell :: ExecControl/StopHook/stop-hook-threads.test (1050 of 2140) PASS: lldb-api :: commands/frame/recognizer/TestFrameRecognizer.py (1051 of 2140) PASS: lldb-unit :: UnwindAssembly/x86/./UnwindAssemblyx86Tests/Testx86AssemblyInspectionEngine.TestPushR13 (1052 of 2140) PASS: lldb-api :: commands/gui/basic/TestGuiBasic.py (1053 of 2140) PASS: lldb-shell :: ScriptInterpreter/Python/scripted_breakpoint.test (1054 of 2140) PASS: lldb-api :: api/log/TestAPILog.py (1055 of 2140) PASS: lldb-shell :: SymbolFile/DWARF/clang-ast-from-dwarf-unamed-and-anon-structs.cpp (1056 of 2140) UNSUPPORTED: lldb-shell :: ScriptInterpreter/Lua/bindings.test (1057 of 2140) PASS: lldb-unit :: Symbol/./SymbolTests/TestClangASTImporter.MetadataPropagationIndirectImport (1058 of 2140) PASS: lldb-api :: lang/objc/objc-static-method-stripped/TestObjCStaticMethodStripped.py (1059 of 2140) PASS: lldb-unit :: Core/./LLDBCoreTests/StreamCallbackTest.Callback (1060 of 2140) PASS: lldb-unit :: Symbol/./SymbolTests/TestClangASTImporter.ImportInvalidType (1061 of 2140) PASS: lldb-unit :: Core/./LLDBCoreTests/RichManglingContextTest.Basic (1062 of 2140) PASS: lldb-api :: commands/command/invalid-args/TestInvalidArgsCommand.py (1063 of 2140) PASS: lldb-api :: python_api/watchpoint/watchlocation/TestSetWatchlocation.py (1064 of 2140) UNSUPPORTED: lldb-shell :: Register/x86-64-xmm16-write.test (1065 of 2140) PASS: lldb-api :: lang/objc/objc-dyn-sbtype/TestObjCDynamicSBType.py (1066 of 2140) PASS: lldb-unit :: SymbolFile/NativePDB/./SymbolFileNativePDBTests/PDBFPOProgramToDWARFExpressionTests.UnresolvedRegisterReference (1067 of 2140) PASS: lldb-unit :: Utility/./UtilityTests/BinaryStreamTest.PutSLEB128SixBytes (1068 of 2140) PASS: lldb-unit :: UnwindAssembly/x86/./UnwindAssemblyx86Tests/Testx86AssemblyInspectionEngine.TestSimple64bitFrameFunction (1069 of 2140) PASS: lldb-api :: lang/objc/direct-dispatch-step/TestObjCDirectDispatchStepping.py (1070 of 2140) PASS: lldb-api :: lang/objc/modules-auto-import/TestModulesAutoImport.py (1071 of 2140) PASS: lldb-unit :: Utility/./UtilityTests/CompletionRequest.TestCompletionOwnership (1072 of 2140) PASS: lldb-unit :: UnwindAssembly/x86/./UnwindAssemblyx86Tests/Testx86AssemblyInspectionEngine.TestPopESI (1073 of 2140) PASS: lldb-shell :: SymbolFile/DWARF/debug-types-dwarf5.s (1074 of 2140) PASS: lldb-api :: functionalities/postmortem/elf-core/gcore/TestGCore.py (1075 of 2140) PASS: lldb-api :: commands/expression/context-object/TestContextObject.py (1076 of 2140) PASS: lldb-api :: functionalities/data-formatter/data-formatter-skip-summary/TestDataFormatterSkipSummary.py (1077 of 2140) PASS: lldb-unit :: Utility/./UtilityTests/SerializationRountripTest.SerializeDeserializeObjectPointer (1078 of 2140) PASS: lldb-api :: python_api/process/io/TestProcessIO.py (1079 of 2140) PASS: lldb-unit :: Language/Highlighting/./HighlighterTests/HighlighterTest.ClangCommas (1080 of 2140) PASS: lldb-api :: lang/cpp/rvalue-references/TestRvalueReferences.py (1081 of 2140) PASS: lldb-unit :: Host/./HostTests/FileSystemTest.MakeAbsolute (1082 of 2140) PASS: lldb-shell :: Driver/TestTarget.test (1083 of 2140) PASS: lldb-api :: functionalities/tail_call_frames/ambiguous_tail_call_seq2/TestAmbiguousTailCallSeq2.py (1084 of 2140) PASS: lldb-api :: commands/expression/persistent_variables/TestPersistentVariables.py (1085 of 2140) PASS: lldb-shell :: ObjectFile/ELF/build-id-case.yaml (1086 of 2140) PASS: lldb-unit :: Symbol/./SymbolTests/DWARFCallFrameInfoTest.Basic_dwarf3 (1087 of 2140) PASS: lldb-unit :: Language/Highlighting/./HighlighterTests/HighlighterTest.ClangCursorPosInOtherToken (1088 of 2140) PASS: lldb-unit :: Utility/./UtilityTests/ArgsTest.TestUnknownEscape (1089 of 2140) PASS: lldb-unit :: Expression/./ExpressionTests/CppModuleConfigurationTest.Linux (1090 of 2140) XFAIL: lldb-shell :: Register/x86-64-write.test (1091 of 2140) PASS: lldb-unit :: Utility/./UtilityTests/LogChannelEnabledTest.LLDB_LOG_ERROR (1092 of 2140) PASS: lldb-api :: commands/expression/anonymous-struct/TestCallUserAnonTypedef.py (1093 of 2140) PASS: lldb-unit :: UnwindAssembly/PPC64/./PPC64InstEmulationTests/TestPPC64InstEmulation.TestSimpleFunction (1094 of 2140) PASS: lldb-api :: lang/cpp/frame-var-anon-unions/TestFrameVariableAnonymousUnions.py (1095 of 2140) PASS: lldb-shell :: SymbolFile/DWARF/clang-ast-from-dwarf-objc-property.m (1096 of 2140) PASS: lldb-unit :: Process/minidump/./LLDBMinidumpTests/MinidumpParserTest.GetFilteredModuleList (1097 of 2140) PASS: lldb-shell :: SymbolFile/DWARF/deterministic-build.cpp (1098 of 2140) PASS: lldb-unit :: Interpreter/./InterpreterTests/OptionArgParserTest.toChar (1099 of 2140) PASS: lldb-unit :: ScriptInterpreter/Python/./ScriptInterpreterPythonTests/PythonDataObjectsTest.TestResetting (1100 of 2140) PASS: lldb-api :: functionalities/breakpoint/breakpoint_ignore_count/TestBreakpointIgnoreCount.py (1101 of 2140) PASS: lldb-unit :: Process/minidump/./LLDBMinidumpTests/MinidumpParserTest.GetThreadContext_x86_32 (1102 of 2140) PASS: lldb-api :: functionalities/data-formatter/data-formatter-stl/libcxx/function/TestLibCxxFunction.py (1103 of 2140) PASS: lldb-api :: commands/disassemble/basic/TestDisassembleBreakpoint.py (1104 of 2140) PASS: lldb-api :: python_api/disassemble-raw-data/TestDisassembleRawData.py (1105 of 2140) PASS: lldb-api :: lang/objc/objc-property/TestObjCProperty.py (1106 of 2140) PASS: lldb-unit :: Symbol/./SymbolTests/TestTypeSystemClang.TestGetTypeClassDeclType (1107 of 2140) PASS: lldb-shell :: SymbolFile/symbol-binding.test (1108 of 2140) PASS: lldb-shell :: SymbolFile/DWARF/dwp.s (1109 of 2140) PASS: lldb-shell :: Driver/TestCommands.test (1110 of 2140) PASS: lldb-unit :: Utility/./UtilityTests/FileSpecTest.RemoveLastPathComponent (1111 of 2140) PASS: lldb-unit :: Utility/./UtilityTests/ArgsTest.TestArgv (1112 of 2140) PASS: lldb-shell :: Reproducer/TestDump.test (1113 of 2140) PASS: lldb-unit :: Utility/./UtilityTests/OptionsWithRawTest.SingleWordSuffix (1114 of 2140) PASS: lldb-api :: functionalities/data-formatter/nsdictionarysynth/TestNSDictionarySynthetic.py (1115 of 2140) PASS: lldb-shell :: ObjectFile/PECOFF/sections.yaml (1116 of 2140) PASS: lldb-shell :: ObjectFile/ELF/minidebuginfo-find-symbols.yaml (1117 of 2140) PASS: lldb-unit :: Platform/Android/./AdbClientTests/AdbClientTest.CreateByDeviceId_ByEnvVar (1118 of 2140) UNSUPPORTED: lldb-shell :: Unwind/eh-frame-small-fde.test (1119 of 2140) PASS: lldb-shell :: Unwind/trap_frame_sym_ctx.test (1120 of 2140) PASS: lldb-shell :: ObjectFile/ELF/PT_LOAD-overlap-PT_TLS.yaml (1121 of 2140) PASS: lldb-unit :: Utility/./UtilityTests/StreamTeeTest.SetStreamAtIndexOutOfBounds (1122 of 2140) PASS: lldb-api :: lang/objc/foundation/TestConstStrings.py (1123 of 2140) PASS: lldb-unit :: Utility/./UtilityTests/RangeTest.SlideZero (1124 of 2140) PASS: lldb-unit :: Utility/./UtilityTests/StringListTest.AppendStringStdString (1125 of 2140) PASS: lldb-unit :: Utility/./UtilityTests/OptionsWithRawTest.EmptyArgsOnlySuffix (1126 of 2140) PASS: lldb-api :: functionalities/thread/concurrent_events/TestConcurrentManyCrash.py (1127 of 2140) PASS: lldb-shell :: Minidump/Windows/arm-fp-unwind.test (1128 of 2140) PASS: lldb-unit :: Utility/./UtilityTests/UriParserTest.BracketedHostnameWithColon (1129 of 2140) PASS: lldb-unit :: Process/gdb-remote/./ProcessGdbRemoteTests/GDBRemoteClientBaseTest.SendContinueAndInterrupt2PacketBug (1130 of 2140) PASS: lldb-api :: functionalities/data-formatter/data-formatter-stl/libcxx/vector/TestDataFormatterLibcxxVector.py (1131 of 2140) PASS: lldb-shell :: Driver/TestProcessAttach.test (1132 of 2140) PASS: lldb-unit :: ScriptInterpreter/Python/./ScriptInterpreterPythonTests/PythonDataObjectsTest.TestPythonBoolean (1133 of 2140) PASS: lldb-shell :: SymbolFile/DWARF/debug-types-basic.test (1134 of 2140) PASS: lldb-unit :: ScriptInterpreter/Python/./ScriptInterpreterPythonTests/PythonDataObjectsTest.TestPythonCallableCheck (1135 of 2140) PASS: lldb-unit :: Utility/./UtilityTests/LogTest.LLDB_LOG_nullptr (1136 of 2140) PASS: lldb-api :: lang/objc/objc-runtime-ivars/TestRuntimeIvars.py (1137 of 2140) PASS: lldb-unit :: Utility/./UtilityTests/StreamTest.PutHex64ByteOrderBig (1138 of 2140) PASS: lldb-shell :: SymbolFile/DWARF/split-dwarf-multiple-cu.ll (1139 of 2140) PASS: lldb-api :: functionalities/thread/concurrent_events/TestConcurrentSignalDelayBreak.py (1140 of 2140) PASS: lldb-api :: functionalities/thread/concurrent_events/TestConcurrentWatchpointWithDelayWatchpointThreads.py (1141 of 2140) PASS: lldb-unit :: Expression/./ExpressionTests/CppModuleConfigurationTest.AmbiguousLibCpp (1142 of 2140) PASS: lldb-api :: python_api/class_members/TestSBTypeClassMembers.py (1143 of 2140) PASS: lldb-api :: functionalities/memory-region/TestMemoryRegion.py (1144 of 2140) PASS: lldb-api :: lang/objc/unicode-string/TestUnicodeString.py (1145 of 2140) PASS: lldb-unit :: Symbol/./SymbolTests/TestClangASTImporter.DeportDeclTagDecl (1146 of 2140) PASS: lldb-shell :: SymbolFile/DWARF/dwp-debug-types.s (1147 of 2140) PASS: lldb-shell :: SymbolFile/DWARF/find-basic-namespace.cpp (1148 of 2140) PASS: lldb-unit :: Utility/./UtilityTests/VMRange.ContainsAddr (1149 of 2140) PASS: lldb-api :: lang/objc/print-obj/TestPrintObj.py (1150 of 2140) PASS: lldb-api :: commands/frame/select/TestFrameSelect.py (1151 of 2140) PASS: lldb-unit :: Utility/./UtilityTests/ScalarTest.Equality (1152 of 2140) PASS: lldb-api :: functionalities/data-formatter/ostypeformatting/TestFormattersOsType.py (1153 of 2140) PASS: lldb-api :: functionalities/load_using_paths/TestLoadUsingPaths.py (1154 of 2140) PASS: lldb-api :: lang/objc/modules-update/TestClangModulesUpdate.py (1155 of 2140) PASS: lldb-shell :: SymbolFile/NativePDB/ast-methods.cpp (1156 of 2140) PASS: lldb-unit :: Utility/./UtilityTests/VMRange.Comparison (1157 of 2140) PASS: lldb-api :: commands/expression/import-std-module/conflicts/TestStdModuleWithConflicts.py (1158 of 2140) PASS: lldb-unit :: Utility/./UtilityTests/OptionsWithRawTest.SingleWhitespaceInput (1159 of 2140) PASS: lldb-unit :: Process/minidump/./LLDBMinidumpTests/MinidumpParserTest.GetMemory (1160 of 2140) PASS: lldb-unit :: Utility/./UtilityTests/BinaryStreamTest.PutULEB128SixBytes (1161 of 2140) PASS: lldb-shell :: Commands/command-target-modules-dump-sections.yaml (1162 of 2140) PASS: lldb-shell :: Settings/TestSettingsWrite.test (1163 of 2140) PASS: lldb-api :: functionalities/thread/thread_specific_break/TestThreadSpecificBreakpoint.py (1164 of 2140) PASS: lldb-api :: lang/cpp/operator-overload/TestOperatorOverload.py (1165 of 2140) PASS: lldb-shell :: SymbolFile/Breakpad/symtab.test (1166 of 2140) PASS: lldb-api :: functionalities/recursion/TestValueObjectRecursion.py (1167 of 2140) UNSUPPORTED: lldb-api :: benchmarks/startup/TestStartupDelays.py (1168 of 2140) PASS: lldb-unit :: Symbol/./SymbolTests/TestTypeSystemClang.TestGetBasicTypeFromName (1169 of 2140) UNSUPPORTED: lldb-shell :: SymbolFile/PDB/vbases.test (1170 of 2140) PASS: lldb-api :: functionalities/abbreviation/TestCommonShortSpellings.py (1171 of 2140) PASS: lldb-api :: commands/expression/import-std-module/vector-dbg-info-content/TestDbgInfoContentVectorFromStdModule.py (1172 of 2140) PASS: lldb-unit :: Utility/./UtilityTests/RangeTest.ContainsAddr (1173 of 2140) UNSUPPORTED: lldb-api :: linux/add-symbols/TestTargetSymbolsAddCommand.py (1174 of 2140) PASS: lldb-unit :: Symbol/./SymbolTests/TestClangASTImporter.DeportTypeTagDecl (1175 of 2140) PASS: lldb-api :: functionalities/thread/concurrent_events/TestConcurrentDelayedCrashWithBreakpointSignal.py (1176 of 2140) PASS: lldb-api :: commands/command/nested_alias/TestNestedAlias.py (1177 of 2140) PASS: lldb-unit :: Language/Highlighting/./HighlighterTests/HighlighterTest.ClangPreserveNewLine (1178 of 2140) PASS: lldb-unit :: Core/./LLDBCoreTests/MangledTest.ResultForValidName (1179 of 2140) PASS: lldb-api :: functionalities/data-formatter/data-formatter-stl/libcxx/forward_list/TestDataFormatterLibcxxForwardList.py (1180 of 2140) PASS: lldb-unit :: Target/./TargetTests/ModuleCacheTest.GetAndPutStrangeHostname (1181 of 2140) PASS: lldb-unit :: Expression/./ExpressionTests/DiagnosticManagerTest.PutString (1182 of 2140) PASS: lldb-unit :: Utility/./UtilityTests/RegisterValueTest.GetSet8 (1183 of 2140) UNSUPPORTED: lldb-shell :: SymbolFile/PDB/variables.test (1184 of 2140) PASS: lldb-unit :: Utility/./UtilityTests/ScalarTest.Getters (1185 of 2140) PASS: lldb-unit :: Expression/./ExpressionTests/DiagnosticManagerTest.AppendMessageAttachToLastDiag (1186 of 2140) PASS: lldb-api :: tools/lldb-vscode/stackTrace/TestVSCode_stackTrace.py (1187 of 2140) PASS: lldb-unit :: Process/gdb-remote/./ProcessGdbRemoteTests/GDBRemoteCommunicationClientTest.SendGetMetaDataPacket (1188 of 2140) PASS: lldb-unit :: SymbolFile/DWARF/./SymbolFileDWARFTests/SymbolFileDWARFTests.TestAbbrevOrder1Start1 (1189 of 2140) PASS: lldb-api :: commands/target/stop-hook/enable/TestTargetStopHookEnable.py (1190 of 2140) PASS: lldb-api :: commands/settings/quoting/TestQuoting.py (1191 of 2140) PASS: lldb-api :: commands/command/script/TestCommandScript.py (1192 of 2140) PASS: lldb-unit :: Expression/./ExpressionTests/DWARFExpression.DW_OP_convert (1193 of 2140) PASS: lldb-unit :: Utility/./UtilityTests/XcodeSDKTest.SDKSupportsModules (1194 of 2140) PASS: lldb-shell :: ObjectFile/ELF/netbsd-core-amd64.test (1195 of 2140) PASS: lldb-api :: lang/cpp/nsimport/TestCppNsImport.py (1196 of 2140) PASS: lldb-unit :: Process/gdb-remote/./ProcessGdbRemoteTests/GDBRemoteCommunicationServerTest.SendErrorResponse_StringError (1197 of 2140) PASS: lldb-unit :: UnwindAssembly/x86/./UnwindAssemblyx86Tests/Testx86AssemblyInspectionEngine.TestSimple32bitFrameFunction (1198 of 2140) PASS: lldb-api :: python_api/lldbutil/process/TestPrintStackTraces.py (1199 of 2140) PASS: lldb-unit :: SymbolFile/NativePDB/./SymbolFileNativePDBTests/PDBFPOProgramToDWARFExpressionTests.SingleAssignmentRegisterRef (1200 of 2140) PASS: lldb-api :: functionalities/data-formatter/frameformat_smallstruct/TestFrameFormatSmallStruct.py (1201 of 2140) UNSUPPORTED: lldb-api :: tools/lldb-server/thread-name/TestGdbRemoteThreadName.py (1202 of 2140) PASS: lldb-api :: lang/c/struct_types/TestStructTypes.py (1203 of 2140) PASS: lldb-unit :: Utility/./UtilityTests/ScalarTest.GetValue (1204 of 2140) PASS: lldb-unit :: Utility/./UtilityTests/ArgsTest.TestSingleArgWithQuotedSpace (1205 of 2140) PASS: lldb-shell :: SymbolFile/Breakpad/symtab-macho.test (1206 of 2140) PASS: lldb-api :: python_api/section/TestSectionAPI.py (1207 of 2140) PASS: lldb-unit :: Expression/./ExpressionTests/CppModuleConfigurationTest.IgnoreLibStdCpp (1208 of 2140) PASS: lldb-unit :: Utility/./UtilityTests/PassiveReplayTest.InstrumentedBar (1209 of 2140) UNSUPPORTED: lldb-api :: tools/lldb-server/registers-target-xml-reading/TestGdbRemoteTargetXmlPacket.py (1210 of 2140) PASS: lldb-api :: lang/cpp/unique-types/TestUniqueTypes.py (1211 of 2140) PASS: lldb-shell :: SymbolFile/DWARF/dwp-separate-debug-file.cpp (1212 of 2140) PASS: lldb-unit :: UnwindAssembly/x86/./UnwindAssemblyx86Tests/Testx86AssemblyInspectionEngine.TestPopR14 (1213 of 2140) PASS: lldb-unit :: Utility/./UtilityTests/StreamTest.SetIndentLevel (1214 of 2140) PASS: lldb-unit :: Utility/./UtilityTests/StreamTest.PutCString (1215 of 2140) PASS: lldb-api :: commands/expression/import-std-module/forward_decl_from_module/TestForwardDeclFromStdModule.py (1216 of 2140) PASS: lldb-unit :: Utility/./UtilityTests/ListenerTest.GetEventWait (1217 of 2140) PASS: lldb-api :: commands/process/attach-resume/TestAttachResume.py (1218 of 2140) PASS: lldb-api :: commands/expression/calculator_mode/TestCalculatorMode.py (1219 of 2140) PASS: lldb-unit :: Utility/./UtilityTests/CompletionRequest.Constructor (1220 of 2140) PASS: lldb-shell :: Commands/command-script-import.test (1221 of 2140) PASS: lldb-unit :: UnwindAssembly/x86/./UnwindAssemblyx86Tests/Testx86AssemblyInspectionEngine.TestPushECX (1222 of 2140) PASS: lldb-api :: commands/platform/basic/TestPlatformPython.py (1223 of 2140) PASS: lldb-api :: tools/lldb-server/TestGdbRemote_vCont.py (1224 of 2140) PASS: lldb-api :: commands/frame/diagnose/array/TestArray.py (1225 of 2140) PASS: lldb-api :: functionalities/load_unload/TestLoadUnload.py (1226 of 2140) PASS: lldb-api :: functionalities/gdb_remote_client/TestRecognizeBreakpoint.py (1227 of 2140) PASS: lldb-api :: lang/cpp/unicode-literals/TestUnicodeLiterals.py (1228 of 2140) PASS: lldb-unit :: Utility/./UtilityTests/XcodeSDKTest.MergeTest (1229 of 2140) PASS: lldb-shell :: SymbolFile/DWARF/DW_AT_low_pc-addrx.s (1230 of 2140) PASS: lldb-api :: commands/expression/completion/TestExprCompletion.py (1231 of 2140) PASS: lldb-shell :: Heap/heap-cstr.test (1232 of 2140) PASS: lldb-unit :: Host/./HostTests/MainLoopTest.UnmonitoredSignal (1233 of 2140) PASS: lldb-unit :: Expression/./ExpressionTests/DiagnosticManagerTest.GetStringSeverityLabels (1234 of 2140) PASS: lldb-api :: commands/expression/dollar-in-variable/TestDollarInVariable.py (1235 of 2140) PASS: lldb-api :: python_api/sbvalue_persist/TestSBValuePersist.py (1236 of 2140) PASS: lldb-unit :: ScriptInterpreter/Python/./ScriptInterpreterPythonTests/PythonDataObjectsTest.TestGlobalNameResolutionWithDot (1237 of 2140) PASS: lldb-unit :: Utility/./UtilityTests/StringListTest.ForRange (1238 of 2140) PASS: lldb-unit :: Host/./HostTests/Host.WaitStatusFormat (1239 of 2140) PASS: lldb-unit :: Utility/./UtilityTests/DataExtractorTest.GetMaxS64 (1240 of 2140) PASS: lldb-shell :: SymbolFile/DWARF/dwarf5_locations.s (1241 of 2140) PASS: lldb-unit :: UnwindAssembly/x86/./UnwindAssemblyx86Tests/Testx86AssemblyInspectionEngine.TestSubESP (1242 of 2140) PASS: lldb-api :: commands/process/attach/TestProcessAttach.py (1243 of 2140) PASS: lldb-api :: python_api/symbol-context/TestSymbolContext.py (1244 of 2140) PASS: lldb-api :: functionalities/data-formatter/poarray/TestPrintObjectArray.py (1245 of 2140) PASS: lldb-api :: functionalities/breakpoint/breakpoint_by_line_and_column/TestBreakpointByLineAndColumn.py (1246 of 2140) PASS: lldb-shell :: SymbolFile/Breakpad/line-table-missing-file.test (1247 of 2140) PASS: lldb-api :: functionalities/show_location/TestShowLocationDwarf5.py (1248 of 2140) PASS: lldb-unit :: Utility/./UtilityTests/BinaryStreamTest.PutULEB128TwoBytes (1249 of 2140) PASS: lldb-unit :: Host/./HostTests/HostInfoTest.GetHostname (1250 of 2140) PASS: lldb-api :: macosx/find-dsym/deep-bundle/TestDeepBundle.py (1251 of 2140) PASS: lldb-unit :: ScriptInterpreter/Python/./ScriptInterpreterPythonTests/PythonDataObjectsTest.TestPythonCallableInvoke (1252 of 2140) PASS: lldb-api :: functionalities/thread/concurrent_events/TestConcurrentTwoWatchpointsOneDelayBreakpoint.py (1253 of 2140) PASS: lldb-unit :: Utility/./UtilityTests/DataExtractorTest.GetCStrUnterminated (1254 of 2140) PASS: lldb-unit :: SymbolFile/NativePDB/./SymbolFileNativePDBTests/PDBFPOProgramToDWARFExpressionTests.UnresolvedDependentCyclicRegisterAssignmentReference (1255 of 2140) PASS: lldb-api :: macosx/duplicate-archive-members/TestDuplicateMembers.py (1256 of 2140) PASS: lldb-unit :: Utility/./UtilityTests/StringExtractorTest.GetHexBytes_OddPair2 (1257 of 2140) PASS: lldb-unit :: Utility/./UtilityTests/StructuredDataTest.StringDump (1258 of 2140) PASS: lldb-api :: commands/expression/import-std-module/list-dbg-info-content/TestDbgInfoContentListFromStdModule.py (1259 of 2140) PASS: lldb-unit :: ScriptInterpreter/Python/./ScriptInterpreterPythonTests/PythonDataObjectsTest.TestOwnedReferences (1260 of 2140) PASS: lldb-api :: lang/cpp/gmodules-templates/TestGModules.py (1261 of 2140) PASS: lldb-api :: types/TestIntegerTypeExpr.py (1262 of 2140) PASS: lldb-unit :: Utility/./UtilityTests/UriParserTest.BracketedHostnameWithPortIPv4 (1263 of 2140) PASS: lldb-unit :: Utility/./UtilityTests/DataExtractorTest.GetDouble (1264 of 2140) PASS: lldb-api :: functionalities/backticks/TestBackticksWithoutATarget.py (1265 of 2140) PASS: lldb-shell :: BuildScript/compiler-full-path.test (1266 of 2140) PASS: lldb-api :: lang/objc/objc-static-method/TestObjCStaticMethod.py (1267 of 2140) PASS: lldb-unit :: ScriptInterpreter/Python/./ScriptInterpreterPythonTests/PythonDataObjectsTest.TestPythonDictionaryToStructuredDictionary (1268 of 2140) PASS: lldb-api :: functionalities/postmortem/elf-core/thread_crash/TestLinuxCoreThreads.py (1269 of 2140) PASS: lldb-unit :: Utility/./UtilityTests/RangeTest.DefaultConstructor (1270 of 2140) PASS: lldb-api :: lang/cpp/const_this/TestConstThis.py (1271 of 2140) PASS: lldb-unit :: Utility/./UtilityTests/EventTest.DumpEventDataBytes (1272 of 2140) PASS: lldb-api :: python_api/module_section/TestModuleAndSection.py (1273 of 2140) PASS: lldb-api :: python_api/lldbutil/iter/TestLLDBIterator.py (1274 of 2140) PASS: lldb-unit :: Utility/./UtilityTests/StringExtractorTest.GetU64LittleEndian (1275 of 2140) PASS: lldb-api :: python_api/lldbutil/iter/TestRegistersIterator.py (1276 of 2140) PASS: lldb-unit :: Process/gdb-remote/./ProcessGdbRemoteTests/GDBRemoteCommunicationClientTest.GetMemoryRegionInfoInvalidResponse (1277 of 2140) PASS: lldb-api :: functionalities/multidebugger_commands/TestMultipleDebuggersCommands.py (1278 of 2140) PASS: lldb-shell :: SymbolFile/NativePDB/disassembly.cpp (1279 of 2140) PASS: lldb-unit :: Symbol/./SymbolTests/TestTypeSystemClang.TestGetTypeClassNested (1280 of 2140) PASS: lldb-unit :: Utility/./UtilityTests/ScalarTest.Promotion (1281 of 2140) PASS: lldb-unit :: Utility/./UtilityTests/RangeDataVector.FindEntryThatContains_Overlap (1282 of 2140) PASS: lldb-shell :: Driver/TestError.test (1283 of 2140) PASS: lldb-unit :: SymbolFile/NativePDB/./SymbolFileNativePDBTests/PDBFPOProgramToDWARFExpressionTests.DependencyChain (1284 of 2140) PASS: lldb-api :: python_api/value_var_update/TestValueVarUpdate.py (1285 of 2140) UNSUPPORTED: lldb-api :: commands/watchpoints/multi_watchpoint_slots/TestWatchpointMultipleSlots.py (1286 of 2140) PASS: lldb-unit :: UnwindAssembly/ARM64/./Arm64InstEmulationTests/TestArm64InstEmulation.TestSimpleDarwinFunction (1287 of 2140) PASS: lldb-api :: lang/objc/objc-optimized/TestObjcOptimized.py (1288 of 2140) PASS: lldb-unit :: Expression/./ExpressionTests/CppModuleConfigurationTest.MissingLibCpp (1289 of 2140) PASS: lldb-api :: functionalities/thread/concurrent_events/TestConcurrentSignalDelayWatch.py (1290 of 2140) PASS: lldb-api :: lang/cpp/modules-import/TestCXXModulesImport.py (1291 of 2140) PASS: lldb-shell :: ObjectFile/Breakpad/breakpad-identification.test (1292 of 2140) PASS: lldb-api :: functionalities/target_var/TestTargetVar.py (1293 of 2140) PASS: lldb-unit :: Utility/./UtilityTests/StringListTest.InsertStringAtIndexMove (1294 of 2140) PASS: lldb-unit :: Interpreter/./InterpreterTests/CompletionTest.FileCompletionAbsolute (1295 of 2140) PASS: lldb-api :: functionalities/mtc/simple/TestMTCSimple.py (1296 of 2140) PASS: lldb-api :: functionalities/tsan/global_location/TestTsanGlobalLocation.py (1297 of 2140) PASS: lldb-api :: functionalities/data-formatter/format-propagation/TestFormatPropagation.py (1298 of 2140) PASS: lldb-api :: python_api/sbvalue_const_addrof/TestSBValueConstAddrOf.py (1299 of 2140) PASS: lldb-api :: python_api/name_lookup/TestNameLookup.py (1300 of 2140) PASS: lldb-unit :: Host/./HostTests/NativeProcessProtocolTest.SetBreakpointFailVerify (1301 of 2140) PASS: lldb-unit :: Editline/./EditlineTests/EditlineTestFixture.EditlineReceivesSingleLineText (1302 of 2140) PASS: lldb-unit :: Utility/./UtilityTests/StringListTest.AppendListCStringArrayEmpty (1303 of 2140) PASS: lldb-api :: functionalities/breakpoint/address_breakpoints/TestBadAddressBreakpoints.py (1304 of 2140) PASS: lldb-unit :: Language/Highlighting/./HighlighterTests/HighlighterTest.ClangEmptyInput (1305 of 2140) PASS: lldb-api :: functionalities/data-formatter/data-formatter-advanced/TestDataFormatterAdv.py (1306 of 2140) PASS: lldb-unit :: Utility/./UtilityTests/UriParserTest.LongPath (1307 of 2140) PASS: lldb-api :: commands/gui/breakpoints/TestGuiBreakpoints.py (1308 of 2140) PASS: lldb-api :: functionalities/data-formatter/data-formatter-objc/TestDataFormatterObjCNSURL.py (1309 of 2140) PASS: lldb-unit :: Utility/./UtilityTests/ArgsTest.ReplaceArgumentAtIndexLonger (1310 of 2140) PASS: lldb-unit :: Utility/./UtilityTests/StreamTest.AddressNoSuffix (1311 of 2140) PASS: lldb-api :: functionalities/thread/concurrent_events/TestConcurrentCrashWithBreak.py (1312 of 2140) PASS: lldb-api :: functionalities/type_completion/TestTypeCompletion.py (1313 of 2140) PASS: lldb-shell :: SymbolFile/Breakpad/line-table.test (1314 of 2140) PASS: lldb-unit :: Utility/./UtilityTests/RangeTest.LessThan (1315 of 2140) UNSUPPORTED: lldb-api :: functionalities/darwin_log/filter/exact_match/subsystem/TestDarwinLogFilterMatchSubsystem.py (1316 of 2140) PASS: lldb-unit :: Utility/./UtilityTests/BinaryStreamTest.PutSLEB128One (1317 of 2140) PASS: lldb-api :: commands/frame/var/TestFrameVar.py (1318 of 2140) PASS: lldb-unit :: ObjectFile/Breakpad/./ObjectFileBreakpadTests/InfoRecord.parse (1319 of 2140) PASS: lldb-unit :: ScriptInterpreter/Python/./ScriptInterpreterPythonTests/PythonDataObjectsTest.TestPythonDictionaryValueEquality (1320 of 2140) PASS: lldb-api :: functionalities/tail_call_frames/disambiguate_paths_to_common_sink/TestDisambiguatePathsToCommonSink.py (1321 of 2140) UNSUPPORTED: lldb-api :: functionalities/darwin_log/filter/regex/activity/TestDarwinLogFilterRegexActivity.py (1322 of 2140) PASS: lldb-shell :: Commands/command-breakpoint-col.test (1323 of 2140) PASS: lldb-unit :: Expression/./ExpressionTests/CppModuleConfigurationTest.MissingUsrInclude (1324 of 2140) PASS: lldb-api :: commands/expression/cast_int_to_anonymous_enum/TestCastIntToAnonymousEnum.py (1325 of 2140) PASS: lldb-unit :: Expression/./ExpressionTests/ClangHostTest.MacOSX (1326 of 2140) PASS: lldb-shell :: Driver/TestNoUseColor.test (1327 of 2140) PASS: lldb-api :: lang/cpp/symbols/TestSymbols.py (1328 of 2140) PASS: lldb-unit :: Utility/./UtilityTests/UriParserTest.TypicalPortPathIPv4 (1329 of 2140) PASS: lldb-unit :: Utility/./UtilityTests/ConstStringTest.CompareConstString (1330 of 2140) PASS: lldb-api :: functionalities/postmortem/minidump/TestMiniDump.py (1331 of 2140) PASS: lldb-api :: functionalities/thread/ignore_suspended/TestIgnoreSuspendedThread.py (1332 of 2140) PASS: lldb-unit :: Utility/./UtilityTests/StringExtractorTest.DecodeHexU8_Extra (1333 of 2140) PASS: lldb-api :: lang/cpp/auto/TestCPPAuto.py (1334 of 2140) PASS: lldb-unit :: Utility/./UtilityTests/VASprintfTest.NoBufferResize (1335 of 2140) PASS: lldb-shell :: Quit/TestQuitExitCode-30.test (1336 of 2140) PASS: lldb-unit :: Utility/./UtilityTests/GeneratorTest.GetOrCreate (1337 of 2140) PASS: lldb-api :: functionalities/inline-stepping/TestInlineStepping.py (1338 of 2140) PASS: lldb-shell :: Commands/command-thread-select.test (1339 of 2140) PASS: lldb-unit :: Expression/./ExpressionTests/DWARFExpression.DW_OP_unknown (1340 of 2140) PASS: lldb-unit :: Utility/./UtilityTests/FileSpecTest.PrependPathComponent (1341 of 2140) PASS: lldb-unit :: Utility/./UtilityTests/StringExtractorTest.GetNameColonValueNoColon (1342 of 2140) PASS: lldb-api :: commands/expression/import-std-module/vector-of-vectors/TestVectorOfVectorsFromStdModule.py (1343 of 2140) PASS: lldb-unit :: Utility/./UtilityTests/RangeVector.CombineConsecutiveRanges (1344 of 2140) PASS: lldb-unit :: Utility/./UtilityTests/StringExtractorTest.GetHexBytes (1345 of 2140) PASS: lldb-unit :: UnwindAssembly/x86/./UnwindAssemblyx86Tests/Testx86AssemblyInspectionEngine.TestSpillRegToStackViaMOVi386 (1346 of 2140) PASS: lldb-unit :: Language/Highlighting/./HighlighterTests/HighlighterTest.ClangScalarLiterals (1347 of 2140) PASS: lldb-unit :: Host/./HostTests/SocketTest.TCPGetAddress (1348 of 2140) PASS: lldb-api :: functionalities/data-formatter/data-formatter-stl/libcxx/multimap/TestDataFormatterLibccMultiMap.py (1349 of 2140) PASS: lldb-api :: terminal/TestEditline.py (1350 of 2140) PASS: lldb-api :: commands/expression/unwind_expression/TestUnwindExpression.py (1351 of 2140) PASS: lldb-unit :: Utility/./UtilityTests/Flags.Clear (1352 of 2140) PASS: lldb-unit :: Utility/./UtilityTests/UriParserTest.MinimalPort (1353 of 2140) PASS: lldb-unit :: Host/./HostTests/FileSystemTest.Readable (1354 of 2140) PASS: lldb-unit :: Utility/./UtilityTests/RangeTest.EqualInvalid (1355 of 2140) PASS: lldb-api :: commands/expression/namespace_local_var_same_name_cpp_and_c/TestNamespaceLocalVarSameNameCppAndC.py (1356 of 2140) PASS: lldb-api :: python_api/objc_type/TestObjCType.py (1357 of 2140) PASS: lldb-unit :: Utility/./UtilityTests/ArgsTest.TestSingleQuotedArgWithSpace (1358 of 2140) UNSUPPORTED: lldb-api :: tools/lldb-vscode/disconnect/TestVSCode_disconnect.py (1359 of 2140) UNSUPPORTED: lldb-shell :: Expr/TestIRMemoryMapWindows.test (1360 of 2140) PASS: lldb-unit :: Platform/./LLDBPlatformTests/PlatformDarwinTest.FindComponentInPath (1361 of 2140) PASS: lldb-api :: functionalities/data-formatter/data-formatter-proper-plurals/TestFormattersOneIsSingular.py (1362 of 2140) PASS: lldb-api :: lang/objc/orderedset/TestOrderedSet.py (1363 of 2140) PASS: lldb-unit :: Utility/./UtilityTests/StringExtractorTest.GetHexBytesAvail_Underflow (1364 of 2140) PASS: lldb-api :: functionalities/tail_call_frames/thread_step_out_message/TestArtificialFrameStepOutMessage.py (1365 of 2140) PASS: lldb-api :: tools/lldb-vscode/variables/TestVSCode_variables.py (1366 of 2140) UNSUPPORTED: lldb-shell :: ScriptInterpreter/Lua/io.test (1367 of 2140) PASS: lldb-unit :: Utility/./UtilityTests/LogTest.Unregister (1368 of 2140) PASS: lldb-unit :: Utility/./UtilityTests/LogChannelEnabledTest.log_options (1369 of 2140) PASS: lldb-api :: commands/expression/multiline-completion/TestMultilineCompletion.py (1370 of 2140) PASS: lldb-api :: lang/objc/objc-new-syntax/TestObjCNewSyntaxDictionary.py (1371 of 2140) PASS: lldb-unit :: Utility/./UtilityTests/OptionsWithRawTest.WhitespaceSuffix (1372 of 2140) PASS: lldb-api :: functionalities/process_group/TestChangeProcessGroup.py (1373 of 2140) PASS: lldb-unit :: Utility/./UtilityTests/AnsiTerminal.Unknown (1374 of 2140) PASS: lldb-shell :: Commands/command-backtrace.test (1375 of 2140) PASS: lldb-unit :: Utility/./UtilityTests/BinaryStreamTest.PutULEB128ThreeBytes (1376 of 2140) PASS: lldb-api :: functionalities/thread/concurrent_events/TestConcurrentManyBreakpoints.py (1377 of 2140) PASS: lldb-unit :: Utility/./UtilityTests/Flags.AllClear (1378 of 2140) PASS: lldb-api :: functionalities/data-formatter/var-in-aggregate-misuse/TestVarInAggregateMisuse.py (1379 of 2140) PASS: lldb-api :: functionalities/thread/concurrent_events/TestConcurrentTwoWatchpointThreads.py (1380 of 2140) PASS: lldb-shell :: ObjectFile/ELF/section-permissions.yaml (1381 of 2140) PASS: lldb-unit :: Language/CPlusPlus/./LanguageCPlusPlusTests/CPlusPlusLanguage.CPlusPlusNameParser (1382 of 2140) PASS: lldb-api :: commands/statistics/basic/TestStats.py (1383 of 2140) PASS: lldb-api :: functionalities/stats_api/TestStatisticsAPI.py (1384 of 2140) PASS: lldb-api :: commands/frame/diagnose/inheritance/TestDiagnoseInheritance.py (1385 of 2140) PASS: lldb-api :: functionalities/data-formatter/data-formatter-objc/TestDataFormatterObjCExpr.py (1386 of 2140) PASS: lldb-unit :: Utility/./UtilityTests/SerializationRountripTest.SerializeDeserializeCStringArray (1387 of 2140) PASS: lldb-unit :: Utility/./UtilityTests/RangeDataVector.FindEntryThatContains (1388 of 2140) PASS: lldb-unit :: Host/./HostTests/NativeProcessProtocolTest.SetBreakpointFailRead (1389 of 2140) PASS: lldb-unit :: Utility/./UtilityTests/VMRange.SetEndAddress (1390 of 2140) PASS: lldb-unit :: Utility/./UtilityTests/ProcessInstanceInfo.Yaml (1391 of 2140) PASS: lldb-api :: lang/cpp/overloaded-functions/TestOverloadedFunctions.py (1392 of 2140) PASS: lldb-unit :: Signals/./SignalsTests/UnixSignalsTest.Iteration (1393 of 2140) PASS: lldb-unit :: Utility/./UtilityTests/StringLexerTest.AdvanceIf (1394 of 2140) PASS: lldb-api :: functionalities/data-formatter/type_summary_list_arg/TestTypeSummaryListArg.py (1395 of 2140) PASS: lldb-unit :: Utility/./UtilityTests/SerializationRountripTest.SerializeDeserializePodPointers (1396 of 2140) PASS: lldb-unit :: Host/./HostTests/MainLoopTest.ReadObject (1397 of 2140) PASS: lldb-api :: lang/c/shared_lib/TestSharedLib.py (1398 of 2140) PASS: lldb-unit :: Utility/./UtilityTests/StringExtractorTest.GetU64BigEndian (1399 of 2140) PASS: lldb-api :: functionalities/postmortem/wow64_minidump/TestWow64MiniDump.py (1400 of 2140) PASS: lldb-shell :: ObjectFile/ELF/PT_TLS-overlap-PT_LOAD.yaml (1401 of 2140) UNSUPPORTED: lldb-api :: functionalities/data-formatter/data-formatter-stl/libstdcpp/iterator/TestDataFormatterStdIterator.py (1402 of 2140) PASS: lldb-api :: commands/platform/file/read/TestPlatformFileRead.py (1403 of 2140) PASS: lldb-unit :: Host/./HostTests/FileSystemTest.OpenErrno (1404 of 2140) PASS: lldb-unit :: Utility/./UtilityTests/FileSpecTest.Match (1405 of 2140) PASS: lldb-shell :: Reproducer/TestVerify.test (1406 of 2140) PASS: lldb-unit :: Core/./LLDBCoreTests/MangledTest.EmptyForInvalidName (1407 of 2140) PASS: lldb-api :: functionalities/thread/concurrent_events/TestConcurrentDelayedCrashWithBreakpointWatchpoint.py (1408 of 2140) PASS: lldb-shell :: Minidump/dump-all.test (1409 of 2140) PASS: lldb-api :: functionalities/abbreviation/TestAbbreviations.py (1410 of 2140) PASS: lldb-api :: lang/c/vla/TestVLA.py (1411 of 2140) PASS: lldb-unit :: Language/Highlighting/./HighlighterTests/HighlighterTest.ClangCursorPosAfterOtherToken (1412 of 2140) PASS: lldb-unit :: Utility/./UtilityTests/StatusTest.ErrorConversion (1413 of 2140) PASS: lldb-api :: lang/cpp/subst_template_type_param/TestSubstTemplateTypeParam.py (1414 of 2140) PASS: lldb-api :: functionalities/data-formatter/hexcaps/TestDataFormatterHexCaps.py (1415 of 2140) PASS: lldb-unit :: Utility/./UtilityTests/ArgsTest.Yaml (1416 of 2140) PASS: lldb-api :: tools/lldb-vscode/launch/TestVSCode_launch.py (1417 of 2140) PASS: lldb-api :: lang/c/shared_lib_stripped_symbols/TestSharedLibStrippedSymbols.py (1418 of 2140) PASS: lldb-unit :: Utility/./UtilityTests/BinaryStreamTest.PutULEB128OneByte (1419 of 2140) PASS: lldb-api :: commands/expression/call-function/TestCallUserDefinedFunction.py (1420 of 2140) PASS: lldb-unit :: Process/./ProcessEventDataTests/ProcessEventDataTest.DoOnRemoval (1421 of 2140) PASS: lldb-api :: functionalities/gdb_remote_client/TestProcessConnect.py (1422 of 2140) PASS: lldb-api :: commands/platform/file/close/TestPlatformFileClose.py (1423 of 2140) PASS: lldb-unit :: Host/./HostTests/SocketTest.DomainListenConnectAccept (1424 of 2140) PASS: lldb-shell :: SymbolFile/DWARF/DW_AT_declaration-with-children.s (1425 of 2140) PASS: lldb-api :: lang/objcxx/class-name-clash/TestNameClash.py (1426 of 2140) PASS: lldb-unit :: Host/./HostTests/FileSystemTest.FileAndDirectoryComponents (1427 of 2140) PASS: lldb-unit :: Utility/./UtilityTests/IndexToObjectTest.ObjectForIndex (1428 of 2140) PASS: lldb-unit :: Utility/./UtilityTests/ArchSpecTest.MergeFrom (1429 of 2140) PASS: lldb-api :: lang/cpp/chained-calls/TestCppChainedCalls.py (1430 of 2140) PASS: lldb-unit :: Utility/./UtilityTests/RangeTest.ContainsRangeStartingFromZero (1431 of 2140) PASS: lldb-unit :: Utility/./UtilityTests/StringExtractorTest.GetNameColonValueSuccess (1432 of 2140) PASS: lldb-api :: iohandler/autosuggestion/TestAutosuggestion.py (1433 of 2140) PASS: lldb-unit :: Process/minidump/./LLDBMinidumpTests/MinidumpParserTest.MinidumpDuplicateModuleSeparateCode (1434 of 2140) PASS: lldb-api :: functionalities/tsan/cpp_global_location/TestTsanCPPGlobalLocation.py (1435 of 2140) PASS: lldb-unit :: Utility/./UtilityTests/RecordReplayTest.InstrumentedBar (1436 of 2140) PASS: lldb-api :: commands/expression/static-initializers/TestStaticInitializers.py (1437 of 2140) PASS: lldb-unit :: UnwindAssembly/x86/./UnwindAssemblyx86Tests/Testx86AssemblyInspectionEngine.TestSubRSP (1438 of 2140) PASS: lldb-api :: commands/expression/import-std-module/queue/TestQueueFromStdModule.py (1439 of 2140) PASS: lldb-shell :: SymbolFile/NativePDB/s_constant.cpp (1440 of 2140) PASS: lldb-unit :: Utility/./UtilityTests/OptionsWithRawTest.ArgsButNoDelimiter (1441 of 2140) PASS: lldb-unit :: Utility/./UtilityTests/StringListTest.LongestCommonPrefixEmpty (1442 of 2140) PASS: lldb-api :: python_api/sbenvironment/TestSBEnvironment.py (1443 of 2140) PASS: lldb-shell :: SymbolFile/DWARF/debug_loc_and_loclists.s (1444 of 2140) UNSUPPORTED: lldb-api :: functionalities/darwin_log/source/info/TestDarwinLogSourceInfo.py (1445 of 2140) PASS: lldb-unit :: Symbol/./SymbolTests/Type.GetTypeScopeAndBasename (1446 of 2140) PASS: lldb-api :: commands/expression/import-std-module/vector/TestVectorFromStdModule.py (1447 of 2140) PASS: lldb-api :: lang/objc/ptr_refs/TestPtrRefsObjC.py (1448 of 2140) PASS: lldb-shell :: SymbolFile/DWARF/dir-separator-no-comp-dir.s (1449 of 2140) PASS: lldb-api :: tools/lldb-server/TestGdbRemoteExitCode.py (1450 of 2140) PASS: lldb-api :: functionalities/breakpoint/hardware_breakpoints/require_hw_breakpoints/TestRequireHWBreakpoints.py (1451 of 2140) PASS: lldb-unit :: Utility/./UtilityTests/StringListTest.InsertStringAtIndexOutOfBounds (1452 of 2140) PASS: lldb-shell :: SymbolFile/DWARF/DW_AT_const_value-bitfields.s (1453 of 2140) PASS: lldb-unit :: Interpreter/./InterpreterTests/CompletionTest.DirCompletionAbsolute (1454 of 2140) PASS: lldb-api :: functionalities/gdb_remote_client/TestqOffsets.py (1455 of 2140) PASS: lldb-api :: functionalities/data-formatter/data-formatter-objc/TestDataFormatterObjCNSError.py (1456 of 2140) PASS: lldb-unit :: Host/./HostTests/FileSystemTest.EnumerateDirectory (1457 of 2140) PASS: lldb-api :: lang/mixed/TestMixedLanguages.py (1458 of 2140) PASS: lldb-unit :: Core/./LLDBCoreTests/SourceFileCache.FindSourceFileFound (1459 of 2140) PASS: lldb-shell :: SymbolFile/DWARF/debug-names-compressed.cpp (1460 of 2140) PASS: lldb-api :: lang/cpp/scope/TestCppScope.py (1461 of 2140) PASS: lldb-shell :: SymbolFile/DWARF/debug-types-missing-signature.test (1462 of 2140) PASS: lldb-shell :: Quit/TestQuitExitCodeHex0.test (1463 of 2140) PASS: lldb-unit :: tools/lldb-server/tests/./LLDBServerTests/TestBase.DebugserverEnv (1464 of 2140) PASS: lldb-api :: functionalities/data-formatter/synthupdate/TestSyntheticFilterRecompute.py (1465 of 2140) PASS: lldb-api :: tools/lldb-vscode/step/TestVSCode_step.py (1466 of 2140) PASS: lldb-api :: functionalities/breakpoint/address_breakpoints/TestAddressBreakpoints.py (1467 of 2140) PASS: lldb-api :: commands/expression/po_verbosity/TestPoVerbosity.py (1468 of 2140) PASS: lldb-unit :: Utility/./UtilityTests/OptionsWithRawTest.QuotedSuffix (1469 of 2140) PASS: lldb-unit :: Utility/./UtilityTests/BinaryStreamTest.PutULEB128EightBytes (1470 of 2140) PASS: lldb-api :: functionalities/breakpoint/debugbreak/TestDebugBreak.py (1471 of 2140) PASS: lldb-unit :: Expression/./ExpressionTests/DiagnosticManagerTest.GetStringPreserveOrder (1472 of 2140) PASS: lldb-unit :: Language/Highlighting/./HighlighterTests/HighlighterTest.ClangCursorPos (1473 of 2140) PASS: lldb-unit :: SymbolFile/DWARF/./SymbolFileDWARFTests/SymbolFileDWARFTests.TestAbbrevOrder1Start5 (1474 of 2140) PASS: lldb-api :: lang/objc/objc-stepping/TestObjCStepping.py (1475 of 2140) UNSUPPORTED: lldb-shell :: Reproducer/TestLuaImport.test (1476 of 2140) PASS: lldb-unit :: Process/minidump/./LLDBMinidumpTests/MinidumpParserTest.GetMiscInfo_no_stream (1477 of 2140) PASS: lldb-unit :: Utility/./UtilityTests/ScalarTest.Scalar_512 (1478 of 2140) PASS: lldb-api :: functionalities/breakpoint/breakpoint_conditions/TestBreakpointConditions.py (1479 of 2140) PASS: lldb-api :: commands/process/launch/TestProcessLaunch.py (1480 of 2140) PASS: lldb-api :: functionalities/data-formatter/typedef_array/TestTypedefArray.py (1481 of 2140) PASS: lldb-shell :: SymbolFile/DWARF/DW_AT_loclists_base.s (1482 of 2140) PASS: lldb-api :: functionalities/data-formatter/data-formatter-objc/TestDataFormatterObjNSException.py (1483 of 2140) PASS: lldb-unit :: Utility/./UtilityTests/FileSpecTest.OperatorBool (1484 of 2140) PASS: lldb-api :: commands/frame/diagnose/virtual-method-call/TestDiagnoseDereferenceVirtualMethodCall.py (1485 of 2140) PASS: lldb-unit :: Utility/./UtilityTests/StringListTest.InsertStringAtIndexStart (1486 of 2140) PASS: lldb-api :: functionalities/step_scripted/TestStepScripted.py (1487 of 2140) UNSUPPORTED: lldb-api :: tools/intel-features/intel-pt/test/TestIntelPTSimpleBinary.py (1488 of 2140) PASS: lldb-api :: lang/c/unicode/TestUnicodeSymbols.py (1489 of 2140) PASS: lldb-shell :: SymbolFile/DWARF/limit-debug-info.s (1490 of 2140) PASS: lldb-api :: lang/objc/foundation/TestObjCMethods2.py (1491 of 2140) PASS: lldb-api :: functionalities/data-formatter/compactvectors/TestCompactVectors.py (1492 of 2140) PASS: lldb-shell :: Reproducer/TestDSYM.test (1493 of 2140) XFAIL: lldb-shell :: Register/x86-mm-xmm-read.test (1494 of 2140) PASS: lldb-unit :: Utility/./UtilityTests/BinaryStreamTest.PutSLEB128TwoBytes (1495 of 2140) XFAIL: lldb-shell :: Register/x86-64-ymm-write.test (1496 of 2140) PASS: lldb-unit :: Utility/./UtilityTests/GeneratorTest.Create (1497 of 2140) PASS: lldb-unit :: Signals/./SignalsTests/UnixSignalsTest.GetFilteredSignals (1498 of 2140) PASS: lldb-api :: functionalities/asan/TestReportData.py (1499 of 2140) PASS: lldb-shell :: ScriptInterpreter/Python/eof.test (1500 of 2140) PASS: lldb-shell :: Settings/TestStopCommandSourceOnError.test (1501 of 2140) PASS: lldb-api :: functionalities/signal/TestSendSignal.py (1502 of 2140) PASS: lldb-unit :: Utility/./UtilityTests/UriParserTest.BadPort (1503 of 2140) PASS: lldb-api :: functionalities/thread/concurrent_events/TestConcurrentSignalBreak.py (1504 of 2140) PASS: lldb-api :: commands/target/create-no-such-arch/TestNoSuchArch.py (1505 of 2140) UNSUPPORTED: lldb-api :: tools/lldb-server/TestGdbRemoteAuxvSupport.py (1506 of 2140) PASS: lldb-unit :: Core/./LLDBCoreTests/MangledTest.NameIndexes_FindFunctionSymbols (1507 of 2140) PASS: lldb-shell :: ObjectFile/PECOFF/disassemble-thumb.yaml (1508 of 2140) PASS: lldb-api :: functionalities/breakpoint/source_regexp/TestSourceRegexBreakpoints.py (1509 of 2140) PASS: lldb-unit :: Interpreter/./InterpreterTests/OptionValueFileColonLine.setFromString (1510 of 2140) PASS: lldb-unit :: Utility/./UtilityTests/ArgsTest.TestQuotedUnknownEscape (1511 of 2140) PASS: lldb-unit :: UnwindAssembly/x86/./UnwindAssemblyx86Tests/Testx86AssemblyInspectionEngine.TestReturnDetect (1512 of 2140) PASS: lldb-unit :: Utility/./UtilityTests/Flags.IsClear (1513 of 2140) PASS: lldb-unit :: Target/./TargetTests/MemoryRegionInfoTest.Formatv (1514 of 2140) PASS: lldb-api :: lang/c/find_struct_type/TestFindStructTypes.py (1515 of 2140) PASS: lldb-unit :: Utility/./UtilityTests/StreamTeeTest.Constructor2Streams (1516 of 2140) PASS: lldb-unit :: Utility/./UtilityTests/FileSpecTest.EqualDotsPosix (1517 of 2140) PASS: lldb-api :: commands/watchpoints/watchpoint_on_vectors/TestValueOfVectorVariable.py (1518 of 2140) PASS: lldb-api :: lang/cpp/covariant-return-types/TestCovariantReturnTypes.py (1519 of 2140) PASS: lldb-unit :: Platform/./LLDBPlatformTests/PlatformAppleSimulatorTest.TestSimHasSimEnvionament (1520 of 2140) PASS: lldb-unit :: Utility/./UtilityTests/Flags.AllSet (1521 of 2140) PASS: lldb-unit :: ObjectFile/PECOFF/./ObjectFilePECOFFTests/PECallFrameInfoTest.Frame_reg_eh (1522 of 2140) PASS: lldb-unit :: Utility/./UtilityTests/ConstStringTest.format_provider (1523 of 2140) PASS: lldb-unit :: UnwindAssembly/x86/./UnwindAssemblyx86Tests/Testx86AssemblyInspectionEngine.TestPopEBP (1524 of 2140) PASS: lldb-api :: lang/cpp/dynamic-value/TestCppValueCast.py (1525 of 2140) PASS: lldb-api :: source-manager/TestSourceManager.py (1526 of 2140) PASS: lldb-api :: functionalities/gdb_remote_client/TestGDBRemoteDiskFileCompletion.py (1527 of 2140) PASS: lldb-shell :: ObjectFile/wasm/basic.yaml (1528 of 2140) PASS: lldb-unit :: Utility/./UtilityTests/ArchSpecTest.TestSetTriple (1529 of 2140) PASS: lldb-shell :: Reproducer/TestGDBRemoteRepro.test (1530 of 2140) PASS: lldb-api :: commands/frame/diagnose/complicated-expression/TestComplicatedExpression.py (1531 of 2140) PASS: lldb-unit :: Process/./ProcessEventDataTests/ProcessEventDataTest.ShouldStop (1532 of 2140) PASS: lldb-unit :: Expression/./ExpressionTests/CppModuleConfigurationTest.UnknownLibCppFile (1533 of 2140) PASS: lldb-unit :: Expression/./ExpressionTests/ClangExpressionDeclMapTest.TestUnknownIdentifierLookup (1534 of 2140) PASS: lldb-unit :: SymbolFile/NativePDB/./SymbolFileNativePDBTests/PDBFPOProgramToDWARFExpressionTests.UnresolvedRegisterAssignmentReference (1535 of 2140) PASS: lldb-unit :: Utility/./UtilityTests/StringExtractorTest.GetHexU8_InvalidHex_NoEof (1536 of 2140) PASS: lldb-api :: terminal/TestSTTYBeforeAndAfter.py (1537 of 2140) PASS: lldb-unit :: SymbolFile/NativePDB/./SymbolFileNativePDBTests/PDBFPOProgramToDWARFExpressionTests.InvalidAssignmentMultiple (1538 of 2140) PASS: lldb-unit :: Utility/./UtilityTests/StringLexerTest.GetUnlexed (1539 of 2140) PASS: lldb-api :: functionalities/tail_call_frames/inlining_and_tail_calls/TestInliningAndTailCalls.py (1540 of 2140) PASS: lldb-unit :: Utility/./UtilityTests/AnsiTerminal.AtEnd (1541 of 2140) PASS: lldb-api :: commands/apropos/basic/TestApropos.py (1542 of 2140) PASS: lldb-shell :: Reproducer/TestSynchronous.test (1543 of 2140) PASS: lldb-shell :: SymbolFile/dissassemble-entry-point.s (1544 of 2140) PASS: lldb-unit :: Utility/./UtilityTests/CompletionRequest.ShiftArguments (1545 of 2140) UNSUPPORTED: lldb-api :: android/platform/TestDefaultCacheLineSize.py (1546 of 2140) PASS: lldb-unit :: Utility/./UtilityTests/StringLexerTest.HasAtLeast (1547 of 2140) PASS: lldb-unit :: debugserver/./debugserverTests/RNBSocket.LoopBackConnectIPv4 (1548 of 2140) PASS: lldb-unit :: Utility/./UtilityTests/ArchSpecTest.OperatorBool (1549 of 2140) PASS: lldb-unit :: SymbolFile/NativePDB/./SymbolFileNativePDBTests/PDBFPOProgramToDWARFExpressionTests.UnresolvedCyclicRegisterAssignmentReference (1550 of 2140) PASS: lldb-unit :: Utility/./UtilityTests/ArchSpecTest.TestParseMachCPUDashSubtypeTripleExtra (1551 of 2140) PASS: lldb-shell :: Reproducer/TestWorkingDir.test (1552 of 2140) PASS: lldb-shell :: Minidump/Windows/find-module.test (1553 of 2140) PASS: lldb-api :: lang/cpp/bitfields/TestCppBitfields.py (1554 of 2140) PASS: lldb-api :: lang/objc/radar-9691614/TestObjCMethodReturningBOOL.py (1555 of 2140) PASS: lldb-api :: lang/c/set_values/TestSetValues.py (1556 of 2140) PASS: lldb-api :: functionalities/limit-debug-info/TestLimitDebugInfo.py (1557 of 2140) PASS: lldb-api :: functionalities/wrong_commands/TestWrongCommands.py (1558 of 2140) PASS: lldb-unit :: Process/gdb-remote/./ProcessGdbRemoteTests/GDBRemoteCommunicationClientTest.ReadRegister (1559 of 2140) PASS: lldb-api :: functionalities/data-formatter/data-formatter-stl/libcxx/vbool/TestDataFormatterLibcxxVBool.py (1560 of 2140) PASS: lldb-unit :: Utility/./UtilityTests/NameMatchesTest.EndsWith (1561 of 2140) XFAIL: lldb-shell :: Register/x86-mm-xmm-write.test (1562 of 2140) PASS: lldb-unit :: Utility/./UtilityTests/OptionsWithRawTest.UnterminatedQuote (1563 of 2140) PASS: lldb-shell :: SymbolFile/DWARF/DW_AT_data_bit_offset-DW_OP_stack_value.s (1564 of 2140) PASS: lldb-unit :: Utility/./UtilityTests/RegularExpression.Empty (1565 of 2140) PASS: lldb-api :: lang/cpp/static_methods/TestCPPStaticMethods.py (1566 of 2140) PASS: lldb-shell :: SymbolFile/DWARF/find-variable-dwo.cpp (1567 of 2140) PASS: lldb-api :: macosx/add-dsym/TestAddDsymMidExecutionCommand.py (1568 of 2140) PASS: lldb-unit :: SymbolFile/NativePDB/./SymbolFileNativePDBTests/PDBFPOProgramToDWARFExpressionTests.UnsupportedRASearch (1569 of 2140) PASS: lldb-unit :: Utility/./UtilityTests/PassiveReplayTest.InstrumentedBarPtr (1570 of 2140) PASS: lldb-unit :: Core/./LLDBCoreTests/ModuleSpecTest.TestELFFile (1571 of 2140) PASS: lldb-unit :: ScriptInterpreter/Python/./ScriptInterpreterPythonTests/PythonDataObjectsTest.TestBorrowedReferences (1572 of 2140) PASS: lldb-unit :: SymbolFile/NativePDB/./SymbolFileNativePDBTests/PDBFPOProgramToDWARFExpressionTests.UnknownOp (1573 of 2140) PASS: lldb-unit :: Process/gdb-remote/./ProcessGdbRemoteTests/GDBRemoteCommunicationClientTest.SendStopTracePacket (1574 of 2140) PASS: lldb-api :: functionalities/data-formatter/data-formatter-stl/libstdcpp/unique_ptr/invalid/TestDataFormatterInvalidStdUniquePtr.py (1575 of 2140) PASS: lldb-api :: iohandler/resize/TestIOHandlerResize.py (1576 of 2140) PASS: lldb-unit :: Process/gdb-remote/./ProcessGdbRemoteTests/GDBRemoteClientBaseTest.SendContinueAndLateInterrupt (1577 of 2140) PASS: lldb-api :: tools/lldb-server/TestGdbRemoteAttach.py (1578 of 2140) PASS: lldb-shell :: ObjectFile/ELF/PT_LOAD-overlap-section.yaml (1579 of 2140) PASS: lldb-unit :: Expression/./ExpressionTests/DiagnosticManagerTest.AppendMessageSubsequentDiags (1580 of 2140) PASS: lldb-api :: lang/cpp/offsetof/TestOffsetofCpp.py (1581 of 2140) PASS: lldb-api :: tools/lldb-vscode/breakpoint-events/TestVSCode_breakpointEvents.py (1582 of 2140) PASS: lldb-unit :: Expression/./ExpressionTests/DiagnosticManagerTest.HasFixits (1583 of 2140) PASS: lldb-api :: lang/objc/foundation/TestObjectDescriptionAPI.py (1584 of 2140) PASS: lldb-api :: lang/c/inlines/TestRedefinitionsInInlines.py (1585 of 2140) PASS: lldb-unit :: Utility/./UtilityTests/RangeTest.LessThanInvalid (1586 of 2140) PASS: lldb-unit :: ScriptInterpreter/Python/./ScriptInterpreterPythonTests/PythonDataObjectsTest.TestDictionaryResolutionWithDot (1587 of 2140) PASS: lldb-api :: lang/cpp/extern_c/TestExternCSymbols.py (1588 of 2140) UNSUPPORTED: lldb-shell :: ObjectFile/ELF/minidebuginfo-set-and-hit-breakpoint.test (1589 of 2140) PASS: lldb-unit :: Process/gdb-remote/./ProcessGdbRemoteTests/GDBRemoteCommunicationClientTest.GetQOffsets (1590 of 2140) PASS: lldb-unit :: Utility/./UtilityTests/StreamTest.PutCStringWithStringRef (1591 of 2140) PASS: lldb-api :: functionalities/breakpoint/move_nearest/TestMoveNearest.py (1592 of 2140) PASS: lldb-unit :: Utility/./UtilityTests/ScalarTest.APIntConstructor (1593 of 2140) PASS: lldb-api :: tools/lldb-vscode/console/TestVSCode_console.py (1594 of 2140) PASS: lldb-api :: functionalities/pre_run_dylibs/TestPreRunDylibs.py (1595 of 2140) PASS: lldb-api :: functionalities/gdb_remote_client/TestWasm.py (1596 of 2140) PASS: lldb-api :: lang/objc/bitfield_ivars/TestBitfieldIvars.py (1597 of 2140) PASS: lldb-api :: macosx/safe-to-func-call/TestSafeFuncCalls.py (1598 of 2140) PASS: lldb-unit :: Utility/./UtilityTests/CompletionRequest.FakeLastArg (1599 of 2140) PASS: lldb-api :: functionalities/gdb_remote_client/TestPlatformClient.py (1600 of 2140) PASS: lldb-unit :: Utility/./UtilityTests/StreamTest.ShiftOperatorChars (1601 of 2140) PASS: lldb-unit :: Utility/./UtilityTests/DataExtractorTest.PeekData (1602 of 2140) PASS: lldb-unit :: tools/lldb-server/tests/./LLDBServerTests/TestBase.LaunchModePreservesEnvironment (1603 of 2140) PASS: lldb-api :: functionalities/gdb_remote_client/TestRestartBug.py (1604 of 2140) PASS: lldb-unit :: ObjectFile/ELF/./ObjectFileELFTests/ObjectFileELFTest.SectionsResolveConsistently (1605 of 2140) PASS: lldb-api :: python_api/sbplatform/TestSBPlatform.py (1606 of 2140) PASS: lldb-unit :: Utility/./UtilityTests/StreamTest.PutCharNull (1607 of 2140) PASS: lldb-unit :: Expression/./ExpressionTests/CppModuleConfigurationTest.UnrelatedLibrary (1608 of 2140) PASS: lldb-unit :: Utility/./UtilityTests/ArchSpecTest.TripleComponentsWereSpecified (1609 of 2140) PASS: lldb-api :: api/multiple-targets/TestMultipleTargets.py (1610 of 2140) PASS: lldb-unit :: Process/gdb-remote/./ProcessGdbRemoteTests/GDBRemoteCommunicationClientTest.WriteRegisterNoSuffix (1611 of 2140) PASS: lldb-api :: functionalities/thread/concurrent_events/TestConcurrentSignalWatchBreak.py (1612 of 2140) PASS: lldb-shell :: SymbolFile/NativePDB/globals-bss.cpp (1613 of 2140) PASS: lldb-unit :: Utility/./UtilityTests/DataExtractorTest.GetCStr (1614 of 2140) PASS: lldb-api :: functionalities/breakpoint/cpp/TestCPPBreakpointLocations.py (1615 of 2140) PASS: lldb-unit :: Utility/./UtilityTests/StreamTeeTest.Constructor1Stream (1616 of 2140) PASS: lldb-unit :: DataFormatter/./LLDBFormatterTests/TypeMatcherTests.GetMatchStringExactName (1617 of 2140) PASS: lldb-api :: functionalities/tsan/thread_numbers/TestTsanThreadNumbers.py (1618 of 2140) PASS: lldb-unit :: ScriptInterpreter/Python/./ScriptInterpreterPythonTests/PythonDataObjectsTest.TestPythonIntegerToStructuredInteger (1619 of 2140) PASS: lldb-unit :: Utility/./UtilityTests/LogTest.Register (1620 of 2140) PASS: lldb-api :: commands/frame/diagnose/dereference-argument/TestDiagnoseDereferenceArgument.py (1621 of 2140) PASS: lldb-unit :: Editline/./EditlineTests/EditlineTestFixture.EditlineReceivesMultiLineText (1622 of 2140) PASS: lldb-api :: tools/lldb-server/TestGdbRemoteHostInfo.py (1623 of 2140) PASS: lldb-api :: python_api/process/TestProcessAPI.py (1624 of 2140) PASS: lldb-api :: functionalities/data-formatter/boolreference/TestFormattersBoolRefPtr.py (1625 of 2140) PASS: lldb-shell :: ObjectFile/ELF/PT_LOAD.yaml (1626 of 2140) PASS: lldb-shell :: SymbolFile/DWARF/gnu-style-compression.cpp (1627 of 2140) PASS: lldb-api :: functionalities/thread/state_after_expression/TestStateAfterExpression.py (1628 of 2140) PASS: lldb-api :: commands/watchpoints/multiple_hits/TestMultipleHits.py (1629 of 2140) PASS: lldb-unit :: SymbolFile/DWARF/./SymbolFileDWARFTests/SymbolFileDWARFTests.TestAbbrevInvalidNULLTag (1630 of 2140) UNSUPPORTED: lldb-shell :: Register/arm-gp-read.test (1631 of 2140) PASS: lldb-shell :: SymbolFile/DWARF/dwarf5-index-is-used.cpp (1632 of 2140) PASS: lldb-shell :: SymbolFile/DWARF/debug_loc-aslr.s (1633 of 2140) UNSUPPORTED: lldb-shell :: Register/x86-64-gp-write.test (1634 of 2140) PASS: lldb-unit :: Utility/./UtilityTests/StringListTest.AppendStringCString (1635 of 2140) PASS: lldb-unit :: Symbol/./SymbolTests/LineEntryTest.GetSameLineContiguousAddressRangeNestedInline (1636 of 2140) PASS: lldb-shell :: ObjectFile/MachO/subsections.yaml (1637 of 2140) UNSUPPORTED: lldb-shell :: ScriptInterpreter/Lua/nested_sessions.test (1638 of 2140) PASS: lldb-api :: commands/help/TestHelp.py (1639 of 2140) PASS: lldb-unit :: ScriptInterpreter/Python/./ScriptInterpreterPythonTests/PythonDataObjectsTest.TestPythonByteArray (1640 of 2140) PASS: lldb-api :: lang/cpp/bool/TestCPPBool.py (1641 of 2140) PASS: lldb-unit :: UnwindAssembly/PPC64/./PPC64InstEmulationTests/TestPPC64InstEmulation.TestMediumFunction (1642 of 2140) UNSUPPORTED: lldb-shell :: Register/x86-zmm-write.test (1643 of 2140) PASS: lldb-unit :: Process/minidump/./LLDBMinidumpTests/MinidumpParserTest.MinidumpModuleOrder (1644 of 2140) PASS: lldb-api :: commands/log/basic/TestLogging.py (1645 of 2140) PASS: lldb-api :: tools/lldb-server/TestGdbRemoteExpeditedRegisters.py (1646 of 2140) PASS: lldb-unit :: Utility/./UtilityTests/Flags.Reset (1647 of 2140) PASS: lldb-unit :: Process/gdb-remote/./ProcessGdbRemoteTests/GDBRemoteCommunicationServerTest.SendErrorResponse_ErrorList (1648 of 2140) PASS: lldb-unit :: Language/Highlighting/./HighlighterTests/HighlighterTest.ClangCursorPosBeforeOtherToken (1649 of 2140) PASS: lldb-unit :: Utility/./UtilityTests/BinaryStreamTest.PutULEB128SevenBytes (1650 of 2140) PASS: lldb-unit :: Host/./HostTests/FileSystemTest.Exists (1651 of 2140) PASS: lldb-unit :: Utility/./UtilityTests/OptionsWithRawTest.ArgsButNoLeadingDash (1652 of 2140) UNSUPPORTED: lldb-shell :: ScriptInterpreter/Lua/independent_state.test (1653 of 2140) PASS: lldb-unit :: Symbol/./SymbolTests/Type.CompilerContextPattern (1654 of 2140) PASS: lldb-unit :: Symbol/./SymbolTests/TestClangASTImporter.CanImportInvalidType (1655 of 2140) PASS: lldb-unit :: debugserver/./debugserverTests/RNBSocket.LoopBackListenIPv6 (1656 of 2140) PASS: lldb-api :: functionalities/inferior-crashing/recursive-inferior/TestRecursiveInferiorStep.py (1657 of 2140) PASS: lldb-unit :: SymbolFile/NativePDB/./SymbolFileNativePDBTests/PDBFPOProgramToDWARFExpressionTests.MultipleDependentAssignments (1658 of 2140) PASS: lldb-api :: lang/objc/self/TestObjCSelf.py (1659 of 2140) UNSUPPORTED: lldb-shell :: SymbolFile/DWARF/DW_TAG_GNU_call_site-DW_AT_low_pc.s (1660 of 2140) PASS: lldb-shell :: Breakpoint/debug_addrx.test (1661 of 2140) PASS: lldb-api :: python_api/formatters/TestFormattersSBAPI.py (1662 of 2140) PASS: lldb-unit :: Utility/./UtilityTests/StatusTest.ErrorConstructor (1663 of 2140) PASS: lldb-shell :: ObjectFile/MachO/symtab.yaml (1664 of 2140) PASS: lldb-api :: commands/expression/pr35310/TestExprsBug35310.py (1665 of 2140) PASS: lldb-shell :: ObjectFile/PECOFF/uuid.yaml (1666 of 2140) PASS: lldb-unit :: Utility/./UtilityTests/ArgsTest.TestInsertArg (1667 of 2140) PASS: lldb-api :: lang/objc/objc_direct-methods/TestObjCDirectMethods.py (1668 of 2140) PASS: lldb-shell :: Breakpoint/split-dwarf-5-addrbase.test (1669 of 2140) PASS: lldb-api :: functionalities/process_crash_info/TestProcessCrashInfo.py (1670 of 2140) PASS: lldb-api :: python_api/signals/TestSignalsAPI.py (1671 of 2140) PASS: lldb-unit :: Utility/./UtilityTests/TimerTest.CategoryTimes2 (1672 of 2140) PASS: lldb-unit :: Utility/./UtilityTests/StreamTeeTest.DefaultConstructor (1673 of 2140) PASS: lldb-api :: functionalities/data-formatter/data-formatter-stl/libcxx/unique_ptr/TestDataFormatterLibcxxUniquePtr.py (1674 of 2140) PASS: lldb-unit :: Utility/./UtilityTests/RangeTest.ContainsAddrInvalid (1675 of 2140) PASS: lldb-unit :: Utility/./UtilityTests/RangeTest.ContainsEndInclusiveInvalid (1676 of 2140) PASS: lldb-unit :: UnwindAssembly/x86/./UnwindAssemblyx86Tests/Testx86AssemblyInspectionEngine.TestAddESP (1677 of 2140) PASS: lldb-unit :: ScriptInterpreter/Python/./ScriptInterpreterPythonTests/PythonDataObjectsTest.TestScript (1678 of 2140) PASS: lldb-unit :: DataFormatter/./LLDBFormatterTests/TypeMatcherTests.RegexName (1679 of 2140) PASS: lldb-api :: functionalities/thread/concurrent_events/TestConcurrentDelayWatchBreak.py (1680 of 2140) PASS: lldb-api :: lang/objc/objc-new-syntax/TestObjCNewSyntaxArray.py (1681 of 2140) PASS: lldb-unit :: Utility/./UtilityTests/Flags.GetBitSize (1682 of 2140) PASS: lldb-unit :: Utility/./UtilityTests/XcodeSDKTest.FindXcodeContentsDirectoryInPath (1683 of 2140) UNSUPPORTED: lldb-api :: benchmarks/frame_variable/TestFrameVariableResponse.py (1684 of 2140) PASS: lldb-api :: commands/expression/rdar42038760/TestScalarURem.py (1685 of 2140) PASS: lldb-unit :: Utility/./UtilityTests/UriParserTest.BadPort2 (1686 of 2140) PASS: lldb-shell :: ObjectFile/PECOFF/symbol.yaml (1687 of 2140) PASS: lldb-api :: commands/frame/diagnose/dereference-this/TestDiagnoseDereferenceThis.py (1688 of 2140) PASS: lldb-unit :: Utility/./UtilityTests/StringListTest.GetSize (1689 of 2140) PASS: lldb-unit :: Target/./TargetTests/PathMappingListTest.RelativeTests (1690 of 2140) PASS: lldb-api :: functionalities/breakpoint/breakpoint_by_file_colon_line/TestBreakpointByFileColonLine.py (1691 of 2140) PASS: lldb-unit :: Utility/./UtilityTests/FileSpecTest.EqualDotsPosixRoot (1692 of 2140) PASS: lldb-api :: commands/gui/invalid-args/TestInvalidArgsGui.py (1693 of 2140) UNSUPPORTED: lldb-api :: functionalities/darwin_log/basic/TestDarwinLogBasic.py (1694 of 2140) PASS: lldb-unit :: Process/minidump/./LLDBMinidumpTests/MinidumpParserTest.InvalidMinidump (1695 of 2140) PASS: lldb-unit :: Symbol/./SymbolTests/TestTypeSystemClang.AddMethodToObjCObjectType (1696 of 2140) PASS: lldb-api :: commands/watchpoints/step_over_watchpoint/TestStepOverWatchpoint.py (1697 of 2140) PASS: lldb-api :: lang/objc/objc-struct-argument/TestObjCStructArgument.py (1698 of 2140) UNSUPPORTED: lldb-api :: functionalities/darwin_log/filter/exact_match/message/TestDarwinLogFilterMatchMessage.py (1699 of 2140) PASS: lldb-api :: functionalities/tail_call_frames/thread_step_out_or_return/TestSteppingOutWithArtificialFrames.py (1700 of 2140) PASS: lldb-shell :: ScriptInterpreter/None/import_module.test (1701 of 2140) PASS: lldb-unit :: Host/./HostTests/SocketTest.TCPListen0GetPort (1702 of 2140) UNSUPPORTED: lldb-api :: functionalities/thread/concurrent_events/TestConcurrentManySignals.py (1703 of 2140) PASS: lldb-unit :: Symbol/./SymbolTests/SymbolsTest.LocateExecutableSymbolFileForUnknownExecutableAndMissingSymbolFile (1704 of 2140) PASS: lldb-unit :: Utility/./UtilityTests/StringListTest.CopyListSingle (1705 of 2140) PASS: lldb-api :: lang/objc/rdar-11355592/TestRdar11355592.py (1706 of 2140) PASS: lldb-api :: lang/objc/objc++/TestObjCXX.py (1707 of 2140) PASS: lldb-unit :: Utility/./UtilityTests/BinaryStreamTest.PutULEB128One (1708 of 2140) PASS: lldb-unit :: Language/Highlighting/./HighlighterTests/HighlighterTest.ClangCursorOutOfBounds (1709 of 2140) PASS: lldb-unit :: Utility/./UtilityTests/StreamTest.AddressRange (1710 of 2140) PASS: lldb-api :: commands/expression/import_builtin_fileid/TestImportBuiltinFileID.py (1711 of 2140) PASS: lldb-api :: functionalities/breakpoint/global_constructor/TestBreakpointInGlobalConstructor.py (1712 of 2140) PASS: lldb-api :: lang/objc/rdar-10967107/TestRdar10967107.py (1713 of 2140) PASS: lldb-api :: functionalities/data-formatter/pyobjsynthprovider/TestPyObjSynthProvider.py (1714 of 2140) PASS: lldb-unit :: Utility/./UtilityTests/StreamTest.PutHex32ByteOrderBig (1715 of 2140) PASS: lldb-shell :: SymbolFile/DWARF/split-dwarf-inlining.cpp (1716 of 2140) PASS: lldb-shell :: Commands/command-source.test (1717 of 2140) PASS: lldb-unit :: Language/Highlighting/./HighlighterTests/HighlighterTest.ClangTrailingBackslashMissingNewLine (1718 of 2140) PASS: lldb-api :: functionalities/inferior-assert/TestInferiorAssert.py (1719 of 2140) PASS: lldb-api :: lang/c/register_variables/TestRegisterVariables.py (1720 of 2140) PASS: lldb-shell :: SymbolFile/DWARF/find-method-local-struct.cpp (1721 of 2140) PASS: lldb-unit :: Process/gdb-remote/./ProcessGdbRemoteTests/GDBRemoteCommunicationServerTest.SendErrorResponse_Status (1722 of 2140) PASS: lldb-unit :: Symbol/./SymbolTests/PostfixExpression.ParseOneExpression (1723 of 2140) PASS: lldb-unit :: Utility/./UtilityTests/FileSpecTest.EqualSeparator (1724 of 2140) PASS: lldb-shell :: SymbolFile/NativePDB/ast-functions.cpp (1725 of 2140) PASS: lldb-unit :: Utility/./UtilityTests/BroadcasterTest.BroadcastEvent (1726 of 2140) PASS: lldb-shell :: Reproducer/TestDriverOptions.test (1727 of 2140) PASS: lldb-unit :: Language/Highlighting/./HighlighterTests/HighlighterTest.ClangPPDirectives (1728 of 2140) PASS: lldb-api :: functionalities/tail_call_frames/unambiguous_sequence/TestUnambiguousTailCalls.py (1729 of 2140) UNSUPPORTED: lldb-api :: functionalities/data-formatter/data-formatter-stl/libstdcpp/vector/TestDataFormatterStdVector.py (1730 of 2140) PASS: lldb-unit :: Process/gdb-remote/./ProcessGdbRemoteTests/GDBRemoteCommunicationClientTest.TestPacketSpeedJSON (1731 of 2140) PASS: lldb-unit :: Symbol/./SymbolTests/TestTypeSystemClang.TestNotDeletingUserCopyCstrDueToMoveCStr (1732 of 2140) PASS: lldb-api :: commands/expression/import-std-module/list/TestListFromStdModule.py (1733 of 2140) PASS: lldb-api :: commands/expression/no-deadlock/TestExprDoesntBlock.py (1734 of 2140) PASS: lldb-unit :: Utility/./UtilityTests/RangeTest.NotEqualInvalid (1735 of 2140) PASS: lldb-shell :: ObjectFile/Breakpad/uuid-matching-mac.test (1736 of 2140) PASS: lldb-unit :: Utility/./UtilityTests/BinaryStreamTest.PutSLEB128NineBytes (1737 of 2140) PASS: lldb-unit :: Utility/./UtilityTests/NameMatchesTest.Ignore (1738 of 2140) PASS: lldb-api :: commands/expression/import-std-module/no-std-module/TestMissingStdModule.py (1739 of 2140) UNSUPPORTED: lldb-api :: lang/objc/objc-dynamic-value/TestObjCDynamicValue.py (1740 of 2140) PASS: lldb-api :: lang/cpp/class_static/TestStaticVariables.py (1741 of 2140) PASS: lldb-unit :: Utility/./UtilityTests/XcodeSDKTest.GetCanonicalNameAndConstruct (1742 of 2140) PASS: lldb-unit :: Utility/./UtilityTests/StringListTest.AppendListCStringArray (1743 of 2140) PASS: lldb-api :: functionalities/jitloader_gdb/TestJITLoaderGDB.py (1744 of 2140) PASS: lldb-unit :: Utility/./UtilityTests/BinaryStreamTest.PutSLEB128OneByte (1745 of 2140) PASS: lldb-api :: functionalities/breakpoint/dummy_target_breakpoints/TestBreakpointsWithNoTargets.py (1746 of 2140) PASS: lldb-shell :: SymbolFile/DWARF/debug_aranges-empty-section.s (1747 of 2140) PASS: lldb-shell :: Commands/command-regex-unalias.test (1748 of 2140) PASS: lldb-api :: tools/lldb-server/TestGdbRemoteThreadsInStopReply.py (1749 of 2140) UNSUPPORTED: lldb-shell :: SymbolFile/PDB/enums-layout.test (1750 of 2140) PASS: lldb-unit :: API/./APITests/SBCommandInterpreterTest.SingleWordCommand (1751 of 2140) PASS: lldb-unit :: Host/./HostTests/NativeProcessProtocolTest.SetBreakpointFailWrite (1752 of 2140) PASS: lldb-api :: functionalities/data-formatter/data-formatter-disabling/TestDataFormatterDisabling.py (1753 of 2140) PASS: lldb-unit :: Utility/./UtilityTests/RangeTest.SetRangeBase (1754 of 2140) UNSUPPORTED: lldb-api :: commands/watchpoints/variable_out_of_scope/TestWatchedVarHitWhenInScope.py (1755 of 2140) PASS: lldb-shell :: SymbolFile/NativePDB/break-by-function.cpp (1756 of 2140) PASS: lldb-unit :: Utility/./UtilityTests/BinaryStreamTest.PutULEB128FiveBytes (1757 of 2140) PASS: lldb-api :: functionalities/data-formatter/data-formatter-caching/TestDataFormatterCaching.py (1758 of 2140) PASS: lldb-unit :: Utility/./UtilityTests/StringExtractorTest.GetHexBytes_Partial (1759 of 2140) PASS: lldb-unit :: Process/gdb-remote/./ProcessGdbRemoteTests/GDBRemoteCommunicationClientTest.SyncThreadState (1760 of 2140) PASS: lldb-unit :: Symbol/./SymbolTests/TestTypeSystemClang.TestFunctionTemplateConstruction (1761 of 2140) PASS: lldb-unit :: Symbol/./SymbolTests/SymbolsTest.TerminateLocateExecutableSymbolFileForUnknownExecutableAndUnknownSymbolFile (1762 of 2140) PASS: lldb-unit :: Utility/./UtilityTests/FileSpecTest.FileAndDirectoryComponents (1763 of 2140) PASS: lldb-unit :: Utility/./UtilityTests/StringListTest.InsertStringAtIndexStdString (1764 of 2140) PASS: lldb-unit :: Process/gdb-remote/./ProcessGdbRemoteTests/GDBRemoteClientBaseTest.SendContinueAndAsyncSignal (1765 of 2140) PASS: lldb-api :: commands/expression/xvalue/TestXValuePrinting.py (1766 of 2140) PASS: lldb-api :: macosx/dyld-trie-symbols/TestDyldTrieSymbols.py (1767 of 2140) PASS: lldb-unit :: Utility/./UtilityTests/StringExtractorTest.GetHexBytes_OddPair (1768 of 2140) PASS: lldb-unit :: Utility/./UtilityTests/XcodeSDKTest.SDKSupportsSwift (1769 of 2140) PASS: lldb-unit :: Utility/./UtilityTests/StringListTest.JoinMultiCharSeparator (1770 of 2140) PASS: lldb-api :: functionalities/value_md5_crash/TestValueMD5Crash.py (1771 of 2140) PASS: lldb-unit :: Signals/./SignalsTests/UnixSignalsTest.VersionChange (1772 of 2140) PASS: lldb-unit :: Utility/./UtilityTests/SerializationRountripTest.SerializeDeserializeCString (1773 of 2140) PASS: lldb-api :: lang/cpp/namespace/TestNamespaceLookup.py (1774 of 2140) PASS: lldb-api :: functionalities/lazy-loading/TestLazyLoading.py (1775 of 2140) PASS: lldb-unit :: Expression/./ExpressionTests/DWARFExpression.DW_OP_piece (1776 of 2140) PASS: lldb-unit :: Utility/./UtilityTests/StringListTest.GetMaxStringLengthIncreasingSize (1777 of 2140) PASS: lldb-unit :: Utility/./UtilityTests/StringListTest.SplitIntoLinesSingleTrailingCR (1778 of 2140) PASS: lldb-unit :: Symbol/./SymbolTests/TestClangASTImporter.RecordLayout (1779 of 2140) UNSUPPORTED: lldb-shell :: SymbolFile/PDB/type-quals.test (1780 of 2140) PASS: lldb-unit :: Utility/./UtilityTests/StreamTeeTest.AppendStream (1781 of 2140) UNSUPPORTED: lldb-shell :: SymbolFile/DWARF/debug-types-expressions.test (1782 of 2140) UNSUPPORTED: lldb-api :: functionalities/data-formatter/data-formatter-stl/libstdcpp/unique_ptr/TestDataFormatterStdUniquePtr.py (1783 of 2140) PASS: lldb-shell :: SymbolFile/Breakpad/unwind-via-stack-cfi.test (1784 of 2140) PASS: lldb-unit :: Utility/./UtilityTests/CompletionRequest.DuplicateFilteringWithComments (1785 of 2140) PASS: lldb-unit :: Process/gdb-remote/./ProcessGdbRemoteTests/GDBRemoteCommunicationClientTest.SaveRestoreRegistersNoSuffix (1786 of 2140) PASS: lldb-api :: functionalities/thread/create_after_attach/TestCreateAfterAttach.py (1787 of 2140) PASS: lldb-unit :: Host/./HostTests/Host.GetEnvironment (1788 of 2140) PASS: lldb-shell :: Minidump/breakpad-symbols.test (1789 of 2140) PASS: lldb-api :: lang/objcxx/hide-runtime-values/TestObjCXXHideRuntimeValues.py (1790 of 2140) PASS: lldb-unit :: Utility/./UtilityTests/Predicate.WaitForValueEqualTo (1791 of 2140) UNSUPPORTED: lldb-api :: arm/breakpoint-it/TestBreakpointIt.py (1792 of 2140) PASS: lldb-unit :: UnwindAssembly/x86/./UnwindAssemblyx86Tests/Testx86AssemblyInspectionEngine.TestPopR15 (1793 of 2140) PASS: lldb-api :: commands/expression/ir-interpreter/TestIRInterpreter.py (1794 of 2140) PASS: lldb-unit :: ObjectFile/PECOFF/./ObjectFilePECOFFTests/PECallFrameInfoTest.Chained_eh (1795 of 2140) PASS: lldb-api :: python_api/lldbutil/TestSwigVersion.py (1796 of 2140) PASS: lldb-api :: functionalities/data-formatter/data-formatter-stl/libcxx/queue/TestDataFormatterLibcxxQueue.py (1797 of 2140) UNSUPPORTED: lldb-api :: functionalities/process_save_core/TestProcessSaveCore.py (1798 of 2140) PASS: lldb-api :: commands/command/delete/TestCommandDelete.py (1799 of 2140) PASS: lldb-unit :: Utility/./UtilityTests/XcodeSDKTest.ParseTest (1800 of 2140) PASS: lldb-api :: lang/objc/objc-foundation-dictionary-empty/TestNSDictionary0.py (1801 of 2140) PASS: lldb-api :: functionalities/breakpoint/serialize/TestBreakpointSerialization.py (1802 of 2140) PASS: lldb-unit :: Utility/./UtilityTests/StringExtractorTest.GetNameColonValueContainsColon (1803 of 2140) PASS: lldb-shell :: ObjectFile/ELF/section-types.yaml (1804 of 2140) PASS: lldb-api :: commands/expression/call-function/TestCallStopAndContinue.py (1805 of 2140) PASS: lldb-unit :: ScriptInterpreter/Python/./ScriptInterpreterPythonTests/PythonDataObjectsTest.TestInstanceNameResolutionNoDot (1806 of 2140) UNSUPPORTED: lldb-shell :: SymbolFile/PDB/calling-conventions.test (1807 of 2140) PASS: lldb-api :: types/TestDoubleTypesExpr.py (1808 of 2140) PASS: lldb-unit :: Utility/./UtilityTests/RecordReplayTest.InstrumentedFoo (1809 of 2140) PASS: lldb-unit :: Utility/./UtilityTests/StringExtractorTest.GetHexU8_Extra (1810 of 2140) PASS: lldb-unit :: Process/minidump/./LLDBMinidumpTests/MinidumpParserTest.GetMiscInfoWindows (1811 of 2140) PASS: lldb-unit :: Utility/./UtilityTests/VMRange.IsValid (1812 of 2140) PASS: lldb-api :: functionalities/conditional_break/TestConditionalBreak.py (1813 of 2140) PASS: lldb-api :: lang/cpp/breakpoint_in_member_func_w_non_primitive_params/TestBreakpointInMemberFuncWNonPrimitiveParams.py (1814 of 2140) PASS: lldb-api :: commands/expression/import-std-module/forward_list/TestForwardListFromStdModule.py (1815 of 2140) PASS: lldb-unit :: Utility/./UtilityTests/BinaryStreamTest.PutULEB128FourBytes (1816 of 2140) UNSUPPORTED: lldb-shell :: SymbolFile/PDB/function-nested-block.test (1817 of 2140) PASS: lldb-shell :: ObjectFile/PECOFF/sections-names.yaml (1818 of 2140) PASS: lldb-shell :: Driver/TestPositionalArgs.test (1819 of 2140) PASS: lldb-unit :: Utility/./UtilityTests/GeneratorTest.Get (1820 of 2140) PASS: lldb-api :: lang/cpp/char8_t/TestCxxChar8_t.py (1821 of 2140) PASS: lldb-unit :: Expression/./ExpressionTests/CppModuleConfigurationTest.AmbiguousCLib (1822 of 2140) PASS: lldb-api :: types/TestShortType.py (1823 of 2140) PASS: lldb-api :: commands/expression/import-std-module/deque-basic/TestDequeFromStdModule.py (1824 of 2140) PASS: lldb-api :: commands/expression/call-function/TestCallStdStringFunction.py (1825 of 2140) PASS: lldb-api :: functionalities/data-formatter/builtin-formats/TestBuiltinFormats.py (1826 of 2140) PASS: lldb-api :: lang/objc/modules-hash-mismatch/TestClangModulesHashMismatch.py (1827 of 2140) PASS: lldb-unit :: Utility/./UtilityTests/StreamTeeTest.GetStreamAtIndexOutOfBoundsEmpty (1828 of 2140) PASS: lldb-api :: lang/c/modules/TestCModules.py (1829 of 2140) PASS: lldb-unit :: Utility/./UtilityTests/BroadcasterTest.EventTypeHasListeners (1830 of 2140) PASS: lldb-unit :: Utility/./UtilityTests/DataExtractorTest.GetDoubleUnaligned (1831 of 2140) PASS: lldb-unit :: ScriptInterpreter/Python/./ScriptInterpreterPythonTests/PythonDataObjectsTest.TestPythonStringToStr (1832 of 2140) PASS: lldb-api :: commands/expression/persist_objc_pointeetype/TestPersistObjCPointeeType.py (1833 of 2140) PASS: lldb-api :: functionalities/data-formatter/data-formatter-objc/TestDataFormatterObjCPlain.py (1834 of 2140) PASS: lldb-api :: python_api/function_symbol/TestDisasmAPI.py (1835 of 2140) PASS: lldb-api :: functionalities/memory/find/TestMemoryFind.py (1836 of 2140) PASS: lldb-unit :: Utility/./UtilityTests/StringLexerTest.Peek (1837 of 2140) PASS: lldb-shell :: Driver/TestUseColor.test (1838 of 2140) PASS: lldb-api :: functionalities/data-formatter/array_typedef/TestArrayTypedef.py (1839 of 2140) PASS: lldb-api :: lang/cpp/accelerator-table/TestCPPAccelerator.py (1840 of 2140) PASS: lldb-unit :: Utility/./UtilityTests/StatusTest.Formatv (1841 of 2140) PASS: lldb-api :: functionalities/rerun/TestRerun.py (1842 of 2140) PASS: lldb-unit :: Utility/./UtilityTests/OptionsWithRawTest.LeadingSpaceArgs (1843 of 2140) PASS: lldb-unit :: Utility/./UtilityTests/ScalarTest.LongLongAssigmentOperator (1844 of 2140) PASS: lldb-api :: python_api/symbol-context/two-files/TestSymbolContextTwoFiles.py (1845 of 2140) PASS: lldb-api :: types/TestCharTypeExpr.py (1846 of 2140) PASS: lldb-shell :: Minidump/fb-dump.test (1847 of 2140) PASS: lldb-api :: python_api/function_symbol/TestSymbolAPI.py (1848 of 2140) PASS: lldb-api :: functionalities/data-formatter/data-formatter-stl/libcxx/variant/TestDataFormatterLibcxxVariant.py (1849 of 2140) PASS: lldb-unit :: Utility/./UtilityTests/ProcessInstanceInfoMatch.Name (1850 of 2140) PASS: lldb-shell :: SymbolFile/DWARF/DW_TAG_basic_type_DW_ATE_UTF_nonC.ll (1851 of 2140) PASS: lldb-unit :: Expression/./ExpressionTests/DWARFExpression.DW_OP_pick (1852 of 2140) PASS: lldb-api :: functionalities/tail_call_frames/disambiguate_call_site/TestDisambiguateCallSite.py (1853 of 2140) PASS: lldb-unit :: UnwindAssembly/x86/./UnwindAssemblyx86Tests/Testx86AssemblyInspectionEngine.TestPushRBX (1854 of 2140) PASS: lldb-unit :: Host/./HostTests/FileSystemTest.Resolve (1855 of 2140) PASS: lldb-shell :: SymbolFile/Breakpad/line-table-discontinuous-file-ids.test (1856 of 2140) PASS: lldb-api :: functionalities/reproducers/attach/TestReproducerAttach.py (1857 of 2140) PASS: lldb-api :: lang/objc/blocks/TestObjCIvarsInBlocks.py (1858 of 2140) PASS: lldb-api :: functionalities/history/TestHistoryRecall.py (1859 of 2140) PASS: lldb-api :: api/multithreaded/TestMultithreaded.py (1860 of 2140) PASS: lldb-api :: python_api/frame/TestFrames.py (1861 of 2140) PASS: lldb-shell :: ObjectFile/MachO/lc_version_min.yaml (1862 of 2140) PASS: lldb-unit :: Symbol/./SymbolTests/TestTypeSystemClang.TestIsClangType (1863 of 2140) PASS: lldb-unit :: Utility/./UtilityTests/BinaryStreamTest.PutULEB128NineBytes (1864 of 2140) PASS: lldb-shell :: SymbolFile/DWARF/debug-types-address-ranges.s (1865 of 2140) PASS: lldb-unit :: Utility/./UtilityTests/StringExtractorTest.GetHexU8_Exact_NoEof (1866 of 2140) PASS: lldb-api :: commands/watchpoints/hello_watchpoint/TestMyFirstWatchpoint.py (1867 of 2140) PASS: lldb-unit :: Target/./TargetTests/ExecutionContextTest.GetByteOrder (1868 of 2140) UNSUPPORTED: lldb-api :: commands/target/auto-install-main-executable/TestAutoInstallMainExecutable.py (1869 of 2140) PASS: lldb-unit :: Symbol/./SymbolTests/TestTypeSystemClang.TestDisplayName (1870 of 2140) UNSUPPORTED: lldb-api :: tools/lldb-server/TestGdbRemote_vContThreads.py (1871 of 2140) PASS: lldb-api :: lang/objc/objc-super/TestObjCSuper.py (1872 of 2140) PASS: lldb-api :: functionalities/data-formatter/data-formatter-ptr-to-array/TestPtrToArrayFormatting.py (1873 of 2140) PASS: lldb-unit :: Target/./TargetTests/ModuleCacheTest.GetAndPutUuidExists (1874 of 2140) PASS: lldb-unit :: Language/Highlighting/./HighlighterTests/HighlighterTest.Keywords (1875 of 2140) PASS: lldb-api :: functionalities/ptr_refs/TestPtrRefs.py (1876 of 2140) PASS: lldb-api :: lang/objc/modules-incomplete/TestIncompleteModules.py (1877 of 2140) PASS: lldb-unit :: Utility/./UtilityTests/ConstStringTest.YAML (1878 of 2140) PASS: lldb-unit :: Utility/./UtilityTests/StringExtractorTest.InitMisc (1879 of 2140) PASS: lldb-unit :: Utility/./UtilityTests/StringExtractorTest.GetHexU8_InvalidHex (1880 of 2140) PASS: lldb-unit :: Symbol/./SymbolTests/TestTypeSystemClang.TestGetTypeClassTypeOf (1881 of 2140) PASS: lldb-api :: commands/expression/top-level/TestTopLevelExprs.py (1882 of 2140) PASS: lldb-unit :: Utility/./UtilityTests/ArgsTest.StringListConstructor (1883 of 2140) PASS: lldb-unit :: Utility/./UtilityTests/RangeTest.Constructor (1884 of 2140) PASS: lldb-unit :: Utility/./UtilityTests/VMRange.Clear (1885 of 2140) PASS: lldb-api :: lang/cpp/incomplete-types/TestCppIncompleteTypes.py (1886 of 2140) PASS: lldb-shell :: SymbolFile/DWARF/find-basic-variable.cpp (1887 of 2140) PASS: lldb-unit :: Expression/./ExpressionTests/ClangExpressionDeclMapTest.TestPersistentDeclLookup (1888 of 2140) PASS: lldb-api :: functionalities/data-formatter/data-formatter-objc/TestDataFormatterObjCNSData.py (1889 of 2140) PASS: lldb-api :: lang/cpp/class_types/TestClassTypes.py (1890 of 2140) PASS: lldb-api :: lang/objc/foundation/TestSymbolTable.py (1891 of 2140) UNSUPPORTED: lldb-api :: functionalities/thread/break_after_join/TestBreakAfterJoin.py (1892 of 2140) PASS: lldb-unit :: Utility/./UtilityTests/StringListTest.Clear (1893 of 2140) PASS: lldb-api :: commands/expression/options/TestExprOptions.py (1894 of 2140) PASS: lldb-unit :: Utility/./UtilityTests/AnsiTerminal.WhiteSpace (1895 of 2140) PASS: lldb-unit :: Utility/./UtilityTests/ScalarTest.Division (1896 of 2140) PASS: lldb-api :: functionalities/var_path/TestVarPath.py (1897 of 2140) PASS: lldb-api :: commands/watchpoints/watchpoint_events/TestWatchpointEvents.py (1898 of 2140) PASS: lldb-api :: functionalities/thread/concurrent_events/TestConcurrentBreakpointsDelayedBreakpointOneWatchpoint.py (1899 of 2140) PASS: lldb-api :: lang/cpp/template-specialization-type/TestTemplateSpecializationType.py (1900 of 2140) PASS: lldb-shell :: ObjectFile/ELF/base-address.yaml (1901 of 2140) PASS: lldb-shell :: Reproducer/Functionalities/TestDataFormatter.test (1902 of 2140) UNSUPPORTED: lldb-api :: commands/watchpoints/hello_watchlocation/TestWatchLocation.py (1903 of 2140) UNSUPPORTED: lldb-shell :: Unwind/eh-frame-augment-noop.test (1904 of 2140) PASS: lldb-unit :: Host/./HostTests/MainLoopTest.DetectsEOF (1905 of 2140) PASS: lldb-unit :: Utility/./UtilityTests/RegularExpression.CopyAssignment (1906 of 2140) PASS: lldb-unit :: Thread/./ThreadTests/ThreadTest.SetStopInfo (1907 of 2140) UNSUPPORTED: lldb-api :: functionalities/data-formatter/data-formatter-stl/libstdcpp/string/TestDataFormatterStdString.py (1908 of 2140) PASS: lldb-api :: commands/expression/char/TestExprsChar.py (1909 of 2140) PASS: lldb-api :: macosx/universal/TestUniversal.py (1910 of 2140) PASS: lldb-unit :: Utility/./UtilityTests/RangeDataVector.FindEntryIndexesThatContain (1911 of 2140) PASS: lldb-api :: functionalities/completion/TestCompletion.py (1912 of 2140) UNSUPPORTED: lldb-api :: linux/sepdebugsymlink/TestTargetSymbolsSepDebugSymlink.py (1913 of 2140) PASS: lldb-unit :: Language/Highlighting/./HighlighterTests/HighlighterTest.ClangSquareBrackets (1914 of 2140) PASS: lldb-shell :: SymbolFile/DWARF/debug_loclists-dwo.s (1915 of 2140) PASS: lldb-api :: functionalities/thread/concurrent_events/TestConcurrentTwoBreakpointsOneDelaySignal.py (1916 of 2140) PASS: lldb-unit :: Process/minidump/./LLDBMinidumpTests/MinidumpParserTest.GetThreadsAndGetThreadContext (1917 of 2140) PASS: lldb-api :: commands/target/select/TestTargetSelect.py (1918 of 2140) PASS: lldb-api :: functionalities/thread/exit_during_expression/TestExitDuringExpression.py (1919 of 2140) PASS: lldb-unit :: UnwindAssembly/x86/./UnwindAssemblyx86Tests/Testx86AssemblyInspectionEngine.TestCALLNextInsn (1920 of 2140) PASS: lldb-shell :: Breakpoint/debug_rnglist_basic.test (1921 of 2140) PASS: lldb-unit :: Utility/./UtilityTests/StringListTest.JoinThree (1922 of 2140) PASS: lldb-api :: functionalities/dead-strip/TestDeadStrip.py (1923 of 2140) UNSUPPORTED: lldb-api :: lang/cpp/printf/TestPrintf.py (1924 of 2140) PASS: lldb-api :: lang/objc/exceptions/TestObjCExceptions.py (1925 of 2140) PASS: lldb-api :: functionalities/data-formatter/data-formatter-script/TestDataFormatterScript.py (1926 of 2140) PASS: lldb-unit :: Utility/./UtilityTests/EnvironmentTest.EnvpConversion (1927 of 2140) PASS: lldb-shell :: SymbolFile/DWARF/debug_line-relative_path.s (1928 of 2140) PASS: lldb-unit :: ObjectFile/Breakpad/./ObjectFileBreakpadTests/FileRecord.parse (1929 of 2140) PASS: lldb-unit :: Utility/./UtilityTests/TimeoutTest.Format (1930 of 2140) PASS: lldb-api :: commands/command/source/TestCommandSource.py (1931 of 2140) PASS: lldb-unit :: Utility/./UtilityTests/StringListTest.GetMaxStringLengthDecreasingSize (1932 of 2140) PASS: lldb-unit :: Utility/./UtilityTests/VASprintfTest.BufferResize (1933 of 2140) PASS: lldb-api :: functionalities/thread/num_threads/TestNumThreads.py (1934 of 2140) UNSUPPORTED: lldb-api :: commands/register/register/intel_xtended_registers/mpx_offset_intersection/TestMPXOffsetIntersection.py (1935 of 2140) PASS: lldb-unit :: Utility/./UtilityTests/SerializationRountripTest.SerializeDeserializeCStringArrayNullptr (1936 of 2140) PASS: lldb-shell :: Recognizer/assert.test (1937 of 2140) PASS: lldb-api :: functionalities/data-formatter/data-formatter-globals/TestDataFormatterGlobals.py (1938 of 2140) PASS: lldb-api :: lang/cpp/gmodules/TestWithModuleDebugging.py (1939 of 2140) PASS: lldb-api :: python_api/watchpoint/TestWatchpointIter.py (1940 of 2140) PASS: lldb-api :: commands/expression/issue_11588/Test11588.py (1941 of 2140) PASS: lldb-unit :: Utility/./UtilityTests/StringExtractorTest.GetHexBytes_FullString (1942 of 2140) PASS: lldb-unit :: Host/./HostTests/FileActionTest.Open (1943 of 2140) PASS: lldb-unit :: UnwindAssembly/x86/./UnwindAssemblyx86Tests/Testx86AssemblyInspectionEngine.TestPushR15 (1944 of 2140) PASS: lldb-unit :: Utility/./UtilityTests/PassiveReplayTest.InstrumentedFoo (1945 of 2140) PASS: lldb-unit :: SymbolFile/DWARF/./SymbolFileDWARFTests/SymbolFileDWARFTests.TestAbbrevValidAttrNullForm (1946 of 2140) PASS: lldb-unit :: Utility/./UtilityTests/RangeTest.SizeTypes (1947 of 2140) PASS: lldb-shell :: Process/TestEnvironment.test (1948 of 2140) PASS: lldb-unit :: UnwindAssembly/x86/./UnwindAssemblyx86Tests/Testx86AssemblyInspectionEngine.TestPushRBP (1949 of 2140) PASS: lldb-api :: functionalities/gdb_remote_client/TestGDBRemoteClient.py (1950 of 2140) PASS: lldb-unit :: ScriptInterpreter/Python/./ScriptInterpreterPythonTests/PythonDataObjectsTest.TestPythonListManipulation (1951 of 2140) PASS: lldb-unit :: Utility/./UtilityTests/RangeTest.Equal (1952 of 2140) PASS: lldb-unit :: Utility/./UtilityTests/StringListTest.AppendStringMove (1953 of 2140) PASS: lldb-api :: lang/objc/objc-ivar-stripped/TestObjCIvarStripped.py (1954 of 2140) PASS: lldb-unit :: Utility/./UtilityTests/ScalarTest.SetValueFromData (1955 of 2140) UNSUPPORTED: lldb-api :: linux/mix-dwo-and-regular-objects/TestMixedDwarfBinary.py (1956 of 2140) PASS: lldb-shell :: Register/x86-64-gp-read.test (1957 of 2140) PASS: lldb-unit :: Symbol/./SymbolTests/TestTypeSystemClang.TestDisplayNameEmpty (1958 of 2140) PASS: lldb-api :: lang/cpp/trivial_abi/TestTrivialABI.py (1959 of 2140) UNSUPPORTED: lldb-shell :: SymbolFile/PDB/udt-layout.test (1960 of 2140) PASS: lldb-unit :: Symbol/./SymbolTests/TestTypeSystemClang.TestConvertAccessTypeToAccessSpecifier (1961 of 2140) PASS: lldb-api :: python_api/default-constructor/TestDefaultConstructorForAPIObjects.py (1962 of 2140) PASS: lldb-unit :: Utility/./UtilityTests/BinaryStreamTest.PutULEB128MaxValue (1963 of 2140) PASS: lldb-unit :: Target/./TargetTests/ExecutionContextTest.GetByteOrderTarget (1964 of 2140) PASS: lldb-unit :: Utility/./UtilityTests/SubsystemRAIITest.SubsystemWithErrorFailure (1965 of 2140) PASS: lldb-unit :: Utility/./UtilityTests/DeserializerTest.HasData (1966 of 2140) PASS: lldb-api :: lang/cpp/wchar_t/TestCxxWCharT.py (1967 of 2140) PASS: lldb-unit :: Utility/./UtilityTests/ArgsTest.ReplaceArgumentAtIndexFarOutOfRange (1968 of 2140) PASS: lldb-unit :: Utility/./UtilityTests/RegularExpression.Valid (1969 of 2140) PASS: lldb-unit :: Utility/./UtilityTests/StringLexerTest.Next (1970 of 2140) PASS: lldb-shell :: SymbolFile/NativePDB/ast-types.cpp (1971 of 2140) PASS: lldb-unit :: Process/gdb-remote/./ProcessGdbRemoteTests/GDBRemoteCommunicationClientTest.WriteRegister (1972 of 2140) PASS: lldb-unit :: Core/./LLDBCoreTests/ModuleSpecTest.TestMachOFile (1973 of 2140) PASS: lldb-api :: lang/c/step-target/TestStepTarget.py (1974 of 2140) PASS: lldb-unit :: Utility/./UtilityTests/StreamTest.AddressRangeSize (1975 of 2140) PASS: lldb-api :: functionalities/object-file/TestImageListMultiArchitecture.py (1976 of 2140) PASS: lldb-unit :: DataFormatter/./LLDBFormatterTests/StringPrinterTests.CxxASCII (1977 of 2140) PASS: lldb-api :: functionalities/breakpoint/cpp_exception/TestCPPExceptionBreakpoint.py (1978 of 2140) PASS: lldb-unit :: Utility/./UtilityTests/VMRange.CollectionContains (1979 of 2140) PASS: lldb-api :: lang/cpp/operators/TestCppOperators.py (1980 of 2140) PASS: lldb-api :: lang/cpp/alignas_base_class/TestAlignAsBaseClass.py (1981 of 2140) UNSUPPORTED: lldb-shell :: Register/x86-gp-read.test (1982 of 2140) PASS: lldb-api :: functionalities/optimized_code/TestNoASanExceptionAfterEvalOP_piece.py (1983 of 2140) PASS: lldb-unit :: Utility/./UtilityTests/StringListTest.JoinSingle (1984 of 2140) PASS: lldb-api :: lang/objcxx/cxx-bridged-po/TestObjCXXBridgedPO.py (1985 of 2140) PASS: lldb-shell :: SymbolFile/DWARF/debug-line-basic.s (1986 of 2140) PASS: lldb-shell :: Settings/TestFrameFormatMangling.test (1987 of 2140) PASS: lldb-api :: assert_messages_test/TestAssertMessages.py (1988 of 2140) PASS: lldb-api :: functionalities/inferior-crashing/TestInferiorCrashingStep.py (1989 of 2140) PASS: lldb-unit :: Utility/./UtilityTests/NameMatchesTest.Contains (1990 of 2140) PASS: lldb-unit :: Language/Highlighting/./HighlighterTests/HighlighterTest.Colons (1991 of 2140) PASS: lldb-unit :: Host/./HostTests/NativeProcessProtocolTest.ReadCStringFromMemory_CrossPageBoundary (1992 of 2140) PASS: lldb-shell :: ObjectFile/Breakpad/sections-trailing-func.test (1993 of 2140) PASS: lldb-api :: functionalities/exec/TestExec.py (1994 of 2140) PASS: lldb-unit :: Utility/./UtilityTests/UriParserTest.Empty (1995 of 2140) PASS: lldb-shell :: SymbolFile/DWARF/compilercontext.ll (1996 of 2140) PASS: lldb-api :: macosx/version_zero/TestGetVersionZeroVersion.py (1997 of 2140) PASS: lldb-api :: functionalities/data-formatter/data-formatter-smart-array/TestDataFormatterSmartArray.py (1998 of 2140) PASS: lldb-shell :: SymbolFile/Breakpad/line-table-edgecases.test (1999 of 2140) PASS: lldb-api :: functionalities/data-formatter/data-formatter-stl/libcxx/list/loop/TestDataFormatterLibcxxListLoop.py (2000 of 2140) PASS: lldb-api :: functionalities/thread/concurrent_events/TestConcurrentWatchBreakDelay.py (2001 of 2140) PASS: lldb-api :: lang/cpp/dynamic-value-same-basename/TestDynamicValueSameBase.py (2002 of 2140) PASS: lldb-shell :: SymbolFile/DWARF/dir-separator-no-comp-dir-relative-name.s (2003 of 2140) PASS: lldb-unit :: UnwindAssembly/x86/./UnwindAssemblyx86Tests/Testx86AssemblyInspectionEngine.TestPopRBX (2004 of 2140) UNSUPPORTED: lldb-api :: tools/lldb-server/TestGdbRemoteModuleInfo.py (2005 of 2140) PASS: lldb-api :: lang/cpp/this/TestCPPThis.py (2006 of 2140) PASS: lldb-unit :: Utility/./UtilityTests/StreamTest.PutBytesAsRawHex8ToMixedEndian (2007 of 2140) PASS: lldb-shell :: BuildScript/script-args.test (2008 of 2140) PASS: lldb-api :: functionalities/plugins/command_plugin/TestPluginCommands.py (2009 of 2140) PASS: lldb-unit :: Utility/./UtilityTests/StringExtractorTest.GetHexU8_Exact (2010 of 2140) PASS: lldb-unit :: Host/./HostTests/SocketTest.DomainGetConnectURI (2011 of 2140) UNSUPPORTED: lldb-shell :: SymbolFile/PDB/func-symbols.test (2012 of 2140) PASS: lldb-unit :: Target/./TargetTests/PathMappingListTest.AbsoluteTests (2013 of 2140) PASS: lldb-unit :: Expression/./ExpressionTests/DiagnosticManagerTest.PutStringSeverities (2014 of 2140) PASS: lldb-shell :: ObjectFile/ELF/PT_LOAD-overlap-PT_INTERP.yaml (2015 of 2140) PASS: lldb-api :: functionalities/set-data/TestSetData.py (2016 of 2140) PASS: lldb-unit :: Utility/./UtilityTests/ArgsTest.BareSingleQuote (2017 of 2140) PASS: lldb-shell :: Breakpoint/split-dwarf5-debug-stroffsets.test (2018 of 2140) PASS: lldb-api :: types/TestLongTypes.py (2019 of 2140) PASS: lldb-unit :: Symbol/./SymbolTests/TestTypeSystemClang.TestBuiltinTypeForEncodingAndBitSize (2020 of 2140) PASS: lldb-api :: lang/objc/objc-ivar-protocols/TestIvarProtocols.py (2021 of 2140) PASS: lldb-unit :: ScriptInterpreter/Python/./ScriptInterpreterPythonTests/PythonDataObjectsTest.TestPythonTupleValues (2022 of 2140) PASS: lldb-api :: commands/expression/result_numbering/TestResultNumbering.py (2023 of 2140) PASS: lldb-unit :: Utility/./UtilityTests/SerializationRountripTest.SerializeDeserializeCStringNull (2024 of 2140) PASS: lldb-unit :: Utility/./UtilityTests/StringListTest.SetSize (2025 of 2140) PASS: lldb-unit :: UnwindAssembly/x86/./UnwindAssemblyx86Tests/Testx86AssemblyInspectionEngine.TestAddRSP (2026 of 2140) PASS: lldb-api :: lang/objc/foundation/TestObjCMethodsString.py (2027 of 2140) UNSUPPORTED: lldb-shell :: Breakpoint/case-insensitive.test (2028 of 2140) PASS: lldb-api :: commands/disassemble/basic/TestFrameDisassemble.py (2029 of 2140) PASS: lldb-api :: tools/lldb-server/TestGdbRemoteRegisterState.py (2030 of 2140) PASS: lldb-api :: lang/objc/objc-class-method/TestObjCClassMethod.py (2031 of 2140) PASS: lldb-unit :: Language/Highlighting/./HighlighterTests/HighlighterTest.ClangStringLiterals (2032 of 2140) PASS: lldb-api :: python_api/breakpoint/TestBreakpointAPI.py (2033 of 2140) PASS: lldb-api :: functionalities/data-formatter/data-formatter-stl/libcxx/unordered/TestDataFormatterUnordered.py (2034 of 2140) PASS: lldb-shell :: SymbolFile/DWARF/debug_ranges_and_rnglists.test (2035 of 2140) PASS: lldb-shell :: Reproducer/TestRelativePath.test (2036 of 2140) PASS: lldb-unit :: Utility/./UtilityTests/StatusTest.ErrorCodeConstructor (2037 of 2140) PASS: lldb-api :: lang/cpp/thread_local/TestThreadLocal.py (2038 of 2140) PASS: lldb-unit :: Utility/./UtilityTests/ScalarTest.GetBytes (2039 of 2140) XFAIL: lldb-shell :: SymbolFile/DWARF/find-type-in-function.cpp (2040 of 2140) PASS: lldb-unit :: Utility/./UtilityTests/StreamTest.Indent (2041 of 2140) PASS: lldb-unit :: Host/./HostTests/FileSystemTest.GetPermissions (2042 of 2140) PASS: lldb-api :: functionalities/data-formatter/data-formatter-stl/libcxx/optional/TestDataFormatterLibcxxOptional.py (2043 of 2140) PASS: lldb-shell :: SymbolFile/DWARF/DW_AT_location-DW_AT_const_value.s (2044 of 2140) PASS: lldb-shell :: Breakpoint/case-sensitive.test (2045 of 2140) PASS: lldb-shell :: Minidump/no-process-id.yaml (2046 of 2140) UNSUPPORTED: lldb-api :: tools/lldb-server/signal-filtering/TestGdbRemote_QPassSignals.py (2047 of 2140) PASS: lldb-api :: python_api/debugger/TestDebuggerAPI.py (2048 of 2140) PASS: lldb-api :: lang/cpp/typeof/TestTypeOfDeclTypeExpr.py (2049 of 2140) PASS: lldb-api :: lang/c/array_types/TestArrayTypes.py (2050 of 2140) PASS: lldb-unit :: Interpreter/./InterpreterTests/OptionArgParserTest.toBoolean (2051 of 2140) PASS: lldb-shell :: SymbolFile/DWARF/dir-separator-windows.s (2052 of 2140) PASS: lldb-api :: tools/lldb-server/register-reading/TestGdbRemoteGPacket.py (2053 of 2140) PASS: lldb-api :: tools/lldb-vscode/coreFile/TestVSCode_coreFile.py (2054 of 2140) PASS: lldb-unit :: DataFormatter/./LLDBFormatterTests/TypeMatcherTests.RegexMatchPart (2055 of 2140) UNSUPPORTED: lldb-api :: python_api/event/TestEvents.py (2056 of 2140) PASS: lldb-api :: lang/objc/objc-struct-return/TestObjCStructReturn.py (2057 of 2140) PASS: lldb-unit :: UnwindAssembly/x86/./UnwindAssemblyx86Tests/Testx86AssemblyInspectionEngine.TestMovRSPtoRBP (2058 of 2140) PASS: lldb-unit :: ObjectFile/Breakpad/./ObjectFileBreakpadTests/Record.classify (2059 of 2140) PASS: lldb-api :: lang/cpp/namespace/TestNamespace.py (2060 of 2140) PASS: lldb-unit :: Utility/./UtilityTests/OptionsWithRawTest.TerminatedQuote (2061 of 2140) PASS: lldb-unit :: Utility/./UtilityTests/FileSpecTest.CopyByAppendingPathComponent (2062 of 2140) PASS: lldb-unit :: Process/minidump/./LLDBMinidumpTests/MinidumpParserTest.GetMemoryRegionInfoLinuxMaps (2063 of 2140) PASS: lldb-unit :: Process/gdb-remote/./ProcessGdbRemoteTests/GDBRemoteCommunicationClientTest.GetModulesInfo_UUID20 (2064 of 2140) PASS: lldb-unit :: Utility/./UtilityTests/StreamTest.PutBytesAsRawHex8ToBigEndian (2065 of 2140) PASS: lldb-api :: functionalities/thread/concurrent_events/TestConcurrentWatchBreak.py (2066 of 2140) PASS: lldb-api :: commands/process/launch-with-shellexpand/TestLaunchWithShellExpand.py (2067 of 2140) PASS: lldb-unit :: Process/minidump/./LLDBMinidumpTests/MinidumpParserTest.MinidumpDuplicateModuleMappedFirst (2068 of 2140) PASS: lldb-shell :: SymbolFile/DWARF/debug_ranges-missing-section.s (2069 of 2140) PASS: lldb-unit :: ScriptInterpreter/Python/./ScriptInterpreterPythonTests/PythonDataObjectsTest.TestCallable (2070 of 2140) PASS: lldb-unit :: ObjectFile/Breakpad/./ObjectFileBreakpadTests/StackWinRecord.parse (2071 of 2140) PASS: lldb-api :: functionalities/data-formatter/data-formatter-stl/libcxx/string/TestDataFormatterLibcxxString.py (2072 of 2140) PASS: lldb-unit :: Utility/./UtilityTests/LogChannelTest.List (2073 of 2140) UNSUPPORTED: lldb-api :: functionalities/breakpoint/hardware_breakpoints/hardware_breakpoint_on_multiple_threads/TestHWBreakMultiThread.py (2074 of 2140) PASS: lldb-api :: functionalities/data-formatter/nsarraysynth/TestNSArraySynthetic.py (2075 of 2140) PASS: lldb-api :: lang/c/unions/TestUnionMembers.py (2076 of 2140) PASS: lldb-unit :: Utility/./UtilityTests/FileSpecTest.GuessPathStyle (2077 of 2140) PASS: lldb-unit :: UnwindAssembly/x86/./UnwindAssemblyx86Tests/Testx86AssemblyInspectionEngine.TestSimplex86_64Augmented (2078 of 2140) PASS: lldb-unit :: Utility/./UtilityTests/UUIDTest.StringConverion (2079 of 2140) PASS: lldb-unit :: ScriptInterpreter/Python/./ScriptInterpreterPythonTests/PythonDataObjectsTest.TestPythonListValueEquality (2080 of 2140) PASS: lldb-unit :: Utility/./UtilityTests/StringExtractorTest.DecodeHexU8_Underflow2 (2081 of 2140) UNSUPPORTED: lldb-shell :: ObjectFile/ELF/minidebuginfo-no-lzma.yaml (2082 of 2140) PASS: lldb-unit :: Utility/./UtilityTests/ReproducerTest.SetReplay (2083 of 2140) PASS: lldb-unit :: UnwindAssembly/x86/./UnwindAssemblyx86Tests/Testx86AssemblyInspectionEngine.TestDisassemblyMidFunctionEpilogues (2084 of 2140) PASS: lldb-api :: commands/expression/regression-access-function-template-in-record/TestRegressionAccessFunctionTemplateInRecord.py (2085 of 2140) PASS: lldb-api :: functionalities/data-formatter/data-formatter-stl/libcxx/set/TestDataFormatterLibcxxSet.py (2086 of 2140) PASS: lldb-api :: functionalities/data-formatter/ptr_ref_typedef/TestPtrRef2Typedef.py (2087 of 2140) PASS: lldb-api :: functionalities/gdb_remote_client/TestGDBRemoteLoad.py (2088 of 2140) PASS: lldb-api :: commands/expression/inline-namespace/TestInlineNamespace.py (2089 of 2140) PASS: lldb-shell :: ScriptInterpreter/Python/crashlog.test (2090 of 2140) PASS: lldb-unit :: Utility/./UtilityTests/StreamTeeTest.Flush (2091 of 2140) PASS: lldb-api :: lang/cpp/template-function/TestTemplateFunctions.py (2092 of 2140) PASS: lldb-shell :: ObjectFile/Breakpad/sections.test (2093 of 2140) PASS: lldb-api :: functionalities/ubsan/basic/TestUbsanBasic.py (2094 of 2140) PASS: lldb-api :: functionalities/archives/TestBSDArchives.py (2095 of 2140) PASS: lldb-unit :: Process/gdb-remote/./ProcessGdbRemoteTests/GDBRemoteClientBaseTest.SendContinueDelegateStructuredDataReceipt (2096 of 2140) PASS: lldb-unit :: Utility/./UtilityTests/OptionsWithRawTest.MultiWordSuffix (2097 of 2140) PASS: lldb-api :: commands/register/register/register_command/TestRegisters.py (2098 of 2140) PASS: lldb-api :: functionalities/thread/backtrace_limit/TestBacktraceLimit.py (2099 of 2140) PASS: lldb-shell :: Driver/TestHelp.test (2100 of 2140) PASS: lldb-shell :: Settings/TestSettingsSet.test (2101 of 2140) PASS: lldb-shell :: Driver/TestConvenienceVariables.test (2102 of 2140) PASS: lldb-unit :: Utility/./UtilityTests/StringExtractorTest.GetHexU8_Extra_NoEof (2103 of 2140) UNSUPPORTED: lldb-api :: functionalities/data-formatter/data-formatter-stl/libstdcpp/list/TestDataFormatterStdList.py (2104 of 2140) PASS: lldb-unit :: Utility/./UtilityTests/SerializationRountripTest.SerializeDeserializePodReferences (2105 of 2140) UNSUPPORTED: lldb-api :: functionalities/signal/handle-segv/TestHandleSegv.py (2106 of 2140) PASS: lldb-unit :: DataFormatter/./LLDBFormatterTests/TypeMatcherTests.CreatedBySameMatchStringExactNamePrefixes (2107 of 2140) PASS: lldb-api :: python_api/frame/get-variables/TestGetVariables.py (2108 of 2140) PASS: lldb-unit :: UnwindAssembly/x86/./UnwindAssemblyx86Tests/Testx86AssemblyInspectionEngine.TestPushR14 (2109 of 2140) PASS: lldb-shell :: Quit/TestQuitExitCode30.test (2110 of 2140) PASS: lldb-shell :: Reproducer/TestMultipleTargets.test (2111 of 2140) PASS: lldb-api :: functionalities/data-formatter/summary-string-onfail/Test-rdar-9974002.py (2112 of 2140) PASS: lldb-api :: python_api/value/change_values/TestChangeValueAPI.py (2113 of 2140) PASS: lldb-api :: functionalities/data-formatter/user-format-vs-summary/TestUserFormatVsSummary.py (2114 of 2140) PASS: lldb-api :: lang/objc/foundation/TestObjCMethodsNSError.py (2115 of 2140) PASS: lldb-unit :: ScriptInterpreter/Python/./ScriptInterpreterPythonTests/PythonDataObjectsTest.TestPythonTupleInitializerList (2116 of 2140) PASS: lldb-api :: macosx/macCatalyst/TestMacCatalyst.py (2117 of 2140) PASS: lldb-unit :: Utility/./UtilityTests/ConstStringTest.FromMidOfBufferStringRef (2118 of 2140) PASS: lldb-api :: lang/cpp/inlines/TestInlines.py (2119 of 2140) PASS: lldb-api :: commands/expression/import-std-module/forward_list-dbg-info-content/TestDbgInfoContentForwardListFromStdModule.py (2120 of 2140) PASS: lldb-unit :: Utility/./UtilityTests/PassiveReplayTest.InstrumentedBarRef (2121 of 2140) PASS: lldb-api :: functionalities/breakpoint/breakpoint_locations/TestBreakpointLocations.py (2122 of 2140) PASS: lldb-unit :: Utility/./UtilityTests/UserIDResolver.GetUserName (2123 of 2140) PASS: lldb-api :: lang/objc/conflicting-definition/TestConflictingDefinition.py (2124 of 2140) PASS: lldb-api :: commands/expression/argument_passing_restrictions/TestArgumentPassingRestrictions.py (2125 of 2140) PASS: lldb-unit :: Utility/./UtilityTests/FileSpecTest.AppendPathComponent (2126 of 2140) PASS: lldb-unit :: Utility/./UtilityTests/XcodeSDKTest.GetSDKTypeForTriple (2127 of 2140) UNSUPPORTED: lldb-shell :: Register/x86-64-zmm-write.test (2128 of 2140) PASS: lldb-shell :: Reproducer/TestVersionCheck.test (2129 of 2140) PASS: lldb-unit :: ScriptInterpreter/Python/./ScriptInterpreterPythonTests/PythonDataObjectsTest.TestPythonString (2130 of 2140) PASS: lldb-unit :: Utility/./UtilityTests/StringListTest.CopyList (2131 of 2140) PASS: lldb-api :: lang/cpp/virtual-overload/TestVirtualOverload.py (2132 of 2140) PASS: lldb-unit :: Utility/./UtilityTests/RangeTest.Slide (2133 of 2140) PASS: lldb-api :: commands/expression/namespace_local_var_same_name_obj_c/TestNamespaceLocalVarSameNameObjC.py (2134 of 2140) PASS: lldb-api :: sanity/TestModuleCacheSanity.py (2135 of 2140) PASS: lldb-api :: types/TestDoubleTypes.py (2136 of 2140) PASS: lldb-api :: functionalities/avoids-fd-leak/TestFdLeak.py (2137 of 2140) PASS: lldb-api :: tools/lldb-server/TestGdbRemoteKill.py (2138 of 2140) PASS: lldb-api :: functionalities/data-formatter/data-formatter-objc/nsstring/TestDataFormatterNSString.py (2139 of 2140) PASS: lldb-api :: tools/lldb-server/TestLldbGdbServer.py (2140 of 2140) Slowest Tests: -------------------------------------------------------------------------- 603.86s: lldb-api :: macosx/simulator/TestSimulatorPlatform.py 173.23s: lldb-api :: functionalities/data-formatter/data-formatter-objc/TestDataFormatterObjCNSDate.py 135.66s: lldb-api :: python_api/exprpath_synthetic/TestExprPathSynthetic.py 130.60s: lldb-api :: functionalities/data-formatter/data-formatter-named-summaries/TestDataFormatterNamedSummaries.py 119.88s: lldb-api :: functionalities/breakpoint/inlined_breakpoints/TestInlinedBreakpoints.py 114.23s: lldb-api :: functionalities/postmortem/elf-core/TestLinuxCore.py 100.44s: lldb-api :: tools/lldb-server/TestLldbGdbServer.py 95.15s: lldb-api :: functionalities/thread/concurrent_events/TestConcurrentCrashWithWatchpointBreakpointSignal.py 85.17s: lldb-api :: commands/expression/import-std-module/shared_ptr/TestSharedPtrFromStdModule.py 82.79s: lldb-api :: functionalities/postmortem/mach-core/TestMachCore.py 78.51s: lldb-api :: commands/expression/expr-in-syscall/TestExpressionInSyscall.py 63.16s: lldb-api :: lang/objc/hidden-ivars/TestHiddenIvars.py 56.76s: lldb-shell :: SymbolFile/NativePDB/source-list.cpp 55.69s: lldb-api :: lang/objc/foundation/TestFoundationDisassembly.py 54.63s: lldb-shell :: SymbolFile/NativePDB/bitfields.cpp 54.48s: lldb-api :: lang/objc/exceptions/TestObjCExceptions.py 54.14s: lldb-api :: functionalities/thread/step_out/TestThreadStepOut.py 54.03s: lldb-api :: functionalities/data-formatter/nssetsynth/TestNSSetSynthetic.py 52.30s: lldb-api :: lang/objc/single-entry-dictionary/TestObjCSingleEntryDictionary.py 52.12s: lldb-api :: lang/objc/foundation/TestObjCMethods.py

Hide Details

Tests Times: -------------------------------------------------------------------------- [ Range ] :: [ Percentage ] :: [ Count ] -------------------------------------------------------------------------- [600s,650s) :: [ ] :: [ 1/2140] [550s,600s) :: [ ] :: [ 0/2140] [500s,550s) :: [ ] :: [ 0/2140] [450s,500s) :: [ ] :: [ 0/2140] [400s,450s) :: [ ] :: [ 0/2140] [350s,400s) :: [ ] :: [ 0/2140] [300s,350s) :: [ ] :: [ 0/2140] [250s,300s) :: [ ] :: [ 0/2140] [200s,250s) :: [ ] :: [ 0/2140] [150s,200s) :: [ ] :: [ 1/2140] [100s,150s) :: [ ] :: [ 6/2140] [ 50s,100s) :: [ ] :: [ 16/2140] [ 0s, 50s) :: [*************************************** ] :: [2116/2140] -------------------------------------------------------------------------- ******************** Timed Out Tests (1): lldb-api :: macosx/simulator/TestSimulatorPlatform.py

Hide Details

******************** Failed Tests (1): lldb-api :: functionalities/data-formatter/data-formatter-named-summaries/TestDataFormatterNamedSummaries.py

Hide Details

Hide Details

Testing Time: 2059.36s Unsupported : 150 Passed : 1982 Expectedly Failed: 6 Timed Out : 1 Failed : 1 FAILED: tools/lldb/test/CMakeFiles/check-lldb-lit cd /Users/buildslave/jenkins/workspace/lldb-cmake/lldb-build/tools/lldb/test && /usr/local/Frameworks/Python.framework/Versions/3.7/bin/python3.7 /Users/buildslave/jenkins/workspace/lldb-cmake/lldb-build/./bin/llvm-lit -v --time-tests --shuffle --xunit-xml-output=/Users/buildslave/jenkins/workspace/lldb-cmake/test/results.xml -v -j 4 /Users/buildslave/jenkins/workspace/lldb-cmake/lldb-build/tools/lldb/test ninja: build stopped: subcommand failed. Command failed: Command '['/usr/bin/env', 'TERM=vt100', '/usr/local/bin/ninja', '-v', 'check-lldb']' returned non-zero exit status 1 Command: ['/usr/bin/env', 'TERM=vt100', '/usr/local/bin/ninja', '-v', 'check-lldb'] [Pipeline] } [Pipeline] // timeout [Pipeline] } [Pipeline] // stage [Pipeline] stage [Pipeline] { (Declarative: Post Actions) [Pipeline] scanForIssues [Clang (LLVM based)] Sleeping for 5 seconds due to JENKINS-32191... [Clang (LLVM based)] Parsing console log (workspace: '/Users/buildslave/jenkins/workspace/lldb-cmake') [Clang (LLVM based)] Successfully parsed console log [Clang (LLVM based)] -> found 8 issues (skipped 12 duplicates) [Clang (LLVM based)] Post processing issues on 'green-dragon-10' with source code encoding 'UTF-8' [Clang (LLVM based)] Creating SCM blamer to obtain author and commit information for affected files [Clang (LLVM based)] Creating SCM miner to obtain statistics for affected repository files [Clang (LLVM based)] Resolving file names for all issues in source directory '/Users/buildslave/jenkins/workspace/lldb-cmake' [Clang (LLVM based)] -> resolved paths in source directory (6 found, 0 not found) [Clang (LLVM based)] Resolving module names from module definitions (build.xml, pom.xml, or Manifest.mf files) [Clang (LLVM based)] -> resolved module names for 8 issues [Clang (LLVM based)] Resolving package names (or namespaces) by parsing the affected files [Clang (LLVM based)] -> resolved package names of 6 affected files [Clang (LLVM based)] No filter has been set, publishing all 8 issues [Clang (LLVM based)] Creating fingerprints for all affected code blocks to track issues over different builds [Clang (LLVM based)] -> created fingerprints for 8 issues (skipped 0 issues) [Clang (LLVM based)] Copying affected files to Jenkins' build folder '/Users/Shared/Jenkins/Home/jobs/lldb-cmake/builds/23766/files-with-issues' [Clang (LLVM based)] -> 4 copied, 2 not in workspace, 0 not-found, 0 with I/O error [Pipeline] junit Recording test results [Pipeline] emailext Warning: limo@google.com is not a recognized user, but sending mail anyway Warning: snehasishk@google.com is not a recognized user, but sending mail anyway Warning: aqjune@gmail.com is not a recognized user, but sending mail anyway Warning: sam.parker@arm.com is not a recognized user, but sending mail anyway Warning: gkistanova@gmail.com is not a recognized user, but sending mail anyway Warning: ravishankarm@google.com is not a recognized user, but sending mail anyway Warning: mkazantsev@azul.com is not a recognized user, but sending mail anyway Warning: ajcbik@google.com is not a recognized user, but sending mail anyway Warning: jano.vesely@gmail.com is not a recognized user, but sending mail anyway Warning: limo@google.com is not a recognized user, but sending mail anyway Warning: snehasishk@google.com is not a recognized user, but sending mail anyway Warning: aqjune@gmail.com is not a recognized user, but sending mail anyway Warning: sam.parker@arm.com is not a recognized user, but sending mail anyway Warning: gkistanova@gmail.com is not a recognized user, but sending mail anyway Warning: ravishankarm@google.com is not a recognized user, but sending mail anyway Warning: mkazantsev@azul.com is not a recognized user, but sending mail anyway Warning: ajcbik@google.com is not a recognized user, but sending mail anyway Warning: jano.vesely@gmail.com is not a recognized user, but sending mail anyway

Hide Details

Begin Pre-Send Script... Sending email to: mschifer@apple.com limo@google.com snehasishk@google.com aqjune@gmail.com sam.parker@arm.com gkistanova@gmail.com ravishankarm@google.com mkazantsev@azul.com ajcbik@google.com jano.vesely@gmail.com Michael Spencer <michael_spencer@apple.com> Azhar Mohammed <azhar@apple.com>
[Pipeline] } [Pipeline] // stage [Pipeline] } [Pipeline] // withEnv [Pipeline] } [Pipeline] // node [Pipeline] End of Pipeline ERROR: script returned exit code 1 Finished: FAILURE