FailedConsole Output

Skipping 9,267 KB.. Full Log
os13.5.0-simulator
[ 33] libsystem_trace.dylib x86_64-apple-ios13.5.0-simulator
[ 34] libunwind.dylib x86_64-apple-ios13.5.0-simulator
[ 35] libxpc.dylib x86_64-apple-ios13.5.0-simulator
[ 36] libsystem_sim_pthread_host.dylib x86_64-apple-ios13.5.0-simulator
[ 37] libsystem_sim_platform_host.dylib x86_64-apple-ios13.5.0-simulator
[ 38] libsystem_sim_kernel_host.dylib x86_64-apple-ios13.5.0-simulator
[ 39] libsystem_kernel.dylib x86_64-apple-macosx10.15.0-simulator(0x00007fff51b5a000)
[ 40] libobjc.A.dylib x86_64-apple-ios13.5.0-simulator
[ 41] libsystem_platform.dylib x86_64-apple-macosx10.15.0-simulator(0x00007fff51bfd000)
[ 42] libsystem_pthread.dylib x86_64-apple-macosx10.15.0-simulator(0x00007fff51c06000)

Hide Details

Expecting regex pattern: "a\.out x86_64-apple-ios13.0.*-simulator" (was found, matched "a.out x86_64-apple-ios13.0.0-simulator")

Hide Details

<bound method SBProcess.Kill of <lldb.SBProcess; proxy of <Swig Object of type 'lldb::SBProcess *' at 0x10a7dbd80> >>: success

Hide Details

PASS: LLDB (/Users/buildslave/jenkins/workspace/lldb-cmake/lldb-build/bin/clang-x86_64) :: test_ios_backdeploy_x86 (TestSimulatorPlatform.TestSimulatorPlatformLaunching) runCmd: settings clear -all output:

Hide Details

runCmd: settings set symbols.enable-external-lookup false output:

Hide Details

runCmd: settings set target.inherit-tcc true output:

Hide Details

runCmd: settings set target.auto-apply-fixits false output:

Hide Details

runCmd: settings set plugin.process.gdb-remote.packet-timeout 60 output:

Hide Details

runCmd: settings set symbols.clang-modules-cache-path "/Users/buildslave/jenkins/workspace/lldb-cmake/lldb-build/lldb-test-build.noindex/module-cache-lldb/lldb-api" output:

Hide Details

runCmd: settings set use-color false output:

Hide Details

runCmd: setting set target.prefer-dynamic-value no-dynamic-values output:

Hide Details

runCmd: log enable gdb-remote packets -f /Users/buildslave/jenkins/workspace/lldb-cmake/lldb-build/lldb-test-build.noindex/macosx/simulator/TestSimulatorPlatform.test_lc_version_min_iphoneos/packets.log output:

Hide Details

Ran command: "log enable gdb-remote packets -f /Users/buildslave/jenkins/workspace/lldb-cmake/lldb-build/lldb-test-build.noindex/macosx/simulator/TestSimulatorPlatform.test_lc_version_min_iphoneos/packets.log"

Hide Details

Got output:

Hide Details

Hide Details

runCmd: image list -b -t output: [ 0] a.out x86_64-apple-ios11.0.0-simulator [ 1] dyld x86_64-apple-macosx10.15.0 [ 2] dyld_sim x86_64-apple-ios13.5.0-simulator [ 3] libc++.1.dylib x86_64-apple-ios13.5.0-simulator [ 4] libSystem.B.dylib x86_64-apple-ios13.5.0-simulator [ 5] libc++abi.dylib x86_64-apple-ios13.5.0-simulator [ 6] libcache.dylib x86_64-apple-ios13.5.0-simulator [ 7] libcommonCrypto.dylib x86_64-apple-ios13.5.0-simulator [ 8] libcompiler_rt.dylib x86_64-apple-ios13.5.0-simulator [ 9] libcopyfile.dylib x86_64-apple-ios13.5.0-simulator [ 10] libcorecrypto.dylib x86_64-apple-ios13.5.0-simulator [ 11] libdispatch.dylib x86_64-apple-ios13.5.0-simulator [ 12] libdyld.dylib x86_64-apple-ios13.5.0-simulator [ 13] liblaunch.dylib x86_64-apple-ios13.5.0-simulator [ 14] libmacho.dylib x86_64-apple-ios13.5.0-simulator [ 15] libremovefile.dylib x86_64-apple-ios13.5.0-simulator [ 16] libsystem_asl.dylib x86_64-apple-ios13.5.0-simulator [ 17] libsystem_blocks.dylib x86_64-apple-ios13.5.0-simulator [ 18] libsystem_c.dylib x86_64-apple-ios13.5.0-simulator [ 19] libsystem_configuration.dylib x86_64-apple-ios13.5.0-simulator [ 20] libsystem_containermanager.dylib x86_64-apple-ios13.5.0-simulator [ 21] libsystem_coreservices.dylib x86_64-apple-ios13.5.0-simulator [ 22] libsystem_darwin.dylib x86_64-apple-ios13.5.0-simulator [ 23] libsystem_dnssd.dylib x86_64-apple-ios13.5.0-simulator [ 24] libsystem_featureflags.dylib x86_64-apple-ios13.5.0-simulator [ 25] libsystem_info.dylib x86_64-apple-ios13.5.0-simulator [ 26] libsystem_m.dylib x86_64-apple-ios13.5.0-simulator [ 27] libsystem_malloc.dylib x86_64-apple-ios13.5.0-simulator [ 28] libsystem_notify.dylib x86_64-apple-ios13.5.0-simulator [ 29] libsystem_sandbox.dylib x86_64-apple-ios13.5.0-simulator [ 30] libsystem_sim_kernel.dylib x86_64-apple-ios13.5.0-simulator [ 31] libsystem_sim_platform.dylib x86_64-apple-ios13.5.0-simulator [ 32] libsystem_sim_pthread.dylib x86_64-apple-ios13.5.0-simulator [ 33] libsystem_trace.dylib x86_64-apple-ios13.5.0-simulator [ 34] libunwind.dylib x86_64-apple-ios13.5.0-simulator [ 35] libxpc.dylib x86_64-apple-ios13.5.0-simulator [ 36] libsystem_sim_pthread_host.dylib x86_64-apple-ios13.5.0-simulator [ 37] libsystem_sim_platform_host.dylib x86_64-apple-ios13.5.0-simulator [ 38] libsystem_sim_kernel_host.dylib x86_64-apple-ios13.5.0-simulator [ 39] libsystem_kernel.dylib x86_64-apple-macosx10.15.0-simulator(0x00007fff51b5a000) [ 40] libobjc.A.dylib x86_64-apple-ios13.5.0-simulator [ 41] libsystem_platform.dylib x86_64-apple-macosx10.15.0-simulator(0x00007fff51bfd000) [ 42] libsystem_pthread.dylib x86_64-apple-macosx10.15.0-simulator(0x00007fff51c06000)

Hide Details

2020-09-14 16:42:28.617 Python[63850:6220120] CoreSimulatorService connection interrupted. Resubscribing to notifications.

Hide Details

Ran command: "image list -b -t"

Hide Details

Got output: [ 0] a.out x86_64-apple-ios11.0.0-simulator [ 1] dyld x86_64-apple-macosx10.15.0 [ 2] dyld_sim x86_64-apple-ios13.5.0-simulator [ 3] libc++.1.dylib x86_64-apple-ios13.5.0-simulator [ 4] libSystem.B.dylib x86_64-apple-ios13.5.0-simulator [ 5] libc++abi.dylib x86_64-apple-ios13.5.0-simulator [ 6] libcache.dylib x86_64-apple-ios13.5.0-simulator [ 7] libcommonCrypto.dylib x86_64-apple-ios13.5.0-simulator [ 8] libcompiler_rt.dylib x86_64-apple-ios13.5.0-simulator [ 9] libcopyfile.dylib x86_64-apple-ios13.5.0-simulator [ 10] libcorecrypto.dylib x86_64-apple-ios13.5.0-simulator [ 11] libdispatch.dylib x86_64-apple-ios13.5.0-simulator [ 12] libdyld.dylib x86_64-apple-ios13.5.0-simulator [ 13] liblaunch.dylib x86_64-apple-ios13.5.0-simulator [ 14] libmacho.dylib x86_64-apple-ios13.5.0-simulator [ 15] libremovefile.dylib x86_64-apple-ios13.5.0-simulator [ 16] libsystem_asl.dylib x86_64-apple-ios13.5.0-simulator [ 17] libsystem_blocks.dylib x86_64-apple-ios13.5.0-simulator [ 18] libsystem_c.dylib x86_64-apple-ios13.5.0-simulator [ 19] libsystem_configuration.dylib x86_64-apple-ios13.5.0-simulator [ 20] libsystem_containermanager.dylib x86_64-apple-ios13.5.0-simulator [ 21] libsystem_coreservices.dylib x86_64-apple-ios13.5.0-simulator [ 22] libsystem_darwin.dylib x86_64-apple-ios13.5.0-simulator [ 23] libsystem_dnssd.dylib x86_64-apple-ios13.5.0-simulator [ 24] libsystem_featureflags.dylib x86_64-apple-ios13.5.0-simulator [ 25] libsystem_info.dylib x86_64-apple-ios13.5.0-simulator [ 26] libsystem_m.dylib x86_64-apple-ios13.5.0-simulator [ 27] libsystem_malloc.dylib x86_64-apple-ios13.5.0-simulator [ 28] libsystem_notify.dylib x86_64-apple-ios13.5.0-simulator [ 29] libsystem_sandbox.dylib x86_64-apple-ios13.5.0-simulator [ 30] libsystem_sim_kernel.dylib x86_64-apple-ios13.5.0-simulator [ 31] libsystem_sim_platform.dylib x86_64-apple-ios13.5.0-simulator [ 32] libsystem_sim_pthread.dylib x86_64-apple-ios13.5.0-simulator [ 33] libsystem_trace.dylib x86_64-apple-ios13.5.0-simulator [ 34] libunwind.dylib x86_64-apple-ios13.5.0-simulator [ 35] libxpc.dylib x86_64-apple-ios13.5.0-simulator [ 36] libsystem_sim_pthread_host.dylib x86_64-apple-ios13.5.0-simulator [ 37] libsystem_sim_platform_host.dylib x86_64-apple-ios13.5.0-simulator [ 38] libsystem_sim_kernel_host.dylib x86_64-apple-ios13.5.0-simulator [ 39] libsystem_kernel.dylib x86_64-apple-macosx10.15.0-simulator(0x00007fff51b5a000) [ 40] libobjc.A.dylib x86_64-apple-ios13.5.0-simulator [ 41] libsystem_platform.dylib x86_64-apple-macosx10.15.0-simulator(0x00007fff51bfd000) [ 42] libsystem_pthread.dylib x86_64-apple-macosx10.15.0-simulator(0x00007fff51c06000)

Hide Details

Expecting regex pattern: "a\.out x86_64-apple-ios11.0.*-simulator" (was found, matched "a.out x86_64-apple-ios11.0.0-simulator")

Hide Details

<bound method SBProcess.Kill of <lldb.SBProcess; proxy of <Swig Object of type 'lldb::SBProcess *' at 0x103293c30> >>: success

Hide Details

PASS: LLDB (/Users/buildslave/jenkins/workspace/lldb-cmake/lldb-build/bin/clang-x86_64) :: test_lc_version_min_iphoneos (TestSimulatorPlatform.TestSimulatorPlatformLaunching) runCmd: settings clear -all output:

Hide Details

runCmd: settings set symbols.enable-external-lookup false output:

Hide Details

runCmd: settings set target.inherit-tcc true output:

Hide Details

runCmd: settings set target.auto-apply-fixits false output:

Hide Details

runCmd: settings set plugin.process.gdb-remote.packet-timeout 60 output:

Hide Details

runCmd: settings set symbols.clang-modules-cache-path "/Users/buildslave/jenkins/workspace/lldb-cmake/lldb-build/lldb-test-build.noindex/module-cache-lldb/lldb-api" output:

Hide Details

runCmd: settings set use-color false output:

Hide Details

runCmd: setting set target.prefer-dynamic-value no-dynamic-values output:

Hide Details

runCmd: log enable gdb-remote packets -f /Users/buildslave/jenkins/workspace/lldb-cmake/lldb-build/lldb-test-build.noindex/macosx/simulator/TestSimulatorPlatform.test_lc_version_min_macosx/packets.log output:

Hide Details

Ran command: "log enable gdb-remote packets -f /Users/buildslave/jenkins/workspace/lldb-cmake/lldb-build/lldb-test-build.noindex/macosx/simulator/TestSimulatorPlatform.test_lc_version_min_macosx/packets.log"

Hide Details

Got output:

Hide Details

Hide Details

runCmd: image list -b -t output: [ 0] a.out x86_64-apple-macosx10.9.0 [ 1] dyld x86_64-apple-macosx10.15.0 [ 2] libc++.1.dylib x86_64-apple-macosx10.15.0 [ 3] libSystem.B.dylib x86_64-apple-macosx10.15.0 [ 4] libc++abi.dylib x86_64-apple-macosx10.15.0 [ 5] libcache.dylib x86_64-apple-macosx10.15.0 [ 6] libcommonCrypto.dylib x86_64-apple-macosx10.15.0 [ 7] libcompiler_rt.dylib x86_64-apple-macosx10.15.0 [ 8] libcopyfile.dylib x86_64-apple-macosx10.15.0 [ 9] libcorecrypto.dylib x86_64-apple-macosx10.15.0 [ 10] libdispatch.dylib x86_64-apple-macosx10.15.0 [ 11] libdyld.dylib x86_64-apple-macosx10.15.0 [ 12] libkeymgr.dylib x86_64-apple-macosx10.15.0 [ 13] liblaunch.dylib x86_64-apple-macosx10.15.0 [ 14] libmacho.dylib x86_64-apple-macosx10.15.0 [ 15] libquarantine.dylib x86_64-apple-macosx10.15.0 [ 16] libremovefile.dylib x86_64-apple-macosx10.15.0 [ 17] libsystem_asl.dylib x86_64-apple-macosx10.15.0 [ 18] libsystem_blocks.dylib x86_64-apple-macosx10.15.0 [ 19] libsystem_c.dylib x86_64-apple-macosx10.15.0 [ 20] libsystem_configuration.dylib x86_64-apple-macosx10.15.0 [ 21] libsystem_coreservices.dylib x86_64-apple-macosx10.15.0 [ 22] libsystem_darwin.dylib x86_64-apple-macosx10.15.0 [ 23] libsystem_dnssd.dylib x86_64-apple-macosx10.15.0 [ 24] libsystem_featureflags.dylib x86_64-apple-macosx10.15.0 [ 25] libsystem_info.dylib x86_64-apple-macosx10.15.0 [ 26] libsystem_m.dylib x86_64-apple-macosx10.15.0 [ 27] libsystem_malloc.dylib x86_64-apple-macosx10.15.0 [ 28] libsystem_networkextension.dylib x86_64-apple-macosx10.15.0 [ 29] libsystem_notify.dylib x86_64-apple-macosx10.15.0 [ 30] libsystem_sandbox.dylib x86_64-apple-macosx10.15.0 [ 31] libsystem_secinit.dylib x86_64-apple-macosx10.15.0 [ 32] libsystem_kernel.dylib x86_64-apple-macosx10.15.0 [ 33] libsystem_platform.dylib x86_64-apple-macosx10.15.0 [ 34] libsystem_pthread.dylib x86_64-apple-macosx10.15.0 [ 35] libsystem_symptoms.dylib x86_64-apple-macosx10.15.0 [ 36] libsystem_trace.dylib x86_64-apple-macosx10.15.0 [ 37] libunwind.dylib x86_64-apple-macosx10.15.0 [ 38] libxpc.dylib x86_64-apple-macosx10.15.0 [ 39] libobjc.A.dylib x86_64-apple-macosx10.15.0

Hide Details

Hide Details

Ran command: "image list -b -t"

Hide Details

Got output: [ 0] a.out x86_64-apple-macosx10.9.0 [ 1] dyld x86_64-apple-macosx10.15.0 [ 2] libc++.1.dylib x86_64-apple-macosx10.15.0 [ 3] libSystem.B.dylib x86_64-apple-macosx10.15.0 [ 4] libc++abi.dylib x86_64-apple-macosx10.15.0 [ 5] libcache.dylib x86_64-apple-macosx10.15.0 [ 6] libcommonCrypto.dylib x86_64-apple-macosx10.15.0 [ 7] libcompiler_rt.dylib x86_64-apple-macosx10.15.0 [ 8] libcopyfile.dylib x86_64-apple-macosx10.15.0 [ 9] libcorecrypto.dylib x86_64-apple-macosx10.15.0 [ 10] libdispatch.dylib x86_64-apple-macosx10.15.0 [ 11] libdyld.dylib x86_64-apple-macosx10.15.0 [ 12] libkeymgr.dylib x86_64-apple-macosx10.15.0 [ 13] liblaunch.dylib x86_64-apple-macosx10.15.0 [ 14] libmacho.dylib x86_64-apple-macosx10.15.0 [ 15] libquarantine.dylib x86_64-apple-macosx10.15.0 [ 16] libremovefile.dylib x86_64-apple-macosx10.15.0 [ 17] libsystem_asl.dylib x86_64-apple-macosx10.15.0 [ 18] libsystem_blocks.dylib x86_64-apple-macosx10.15.0 [ 19] libsystem_c.dylib x86_64-apple-macosx10.15.0 [ 20] libsystem_configuration.dylib x86_64-apple-macosx10.15.0 [ 21] libsystem_coreservices.dylib x86_64-apple-macosx10.15.0 [ 22] libsystem_darwin.dylib x86_64-apple-macosx10.15.0 [ 23] libsystem_dnssd.dylib x86_64-apple-macosx10.15.0 [ 24] libsystem_featureflags.dylib x86_64-apple-macosx10.15.0 [ 25] libsystem_info.dylib x86_64-apple-macosx10.15.0 [ 26] libsystem_m.dylib x86_64-apple-macosx10.15.0 [ 27] libsystem_malloc.dylib x86_64-apple-macosx10.15.0 [ 28] libsystem_networkextension.dylib x86_64-apple-macosx10.15.0 [ 29] libsystem_notify.dylib x86_64-apple-macosx10.15.0 [ 30] libsystem_sandbox.dylib x86_64-apple-macosx10.15.0 [ 31] libsystem_secinit.dylib x86_64-apple-macosx10.15.0 [ 32] libsystem_kernel.dylib x86_64-apple-macosx10.15.0 [ 33] libsystem_platform.dylib x86_64-apple-macosx10.15.0 [ 34] libsystem_pthread.dylib x86_64-apple-macosx10.15.0 [ 35] libsystem_symptoms.dylib x86_64-apple-macosx10.15.0 [ 36] libsystem_trace.dylib x86_64-apple-macosx10.15.0 [ 37] libunwind.dylib x86_64-apple-macosx10.15.0 [ 38] libxpc.dylib x86_64-apple-macosx10.15.0 [ 39] libobjc.A.dylib x86_64-apple-macosx10.15.0

Hide Details

Expecting regex pattern: "a\.out x86_64-apple-macosx10.9.*" (was found, matched "a.out x86_64-apple-macosx10.9.0")

Hide Details

<bound method SBProcess.Kill of <lldb.SBProcess; proxy of <Swig Object of type 'lldb::SBProcess *' at 0x10a7dbd80> >>: success

Hide Details

PASS: LLDB (/Users/buildslave/jenkins/workspace/lldb-cmake/lldb-build/bin/clang-x86_64) :: test_lc_version_min_macosx (TestSimulatorPlatform.TestSimulatorPlatformLaunching) runCmd: settings clear -all output:

Hide Details

runCmd: settings set symbols.enable-external-lookup false output:

Hide Details

runCmd: settings set target.inherit-tcc true output:

Hide Details

runCmd: settings set target.auto-apply-fixits false output:

Hide Details

runCmd: settings set plugin.process.gdb-remote.packet-timeout 60 output:

Hide Details

runCmd: settings set symbols.clang-modules-cache-path "/Users/buildslave/jenkins/workspace/lldb-cmake/lldb-build/lldb-test-build.noindex/module-cache-lldb/lldb-api" output:

Hide Details

runCmd: settings set use-color false output:

Hide Details

runCmd: setting set target.prefer-dynamic-value no-dynamic-values output:

Hide Details

runCmd: log enable gdb-remote packets -f /Users/buildslave/jenkins/workspace/lldb-cmake/lldb-build/lldb-test-build.noindex/macosx/simulator/TestSimulatorPlatform.test_lc_version_min_tvos/packets.log output:

Hide Details

Ran command: "log enable gdb-remote packets -f /Users/buildslave/jenkins/workspace/lldb-cmake/lldb-build/lldb-test-build.noindex/macosx/simulator/TestSimulatorPlatform.test_lc_version_min_tvos/packets.log"

Hide Details

Got output:

Hide Details

Hide Details

FAIL: LLDB (/Users/buildslave/jenkins/workspace/lldb-cmake/lldb-build/bin/clang-x86_64) :: test_lc_version_min_tvos (TestSimulatorPlatform.TestSimulatorPlatformLaunching) UNSUPPORTED: LLDB (/Users/buildslave/jenkins/workspace/lldb-cmake/lldb-build/bin/clang-x86_64) :: test_lc_version_min_watchos (TestSimulatorPlatform.TestSimulatorPlatformLaunching) (skip on macosx, darwin, ios, tvos, watchos, bridgeos) runCmd: settings clear -all output:

Hide Details

runCmd: settings set symbols.enable-external-lookup false output:

Hide Details

runCmd: settings set target.inherit-tcc true output:

Hide Details

runCmd: settings set target.auto-apply-fixits false output:

Hide Details

runCmd: settings set plugin.process.gdb-remote.packet-timeout 60 output:

Hide Details

runCmd: settings set symbols.clang-modules-cache-path "/Users/buildslave/jenkins/workspace/lldb-cmake/lldb-build/lldb-test-build.noindex/module-cache-lldb/lldb-api" output:

Hide Details

runCmd: settings set use-color false output:

Hide Details

runCmd: setting set target.prefer-dynamic-value no-dynamic-values output:

Hide Details

runCmd: log enable gdb-remote packets -f /Users/buildslave/jenkins/workspace/lldb-cmake/lldb-build/lldb-test-build.noindex/macosx/simulator/TestSimulatorPlatform.test_tvos/packets.log output:

Hide Details

Ran command: "log enable gdb-remote packets -f /Users/buildslave/jenkins/workspace/lldb-cmake/lldb-build/lldb-test-build.noindex/macosx/simulator/TestSimulatorPlatform.test_tvos/packets.log"

Hide Details

Got output:

Hide Details

Hide Details

runCmd: image list -b -t output: [ 0] a.out x86_64-apple-tvos13.4.0-simulator [ 1] dyld x86_64-apple-macosx10.15.0 [ 2] dyld_sim x86_64-apple-tvos13.4.0-simulator [ 3] libc++.1.dylib x86_64-apple-tvos13.4.0-simulator [ 4] libSystem.B.dylib x86_64-apple-tvos13.4.0-simulator [ 5] libc++abi.dylib x86_64-apple-tvos13.4.0-simulator [ 6] libcache.dylib x86_64-apple-tvos13.4.0-simulator [ 7] libcommonCrypto.dylib x86_64-apple-tvos13.4.0-simulator [ 8] libcompiler_rt.dylib x86_64-apple-tvos13.4.0-simulator [ 9] libcopyfile.dylib x86_64-apple-tvos13.4.0-simulator [ 10] libcorecrypto.dylib x86_64-apple-tvos13.4.0-simulator [ 11] libdispatch.dylib x86_64-apple-tvos13.4.0-simulator [ 12] libdyld.dylib x86_64-apple-tvos13.4.0-simulator [ 13] liblaunch.dylib x86_64-apple-tvos13.4.0-simulator [ 14] libmacho.dylib x86_64-apple-tvos13.4.0-simulator [ 15] libremovefile.dylib x86_64-apple-tvos13.4.0-simulator [ 16] libsystem_asl.dylib x86_64-apple-tvos13.4.0-simulator [ 17] libsystem_blocks.dylib x86_64-apple-tvos13.4.0-simulator [ 18] libsystem_c.dylib x86_64-apple-tvos13.4.0-simulator [ 19] libsystem_configuration.dylib x86_64-apple-tvos13.4.0-simulator [ 20] libsystem_containermanager.dylib x86_64-apple-tvos13.4.0-simulator [ 21] libsystem_coreservices.dylib x86_64-apple-tvos13.4.0-simulator [ 22] libsystem_darwin.dylib x86_64-apple-tvos13.4.0-simulator [ 23] libsystem_dnssd.dylib x86_64-apple-tvos13.4.0-simulator [ 24] libsystem_featureflags.dylib x86_64-apple-tvos13.4.0-simulator [ 25] libsystem_info.dylib x86_64-apple-tvos13.4.0-simulator [ 26] libsystem_m.dylib x86_64-apple-tvos13.4.0-simulator [ 27] libsystem_malloc.dylib x86_64-apple-tvos13.4.0-simulator [ 28] libsystem_notify.dylib x86_64-apple-tvos13.4.0-simulator [ 29] libsystem_sandbox.dylib x86_64-apple-tvos13.4.0-simulator [ 30] libsystem_sim_kernel.dylib x86_64-apple-tvos13.4.0-simulator [ 31] libsystem_sim_platform.dylib x86_64-apple-tvos13.4.0-simulator [ 32] libsystem_sim_pthread.dylib x86_64-apple-tvos13.4.0-simulator [ 33] libsystem_trace.dylib x86_64-apple-tvos13.4.0-simulator [ 34] libunwind.dylib x86_64-apple-tvos13.4.0-simulator [ 35] libxpc.dylib x86_64-apple-tvos13.4.0-simulator [ 36] libsystem_sim_pthread_host.dylib x86_64-apple-tvos13.4.0-simulator [ 37] libsystem_sim_platform_host.dylib x86_64-apple-tvos13.4.0-simulator [ 38] libsystem_sim_kernel_host.dylib x86_64-apple-tvos13.4.0-simulator [ 39] libsystem_kernel.dylib x86_64-apple-macosx10.15.0-simulator(0x00007fff421b1000) [ 40] libobjc.A.dylib x86_64-apple-tvos13.4.0-simulator [ 41] libsystem_platform.dylib x86_64-apple-macosx10.15.0-simulator(0x00007fff42254000) [ 42] libsystem_pthread.dylib x86_64-apple-macosx10.15.0-simulator(0x00007fff4225d000)

Hide Details

Hide Details

Ran command: "image list -b -t"

Hide Details

Got output: [ 0] a.out x86_64-apple-tvos13.4.0-simulator [ 1] dyld x86_64-apple-macosx10.15.0 [ 2] dyld_sim x86_64-apple-tvos13.4.0-simulator [ 3] libc++.1.dylib x86_64-apple-tvos13.4.0-simulator [ 4] libSystem.B.dylib x86_64-apple-tvos13.4.0-simulator [ 5] libc++abi.dylib x86_64-apple-tvos13.4.0-simulator [ 6] libcache.dylib x86_64-apple-tvos13.4.0-simulator [ 7] libcommonCrypto.dylib x86_64-apple-tvos13.4.0-simulator [ 8] libcompiler_rt.dylib x86_64-apple-tvos13.4.0-simulator [ 9] libcopyfile.dylib x86_64-apple-tvos13.4.0-simulator [ 10] libcorecrypto.dylib x86_64-apple-tvos13.4.0-simulator [ 11] libdispatch.dylib x86_64-apple-tvos13.4.0-simulator [ 12] libdyld.dylib x86_64-apple-tvos13.4.0-simulator [ 13] liblaunch.dylib x86_64-apple-tvos13.4.0-simulator [ 14] libmacho.dylib x86_64-apple-tvos13.4.0-simulator [ 15] libremovefile.dylib x86_64-apple-tvos13.4.0-simulator [ 16] libsystem_asl.dylib x86_64-apple-tvos13.4.0-simulator [ 17] libsystem_blocks.dylib x86_64-apple-tvos13.4.0-simulator [ 18] libsystem_c.dylib x86_64-apple-tvos13.4.0-simulator [ 19] libsystem_configuration.dylib x86_64-apple-tvos13.4.0-simulator [ 20] libsystem_containermanager.dylib x86_64-apple-tvos13.4.0-simulator [ 21] libsystem_coreservices.dylib x86_64-apple-tvos13.4.0-simulator [ 22] libsystem_darwin.dylib x86_64-apple-tvos13.4.0-simulator [ 23] libsystem_dnssd.dylib x86_64-apple-tvos13.4.0-simulator [ 24] libsystem_featureflags.dylib x86_64-apple-tvos13.4.0-simulator [ 25] libsystem_info.dylib x86_64-apple-tvos13.4.0-simulator [ 26] libsystem_m.dylib x86_64-apple-tvos13.4.0-simulator [ 27] libsystem_malloc.dylib x86_64-apple-tvos13.4.0-simulator [ 28] libsystem_notify.dylib x86_64-apple-tvos13.4.0-simulator [ 29] libsystem_sandbox.dylib x86_64-apple-tvos13.4.0-simulator [ 30] libsystem_sim_kernel.dylib x86_64-apple-tvos13.4.0-simulator [ 31] libsystem_sim_platform.dylib x86_64-apple-tvos13.4.0-simulator [ 32] libsystem_sim_pthread.dylib x86_64-apple-tvos13.4.0-simulator [ 33] libsystem_trace.dylib x86_64-apple-tvos13.4.0-simulator [ 34] libunwind.dylib x86_64-apple-tvos13.4.0-simulator [ 35] libxpc.dylib x86_64-apple-tvos13.4.0-simulator [ 36] libsystem_sim_pthread_host.dylib x86_64-apple-tvos13.4.0-simulator [ 37] libsystem_sim_platform_host.dylib x86_64-apple-tvos13.4.0-simulator [ 38] libsystem_sim_kernel_host.dylib x86_64-apple-tvos13.4.0-simulator [ 39] libsystem_kernel.dylib x86_64-apple-macosx10.15.0-simulator(0x00007fff421b1000) [ 40] libobjc.A.dylib x86_64-apple-tvos13.4.0-simulator [ 41] libsystem_platform.dylib x86_64-apple-macosx10.15.0-simulator(0x00007fff42254000) [ 42] libsystem_pthread.dylib x86_64-apple-macosx10.15.0-simulator(0x00007fff4225d000)

Hide Details

Expecting regex pattern: "a\.out x86_64-apple-tvos13.4.*-simulator" (was found, matched "a.out x86_64-apple-tvos13.4.0-simulator")

Hide Details

<bound method SBProcess.Kill of <lldb.SBProcess; proxy of <Swig Object of type 'lldb::SBProcess *' at 0x10a7dbf90> >>: success

Hide Details

PASS: LLDB (/Users/buildslave/jenkins/workspace/lldb-cmake/lldb-build/bin/clang-x86_64) :: test_tvos (TestSimulatorPlatform.TestSimulatorPlatformLaunching) runCmd: settings clear -all output:

Hide Details

runCmd: settings set symbols.enable-external-lookup false output:

Hide Details

runCmd: settings set target.inherit-tcc true output:

Hide Details

runCmd: settings set target.auto-apply-fixits false output:

Hide Details

runCmd: settings set plugin.process.gdb-remote.packet-timeout 60 output:

Hide Details

runCmd: settings set symbols.clang-modules-cache-path "/Users/buildslave/jenkins/workspace/lldb-cmake/lldb-build/lldb-test-build.noindex/module-cache-lldb/lldb-api" output:

Hide Details

runCmd: settings set use-color false output:

Hide Details

runCmd: setting set target.prefer-dynamic-value no-dynamic-values output:

Hide Details

UNSUPPORTED: LLDB (/Users/buildslave/jenkins/workspace/lldb-cmake/lldb-build/bin/clang-x86_64) :: test_tvos_backdeploy_apple_silicon (TestSimulatorPlatform.TestSimulatorPlatformLaunching) (skipping due to the following parameter(s): architecture) UNSUPPORTED: LLDB (/Users/buildslave/jenkins/workspace/lldb-cmake/lldb-build/bin/clang-x86_64) :: test_watchos_armv7k (TestSimulatorPlatform.TestSimulatorPlatformLaunching) (skip on macosx, darwin, ios, tvos, watchos, bridgeos) UNSUPPORTED: LLDB (/Users/buildslave/jenkins/workspace/lldb-cmake/lldb-build/bin/clang-x86_64) :: test_watchos_backdeploy_apple_silicon (TestSimulatorPlatform.TestSimulatorPlatformLaunching) (skip on macosx, darwin, ios, tvos, watchos, bridgeos) UNSUPPORTED: LLDB (/Users/buildslave/jenkins/workspace/lldb-cmake/lldb-build/bin/clang-x86_64) :: test_watchos_i386 (TestSimulatorPlatform.TestSimulatorPlatformLaunching) (skip on macosx, darwin, ios, tvos, watchos, bridgeos) Restore dir to: /Users/buildslave/jenkins/workspace/lldb-cmake/lldb-build/tools/lldb/test ====================================================================== FAIL: test_lc_version_min_tvos (TestSimulatorPlatform.TestSimulatorPlatformLaunching) Test running a back-deploying tvOS simulator binary ---------------------------------------------------------------------- Traceback (most recent call last): File "/Users/buildslave/jenkins/workspace/lldb-cmake/llvm-project/lldb/packages/Python/lldbsuite/test/decorators.py", line 134, in wrapper return func(*args, **kwargs) File "/Users/buildslave/jenkins/workspace/lldb-cmake/llvm-project/lldb/packages/Python/lldbsuite/test/decorators.py", line 134, in wrapper return func(*args, **kwargs) File "/Users/buildslave/jenkins/workspace/lldb-cmake/llvm-project/lldb/packages/Python/lldbsuite/test/decorators.py", line 134, in wrapper return func(*args, **kwargs) [Previous line repeated 1 more time] File "/Users/buildslave/jenkins/workspace/lldb-cmake/llvm-project/lldb/test/API/macosx/simulator/TestSimulatorPlatform.py", line 192, in test_lc_version_min_tvos expected_load_command='LC_VERSION_MIN_TVOS') File "/Users/buildslave/jenkins/workspace/lldb-cmake/llvm-project/lldb/test/API/macosx/simulator/TestSimulatorPlatform.py", line 72, in run_with lldb.SBFileSpec("hello.c")) File "/Users/buildslave/jenkins/workspace/lldb-cmake/llvm-project/lldb/packages/Python/lldbsuite/test/lldbutil.py", line 954, in run_to_source_breakpoint only_one_thread, extra_images) File "/Users/buildslave/jenkins/workspace/lldb-cmake/llvm-project/lldb/packages/Python/lldbsuite/test/lldbutil.py", line 871, in run_to_breakpoint_do_run (target.GetExecutable().GetFilename(), error.GetCString())) AssertionError: <lldb.SBProcess; proxy of <Swig Object of type 'lldb::SBProcess *' at 0x10a9531e0> > is not True : Could not create a valid process for a.out: Error Domain=NSPOSIXErrorDomain Code=53 "Software caused connection abort" UserInfo={NSLocalizedDescription=Error returned in reply: Connection interrupted} Config=x86_64-/Users/buildslave/jenkins/workspace/lldb-cmake/lldb-build/bin/clang ---------------------------------------------------------------------- Ran 12 tests in 123.014s

Hide Details

RESULT: FAILED (5 passes, 1 failures, 0 errors, 6 skipped, 0 expected failures, 0 unexpected successes)

Hide Details

--

Hide Details

******************** PASS: lldb-unit :: Utility/./UtilityTests/FileSpecTest.FormatFileSpec (875 of 2141) UNSUPPORTED: lldb-shell :: Register/x86-64-ymm16-write.test (876 of 2141) PASS: lldb-api :: lang/cpp/const_this/TestConstThis.py (877 of 2141) UNSUPPORTED: lldb-shell :: SymbolFile/target-symbols-add-unwind.test (878 of 2141) UNSUPPORTED: lldb-shell :: BuildScript/toolchain-clang-cl.test (879 of 2141) PASS: lldb-unit :: Language/Highlighting/./HighlighterTests/HighlighterTest.ClangTrailingBackslashMissingNewLine (880 of 2141) PASS: lldb-unit :: ObjectFile/ELF/./ObjectFileELFTests/ObjectFileELFTest.GetModuleSpecifications_EarlySectionHeaders (881 of 2141) PASS: lldb-shell :: Driver/TestSingleQuote.test (882 of 2141) PASS: lldb-shell :: Commands/CommandScriptImmediateOutput/CommandScriptImmediateOutputConsole.test (883 of 2141) PASS: lldb-api :: commands/expression/import_base_class_when_class_has_derived_member/TestImportBaseClassWhenClassHasDerivedMember.py (884 of 2141) PASS: lldb-api :: commands/expression/import-std-module/shared_ptr/TestSharedPtrFromStdModule.py (885 of 2141) PASS: lldb-unit :: Utility/./UtilityTests/BinaryStreamTest.PutULEB128Zero (886 of 2141) PASS: lldb-unit :: UnwindAssembly/ARM64/./Arm64InstEmulationTests/TestArm64InstEmulation.TestCFARegisterTrackedAcrossJumps (887 of 2141) PASS: lldb-api :: lang/objc/rdar-11355592/TestRdar11355592.py (888 of 2141) PASS: lldb-shell :: Reproducer/Functionalities/TestDataFormatter.test (889 of 2141) PASS: lldb-api :: tools/lldb-server/TestGdbRemote_vCont.py (890 of 2141) PASS: lldb-unit :: ScriptInterpreter/Python/./ScriptInterpreterPythonTests/PythonDataObjectsTest.TestModuleNameResolutionNoDot (891 of 2141) PASS: lldb-unit :: Utility/./UtilityTests/StringExtractorTest.GetHexU8_Underflow_NoEof (892 of 2141) PASS: lldb-unit :: Host/./HostTests/SocketTest.UDPConnect (893 of 2141) PASS: lldb-unit :: Interpreter/./InterpreterTests/OptionArgParserTest.toChar (894 of 2141) UNSUPPORTED: lldb-api :: functionalities/thread/create_during_step/TestCreateDuringStep.py (895 of 2141) PASS: lldb-unit :: ScriptInterpreter/Python/./ScriptInterpreterPythonTests/PythonDataObjectsTest.TestPythonDictionaryValueEquality (896 of 2141) PASS: lldb-shell :: ObjectFile/ELF/PT_LOAD-overlap-section.yaml (897 of 2141) PASS: lldb-api :: commands/expression/entry-bp/TestExprEntryBP.py (898 of 2141) PASS: lldb-api :: functionalities/data-formatter/boolreference/TestFormattersBoolRefPtr.py (899 of 2141) PASS: lldb-api :: functionalities/tsan/cpp_global_location/TestTsanCPPGlobalLocation.py (900 of 2141) PASS: lldb-unit :: Utility/./UtilityTests/StreamTest.AddressRange (901 of 2141) PASS: lldb-shell :: SymbolFile/DWARF/debug_aranges-empty-section.s (902 of 2141) PASS: lldb-api :: python_api/watchpoint/TestWatchpointIgnoreCount.py (903 of 2141) PASS: lldb-unit :: Utility/./UtilityTests/ArchSpecTest.TripleComponentsWereSpecified (904 of 2141) PASS: lldb-api :: functionalities/unwind/sigtramp/TestSigtrampUnwind.py (905 of 2141) PASS: lldb-unit :: Core/./LLDBCoreTests/RichManglingContextTest.Basic (906 of 2141) PASS: lldb-api :: commands/process/attach/attach_denied/TestAttachDenied.py (907 of 2141) PASS: lldb-api :: functionalities/data-formatter/nssetsynth/TestNSSetSynthetic.py (908 of 2141) PASS: lldb-api :: lang/objc/modules-compile-error/TestModulesCompileError.py (909 of 2141) PASS: lldb-unit :: Symbol/./SymbolTests/TestClangASTImporter.CopyTypeTagDecl (910 of 2141) UNSUPPORTED: lldb-shell :: Register/x86-ymm-read.test (911 of 2141) PASS: lldb-unit :: Utility/./UtilityTests/StringListTest.GetMaxStringLengthEqualSize (912 of 2141) PASS: lldb-unit :: Utility/./UtilityTests/CompletionRequest.Constructor (913 of 2141) PASS: lldb-unit :: Utility/./UtilityTests/GeneratorTest.GetOrCreate (914 of 2141) PASS: lldb-api :: commands/command/script/import/TestImport.py (915 of 2141) PASS: lldb-api :: lang/cpp/chained-calls/TestCppChainedCalls.py (916 of 2141) PASS: lldb-api :: commands/process/signal/TestProcessSignal.py (917 of 2141) PASS: lldb-unit :: Signals/./SignalsTests/UnixSignalsTest.GetFilteredSignals (918 of 2141) PASS: lldb-api :: functionalities/thread/backtrace_limit/TestBacktraceLimit.py (919 of 2141) PASS: lldb-unit :: Utility/./UtilityTests/StringExtractorTest.GetHexU8_Extra (920 of 2141) PASS: lldb-unit :: Symbol/./SymbolTests/TestClangASTImporter.MetadataPropagationIndirectImport (921 of 2141) PASS: lldb-api :: functionalities/thread/concurrent_events/TestConcurrentBreakpointsDelayedBreakpointOneWatchpoint.py (922 of 2141) PASS: lldb-api :: lang/cpp/virtual-overload/TestVirtualOverload.py (923 of 2141) PASS: lldb-api :: functionalities/breakpoint/breakpoint_hit_count/TestBreakpointHitCount.py (924 of 2141) PASS: lldb-shell :: SymbolFile/DWARF/find-basic-function.cpp (925 of 2141) PASS: lldb-unit :: Process/gdb-remote/./ProcessGdbRemoteTests/GDBRemoteCommunicationServerTest.SendErrorResponse_Status (926 of 2141) PASS: lldb-unit :: Symbol/./SymbolTests/TestTypeSystemClang.TestDisplayNameEmpty (927 of 2141) PASS: lldb-api :: python_api/formatters/TestFormattersSBAPI.py (928 of 2141) PASS: lldb-unit :: SymbolFile/NativePDB/./SymbolFileNativePDBTests/PDBFPOProgramToDWARFExpressionTests.MultipleDependentAssignments (929 of 2141) PASS: lldb-api :: lang/objc/objc-static-method-stripped/TestObjCStaticMethodStripped.py (930 of 2141) PASS: lldb-unit :: Process/minidump/./LLDBMinidumpTests/RegisterContextMinidump.CheckRegisterContextMinidump_ARM (931 of 2141) PASS: lldb-unit :: ScriptInterpreter/Python/./ScriptInterpreterPythonTests/PythonDataObjectsTest.TestOwnedReferences (932 of 2141) PASS: lldb-unit :: UnwindAssembly/x86/./UnwindAssemblyx86Tests/Testx86AssemblyInspectionEngine.TestSubESP (933 of 2141) PASS: lldb-unit :: DataFormatter/./LLDBFormatterTests/StringPrinterTests.SwiftUTF8 (934 of 2141) PASS: lldb-unit :: Utility/./UtilityTests/RangeTest.SlideZero (935 of 2141) PASS: lldb-unit :: Utility/./UtilityTests/ConstStringTest.MangledCounterpart (936 of 2141) PASS: lldb-unit :: Utility/./UtilityTests/ArgsTest.EscapeLLDBCommandArgument (937 of 2141) PASS: lldb-api :: functionalities/data-formatter/data-formatter-objc/nsindexpath/TestDataFormatterNSIndexPath.py (938 of 2141) PASS: lldb-shell :: Reproducer/TestFileRepro.test (939 of 2141) PASS: lldb-shell :: SymbolFile/DWARF/debug_rnglists-dwo.s (940 of 2141) PASS: lldb-unit :: Language/Highlighting/./HighlighterTests/HighlighterTest.ClangScalarLiterals (941 of 2141) PASS: lldb-unit :: ObjectFile/PECOFF/./ObjectFilePECOFFTests/PECallFrameInfoTest.Frame_reg_eh (942 of 2141) UNSUPPORTED: lldb-api :: functionalities/data-formatter/data-formatter-stl/libstdcpp/string/TestDataFormatterStdString.py (943 of 2141) PASS: lldb-unit :: Utility/./UtilityTests/BinaryStreamTest.PutSLEB128FiveBytes (944 of 2141) PASS: lldb-unit :: Utility/./UtilityTests/DataExtractorTest.GetBitfield (945 of 2141) PASS: lldb-shell :: Reproducer/TestCrash.test (946 of 2141) PASS: lldb-api :: functionalities/data-formatter/data-formatter-skip-summary/TestDataFormatterSkipSummary.py (947 of 2141) PASS: lldb-api :: commands/target/stop-hooks/TestStopHooks.py (948 of 2141) PASS: lldb-api :: functionalities/data-formatter/data-formatter-synthtype/TestDataFormatterSynthType.py (949 of 2141) PASS: lldb-api :: functionalities/history/TestHistoryRecall.py (950 of 2141) PASS: lldb-unit :: Symbol/./SymbolTests/TestTypeSystemClang.TestFunctionTemplateInRecordConstruction (951 of 2141) PASS: lldb-shell :: Reproducer/Functionalities/TestStepping.test (952 of 2141) PASS: lldb-api :: functionalities/data-formatter/type_summary_list_script/TestTypeSummaryListScript.py (953 of 2141) PASS: lldb-unit :: Utility/./UtilityTests/StringLexerTest.Next (954 of 2141) PASS: lldb-api :: functionalities/breakpoint/consecutive_breakpoints/TestConsecutiveBreakpoints.py (955 of 2141) PASS: lldb-api :: functionalities/data-formatter/data-formatter-objc/TestDataFormatterObjCNSError.py (956 of 2141) PASS: lldb-unit :: Utility/./UtilityTests/StringExtractorTest.GetHexBytesAvail (957 of 2141) PASS: lldb-unit :: Utility/./UtilityTests/OptionsWithRawTest.SingleWordSuffix (958 of 2141) PASS: lldb-shell :: ObjectFile/ELF/PT_LOAD-overlap-PT_INTERP.yaml (959 of 2141) PASS: lldb-unit :: Language/Highlighting/./HighlighterTests/HighlighterTest.ClangTrailingBackslashWithWhitespace (960 of 2141) PASS: lldb-shell :: Reproducer/TestDiscard.test (961 of 2141) PASS: lldb-unit :: Instruction/./EmulatorTests/TestAArch64Emulator.TestOverflow (962 of 2141) PASS: lldb-api :: lang/cpp/this_class_type_mixing/TestThisClassTypeMixing.py (963 of 2141) PASS: lldb-api :: functionalities/data-formatter/data-formatter-proper-plurals/TestFormattersOneIsSingular.py (964 of 2141) PASS: lldb-unit :: Utility/./UtilityTests/StringExtractorTest.GetHexBytesAvail_Partial (965 of 2141) PASS: lldb-api :: lang/objc/foundation/TestSymbolTable.py (966 of 2141) PASS: lldb-shell :: ScriptInterpreter/Python/eof.test (967 of 2141) PASS: lldb-shell :: SymbolFile/DWARF/childless-compile-unit.s (968 of 2141) UNSUPPORTED: lldb-shell :: ScriptInterpreter/Lua/nested_sessions.test (969 of 2141) PASS: lldb-unit :: Symbol/./SymbolTests/TestTypeSystemClang.TestDisplayName (970 of 2141) PASS: lldb-api :: lang/objc/objc-struct-argument/TestObjCStructArgument.py (971 of 2141) PASS: lldb-api :: functionalities/data-formatter/data-formatter-stl/libcxx/list/TestDataFormatterLibcxxList.py (972 of 2141) PASS: lldb-unit :: Symbol/./SymbolTests/LineEntryTest.GetSameLineContiguousAddressRangeNestedInline (973 of 2141) PASS: lldb-shell :: SymbolFile/DWARF/dwp-debug-types.s (974 of 2141) PASS: lldb-unit :: SymbolFile/DWARF/./SymbolFileDWARFTests/SymbolFileDWARFTests.TestAbbrevOrder1Start5 (975 of 2141) PASS: lldb-unit :: Utility/./UtilityTests/StringListTest.PopBack (976 of 2141) PASS: lldb-api :: functionalities/optimized_code/TestNoASanExceptionAfterEvalOP_piece.py (977 of 2141) PASS: lldb-unit :: Utility/./UtilityTests/UriParserTest.SchemeHostSeparator (978 of 2141) PASS: lldb-api :: functionalities/inferior-crashing/recursive-inferior/TestRecursiveInferiorStep.py (979 of 2141) PASS: lldb-shell :: SymbolFile/DWARF/parallel-indexing-stress.s (980 of 2141) PASS: lldb-unit :: Process/gdb-remote/./ProcessGdbRemoteTests/GDBRemoteCommunicationClientTest.SendGetMetaDataPacket (981 of 2141) PASS: lldb-shell :: SymbolFile/DWARF/debug-types-missing-signature.test (982 of 2141) PASS: lldb-unit :: Utility/./UtilityTests/OptionsWithRawTest.UnterminatedQuote (983 of 2141) PASS: lldb-api :: lang/cpp/nested-class-other-compilation-unit/TestNestedClassWithParentInAnotherCU.py (984 of 2141) PASS: lldb-api :: commands/frame/var/TestFrameVar.py (985 of 2141) PASS: lldb-shell :: SymbolFile/DWARF/find-function-regex.cpp (986 of 2141) PASS: lldb-api :: lang/objc/orderedset/TestOrderedSet.py (987 of 2141) PASS: lldb-api :: functionalities/breakpoint/breakpoint_options/TestBreakpointOptions.py (988 of 2141) PASS: lldb-api :: commands/expression/import-std-module/deque-basic/TestDequeFromStdModule.py (989 of 2141) PASS: lldb-unit :: Utility/./UtilityTests/BinaryStreamTest.PutSLEB128FourBytes (990 of 2141) UNSUPPORTED: lldb-shell :: SymbolFile/PDB/compilands.test (991 of 2141) PASS: lldb-unit :: Utility/./UtilityTests/StreamTest.PutCharWhitespace (992 of 2141) PASS: lldb-api :: commands/expression/context-object/TestContextObject.py (993 of 2141) PASS: lldb-shell :: ObjectFile/ELF/compressed-sections.yaml (994 of 2141) PASS: lldb-api :: lang/cpp/function-qualifiers/TestCppFunctionQualifiers.py (995 of 2141) PASS: lldb-shell :: ScriptInterpreter/None/import_module.test (996 of 2141) PASS: lldb-unit :: Symbol/./SymbolTests/TestTypeSystemClang.TestBuiltinTypeForEncodingAndBitSize (997 of 2141) PASS: lldb-shell :: Breakpoint/single-file-split-dwarf.test (998 of 2141) PASS: lldb-api :: functionalities/completion/TestCompletion.py (999 of 2141) PASS: lldb-api :: python_api/symbol-context/TestSymbolContext.py (1000 of 2141) PASS: lldb-api :: commands/quit/TestQuit.py (1001 of 2141) PASS: lldb-unit :: Utility/./UtilityTests/UriParserTest.BracketedHostnameWithPortIPv4 (1002 of 2141) PASS: lldb-api :: functionalities/thread/concurrent_events/TestConcurrentSignalDelayWatch.py (1003 of 2141) PASS: lldb-shell :: ObjectFile/ELF/gnu-debuglink.yaml (1004 of 2141) PASS: lldb-unit :: Utility/./UtilityTests/EnvironmentTest.EnvpConversion (1005 of 2141) PASS: lldb-unit :: Process/minidump/./LLDBMinidumpTests/RegisterContextMinidump.ConvertMinidumpContext_x86_32 (1006 of 2141) PASS: lldb-api :: functionalities/tsan/global_location/TestTsanGlobalLocation.py (1007 of 2141) PASS: lldb-unit :: Utility/./UtilityTests/StringExtractorTest.GetHexU8_Underflow (1008 of 2141) PASS: lldb-api :: tools/lldb-vscode/stackTrace/TestVSCode_stackTrace.py (1009 of 2141) PASS: lldb-api :: lang/cpp/breakpoint-commands/TestCPPBreakpointCommands.py (1010 of 2141) PASS: lldb-api :: functionalities/thread/concurrent_events/TestConcurrentCrashWithWatchpoint.py (1011 of 2141) PASS: lldb-api :: functionalities/data-formatter/data-formatter-objc/TestDataFormatterObjCNSData.py (1012 of 2141) PASS: lldb-unit :: Target/./TargetTests/ExecutionContextTest.GetByteOrder (1013 of 2141) PASS: lldb-unit :: Utility/./UtilityTests/ConstStringTest.UpdateMangledCounterpart (1014 of 2141) PASS: lldb-unit :: Core/./LLDBCoreTests/ModuleSpecTest.InvalidInMemoryBufferValidFile (1015 of 2141) PASS: lldb-unit :: ObjectFile/MachO/./ObjectFileMachOTests/ObjectFileMachOTest.ModuleFromSharedCacheInfo (1016 of 2141) PASS: lldb-unit :: Utility/./UtilityTests/StreamTest.AddressNoSuffix (1017 of 2141) PASS: lldb-api :: commands/command/script_alias/TestCommandScriptAlias.py (1018 of 2141) PASS: lldb-api :: functionalities/breakpoint/dummy_target_breakpoints/TestBreakpointsWithNoTargets.py (1019 of 2141) UNSUPPORTED: lldb-shell :: ObjectFile/ELF/minidebuginfo-no-lzma.yaml (1020 of 2141) PASS: lldb-shell :: SymbolFile/DWARF/deterministic-build.cpp (1021 of 2141) PASS: lldb-unit :: Utility/./UtilityTests/StringExtractorTest.GetHexBytesAvail_OddPair2 (1022 of 2141) PASS: lldb-unit :: Utility/./UtilityTests/SubsystemRAIITest.SubsystemWithErrorSuccess (1023 of 2141) PASS: lldb-api :: lang/c/local_variables/TestLocalVariables.py (1024 of 2141) PASS: lldb-shell :: Driver/TestError.test (1025 of 2141) PASS: lldb-api :: commands/version/TestVersion.py (1026 of 2141) PASS: lldb-shell :: ScriptInterpreter/Python/sb_address_exception.test (1027 of 2141) PASS: lldb-api :: commands/expression/regression-access-function-template-in-record/TestRegressionAccessFunctionTemplateInRecord.py (1028 of 2141) PASS: lldb-unit :: Utility/./UtilityTests/Flags.AnyClear (1029 of 2141) PASS: lldb-api :: functionalities/thread/exit_during_step/TestExitDuringStep.py (1030 of 2141) PASS: lldb-unit :: Symbol/./SymbolTests/SymbolsTest.LocateExecutableSymbolFileForUnknownExecutableAndMissingSymbolFile (1031 of 2141) PASS: lldb-api :: macosx/safe-to-func-call/TestSafeFuncCalls.py (1032 of 2141) PASS: lldb-unit :: Language/CPlusPlus/./LanguageCPlusPlusTests/CPlusPlusLanguage.CPlusPlusNameParser (1033 of 2141) PASS: lldb-api :: functionalities/data-formatter/hexcaps/TestDataFormatterHexCaps.py (1034 of 2141) PASS: lldb-unit :: Process/gdb-remote/./ProcessGdbRemoteTests/GDBRemoteCommunicationClientTest.SendSignalsToIgnore (1035 of 2141) UNSUPPORTED: lldb-api :: functionalities/data-formatter/data-formatter-stl/libstdcpp/iterator/TestDataFormatterStdIterator.py (1036 of 2141) PASS: lldb-unit :: Language/Highlighting/./HighlighterTests/HighlighterTest.ClangCursorPosBeforeOtherToken (1037 of 2141) PASS: lldb-shell :: SymbolFile/DWARF/DW_AT_location-DW_AT_const_value.s (1038 of 2141) PASS: lldb-unit :: Host/./HostTests/ProcessLaunchInfoTest.Constructor (1039 of 2141) PASS: lldb-api :: macosx/nslog/TestDarwinNSLogOutput.py (1040 of 2141) PASS: lldb-unit :: Process/minidump/./LLDBMinidumpTests/MinidumpParserTest.GetMemoryRegionInfoFromMemoryList (1041 of 2141) PASS: lldb-api :: functionalities/data-formatter/poarray/TestPrintObjectArray.py (1042 of 2141) PASS: lldb-unit :: Utility/./UtilityTests/BinaryStreamTest.PutULEB128SixBytes (1043 of 2141) PASS: lldb-api :: lang/objc/foundation/TestRuntimeTypes.py (1044 of 2141) PASS: lldb-unit :: Utility/./UtilityTests/EventTest.DumpEventDataBytes (1045 of 2141) PASS: lldb-api :: commands/session/history/TestSessionHistory.py (1046 of 2141) UNSUPPORTED: lldb-shell :: SymbolFile/PDB/class-layout.test (1047 of 2141) PASS: lldb-unit :: Expression/./ExpressionTests/CppModuleConfigurationTest.MissingLibCpp (1048 of 2141) PASS: lldb-api :: commands/gui/basic/TestGuiBasic.py (1049 of 2141) PASS: lldb-unit :: Symbol/./SymbolTests/TestTypeSystemClang.TestGetBasicTypeFromName (1050 of 2141) PASS: lldb-api :: lang/c/enum_types/TestEnumTypes.py (1051 of 2141) UNSUPPORTED: lldb-shell :: SymbolFile/PDB/ast-restore.test (1052 of 2141) PASS: lldb-unit :: UnwindAssembly/x86/./UnwindAssemblyx86Tests/Testx86AssemblyInspectionEngine.TestPush0 (1053 of 2141) PASS: lldb-api :: lang/cpp/lambdas/TestLambdas.py (1054 of 2141) PASS: lldb-shell :: Minidump/Windows/arm-fp-unwind.test (1055 of 2141) PASS: lldb-unit :: Utility/./UtilityTests/StructuredDataTest.ParseJSONFromFile (1056 of 2141) PASS: lldb-unit :: Host/./HostTests/SocketTest.TCPGetConnectURI (1057 of 2141) PASS: lldb-api :: lang/c/shared_lib_stripped_symbols/TestSharedLibStrippedSymbols.py (1058 of 2141) PASS: lldb-api :: macosx/profile_vrs_detach/TestDetachVrsProfile.py (1059 of 2141) PASS: lldb-api :: lang/c/forward/TestForwardDeclaration.py (1060 of 2141) PASS: lldb-api :: api/multithreaded/TestMultithreaded.py (1061 of 2141) PASS: lldb-api :: python_api/function_symbol/TestSymbolAPI.py (1062 of 2141) PASS: lldb-shell :: SymbolFile/DWARF/DW_AT_const_value-bitfields.s (1063 of 2141) PASS: lldb-api :: lang/objc/objc-ivar-stripped/TestObjCIvarStripped.py (1064 of 2141) PASS: lldb-unit :: Target/./TargetTests/ModuleCacheTest.GetAndPut (1065 of 2141) PASS: lldb-unit :: ObjectFile/PECOFF/./ObjectFilePECOFFTests/PECallFrameInfoTest.Chained_eh (1066 of 2141) PASS: lldb-api :: functionalities/load_unload/TestLoadUnload.py (1067 of 2141) PASS: lldb-unit :: Utility/./UtilityTests/VASprintfTest.EncodingError (1068 of 2141) PASS: lldb-unit :: Utility/./UtilityTests/StreamTest.PutRawBytesToLittleEndian (1069 of 2141) PASS: lldb-api :: commands/settings/TestSettings.py (1070 of 2141) PASS: lldb-api :: functionalities/tsan/thread_leak/TestTsanThreadLeak.py (1071 of 2141) PASS: lldb-unit :: UnwindAssembly/x86/./UnwindAssemblyx86Tests/Testx86AssemblyInspectionEngine.TestLEAVE (1072 of 2141) PASS: lldb-unit :: UnwindAssembly/x86/./UnwindAssemblyx86Tests/Testx86AssemblyInspectionEngine.TestPushEAX (1073 of 2141) PASS: lldb-api :: types/TestShortTypeExpr.py (1074 of 2141) PASS: lldb-unit :: Utility/./UtilityTests/StringExtractorTest.GetNameColonValueNoColon (1075 of 2141) PASS: lldb-api :: functionalities/gdb_remote_client/TestTargetXMLArch.py (1076 of 2141) PASS: lldb-unit :: Process/minidump/./LLDBMinidumpTests/MinidumpParserTest.GetLinuxProcStatus_no_stream (1077 of 2141) PASS: lldb-unit :: Utility/./UtilityTests/StructuredDataTest.StringDump (1078 of 2141) PASS: lldb-unit :: UnwindAssembly/x86/./UnwindAssemblyx86Tests/Testx86AssemblyInspectionEngine.TestPopESI (1079 of 2141) PASS: lldb-api :: python_api/default-constructor/TestDefaultConstructorForAPIObjects.py (1080 of 2141) PASS: lldb-api :: lang/objc/objc-static-method/TestObjCStaticMethod.py (1081 of 2141) PASS: lldb-shell :: ObjectFile/Breakpad/breakpad-identification.test (1082 of 2141) PASS: lldb-unit :: Utility/./UtilityTests/StringListTest.GetMaxStringLengthMixed (1083 of 2141) PASS: lldb-api :: sample_test/TestSampleInlineTest.py (1084 of 2141) PASS: lldb-unit :: Breakpoint/./LLDBBreakpointTests/BreakpointIDTest.StringIsBreakpointName (1085 of 2141) PASS: lldb-unit :: Utility/./UtilityTests/StringExtractorTest.GetNameColonValueContainsColon (1086 of 2141) PASS: lldb-unit :: Utility/./UtilityTests/BinaryStreamTest.PutULEB128FiveBytes (1087 of 2141) PASS: lldb-unit :: Host/./HostTests/HostInfoTest.GetAugmentedArchSpec (1088 of 2141) PASS: lldb-shell :: Quit/TestQuitExitCodeHex0.test (1089 of 2141) PASS: lldb-api :: lang/objc/modules/TestObjCModules.py (1090 of 2141) PASS: lldb-shell :: SymbolFile/DWARF/debug-types-dwarf5.s (1091 of 2141) PASS: lldb-shell :: SymbolFile/DWARF/debug-types-dwo-cross-reference.cpp (1092 of 2141) UNSUPPORTED: lldb-api :: commands/register/register/intel_xtended_registers/mpx_offset_intersection/TestMPXOffsetIntersection.py (1093 of 2141) PASS: lldb-unit :: Utility/./UtilityTests/ArchSpecTest.MergeFromMachOUnknown (1094 of 2141) PASS: lldb-unit :: Utility/./UtilityTests/RangeTest.ContainsEndInclusiveInvalid (1095 of 2141) PASS: lldb-shell :: ObjectFile/ELF/basic-info.yaml (1096 of 2141) XFAIL: lldb-shell :: Register/x86-mm-xmm-write.test (1097 of 2141) PASS: lldb-api :: functionalities/data-formatter/data-formatter-advanced/TestDataFormatterAdv.py (1098 of 2141) PASS: lldb-shell :: Reproducer/TestVersionCheck.test (1099 of 2141) PASS: lldb-unit :: Language/Highlighting/./HighlighterTests/HighlighterTest.DefaultHighlighterWithCursor (1100 of 2141) PASS: lldb-unit :: Language/Highlighting/./HighlighterTests/HighlighterTest.ClangCursorPos (1101 of 2141) PASS: lldb-unit :: Symbol/./SymbolTests/TestTypeSystemClang.TestGetTypeClassTypeOfExpr (1102 of 2141) PASS: lldb-api :: functionalities/data-formatter/stringprinter/TestStringPrinter.py (1103 of 2141) PASS: lldb-api :: functionalities/postmortem/elf-core/TestLinuxCore.py (1104 of 2141) PASS: lldb-unit :: Process/gdb-remote/./ProcessGdbRemoteTests/GDBRemoteCommunicationClientTest.ReadRegister (1105 of 2141) UNSUPPORTED: lldb-api :: benchmarks/expression/TestExpressionCmd.py (1106 of 2141) PASS: lldb-shell :: Settings/TestLineMarkerColor.test (1107 of 2141) PASS: lldb-api :: functionalities/data-formatter/frameformat_smallstruct/TestFrameFormatSmallStruct.py (1108 of 2141) UNSUPPORTED: lldb-shell :: ScriptInterpreter/Lua/quit.test (1109 of 2141) PASS: lldb-unit :: Utility/./UtilityTests/CompletionRequest.FakeLastArg (1110 of 2141) PASS: lldb-unit :: Utility/./UtilityTests/ArchSpecTest.YAML (1111 of 2141) PASS: lldb-api :: lang/cpp/rvalue-references/TestRvalueReferences.py (1112 of 2141) UNSUPPORTED: lldb-api :: benchmarks/libcxxmap/TestBenchmarkLibcxxMap.py (1113 of 2141) PASS: lldb-api :: functionalities/breakpoint/scripted_bkpt/TestScriptedResolver.py (1114 of 2141) PASS: lldb-unit :: Process/gdb-remote/./ProcessGdbRemoteTests/GDBRemoteCommunicationClientTest.SendStartTracePacket (1115 of 2141) PASS: lldb-api :: functionalities/data-formatter/data-formatter-stl/libcxx/queue/TestDataFormatterLibcxxQueue.py (1116 of 2141) UNSUPPORTED: lldb-shell :: Register/x86-64-zmm-write.test (1117 of 2141) PASS: lldb-unit :: Language/Highlighting/./HighlighterTests/HighlighterTest.ClangCursorPosInOtherToken (1118 of 2141) PASS: lldb-unit :: Process/minidump/./LLDBMinidumpTests/MinidumpParserTest.GetMemoryRegionInfoLinuxMaps (1119 of 2141) PASS: lldb-shell :: SymbolFile/DWARF/debug-names-compressed.cpp (1120 of 2141) PASS: lldb-api :: commands/watchpoints/hello_watchpoint/TestMyFirstWatchpoint.py (1121 of 2141) PASS: lldb-api :: functionalities/inferior-crashing/TestInferiorCrashing.py (1122 of 2141) PASS: lldb-unit :: Utility/./UtilityTests/StringListTest.InsertStringAtIndexMove (1123 of 2141) PASS: lldb-api :: functionalities/memory/cache/TestMemoryCache.py (1124 of 2141) PASS: lldb-api :: tools/lldb-server/TestGdbRemoteThreadsInStopReply.py (1125 of 2141) PASS: lldb-unit :: Utility/./UtilityTests/ProcessInstanceInfo.DumpTable (1126 of 2141) UNSUPPORTED: lldb-api :: commands/watchpoints/variable_out_of_scope/TestWatchedVarHitWhenInScope.py (1127 of 2141) PASS: lldb-api :: commands/expression/import-std-module/list-dbg-info-content/TestDbgInfoContentListFromStdModule.py (1128 of 2141) PASS: lldb-api :: functionalities/breakpoint/move_nearest/TestMoveNearest.py (1129 of 2141) PASS: lldb-api :: lang/c/register_variables/TestRegisterVariables.py (1130 of 2141) PASS: lldb-unit :: Process/minidump/./LLDBMinidumpTests/MinidumpParserTest.GetArchitecture (1131 of 2141) PASS: lldb-api :: functionalities/tail_call_frames/sbapi_support/TestTailCallFrameSBAPI.py (1132 of 2141) PASS: lldb-unit :: Process/gdb-remote/./ProcessGdbRemoteTests/GDBRemoteCommunicationClientTest.SyncThreadState (1133 of 2141) PASS: lldb-shell :: Expr/TestIRMemoryMap.test (1134 of 2141) PASS: lldb-unit :: Utility/./UtilityTests/StatusTest.ErrorCodeConstructor (1135 of 2141) PASS: lldb-unit :: Target/./TargetTests/ExecutionContextTest.GetByteOrderTarget (1136 of 2141) PASS: lldb-shell :: Driver/TestProcessAttach.test (1137 of 2141) PASS: lldb-unit :: Utility/./UtilityTests/GeneratorTest.YamlMultiProvider (1138 of 2141) PASS: lldb-api :: functionalities/data-formatter/summary-string-onfail/Test-rdar-9974002.py (1139 of 2141) PASS: lldb-unit :: Core/./LLDBCoreTests/MangledTest.ResultForBlockInvocation (1140 of 2141) PASS: lldb-api :: linux/builtin_trap/TestBuiltinTrap.py (1141 of 2141) PASS: lldb-api :: macosx/add-dsym/TestAddDsymMidExecutionCommand.py (1142 of 2141) PASS: lldb-unit :: Utility/./UtilityTests/DataExtractorTest.GetCStrAtNullOffset (1143 of 2141) PASS: lldb-shell :: Breakpoint/jitbp_elf.test (1144 of 2141) PASS: lldb-api :: functionalities/data-formatter/setvaluefromcstring/TestSetValueFromCString.py (1145 of 2141) PASS: lldb-shell :: SymbolFile/DWARF/compilercontext.ll (1146 of 2141) PASS: lldb-api :: commands/command/script/import/rdar-12586188/TestRdar12586188.py (1147 of 2141) UNSUPPORTED: lldb-api :: commands/expression/call-restarts/TestCallThatRestarts.py (1148 of 2141) PASS: lldb-unit :: Utility/./UtilityTests/StreamTeeTest.Flush (1149 of 2141) PASS: lldb-unit :: Process/minidump/./LLDBMinidumpTests/MinidumpParserTest.GetThreadsAndGetThreadContext (1150 of 2141) PASS: lldb-unit :: Language/Highlighting/./HighlighterTests/HighlighterTest.ClangComments (1151 of 2141) PASS: lldb-shell :: SymbolFile/DWARF/debug-types-basic.test (1152 of 2141) PASS: lldb-api :: macosx/dyld-trie-symbols/TestDyldTrieSymbols.py (1153 of 2141) UNSUPPORTED: lldb-api :: functionalities/darwin_log/basic/TestDarwinLogBasic.py (1154 of 2141) PASS: lldb-unit :: Utility/./UtilityTests/CompletionRequest.TryCompleteCurrentArgBad (1155 of 2141) PASS: lldb-api :: lang/cpp/breakpoint_in_member_func_w_non_primitive_params/TestBreakpointInMemberFuncWNonPrimitiveParams.py (1156 of 2141) PASS: lldb-unit :: Utility/./UtilityTests/FileSpecTest.IsRelative (1157 of 2141) PASS: lldb-unit :: Thread/./ThreadTests/ThreadTest.GetPrivateStopInfo (1158 of 2141) PASS: lldb-unit :: Host/./HostTests/SocketAddressTest.GetAddressInfo (1159 of 2141) PASS: lldb-unit :: Utility/./UtilityTests/StreamTeeTest.GetStreamAtIndexOutOfBounds (1160 of 2141) PASS: lldb-api :: commands/expression/char/TestExprsChar.py (1161 of 2141) PASS: lldb-unit :: Utility/./UtilityTests/RecordReplayTest.InstrumentedBarPtr (1162 of 2141) PASS: lldb-unit :: Process/gdb-remote/./ProcessGdbRemoteTests/GDBRemoteCommunicationClientTest.WriteRegister (1163 of 2141) PASS: lldb-api :: lang/cpp/bool/TestCPPBool.py (1164 of 2141) PASS: lldb-api :: functionalities/stats_api/TestStatisticsAPI.py (1165 of 2141) PASS: lldb-unit :: Utility/./UtilityTests/RangeTest.DefaultConstructor (1166 of 2141) PASS: lldb-api :: lang/objc/objc-new-syntax/TestObjCNewSyntaxLiteral.py (1167 of 2141) PASS: lldb-unit :: Utility/./UtilityTests/StreamTest.AddressSuffix (1168 of 2141) PASS: lldb-unit :: Utility/./UtilityTests/OptionsWithRawTest.EmptyArgsOnlySuffix (1169 of 2141) PASS: lldb-shell :: ScriptInterpreter/Python/crashlog.test (1170 of 2141) PASS: lldb-unit :: Symbol/./SymbolTests/TestClangASTImporter.CopyDeclTagDecl (1171 of 2141) PASS: lldb-unit :: Host/./HostTests/SocketTest.UDPGetConnectURI (1172 of 2141) PASS: lldb-unit :: UnwindAssembly/x86/./UnwindAssemblyx86Tests/Testx86AssemblyInspectionEngine.TestPopRBP (1173 of 2141) PASS: lldb-api :: functionalities/breakpoint/breakpoint_by_file_colon_line/TestBreakpointByFileColonLine.py (1174 of 2141) UNSUPPORTED: lldb-shell :: Process/Windows/exception_access_violation.cpp (1175 of 2141) PASS: lldb-unit :: UnwindAssembly/x86/./UnwindAssemblyx86Tests/Testx86AssemblyInspectionEngine.TestPushEDX (1176 of 2141) PASS: lldb-unit :: Host/./HostTests/SocketTest.TCPGetAddress (1177 of 2141) PASS: lldb-api :: tools/lldb-vscode/runInTerminal/TestVSCode_runInTerminal.py (1178 of 2141) PASS: lldb-unit :: Host/./HostTests/MainLoopTest.TerminatesImmediately (1179 of 2141) PASS: lldb-api :: lang/cpp/nsimport/TestCppNsImport.py (1180 of 2141) PASS: lldb-unit :: Utility/./UtilityTests/ArgsTest.AppendArguments (1181 of 2141) PASS: lldb-api :: commands/help/TestHelp.py (1182 of 2141) PASS: lldb-api :: lang/objcxx/hide-runtime-values/TestObjCXXHideRuntimeValues.py (1183 of 2141) PASS: lldb-unit :: Language/Highlighting/./HighlighterTests/HighlighterTest.ClangUnterminatedString (1184 of 2141) PASS: lldb-api :: lang/objc/exceptions/TestObjCExceptions.py (1185 of 2141) PASS: lldb-unit :: Host/./HostTests/File.GetWaitableHandleFileno (1186 of 2141) PASS: lldb-unit :: Process/minidump/./LLDBMinidumpTests/MinidumpParserTest.GetMemoryRegionInfo (1187 of 2141) PASS: lldb-unit :: SymbolFile/NativePDB/./SymbolFileNativePDBTests/PDBFPOProgramToDWARFExpressionTests.InvalidAssignmentSingle (1188 of 2141) PASS: lldb-shell :: SymbolFile/DWARF/dir-separator-posix.s (1189 of 2141) PASS: lldb-unit :: Utility/./UtilityTests/ConstStringTest.FromMidOfBufferStringRef (1190 of 2141) PASS: lldb-api :: python_api/objc_type/TestObjCType.py (1191 of 2141) PASS: lldb-unit :: Utility/./UtilityTests/StreamTeeTest.Constructor2Streams (1192 of 2141) UNSUPPORTED: lldb-shell :: ScriptInterpreter/Lua/persistent_state.test (1193 of 2141) PASS: lldb-unit :: Process/minidump/./LLDBMinidumpTests/MinidumpParserTest.GetThreadContext_x86_32_wow64 (1194 of 2141) PASS: lldb-unit :: Utility/./UtilityTests/LogChannelTest.List (1195 of 2141) PASS: lldb-unit :: SymbolFile/NativePDB/./SymbolFileNativePDBTests/PDBFPOProgramToDWARFExpressionTests.DependencyChain (1196 of 2141) PASS: lldb-api :: commands/expression/radar_9673664/TestExprHelpExamples.py (1197 of 2141) PASS: lldb-api :: functionalities/unwind/noreturn/TestNoreturnUnwind.py (1198 of 2141) PASS: lldb-unit :: Utility/./UtilityTests/LogChannelTest.Disable (1199 of 2141) PASS: lldb-api :: functionalities/data-formatter/data-formatter-stl/libcxx/list/loop/TestDataFormatterLibcxxListLoop.py (1200 of 2141) PASS: lldb-api :: commands/expression/test/TestExprs2.py (1201 of 2141) PASS: lldb-api :: lang/objc/foundation/TestObjCMethodsString.py (1202 of 2141) PASS: lldb-api :: functionalities/tsan/thread_numbers/TestTsanThreadNumbers.py (1203 of 2141) PASS: lldb-api :: commands/expression/save_jit_objects/TestSaveJITObjects.py (1204 of 2141) PASS: lldb-api :: tools/lldb-vscode/variables/TestVSCode_variables.py (1205 of 2141) PASS: lldb-api :: commands/expression/persistent_types/TestNestedPersistentTypes.py (1206 of 2141) PASS: lldb-shell :: SymbolFile/DWARF/DW_AT_low_pc-addrx.s (1207 of 2141) PASS: lldb-unit :: Symbol/./SymbolTests/TestTypeSystemClang.TestNotDeletingUserCopyCstrDueToMoveCStr (1208 of 2141) PASS: lldb-unit :: Expression/./ExpressionTests/DiagnosticManagerTest.FixedExpression (1209 of 2141) PASS: lldb-api :: lang/cpp/virtual-functions/TestCppVirtualFunctions.py (1210 of 2141) PASS: lldb-unit :: Utility/./UtilityTests/UriParserTest.TypicalPortPathIPv6 (1211 of 2141) PASS: lldb-api :: python_api/disassemble-raw-data/TestDisassemble_VST1_64.py (1212 of 2141) PASS: lldb-shell :: Commands/command-regex-unalias.test (1213 of 2141) PASS: lldb-shell :: SymbolFile/NativePDB/tag-types.cpp (1214 of 2141) PASS: lldb-api :: commands/expression/persist_objc_pointeetype/TestPersistObjCPointeeType.py (1215 of 2141) PASS: lldb-shell :: SymbolFile/DWARF/debug-types-line-tables.s (1216 of 2141) PASS: lldb-unit :: UnwindAssembly/x86/./UnwindAssemblyx86Tests/Testx86AssemblyInspectionEngine.TestSimplex86_64Augmented (1217 of 2141) PASS: lldb-unit :: Utility/./UtilityTests/ArgsTest.TestArgv (1218 of 2141) PASS: lldb-unit :: Utility/./UtilityTests/StringExtractorTest.GetHexBytesAvail_FullString (1219 of 2141) PASS: lldb-shell :: Settings/TestDisableColor.test (1220 of 2141) PASS: lldb-api :: commands/expression/namespace_local_var_same_name_obj_c/TestNamespaceLocalVarSameNameObjC.py (1221 of 2141) UNSUPPORTED: lldb-api :: functionalities/darwin_log/filter/regex/message/TestDarwinLogFilterRegexMessage.py (1222 of 2141) PASS: lldb-unit :: Symbol/./SymbolTests/Type.CompilerContextPattern (1223 of 2141) PASS: lldb-shell :: Minidump/no-process-id.yaml (1224 of 2141) PASS: lldb-api :: lang/c/unicode/TestUnicodeSymbols.py (1225 of 2141) PASS: lldb-unit :: Process/gdb-remote/./ProcessGdbRemoteTests/GDBRemoteClientBaseTest.SendContinueDelegateInterface (1226 of 2141) UNSUPPORTED: lldb-api :: functionalities/darwin_log/filter/regex/activity/TestDarwinLogFilterRegexActivity.py (1227 of 2141) PASS: lldb-api :: lang/cpp/bitfields/TestCppBitfields.py (1228 of 2141) PASS: lldb-api :: functionalities/gdb_remote_client/TestThreadSelectionBug.py (1229 of 2141) PASS: lldb-api :: iohandler/resize/TestIOHandlerResize.py (1230 of 2141) PASS: lldb-unit :: Expression/./ExpressionTests/DiagnosticManagerTest.GetStringMultiline (1231 of 2141) PASS: lldb-api :: functionalities/gdb_remote_client/TestRestartBug.py (1232 of 2141) PASS: lldb-unit :: Utility/./UtilityTests/ScalarTest.GetValue (1233 of 2141) PASS: lldb-unit :: Utility/./UtilityTests/StatusTest.Formatv (1234 of 2141) PASS: lldb-unit :: ObjectFile/Breakpad/./ObjectFileBreakpadTests/StackCFIRecord.parse (1235 of 2141) PASS: lldb-unit :: Utility/./UtilityTests/StringListTest.AppendStringMove (1236 of 2141) PASS: lldb-unit :: Process/minidump/./LLDBMinidumpTests/MinidumpParserTest.GetExceptionStream (1237 of 2141) PASS: lldb-api :: lang/objc/forward-decl/TestForwardDecl.py (1238 of 2141) PASS: lldb-shell :: SymbolFile/NativePDB/source-list.cpp (1239 of 2141) PASS: lldb-unit :: DataFormatter/./LLDBFormatterTests/TypeMatcherTests.RegexName (1240 of 2141) PASS: lldb-unit :: UnwindAssembly/x86/./UnwindAssemblyx86Tests/Testx86AssemblyInspectionEngine.TestAddRSP (1241 of 2141) PASS: lldb-unit :: ScriptInterpreter/Python/./ScriptInterpreterPythonTests/PythonDataObjectsTest.TestPythonListValueEquality (1242 of 2141) PASS: lldb-api :: functionalities/asan/TestMemoryHistory.py (1243 of 2141) PASS: lldb-api :: python_api/thread/TestThreadAPI.py (1244 of 2141) PASS: lldb-unit :: Expression/./ExpressionTests/DiagnosticManagerTest.GetStringPreserveOrder (1245 of 2141) PASS: lldb-unit :: Utility/./UtilityTests/ArgsTest.ReplaceArgumentAtIndexEqual (1246 of 2141) PASS: lldb-unit :: UnwindAssembly/x86/./UnwindAssemblyx86Tests/Testx86AssemblyInspectionEngine.TestPushRBX (1247 of 2141) PASS: lldb-unit :: Utility/./UtilityTests/VASprintfTest.NoBufferResize (1248 of 2141) PASS: lldb-api :: lang/c/vla/TestVLA.py (1249 of 2141) PASS: lldb-unit :: Utility/./UtilityTests/Flags.Reset (1250 of 2141) PASS: lldb-api :: functionalities/gdb_remote_client/TestNestedRegDefinitions.py (1251 of 2141) PASS: lldb-unit :: Target/./TargetTests/PathMappingListTest.RemapRoot (1252 of 2141) PASS: lldb-unit :: Utility/./UtilityTests/StringListTest.InsertStringAtIndexStart (1253 of 2141) PASS: lldb-api :: functionalities/thread/concurrent_events/TestConcurrentSignalWatchBreak.py (1254 of 2141) PASS: lldb-api :: lang/objc/real-definition/TestRealDefinition.py (1255 of 2141) PASS: lldb-api :: commands/expression/vector_of_enums/TestVectorOfEnums.py (1256 of 2141) PASS: lldb-shell :: SymbolFile/DWARF/debug_loclists-dwo.s (1257 of 2141) PASS: lldb-api :: lang/objc/objc-runtime-ivars/TestRuntimeIvars.py (1258 of 2141) PASS: lldb-api :: lang/c/stepping/TestThreadStepping.py (1259 of 2141) PASS: lldb-api :: functionalities/abbreviation/TestAbbreviations.py (1260 of 2141) PASS: lldb-unit :: Utility/./UtilityTests/StringListTest.LongestCommonPrefixEmpty (1261 of 2141) PASS: lldb-shell :: SymbolFile/Breakpad/stack-cfi-arm.yaml (1262 of 2141) PASS: lldb-api :: functionalities/inline-stepping/TestInlineStepping.py (1263 of 2141) PASS: lldb-unit :: Utility/./UtilityTests/RangeTest.ClearWithStarAddress (1264 of 2141) PASS: lldb-unit :: Symbol/./SymbolTests/PostfixExpression.ToDWARF (1265 of 2141) PASS: lldb-unit :: ScriptInterpreter/Python/./ScriptInterpreterPythonTests/PythonDataObjectsTest.TestPythonCallableCheck (1266 of 2141) PASS: lldb-api :: lang/cpp/template-function/TestTemplateFunctions.py (1267 of 2141) PASS: lldb-api :: functionalities/breakpoint/breakpoint_names/TestBreakpointNames.py (1268 of 2141) PASS: lldb-unit :: Process/gdb-remote/./ProcessGdbRemoteTests/GDBRemoteClientBaseTest.SendContinueAndLateInterrupt (1269 of 2141) PASS: lldb-api :: functionalities/multidebugger_commands/TestMultipleDebuggersCommands.py (1270 of 2141) PASS: lldb-api :: tools/lldb-server/TestGdbRemoteProcessInfo.py (1271 of 2141) UNSUPPORTED: lldb-shell :: Breakpoint/case-insensitive.test (1272 of 2141) PASS: lldb-api :: commands/expression/radar_9531204/TestPrintfAfterUp.py (1273 of 2141) PASS: lldb-unit :: Host/./HostTests/NativeProcessProtocolTest.SetBreakpointFailRead (1274 of 2141) PASS: lldb-api :: lang/c/const_variables/TestConstVariables.py (1275 of 2141) PASS: lldb-unit :: Host/./HostTests/HostInfoTest.GetHostname (1276 of 2141) PASS: lldb-unit :: Utility/./UtilityTests/ScalarTest.Getters (1277 of 2141) PASS: lldb-shell :: SymbolFile/DWARF/find-inline-method.s (1278 of 2141) PASS: lldb-unit :: Utility/./UtilityTests/Flags.Test (1279 of 2141) PASS: lldb-api :: lang/objc/objc-optimized/TestObjcOptimized.py (1280 of 2141) PASS: lldb-api :: functionalities/data-formatter/data-formatter-stl/libcxx/function/TestLibCxxFunction.py (1281 of 2141) PASS: lldb-unit :: UnwindAssembly/x86/./UnwindAssemblyx86Tests/Testx86AssemblyInspectionEngine.TestPopEBX (1282 of 2141) PASS: lldb-api :: commands/expression/dont_allow_jit/TestAllowJIT.py (1283 of 2141) PASS: lldb-unit :: Symbol/./SymbolTests/TestTypeSystemClang.TestGetTypeClassNested (1284 of 2141) PASS: lldb-shell :: ObjectFile/ELF/aarch64-relocations.yaml (1285 of 2141) PASS: lldb-api :: functionalities/breakpoint/breakpoint_command/TestRegexpBreakCommand.py (1286 of 2141) PASS: lldb-unit :: Process/gdb-remote/./ProcessGdbRemoteTests/GDBRemoteCommunicationServerTest.SendErrorResponse_StringError (1287 of 2141) XFAIL: lldb-shell :: Unwind/prefer-debug-over-eh-frame.test (1288 of 2141) PASS: lldb-unit :: Utility/./UtilityTests/UUIDTest.Validity (1289 of 2141) PASS: lldb-api :: functionalities/data-formatter/data-formatter-globals/TestDataFormatterGlobals.py (1290 of 2141) PASS: lldb-shell :: Unwind/trap_frame_sym_ctx.test (1291 of 2141) PASS: lldb-unit :: Symbol/./SymbolTests/TestTypeSystemClang.TestGetEnumIntegerTypeInvalid (1292 of 2141) PASS: lldb-shell :: Driver/TestCore.test (1293 of 2141) PASS: lldb-unit :: Interpreter/./InterpreterTests/CompletionTest.FileCompletionAbsolute (1294 of 2141) PASS: lldb-unit :: Language/Highlighting/./HighlighterTests/HighlighterTest.FallbackHighlighter (1295 of 2141) PASS: lldb-unit :: Symbol/./SymbolTests/LineEntryTest.GetSameLineContiguousAddressRangeNoInlines (1296 of 2141) PASS: lldb-unit :: Utility/./UtilityTests/FileSpecTest.Yaml (1297 of 2141) PASS: lldb-unit :: Host/./HostTests/Host.GetEnvironment (1298 of 2141) PASS: lldb-api :: commands/expression/persistent_types/TestPersistentTypes.py (1299 of 2141) PASS: lldb-api :: functionalities/data-formatter/data-formatter-named-summaries/TestDataFormatterNamedSummaries.py (1300 of 2141) PASS: lldb-shell :: Register/x86-64-gp-read.test (1301 of 2141) PASS: lldb-unit :: Utility/./UtilityTests/StreamTest.PutBytesAsRawHex8ToLittleEndian (1302 of 2141) UNSUPPORTED: lldb-shell :: SymbolFile/NativePDB/ast-functions-msvc.cpp (1303 of 2141) UNSUPPORTED: lldb-shell :: SymbolFile/PDB/func-symbols.test (1304 of 2141) PASS: lldb-unit :: DataFormatter/./LLDBFormatterTests/TypeMatcherTests.GetMatchStringRegex (1305 of 2141) PASS: lldb-api :: python_api/hello_world/TestHelloWorld.py (1306 of 2141) PASS: lldb-unit :: Utility/./UtilityTests/StringExtractorTest.GetU32BigEndian (1307 of 2141) PASS: lldb-api :: lang/cpp/function_refs/TestFunctionRefs.py (1308 of 2141) PASS: lldb-shell :: Commands/command-disassemble.s (1309 of 2141) PASS: lldb-api :: lang/cpp/stl/TestStdCXXDisassembly.py (1310 of 2141) PASS: lldb-api :: commands/target/stop-hook/delete/TestTargetStopHookDelete.py (1311 of 2141) PASS: lldb-unit :: Utility/./UtilityTests/StreamTest.PutHex64ByteOrderBig (1312 of 2141) PASS: lldb-unit :: Utility/./UtilityTests/StringListTest.Join (1313 of 2141) PASS: lldb-unit :: Utility/./UtilityTests/AnsiTerminal.Incomplete (1314 of 2141) UNSUPPORTED: lldb-shell :: Register/x86-zmm-write.test (1315 of 2141) PASS: lldb-unit :: UnwindAssembly/x86/./UnwindAssemblyx86Tests/Testx86AssemblyInspectionEngine.TestPushRBP (1316 of 2141) PASS: lldb-unit :: debugserver/./debugserverTests/RNBSocket.LoopBackConnectIPv4 (1317 of 2141) PASS: lldb-api :: functionalities/postmortem/mach-core/TestMachCore.py (1318 of 2141) PASS: lldb-unit :: Utility/./UtilityTests/ConstStringTest.format_provider (1319 of 2141) PASS: lldb-unit :: Process/minidump/./LLDBMinidumpTests/MinidumpParserTest.GetThreadContext_x86_32 (1320 of 2141) PASS: lldb-unit :: Utility/./UtilityTests/UriParserTest.Minimal (1321 of 2141) PASS: lldb-api :: functionalities/type_lookup/TestTypeLookup.py (1322 of 2141) PASS: lldb-api :: functionalities/data-formatter/synthcapping/TestSyntheticCapping.py (1323 of 2141) PASS: lldb-api :: python_api/lldbutil/process/TestPrintStackTraces.py (1324 of 2141) PASS: lldb-api :: commands/gui/viewlarge/TestGuiViewLarge.py (1325 of 2141) PASS: lldb-shell :: ObjectFile/PECOFF/uuid.yaml (1326 of 2141) PASS: lldb-unit :: tools/lldb-server/tests/./LLDBServerTests/TestBase.LaunchModePreservesEnvironment (1327 of 2141) PASS: lldb-api :: functionalities/data-formatter/data-formatter-stl/libcxx/forward_list/TestDataFormatterLibcxxForwardList.py (1328 of 2141) PASS: lldb-unit :: Utility/./UtilityTests/StringListTest.GetMaxStringLengthIncreasingSize (1329 of 2141) PASS: lldb-api :: functionalities/breakpoint/serialize/TestBreakpointSerialization.py (1330 of 2141) PASS: lldb-unit :: ScriptInterpreter/Python/./ScriptInterpreterPythonTests/PythonDataObjectsTest.TestPythonInteger (1331 of 2141) PASS: lldb-api :: commands/expression/no-deadlock/TestExprDoesntBlock.py (1332 of 2141) PASS: lldb-api :: lang/c/complex_int/TestComplexInt.py (1333 of 2141) PASS: lldb-shell :: BuildScript/toolchain-clang.test (1334 of 2141) PASS: lldb-unit :: UnwindAssembly/x86/./UnwindAssemblyx86Tests/Testx86AssemblyInspectionEngine.TestSimple32bitFrameFunction (1335 of 2141) PASS: lldb-api :: commands/process/launch/TestProcessLaunch.py (1336 of 2141) PASS: lldb-unit :: Utility/./UtilityTests/VASprintfTest.BufferResize (1337 of 2141) PASS: lldb-unit :: Utility/./UtilityTests/ProcessInstanceInfo.Dump (1338 of 2141) PASS: lldb-unit :: Utility/./UtilityTests/ScalarTest.SetValueFromData (1339 of 2141) PASS: lldb-unit :: Process/minidump/./LLDBMinidumpTests/MinidumpParserTest.GetMiscInfoWindows (1340 of 2141) PASS: lldb-shell :: SymbolFile/DWARF/debug_rnglists.s (1341 of 2141) PASS: lldb-api :: functionalities/thread/concurrent_events/TestConcurrentSignalWatch.py (1342 of 2141) PASS: lldb-api :: python_api/process/read-mem-cstring/TestReadMemCString.py (1343 of 2141) PASS: lldb-unit :: Utility/./UtilityTests/StringExtractorTest.DecodeHexU8_Exact (1344 of 2141) PASS: lldb-api :: functionalities/tail_call_frames/disambiguate_call_site/TestDisambiguateCallSite.py (1345 of 2141) PASS: lldb-api :: macosx/save_crashlog/TestSaveCrashlog.py (1346 of 2141) PASS: lldb-unit :: Process/minidump/./LLDBMinidumpTests/MinidumpParserTest.FindMemoryRangeWithFullMemoryMinidump (1347 of 2141) PASS: lldb-unit :: Utility/./UtilityTests/Predicate.WaitForValueNotEqualTo (1348 of 2141) PASS: lldb-unit :: Symbol/./SymbolTests/DWARFCallFrameInfoTest.Basic_dwarf4 (1349 of 2141) PASS: lldb-unit :: SymbolFile/NativePDB/./SymbolFileNativePDBTests/PDBFPOProgramToDWARFExpressionTests.MissingTargetRegister (1350 of 2141) PASS: lldb-unit :: Utility/./UtilityTests/ScalarTest.GetBytes (1351 of 2141) PASS: lldb-shell :: ObjectFile/PECOFF/export-dllfunc.yaml (1352 of 2141) UNSUPPORTED: lldb-api :: functionalities/data-formatter/data-formatter-stl/libstdcpp/list/TestDataFormatterStdList.py (1353 of 2141) PASS: lldb-unit :: ObjectFile/Breakpad/./ObjectFileBreakpadTests/ModuleRecord.parse (1354 of 2141) PASS: lldb-api :: commands/watchpoints/watchpoint_events/TestWatchpointEvents.py (1355 of 2141) PASS: lldb-unit :: Utility/./UtilityTests/NameMatchesTest.EndsWith (1356 of 2141) UNSUPPORTED: lldb-shell :: ScriptInterpreter/Lua/convenience_variables.test (1357 of 2141) PASS: lldb-unit :: ScriptInterpreter/Python/./ScriptInterpreterPythonTests/PythonDataObjectsTest.TestPythonDictionaryManipulation (1358 of 2141) PASS: lldb-unit :: Process/gdb-remote/./ProcessGdbRemoteTests/GDBRemoteClientBaseTest.SendContinueAndInterrupt (1359 of 2141) PASS: lldb-shell :: SymbolFile/Breakpad/unwind-via-raSearch.test (1360 of 2141) PASS: lldb-unit :: Utility/./UtilityTests/ArchSpecTest.MergeFrom (1361 of 2141) PASS: lldb-api :: functionalities/postmortem/elf-core/thread_crash/TestLinuxCoreThreads.py (1362 of 2141) PASS: lldb-api :: lang/c/complex/TestComplexC99.py (1363 of 2141) UNSUPPORTED: lldb-api :: functionalities/darwin_log/filter/exact_match/subsystem/TestDarwinLogFilterMatchSubsystem.py (1364 of 2141) PASS: lldb-unit :: Utility/./UtilityTests/OptionsWithRawTest.LeadingSpaceArgs (1365 of 2141) PASS: lldb-unit :: Process/minidump/./LLDBMinidumpTests/MinidumpParserTest.GetMemoryRegionInfoFromMemory64List (1366 of 2141) PASS: lldb-api :: commands/frame/diagnose/inheritance/TestDiagnoseInheritance.py (1367 of 2141) PASS: lldb-unit :: Utility/./UtilityTests/ScalarTest.Promotion (1368 of 2141) UNSUPPORTED: lldb-api :: android/platform/TestDefaultCacheLineSize.py (1369 of 2141) PASS: lldb-unit :: ScriptInterpreter/Python/./ScriptInterpreterPythonTests/PythonDataObjectsTest.TestExceptions (1370 of 2141) PASS: lldb-shell :: ObjectFile/Breakpad/uuid-matching-mac.test (1371 of 2141) PASS: lldb-shell :: SymbolFile/NativePDB/function-types-classes.cpp (1372 of 2141) PASS: lldb-api :: commands/apropos/with-process/TestAproposWithProcess.py (1373 of 2141) PASS: lldb-shell :: Reproducer/TestDSYM.test (1374 of 2141) PASS: lldb-unit :: Utility/./UtilityTests/UriParserTest.LongPath (1375 of 2141) UNSUPPORTED: lldb-api :: functionalities/darwin_log/filter/regex/subsystem/TestDarwinLogFilterRegexSubsystem.py (1376 of 2141) PASS: lldb-api :: commands/target/select/TestTargetSelect.py (1377 of 2141) PASS: lldb-api :: functionalities/data-formatter/language_category_updates/TestDataFormatterLanguageCategoryUpdates.py (1378 of 2141) PASS: lldb-api :: commands/expression/inline-namespace/TestInlineNamespace.py (1379 of 2141) UNSUPPORTED: lldb-shell :: SymbolFile/DWARF/DW_TAG_GNU_call_site-DW_AT_low_pc.s (1380 of 2141) PASS: lldb-shell :: SymbolFile/DWARF/gnu-style-compression.cpp (1381 of 2141) PASS: lldb-unit :: Utility/./UtilityTests/StreamTest.PutCStringWithStringRef (1382 of 2141) PASS: lldb-unit :: Process/./ProcessEventDataTests/ProcessEventDataTest.DoOnRemoval (1383 of 2141) UNSUPPORTED: lldb-shell :: Watchpoint/netbsd-nouserdbregs.test (1384 of 2141) PASS: lldb-api :: functionalities/thread/state_after_expression/TestStateAfterExpression.py (1385 of 2141) PASS: lldb-api :: functionalities/target-new-solib-notifications/TestModuleLoadedNotifys.py (1386 of 2141) PASS: lldb-api :: functionalities/memory-region/TestMemoryRegion.py (1387 of 2141) PASS: lldb-api :: macosx/find-dsym/bundle-with-dot-in-filename/TestBundleWithDotInFilename.py (1388 of 2141) PASS: lldb-unit :: Host/./HostTests/MainLoopTest.ReadObject (1389 of 2141) PASS: lldb-unit :: Expression/./ExpressionTests/CppModuleConfigurationTest.UnknownLibCppFile (1390 of 2141) PASS: lldb-api :: commands/expression/import-std-module/forward_decl_from_module/TestForwardDeclFromStdModule.py (1391 of 2141) PASS: lldb-api :: commands/expression/options/TestExprOptions.py (1392 of 2141) PASS: lldb-unit :: Utility/./UtilityTests/BinaryStreamTest.PutSLEB128SixBytes (1393 of 2141) PASS: lldb-unit :: ScriptInterpreter/Python/./ScriptInterpreterPythonTests/PythonDataObjectsTest.TestPythonIntegerToStructuredInteger (1394 of 2141) PASS: lldb-unit :: Utility/./UtilityTests/StringExtractorTest.GetNameColonValueSuccess (1395 of 2141) PASS: lldb-api :: tools/lldb-server/TestGdbRemoteSingleStep.py (1396 of 2141) PASS: lldb-unit :: Utility/./UtilityTests/RangeTest.NotEqualInvalid (1397 of 2141) PASS: lldb-api :: functionalities/dlopen_other_executable/TestDlopenOtherExecutable.py (1398 of 2141) UNSUPPORTED: lldb-api :: linux/sepdebugsymlink/TestTargetSymbolsSepDebugSymlink.py (1399 of 2141) PASS: lldb-unit :: Platform/./LLDBPlatformTests/PlatformAppleSimulatorTest.TestSimHasSimEnvionament (1400 of 2141) PASS: lldb-unit :: SymbolFile/NativePDB/./SymbolFileNativePDBTests/PDBFPOProgramToDWARFExpressionTests.InvalidOpBinary (1401 of 2141) PASS: lldb-shell :: ObjectFile/Breakpad/sections-trailing-func.test (1402 of 2141) PASS: lldb-unit :: UnwindAssembly/x86/./UnwindAssemblyx86Tests/Testx86AssemblyInspectionEngine.TestPushR15 (1403 of 2141) PASS: lldb-api :: lang/cpp/operators/TestCppOperators.py (1404 of 2141) PASS: lldb-shell :: SymbolFile/DWARF/find-variable-dwo.cpp (1405 of 2141) PASS: lldb-shell :: ObjectFile/Breakpad/discontiguous-sections.test (1406 of 2141) PASS: lldb-shell :: SymbolFile/DWARF/DW_TAG_variable-invalid_location.s (1407 of 2141) PASS: lldb-api :: lang/cpp/exceptions/TestCPPExceptionBreakpoints.py (1408 of 2141) PASS: lldb-api :: python_api/file_handle/TestFileHandle.py (1409 of 2141) PASS: lldb-api :: tools/lldb-server/TestLldbGdbServer.py (1410 of 2141) UNSUPPORTED: lldb-shell :: SymbolFile/DWARF/debug-types-expressions.test (1411 of 2141) PASS: lldb-unit :: UnwindAssembly/x86/./UnwindAssemblyx86Tests/Testx86AssemblyInspectionEngine.TestPopRBX (1412 of 2141) PASS: lldb-api :: functionalities/data-formatter/data-formatter-objc/TestDataFormatterObjCExpr.py (1413 of 2141) PASS: lldb-shell :: SymbolFile/DWARF/debug_loc_and_loclists.s (1414 of 2141) PASS: lldb-unit :: Utility/./UtilityTests/FileSpecTest.Match (1415 of 2141) PASS: lldb-api :: commands/expression/persistent_ptr_update/TestPersistentPtrUpdate.py (1416 of 2141) PASS: lldb-unit :: Utility/./UtilityTests/StringExtractorTest.GetHexU8_InvalidHex_NoEof (1417 of 2141) PASS: lldb-unit :: SymbolFile/NativePDB/./SymbolFileNativePDBTests/PDBFPOProgramToDWARFExpressionTests.UnresolvedRegisterAssignmentReference (1418 of 2141) PASS: lldb-unit :: ScriptInterpreter/Python/./ScriptInterpreterPythonTests/PythonDataObjectsTest.TestPythonIntegerToStr (1419 of 2141) PASS: lldb-api :: lang/cpp/symbols/TestSymbols.py (1420 of 2141) PASS: lldb-api :: commands/expression/codegen-crash-typedefdecl-not-in_declcontext/TestCodegenCrashTypedefDeclNotInDeclContext.py (1421 of 2141) PASS: lldb-unit :: Process/gdb-remote/./ProcessGdbRemoteTests/GDBRemoteCommunicationClientTest.GetQOffsets (1422 of 2141) PASS: lldb-api :: commands/expression/import-std-module/unique_ptr-dbg-info-content/TestUniquePtrDbgInfoContent.py (1423 of 2141) PASS: lldb-api :: functionalities/set-data/TestSetData.py (1424 of 2141) PASS: lldb-api :: lang/cpp/static_methods/TestCPPStaticMethods.py (1425 of 2141) PASS: lldb-unit :: Process/gdb-remote/./ProcessGdbRemoteTests/GDBRemoteCommunicationServerTest.SendErrorResponse_ErrorList (1426 of 2141) PASS: lldb-shell :: Driver/TestHelp.test (1427 of 2141) PASS: lldb-api :: lang/cpp/extern_c/TestExternCSymbols.py (1428 of 2141) PASS: lldb-shell :: SymbolFile/DWARF/find-variable-file.cpp (1429 of 2141) PASS: lldb-api :: functionalities/abbreviation/TestCommonShortSpellings.py (1430 of 2141) PASS: lldb-shell :: Driver/TestFile.test (1431 of 2141) PASS: lldb-unit :: Utility/./UtilityTests/ArgsTest.ReplaceArgumentAtIndexFarOutOfRange (1432 of 2141) PASS: lldb-api :: commands/process/attach-resume/TestAttachResume.py (1433 of 2141) PASS: lldb-unit :: Expression/./ExpressionTests/DiagnosticManagerTest.PutStringSeverities (1434 of 2141) PASS: lldb-unit :: Utility/./UtilityTests/OptionsWithRawTest.EmptySuffixSingleWhitespace (1435 of 2141) PASS: lldb-api :: commands/expression/argument_passing_restrictions/TestArgumentPassingRestrictions.py (1436 of 2141) PASS: lldb-unit :: Host/./HostTests/HostInfoTest.GetXcodeSDK (1437 of 2141) PASS: lldb-unit :: Utility/./UtilityTests/ListenerTest.GetEventWait (1438 of 2141) PASS: lldb-api :: python_api/section/TestSectionAPI.py (1439 of 2141) PASS: lldb-unit :: Utility/./UtilityTests/BinaryStreamTest.PutSLEB128NineBytes (1440 of 2141) PASS: lldb-api :: lang/c/step_over_no_deadlock/TestStepOverDoesntBlock.py (1441 of 2141) PASS: lldb-unit :: ScriptInterpreter/Python/./ScriptInterpreterPythonTests/PythonDataObjectsTest.TestPythonStringToStructuredString (1442 of 2141) UNSUPPORTED: lldb-api :: lang/cpp/function-template-parameter-pack/TestFunctionTemplateParameterPack.py (1443 of 2141) PASS: lldb-shell :: Driver/TestCommands.test (1444 of 2141) PASS: lldb-shell :: Reproducer/TestPythonImport.test (1445 of 2141) UNSUPPORTED: lldb-api :: benchmarks/continue/TestBenchmarkContinue.py (1446 of 2141) PASS: lldb-unit :: Utility/./UtilityTests/StringListTest.LongestCommonPrefix (1447 of 2141) PASS: lldb-unit :: SymbolFile/DWARF/./SymbolFileDWARFTests/SymbolFileDWARFTests.TestAbilitiesForDWARF (1448 of 2141) PASS: lldb-unit :: ObjectFile/ELF/./ObjectFileELFTests/ObjectFileELFTest.SectionsResolveConsistently (1449 of 2141) PASS: lldb-unit :: UnwindAssembly/x86/./UnwindAssemblyx86Tests/Testx86AssemblyInspectionEngine.TestCALLNextInsn (1450 of 2141) PASS: lldb-unit :: UnwindAssembly/x86/./UnwindAssemblyx86Tests/Testx86AssemblyInspectionEngine.TestSimple64bitFrameFunction (1451 of 2141) PASS: lldb-unit :: Utility/./UtilityTests/StringLexerTest.GetUnlexed (1452 of 2141) PASS: lldb-unit :: Utility/./UtilityTests/StringExtractorTest.DecodeHexU8_Underflow2 (1453 of 2141) PASS: lldb-unit :: Utility/./UtilityTests/RangeDataVector.CustomSort (1454 of 2141) PASS: lldb-api :: lang/objc/modules-hash-mismatch/TestClangModulesHashMismatch.py (1455 of 2141) PASS: lldb-shell :: SymbolFile/DWARF/DW_AT_const_value.s (1456 of 2141) UNSUPPORTED: lldb-api :: functionalities/darwin_log/format/TestDarwinLogMessageFormat.py (1457 of 2141) PASS: lldb-api :: commands/watchpoints/watchpoint_disable/TestWatchpointDisable.py (1458 of 2141) PASS: lldb-shell :: SymbolFile/DWARF/debug-types-signature-loop.s (1459 of 2141) PASS: lldb-api :: functionalities/data-formatter/data-formatter-synthval/TestDataFormatterSynthVal.py (1460 of 2141) PASS: lldb-api :: lang/cpp/accelerator-table/TestCPPAccelerator.py (1461 of 2141) PASS: lldb-unit :: Utility/./UtilityTests/ArgsTest.TestSingleArg (1462 of 2141) PASS: lldb-unit :: Utility/./UtilityTests/ArgsTest.ReplaceArgumentAtIndexOutOfRange (1463 of 2141) PASS: lldb-unit :: Utility/./UtilityTests/StringExtractorTest.GetHexBytes_FullString (1464 of 2141) PASS: lldb-unit :: Target/./TargetTests/MemoryRegionInfoTest.Formatv (1465 of 2141) PASS: lldb-unit :: Core/./LLDBCoreTests/ModuleSpecTest.TestCOFFFile (1466 of 2141) PASS: lldb-unit :: Host/./HostTests/FileSystemTest.GetByteSize (1467 of 2141) PASS: lldb-unit :: Utility/./UtilityTests/StreamTeeTest.AppendStream (1468 of 2141) PASS: lldb-unit :: ScriptInterpreter/Python/./ScriptInterpreterPythonTests/PythonDataObjectsTest.TestDictionaryResolutionWithDot (1469 of 2141) PASS: lldb-unit :: Symbol/./SymbolTests/SymbolsTest.TerminateLocateExecutableSymbolFileForUnknownExecutableAndUnknownSymbolFile (1470 of 2141) PASS: lldb-api :: commands/settings/use_source_cache/TestUseSourceCache.py (1471 of 2141) PASS: lldb-api :: functionalities/data-formatter/format-propagation/TestFormatPropagation.py (1472 of 2141) PASS: lldb-shell :: Driver/TestRepl.test (1473 of 2141) PASS: lldb-api :: python_api/function_symbol/TestDisasmAPI.py (1474 of 2141) PASS: lldb-api :: functionalities/thread/concurrent_events/TestConcurrentTwoBreakpointThreads.py (1475 of 2141) PASS: lldb-unit :: Symbol/./SymbolTests/TestTypeSystemClang.TestRemoveFastQualifiers (1476 of 2141) PASS: lldb-unit :: Utility/./UtilityTests/StringLexerTest.NextIf (1477 of 2141) PASS: lldb-unit :: Host/./HostTests/MainLoopTest.Signal (1478 of 2141) PASS: lldb-shell :: ObjectFile/wasm/unified-debug-sections.yaml (1479 of 2141) PASS: lldb-unit :: Utility/./UtilityTests/VMRange.SetEndAddress (1480 of 2141) PASS: lldb-api :: functionalities/tail_call_frames/disambiguate_tail_call_seq/TestDisambiguateTailCallSeq.py (1481 of 2141) PASS: lldb-api :: lang/cpp/global_operators/TestCppGlobalOperators.py (1482 of 2141) PASS: lldb-unit :: Utility/./UtilityTests/SerializationRountripTest.SerializeDeserializeObjectPointer (1483 of 2141) UNSUPPORTED: lldb-shell :: ScriptInterpreter/Lua/io.test (1484 of 2141) UNSUPPORTED: lldb-api :: functionalities/unwind/ehframe/TestEhFrameUnwind.py (1485 of 2141) PASS: lldb-unit :: Platform/./LLDBPlatformTests/PlatformAppleSimulatorTest.TestHostPlatformToSim (1486 of 2141) PASS: lldb-api :: python_api/sbvalue_persist/TestSBValuePersist.py (1487 of 2141) PASS: lldb-api :: python_api/watchpoint/TestWatchpointIter.py (1488 of 2141) PASS: lldb-api :: commands/session/save/TestSessionSave.py (1489 of 2141) PASS: lldb-api :: commands/expression/result_numbering/TestResultNumbering.py (1490 of 2141) PASS: lldb-unit :: Utility/./UtilityTests/StreamTest.AddressSize (1491 of 2141) PASS: lldb-unit :: Utility/./UtilityTests/StringExtractorTest.InitEmpty (1492 of 2141) PASS: lldb-unit :: Utility/./UtilityTests/CompletionRequest.ShiftArguments (1493 of 2141) PASS: lldb-unit :: Process/gdb-remote/./ProcessGdbRemoteTests/GDBRemoteCommunicationClientTest.GetMemoryRegionInfo (1494 of 2141) UNSUPPORTED: lldb-api :: functionalities/thread/break_after_join/TestBreakAfterJoin.py (1495 of 2141) PASS: lldb-api :: commands/command/script/TestCommandScript.py (1496 of 2141) PASS: lldb-api :: commands/disassemble/basic/TestFrameDisassemble.py (1497 of 2141) PASS: lldb-api :: python_api/value/change_values/TestChangeValueAPI.py (1498 of 2141) PASS: lldb-shell :: SymbolFile/DWARF/find-basic-variable.cpp (1499 of 2141) PASS: lldb-unit :: Symbol/./SymbolTests/PostfixExpression.ParseFPOProgram (1500 of 2141) PASS: lldb-api :: lang/cpp/frame-var-anon-unions/TestFrameVariableAnonymousUnions.py (1501 of 2141) PASS: lldb-shell :: SymbolFile/Breakpad/symtab-macho.test (1502 of 2141) PASS: lldb-unit :: Process/gdb-remote/./ProcessGdbRemoteTests/GDBRemoteCommunicationTest.ReadPacket_checksum (1503 of 2141) PASS: lldb-unit :: UnwindAssembly/x86/./UnwindAssemblyx86Tests/Testx86AssemblyInspectionEngine.TestSpillRegToStackViaMOVi386 (1504 of 2141) PASS: lldb-unit :: Process/minidump/./LLDBMinidumpTests/MinidumpParserTest.MinidumpDuplicateModuleMappedSecond (1505 of 2141) PASS: lldb-unit :: Utility/./UtilityTests/VMRange.Clear (1506 of 2141) PASS: lldb-api :: types/TestLongTypes.py (1507 of 2141) PASS: lldb-unit :: Utility/./UtilityTests/FileSpecTest.GetPath (1508 of 2141) PASS: lldb-unit :: Utility/./UtilityTests/DataExtractorTest.GetSLEB128_bit63 (1509 of 2141) PASS: lldb-api :: python_api/signals/TestSignalsAPI.py (1510 of 2141) PASS: lldb-unit :: ScriptInterpreter/Python/./ScriptInterpreterPythonTests/PythonDataObjectsTest.TestPythonCallableInvoke (1511 of 2141) PASS: lldb-shell :: Quit/TestQuitExitCodeImplicit0.test (1512 of 2141) PASS: lldb-api :: functionalities/thread/concurrent_events/TestConcurrentTwoWatchpointThreads.py (1513 of 2141) PASS: lldb-shell :: SymbolFile/DWARF/inline-function-address.ll (1514 of 2141) PASS: lldb-api :: functionalities/thread/concurrent_events/TestConcurrentWatchBreak.py (1515 of 2141) PASS: lldb-unit :: Utility/./UtilityTests/StringExtractorTest.GetU64LittleEndian (1516 of 2141) UNSUPPORTED: lldb-api :: commands/watchpoints/hello_watchlocation/TestWatchLocation.py (1517 of 2141) PASS: lldb-shell :: Minidump/breakpad-symbols.test (1518 of 2141) PASS: lldb-shell :: Quit/TestQuitExitCodeNonInt.test (1519 of 2141) PASS: lldb-unit :: Expression/./ExpressionTests/DiagnosticManagerTest.PutStringMultiple (1520 of 2141) PASS: lldb-api :: commands/register/register/register_command/TestRegisters.py (1521 of 2141) PASS: lldb-unit :: UnwindAssembly/x86/./UnwindAssemblyx86Tests/Testx86AssemblyInspectionEngine.TestSimplei386ugmented (1522 of 2141) PASS: lldb-api :: functionalities/data-formatter/data-formatter-synth/TestDataFormatterSynth.py (1523 of 2141) PASS: lldb-api :: commands/expression/import-std-module/weak_ptr/TestWeakPtrFromStdModule.py (1524 of 2141) PASS: lldb-unit :: Utility/./UtilityTests/StreamTest.PutPtr (1525 of 2141) PASS: lldb-api :: tools/lldb-server/TestGdbRemoteExpeditedRegisters.py (1526 of 2141) PASS: lldb-unit :: ScriptInterpreter/Python/./ScriptInterpreterPythonTests/PythonDataObjectsTest.TestPythonTupleInitializerList2 (1527 of 2141) PASS: lldb-unit :: Expression/./ExpressionTests/DWARFExpression.DW_OP_unknown (1528 of 2141) PASS: lldb-unit :: Target/./TargetTests/ExecutionContextTest.GetByteOrderProcess (1529 of 2141) PASS: lldb-shell :: SymbolFile/DWARF/module-ownership.mm (1530 of 2141) PASS: lldb-api :: commands/expression/call-function/TestCallUserDefinedFunction.py (1531 of 2141) PASS: lldb-unit :: Symbol/./SymbolTests/PostfixExpression.ParseOneExpression (1532 of 2141) PASS: lldb-api :: python_api/lldbutil/iter/TestRegistersIterator.py (1533 of 2141) PASS: lldb-api :: commands/thread/select/TestThreadSelect.py (1534 of 2141) UNSUPPORTED: lldb-shell :: SymbolFile/PDB/variables.test (1535 of 2141) PASS: lldb-api :: lang/c/offsetof/TestOffsetof.py (1536 of 2141) PASS: lldb-unit :: Expression/./ExpressionTests/ClangHostTest.MacOSX (1537 of 2141) PASS: lldb-api :: functionalities/limit-debug-info/TestLimitDebugInfo.py (1538 of 2141) PASS: lldb-unit :: Utility/./UtilityTests/ArgsTest.DoubleQuotedItem (1539 of 2141) PASS: lldb-api :: tools/lldb-server/TestGdbRemoteKill.py (1540 of 2141) PASS: lldb-unit :: Process/minidump/./LLDBMinidumpTests/MinidumpParserTest.GetArchitectureWindows (1541 of 2141) PASS: lldb-unit :: Utility/./UtilityTests/StreamTest.AddressRangeSize (1542 of 2141) PASS: lldb-unit :: Host/./HostTests/SocketTest.DecodeHostAndPort (1543 of 2141) PASS: lldb-unit :: Utility/./UtilityTests/BinaryStreamTest.PutSLEB128MaxValue (1544 of 2141) PASS: lldb-unit :: Utility/./UtilityTests/CompletionRequest.TryCompleteCurrentArgGood (1545 of 2141) PASS: lldb-unit :: Utility/./UtilityTests/StreamTest.QuotedCString (1546 of 2141) UNSUPPORTED: lldb-shell :: Register/aarch64-fp-read.test (1547 of 2141) PASS: lldb-api :: functionalities/tail_call_frames/ambiguous_tail_call_seq2/TestAmbiguousTailCallSeq2.py (1548 of 2141) PASS: lldb-api :: functionalities/gdb_remote_client/TestWriteMemory.py (1549 of 2141) PASS: lldb-unit :: Process/minidump/./LLDBMinidumpTests/MinidumpParserTest.MinidumpDuplicateModuleSeparateCode (1550 of 2141) PASS: lldb-shell :: SymbolFile/DWARF/static_scope.s (1551 of 2141) PASS: lldb-api :: commands/expression/import-std-module/stack/TestStackFromStdModule.py (1552 of 2141) PASS: lldb-shell :: Settings/TestSettingsSet.test (1553 of 2141) PASS: lldb-unit :: Utility/./UtilityTests/RangeTest.ContainsAddrInvalid (1554 of 2141) PASS: lldb-unit :: Utility/./UtilityTests/BinaryStreamTest.PutULEB128OneByte (1555 of 2141) PASS: lldb-api :: functionalities/thread/concurrent_events/TestConcurrentDelayedCrashWithBreakpointWatchpoint.py (1556 of 2141) PASS: lldb-shell :: SymbolFile/Breakpad/line-table-discontinuous-file-ids.test (1557 of 2141) PASS: lldb-api :: python_api/frame/get-variables/TestGetVariables.py (1558 of 2141) PASS: lldb-api :: commands/watchpoints/watchpoint_count/TestWatchpointCount.py (1559 of 2141) PASS: lldb-unit :: Utility/./UtilityTests/StreamTeeTest.SetStreamAtIndexOverwrite (1560 of 2141) PASS: lldb-api :: lang/cpp/diamond/TestDiamond.py (1561 of 2141) UNSUPPORTED: lldb-api :: functionalities/darwin_log/filter/exact_match/activity-chain/TestDarwinLogFilterMatchActivityChain.py (1562 of 2141) PASS: lldb-unit :: UnwindAssembly/x86/./UnwindAssemblyx86Tests/Testx86AssemblyInspectionEngine.TestSpillRegToStackViaMOVx86_64 (1563 of 2141) UNSUPPORTED: lldb-api :: tools/lldb-server/libraries-svr4/TestGdbRemoteLibrariesSvr4Support.py (1564 of 2141) PASS: lldb-unit :: Utility/./UtilityTests/VMRange.ContainsRange (1565 of 2141) PASS: lldb-unit :: SymbolFile/DWARF/./SymbolFileDWARFTests/XcodeSDKModuleTests.TestModuleGetXcodeSDK (1566 of 2141) PASS: lldb-api :: commands/watchpoints/watchpoint_on_vectors/TestValueOfVectorVariable.py (1567 of 2141) PASS: lldb-shell :: SymbolFile/DWARF/debug_ranges.s (1568 of 2141) UNSUPPORTED: lldb-shell :: Register/x86-gp-read.test (1569 of 2141) PASS: lldb-unit :: SymbolFile/NativePDB/./SymbolFileNativePDBTests/PDBFPOProgramToDWARFExpressionTests.UnresolvedRegisterReference (1570 of 2141) PASS: lldb-api :: commands/watchpoints/multiple_threads/TestWatchpointMultipleThreads.py (1571 of 2141) PASS: lldb-unit :: Utility/./UtilityTests/StringListTest.ShiftMove (1572 of 2141) PASS: lldb-unit :: ScriptInterpreter/Python/./ScriptInterpreterPythonTests/PythonDataObjectsTest.TestPythonStringToStr (1573 of 2141) PASS: lldb-api :: functionalities/thread/step_out/TestThreadStepOut.py (1574 of 2141) PASS: lldb-unit :: Utility/./UtilityTests/StringExtractorTest.GetHexBytes (1575 of 2141) PASS: lldb-unit :: Utility/./UtilityTests/DataExtractorTest.GetCStrUnterminated (1576 of 2141) PASS: lldb-unit :: Utility/./UtilityTests/StreamTest.PutULEB128 (1577 of 2141) PASS: lldb-unit :: Utility/./UtilityTests/UriParserTest.BracketedHostnameWithPortIPv6 (1578 of 2141) PASS: lldb-api :: python_api/lldbutil/frame/TestFrameUtils.py (1579 of 2141) PASS: lldb-api :: lang/c/blocks/TestBlocks.py (1580 of 2141) PASS: lldb-unit :: Process/./ProcessEventDataTests/ProcessEventDataTest.ShouldStop (1581 of 2141) PASS: lldb-shell :: ObjectFile/ELF/PT_LOAD.yaml (1582 of 2141) PASS: lldb-unit :: Utility/./UtilityTests/ScalarTest.Scalar_512 (1583 of 2141) PASS: lldb-unit :: ObjectFile/Breakpad/./ObjectFileBreakpadTests/InfoRecord.parse (1584 of 2141) PASS: lldb-unit :: Utility/./UtilityTests/DataExtractorTest.GetCStr (1585 of 2141) PASS: lldb-unit :: Utility/./UtilityTests/SerializationRountripTest.SerializeDeserializeCStringArray (1586 of 2141) PASS: lldb-api :: macosx/load-kext/TestLoadKext.py (1587 of 2141) PASS: lldb-api :: commands/command/delete/TestCommandDelete.py (1588 of 2141) PASS: lldb-api :: macosx/find-app-in-bundle/TestFindAppInBundle.py (1589 of 2141) PASS: lldb-unit :: Utility/./UtilityTests/UriParserTest.Empty (1590 of 2141) PASS: lldb-api :: functionalities/thread/concurrent_events/TestConcurrentCrashWithBreak.py (1591 of 2141) PASS: lldb-unit :: Process/minidump/./LLDBMinidumpTests/MinidumpParserTest.MinidumpDuplicateModuleMinAddress (1592 of 2141) PASS: lldb-shell :: Commands/command-target-modules-dump-sections.yaml (1593 of 2141) PASS: lldb-unit :: Utility/./UtilityTests/ArgsTest.TestSingleArgWithQuotedSpace (1594 of 2141) PASS: lldb-shell :: SymbolFile/DWARF/debug_loc-aslr.s (1595 of 2141) PASS: lldb-unit :: Utility/./UtilityTests/Flags.Clear (1596 of 2141) PASS: lldb-api :: commands/watchpoints/watchpoint_size/TestWatchpointSizes.py (1597 of 2141) PASS: lldb-unit :: Language/Highlighting/./HighlighterTests/HighlighterTest.ClangStringLiterals (1598 of 2141) PASS: lldb-api :: lang/cpp/modules-import/TestCXXModulesImport.py (1599 of 2141) PASS: lldb-unit :: Utility/./UtilityTests/XcodeSDKTest.ParseTest (1600 of 2141) PASS: lldb-unit :: Utility/./UtilityTests/SerializationRountripTest.SerializeDeserializePodReferences (1601 of 2141) PASS: lldb-unit :: Process/gdb-remote/./ProcessGdbRemoteTests/GDBRemoteCommunicationClientTest.SendStopTracePacket (1602 of 2141) PASS: lldb-api :: functionalities/data-formatter/data-formatter-stl/libcxx/map/TestDataFormatterLibccMap.py (1603 of 2141) PASS: lldb-unit :: DataFormatter/./LLDBFormatterTests/FormatManagerTests.CompatibleLangs (1604 of 2141) PASS: lldb-api :: lang/objc/objc-stepping/TestObjCStepping.py (1605 of 2141) PASS: lldb-unit :: Utility/./UtilityTests/ArgsTest.Yaml (1606 of 2141) PASS: lldb-api :: commands/expression/completion-in-lambda-and-unnamed-class/TestCompletionInLambdaAndUnnamedClass.py (1607 of 2141) PASS: lldb-unit :: Utility/./UtilityTests/TimerTest.CategoryTimesNested (1608 of 2141) PASS: lldb-unit :: Utility/./UtilityTests/StreamTest.ShiftOperatorChars (1609 of 2141) PASS: lldb-api :: lang/c/anonymous/TestAnonymous.py (1610 of 2141) PASS: lldb-api :: functionalities/thread/concurrent_events/TestConcurrentTwoBreakpointsOneSignal.py (1611 of 2141) PASS: lldb-api :: tools/lldb-server/TestGdbRemote_qThreadStopInfo.py (1612 of 2141) PASS: lldb-api :: commands/source/info/TestSourceInfo.py (1613 of 2141) PASS: lldb-api :: functionalities/thread/jump/TestThreadJump.py (1614 of 2141) PASS: lldb-api :: functionalities/data-formatter/data-formatter-categories/TestDataFormatterCategories.py (1615 of 2141) PASS: lldb-unit :: ScriptInterpreter/Python/./ScriptInterpreterPythonTests/PythonDataObjectsTest.TestPythonByteArray (1616 of 2141) PASS: lldb-unit :: ScriptInterpreter/Python/./ScriptInterpreterPythonTests/PythonDataObjectsTest.TestPythonString (1617 of 2141) UNSUPPORTED: lldb-api :: commands/register/register/intel_xtended_registers/mpx_bound_violation/TestBoundViolation.py (1618 of 2141) PASS: lldb-api :: commands/platform/process/list/TestProcessList.py (1619 of 2141) PASS: lldb-api :: functionalities/signal/handle-abrt/TestHandleAbort.py (1620 of 2141) PASS: lldb-unit :: Utility/./UtilityTests/OptionsWithRawTest.WhitespaceInput (1621 of 2141) PASS: lldb-api :: functionalities/data-formatter/data-formatter-stl/libcxx/unordered/TestDataFormatterUnordered.py (1622 of 2141) PASS: lldb-api :: lang/cpp/thread_local/TestThreadLocal.py (1623 of 2141) PASS: lldb-api :: functionalities/memory/find/TestMemoryFind.py (1624 of 2141) PASS: lldb-shell :: Register/x86-64-read.test (1625 of 2141) PASS: lldb-api :: functionalities/inferior-assert/TestInferiorAssert.py (1626 of 2141) PASS: lldb-unit :: Utility/./UtilityTests/GeneratorTest.Get (1627 of 2141) PASS: lldb-api :: functionalities/thread/concurrent_events/TestConcurrentManyBreakpoints.py (1628 of 2141) PASS: lldb-api :: python_api/watchpoint/watchlocation/TestTargetWatchAddress.py (1629 of 2141) PASS: lldb-unit :: Utility/./UtilityTests/AnsiTerminal.AtStart (1630 of 2141) PASS: lldb-api :: functionalities/return-value/TestReturnValue.py (1631 of 2141) PASS: lldb-unit :: Utility/./UtilityTests/UriParserTest.MinimalPortPath (1632 of 2141) UNSUPPORTED: lldb-api :: macosx/macCatalystAppMacOSFramework/TestMacCatalystAppWithMacOSFramework.py (1633 of 2141) PASS: lldb-api :: functionalities/reproducers/attach/TestReproducerAttach.py (1634 of 2141) PASS: lldb-unit :: Utility/./UtilityTests/StringListTest.JoinSingle (1635 of 2141) PASS: lldb-unit :: Target/./TargetTests/ModuleCacheTest.GetAndPutUuidExists (1636 of 2141) PASS: lldb-api :: commands/expression/import_builtin_fileid/TestImportBuiltinFileID.py (1637 of 2141) PASS: lldb-api :: functionalities/postmortem/netbsd-core/TestNetBSDCore.py (1638 of 2141) PASS: lldb-shell :: Process/TestAbortExitCode.test (1639 of 2141) PASS: lldb-unit :: Symbol/./SymbolTests/TestTypeSystemClang.TemplateArguments (1640 of 2141) PASS: lldb-api :: commands/expression/calculator_mode/TestCalculatorMode.py (1641 of 2141) PASS: lldb-api :: lang/cpp/call-function/TestCallCPPFunction.py (1642 of 2141) PASS: lldb-unit :: Utility/./UtilityTests/OptionsWithRawTest.EmptyInput (1643 of 2141) PASS: lldb-unit :: Host/./HostTests/FileSystemTest.Resolve (1644 of 2141) PASS: lldb-unit :: Utility/./UtilityTests/RangeTest.ContainsAddr (1645 of 2141) PASS: lldb-api :: functionalities/gdb_remote_client/TestGDBRemoteDiskFileCompletion.py (1646 of 2141) PASS: lldb-unit :: SymbolFile/NativePDB/./SymbolFileNativePDBTests/PDBFPOProgramToDWARFExpressionTests.InvalidOpUnary (1647 of 2141) PASS: lldb-shell :: ObjectFile/PECOFF/dep-modules.yaml (1648 of 2141) PASS: lldb-shell :: BuildScript/modes.test (1649 of 2141) PASS: lldb-api :: lang/objc/blocks/TestObjCIvarsInBlocks.py (1650 of 2141) PASS: lldb-api :: functionalities/float-display/TestFloatDisplay.py (1651 of 2141) PASS: lldb-shell :: Settings/TestStopCommandSourceOnError.test (1652 of 2141) PASS: lldb-api :: commands/expression/persistent_variables/TestPersistentVariables.py (1653 of 2141) PASS: lldb-api :: functionalities/thread_plan/TestThreadPlanCommands.py (1654 of 2141) PASS: lldb-shell :: ExecControl/StopHook/stop-hook.test (1655 of 2141) PASS: lldb-api :: functionalities/data-formatter/array_typedef/TestArrayTypedef.py (1656 of 2141) PASS: lldb-api :: commands/frame/diagnose/dereference-argument/TestDiagnoseDereferenceArgument.py (1657 of 2141) PASS: lldb-shell :: SymbolFile/Breakpad/unwind-via-stack-win.test (1658 of 2141) PASS: lldb-unit :: UnwindAssembly/ARM64/./Arm64InstEmulationTests/TestArm64InstEmulation.TestMediumDarwinFunction (1659 of 2141) PASS: lldb-api :: commands/target/basic/TestTargetCommand.py (1660 of 2141) PASS: lldb-api :: functionalities/breakpoint/auto_continue/TestBreakpointAutoContinue.py (1661 of 2141) PASS: lldb-api :: macosx/order/TestOrderFile.py (1662 of 2141) PASS: lldb-api :: commands/expression/import-std-module/empty-module/TestEmptyStdModule.py (1663 of 2141) PASS: lldb-api :: lang/objc/foundation/TestConstStrings.py (1664 of 2141) UNSUPPORTED: lldb-api :: commands/target/auto-install-main-executable/TestAutoInstallMainExecutable.py (1665 of 2141) UNSUPPORTED: lldb-api :: functionalities/darwin_log/filter/exact_match/activity/TestDarwinLogFilterMatchActivity.py (1666 of 2141) PASS: lldb-unit :: Symbol/./SymbolTests/TestTypeSystemClang.TestOwningModule (1667 of 2141) PASS: lldb-unit :: Utility/./UtilityTests/ScalarTest.Division (1668 of 2141) PASS: lldb-api :: lang/c/local_types/TestUseClosestType.py (1669 of 2141) PASS: lldb-shell :: SymbolFile/DWARF/dwarf5-partial-index.cpp (1670 of 2141) PASS: lldb-shell :: ObjectFile/MachO/symtab.yaml (1671 of 2141) PASS: lldb-shell :: Minidump/Windows/Sigsegv/sigsegv.test (1672 of 2141) PASS: lldb-unit :: UnwindAssembly/x86/./UnwindAssemblyx86Tests/Testx86AssemblyInspectionEngine.Testi386IgnoredRegisters (1673 of 2141) PASS: lldb-unit :: Utility/./UtilityTests/AnsiTerminal.Empty (1674 of 2141) PASS: lldb-api :: commands/expression/scoped_enums/TestScopedEnumType.py (1675 of 2141) PASS: lldb-unit :: Utility/./UtilityTests/StreamTest.PutBytesAsRawHex8ToBigEndian (1676 of 2141) PASS: lldb-unit :: Utility/./UtilityTests/VMRange.ContainsAddr (1677 of 2141) PASS: lldb-shell :: SymbolFile/Breakpad/symtab.test (1678 of 2141) PASS: lldb-api :: lang/cpp/global_variables/TestCPPGlobalVariables.py (1679 of 2141) UNSUPPORTED: lldb-shell :: SymbolFile/PDB/expressions.test (1680 of 2141) PASS: lldb-api :: commands/expression/dollar-in-variable/TestDollarInVariable.py (1681 of 2141) PASS: lldb-unit :: Utility/./UtilityTests/UserIDResolver.GetUserName (1682 of 2141) PASS: lldb-shell :: Settings/TestFrameFormatMangling.test (1683 of 2141) PASS: lldb-api :: functionalities/breakpoint/breakpoint_callback_command_source/TestBreakpointCallbackCommandSource.py (1684 of 2141) PASS: lldb-api :: commands/frame/diagnose/dereference-this/TestDiagnoseDereferenceThis.py (1685 of 2141) PASS: lldb-unit :: Utility/./UtilityTests/BinaryStreamTest.PutULEB128One (1686 of 2141) PASS: lldb-unit :: Utility/./UtilityTests/StringLexerTest.AdvanceIf (1687 of 2141) PASS: lldb-unit :: Process/minidump/./LLDBMinidumpTests/MinidumpParserTest.GetPidWow64 (1688 of 2141) PASS: lldb-unit :: Utility/./UtilityTests/TildeExpressionResolver.ResolveFullPath (1689 of 2141) PASS: lldb-api :: lang/cpp/class_static/TestStaticVariables.py (1690 of 2141) PASS: lldb-unit :: Symbol/./SymbolTests/DWARFCallFrameInfoTest.Basic_eh (1691 of 2141) PASS: lldb-unit :: Utility/./UtilityTests/StreamTeeTest.Constructor1Stream (1692 of 2141) PASS: lldb-unit :: Utility/./UtilityTests/ReproducerTest.SetReplay (1693 of 2141) PASS: lldb-api :: python_api/watchpoint/condition/TestWatchpointConditionAPI.py (1694 of 2141) UNSUPPORTED: lldb-api :: functionalities/darwin_log/source/info/TestDarwinLogSourceInfo.py (1695 of 2141) PASS: lldb-api :: functionalities/pre_run_dylibs/TestPreRunDylibs.py (1696 of 2141) PASS: lldb-shell :: Driver/TestPositionalArgs.test (1697 of 2141) PASS: lldb-unit :: Utility/./UtilityTests/AnsiTerminal.AtEnd (1698 of 2141) PASS: lldb-shell :: SymbolFile/DWARF/split-dwarf-inlining.cpp (1699 of 2141) PASS: lldb-shell :: Reproducer/TestReuseDirectory.test (1700 of 2141) PASS: lldb-api :: terminal/TestEditline.py (1701 of 2141) PASS: lldb-api :: commands/expression/top-level/TestTopLevelExprs.py (1702 of 2141) PASS: lldb-unit :: UnwindAssembly/x86/./UnwindAssemblyx86Tests/Testx86AssemblyInspectionEngine.TestAddESP (1703 of 2141) PASS: lldb-unit :: Utility/./UtilityTests/RangeDataVector.FindEntryIndexesThatContain_Overlap (1704 of 2141) PASS: lldb-api :: functionalities/fat_archives/TestFatArchives.py (1705 of 2141) PASS: lldb-unit :: UnwindAssembly/x86/./UnwindAssemblyx86Tests/Testx86AssemblyInspectionEngine.Test64bitFramelessSmallStackFrame (1706 of 2141) PASS: lldb-unit :: Utility/./UtilityTests/LogChannelEnabledTest.LogVerboseThread (1707 of 2141) PASS: lldb-shell :: SymbolFile/Breakpad/line-table-edgecases.test (1708 of 2141) PASS: lldb-api :: commands/frame/recognizer/TestFrameRecognizer.py (1709 of 2141) PASS: lldb-shell :: ObjectFile/ELF/section-overlap.yaml (1710 of 2141) PASS: lldb-unit :: Utility/./UtilityTests/StringListTest.LongestCommonPrefixSingleElement (1711 of 2141) PASS: lldb-shell :: SymbolFile/DWARF/dir-separator-windows.s (1712 of 2141) PASS: lldb-shell :: ObjectFile/PECOFF/sections-names.yaml (1713 of 2141) PASS: lldb-shell :: Process/UnsupportedLanguage.test (1714 of 2141) UNSUPPORTED: lldb-api :: python_api/event/TestEvents.py (1715 of 2141) PASS: lldb-unit :: Utility/./UtilityTests/Flags.GetBitSize (1716 of 2141) PASS: lldb-api :: functionalities/thread/concurrent_events/TestConcurrentSignalNWatchNBreak.py (1717 of 2141) PASS: lldb-shell :: Quit/TestQuitExitCode0.test (1718 of 2141) PASS: lldb-api :: commands/watchpoints/step_over_watchpoint/TestStepOverWatchpoint.py (1719 of 2141) PASS: lldb-api :: api/listeners/TestListener.py (1720 of 2141) PASS: lldb-unit :: Utility/./UtilityTests/StringListTest.LongestCommonPrefixNoPrefix (1721 of 2141) PASS: lldb-unit :: Utility/./UtilityTests/DeserializerTest.HasData (1722 of 2141) PASS: lldb-api :: types/TestDoubleTypes.py (1723 of 2141) PASS: lldb-unit :: SymbolFile/NativePDB/./SymbolFileNativePDBTests/PDBFPOProgramToDWARFExpressionTests.UnsupportedRASearch (1724 of 2141) PASS: lldb-unit :: UnwindAssembly/ARM64/./Arm64InstEmulationTests/TestArm64InstEmulation.TestSimpleDarwinFunction (1725 of 2141) PASS: lldb-api :: lang/objc/objc-super/TestObjCSuper.py (1726 of 2141) PASS: lldb-shell :: ObjectFile/Breakpad/sections.test (1727 of 2141) PASS: lldb-shell :: SymbolFile/NativePDB/ast-functions.cpp (1728 of 2141) PASS: lldb-shell :: ScriptInterpreter/Python/scripted_breakpoint.test (1729 of 2141) PASS: lldb-unit :: ScriptInterpreter/Python/./ScriptInterpreterPythonTests/PythonDataObjectsTest.TestResetting (1730 of 2141) UNSUPPORTED: lldb-api :: functionalities/data-formatter/data-formatter-stl/libstdcpp/map/TestDataFormatterStdMap.py (1731 of 2141) PASS: lldb-unit :: Utility/./UtilityTests/ScalarTest.Comparison (1732 of 2141) PASS: lldb-shell :: SymbolFile/DWARF/debug_line-relative_path.s (1733 of 2141) PASS: lldb-unit :: Process/gdb-remote/./ProcessGdbRemoteTests/GDBRemoteCommunicationServerTest.SendErrorResponse_UnimplementedError (1734 of 2141) PASS: lldb-api :: functionalities/data-formatter/data-formatter-objc/cmtime/TestDataFormatterCMTime.py (1735 of 2141) PASS: lldb-unit :: Utility/./UtilityTests/StringListTest.AppendStringStdString (1736 of 2141) PASS: lldb-api :: functionalities/thread/concurrent_events/TestConcurrentSignalBreak.py (1737 of 2141) PASS: lldb-api :: tools/lldb-server/TestGdbRemoteRegisterState.py (1738 of 2141) PASS: lldb-api :: functionalities/conditional_break/TestConditionalBreak.py (1739 of 2141) PASS: lldb-unit :: tools/lldb-server/tests/./LLDBServerTests/TestBase.DebugserverEnv (1740 of 2141) UNSUPPORTED: lldb-api :: functionalities/darwin_log/filter/exact_match/category/TestDarwinLogFilterMatchCategory.py (1741 of 2141) PASS: lldb-unit :: Utility/./UtilityTests/RangeTest.DoesIntersect (1742 of 2141) PASS: lldb-unit :: Utility/./UtilityTests/TimerTest.CategoryTimes (1743 of 2141) PASS: lldb-unit :: Platform/./LLDBPlatformTests/PlatformDarwinTest.FindComponentInPath (1744 of 2141) PASS: lldb-unit :: Utility/./UtilityTests/DataExtractorTest.GetCStrEmpty (1745 of 2141) PASS: lldb-unit :: UnwindAssembly/ARM64/./Arm64InstEmulationTests/TestArm64InstEmulation.TestRegisterDoubleSpills (1746 of 2141) PASS: lldb-shell :: SymbolFile/DWARF/dwarf5-index-is-used.cpp (1747 of 2141) PASS: lldb-unit :: Utility/./UtilityTests/StringExtractorTest.GetHexBytes_Partial (1748 of 2141) PASS: lldb-api :: functionalities/data-formatter/data-formatter-objc/TestDataFormatterObjCPlain.py (1749 of 2141) PASS: lldb-api :: python_api/findvalue_duplist/TestSBFrameFindValue.py (1750 of 2141) PASS: lldb-unit :: Symbol/./SymbolTests/TestClangASTImporter.CanImportInvalidType (1751 of 2141) PASS: lldb-shell :: ObjectFile/ELF/PT_TLS-overlap-PT_LOAD.yaml (1752 of 2141) PASS: lldb-unit :: Utility/./UtilityTests/StateTest.Formatv (1753 of 2141) PASS: lldb-shell :: Commands/command-thread-select.test (1754 of 2141) PASS: lldb-api :: functionalities/gdb_remote_client/TestqOffsets.py (1755 of 2141) PASS: lldb-unit :: Utility/./UtilityTests/ScalarTest.CastOperations (1756 of 2141) PASS: lldb-api :: lang/c/find_struct_type/TestFindStructTypes.py (1757 of 2141) PASS: lldb-unit :: UnwindAssembly/x86/./UnwindAssemblyx86Tests/Testx86AssemblyInspectionEngine.TestDisassemblyJunkBytes (1758 of 2141) PASS: lldb-unit :: Utility/./UtilityTests/StringExtractorTest.GetU64BigEndian (1759 of 2141) PASS: lldb-api :: lang/c/record_decl_in_expr/TestRecordDeclInExpr.py (1760 of 2141) PASS: lldb-unit :: Host/./HostTests/NativeProcessProtocolTest.ReadCStringFromMemory_MaxSize (1761 of 2141) PASS: lldb-unit :: Utility/./UtilityTests/StringExtractorTest.GetHexBytes_OddPair (1762 of 2141) UNSUPPORTED: lldb-api :: commands/watchpoints/multi_watchpoint_slots/TestWatchpointMultipleSlots.py (1763 of 2141) PASS: lldb-api :: functionalities/thread/concurrent_events/TestConcurrentCrashWithWatchpointBreakpointSignal.py (1764 of 2141) UNSUPPORTED: lldb-shell :: Register/arm-gp-read.test (1765 of 2141) PASS: lldb-unit :: Utility/./UtilityTests/GeneratorTest.Create (1766 of 2141) UNSUPPORTED: lldb-api :: linux/thread/create_during_instruction_step/TestCreateDuringInstructionStep.py (1767 of 2141) PASS: lldb-api :: functionalities/ptr_refs/TestPtrRefs.py (1768 of 2141) PASS: lldb-unit :: Utility/./UtilityTests/LogTest.Unregister (1769 of 2141) PASS: lldb-unit :: Language/Highlighting/./HighlighterTests/HighlighterTest.ClangCursorPosAfterOtherToken (1770 of 2141) PASS: lldb-unit :: Expression/./ExpressionTests/DiagnosticManagerTest.PutString (1771 of 2141) PASS: lldb-api :: functionalities/deleted-executable/TestDeletedExecutable.py (1772 of 2141) PASS: lldb-unit :: Interpreter/./InterpreterTests/CompletionTest.DirCompletionUsername (1773 of 2141) PASS: lldb-api :: lang/cpp/alignas_base_class/TestAlignAsBaseClass.py (1774 of 2141) PASS: lldb-unit :: Utility/./UtilityTests/VMRange.Reset (1775 of 2141) PASS: lldb-unit :: ScriptInterpreter/Python/./ScriptInterpreterPythonTests/PythonDataObjectsTest.TestPythonDictionaryToStructuredDictionary (1776 of 2141) PASS: lldb-unit :: Language/CPlusPlus/./LanguageCPlusPlusTests/CPlusPlusLanguage.FindAlternateFunctionManglings (1777 of 2141) PASS: lldb-api :: tools/lldb-server/TestGdbRemoteExitCode.py (1778 of 2141) PASS: lldb-unit :: Expression/./ExpressionTests/CppModuleConfigurationTest.LibCppV2 (1779 of 2141) PASS: lldb-unit :: Signals/./SignalsTests/UnixSignalsTest.Iteration (1780 of 2141) PASS: lldb-api :: lang/objc/foundation/TestObjCMethods.py (1781 of 2141) PASS: lldb-api :: lang/objc/objc-ivar-protocols/TestIvarProtocols.py (1782 of 2141) PASS: lldb-unit :: Utility/./UtilityTests/StringLexerTest.NextIfList (1783 of 2141) PASS: lldb-api :: lang/objc/bitfield_ivars/TestBitfieldIvars.py (1784 of 2141) PASS: lldb-api :: lang/objc/modules-inline-functions/TestModulesInlineFunctions.py (1785 of 2141) UNSUPPORTED: lldb-api :: functionalities/breakpoint/hardware_breakpoints/write_memory_with_hw_breakpoint/TestWriteMemoryWithHWBreakpoint.py (1786 of 2141) PASS: lldb-unit :: UnwindAssembly/x86/./UnwindAssemblyx86Tests/Testx86AssemblyInspectionEngine.TestDisassemblyMidFunctionEpilogues (1787 of 2141) PASS: lldb-api :: lang/cpp/typedef/TestCppTypedef.py (1788 of 2141) PASS: lldb-unit :: Utility/./UtilityTests/OptionsWithRawTest.ArgsButNoDelimiter (1789 of 2141) PASS: lldb-api :: functionalities/data-formatter/data-formatter-stl/libcxx/tuple/TestDataFormatterLibcxxTuple.py (1790 of 2141) PASS: lldb-api :: functionalities/data-formatter/data-formatter-stl/libcxx/bitset/TestDataFormatterLibcxxBitset.py (1791 of 2141) PASS: lldb-unit :: Platform/Android/./AdbClientTests/AdbClientTest.CreateByDeviceId_ByEnvVar (1792 of 2141) PASS: lldb-shell :: Process/TestEnvironment.test (1793 of 2141) PASS: lldb-unit :: Utility/./UtilityTests/OptionsWithRawTest.MultiWordSuffix (1794 of 2141) PASS: lldb-unit :: Utility/./UtilityTests/SerializationRountripTest.SerializeDeserializeCString (1795 of 2141) PASS: lldb-api :: lang/cpp/scope/TestCppScope.py (1796 of 2141) PASS: lldb-api :: functionalities/data-formatter/pyobjsynthprovider/TestPyObjSynthProvider.py (1797 of 2141) PASS: lldb-shell :: SymbolFile/DWARF/anon_class_w_and_wo_export_symbols.ll (1798 of 2141) UNSUPPORTED: lldb-api :: lang/c/typedef/Testtypedef.py (1799 of 2141) PASS: lldb-api :: commands/expression/invalid-args/TestInvalidArgsExpression.py (1800 of 2141) PASS: lldb-unit :: Utility/./UtilityTests/DataExtractorTest.PeekData (1801 of 2141) PASS: lldb-api :: lang/objc/objc-checker/TestObjCCheckers.py (1802 of 2141) PASS: lldb-api :: lang/c/conflicting-symbol/TestConflictingSymbol.py (1803 of 2141) PASS: lldb-api :: commands/expression/static-initializers/TestStaticInitializers.py (1804 of 2141) PASS: lldb-unit :: Utility/./UtilityTests/StreamTest.PutCharNull (1805 of 2141) PASS: lldb-api :: commands/expression/import-std-module/deque-dbg-info-content/TestDbgInfoContentDequeFromStdModule.py (1806 of 2141) PASS: lldb-unit :: Process/minidump/./LLDBMinidumpTests/MinidumpParserTest.GetFilteredModuleList (1807 of 2141) PASS: lldb-api :: commands/expression/ir-interpreter/TestIRInterpreter.py (1808 of 2141) PASS: lldb-shell :: ObjectFile/wasm/basic.yaml (1809 of 2141) PASS: lldb-unit :: Utility/./UtilityTests/StreamTest.PutChar (1810 of 2141) PASS: lldb-shell :: SymbolFile/DWARF/DW_TAG_basic_type_DW_ATE_UTF_nonC.ll (1811 of 2141) PASS: lldb-shell :: SymbolFile/DWARF/debug_line-tombstone.s (1812 of 2141) PASS: lldb-api :: arm/emulation/TestEmulations.py (1813 of 2141) PASS: lldb-api :: commands/watchpoints/watchpoint_commands/command/TestWatchpointCommandPython.py (1814 of 2141) PASS: lldb-api :: functionalities/data-formatter/vector-types/TestVectorTypesFormatting.py (1815 of 2141) PASS: lldb-shell :: SymbolFile/DWARF/debug_ranges_and_rnglists.test (1816 of 2141) PASS: lldb-shell :: SymbolFile/DWARF/clang-ast-from-dwarf-unamed-and-anon-structs.cpp (1817 of 2141) PASS: lldb-unit :: Process/minidump/./LLDBMinidumpTests/MinidumpParserTest.MinidumpDuplicateModuleMappedFirst (1818 of 2141) PASS: lldb-api :: functionalities/data-formatter/cstring-utf8-summary/TestCstringUnicode.py (1819 of 2141) UNSUPPORTED: lldb-api :: commands/register/register/intel_xtended_registers/TestMPXRegisters.py (1820 of 2141) PASS: lldb-api :: functionalities/gdb_remote_client/TestNoWatchpointSupportInfo.py (1821 of 2141) PASS: lldb-api :: commands/target/stop-hook/disable/TestTargetStopHookDisable.py (1822 of 2141) PASS: lldb-unit :: Utility/./UtilityTests/ArchSpecTest.TestParseMachCPUDashSubtypeTripleSimple (1823 of 2141) PASS: lldb-unit :: Utility/./UtilityTests/StringListTest.GetMaxStringLengthEmpty (1824 of 2141) PASS: lldb-shell :: SymbolFile/DWARF/clang-ast-from-dwarf-objc-property.m (1825 of 2141) PASS: lldb-api :: lang/objc/radar-9691614/TestObjCMethodReturningBOOL.py (1826 of 2141) PASS: lldb-unit :: Disassembler/./DisassemblerTests/TestArm64Disassembly.TestArmv81Instruction (1827 of 2141) PASS: lldb-api :: functionalities/tail_call_frames/ambiguous_tail_call_seq1/TestAmbiguousTailCallSeq1.py (1828 of 2141) PASS: lldb-api :: tools/lldb-vscode/launch/TestVSCode_launch.py (1829 of 2141) PASS: lldb-unit :: Symbol/./SymbolTests/TestTypeSystemClang.TestUnifyAccessSpecifiers (1830 of 2141) PASS: lldb-unit :: Utility/./UtilityTests/FileSpecTest.AppendPathComponent (1831 of 2141) PASS: lldb-api :: functionalities/thread/concurrent_events/TestConcurrentTwoBreakpointsOneWatchpoint.py (1832 of 2141) PASS: lldb-unit :: Expression/./ExpressionTests/DiagnosticManagerTest.GetStringMultipleDiags (1833 of 2141) PASS: lldb-api :: functionalities/thread/num_threads/TestNumThreads.py (1834 of 2141) PASS: lldb-shell :: SymbolFile/DWARF/limit-debug-info.s (1835 of 2141) PASS: lldb-api :: python_api/watchpoint/TestSetWatchpoint.py (1836 of 2141) PASS: lldb-unit :: Language/Highlighting/./HighlighterTests/HighlighterTest.DefaultHighlighter (1837 of 2141) PASS: lldb-api :: functionalities/mtc/simple/TestMTCSimple.py (1838 of 2141) PASS: lldb-unit :: Utility/./UtilityTests/BroadcasterTest.EventTypeHasListeners (1839 of 2141) PASS: lldb-unit :: Utility/./UtilityTests/AnsiTerminal.Basic (1840 of 2141) PASS: lldb-unit :: Utility/./UtilityTests/StringExtractorTest.GetHexU8_Underflow2 (1841 of 2141) PASS: lldb-unit :: Language/Highlighting/./HighlighterTests/HighlighterTest.ClangPPDirectives (1842 of 2141) PASS: lldb-api :: macosx/find-dsym/deep-bundle/TestDeepBundle.py (1843 of 2141) PASS: lldb-unit :: Process/gdb-remote/./ProcessGdbRemoteTests/GDBRemoteCommunicationClientTest.TestPacketSpeedJSON (1844 of 2141) PASS: lldb-unit :: Core/./LLDBCoreTests/RichManglingContextTest.SwitchProvider (1845 of 2141) PASS: lldb-unit :: Utility/./UtilityTests/FileSpecTest.EqualDotsWindows (1846 of 2141) PASS: lldb-api :: python_api/sblaunchinfo/TestSBLaunchInfo.py (1847 of 2141) PASS: lldb-unit :: Utility/./UtilityTests/XcodeSDKTest.SDKSupportsSwift (1848 of 2141) PASS: lldb-shell :: Breakpoint/debug_rnglistx_rlex.test (1849 of 2141) PASS: lldb-api :: functionalities/signal/TestSendSignal.py (1850 of 2141) PASS: lldb-unit :: Core/./LLDBCoreTests/SourceFileCache.FindSourceFileFound (1851 of 2141) PASS: lldb-api :: functionalities/thread/concurrent_events/TestConcurrentWatchpointDelayWatchpointOneBreakpoint.py (1852 of 2141) PASS: lldb-unit :: API/./APITests/SBCommandInterpreterTest.MultiWordCommand (1853 of 2141) PASS: lldb-unit :: Utility/./UtilityTests/UriParserTest.SchemeHostSeparator4 (1854 of 2141) PASS: lldb-api :: functionalities/thread/concurrent_events/TestConcurrentDelayWatchBreak.py (1855 of 2141) PASS: lldb-unit :: SymbolFile/NativePDB/./SymbolFileNativePDBTests/PDBFPOProgramToDWARFExpressionTests.MultipleIndependentAssignments (1856 of 2141) PASS: lldb-api :: lang/cpp/limit-debug-info/TestWithLimitDebugInfo.py (1857 of 2141) PASS: lldb-api :: commands/expression/anonymous-struct/TestCallUserAnonTypedef.py (1858 of 2141) PASS: lldb-api :: lang/cpp/overloaded-functions/TestOverloadedFunctions.py (1859 of 2141) PASS: lldb-unit :: Utility/./UtilityTests/StringExtractorTest.DecodeHexU8_Underflow (1860 of 2141) PASS: lldb-unit :: Utility/./UtilityTests/StringLexerTest.HasAtLeast (1861 of 2141) PASS: lldb-api :: lang/cpp/class_types/TestClassTypesDisassembly.py (1862 of 2141) PASS: lldb-unit :: Utility/./UtilityTests/UriParserTest.TypicalPortPathIPv4 (1863 of 2141) PASS: lldb-api :: commands/expression/issue_11588/Test11588.py (1864 of 2141) PASS: lldb-unit :: Symbol/./SymbolTests/TestClangASTImporter.CompleteFwdDeclWithOtherOrigin (1865 of 2141) PASS: lldb-unit :: UnwindAssembly/PPC64/./PPC64InstEmulationTests/TestPPC64InstEmulation.TestMediumFunction (1866 of 2141) PASS: lldb-api :: commands/expression/import-std-module/forward_list/TestForwardListFromStdModule.py (1867 of 2141) PASS: lldb-unit :: Utility/./UtilityTests/Predicate.WaitForValueEqualTo (1868 of 2141) PASS: lldb-unit :: Utility/./UtilityTests/LogTest.LLDB_LOG_nullptr (1869 of 2141) PASS: lldb-api :: lang/mixed/TestMixedLanguages.py (1870 of 2141) UNSUPPORTED: lldb-api :: functionalities/thread/concurrent_events/TestConcurrentManySignals.py (1871 of 2141) PASS: lldb-unit :: SymbolFile/NativePDB/./SymbolFileNativePDBTests/PDBFPOProgramToDWARFExpressionTests.UnresolvedDependentCyclicRegisterAssignmentReference (1872 of 2141) PASS: lldb-api :: lang/objcxx/objcxx-ivar-vector/TestIvarVector.py (1873 of 2141) PASS: lldb-shell :: ObjectFile/ELF/many-sections.s (1874 of 2141) PASS: lldb-unit :: Core/./LLDBCoreTests/RichManglingContextTest.FromCxxMethodName (1875 of 2141) UNSUPPORTED: lldb-api :: lang/cpp/printf/TestPrintf.py (1876 of 2141) PASS: lldb-api :: lang/cpp/subst_template_type_param/TestSubstTemplateTypeParam.py (1877 of 2141) PASS: lldb-api :: functionalities/ubsan/basic/TestUbsanBasic.py (1878 of 2141) UNSUPPORTED: lldb-shell :: ScriptInterpreter/Lua/bindings.test (1879 of 2141) PASS: lldb-shell :: Minidump/fb-dump.test (1880 of 2141) PASS: lldb-unit :: Utility/./UtilityTests/StringListTest.InsertStringAtIndexStdString (1881 of 2141) UNSUPPORTED: lldb-shell :: Expr/TestIRMemoryMapWindows.test (1882 of 2141) PASS: lldb-unit :: Editline/./EditlineTests/EditlineTestFixture.EditlineReceivesMultiLineText (1883 of 2141) PASS: lldb-unit :: Utility/./UtilityTests/StringListTest.RemoveBlankLines (1884 of 2141) PASS: lldb-shell :: Breakpoint/debug_rnglist_rlestartend.test (1885 of 2141) PASS: lldb-unit :: Utility/./UtilityTests/StreamTest.AddressPrefixAndSuffix (1886 of 2141) PASS: lldb-api :: functionalities/breakpoint/breakpoint_locations/TestBreakpointLocations.py (1887 of 2141) UNSUPPORTED: lldb-shell :: SymbolFile/PDB/udt-layout.test (1888 of 2141) PASS: lldb-api :: functionalities/step-avoids-no-debug/TestStepNoDebug.py (1889 of 2141) PASS: lldb-unit :: Utility/./UtilityTests/BinaryStreamTest.PutSLEB128TwoBytes (1890 of 2141) PASS: lldb-api :: functionalities/exec/TestExec.py (1891 of 2141) PASS: lldb-api :: functionalities/breakpoint/objc/TestObjCBreakpoints.py (1892 of 2141) PASS: lldb-shell :: SymbolFile/NativePDB/function-types-builtins.cpp (1893 of 2141) UNSUPPORTED: lldb-shell :: SymbolFile/NativePDB/typedefs.cpp (1894 of 2141) PASS: lldb-api :: functionalities/data-formatter/data-formatter-script/TestDataFormatterScript.py (1895 of 2141) PASS: lldb-api :: functionalities/data-formatter/refpointer-recursion/TestDataFormatterRefPtrRecursion.py (1896 of 2141) PASS: lldb-unit :: SymbolFile/NativePDB/./SymbolFileNativePDBTests/PDBFPOProgramToDWARFExpressionTests.InvalidAssignmentMultiple (1897 of 2141) PASS: lldb-api :: commands/expression/weak_symbols/TestWeakSymbols.py (1898 of 2141) PASS: lldb-shell :: SymbolFile/DWARF/inline-function-address-shared.test (1899 of 2141) PASS: lldb-unit :: Utility/./UtilityTests/StreamTest.ShiftOperatorPtr (1900 of 2141) PASS: lldb-api :: types/TestIntegerType.py (1901 of 2141) PASS: lldb-api :: commands/log/invalid-args/TestInvalidArgsLog.py (1902 of 2141) PASS: lldb-api :: lang/cpp/llvm-style/TestLLVMStyle.py (1903 of 2141) PASS: lldb-api :: functionalities/tail_call_frames/thread_step_out_or_return/TestSteppingOutWithArtificialFrames.py (1904 of 2141) PASS: lldb-api :: functionalities/lazy-loading/TestLazyLoading.py (1905 of 2141) PASS: lldb-api :: python_api/watchpoint/watchlocation/TestSetWatchlocation.py (1906 of 2141) PASS: lldb-shell :: SymbolFile/NativePDB/break-by-line.cpp (1907 of 2141) PASS: lldb-api :: python_api/sbvalue_const_addrof/TestSBValueConstAddrOf.py (1908 of 2141) PASS: lldb-api :: commands/platform/file/close/TestPlatformFileClose.py (1909 of 2141) PASS: lldb-api :: commands/gui/invalid-args/TestInvalidArgsGui.py (1910 of 2141) PASS: lldb-unit :: UnwindAssembly/x86/./UnwindAssemblyx86Tests/Testx86AssemblyInspectionEngine.TestPopR15 (1911 of 2141) PASS: lldb-api :: lang/objcxx/cxx-bridged-po/TestObjCXXBridgedPO.py (1912 of 2141) UNSUPPORTED: lldb-shell :: ScriptInterpreter/Lua/command_script_import.test (1913 of 2141) PASS: lldb-unit :: DataFormatter/./LLDBFormatterTests/TypeMatcherTests.GetMatchStringExactName (1914 of 2141) PASS: lldb-api :: functionalities/inferior-crashing/recursive-inferior/TestRecursiveInferior.py (1915 of 2141) PASS: lldb-unit :: ScriptInterpreter/Python/./ScriptInterpreterPythonTests/PythonDataObjectsTest.TestBorrowedReferences (1916 of 2141) PASS: lldb-unit :: Symbol/./SymbolTests/TestTypeSystemClang.TestRecordHasFields (1917 of 2141) PASS: lldb-unit :: ScriptInterpreter/Python/./ScriptInterpreterPythonTests/PythonDataObjectsTest.TestPythonListToStructuredList (1918 of 2141) PASS: lldb-shell :: Breakpoint/split-dwarf5-debug-stroffsets.test (1919 of 2141) PASS: lldb-unit :: Host/./HostTests/NativeProcessProtocolTest.ReadCStringFromMemory (1920 of 2141) PASS: lldb-shell :: Breakpoint/ppc64-localentry.test (1921 of 2141) UNSUPPORTED: lldb-shell :: Register/x86-64-xmm16-write.test (1922 of 2141) PASS: lldb-api :: tools/lldb-vscode/breakpoint-events/TestVSCode_breakpointEvents.py (1923 of 2141) PASS: lldb-api :: functionalities/data-formatter/data-formatter-stl/libcxx/vbool/TestDataFormatterLibcxxVBool.py (1924 of 2141) PASS: lldb-api :: functionalities/breakpoint/comp_dir_symlink/TestCompDirSymLink.py (1925 of 2141) PASS: lldb-unit :: UnwindAssembly/x86/./UnwindAssemblyx86Tests/Testx86AssemblyInspectionEngine.TestPushImm (1926 of 2141) PASS: lldb-shell :: ObjectFile/ELF/short-build-id.yaml (1927 of 2141) PASS: lldb-api :: functionalities/data-formatter/dump_dynamic/TestDumpDynamic.py (1928 of 2141) PASS: lldb-api :: lang/cpp/class_types/TestClassTypes.py (1929 of 2141) PASS: lldb-shell :: Reproducer/Functionalities/TestImageList.test (1930 of 2141) PASS: lldb-unit :: Utility/./UtilityTests/UriParserTest.MinimalPort (1931 of 2141) PASS: lldb-unit :: Utility/./UtilityTests/TimeoutTest.Construction (1932 of 2141) PASS: lldb-unit :: Utility/./UtilityTests/OptionsWithRawTest.SingleWhitespaceInput (1933 of 2141) PASS: lldb-api :: tools/lldb-vscode/coreFile/TestVSCode_coreFile.py (1934 of 2141) PASS: lldb-shell :: ObjectFile/PECOFF/basic-info.yaml (1935 of 2141) PASS: lldb-unit :: Target/./TargetTests/PathMappingListTest.RelativeTests (1936 of 2141) PASS: lldb-unit :: Host/./HostTests/FileSystemTest.FileAndDirectoryComponents (1937 of 2141) PASS: lldb-unit :: Utility/./UtilityTests/RecordReplayTest.InstrumentedBar (1938 of 2141) PASS: lldb-api :: functionalities/rerun/TestRerun.py (1939 of 2141) PASS: lldb-unit :: UnwindAssembly/x86/./UnwindAssemblyx86Tests/Testx86AssemblyInspectionEngine.TestPushESI (1940 of 2141) PASS: lldb-api :: functionalities/gdb_remote_client/TestArmRegisterDefinition.py (1941 of 2141) PASS: lldb-api :: lang/cpp/covariant-return-types/TestCovariantReturnTypes.py (1942 of 2141) PASS: lldb-api :: commands/expression/import-std-module/queue/TestQueueFromStdModule.py (1943 of 2141) PASS: lldb-unit :: Utility/./UtilityTests/DataExtractorTest.GetFloatUnaligned (1944 of 2141) PASS: lldb-api :: commands/target/dump-symtab-demangle/TestDumpSymtabDemangle.py (1945 of 2141) PASS: lldb-api :: lang/objc/print-obj/TestPrintObj.py (1946 of 2141) PASS: lldb-api :: macosx/DBGSourcePathRemapping/TestDSYMSourcePathRemapping.py (1947 of 2141) PASS: lldb-shell :: Settings/TestDisassemblyFormat.test (1948 of 2141) PASS: lldb-unit :: ScriptInterpreter/Python/./ScriptInterpreterPythonTests/PythonDataObjectsTest.TestPythonTupleSize (1949 of 2141) PASS: lldb-unit :: Utility/./UtilityTests/Flags.AllClear (1950 of 2141) UNSUPPORTED: lldb-api :: commands/expression/completion-crash-invalid-iterator/TestInvalidIteratorCompletionCrash.py (1951 of 2141) PASS: lldb-api :: functionalities/thread/concurrent_events/TestConcurrentDelayedCrashWithBreakpointSignal.py (1952 of 2141) PASS: lldb-api :: commands/breakpoint/set/func-regex/TestBreakpointRegexError.py (1953 of 2141) PASS: lldb-shell :: ObjectFile/ELF/duplicate-section.yaml (1954 of 2141) PASS: lldb-shell :: Reproducer/TestSynchronous.test (1955 of 2141) PASS: lldb-unit :: Utility/./UtilityTests/ConstStringTest.YAML (1956 of 2141) PASS: lldb-api :: tools/lldb-vscode/step/TestVSCode_step.py (1957 of 2141) PASS: lldb-unit :: Utility/./UtilityTests/StreamTeeTest.Assignment (1958 of 2141) UNSUPPORTED: lldb-shell :: SymbolFile/PDB/function-level-linking.test (1959 of 2141) PASS: lldb-api :: tools/lldb-server/TestAppleSimulatorOSType.py (1960 of 2141) UNSUPPORTED: lldb-shell :: Register/x86-64-gp-write.test (1961 of 2141) PASS: lldb-api :: commands/expression/import-std-module/list/TestListFromStdModule.py (1962 of 2141) PASS: lldb-unit :: Utility/./UtilityTests/LogChannelTest.EnableOptions (1963 of 2141) PASS: lldb-api :: lang/cpp/type_lookup/TestCppTypeLookup.py (1964 of 2141) PASS: lldb-shell :: ObjectFile/MachO/lc_build_version_notools.yaml (1965 of 2141) PASS: lldb-api :: commands/process/attach/TestProcessAttach.py (1966 of 2141) UNSUPPORTED: lldb-api :: benchmarks/turnaround/TestCompileRunToBreakpointTurnaround.py (1967 of 2141) PASS: lldb-unit :: Utility/./UtilityTests/OptionsWithRawTest.TerminatedQuote (1968 of 2141) UNSUPPORTED: lldb-shell :: Unwind/eh-frame-augment-noop.test (1969 of 2141) PASS: lldb-api :: tools/lldb-server/inferior-crash/TestGdbRemoteAbort.py (1970 of 2141) PASS: lldb-unit :: Host/./HostTests/FileSystemTest.GetPermissions (1971 of 2141) PASS: lldb-unit :: Utility/./UtilityTests/RegisterValueTest.GetSet8 (1972 of 2141) PASS: lldb-api :: python_api/sbtype_typeclass/TestSBTypeTypeClass.py (1973 of 2141) PASS: lldb-shell :: SymbolFile/DWARF/dwarf5_locations.s (1974 of 2141) PASS: lldb-shell :: ObjectFile/ELF/avr-basic-info.yaml (1975 of 2141) PASS: lldb-unit :: Symbol/./SymbolTests/TestClangASTImporter.DeportDeclTagDecl (1976 of 2141) PASS: lldb-unit :: Utility/./UtilityTests/IndexToObjectTest.ObjectForIndex (1977 of 2141) PASS: lldb-api :: python_api/sbstructureddata/TestStructuredDataAPI.py (1978 of 2141) PASS: lldb-unit :: Core/./LLDBCoreTests/MangledTest.NameIndexes_FindFunctionSymbols (1979 of 2141) PASS: lldb-shell :: BuildScript/script-args.test (1980 of 2141) PASS: lldb-shell :: SymbolFile/DWARF/find-basic-type.cpp (1981 of 2141) PASS: lldb-api :: commands/frame/diagnose/bad-reference/TestBadReference.py (1982 of 2141) PASS: lldb-api :: commands/expression/call-function/TestCallStdStringFunction.py (1983 of 2141) UNSUPPORTED: lldb-api :: functionalities/data-formatter/data-formatter-stl/libstdcpp/smart_ptr/TestDataFormatterStdSmartPtr.py (1984 of 2141) PASS: lldb-api :: functionalities/thread/thread_exit/TestThreadExit.py (1985 of 2141) UNSUPPORTED: lldb-shell :: SymbolFile/DWARF/split-dwarf-expression-eval-bug.cpp (1986 of 2141) PASS: lldb-unit :: Utility/./UtilityTests/DataExtractorTest.GetDoubleUnaligned (1987 of 2141) PASS: lldb-unit :: API/./APITests/SBCommandInterpreterTest.SingleWordCommand (1988 of 2141) PASS: lldb-shell :: SymbolFile/Breakpad/line-table.test (1989 of 2141) PASS: lldb-api :: api/check_public_api_headers/TestPublicAPIHeaders.py (1990 of 2141) PASS: lldb-shell :: Commands/command-script-import.test (1991 of 2141) PASS: lldb-unit :: ScriptInterpreter/Python/./ScriptInterpreterPythonTests/PythonDataObjectsTest.TestTypeNameResolutionNoDot (1992 of 2141) PASS: lldb-api :: functionalities/data-formatter/typedef_array/TestTypedefArray.py (1993 of 2141) UNSUPPORTED: lldb-api :: commands/register/register/aarch64_sve_registers/rw_access_static_config/TestSVERegisters.py (1994 of 2141) PASS: lldb-unit :: Utility/./UtilityTests/XcodeSDKTest.GetSDKTypeForTriple (1995 of 2141) PASS: lldb-unit :: Utility/./UtilityTests/RegularExpression.Valid (1996 of 2141) PASS: lldb-api :: lang/cpp/class-template-parameter-pack/TestClassTemplateParameterPack.py (1997 of 2141) PASS: lldb-unit :: Host/./HostTests/SocketTest.DomainGetConnectURI (1998 of 2141) PASS: lldb-api :: python_api/interpreter/TestCommandInterpreterAPI.py (1999 of 2141) PASS: lldb-unit :: Utility/./UtilityTests/RangeDataVector.FindEntryThatContains_Overlap (2000 of 2141) PASS: lldb-shell :: SymbolFile/Breakpad/unwind-via-stack-win-no-memory-info.yaml (2001 of 2141) PASS: lldb-api :: types/TestCharType.py (2002 of 2141) PASS: lldb-api :: python_api/frame/inlines/TestInlinedFrame.py (2003 of 2141) XFAIL: lldb-shell :: Register/x86-64-write.test (2004 of 2141) PASS: lldb-unit :: Utility/./UtilityTests/CompletionRequest.DuplicateFiltering (2005 of 2141) PASS: lldb-api :: functionalities/data-formatter/user-format-vs-summary/TestUserFormatVsSummary.py (2006 of 2141) UNSUPPORTED: lldb-shell :: SymbolFile/PDB/enums-layout.test (2007 of 2141) PASS: lldb-api :: lang/objc/foundation/TestFoundationDisassembly.py (2008 of 2141) PASS: lldb-shell :: Commands/command-backtrace.test (2009 of 2141) PASS: lldb-unit :: Utility/./UtilityTests/StringListTest.Assignment (2010 of 2141) PASS: lldb-unit :: Utility/./UtilityTests/StreamTest.AddressRangeInvalidRange (2011 of 2141) PASS: lldb-api :: commands/expression/deleting-implicit-copy-constructor/TestDeletingImplicitCopyConstructor.py (2012 of 2141) PASS: lldb-shell :: Reproducer/TestCaptureEnvOverride.test (2013 of 2141) PASS: lldb-unit :: Utility/./UtilityTests/StringListTest.AppendStringCString (2014 of 2141) PASS: lldb-unit :: Signals/./SignalsTests/UnixSignalsTest.VersionChange (2015 of 2141) PASS: lldb-unit :: ScriptInterpreter/Python/./ScriptInterpreterPythonTests/PythonDataObjectsTest.TestPythonFile (2016 of 2141) PASS: lldb-unit :: Utility/./UtilityTests/BinaryStreamTest.PutULEB128TwoBytes (2017 of 2141) PASS: lldb-api :: functionalities/data-formatter/data-formatter-ptr-to-array/TestPtrToArrayFormatting.py (2018 of 2141) PASS: lldb-api :: python_api/class_members/TestSBTypeClassMembers.py (2019 of 2141) PASS: lldb-unit :: Utility/./UtilityTests/RecordReplayTest.InstrumentedFooSameThis (2020 of 2141) PASS: lldb-api :: lang/objc/ivar-IMP/TestObjCiVarIMP.py (2021 of 2141) PASS: lldb-api :: functionalities/data-formatter/data-formatter-objc/TestDataFormatterObjCCF.py (2022 of 2141) PASS: lldb-api :: commands/frame/select/TestFrameSelect.py (2023 of 2141) PASS: lldb-unit :: Process/gdb-remote/./ProcessGdbRemoteTests/GDBRemoteClientBaseTest.SendPacketAndReceiveResponseWithOutputSupport (2024 of 2141) PASS: lldb-unit :: Utility/./UtilityTests/StringListTest.ForRange (2025 of 2141) PASS: lldb-unit :: Utility/./UtilityTests/UriParserTest.SchemeHostSeparator2 (2026 of 2141) PASS: lldb-shell :: Expr/TestMultilineExpr.test (2027 of 2141) PASS: lldb-unit :: Utility/./UtilityTests/UUIDTest.StringConverion (2028 of 2141) PASS: lldb-shell :: Settings/TestFrameFormatNoColor.test (2029 of 2141) PASS: lldb-unit :: debugserver/./debugserverTests/RNBSocket.AnyListen (2030 of 2141) UNSUPPORTED: lldb-api :: lang/cpp/static_members/TestCPPStaticMembers.py (2031 of 2141) PASS: lldb-api :: functionalities/data-formatter/data-formatter-disabling/TestDataFormatterDisabling.py (2032 of 2141) PASS: lldb-unit :: Utility/./UtilityTests/SerializationRountripTest.SerializeDeserializeCStringArrayNullptrElem (2033 of 2141) PASS: lldb-unit :: Utility/./UtilityTests/StreamTest.PutBytesAsRawHex8ToMixedEndian (2034 of 2141) PASS: lldb-unit :: Utility/./UtilityTests/ProcessInstanceInfo.DumpTable_invalidUID (2035 of 2141) PASS: lldb-api :: sanity/TestSettingSkipping.py (2036 of 2141) PASS: lldb-api :: functionalities/breakpoint/inlined_breakpoints/TestInlinedBreakpoints.py (2037 of 2141) PASS: lldb-unit :: Process/gdb-remote/./ProcessGdbRemoteTests/GDBRemoteCommunicationClientTest.SendGetDataPacket (2038 of 2141) PASS: lldb-unit :: Utility/./UtilityTests/NameMatchesTest.StartsWith (2039 of 2141) PASS: lldb-api :: python_api/symbol-context/two-files/TestSymbolContextTwoFiles.py (2040 of 2141) PASS: lldb-api :: lang/objc/objc++/TestObjCXX.py (2041 of 2141) PASS: lldb-api :: commands/settings/quoting/TestQuoting.py (2042 of 2141) PASS: lldb-api :: iohandler/unicode/TestUnicode.py (2043 of 2141) PASS: lldb-api :: commands/expression/import-std-module/forward_list-dbg-info-content/TestDbgInfoContentForwardListFromStdModule.py (2044 of 2141) PASS: lldb-unit :: Utility/./UtilityTests/StringListTest.ShiftStdString (2045 of 2141) PASS: lldb-unit :: Utility/./UtilityTests/UriParserTest.BracketedHostname (2046 of 2141) PASS: lldb-unit :: Utility/./UtilityTests/RangeTest.Union (2047 of 2141) PASS: lldb-unit :: Utility/./UtilityTests/DataExtractorTest.GetCStrAtEnd (2048 of 2141) PASS: lldb-api :: iohandler/autosuggestion/TestAutosuggestion.py (2049 of 2141) PASS: lldb-api :: lang/objc/objc-builtin-types/TestObjCBuiltinTypes.py (2050 of 2141) PASS: lldb-unit :: Core/./LLDBCoreTests/MangledTest.EmptyForInvalidName (2051 of 2141) PASS: lldb-api :: lang/cpp/inlines/TestInlines.py (2052 of 2141) PASS: lldb-api :: lang/c/tls_globals/TestTlsGlobals.py (2053 of 2141) PASS: lldb-unit :: Utility/./UtilityTests/StringListTest.InsertStringAtIndexEnd (2054 of 2141) UNSUPPORTED: lldb-api :: functionalities/data-formatter/data-formatter-stl/libstdcpp/unique_ptr/TestDataFormatterStdUniquePtr.py (2055 of 2141) PASS: lldb-api :: functionalities/show_location/TestShowLocationDwarf5.py (2056 of 2141) PASS: lldb-unit :: Utility/./UtilityTests/BinaryStreamTest.PutSLEB128ThreeBytes (2057 of 2141) PASS: lldb-shell :: Reproducer/TestGDBRemoteRepro.test (2058 of 2141) PASS: lldb-api :: macosx/version_zero/TestGetVersionZeroVersion.py (2059 of 2141) PASS: lldb-unit :: Utility/./UtilityTests/UriParserTest.BadPort (2060 of 2141) PASS: lldb-unit :: Utility/./UtilityTests/PassiveReplayTest.InstrumentedBarRef (2061 of 2141) PASS: lldb-unit :: Utility/./UtilityTests/BinaryStreamTest.PutULEB128SevenBytes (2062 of 2141) PASS: lldb-api :: functionalities/asan/TestReportData.py (2063 of 2141) PASS: lldb-shell :: Breakpoint/case-sensitive.test (2064 of 2141) PASS: lldb-api :: functionalities/gdb_remote_client/TestProcessConnect.py (2065 of 2141) PASS: lldb-api :: functionalities/data-formatter/data-formatter-objc/TestDataFormatterObjCNSURL.py (2066 of 2141) PASS: lldb-api :: functionalities/thread/concurrent_events/TestConcurrentWatchBreakDelay.py (2067 of 2141) PASS: lldb-unit :: Utility/./UtilityTests/ArgsTest.StringListConstructor (2068 of 2141) PASS: lldb-api :: python_api/target/TestTargetAPI.py (2069 of 2141) PASS: lldb-api :: commands/frame/var-scope/TestFrameVariableScope.py (2070 of 2141) PASS: lldb-api :: functionalities/type_completion/TestTypeCompletion.py (2071 of 2141) PASS: lldb-api :: commands/expression/po_verbosity/TestPoVerbosity.py (2072 of 2141) PASS: lldb-unit :: Utility/./UtilityTests/RangeTest.SizeTypes (2073 of 2141) PASS: lldb-api :: python_api/interpreter/TestRunCommandInterpreterAPI.py (2074 of 2141) PASS: lldb-unit :: Utility/./UtilityTests/RegularExpression.Match (2075 of 2141) PASS: lldb-api :: functionalities/thread/crash_during_step/TestCrashDuringStep.py (2076 of 2141) PASS: lldb-unit :: Process/gdb-remote/./ProcessGdbRemoteTests/GDBRemoteClientBaseTest.InterruptNoResponse (2077 of 2141) PASS: lldb-unit :: Utility/./UtilityTests/SharedCluster.ClusterManager (2078 of 2141) PASS: lldb-unit :: Utility/./UtilityTests/FileSpecTest.Equal (2079 of 2141) PASS: lldb-unit :: Utility/./UtilityTests/XcodeSDKTest.GetCanonicalNameAndConstruct (2080 of 2141) PASS: lldb-shell :: Unwind/thread-step-out-ret-addr-check.test (2081 of 2141) PASS: lldb-api :: python_api/breakpoint/TestBreakpointAPI.py (2082 of 2141) PASS: lldb-shell :: ObjectFile/PECOFF/invalid-export-table.yaml (2083 of 2141) PASS: lldb-unit :: ScriptInterpreter/Python/./ScriptInterpreterPythonTests/PythonDataObjectsTest.TestPythonBytes (2084 of 2141) PASS: lldb-shell :: Commands/command-source.test (2085 of 2141) PASS: lldb-api :: functionalities/thread/ignore_suspended/TestIgnoreSuspendedThread.py (2086 of 2141) PASS: lldb-unit :: Language/Highlighting/./HighlighterTests/HighlighterTest.ClangCommas (2087 of 2141) PASS: lldb-shell :: ObjectFile/ELF/section-permissions.yaml (2088 of 2141) PASS: lldb-unit :: ObjectFile/Breakpad/./ObjectFileBreakpadTests/StackWinRecord.parse (2089 of 2141) PASS: lldb-unit :: Process/gdb-remote/./ProcessGdbRemoteTests/GDBRemoteClientBaseTest.SendContinueAndAsyncPacket (2090 of 2141) PASS: lldb-unit :: Utility/./UtilityTests/VMRange.IsValid (2091 of 2141) PASS: lldb-api :: python_api/exprpath_synthetic/TestExprPathSynthetic.py (2092 of 2141) PASS: lldb-unit :: Utility/./UtilityTests/UriParserTest.BracketedHostnamePort (2093 of 2141) PASS: lldb-shell :: SymbolFile/NativePDB/s_constant.cpp (2094 of 2141) PASS: lldb-unit :: Utility/./UtilityTests/ArgsTest.TestQuotedTrailingBackslash (2095 of 2141) PASS: lldb-unit :: Utility/./UtilityTests/ScalarTest.TruncOrExtendTo (2096 of 2141) PASS: lldb-api :: functionalities/postmortem/minidump-new/TestMiniDumpUUID.py (2097 of 2141) PASS: lldb-api :: lang/cpp/unicode-literals/TestUnicodeLiterals.py (2098 of 2141) PASS: lldb-unit :: Utility/./UtilityTests/ArgsTest.TestTrailingBackslash (2099 of 2141) PASS: lldb-shell :: Reproducer/TestDebugSymbols.test (2100 of 2141) PASS: lldb-api :: tools/lldb-vscode/module/TestVSCode_module.py (2101 of 2141) PASS: lldb-api :: commands/expression/function_template_specialization_temp_args/TestFunctionTemplateSpecializationTempArgs.py (2102 of 2141) UNSUPPORTED: lldb-api :: functionalities/signal/handle-segv/TestHandleSegv.py (2103 of 2141) PASS: lldb-unit :: Utility/./UtilityTests/VMRange.CollectionContains (2104 of 2141) PASS: lldb-unit :: Core/./LLDBCoreTests/SourceFileCache.FindSourceFileNotFound (2105 of 2141) PASS: lldb-unit :: Symbol/./SymbolTests/TestTypeSystemClang.TestGetBasicTypeFromEnum (2106 of 2141) PASS: lldb-api :: functionalities/breakpoint/breakpoint_by_line_and_column/TestBreakpointByLineAndColumn.py (2107 of 2141) PASS: lldb-api :: lang/objc/variadic_methods/TestVariadicMethods.py (2108 of 2141) PASS: lldb-unit :: Utility/./UtilityTests/LogChannelEnabledTest.log_options (2109 of 2141) PASS: lldb-shell :: SymbolFile/DWARF/DW_OP_piece-struct.s (2110 of 2141) PASS: lldb-shell :: Minidump/disassemble-no-module.yaml (2111 of 2141) UNSUPPORTED: lldb-shell :: Register/x86-64-ymm16-read.test (2112 of 2141) PASS: lldb-unit :: ScriptInterpreter/Python/./ScriptInterpreterPythonTests/PythonDataObjectsTest.TestInstanceNameResolutionNoDot (2113 of 2141) PASS: lldb-shell :: Reproducer/TestRelativePath.test (2114 of 2141) PASS: lldb-api :: functionalities/thread/concurrent_events/TestConcurrentCrashWithSignal.py (2115 of 2141) PASS: lldb-api :: functionalities/data-formatter/data-formatter-caching/TestDataFormatterCaching.py (2116 of 2141) PASS: lldb-unit :: Utility/./UtilityTests/RangeTest.Clear (2117 of 2141) PASS: lldb-unit :: Utility/./UtilityTests/CompletionRequest.TryCompleteCurrentArgMode (2118 of 2141) UNSUPPORTED: lldb-shell :: SymbolFile/NativePDB/stack_unwinding01.cpp (2119 of 2141) PASS: lldb-unit :: UnwindAssembly/x86/./UnwindAssemblyx86Tests/Testx86AssemblyInspectionEngine.TestStackRealign8BitDisp_i386 (2120 of 2141) PASS: lldb-api :: commands/disassemble/basic/TestDisassembleBreakpoint.py (2121 of 2141) PASS: lldb-unit :: Language/Highlighting/./HighlighterTests/HighlighterTest.HighlighterSelectionPath (2122 of 2141) PASS: lldb-unit :: Utility/./UtilityTests/BinaryStreamTest.PutULEB128EightBytes (2123 of 2141) PASS: lldb-api :: lang/c/array_types/TestArrayTypes.py (2124 of 2141) PASS: lldb-api :: lang/cpp/constructors/TestCppConstructors.py (2125 of 2141) PASS: lldb-api :: commands/expression/import-std-module/no-std-module/TestMissingStdModule.py (2126 of 2141) PASS: lldb-unit :: Utility/./UtilityTests/StringExtractorTest.DecodeHexU8_InvalidHex2 (2127 of 2141) PASS: lldb-unit :: Utility/./UtilityTests/StringExtractorTest.GetHexU8_Extra_NoEof (2128 of 2141) PASS: lldb-shell :: SymbolFile/DWARF/dwp-separate-debug-file.cpp (2129 of 2141) PASS: lldb-unit :: Utility/./UtilityTests/ArgsTest.TestSingleQuotedArgWithSpace (2130 of 2141) PASS: lldb-api :: functionalities/data-formatter/parray/TestPrintArray.py (2131 of 2141) PASS: lldb-unit :: Utility/./UtilityTests/StatusTest.ErrorConstructor (2132 of 2141) PASS: lldb-unit :: Utility/./UtilityTests/AnsiTerminal.Twice (2133 of 2141) UNSUPPORTED: lldb-shell :: Register/aarch64-gp-read.test (2134 of 2141) PASS: lldb-unit :: Language/Highlighting/./HighlighterTests/HighlighterTest.ClangIdentifiers (2135 of 2141) PASS: lldb-shell :: Heap/heap-cstr.test (2136 of 2141) PASS: lldb-shell :: Reproducer/TestMultipleTargets.test (2137 of 2141) PASS: lldb-shell :: SymbolFile/DWARF/dir-separator-no-comp-dir-relative-name.s (2138 of 2141) PASS: lldb-api :: lang/cpp/char1632_t/TestChar1632T.py (2139 of 2141) PASS: lldb-api :: functionalities/thread/exit_during_expression/TestExitDuringExpression.py (2140 of 2141) PASS: lldb-api :: lang/objc/foundation/TestObjectDescriptionAPI.py (2141 of 2141) Slowest Tests: -------------------------------------------------------------------------- 123.60s: lldb-api :: macosx/simulator/TestSimulatorPlatform.py 107.56s: lldb-api :: tools/lldb-server/TestLldbGdbServer.py 73.94s: lldb-api :: types/TestLongTypesExpr.py 56.92s: lldb-api :: lang/objc/hidden-ivars/TestHiddenIvars.py 56.42s: lldb-api :: lang/objc/foundation/TestFoundationDisassembly.py 55.30s: lldb-api :: lang/objc/exceptions/TestObjCExceptions.py 54.79s: lldb-api :: lang/objc/objc-new-syntax/TestObjCNewSyntaxArray.py 53.30s: lldb-api :: lang/objc/foundation/TestObjCMethods.py 51.74s: lldb-api :: api/multithreaded/TestMultithreaded.py 45.41s: lldb-api :: types/TestIntegerTypeExpr.py 43.58s: lldb-api :: lang/cpp/namespace/TestNamespaceLookup.py 40.95s: lldb-api :: lang/objc/objc-new-syntax/TestObjCNewSyntaxLiteral.py 37.91s: lldb-api :: functionalities/completion/TestCompletion.py 36.19s: lldb-api :: python_api/target/TestTargetAPI.py 35.57s: lldb-api :: lang/objc/real-definition/TestRealDefinition.py 32.14s: lldb-api :: types/TestLongTypes.py 31.67s: lldb-api :: commands/target/basic/TestTargetCommand.py 31.58s: lldb-api :: lang/objc/objc-new-syntax/TestObjCNewSyntaxDictionary.py 30.13s: lldb-api :: tools/lldb-server/TestGdbRemoteThreadsInStopReply.py 30.03s: lldb-api :: lang/objc/foundation/TestObjCMethodsNSError.py

Hide Details

Tests Times: -------------------------------------------------------------------------- [ Range ] :: [ Percentage ] :: [ Count ] -------------------------------------------------------------------------- [120s,130s) :: [ ] :: [ 1/2141] [110s,120s) :: [ ] :: [ 1/2141] [100s,110s) :: [ ] :: [ 0/2141] [ 90s,100s) :: [ ] :: [ 0/2141] [ 80s, 90s) :: [ ] :: [ 0/2141] [ 70s, 80s) :: [ ] :: [ 1/2141] [ 60s, 70s) :: [ ] :: [ 0/2141] [ 50s, 60s) :: [ ] :: [ 6/2141] [ 40s, 50s) :: [ ] :: [ 3/2141] [ 30s, 40s) :: [ ] :: [ 9/2141] [ 20s, 30s) :: [ ] :: [ 20/2141] [ 10s, 20s) :: [** ] :: [ 153/2141] [ 0s, 10s) :: [************************************ ] :: [1947/2141] -------------------------------------------------------------------------- ******************** Failed Tests (1): lldb-api :: macosx/simulator/TestSimulatorPlatform.py

Hide Details

Hide Details

Testing Time: 1554.40s Unsupported : 150 Passed : 1984 Expectedly Failed: 6 Failed : 1 FAILED: tools/lldb/test/CMakeFiles/check-lldb-lit cd /Users/buildslave/jenkins/workspace/lldb-cmake/lldb-build/tools/lldb/test && /usr/local/Frameworks/Python.framework/Versions/3.7/bin/python3.7 /Users/buildslave/jenkins/workspace/lldb-cmake/lldb-build/./bin/llvm-lit -v --time-tests --shuffle --xunit-xml-output=/Users/buildslave/jenkins/workspace/lldb-cmake/test/results.xml -v -j 4 /Users/buildslave/jenkins/workspace/lldb-cmake/lldb-build/tools/lldb/test ninja: build stopped: subcommand failed. Command failed: Command '['/usr/bin/env', 'TERM=vt100', '/usr/local/bin/ninja', '-v', 'check-lldb']' returned non-zero exit status 1 Command: ['/usr/bin/env', 'TERM=vt100', '/usr/local/bin/ninja', '-v', 'check-lldb'] [Pipeline] } [Pipeline] // timeout [Pipeline] } [Pipeline] // stage [Pipeline] stage [Pipeline] { (Declarative: Post Actions) [Pipeline] scanForIssues [Clang (LLVM based)] Sleeping for 5 seconds due to JENKINS-32191... [Clang (LLVM based)] Parsing console log (workspace: '/Users/buildslave/jenkins/workspace/lldb-cmake') [Clang (LLVM based)] Successfully parsed console log [Clang (LLVM based)] -> found 8 issues (skipped 12 duplicates) [Clang (LLVM based)] Post processing issues on 'green-dragon-10' with source code encoding 'UTF-8' [Clang (LLVM based)] Creating SCM blamer to obtain author and commit information for affected files [Clang (LLVM based)] Creating SCM miner to obtain statistics for affected repository files [Clang (LLVM based)] Resolving file names for all issues in source directory '/Users/buildslave/jenkins/workspace/lldb-cmake' [Clang (LLVM based)] -> resolved paths in source directory (6 found, 0 not found) [Clang (LLVM based)] Resolving module names from module definitions (build.xml, pom.xml, or Manifest.mf files) [Clang (LLVM based)] -> resolved module names for 8 issues [Clang (LLVM based)] Resolving package names (or namespaces) by parsing the affected files [Clang (LLVM based)] -> resolved package names of 6 affected files [Clang (LLVM based)] No filter has been set, publishing all 8 issues [Clang (LLVM based)] Creating fingerprints for all affected code blocks to track issues over different builds [Clang (LLVM based)] -> created fingerprints for 8 issues (skipped 0 issues) [Clang (LLVM based)] Copying affected files to Jenkins' build folder '/Users/Shared/Jenkins/Home/jobs/lldb-cmake/builds/23822/files-with-issues' [Clang (LLVM based)] -> 4 copied, 2 not in workspace, 0 not-found, 0 with I/O error [Pipeline] junit Recording test results [Pipeline] } [Pipeline] // stage [Pipeline] } [Pipeline] // withEnv [Pipeline] } [Pipeline] // node [Pipeline] End of Pipeline ERROR: script returned exit code 1 Finished: FAILURE