FailedConsole Output

Skipping 9,076 KB.. Full Log
functionalities/tsan/thread_leak/TestTsanThreadLeak.py (917 of 2142)
PASS: lldb-unit :: ScriptInterpreter/Python/./ScriptInterpreterPythonTests/PythonDataObjectsTest.TestTypeNameResolutionNoDot (918 of 2142)
PASS: lldb-unit :: Platform/./LLDBPlatformTests/PlatformDarwinTest.TestParseVersionBuildDir (919 of 2142)
PASS: lldb-api :: lang/c/step-target/TestStepTarget.py (920 of 2142)
PASS: lldb-shell :: ObjectFile/ELF/PT_LOAD-overlap-PT_INTERP.yaml (921 of 2142)
PASS: lldb-shell :: ObjectFile/ELF/gnu-debuglink.yaml (922 of 2142)
UNSUPPORTED: lldb-shell :: Register/x86-ymm-write.test (923 of 2142)
PASS: lldb-api :: commands/expression/import-std-module/shared_ptr-dbg-info-content/TestSharedPtrDbgInfoContentFromStdModule.py (924 of 2142)
PASS: lldb-api :: functionalities/thread/concurrent_events/TestConcurrentSignalNWatchNBreak.py (925 of 2142)
UNSUPPORTED: lldb-shell :: SymbolFile/PDB/enums-layout.test (926 of 2142)
PASS: lldb-api :: functionalities/thread/concurrent_events/TestConcurrentTwoWatchpointsOneBreakpoint.py (927 of 2142)
PASS: lldb-unit :: Utility/./UtilityTests/UriParserTest.MinimalPortPath (928 of 2142)
PASS: lldb-api :: functionalities/data-formatter/data-formatter-caching/TestDataFormatterCaching.py (929 of 2142)
UNSUPPORTED: lldb-api :: tools/lldb-vscode/disconnect/TestVSCode_disconnect.py (930 of 2142)
PASS: lldb-api :: functionalities/gdb_remote_client/TestStopPCs.py (931 of 2142)
PASS: lldb-unit :: UnwindAssembly/x86/./UnwindAssemblyx86Tests/Testx86AssemblyInspectionEngine.TestCALLNextInsn (932 of 2142)
PASS: lldb-unit :: UnwindAssembly/x86/./UnwindAssemblyx86Tests/Testx86AssemblyInspectionEngine.TestPushR13 (933 of 2142)
PASS: lldb-unit :: UnwindAssembly/x86/./UnwindAssemblyx86Tests/Testx86AssemblyInspectionEngine.TestAddESP (934 of 2142)
PASS: lldb-api :: commands/expression/import-std-module/list/TestListFromStdModule.py (935 of 2142)
UNSUPPORTED: lldb-api :: functionalities/data-formatter/data-formatter-stl/libstdcpp/string/TestDataFormatterStdString.py (936 of 2142)
PASS: lldb-unit :: Utility/./UtilityTests/StreamTest.PutMaxHex64ByteOrderLittle (937 of 2142)
PASS: lldb-unit :: SymbolFile/DWARF/./SymbolFileDWARFTests/SymbolFileDWARFTests.TestAbbrevNullAttrValidForm (938 of 2142)
PASS: lldb-unit :: Host/./HostTests/SocketTest.DomainListenConnectAccept (939 of 2142)
PASS: lldb-api :: functionalities/data-formatter/data-formatter-stl/libstdcpp/unique_ptr/invalid/TestDataFormatterInvalidStdUniquePtr.py (940 of 2142)
PASS: lldb-unit :: Utility/./UtilityTests/BinaryStreamTest.PutULEB128SixBytes (941 of 2142)
PASS: lldb-api :: lang/cpp/dynamic-value/TestCppValueCast.py (942 of 2142)
PASS: lldb-api :: lang/objc/objc-new-syntax/TestObjCNewSyntaxLiteral.py (943 of 2142)
PASS: lldb-api :: python_api/get-value-32bit-int/TestGetValue32BitInt.py (944 of 2142)
PASS: lldb-unit :: Language/Highlighting/./HighlighterTests/HighlighterTest.ClangCursorOutOfBounds (945 of 2142)
PASS: lldb-unit :: Language/CPlusPlus/./LanguageCPlusPlusTests/CPlusPlusLanguage.MethodNameParsing (946 of 2142)
PASS: lldb-api :: api/multithreaded/TestMultithreaded.py (947 of 2142)
PASS: lldb-shell :: ScriptInterpreter/Python/eof.test (948 of 2142)
PASS: lldb-unit :: UnwindAssembly/x86/./UnwindAssemblyx86Tests/Testx86AssemblyInspectionEngine.TestPushEBX (949 of 2142)
PASS: lldb-unit :: Process/minidump/./LLDBMinidumpTests/MinidumpParserTest.MinidumpDuplicateModuleMinAddress (950 of 2142)
PASS: lldb-api :: commands/expression/xvalue/TestXValuePrinting.py (951 of 2142)
UNSUPPORTED: lldb-api :: tools/lldb-server/registers-target-xml-reading/TestGdbRemoteTargetXmlPacket.py (952 of 2142)
PASS: lldb-unit :: Expression/./ExpressionTests/CppModuleConfigurationTest.Linux (953 of 2142)
PASS: lldb-api :: python_api/lldbutil/iter/TestRegistersIterator.py (954 of 2142)
PASS: lldb-api :: python_api/lldbutil/iter/TestLLDBIterator.py (955 of 2142)
PASS: lldb-shell :: Minidump/Windows/find-module.test (956 of 2142)
PASS: lldb-shell :: ObjectFile/Breakpad/sections-trailing-func.test (957 of 2142)
UNSUPPORTED: lldb-api :: linux/add-symbols/TestTargetSymbolsAddCommand.py (958 of 2142)
PASS: lldb-api :: functionalities/mtc/simple/TestMTCSimple.py (959 of 2142)
PASS: lldb-unit :: UnwindAssembly/x86/./UnwindAssemblyx86Tests/Testx86AssemblyInspectionEngine.TestLEAVE (960 of 2142)
UNSUPPORTED: lldb-shell :: Register/x86-gp-write.test (961 of 2142)
PASS: lldb-unit :: UnwindAssembly/x86/./UnwindAssemblyx86Tests/Testx86AssemblyInspectionEngine.Test64bitFramelessBigStackFrame (962 of 2142)
PASS: lldb-api :: commands/expression/two-files/TestObjCTypeQueryFromOtherCompileUnit.py (963 of 2142)
UNSUPPORTED: lldb-api :: functionalities/unwind/ehframe/TestEhFrameUnwind.py (964 of 2142)
PASS: lldb-shell :: Commands/command-thread-select.test (965 of 2142)
PASS: lldb-unit :: Utility/./UtilityTests/StringExtractorTest.GetHexBytesAvail_Partial (966 of 2142)
PASS: lldb-unit :: Core/./LLDBCoreTests/SourceFileCache.FindSourceFileNotFound (967 of 2142)
PASS: lldb-unit :: Utility/./UtilityTests/StringListTest.SplitIntoLines (968 of 2142)
PASS: lldb-unit :: Target/./TargetTests/PathMappingListTest.AbsoluteTests (969 of 2142)
PASS: lldb-unit :: Core/./LLDBCoreTests/ModuleSpecTest.TestMachOFile (970 of 2142)
PASS: lldb-unit :: Utility/./UtilityTests/StringLexerTest.GetUnlexed (971 of 2142)
PASS: lldb-unit :: Utility/./UtilityTests/StringListTest.ShiftStdString (972 of 2142)
PASS: lldb-api :: commands/expression/entry-bp/TestExprEntryBP.py (973 of 2142)
UNSUPPORTED: lldb-shell :: SymbolFile/PDB/type-quals.test (974 of 2142)
PASS: lldb-api :: functionalities/ubsan/basic/TestUbsanBasic.py (975 of 2142)
PASS: lldb-unit :: Core/./LLDBCoreTests/RichManglingContextTest.FromCxxMethodName (976 of 2142)
UNSUPPORTED: lldb-shell :: SymbolFile/PDB/typedefs.test (977 of 2142)
PASS: lldb-api :: functionalities/data-formatter/data-formatter-synth/TestDataFormatterSynth.py (978 of 2142)
PASS: lldb-shell :: SymbolFile/DWARF/find-inline-method.s (979 of 2142)
PASS: lldb-api :: python_api/module_section/TestModuleAndSection.py (980 of 2142)
PASS: lldb-unit :: UnwindAssembly/x86/./UnwindAssemblyx86Tests/Testx86AssemblyInspectionEngine.TestPushRBP (981 of 2142)
PASS: lldb-unit :: Utility/./UtilityTests/StringExtractorTest.GetHexU8_Underflow (982 of 2142)
PASS: lldb-unit :: UnwindAssembly/ARM64/./Arm64InstEmulationTests/TestArm64InstEmulation.TestRegisterDoubleSpills (983 of 2142)
PASS: lldb-api :: functionalities/data-formatter/data-formatter-stl/libcxx/string/TestDataFormatterLibcxxString.py (984 of 2142)
PASS: lldb-api :: python_api/thread/TestThreadAPI.py (985 of 2142)
PASS: lldb-shell :: SymbolFile/DWARF/DW_OP_piece-struct.s (986 of 2142)
PASS: lldb-api :: functionalities/data-formatter/data-formatter-objc/TestDataFormatterObjCNSContainer.py (987 of 2142)
PASS: lldb-unit :: UnwindAssembly/x86/./UnwindAssemblyx86Tests/Testx86AssemblyInspectionEngine.TestPushExtended (988 of 2142)
PASS: lldb-api :: lang/objc/modules-compile-error/TestModulesCompileError.py (989 of 2142)
PASS: lldb-unit :: Utility/./UtilityTests/StreamTest.PutSLEB128 (990 of 2142)
PASS: lldb-unit :: Utility/./UtilityTests/SerializationRountripTest.SerializeDeserializeCStringNull (991 of 2142)
PASS: lldb-unit :: Utility/./UtilityTests/NameMatchesTest.RegularExpression (992 of 2142)
PASS: lldb-unit :: Utility/./UtilityTests/RecordReplayTest.InstrumentedBar (993 of 2142)
PASS: lldb-unit :: Host/./HostTests/NativeProcessProtocolTest.SetBreakpointFailRead (994 of 2142)
PASS: lldb-unit :: Utility/./UtilityTests/RegularExpression.Invalid (995 of 2142)
PASS: lldb-api :: functionalities/data-formatter/data-formatter-stl/libcxx/set/TestDataFormatterLibcxxSet.py (996 of 2142)
PASS: lldb-api :: lang/cpp/unsigned_types/TestUnsignedTypes.py (997 of 2142)
PASS: lldb-unit :: Utility/./UtilityTests/BinaryStreamTest.PutSLEB128EightBytes (998 of 2142)
PASS: lldb-api :: tools/lldb-vscode/attach/TestVSCode_attach.py (999 of 2142)
PASS: lldb-unit :: Language/Highlighting/./HighlighterTests/HighlighterTest.ClangStringLiterals (1000 of 2142)
PASS: lldb-shell :: Reproducer/TestHomeDir.test (1001 of 2142)
PASS: lldb-api :: types/TestFloatTypesExpr.py (1002 of 2142)
PASS: lldb-unit :: Utility/./UtilityTests/StringExtractorTest.GetU64LittleEndian (1003 of 2142)
PASS: lldb-shell :: Reproducer/TestDiscard.test (1004 of 2142)
PASS: lldb-api :: python_api/type/TestTypeList.py (1005 of 2142)
PASS: lldb-unit :: Utility/./UtilityTests/NameMatchesTest.Contains (1006 of 2142)
PASS: lldb-unit :: Utility/./UtilityTests/ProcessInstanceInfo.DumpTable (1007 of 2142)
PASS: lldb-unit :: Utility/./UtilityTests/BinaryStreamTest.PutSLEB128MaxValue (1008 of 2142)
PASS: lldb-unit :: Utility/./UtilityTests/ArchSpecTest.YAML (1009 of 2142)
PASS: lldb-api :: functionalities/data-formatter/typedef_array/TestTypedefArray.py (1010 of 2142)
PASS: lldb-api :: commands/frame/diagnose/bad-reference/TestBadReference.py (1011 of 2142)
PASS: lldb-shell :: SymbolFile/DWARF/debug_loc_and_loclists.s (1012 of 2142)
PASS: lldb-api :: functionalities/breakpoint/comp_dir_symlink/TestCompDirSymLink.py (1013 of 2142)
UNSUPPORTED: lldb-api :: functionalities/darwin_log/filter/regex/activity/TestDarwinLogFilterRegexActivity.py (1014 of 2142)
PASS: lldb-unit :: Utility/./UtilityTests/DataExtractorTest.UncommonAddressSize (1015 of 2142)
PASS: lldb-unit :: ScriptInterpreter/Python/./ScriptInterpreterPythonTests/PythonDataObjectsTest.TestGlobalNameResolutionNoDot (1016 of 2142)
PASS: lldb-api :: functionalities/data-formatter/hexcaps/TestDataFormatterHexCaps.py (1017 of 2142)
PASS: lldb-api :: functionalities/thread/concurrent_events/TestConcurrentWatchpointWithDelayWatchpointThreads.py (1018 of 2142)
PASS: lldb-unit :: Symbol/./SymbolTests/TestTypeSystemClang.TestIsClangType (1019 of 2142)
PASS: lldb-unit :: ObjectFile/Breakpad/./ObjectFileBreakpadTests/FuncRecord.parse (1020 of 2142)
PASS: lldb-api :: functionalities/unwind/sigtramp/TestSigtrampUnwind.py (1021 of 2142)
PASS: lldb-api :: commands/target/create-no-such-arch/TestNoSuchArch.py (1022 of 2142)
PASS: lldb-unit :: Utility/./UtilityTests/StringListTest.AppendListCStringArrayEmpty (1023 of 2142)
PASS: lldb-api :: functionalities/signal/TestSendSignal.py (1024 of 2142)
PASS: lldb-unit :: Language/Highlighting/./HighlighterTests/HighlighterTest.ClangEmptyInput (1025 of 2142)
PASS: lldb-unit :: Utility/./UtilityTests/PassiveReplayTest.InstrumentedFooInvalid (1026 of 2142)
PASS: lldb-api :: commands/expression/vector_of_enums/TestVectorOfEnums.py (1027 of 2142)
PASS: lldb-unit :: ScriptInterpreter/Python/./ScriptInterpreterPythonTests/PythonDataObjectsTest.TestPythonCallableInvoke (1028 of 2142)
PASS: lldb-shell :: Quit/TestQuitExitCodeTooManyArgs.test (1029 of 2142)
PASS: lldb-api :: commands/expression/import-std-module/list-dbg-info-content/TestDbgInfoContentListFromStdModule.py (1030 of 2142)
PASS: lldb-api :: assert_messages_test/TestAssertMessages.py (1031 of 2142)
PASS: lldb-unit :: UnwindAssembly/x86/./UnwindAssemblyx86Tests/Testx86AssemblyInspectionEngine.TestPopR15 (1032 of 2142)
UNSUPPORTED: lldb-shell :: BuildScript/toolchain-msvc.test (1033 of 2142)
PASS: lldb-shell :: SymbolFile/Breakpad/unwind-via-stack-cfi.test (1034 of 2142)
PASS: lldb-api :: functionalities/data-formatter/data-formatter-named-summaries/TestDataFormatterNamedSummaries.py (1035 of 2142)
PASS: lldb-shell :: ObjectFile/Breakpad/uuid-matching-mac.test (1036 of 2142)
PASS: lldb-shell :: Breakpoint/implicit_const_form_support.test (1037 of 2142)
PASS: lldb-unit :: Symbol/./SymbolTests/TestTypeSystemClang.TestGetTypeClassTypeOf (1038 of 2142)
PASS: lldb-unit :: Utility/./UtilityTests/ArgsTest.ReplaceArgumentAtIndexLonger (1039 of 2142)
PASS: lldb-api :: functionalities/float-display/TestFloatDisplay.py (1040 of 2142)
PASS: lldb-shell :: Commands/command-regex-unalias.test (1041 of 2142)
PASS: lldb-api :: lang/c/bitfields/TestBitfields.py (1042 of 2142)
PASS: lldb-unit :: Process/minidump/./LLDBMinidumpTests/MinidumpParserTest.GetMemory (1043 of 2142)
PASS: lldb-unit :: Utility/./UtilityTests/BinaryStreamTest.PutULEB128ThreeBytes (1044 of 2142)
PASS: lldb-api :: commands/statistics/basic/TestStats.py (1045 of 2142)
PASS: lldb-shell :: BuildScript/compiler-full-path.test (1046 of 2142)
PASS: lldb-api :: functionalities/data-formatter/data-formatter-stl/libcxx/vbool/TestDataFormatterLibcxxVBool.py (1047 of 2142)
PASS: lldb-unit :: UnwindAssembly/x86/./UnwindAssemblyx86Tests/Testx86AssemblyInspectionEngine.TestPushEAX (1048 of 2142)
PASS: lldb-unit :: ObjectFile/PECOFF/./ObjectFilePECOFFTests/PECallFrameInfoTest.Chained_eh (1049 of 2142)
UNSUPPORTED: lldb-shell :: Unwind/unwind-plan-dwarf-dump.test (1050 of 2142)
PASS: lldb-unit :: Utility/./UtilityTests/DataExtractorTest.GetFloat (1051 of 2142)
PASS: lldb-unit :: Utility/./UtilityTests/StreamTest.AddressSize (1052 of 2142)
PASS: lldb-unit :: Process/minidump/./LLDBMinidumpTests/MinidumpParserTest.MinidumpDuplicateModuleSeparateCode (1053 of 2142)
PASS: lldb-unit :: Target/./TargetTests/RemoteAwarePlatformTest.TestResolveExecutabelOnClientByPlatform (1054 of 2142)
PASS: lldb-unit :: Utility/./UtilityTests/StreamTeeTest.Assignment (1055 of 2142)
PASS: lldb-api :: functionalities/thread/concurrent_events/TestConcurrentSignalWatch.py (1056 of 2142)
PASS: lldb-unit :: ScriptInterpreter/Python/./ScriptInterpreterPythonTests/PythonDataObjectsTest.TestPythonFile (1057 of 2142)
PASS: lldb-shell :: SymbolFile/DWARF/compilercontext.ll (1058 of 2142)
PASS: lldb-unit :: Language/Highlighting/./HighlighterTests/HighlighterTest.ClangIdentifiers (1059 of 2142)
UNSUPPORTED: lldb-api :: tools/lldb-server/platform-process-connect/TestPlatformProcessConnect.py (1060 of 2142)
PASS: lldb-api :: commands/expression/import-std-module/shared_ptr/TestSharedPtrFromStdModule.py (1061 of 2142)
PASS: lldb-api :: lang/objc/objc-optimized/TestObjcOptimized.py (1062 of 2142)
PASS: lldb-unit :: Process/gdb-remote/./ProcessGdbRemoteTests/GDBRemoteClientBaseTest.SendContinueDelegateInterface (1063 of 2142)
PASS: lldb-api :: functionalities/thread/exit_during_expression/TestExitDuringExpression.py (1064 of 2142)
UNSUPPORTED: lldb-shell :: SymbolFile/PDB/variables.test (1065 of 2142)
PASS: lldb-api :: functionalities/data-formatter/data-formatter-stl/libcxx/variant/TestDataFormatterLibcxxVariant.py (1066 of 2142)
XFAIL: lldb-shell :: SymbolFile/DWARF/find-type-in-function.cpp (1067 of 2142)
PASS: lldb-unit :: Utility/./UtilityTests/UriParserTest.BracketedHostnamePort (1068 of 2142)
PASS: lldb-api :: functionalities/data-formatter/data-formatter-disabling/TestDataFormatterDisabling.py (1069 of 2142)
PASS: lldb-api :: functionalities/step-avoids-no-debug/TestStepNoDebug.py (1070 of 2142)
PASS: lldb-shell :: Minidump/breakpad-symbols.test (1071 of 2142)
PASS: lldb-unit :: SymbolFile/NativePDB/./SymbolFileNativePDBTests/PDBFPOProgramToDWARFExpressionTests.SingleAssignmentRegisterRef (1072 of 2142)
PASS: lldb-shell :: ObjectFile/ELF/PT_TLS-overlap-PT_LOAD.yaml (1073 of 2142)
PASS: lldb-api :: functionalities/breakpoint/breakpoint_by_line_and_column/TestBreakpointByLineAndColumn.py (1074 of 2142)
UNSUPPORTED: lldb-api :: lang/objc/rdar-12408181/TestRdar12408181.py (1075 of 2142)
PASS: lldb-api :: lang/objc/foundation/TestSymbolTable.py (1076 of 2142)
PASS: lldb-shell :: Minidump/no-process-id.yaml (1077 of 2142)
PASS: lldb-shell :: Reproducer/TestVerify.test (1078 of 2142)
PASS: lldb-api :: functionalities/thread/concurrent_events/TestConcurrentCrashWithWatchpointBreakpointSignal.py (1079 of 2142)
PASS: lldb-api :: functionalities/thread/concurrent_events/TestConcurrentWatchBreakDelay.py (1080 of 2142)
PASS: lldb-shell :: SymbolFile/NativePDB/source-list.cpp (1081 of 2142)
PASS: lldb-shell :: SymbolFile/DWARF/find-basic-namespace.cpp (1082 of 2142)
PASS: lldb-shell :: SymbolFile/DWARF/parallel-indexing-stress.s (1083 of 2142)
PASS: lldb-unit :: Core/./LLDBCoreTests/SourceFileCache.FindSourceFileFound (1084 of 2142)
PASS: lldb-shell :: Reproducer/Functionalities/TestExpressionEvaluation.test (1085 of 2142)
PASS: lldb-api :: lang/c/unicode/TestUnicodeSymbols.py (1086 of 2142)
PASS: lldb-api :: functionalities/inferior-crashing/TestInferiorCrashingStep.py (1087 of 2142)
PASS: lldb-api :: functionalities/target-new-solib-notifications/TestModuleLoadedNotifys.py (1088 of 2142)
PASS: lldb-api :: functionalities/data-formatter/user-format-vs-summary/TestUserFormatVsSummary.py (1089 of 2142)
PASS: lldb-unit :: Utility/./UtilityTests/ScalarTest.Promotion (1090 of 2142)
PASS: lldb-api :: lang/c/register_variables/TestRegisterVariables.py (1091 of 2142)
PASS: lldb-unit :: Utility/./UtilityTests/RegularExpression.CopyAssignment (1092 of 2142)
PASS: lldb-api :: api/listeners/TestListener.py (1093 of 2142)
PASS: lldb-unit :: Process/minidump/./LLDBMinidumpTests/MinidumpParserTest.MinidumpDuplicateModuleMappedFirst (1094 of 2142)
PASS: lldb-unit :: Process/minidump/./LLDBMinidumpTests/RegisterContextMinidump.CheckRegisterContextMinidump_ARM (1095 of 2142)
PASS: lldb-api :: iohandler/unicode/TestUnicode.py (1096 of 2142)
PASS: lldb-unit :: Expression/./ExpressionTests/DiagnosticManagerTest.PutStringMultiple (1097 of 2142)
PASS: lldb-shell :: ObjectFile/MachO/subsections.yaml (1098 of 2142)
PASS: lldb-api :: lang/c/set_values/TestSetValues.py (1099 of 2142)
PASS: lldb-unit :: Host/./HostTests/SocketAddressTest.Set (1100 of 2142)
PASS: lldb-shell :: Process/Optimization.test (1101 of 2142)
PASS: lldb-api :: python_api/process/TestProcessAPI.py (1102 of 2142)
PASS: lldb-unit :: Utility/./UtilityTests/StringListTest.JoinNonSpace (1103 of 2142)
PASS: lldb-unit :: ScriptInterpreter/Python/./ScriptInterpreterPythonTests/PythonDataObjectsTest.TestPythonDictionaryManipulation (1104 of 2142)
PASS: lldb-api :: functionalities/gdb_remote_client/TestRestartBug.py (1105 of 2142)
PASS: lldb-api :: python_api/name_lookup/TestNameLookup.py (1106 of 2142)
PASS: lldb-api :: functionalities/breakpoint/breakpoint_language/TestBreakpointLanguage.py (1107 of 2142)
XFAIL: lldb-shell :: Register/x86-mm-xmm-read.test (1108 of 2142)
PASS: lldb-unit :: API/./APITests/SBCommandInterpreterTest.SingleWordCommand (1109 of 2142)
PASS: lldb-api :: lang/c/unions/TestUnionMembers.py (1110 of 2142)
PASS: lldb-shell :: Reproducer/Functionalities/TestImageList.test (1111 of 2142)
PASS: lldb-shell :: SymbolFile/DWARF/module-ownership.mm (1112 of 2142)
PASS: lldb-shell :: ObjectFile/ELF/netbsd-exec-8.99.30-amd64.yaml (1113 of 2142)
PASS: lldb-shell :: SymbolFile/DWARF/deterministic-build.cpp (1114 of 2142)
PASS: lldb-unit :: Utility/./UtilityTests/RangeTest.SetRangeBase (1115 of 2142)
PASS: lldb-api :: lang/objc/variadic_methods/TestVariadicMethods.py (1116 of 2142)
PASS: lldb-api :: functionalities/thread/concurrent_events/TestConcurrentSignalBreak.py (1117 of 2142)
PASS: lldb-api :: lang/objc/objc-baseclass-sbtype/TestObjCBaseClassSBType.py (1118 of 2142)
PASS: lldb-unit :: UnwindAssembly/x86/./UnwindAssemblyx86Tests/Testx86AssemblyInspectionEngine.TestPopRBX (1119 of 2142)
PASS: lldb-unit :: Target/./TargetTests/ModuleCacheTest.GetAndPutUuidExists (1120 of 2142)
PASS: lldb-unit :: Expression/./ExpressionTests/CppModuleConfigurationTest.UnrelatedLibrary (1121 of 2142)
PASS: lldb-api :: functionalities/data-formatter/summary-string-onfail/Test-rdar-9974002.py (1122 of 2142)
PASS: lldb-unit :: Utility/./UtilityTests/LogChannelTest.Enable (1123 of 2142)
PASS: lldb-api :: commands/expression/import-std-module/weak_ptr-dbg-info-content/TestDbgInfoContentWeakPtrFromStdModule.py (1124 of 2142)
PASS: lldb-api :: tools/lldb-vscode/breakpoint-events/TestVSCode_breakpointEvents.py (1125 of 2142)
PASS: lldb-unit :: Platform/Android/./AdbClientTests/AdbClientTest.CreateByDeviceId_ByEnvVar (1126 of 2142)
PASS: lldb-shell :: SymbolFile/Breakpad/unwind-via-raSearch.test (1127 of 2142)
PASS: lldb-unit :: Expression/./ExpressionTests/CppModuleConfigurationTest.Xcode (1128 of 2142)
PASS: lldb-shell :: SymbolFile/NativePDB/global-classes.cpp (1129 of 2142)
PASS: lldb-unit :: Process/minidump/./LLDBMinidumpTests/RegisterContextMinidump.ConvertMinidumpContext_x86_32 (1130 of 2142)
PASS: lldb-api :: lang/objc/real-definition/TestRealDefinition.py (1131 of 2142)
PASS: lldb-api :: commands/expression/persist_objc_pointeetype/TestPersistObjCPointeeType.py (1132 of 2142)
PASS: lldb-unit :: Process/gdb-remote/./ProcessGdbRemoteTests/GDBRemoteCommunicationServerTest.SendErrorResponse_StringError (1133 of 2142)
PASS: lldb-shell :: SymbolFile/DWARF/DW_AT_data_bit_offset-DW_OP_stack_value.s (1134 of 2142)
PASS: lldb-api :: lang/cpp/class-template-parameter-pack/TestClassTemplateParameterPack.py (1135 of 2142)
PASS: lldb-api :: commands/expression/import-std-module/no-std-module/TestMissingStdModule.py (1136 of 2142)
PASS: lldb-api :: functionalities/dlopen_other_executable/TestDlopenOtherExecutable.py (1137 of 2142)
PASS: lldb-api :: commands/expression/import-std-module/forward_decl_from_module/TestForwardDeclFromStdModule.py (1138 of 2142)
PASS: lldb-unit :: Utility/./UtilityTests/StringExtractorTest.GetHexU8_Exact_NoEof (1139 of 2142)
PASS: lldb-api :: functionalities/thread/concurrent_events/TestConcurrentTwoBreakpointsOneWatchpoint.py (1140 of 2142)
PASS: lldb-api :: commands/watchpoints/hello_watchpoint/TestMyFirstWatchpoint.py (1141 of 2142)
PASS: lldb-api :: functionalities/data-formatter/data-formatter-objc/TestDataFormatterObjCNSURL.py (1142 of 2142)
PASS: lldb-unit :: Expression/./ExpressionTests/CppModuleConfigurationTest.AmbiguousCLib (1143 of 2142)
PASS: lldb-api :: functionalities/data-formatter/var-in-aggregate-misuse/TestVarInAggregateMisuse.py (1144 of 2142)
PASS: lldb-unit :: Utility/./UtilityTests/StreamTest.QuotedCString (1145 of 2142)
PASS: lldb-unit :: Utility/./UtilityTests/StringListTest.SetSize (1146 of 2142)
PASS: lldb-unit :: Utility/./UtilityTests/RangeTest.Clear (1147 of 2142)
PASS: lldb-unit :: DataFormatter/./LLDBFormatterTests/TypeMatcherTests.ExactName (1148 of 2142)
PASS: lldb-unit :: Utility/./UtilityTests/OptionsWithRawTest.MultiWordSuffix (1149 of 2142)
PASS: lldb-unit :: Utility/./UtilityTests/FileSpecTest.CopyByAppendingPathComponent (1150 of 2142)
PASS: lldb-api :: functionalities/breakpoint/breakpoint_set_restart/TestBreakpointSetRestart.py (1151 of 2142)
PASS: lldb-unit :: Utility/./UtilityTests/StringListTest.SplitIntoLinesEmpty (1152 of 2142)
PASS: lldb-api :: functionalities/breakpoint/breakpoint_options/TestBreakpointOptions.py (1153 of 2142)
PASS: lldb-unit :: Utility/./UtilityTests/FileSpecTest.GuessPathStyle (1154 of 2142)
PASS: lldb-api :: linux/builtin_trap/TestBuiltinTrap.py (1155 of 2142)
PASS: lldb-api :: functionalities/tsan/thread_numbers/TestTsanThreadNumbers.py (1156 of 2142)
PASS: lldb-shell :: SymbolFile/Breakpad/symtab-macho.test (1157 of 2142)
PASS: lldb-api :: commands/expression/ignore-artificial-constructors/TestIgnoreArtificialConstructors.py (1158 of 2142)
PASS: lldb-unit :: UnwindAssembly/x86/./UnwindAssemblyx86Tests/Testx86AssemblyInspectionEngine.Test32bitFramelessSmallStackFrame (1159 of 2142)
UNSUPPORTED: lldb-shell :: SymbolFile/PDB/udt-layout.test (1160 of 2142)
UNSUPPORTED: lldb-shell :: Register/aarch64-gp-read.test (1161 of 2142)
UNSUPPORTED: lldb-api :: tools/lldb-server/libraries-svr4/TestGdbRemoteLibrariesSvr4Support.py (1162 of 2142)
PASS: lldb-api :: functionalities/data-formatter/data-formatter-skip-summary/TestDataFormatterSkipSummary.py (1163 of 2142)
UNSUPPORTED: lldb-shell :: Register/x86-zmm-read.test (1164 of 2142)
PASS: lldb-api :: functionalities/inline-stepping/TestInlineStepping.py (1165 of 2142)
PASS: lldb-shell :: Driver/TestSingleQuote.test (1166 of 2142)
PASS: lldb-unit :: Utility/./UtilityTests/Flags.Test (1167 of 2142)
PASS: lldb-api :: lang/objc/modules-update/TestClangModulesUpdate.py (1168 of 2142)
PASS: lldb-api :: python_api/watchpoint/condition/TestWatchpointConditionAPI.py (1169 of 2142)
PASS: lldb-unit :: Utility/./UtilityTests/StreamTest.PutMaxHex64ByteOrderBig (1170 of 2142)
PASS: lldb-unit :: Symbol/./SymbolTests/TestTypeSystemClang.TestBuiltinTypeForEncodingAndBitSize (1171 of 2142)
PASS: lldb-shell :: Host/TestCustomShell.test (1172 of 2142)
PASS: lldb-api :: functionalities/data-formatter/data-formatter-stl/libcxx/unique_ptr/TestDataFormatterLibcxxUniquePtr.py (1173 of 2142)
PASS: lldb-unit :: Utility/./UtilityTests/LogChannelEnabledTest.LogVerboseThread (1174 of 2142)
PASS: lldb-api :: functionalities/data-formatter/refpointer-recursion/TestDataFormatterRefPtrRecursion.py (1175 of 2142)
PASS: lldb-api :: commands/expression/rdar42038760/TestScalarURem.py (1176 of 2142)
PASS: lldb-unit :: Symbol/./SymbolTests/PostfixExpression.ToDWARF (1177 of 2142)
PASS: lldb-shell :: Settings/TestFrameFormatMangling.test (1178 of 2142)
PASS: lldb-unit :: Utility/./UtilityTests/StreamTest.AddressRangeSize (1179 of 2142)
PASS: lldb-unit :: UnwindAssembly/x86/./UnwindAssemblyx86Tests/Testx86AssemblyInspectionEngine.TestPopR12 (1180 of 2142)
PASS: lldb-unit :: UnwindAssembly/x86/./UnwindAssemblyx86Tests/Testx86AssemblyInspectionEngine.TestPopRBP (1181 of 2142)
PASS: lldb-unit :: ScriptInterpreter/Python/./ScriptInterpreterPythonTests/PythonDataObjectsTest.TestPythonBytes (1182 of 2142)
PASS: lldb-api :: commands/expression/diagnostics/TestExprDiagnostics.py (1183 of 2142)
PASS: lldb-unit :: Utility/./UtilityTests/UriParserTest.BracketedHostnameWithColon (1184 of 2142)
PASS: lldb-api :: commands/expression/import-std-module/sysroot/TestStdModuleSysroot.py (1185 of 2142)
UNSUPPORTED: lldb-shell :: Register/arm-gp-read.test (1186 of 2142)
PASS: lldb-unit :: Process/./ProcessEventDataTests/ProcessEventDataTest.DoOnRemoval (1187 of 2142)
PASS: lldb-unit :: Utility/./UtilityTests/GeneratorTest.GetOrCreate (1188 of 2142)
PASS: lldb-api :: commands/process/launch-with-shellexpand/TestLaunchWithShellExpand.py (1189 of 2142)
PASS: lldb-api :: tools/lldb-vscode/launch/TestVSCode_launch.py (1190 of 2142)
PASS: lldb-unit :: Expression/./ExpressionTests/DiagnosticManagerTest.GetStringSeverityLabels (1191 of 2142)
PASS: lldb-unit :: Utility/./UtilityTests/ArchSpecTest.TestParseMachCPUDashSubtypeTripleExtra (1192 of 2142)
PASS: lldb-unit :: Core/./LLDBCoreTests/MangledTest.ResultForBlockInvocation (1193 of 2142)
PASS: lldb-api :: functionalities/breakpoint/breakpoint_command/TestRegexpBreakCommand.py (1194 of 2142)
UNSUPPORTED: lldb-shell :: SymbolFile/NativePDB/typedefs.cpp (1195 of 2142)
PASS: lldb-api :: lang/cpp/stl/TestSTL.py (1196 of 2142)
PASS: lldb-unit :: ScriptInterpreter/Python/./ScriptInterpreterPythonTests/PythonDataObjectsTest.TestPythonListManipulation (1197 of 2142)
PASS: lldb-shell :: Driver/TestTarget.test (1198 of 2142)
PASS: lldb-unit :: Editline/./EditlineTests/EditlineTestFixture.EditlineReceivesMultiLineText (1199 of 2142)
PASS: lldb-unit :: Utility/./UtilityTests/RangeTest.LessThan (1200 of 2142)
PASS: lldb-unit :: Target/./TargetTests/ExecutionContextTest.GetByteOrderProcess (1201 of 2142)
PASS: lldb-shell :: ObjectFile/PECOFF/invalid-export-table.yaml (1202 of 2142)
PASS: lldb-shell :: SymbolFile/DWARF/inline-function-address.ll (1203 of 2142)
PASS: lldb-shell :: ObjectFile/ELF/PT_LOAD-overlap-section.yaml (1204 of 2142)
PASS: lldb-unit :: Expression/./ExpressionTests/DWARFExpression.DW_OP_convert (1205 of 2142)
PASS: lldb-shell :: SymbolFile/DWARF/debug_aranges-empty-section.s (1206 of 2142)
PASS: lldb-api :: functionalities/load_unload/TestLoadUnload.py (1207 of 2142)
PASS: lldb-unit :: Utility/./UtilityTests/StreamTest.ChangingByteOrder (1208 of 2142)
PASS: lldb-unit :: UnwindAssembly/x86/./UnwindAssemblyx86Tests/Testx86AssemblyInspectionEngine.TestPushEBP (1209 of 2142)
PASS: lldb-unit :: Utility/./UtilityTests/StreamTest.SetIndentLevel (1210 of 2142)
PASS: lldb-api :: python_api/frame/TestFrames.py (1211 of 2142)
PASS: lldb-unit :: Utility/./UtilityTests/TimerTest.CategoryTimesStats (1212 of 2142)
PASS: lldb-shell :: SymbolFile/DWARF/DW_AT_low_pc-addrx.s (1213 of 2142)
PASS: lldb-unit :: Utility/./UtilityTests/DataExtractorTest.GetCStrAtNullOffset (1214 of 2142)
PASS: lldb-unit :: Utility/./UtilityTests/OptionsWithRawTest.EmptySuffixSingleWhitespace (1215 of 2142)
PASS: lldb-api :: python_api/interpreter/TestRunCommandInterpreterAPI.py (1216 of 2142)
PASS: lldb-api :: lang/c/struct_types/TestStructTypes.py (1217 of 2142)
PASS: lldb-unit :: Utility/./UtilityTests/ArgsTest.TestSingleArg (1218 of 2142)
PASS: lldb-unit :: UnwindAssembly/x86/./UnwindAssemblyx86Tests/Testx86AssemblyInspectionEngine.Test32bitFramelessBigStackFrame (1219 of 2142)
PASS: lldb-api :: lang/objc/hidden-ivars/TestHiddenIvars.py (1220 of 2142)
PASS: lldb-unit :: Utility/./UtilityTests/NameMatchesTest.Ignore (1221 of 2142)
PASS: lldb-api :: functionalities/breakpoint/breakpoint_command/TestBreakpointCommand.py (1222 of 2142)
PASS: lldb-shell :: Settings/TestStopCommandSourceOnError.test (1223 of 2142)
PASS: lldb-api :: commands/log/basic/TestLogging.py (1224 of 2142)
PASS: lldb-unit :: Host/./HostTests/SocketTest.TCPGetConnectURI (1225 of 2142)
PASS: lldb-unit :: Utility/./UtilityTests/VASprintfTest.EncodingError (1226 of 2142)
Cannot contact green-dragon-10: java.lang.InterruptedException
TIMEOUT: lldb-api :: macosx/simulator/TestSimulatorPlatform.py (1227 of 2142)
******************** TEST 'lldb-api :: macosx/simulator/TestSimulatorPlatform.py' FAILED ********************
Script:
--
/usr/local/Frameworks/Python.framework/Versions/3.7/bin/python3.7 /Users/buildslave/jenkins/workspace/lldb-cmake/llvm-project/lldb/test/API/dotest.py -s /Users/buildslave/jenkins/workspace/lldb-cmake/lldb-build/lldb-test-traces -S nm -u CXXFLAGS -u CFLAGS --codesign-identity - --server /Users/buildslave/jenkins/workspace/lldb-cmake/lldb-build/./bin/debugserver --arch x86_64 --build-dir /Users/buildslave/jenkins/workspace/lldb-cmake/lldb-build/lldb-test-build.noindex -s=/Users/buildslave/jenkins/workspace/lldb-cmake/test/logs -t --env TERM=vt100 --env LLVM_LIBS_DIR=/Users/buildslave/jenkins/workspace/lldb-cmake/lldb-build/./lib --arch x86_64 --build-dir /Users/buildslave/jenkins/workspace/lldb-cmake/lldb-build/lldb-test-build.noindex --lldb-module-cache-dir /Users/buildslave/jenkins/workspace/lldb-cmake/lldb-build/lldb-test-build.noindex/module-cache-lldb/lldb-api --clang-module-cache-dir /Users/buildslave/jenkins/workspace/lldb-cmake/lldb-build/lldb-test-build.noindex/module-cache-clang/lldb-api --executable /Users/buildslave/jenkins/workspace/lldb-cmake/lldb-build/./bin/lldb --compiler /Users/buildslave/jenkins/workspace/lldb-cmake/lldb-build/./bin/clang --dsymutil /Users/buildslave/jenkins/workspace/lldb-cmake/lldb-build/./bin/dsymutil --filecheck /Users/buildslave/jenkins/workspace/lldb-cmake/lldb-build/./bin/FileCheck --yaml2obj /Users/buildslave/jenkins/workspace/lldb-cmake/lldb-build/./bin/yaml2obj --lldb-libs-dir /Users/buildslave/jenkins/workspace/lldb-cmake/lldb-build/./lib /Users/buildslave/jenkins/workspace/lldb-cmake/llvm-project/lldb/test/API/macosx/simulator -p TestSimulatorPlatform.py
--
Exit Code: -9
Timeout: Reached timeout of 600 seconds

Hide Details

Command Output (stdout): -- lldb version 12.0.99 clang revision e328456a9e6fa8c1ef05e183c1506ed837005847 llvm revision e328456a9e6fa8c1ef05e183c1506ed837005847

Hide Details

-- Command Output (stderr): --

Hide Details

Session logs for test failures/errors/unexpected successes will go into directory '/Users/buildslave/jenkins/workspace/lldb-cmake/test/logs' Change dir to: /Users/buildslave/jenkins/workspace/lldb-cmake/llvm-project/lldb/test/API/macosx/simulator runCmd: settings clear -all output:

Hide Details

runCmd: settings set symbols.enable-external-lookup false output:

Hide Details

runCmd: settings set target.inherit-tcc true output:

Hide Details

runCmd: settings set target.auto-apply-fixits false output:

Hide Details

runCmd: settings set plugin.process.gdb-remote.packet-timeout 60 output:

Hide Details

runCmd: settings set symbols.clang-modules-cache-path "/Users/buildslave/jenkins/workspace/lldb-cmake/lldb-build/lldb-test-build.noindex/module-cache-lldb/lldb-api" output:

Hide Details

runCmd: settings set use-color false output:

Hide Details

runCmd: setting set target.prefer-dynamic-value no-dynamic-values output:

Hide Details

runCmd: log enable gdb-remote packets -f /Users/buildslave/jenkins/workspace/lldb-cmake/lldb-build/lldb-test-build.noindex/macosx/simulator/TestSimulatorPlatform.test_ios/packets.log output:

Hide Details

Ran command: "log enable gdb-remote packets -f /Users/buildslave/jenkins/workspace/lldb-cmake/lldb-build/lldb-test-build.noindex/macosx/simulator/TestSimulatorPlatform.test_ios/packets.log"

Hide Details

Got output:

Hide Details

Hide Details

runCmd: image list -b -t output: [ 0] a.out x86_64-apple-ios13.5.0-simulator [ 1] dyld x86_64-apple-macosx10.15.0 [ 2] dyld_sim x86_64-apple-ios13.5.0-simulator [ 3] libc++.1.dylib x86_64-apple-ios13.5.0-simulator [ 4] libSystem.B.dylib x86_64-apple-ios13.5.0-simulator [ 5] libc++abi.dylib x86_64-apple-ios13.5.0-simulator [ 6] libcache.dylib x86_64-apple-ios13.5.0-simulator [ 7] libcommonCrypto.dylib x86_64-apple-ios13.5.0-simulator [ 8] libcompiler_rt.dylib x86_64-apple-ios13.5.0-simulator [ 9] libcopyfile.dylib x86_64-apple-ios13.5.0-simulator [ 10] libcorecrypto.dylib x86_64-apple-ios13.5.0-simulator [ 11] libdispatch.dylib x86_64-apple-ios13.5.0-simulator [ 12] libdyld.dylib x86_64-apple-ios13.5.0-simulator [ 13] liblaunch.dylib x86_64-apple-ios13.5.0-simulator [ 14] libmacho.dylib x86_64-apple-ios13.5.0-simulator [ 15] libremovefile.dylib x86_64-apple-ios13.5.0-simulator [ 16] libsystem_asl.dylib x86_64-apple-ios13.5.0-simulator [ 17] libsystem_blocks.dylib x86_64-apple-ios13.5.0-simulator [ 18] libsystem_c.dylib x86_64-apple-ios13.5.0-simulator [ 19] libsystem_configuration.dylib x86_64-apple-ios13.5.0-simulator [ 20] libsystem_containermanager.dylib x86_64-apple-ios13.5.0-simulator [ 21] libsystem_coreservices.dylib x86_64-apple-ios13.5.0-simulator [ 22] libsystem_darwin.dylib x86_64-apple-ios13.5.0-simulator [ 23] libsystem_dnssd.dylib x86_64-apple-ios13.5.0-simulator [ 24] libsystem_featureflags.dylib x86_64-apple-ios13.5.0-simulator [ 25] libsystem_info.dylib x86_64-apple-ios13.5.0-simulator [ 26] libsystem_m.dylib x86_64-apple-ios13.5.0-simulator [ 27] libsystem_malloc.dylib x86_64-apple-ios13.5.0-simulator [ 28] libsystem_notify.dylib x86_64-apple-ios13.5.0-simulator [ 29] libsystem_sandbox.dylib x86_64-apple-ios13.5.0-simulator [ 30] libsystem_sim_kernel.dylib x86_64-apple-ios13.5.0-simulator [ 31] libsystem_sim_platform.dylib x86_64-apple-ios13.5.0-simulator [ 32] libsystem_sim_pthread.dylib x86_64-apple-ios13.5.0-simulator [ 33] libsystem_trace.dylib x86_64-apple-ios13.5.0-simulator [ 34] libunwind.dylib x86_64-apple-ios13.5.0-simulator [ 35] libxpc.dylib x86_64-apple-ios13.5.0-simulator [ 36] libsystem_sim_pthread_host.dylib x86_64-apple-ios13.5.0-simulator [ 37] libsystem_sim_platform_host.dylib x86_64-apple-ios13.5.0-simulator [ 38] libsystem_sim_kernel_host.dylib x86_64-apple-ios13.5.0-simulator [ 39] libsystem_kernel.dylib x86_64-apple-macosx10.15.0-simulator(0x00007fff51b5a000) [ 40] libobjc.A.dylib x86_64-apple-ios13.5.0-simulator [ 41] libsystem_platform.dylib x86_64-apple-macosx10.15.0-simulator(0x00007fff51bfd000) [ 42] libsystem_pthread.dylib x86_64-apple-macosx10.15.0-simulator(0x00007fff51c06000)

Hide Details

Hide Details

Ran command: "image list -b -t"

Hide Details

Got output: [ 0] a.out x86_64-apple-ios13.5.0-simulator [ 1] dyld x86_64-apple-macosx10.15.0 [ 2] dyld_sim x86_64-apple-ios13.5.0-simulator [ 3] libc++.1.dylib x86_64-apple-ios13.5.0-simulator [ 4] libSystem.B.dylib x86_64-apple-ios13.5.0-simulator [ 5] libc++abi.dylib x86_64-apple-ios13.5.0-simulator [ 6] libcache.dylib x86_64-apple-ios13.5.0-simulator [ 7] libcommonCrypto.dylib x86_64-apple-ios13.5.0-simulator [ 8] libcompiler_rt.dylib x86_64-apple-ios13.5.0-simulator [ 9] libcopyfile.dylib x86_64-apple-ios13.5.0-simulator [ 10] libcorecrypto.dylib x86_64-apple-ios13.5.0-simulator [ 11] libdispatch.dylib x86_64-apple-ios13.5.0-simulator [ 12] libdyld.dylib x86_64-apple-ios13.5.0-simulator [ 13] liblaunch.dylib x86_64-apple-ios13.5.0-simulator [ 14] libmacho.dylib x86_64-apple-ios13.5.0-simulator [ 15] libremovefile.dylib x86_64-apple-ios13.5.0-simulator [ 16] libsystem_asl.dylib x86_64-apple-ios13.5.0-simulator [ 17] libsystem_blocks.dylib x86_64-apple-ios13.5.0-simulator [ 18] libsystem_c.dylib x86_64-apple-ios13.5.0-simulator [ 19] libsystem_configuration.dylib x86_64-apple-ios13.5.0-simulator [ 20] libsystem_containermanager.dylib x86_64-apple-ios13.5.0-simulator [ 21] libsystem_coreservices.dylib x86_64-apple-ios13.5.0-simulator [ 22] libsystem_darwin.dylib x86_64-apple-ios13.5.0-simulator [ 23] libsystem_dnssd.dylib x86_64-apple-ios13.5.0-simulator [ 24] libsystem_featureflags.dylib x86_64-apple-ios13.5.0-simulator [ 25] libsystem_info.dylib x86_64-apple-ios13.5.0-simulator [ 26] libsystem_m.dylib x86_64-apple-ios13.5.0-simulator [ 27] libsystem_malloc.dylib x86_64-apple-ios13.5.0-simulator [ 28] libsystem_notify.dylib x86_64-apple-ios13.5.0-simulator [ 29] libsystem_sandbox.dylib x86_64-apple-ios13.5.0-simulator [ 30] libsystem_sim_kernel.dylib x86_64-apple-ios13.5.0-simulator [ 31] libsystem_sim_platform.dylib x86_64-apple-ios13.5.0-simulator [ 32] libsystem_sim_pthread.dylib x86_64-apple-ios13.5.0-simulator [ 33] libsystem_trace.dylib x86_64-apple-ios13.5.0-simulator [ 34] libunwind.dylib x86_64-apple-ios13.5.0-simulator [ 35] libxpc.dylib x86_64-apple-ios13.5.0-simulator [ 36] libsystem_sim_pthread_host.dylib x86_64-apple-ios13.5.0-simulator [ 37] libsystem_sim_platform_host.dylib x86_64-apple-ios13.5.0-simulator [ 38] libsystem_sim_kernel_host.dylib x86_64-apple-ios13.5.0-simulator [ 39] libsystem_kernel.dylib x86_64-apple-macosx10.15.0-simulator(0x00007fff51b5a000) [ 40] libobjc.A.dylib x86_64-apple-ios13.5.0-simulator [ 41] libsystem_platform.dylib x86_64-apple-macosx10.15.0-simulator(0x00007fff51bfd000) [ 42] libsystem_pthread.dylib x86_64-apple-macosx10.15.0-simulator(0x00007fff51c06000)

Hide Details

Expecting regex pattern: "a\.out x86_64-apple-ios13.5.*-simulator" (was found, matched "a.out x86_64-apple-ios13.5.0-simulator")

Hide Details

<bound method SBProcess.Kill of <lldb.SBProcess; proxy of <Swig Object of type 'lldb::SBProcess *' at 0x106cbff90> >>: success

Hide Details

PASS: LLDB (/Users/buildslave/jenkins/workspace/lldb-cmake/lldb-build/bin/clang-x86_64) :: test_ios (TestSimulatorPlatform.TestSimulatorPlatformLaunching) runCmd: settings clear -all output:

Hide Details

runCmd: settings set symbols.enable-external-lookup false output:

Hide Details

runCmd: settings set target.inherit-tcc true output:

Hide Details

runCmd: settings set target.auto-apply-fixits false output:

Hide Details

runCmd: settings set plugin.process.gdb-remote.packet-timeout 60 output:

Hide Details

runCmd: settings set symbols.clang-modules-cache-path "/Users/buildslave/jenkins/workspace/lldb-cmake/lldb-build/lldb-test-build.noindex/module-cache-lldb/lldb-api" output:

Hide Details

runCmd: settings set use-color false output:

Hide Details

runCmd: setting set target.prefer-dynamic-value no-dynamic-values output:

Hide Details

UNSUPPORTED: LLDB (/Users/buildslave/jenkins/workspace/lldb-cmake/lldb-build/bin/clang-x86_64) :: test_ios_backdeploy_apple_silicon (TestSimulatorPlatform.TestSimulatorPlatformLaunching) (skipping due to the following parameter(s): architecture) runCmd: settings clear -all output:

Hide Details

runCmd: settings set symbols.enable-external-lookup false output:

Hide Details

runCmd: settings set target.inherit-tcc true output:

Hide Details

runCmd: settings set target.auto-apply-fixits false output:

Hide Details

runCmd: settings set plugin.process.gdb-remote.packet-timeout 60 output:

Hide Details

runCmd: settings set symbols.clang-modules-cache-path "/Users/buildslave/jenkins/workspace/lldb-cmake/lldb-build/lldb-test-build.noindex/module-cache-lldb/lldb-api" output:

Hide Details

runCmd: settings set use-color false output:

Hide Details

runCmd: setting set target.prefer-dynamic-value no-dynamic-values output:

Hide Details

runCmd: log enable gdb-remote packets -f /Users/buildslave/jenkins/workspace/lldb-cmake/lldb-build/lldb-test-build.noindex/macosx/simulator/TestSimulatorPlatform.test_ios_backdeploy_x86/packets.log output:

Hide Details

Ran command: "log enable gdb-remote packets -f /Users/buildslave/jenkins/workspace/lldb-cmake/lldb-build/lldb-test-build.noindex/macosx/simulator/TestSimulatorPlatform.test_ios_backdeploy_x86/packets.log"

Hide Details

Got output:

Hide Details

Hide Details

runCmd: image list -b -t output: [ 0] a.out x86_64-apple-ios13.0.0-simulator [ 1] dyld x86_64-apple-macosx10.15.0 [ 2] dyld_sim x86_64-apple-ios13.5.0-simulator [ 3] libc++.1.dylib x86_64-apple-ios13.5.0-simulator [ 4] libSystem.B.dylib x86_64-apple-ios13.5.0-simulator [ 5] libc++abi.dylib x86_64-apple-ios13.5.0-simulator [ 6] libcache.dylib x86_64-apple-ios13.5.0-simulator [ 7] libcommonCrypto.dylib x86_64-apple-ios13.5.0-simulator [ 8] libcompiler_rt.dylib x86_64-apple-ios13.5.0-simulator [ 9] libcopyfile.dylib x86_64-apple-ios13.5.0-simulator [ 10] libcorecrypto.dylib x86_64-apple-ios13.5.0-simulator [ 11] libdispatch.dylib x86_64-apple-ios13.5.0-simulator [ 12] libdyld.dylib x86_64-apple-ios13.5.0-simulator [ 13] liblaunch.dylib x86_64-apple-ios13.5.0-simulator [ 14] libmacho.dylib x86_64-apple-ios13.5.0-simulator [ 15] libremovefile.dylib x86_64-apple-ios13.5.0-simulator [ 16] libsystem_asl.dylib x86_64-apple-ios13.5.0-simulator [ 17] libsystem_blocks.dylib x86_64-apple-ios13.5.0-simulator [ 18] libsystem_c.dylib x86_64-apple-ios13.5.0-simulator [ 19] libsystem_configuration.dylib x86_64-apple-ios13.5.0-simulator [ 20] libsystem_containermanager.dylib x86_64-apple-ios13.5.0-simulator [ 21] libsystem_coreservices.dylib x86_64-apple-ios13.5.0-simulator [ 22] libsystem_darwin.dylib x86_64-apple-ios13.5.0-simulator [ 23] libsystem_dnssd.dylib x86_64-apple-ios13.5.0-simulator [ 24] libsystem_featureflags.dylib x86_64-apple-ios13.5.0-simulator [ 25] libsystem_info.dylib x86_64-apple-ios13.5.0-simulator [ 26] libsystem_m.dylib x86_64-apple-ios13.5.0-simulator [ 27] libsystem_malloc.dylib x86_64-apple-ios13.5.0-simulator [ 28] libsystem_notify.dylib x86_64-apple-ios13.5.0-simulator [ 29] libsystem_sandbox.dylib x86_64-apple-ios13.5.0-simulator [ 30] libsystem_sim_kernel.dylib x86_64-apple-ios13.5.0-simulator [ 31] libsystem_sim_platform.dylib x86_64-apple-ios13.5.0-simulator [ 32] libsystem_sim_pthread.dylib x86_64-apple-ios13.5.0-simulator [ 33] libsystem_trace.dylib x86_64-apple-ios13.5.0-simulator [ 34] libunwind.dylib x86_64-apple-ios13.5.0-simulator [ 35] libxpc.dylib x86_64-apple-ios13.5.0-simulator [ 36] libsystem_sim_pthread_host.dylib x86_64-apple-ios13.5.0-simulator [ 37] libsystem_sim_platform_host.dylib x86_64-apple-ios13.5.0-simulator [ 38] libsystem_sim_kernel_host.dylib x86_64-apple-ios13.5.0-simulator [ 39] libsystem_kernel.dylib x86_64-apple-macosx10.15.0-simulator(0x00007fff51b5a000) [ 40] libobjc.A.dylib x86_64-apple-ios13.5.0-simulator [ 41] libsystem_platform.dylib x86_64-apple-macosx10.15.0-simulator(0x00007fff51bfd000) [ 42] libsystem_pthread.dylib x86_64-apple-macosx10.15.0-simulator(0x00007fff51c06000)

Hide Details

Hide Details

Ran command: "image list -b -t"

Hide Details

Got output: [ 0] a.out x86_64-apple-ios13.0.0-simulator [ 1] dyld x86_64-apple-macosx10.15.0 [ 2] dyld_sim x86_64-apple-ios13.5.0-simulator [ 3] libc++.1.dylib x86_64-apple-ios13.5.0-simulator [ 4] libSystem.B.dylib x86_64-apple-ios13.5.0-simulator [ 5] libc++abi.dylib x86_64-apple-ios13.5.0-simulator [ 6] libcache.dylib x86_64-apple-ios13.5.0-simulator [ 7] libcommonCrypto.dylib x86_64-apple-ios13.5.0-simulator [ 8] libcompiler_rt.dylib x86_64-apple-ios13.5.0-simulator [ 9] libcopyfile.dylib x86_64-apple-ios13.5.0-simulator [ 10] libcorecrypto.dylib x86_64-apple-ios13.5.0-simulator [ 11] libdispatch.dylib x86_64-apple-ios13.5.0-simulator [ 12] libdyld.dylib x86_64-apple-ios13.5.0-simulator [ 13] liblaunch.dylib x86_64-apple-ios13.5.0-simulator [ 14] libmacho.dylib x86_64-apple-ios13.5.0-simulator [ 15] libremovefile.dylib x86_64-apple-ios13.5.0-simulator [ 16] libsystem_asl.dylib x86_64-apple-ios13.5.0-simulator [ 17] libsystem_blocks.dylib x86_64-apple-ios13.5.0-simulator [ 18] libsystem_c.dylib x86_64-apple-ios13.5.0-simulator [ 19] libsystem_configuration.dylib x86_64-apple-ios13.5.0-simulator [ 20] libsystem_containermanager.dylib x86_64-apple-ios13.5.0-simulator [ 21] libsystem_coreservices.dylib x86_64-apple-ios13.5.0-simulator [ 22] libsystem_darwin.dylib x86_64-apple-ios13.5.0-simulator [ 23] libsystem_dnssd.dylib x86_64-apple-ios13.5.0-simulator [ 24] libsystem_featureflags.dylib x86_64-apple-ios13.5.0-simulator [ 25] libsystem_info.dylib x86_64-apple-ios13.5.0-simulator [ 26] libsystem_m.dylib x86_64-apple-ios13.5.0-simulator [ 27] libsystem_malloc.dylib x86_64-apple-ios13.5.0-simulator [ 28] libsystem_notify.dylib x86_64-apple-ios13.5.0-simulator [ 29] libsystem_sandbox.dylib x86_64-apple-ios13.5.0-simulator [ 30] libsystem_sim_kernel.dylib x86_64-apple-ios13.5.0-simulator [ 31] libsystem_sim_platform.dylib x86_64-apple-ios13.5.0-simulator [ 32] libsystem_sim_pthread.dylib x86_64-apple-ios13.5.0-simulator [ 33] libsystem_trace.dylib x86_64-apple-ios13.5.0-simulator [ 34] libunwind.dylib x86_64-apple-ios13.5.0-simulator [ 35] libxpc.dylib x86_64-apple-ios13.5.0-simulator [ 36] libsystem_sim_pthread_host.dylib x86_64-apple-ios13.5.0-simulator [ 37] libsystem_sim_platform_host.dylib x86_64-apple-ios13.5.0-simulator [ 38] libsystem_sim_kernel_host.dylib x86_64-apple-ios13.5.0-simulator [ 39] libsystem_kernel.dylib x86_64-apple-macosx10.15.0-simulator(0x00007fff51b5a000) [ 40] libobjc.A.dylib x86_64-apple-ios13.5.0-simulator [ 41] libsystem_platform.dylib x86_64-apple-macosx10.15.0-simulator(0x00007fff51bfd000) [ 42] libsystem_pthread.dylib x86_64-apple-macosx10.15.0-simulator(0x00007fff51c06000)

Hide Details

Expecting regex pattern: "a\.out x86_64-apple-ios13.0.*-simulator" (was found, matched "a.out x86_64-apple-ios13.0.0-simulator")

Hide Details

<bound method SBProcess.Kill of <lldb.SBProcess; proxy of <Swig Object of type 'lldb::SBProcess *' at 0x105b3fd80> >>: success

Hide Details

PASS: LLDB (/Users/buildslave/jenkins/workspace/lldb-cmake/lldb-build/bin/clang-x86_64) :: test_ios_backdeploy_x86 (TestSimulatorPlatform.TestSimulatorPlatformLaunching) runCmd: settings clear -all output:

Hide Details

runCmd: settings set symbols.enable-external-lookup false output:

Hide Details

runCmd: settings set target.inherit-tcc true output:

Hide Details

runCmd: settings set target.auto-apply-fixits false output:

Hide Details

runCmd: settings set plugin.process.gdb-remote.packet-timeout 60 output:

Hide Details

runCmd: settings set symbols.clang-modules-cache-path "/Users/buildslave/jenkins/workspace/lldb-cmake/lldb-build/lldb-test-build.noindex/module-cache-lldb/lldb-api" output:

Hide Details

runCmd: settings set use-color false output:

Hide Details

runCmd: setting set target.prefer-dynamic-value no-dynamic-values output:

Hide Details

runCmd: log enable gdb-remote packets -f /Users/buildslave/jenkins/workspace/lldb-cmake/lldb-build/lldb-test-build.noindex/macosx/simulator/TestSimulatorPlatform.test_lc_version_min_iphoneos/packets.log output:

Hide Details

Ran command: "log enable gdb-remote packets -f /Users/buildslave/jenkins/workspace/lldb-cmake/lldb-build/lldb-test-build.noindex/macosx/simulator/TestSimulatorPlatform.test_lc_version_min_iphoneos/packets.log"

Hide Details

Got output:

Hide Details

Hide Details

runCmd: image list -b -t output: [ 0] a.out x86_64-apple-ios11.0.0-simulator [ 1] dyld x86_64-apple-macosx10.15.0 [ 2] dyld_sim x86_64-apple-ios13.5.0-simulator [ 3] libc++.1.dylib x86_64-apple-ios13.5.0-simulator [ 4] libSystem.B.dylib x86_64-apple-ios13.5.0-simulator [ 5] libc++abi.dylib x86_64-apple-ios13.5.0-simulator [ 6] libcache.dylib x86_64-apple-ios13.5.0-simulator [ 7] libcommonCrypto.dylib x86_64-apple-ios13.5.0-simulator [ 8] libcompiler_rt.dylib x86_64-apple-ios13.5.0-simulator [ 9] libcopyfile.dylib x86_64-apple-ios13.5.0-simulator [ 10] libcorecrypto.dylib x86_64-apple-ios13.5.0-simulator [ 11] libdispatch.dylib x86_64-apple-ios13.5.0-simulator [ 12] libdyld.dylib x86_64-apple-ios13.5.0-simulator [ 13] liblaunch.dylib x86_64-apple-ios13.5.0-simulator [ 14] libmacho.dylib x86_64-apple-ios13.5.0-simulator [ 15] libremovefile.dylib x86_64-apple-ios13.5.0-simulator [ 16] libsystem_asl.dylib x86_64-apple-ios13.5.0-simulator [ 17] libsystem_blocks.dylib x86_64-apple-ios13.5.0-simulator [ 18] libsystem_c.dylib x86_64-apple-ios13.5.0-simulator [ 19] libsystem_configuration.dylib x86_64-apple-ios13.5.0-simulator [ 20] libsystem_containermanager.dylib x86_64-apple-ios13.5.0-simulator [ 21] libsystem_coreservices.dylib x86_64-apple-ios13.5.0-simulator [ 22] libsystem_darwin.dylib x86_64-apple-ios13.5.0-simulator [ 23] libsystem_dnssd.dylib x86_64-apple-ios13.5.0-simulator [ 24] libsystem_featureflags.dylib x86_64-apple-ios13.5.0-simulator [ 25] libsystem_info.dylib x86_64-apple-ios13.5.0-simulator [ 26] libsystem_m.dylib x86_64-apple-ios13.5.0-simulator [ 27] libsystem_malloc.dylib x86_64-apple-ios13.5.0-simulator [ 28] libsystem_notify.dylib x86_64-apple-ios13.5.0-simulator [ 29] libsystem_sandbox.dylib x86_64-apple-ios13.5.0-simulator [ 30] libsystem_sim_kernel.dylib x86_64-apple-ios13.5.0-simulator [ 31] libsystem_sim_platform.dylib x86_64-apple-ios13.5.0-simulator [ 32] libsystem_sim_pthread.dylib x86_64-apple-ios13.5.0-simulator [ 33] libsystem_trace.dylib x86_64-apple-ios13.5.0-simulator [ 34] libunwind.dylib x86_64-apple-ios13.5.0-simulator [ 35] libxpc.dylib x86_64-apple-ios13.5.0-simulator [ 36] libsystem_sim_pthread_host.dylib x86_64-apple-ios13.5.0-simulator [ 37] libsystem_sim_platform_host.dylib x86_64-apple-ios13.5.0-simulator [ 38] libsystem_sim_kernel_host.dylib x86_64-apple-ios13.5.0-simulator [ 39] libsystem_kernel.dylib x86_64-apple-macosx10.15.0-simulator(0x00007fff51b5a000) [ 40] libobjc.A.dylib x86_64-apple-ios13.5.0-simulator [ 41] libsystem_platform.dylib x86_64-apple-macosx10.15.0-simulator(0x00007fff51bfd000) [ 42] libsystem_pthread.dylib x86_64-apple-macosx10.15.0-simulator(0x00007fff51c06000)

Hide Details

Hide Details

Ran command: "image list -b -t"

Hide Details

Got output: [ 0] a.out x86_64-apple-ios11.0.0-simulator [ 1] dyld x86_64-apple-macosx10.15.0 [ 2] dyld_sim x86_64-apple-ios13.5.0-simulator [ 3] libc++.1.dylib x86_64-apple-ios13.5.0-simulator [ 4] libSystem.B.dylib x86_64-apple-ios13.5.0-simulator [ 5] libc++abi.dylib x86_64-apple-ios13.5.0-simulator [ 6] libcache.dylib x86_64-apple-ios13.5.0-simulator [ 7] libcommonCrypto.dylib x86_64-apple-ios13.5.0-simulator [ 8] libcompiler_rt.dylib x86_64-apple-ios13.5.0-simulator [ 9] libcopyfile.dylib x86_64-apple-ios13.5.0-simulator [ 10] libcorecrypto.dylib x86_64-apple-ios13.5.0-simulator [ 11] libdispatch.dylib x86_64-apple-ios13.5.0-simulator [ 12] libdyld.dylib x86_64-apple-ios13.5.0-simulator [ 13] liblaunch.dylib x86_64-apple-ios13.5.0-simulator [ 14] libmacho.dylib x86_64-apple-ios13.5.0-simulator [ 15] libremovefile.dylib x86_64-apple-ios13.5.0-simulator [ 16] libsystem_asl.dylib x86_64-apple-ios13.5.0-simulator [ 17] libsystem_blocks.dylib x86_64-apple-ios13.5.0-simulator [ 18] libsystem_c.dylib x86_64-apple-ios13.5.0-simulator [ 19] libsystem_configuration.dylib x86_64-apple-ios13.5.0-simulator [ 20] libsystem_containermanager.dylib x86_64-apple-ios13.5.0-simulator [ 21] libsystem_coreservices.dylib x86_64-apple-ios13.5.0-simulator [ 22] libsystem_darwin.dylib x86_64-apple-ios13.5.0-simulator [ 23] libsystem_dnssd.dylib x86_64-apple-ios13.5.0-simulator [ 24] libsystem_featureflags.dylib x86_64-apple-ios13.5.0-simulator [ 25] libsystem_info.dylib x86_64-apple-ios13.5.0-simulator [ 26] libsystem_m.dylib x86_64-apple-ios13.5.0-simulator [ 27] libsystem_malloc.dylib x86_64-apple-ios13.5.0-simulator [ 28] libsystem_notify.dylib x86_64-apple-ios13.5.0-simulator [ 29] libsystem_sandbox.dylib x86_64-apple-ios13.5.0-simulator [ 30] libsystem_sim_kernel.dylib x86_64-apple-ios13.5.0-simulator [ 31] libsystem_sim_platform.dylib x86_64-apple-ios13.5.0-simulator [ 32] libsystem_sim_pthread.dylib x86_64-apple-ios13.5.0-simulator [ 33] libsystem_trace.dylib x86_64-apple-ios13.5.0-simulator [ 34] libunwind.dylib x86_64-apple-ios13.5.0-simulator [ 35] libxpc.dylib x86_64-apple-ios13.5.0-simulator [ 36] libsystem_sim_pthread_host.dylib x86_64-apple-ios13.5.0-simulator [ 37] libsystem_sim_platform_host.dylib x86_64-apple-ios13.5.0-simulator [ 38] libsystem_sim_kernel_host.dylib x86_64-apple-ios13.5.0-simulator [ 39] libsystem_kernel.dylib x86_64-apple-macosx10.15.0-simulator(0x00007fff51b5a000) [ 40] libobjc.A.dylib x86_64-apple-ios13.5.0-simulator [ 41] libsystem_platform.dylib x86_64-apple-macosx10.15.0-simulator(0x00007fff51bfd000) [ 42] libsystem_pthread.dylib x86_64-apple-macosx10.15.0-simulator(0x00007fff51c06000)

Hide Details

Expecting regex pattern: "a\.out x86_64-apple-ios11.0.*-simulator" (was found, matched "a.out x86_64-apple-ios11.0.0-simulator")

Hide Details

<bound method SBProcess.Kill of <lldb.SBProcess; proxy of <Swig Object of type 'lldb::SBProcess *' at 0x1059c7c30> >>: success

Hide Details

PASS: LLDB (/Users/buildslave/jenkins/workspace/lldb-cmake/lldb-build/bin/clang-x86_64) :: test_lc_version_min_iphoneos (TestSimulatorPlatform.TestSimulatorPlatformLaunching) runCmd: settings clear -all output:

Hide Details

runCmd: settings set symbols.enable-external-lookup false output:

Hide Details

runCmd: settings set target.inherit-tcc true output:

Hide Details

runCmd: settings set target.auto-apply-fixits false output:

Hide Details

runCmd: settings set plugin.process.gdb-remote.packet-timeout 60 output:

Hide Details

runCmd: settings set symbols.clang-modules-cache-path "/Users/buildslave/jenkins/workspace/lldb-cmake/lldb-build/lldb-test-build.noindex/module-cache-lldb/lldb-api" output:

Hide Details

runCmd: settings set use-color false output:

Hide Details

runCmd: setting set target.prefer-dynamic-value no-dynamic-values output:

Hide Details

runCmd: log enable gdb-remote packets -f /Users/buildslave/jenkins/workspace/lldb-cmake/lldb-build/lldb-test-build.noindex/macosx/simulator/TestSimulatorPlatform.test_lc_version_min_macosx/packets.log output:

Hide Details

Ran command: "log enable gdb-remote packets -f /Users/buildslave/jenkins/workspace/lldb-cmake/lldb-build/lldb-test-build.noindex/macosx/simulator/TestSimulatorPlatform.test_lc_version_min_macosx/packets.log"

Hide Details

Got output:

Hide Details

Hide Details

runCmd: image list -b -t output: [ 0] a.out x86_64-apple-macosx10.9.0 [ 1] dyld x86_64-apple-macosx10.15.0 [ 2] libc++.1.dylib x86_64-apple-macosx10.15.0 [ 3] libSystem.B.dylib x86_64-apple-macosx10.15.0 [ 4] libc++abi.dylib x86_64-apple-macosx10.15.0 [ 5] libcache.dylib x86_64-apple-macosx10.15.0 [ 6] libcommonCrypto.dylib x86_64-apple-macosx10.15.0 [ 7] libcompiler_rt.dylib x86_64-apple-macosx10.15.0 [ 8] libcopyfile.dylib x86_64-apple-macosx10.15.0 [ 9] libcorecrypto.dylib x86_64-apple-macosx10.15.0 [ 10] libdispatch.dylib x86_64-apple-macosx10.15.0 [ 11] libdyld.dylib x86_64-apple-macosx10.15.0 [ 12] libkeymgr.dylib x86_64-apple-macosx10.15.0 [ 13] liblaunch.dylib x86_64-apple-macosx10.15.0 [ 14] libmacho.dylib x86_64-apple-macosx10.15.0 [ 15] libquarantine.dylib x86_64-apple-macosx10.15.0 [ 16] libremovefile.dylib x86_64-apple-macosx10.15.0 [ 17] libsystem_asl.dylib x86_64-apple-macosx10.15.0 [ 18] libsystem_blocks.dylib x86_64-apple-macosx10.15.0 [ 19] libsystem_c.dylib x86_64-apple-macosx10.15.0 [ 20] libsystem_configuration.dylib x86_64-apple-macosx10.15.0 [ 21] libsystem_coreservices.dylib x86_64-apple-macosx10.15.0 [ 22] libsystem_darwin.dylib x86_64-apple-macosx10.15.0 [ 23] libsystem_dnssd.dylib x86_64-apple-macosx10.15.0 [ 24] libsystem_featureflags.dylib x86_64-apple-macosx10.15.0 [ 25] libsystem_info.dylib x86_64-apple-macosx10.15.0 [ 26] libsystem_m.dylib x86_64-apple-macosx10.15.0 [ 27] libsystem_malloc.dylib x86_64-apple-macosx10.15.0 [ 28] libsystem_networkextension.dylib x86_64-apple-macosx10.15.0 [ 29] libsystem_notify.dylib x86_64-apple-macosx10.15.0 [ 30] libsystem_sandbox.dylib x86_64-apple-macosx10.15.0 [ 31] libsystem_secinit.dylib x86_64-apple-macosx10.15.0 [ 32] libsystem_kernel.dylib x86_64-apple-macosx10.15.0 [ 33] libsystem_platform.dylib x86_64-apple-macosx10.15.0 [ 34] libsystem_pthread.dylib x86_64-apple-macosx10.15.0 [ 35] libsystem_symptoms.dylib x86_64-apple-macosx10.15.0 [ 36] libsystem_trace.dylib x86_64-apple-macosx10.15.0 [ 37] libunwind.dylib x86_64-apple-macosx10.15.0 [ 38] libxpc.dylib x86_64-apple-macosx10.15.0 [ 39] libobjc.A.dylib x86_64-apple-macosx10.15.0

Hide Details

Hide Details

Ran command: "image list -b -t"

Hide Details

Got output: [ 0] a.out x86_64-apple-macosx10.9.0 [ 1] dyld x86_64-apple-macosx10.15.0 [ 2] libc++.1.dylib x86_64-apple-macosx10.15.0 [ 3] libSystem.B.dylib x86_64-apple-macosx10.15.0 [ 4] libc++abi.dylib x86_64-apple-macosx10.15.0 [ 5] libcache.dylib x86_64-apple-macosx10.15.0 [ 6] libcommonCrypto.dylib x86_64-apple-macosx10.15.0 [ 7] libcompiler_rt.dylib x86_64-apple-macosx10.15.0 [ 8] libcopyfile.dylib x86_64-apple-macosx10.15.0 [ 9] libcorecrypto.dylib x86_64-apple-macosx10.15.0 [ 10] libdispatch.dylib x86_64-apple-macosx10.15.0 [ 11] libdyld.dylib x86_64-apple-macosx10.15.0 [ 12] libkeymgr.dylib x86_64-apple-macosx10.15.0 [ 13] liblaunch.dylib x86_64-apple-macosx10.15.0 [ 14] libmacho.dylib x86_64-apple-macosx10.15.0 [ 15] libquarantine.dylib x86_64-apple-macosx10.15.0 [ 16] libremovefile.dylib x86_64-apple-macosx10.15.0 [ 17] libsystem_asl.dylib x86_64-apple-macosx10.15.0 [ 18] libsystem_blocks.dylib x86_64-apple-macosx10.15.0 [ 19] libsystem_c.dylib x86_64-apple-macosx10.15.0 [ 20] libsystem_configuration.dylib x86_64-apple-macosx10.15.0 [ 21] libsystem_coreservices.dylib x86_64-apple-macosx10.15.0 [ 22] libsystem_darwin.dylib x86_64-apple-macosx10.15.0 [ 23] libsystem_dnssd.dylib x86_64-apple-macosx10.15.0 [ 24] libsystem_featureflags.dylib x86_64-apple-macosx10.15.0 [ 25] libsystem_info.dylib x86_64-apple-macosx10.15.0 [ 26] libsystem_m.dylib x86_64-apple-macosx10.15.0 [ 27] libsystem_malloc.dylib x86_64-apple-macosx10.15.0 [ 28] libsystem_networkextension.dylib x86_64-apple-macosx10.15.0 [ 29] libsystem_notify.dylib x86_64-apple-macosx10.15.0 [ 30] libsystem_sandbox.dylib x86_64-apple-macosx10.15.0 [ 31] libsystem_secinit.dylib x86_64-apple-macosx10.15.0 [ 32] libsystem_kernel.dylib x86_64-apple-macosx10.15.0 [ 33] libsystem_platform.dylib x86_64-apple-macosx10.15.0 [ 34] libsystem_pthread.dylib x86_64-apple-macosx10.15.0 [ 35] libsystem_symptoms.dylib x86_64-apple-macosx10.15.0 [ 36] libsystem_trace.dylib x86_64-apple-macosx10.15.0 [ 37] libunwind.dylib x86_64-apple-macosx10.15.0 [ 38] libxpc.dylib x86_64-apple-macosx10.15.0 [ 39] libobjc.A.dylib x86_64-apple-macosx10.15.0

Hide Details

Expecting regex pattern: "a\.out x86_64-apple-macosx10.9.*" (was found, matched "a.out x86_64-apple-macosx10.9.0")

Hide Details

--

Hide Details

******************** PASS: lldb-unit :: Expression/./ExpressionTests/DiagnosticManagerTest.PutString (1228 of 2142) PASS: lldb-api :: functionalities/postmortem/mach-core/TestMachCore.py (1229 of 2142) PASS: lldb-api :: lang/cpp/dynamic-value/TestDynamicValue.py (1230 of 2142) PASS: lldb-unit :: Expression/./ExpressionTests/CppModuleConfigurationTest.LibCppV2 (1231 of 2142) PASS: lldb-api :: functionalities/pre_run_dylibs/TestPreRunDylibs.py (1232 of 2142) PASS: lldb-api :: python_api/signals/TestSignalsAPI.py (1233 of 2142) PASS: lldb-unit :: ScriptInterpreter/Python/./ScriptInterpreterPythonTests/PythonDataObjectsTest.TestPythonStringToStr (1234 of 2142) PASS: lldb-unit :: UnwindAssembly/x86/./UnwindAssemblyx86Tests/Testx86AssemblyInspectionEngine.TestPushR15 (1235 of 2142) PASS: lldb-unit :: Utility/./UtilityTests/FileSpecTest.Equal (1236 of 2142) UNSUPPORTED: lldb-api :: benchmarks/libcxxmap/TestBenchmarkLibcxxMap.py (1237 of 2142) PASS: lldb-api :: iohandler/resize/TestIOHandlerResizeNoEditline.py (1238 of 2142) UNSUPPORTED: lldb-api :: lang/cpp/static_members/TestCPPStaticMembers.py (1239 of 2142) PASS: lldb-unit :: Utility/./UtilityTests/ScalarTest.TruncOrExtendTo (1240 of 2142) UNSUPPORTED: lldb-api :: functionalities/darwin_log/filter/exact_match/activity-chain/TestDarwinLogFilterMatchActivityChain.py (1241 of 2142) PASS: lldb-unit :: Process/gdb-remote/./ProcessGdbRemoteTests/GDBRemoteCommunicationServerTest.SendErrorResponse_Status (1242 of 2142) PASS: lldb-shell :: Driver/TestHelp.test (1243 of 2142) PASS: lldb-api :: lang/c/forward/TestForwardDeclaration.py (1244 of 2142) PASS: lldb-api :: lang/objc/objc-static-method/TestObjCStaticMethod.py (1245 of 2142) PASS: lldb-api :: lang/cpp/char8_t/TestCxxChar8_t.py (1246 of 2142) PASS: lldb-unit :: Utility/./UtilityTests/DataExtractorTest.GetULEB128_bit63 (1247 of 2142) PASS: lldb-unit :: Utility/./UtilityTests/DataExtractorTest.GetDouble (1248 of 2142) PASS: lldb-unit :: Utility/./UtilityTests/IndexToObjectTest.ObjectForIndex (1249 of 2142) PASS: lldb-unit :: ScriptInterpreter/Python/./ScriptInterpreterPythonTests/PythonDataObjectsTest.TestPythonDictionaryToStructuredDictionary (1250 of 2142) PASS: lldb-unit :: Utility/./UtilityTests/FileSpecTest.FormatFileSpec (1251 of 2142) UNSUPPORTED: lldb-shell :: Watchpoint/netbsd-nouserdbregs.test (1252 of 2142) PASS: lldb-unit :: Core/./LLDBCoreTests/RichManglingContextTest.IPDRealloc (1253 of 2142) PASS: lldb-api :: lang/objc/orderedset/TestOrderedSet.py (1254 of 2142) UNSUPPORTED: lldb-api :: functionalities/darwin_log/basic/TestDarwinLogBasic.py (1255 of 2142) PASS: lldb-shell :: SymbolFile/NativePDB/function-types-classes.cpp (1256 of 2142) PASS: lldb-unit :: Utility/./UtilityTests/StreamTest.PutRawBytesToMixedEndian (1257 of 2142) PASS: lldb-unit :: Symbol/./SymbolTests/TestTypeSystemClang.TestUnifyAccessSpecifiers (1258 of 2142) PASS: lldb-api :: functionalities/multiword-commands/TestMultiWordCommands.py (1259 of 2142) PASS: lldb-unit :: Instruction/./EmulatorTests/TestAArch64Emulator.TestOverflow (1260 of 2142) PASS: lldb-unit :: Host/./HostTests/SocketTest.DecodeHostAndPort (1261 of 2142) PASS: lldb-api :: functionalities/gdb_remote_client/TestThreadSelectionBug.py (1262 of 2142) PASS: lldb-unit :: Host/./HostTests/FileActionTest.Open (1263 of 2142) PASS: lldb-api :: commands/frame/var/TestFrameVar.py (1264 of 2142) PASS: lldb-api :: commands/expression/test/TestExprs.py (1265 of 2142) PASS: lldb-unit :: ObjectFile/Breakpad/./ObjectFileBreakpadTests/StackCFIRecord.parse (1266 of 2142) UNSUPPORTED: lldb-api :: functionalities/data-formatter/data-formatter-stl/libstdcpp/vector/TestDataFormatterStdVector.py (1267 of 2142) UNSUPPORTED: lldb-api :: functionalities/data-formatter/data-formatter-stl/libstdcpp/list/TestDataFormatterStdList.py (1268 of 2142) PASS: lldb-api :: commands/expression/persistent_types/TestPersistentTypes.py (1269 of 2142) PASS: lldb-unit :: SymbolFile/NativePDB/./SymbolFileNativePDBTests/PDBFPOProgramToDWARFExpressionTests.MissingTargetRegister (1270 of 2142) PASS: lldb-shell :: Reproducer/TestGDBRemoteRepro.test (1271 of 2142) PASS: lldb-unit :: Utility/./UtilityTests/StatusTest.Formatv (1272 of 2142) PASS: lldb-unit :: Utility/./UtilityTests/FileSpecTest.EqualDotsPosixRoot (1273 of 2142) PASS: lldb-shell :: SymbolFile/DWARF/dwarf5-debug_line.s (1274 of 2142) PASS: lldb-unit :: Utility/./UtilityTests/StringExtractorTest.GetHexBytesAvail_OddPair (1275 of 2142) PASS: lldb-api :: api/multiple-targets/TestMultipleTargets.py (1276 of 2142) PASS: lldb-api :: python_api/function_symbol/TestSymbolAPI.py (1277 of 2142) PASS: lldb-api :: commands/expression/import-std-module/unique_ptr-dbg-info-content/TestUniquePtrDbgInfoContent.py (1278 of 2142) PASS: lldb-shell :: Driver/TestUseColor.test (1279 of 2142) PASS: lldb-unit :: Utility/./UtilityTests/UUIDTest.SetFromStringRef (1280 of 2142) PASS: lldb-unit :: Utility/./UtilityTests/StreamTest.PutULEB128 (1281 of 2142) PASS: lldb-api :: functionalities/tail_call_frames/unambiguous_sequence/TestUnambiguousTailCalls.py (1282 of 2142) PASS: lldb-unit :: Expression/./ExpressionTests/DWARFExpression.DW_OP_pick (1283 of 2142) PASS: lldb-api :: macosx/version_zero/TestGetVersionZeroVersion.py (1284 of 2142) PASS: lldb-unit :: UnwindAssembly/x86/./UnwindAssemblyx86Tests/Testx86AssemblyInspectionEngine.TestPushR14 (1285 of 2142) PASS: lldb-api :: commands/process/launch/TestProcessLaunch.py (1286 of 2142) PASS: lldb-unit :: Utility/./UtilityTests/OptionsWithRawTest.WhitespaceSuffix (1287 of 2142) PASS: lldb-api :: functionalities/data-formatter/format-propagation/TestFormatPropagation.py (1288 of 2142) PASS: lldb-api :: commands/target/create-deps/TestTargetCreateDeps.py (1289 of 2142) PASS: lldb-unit :: Symbol/./SymbolTests/TestTypeSystemClang.TestGetEnumIntegerTypeInvalid (1290 of 2142) PASS: lldb-api :: commands/expression/rdar44436068/Test128BitsInteger.py (1291 of 2142) PASS: lldb-api :: commands/process/attach/TestProcessAttach.py (1292 of 2142) PASS: lldb-unit :: Utility/./UtilityTests/StringListTest.RemoveBlankLines (1293 of 2142) PASS: lldb-api :: functionalities/breakpoint/dummy_target_breakpoints/TestBreakpointsWithNoTargets.py (1294 of 2142) PASS: lldb-unit :: Utility/./UtilityTests/StreamTest.ShiftOperatorStrings (1295 of 2142) PASS: lldb-api :: functionalities/data-formatter/varscript_formatting/TestDataFormatterVarScriptFormatting.py (1296 of 2142) PASS: lldb-shell :: Settings/TestLineMarkerColor.test (1297 of 2142) PASS: lldb-unit :: Utility/./UtilityTests/LogChannelEnabledTest.log_options (1298 of 2142) PASS: lldb-shell :: Driver/LocalLLDBInit.test (1299 of 2142) PASS: lldb-unit :: Language/Highlighting/./HighlighterTests/HighlighterTest.ClangCursorPosAfterOtherToken (1300 of 2142) PASS: lldb-unit :: Utility/./UtilityTests/SubsystemRAIITest.SubsystemWithErrorSuccess (1301 of 2142) PASS: lldb-unit :: Utility/./UtilityTests/StringListTest.InsertStringAtIndexStdString (1302 of 2142) PASS: lldb-unit :: Utility/./UtilityTests/RangeTest.ContainsRange (1303 of 2142) PASS: lldb-api :: lang/cpp/wchar_t/TestCxxWCharT.py (1304 of 2142) PASS: lldb-api :: functionalities/step_scripted/TestStepScripted.py (1305 of 2142) PASS: lldb-unit :: Utility/./UtilityTests/UriParserTest.BracketedHostnameWithPortIPv4 (1306 of 2142) PASS: lldb-api :: lang/objc/modules-hash-mismatch/TestClangModulesHashMismatch.py (1307 of 2142) PASS: lldb-unit :: Utility/./UtilityTests/StreamTest.PutNHex8 (1308 of 2142) PASS: lldb-unit :: Utility/./UtilityTests/RangeTest.ContainsEndInclusiveInvalid (1309 of 2142) UNSUPPORTED: lldb-api :: benchmarks/expression/TestRepeatedExprs.py (1310 of 2142) PASS: lldb-api :: functionalities/type_lookup/TestTypeLookup.py (1311 of 2142) PASS: lldb-unit :: Process/gdb-remote/./ProcessGdbRemoteTests/GDBRemoteClientBaseTest.SendContinueAndLateInterrupt (1312 of 2142) UNSUPPORTED: lldb-api :: functionalities/unwind/standard/TestStandardUnwind.py (1313 of 2142) PASS: lldb-unit :: Language/Highlighting/./HighlighterTests/HighlighterTest.ClangCursorPosInOtherToken (1314 of 2142) PASS: lldb-api :: functionalities/gdb_remote_client/TestArmRegisterDefinition.py (1315 of 2142) UNSUPPORTED: lldb-api :: benchmarks/continue/TestBenchmarkContinue.py (1316 of 2142) PASS: lldb-api :: functionalities/breakpoint/debugbreak/TestDebugBreak.py (1317 of 2142) PASS: lldb-api :: lang/cpp/static_methods/TestCPPStaticMethods.py (1318 of 2142) UNSUPPORTED: lldb-shell :: Unwind/eh-frame-augment-noop.test (1319 of 2142) PASS: lldb-api :: lang/cpp/unique-types/TestUniqueTypes.py (1320 of 2142) PASS: lldb-unit :: Language/Highlighting/./HighlighterTests/HighlighterTest.HighlighterSelectionType (1321 of 2142) PASS: lldb-unit :: Utility/./UtilityTests/BinaryStreamTest.PutULEB128FiveBytes (1322 of 2142) PASS: lldb-api :: lang/objc/modules-app-update/TestClangModulesAppUpdate.py (1323 of 2142) PASS: lldb-shell :: SymbolFile/NativePDB/globals-fundamental.cpp (1324 of 2142) PASS: lldb-api :: python_api/frame/get-variables/TestGetVariables.py (1325 of 2142) PASS: lldb-api :: python_api/file_handle/TestFileHandle.py (1326 of 2142) PASS: lldb-unit :: Utility/./UtilityTests/BinaryStreamTest.PutSLEB128SixBytes (1327 of 2142) PASS: lldb-unit :: Utility/./UtilityTests/ScalarTest.Division (1328 of 2142) PASS: lldb-api :: lang/cpp/char1632_t/TestChar1632T.py (1329 of 2142) PASS: lldb-unit :: Utility/./UtilityTests/VMRange.Ordering (1330 of 2142) PASS: lldb-unit :: Utility/./UtilityTests/StreamTest.AddressRangeEmptyRange (1331 of 2142) PASS: lldb-api :: commands/expression/import_base_class_when_class_has_derived_member/TestImportBaseClassWhenClassHasDerivedMember.py (1332 of 2142) PASS: lldb-api :: lang/c/blocks/TestBlocks.py (1333 of 2142) PASS: lldb-unit :: Utility/./UtilityTests/UriParserTest.BadPort (1334 of 2142) PASS: lldb-unit :: Process/gdb-remote/./ProcessGdbRemoteTests/GDBRemoteCommunicationClientTest.WriteRegister (1335 of 2142) PASS: lldb-unit :: Utility/./UtilityTests/ReproducerTest.SetReplay (1336 of 2142) PASS: lldb-shell :: ObjectFile/PECOFF/section-types.yaml (1337 of 2142) PASS: lldb-shell :: Commands/command-target-modules-dump-sections.yaml (1338 of 2142) PASS: lldb-unit :: Utility/./UtilityTests/BinaryStreamTest.PutULEB128FourBytes (1339 of 2142) PASS: lldb-api :: commands/expression/timeout/TestCallWithTimeout.py (1340 of 2142) PASS: lldb-unit :: Utility/./UtilityTests/CompletionRequest.TryCompleteCurrentArgBad (1341 of 2142) PASS: lldb-unit :: SymbolFile/NativePDB/./SymbolFileNativePDBTests/PDBFPOProgramToDWARFExpressionTests.MultipleDependentAssignments (1342 of 2142) PASS: lldb-unit :: SymbolFile/NativePDB/./SymbolFileNativePDBTests/PDBFPOProgramToDWARFExpressionTests.InvalidAssignmentMultiple (1343 of 2142) UNSUPPORTED: lldb-api :: benchmarks/expression/TestExpressionCmd.py (1344 of 2142) PASS: lldb-unit :: Utility/./UtilityTests/StringListTest.CopyList (1345 of 2142) PASS: lldb-api :: functionalities/breakpoint/breakpoint_hit_count/TestBreakpointHitCount.py (1346 of 2142) PASS: lldb-unit :: Target/./TargetTests/StackFrameRecognizerTest.NullModuleRegex (1347 of 2142) PASS: lldb-api :: functionalities/data-formatter/array_typedef/TestArrayTypedef.py (1348 of 2142) PASS: lldb-unit :: Utility/./UtilityTests/ScalarTest.Getters (1349 of 2142) PASS: lldb-api :: functionalities/inferior-crashing/TestInferiorCrashing.py (1350 of 2142) PASS: lldb-shell :: Heap/heap-cstr.test (1351 of 2142) PASS: lldb-shell :: SymbolFile/DWARF/DW_AT_loclists_base.s (1352 of 2142) UNSUPPORTED: lldb-shell :: Unwind/eh-frame-small-fde.test (1353 of 2142) PASS: lldb-unit :: UnwindAssembly/x86/./UnwindAssemblyx86Tests/Testx86AssemblyInspectionEngine.Test32BitOnlyInstruction (1354 of 2142) PASS: lldb-unit :: Symbol/./SymbolTests/PostfixExpression.ParseFPOProgram (1355 of 2142) PASS: lldb-unit :: API/./APITests/SBCommandInterpreterTest.MultiWordCommand (1356 of 2142) PASS: lldb-api :: functionalities/var_path/TestVarPath.py (1357 of 2142) PASS: lldb-api :: commands/expression/result_numbering/TestResultNumbering.py (1358 of 2142) PASS: lldb-api :: functionalities/gdb_remote_client/TestIOSSimulator.py (1359 of 2142) PASS: lldb-api :: macosx/nslog/TestDarwinNSLogOutput.py (1360 of 2142) PASS: lldb-unit :: Utility/./UtilityTests/StringLexerTest.NextIfList (1361 of 2142) PASS: lldb-unit :: Utility/./UtilityTests/DataExtractorTest.GetDoubleUnaligned (1362 of 2142) PASS: lldb-shell :: SymbolFile/DWARF/debug_ranges.s (1363 of 2142) PASS: lldb-unit :: Utility/./UtilityTests/RangeTest.Slide (1364 of 2142) PASS: lldb-api :: commands/watchpoints/watchpoint_events/TestWatchpointEvents.py (1365 of 2142) PASS: lldb-unit :: Utility/./UtilityTests/NameMatchesTest.EndsWith (1366 of 2142) PASS: lldb-api :: functionalities/postmortem/elf-core/thread_crash/TestLinuxCoreThreads.py (1367 of 2142) PASS: lldb-unit :: Language/Highlighting/./HighlighterTests/HighlighterTest.ClangBraces (1368 of 2142) PASS: lldb-unit :: Utility/./UtilityTests/StringListTest.JoinThree (1369 of 2142) PASS: lldb-shell :: ObjectFile/ELF/section-types.yaml (1370 of 2142) PASS: lldb-api :: iohandler/resize/TestIOHandlerResize.py (1371 of 2142) PASS: lldb-api :: lang/c/local_variables/TestLocalVariables.py (1372 of 2142) PASS: lldb-unit :: Utility/./UtilityTests/FileSpecTest.FileAndDirectoryComponents (1373 of 2142) PASS: lldb-unit :: Utility/./UtilityTests/ProcessInstanceInfo.DumpTable_invalidUID (1374 of 2142) PASS: lldb-unit :: Utility/./UtilityTests/ScalarTest.Scalar_512 (1375 of 2142) PASS: lldb-unit :: UnwindAssembly/ARM64/./Arm64InstEmulationTests/TestArm64InstEmulation.TestMediumDarwinFunction (1376 of 2142) PASS: lldb-unit :: Utility/./UtilityTests/StringListTest.CopyListSingle (1377 of 2142) UNSUPPORTED: lldb-api :: functionalities/longjmp/TestLongjmp.py (1378 of 2142) PASS: lldb-api :: macosx/DBGSourcePathRemapping/TestDSYMSourcePathRemapping.py (1379 of 2142) PASS: lldb-shell :: Breakpoint/split-dwarf-5-addrbase.test (1380 of 2142) PASS: lldb-unit :: UnwindAssembly/x86/./UnwindAssemblyx86Tests/Testx86AssemblyInspectionEngine.TestPopEDI (1381 of 2142) PASS: lldb-unit :: ScriptInterpreter/Python/./ScriptInterpreterPythonTests/PythonDataObjectsTest.TestExceptions (1382 of 2142) PASS: lldb-api :: functionalities/gdb_remote_client/TestPlatformClient.py (1383 of 2142) PASS: lldb-api :: functionalities/data-formatter/data-formatter-objc/nsindexpath/TestDataFormatterNSIndexPath.py (1384 of 2142) PASS: lldb-api :: functionalities/backticks/TestBackticksWithoutATarget.py (1385 of 2142) PASS: lldb-api :: commands/apropos/with-process/TestAproposWithProcess.py (1386 of 2142) UNSUPPORTED: lldb-api :: functionalities/thread/concurrent_events/TestConcurrentManySignals.py (1387 of 2142) PASS: lldb-api :: lang/objc/foundation/TestObjCMethodsNSArray.py (1388 of 2142) PASS: lldb-api :: commands/expression/call-function/TestCallBuiltinFunction.py (1389 of 2142) PASS: lldb-unit :: Utility/./UtilityTests/EnvironmentTest.EnvpConstruction (1390 of 2142) PASS: lldb-api :: functionalities/plugins/python_os_plugin/TestPythonOSPlugin.py (1391 of 2142) PASS: lldb-unit :: Utility/./UtilityTests/StructuredDataTest.StringDump (1392 of 2142) PASS: lldb-unit :: Utility/./UtilityTests/UriParserTest.TypicalPortPathIPv4 (1393 of 2142) PASS: lldb-unit :: ScriptInterpreter/Python/./ScriptInterpreterPythonTests/PythonDataObjectsTest.TestDictionaryResolutionWithDot (1394 of 2142) PASS: lldb-api :: commands/expression/test/TestExprs2.py (1395 of 2142) PASS: lldb-api :: functionalities/dead-strip/TestDeadStrip.py (1396 of 2142) PASS: lldb-unit :: Utility/./UtilityTests/VMRange.CollectionContains (1397 of 2142) PASS: lldb-unit :: UnwindAssembly/x86/./UnwindAssemblyx86Tests/Testx86AssemblyInspectionEngine.TestMovRSPtoRBP (1398 of 2142) PASS: lldb-unit :: SymbolFile/NativePDB/./SymbolFileNativePDBTests/PDBFPOProgramToDWARFExpressionTests.UnresolvedRegisterAssignmentReference (1399 of 2142) PASS: lldb-api :: functionalities/thread/state_after_expression/TestStateAfterExpression.py (1400 of 2142) PASS: lldb-unit :: Process/gdb-remote/./ProcessGdbRemoteTests/GDBRemoteCommunicationClientTest.SendSignalsToIgnore (1401 of 2142) PASS: lldb-unit :: Utility/./UtilityTests/ScalarTest.Comparison (1402 of 2142) PASS: lldb-unit :: Interpreter/./InterpreterTests/OptionValueFileColonLine.setFromString (1403 of 2142) PASS: lldb-unit :: Process/gdb-remote/./ProcessGdbRemoteTests/GDBRemoteClientBaseTest.SendPacketAndReceiveResponseWithOutputSupport (1404 of 2142) PASS: lldb-api :: lang/cpp/unicode-literals/TestUnicodeLiterals.py (1405 of 2142) PASS: lldb-api :: functionalities/thread/concurrent_events/TestConcurrentTwoWatchpointsOneSignal.py (1406 of 2142) PASS: lldb-shell :: ObjectFile/ELF/compressed-sections.yaml (1407 of 2142) PASS: lldb-api :: commands/expression/import-std-module/pair/TestPairFromStdModule.py (1408 of 2142) UNSUPPORTED: lldb-api :: benchmarks/stepping/TestSteppingSpeed.py (1409 of 2142) PASS: lldb-api :: functionalities/thread/concurrent_events/TestConcurrentTwoBreakpointsOneSignal.py (1410 of 2142) PASS: lldb-unit :: Utility/./UtilityTests/SerializationRountripTest.SerializeDeserializePodPointers (1411 of 2142) PASS: lldb-unit :: Utility/./UtilityTests/FileSpecTest.Match (1412 of 2142) PASS: lldb-api :: commands/gui/basicdebug/TestGuiBasicDebug.py (1413 of 2142) PASS: lldb-unit :: Utility/./UtilityTests/CompletionRequest.TestCompletionOwnership (1414 of 2142) PASS: lldb-unit :: Utility/./UtilityTests/StringListTest.GetMaxStringLengthEqualSize (1415 of 2142) PASS: lldb-api :: lang/objc/foundation/TestObjCMethods2.py (1416 of 2142) PASS: lldb-api :: functionalities/breakpoint/source_regexp/TestSourceRegexBreakpoints.py (1417 of 2142) PASS: lldb-shell :: Reproducer/TestReuseDirectory.test (1418 of 2142) PASS: lldb-api :: functionalities/breakpoint/address_breakpoints/TestBadAddressBreakpoints.py (1419 of 2142) PASS: lldb-unit :: Host/./HostTests/HostInfoTest.GetHostname (1420 of 2142) UNSUPPORTED: lldb-shell :: SymbolFile/PDB/function-nested-block.test (1421 of 2142) PASS: lldb-unit :: Utility/./UtilityTests/RangeTest.ContainsEndInclusive (1422 of 2142) PASS: lldb-api :: functionalities/unwind/noreturn/TestNoreturnUnwind.py (1423 of 2142) UNSUPPORTED: lldb-shell :: Register/x86-64-ymm16-write.test (1424 of 2142) PASS: lldb-shell :: SymbolFile/DWARF/DW_TAG_basic_type_DW_ATE_UTF_nonC.ll (1425 of 2142) PASS: lldb-unit :: Signals/./SignalsTests/UnixSignalsTest.GetInfo (1426 of 2142) PASS: lldb-unit :: Utility/./UtilityTests/RecordReplayTest.InstrumentedBarRef (1427 of 2142) PASS: lldb-shell :: SymbolFile/DWARF/debug-types-missing-signature.test (1428 of 2142) PASS: lldb-shell :: ObjectFile/PECOFF/basic-info-arm.yaml (1429 of 2142) PASS: lldb-api :: lang/cpp/scope/TestCppScope.py (1430 of 2142) PASS: lldb-unit :: UnwindAssembly/PPC64/./PPC64InstEmulationTests/TestPPC64InstEmulation.TestMediumFunction (1431 of 2142) PASS: lldb-shell :: Driver/TestRepl.test (1432 of 2142) PASS: lldb-shell :: Minidump/Windows/arm-fp-unwind.test (1433 of 2142) PASS: lldb-api :: functionalities/recursion/TestValueObjectRecursion.py (1434 of 2142) PASS: lldb-unit :: Utility/./UtilityTests/StreamTest.PutRawBytesToLittleEndian (1435 of 2142) PASS: lldb-shell :: SymbolFile/DWARF/debug-types-dwarf5.s (1436 of 2142) PASS: lldb-api :: commands/frame/diagnose/dereference-function-return/TestDiagnoseDereferenceFunctionReturn.py (1437 of 2142) PASS: lldb-unit :: Expression/./ExpressionTests/CppModuleConfigurationTest.IgnoreLibStdCpp (1438 of 2142) PASS: lldb-api :: commands/expression/static-initializers/TestStaticInitializers.py (1439 of 2142) PASS: lldb-api :: functionalities/object-file/TestImageListMultiArchitecture.py (1440 of 2142) PASS: lldb-api :: functionalities/tail_call_frames/thread_step_out_message/TestArtificialFrameStepOutMessage.py (1441 of 2142) PASS: lldb-unit :: Interpreter/./InterpreterTests/CompletionTest.FileCompletionAbsolute (1442 of 2142) PASS: lldb-api :: functionalities/testid/TestTestId.py (1443 of 2142) PASS: lldb-api :: python_api/disassemble-raw-data/TestDisassemble_VST1_64.py (1444 of 2142) UNSUPPORTED: lldb-api :: functionalities/thread/thread_specific_break_plus_condition/TestThreadSpecificBpPlusCondition.py (1445 of 2142) PASS: lldb-api :: commands/breakpoint/set/func-regex/TestBreakpointRegexError.py (1446 of 2142) PASS: lldb-unit :: Utility/./UtilityTests/ArgsTest.StringListConstructor (1447 of 2142) PASS: lldb-api :: commands/help/TestHelp.py (1448 of 2142) PASS: lldb-api :: python_api/disassemble-raw-data/TestDisassembleRawData.py (1449 of 2142) PASS: lldb-api :: commands/expression/import-std-module/unique_ptr/TestUniquePtrFromStdModule.py (1450 of 2142) PASS: lldb-unit :: Process/minidump/./LLDBMinidumpTests/MinidumpParserTest.GetMemoryRegionInfoFromMemory64List (1451 of 2142) PASS: lldb-unit :: Utility/./UtilityTests/StringListTest.LongestCommonPrefixSingleElement (1452 of 2142) PASS: lldb-api :: functionalities/data-formatter/parray/TestPrintArray.py (1453 of 2142) PASS: lldb-shell :: SymbolFile/DWARF/find-basic-function.cpp (1454 of 2142) PASS: lldb-shell :: SymbolFile/NativePDB/break-by-function.cpp (1455 of 2142) PASS: lldb-api :: functionalities/wrong_commands/TestWrongCommands.py (1456 of 2142) PASS: lldb-api :: lang/cpp/covariant-return-types/TestCovariantReturnTypes.py (1457 of 2142) PASS: lldb-unit :: Expression/./ExpressionTests/DiagnosticManagerTest.FixedExpression (1458 of 2142) PASS: lldb-unit :: Utility/./UtilityTests/RangeTest.SizeTypes (1459 of 2142) PASS: lldb-unit :: Process/gdb-remote/./ProcessGdbRemoteTests/GDBRemoteCommunicationClientTest.ReadRegister (1460 of 2142) PASS: lldb-api :: functionalities/data-formatter/data-formatter-stl/libcxx/atomic/TestLibCxxAtomic.py (1461 of 2142) PASS: lldb-api :: commands/watchpoints/multiple_threads/TestWatchpointMultipleThreads.py (1462 of 2142) PASS: lldb-unit :: Symbol/./SymbolTests/TestTypeSystemClang.TestGetBasicTypeFromName (1463 of 2142) PASS: lldb-api :: functionalities/data-formatter/data-formatter-objc/TestDataFormatterObjCNSDate.py (1464 of 2142) PASS: lldb-unit :: Symbol/./SymbolTests/Type.GetTypeScopeAndBasename (1465 of 2142) PASS: lldb-shell :: Process/UnsupportedLanguage.test (1466 of 2142) PASS: lldb-api :: lang/objc/objc-checker/TestObjCCheckers.py (1467 of 2142) PASS: lldb-api :: types/TestLongTypesExpr.py (1468 of 2142) PASS: lldb-unit :: Utility/./UtilityTests/LogChannelTest.EnableOptions (1469 of 2142) PASS: lldb-unit :: Utility/./UtilityTests/DeserializerTest.HasData (1470 of 2142) PASS: lldb-api :: python_api/class_members/TestSBTypeClassMembers.py (1471 of 2142) PASS: lldb-api :: commands/expression/completion-in-lambda-and-unnamed-class/TestCompletionInLambdaAndUnnamedClass.py (1472 of 2142) PASS: lldb-unit :: Signals/./SignalsTests/UnixSignalsTest.GetFilteredSignals (1473 of 2142) PASS: lldb-unit :: ScriptInterpreter/Python/./ScriptInterpreterPythonTests/PythonDataObjectsTest.TestBorrowedReferences (1474 of 2142) PASS: lldb-api :: functionalities/tsan/basic/TestTsanBasic.py (1475 of 2142) PASS: lldb-unit :: UnwindAssembly/x86/./UnwindAssemblyx86Tests/Testx86AssemblyInspectionEngine.TestReturnDetect (1476 of 2142) PASS: lldb-unit :: SymbolFile/DWARF/./SymbolFileDWARFTests/SymbolFileDWARFTests.TestAbilitiesForDWARF (1477 of 2142) PASS: lldb-api :: commands/expression/unwind_expression/TestUnwindExpression.py (1478 of 2142) PASS: lldb-api :: lang/c/vla/TestVLA.py (1479 of 2142) PASS: lldb-unit :: Symbol/./SymbolTests/TestTypeSystemClang.TestDeletingImplicitCopyCstrDueToMoveCStr (1480 of 2142) PASS: lldb-api :: functionalities/signal/raise/TestRaise.py (1481 of 2142) PASS: lldb-unit :: Expression/./ExpressionTests/DiagnosticManagerTest.AppendMessageSubsequentDiags (1482 of 2142) PASS: lldb-shell :: Breakpoint/debug_rnglist_rlestartend.test (1483 of 2142) PASS: lldb-api :: commands/frame/diagnose/inheritance/TestDiagnoseInheritance.py (1484 of 2142) PASS: lldb-api :: lang/cpp/thread_local/TestThreadLocal.py (1485 of 2142) PASS: lldb-shell :: Quit/TestQuitExitCode30.test (1486 of 2142) PASS: lldb-shell :: Quit/TestQuitExitCodeNonInt.test (1487 of 2142) PASS: lldb-api :: commands/target/dump-symtab-demangle/TestDumpSymtabDemangle.py (1488 of 2142) PASS: lldb-api :: commands/target/stop-hooks/TestStopHooks.py (1489 of 2142) PASS: lldb-api :: commands/frame/diagnose/array/TestArray.py (1490 of 2142) PASS: lldb-api :: commands/expression/radar_9531204/TestPrintfAfterUp.py (1491 of 2142) PASS: lldb-api :: tools/lldb-server/TestGdbRemote_vCont.py (1492 of 2142) PASS: lldb-api :: commands/expression/context-object-objc/TestContextObjectObjc.py (1493 of 2142) PASS: lldb-api :: functionalities/plugins/command_plugin/TestPluginCommands.py (1494 of 2142) PASS: lldb-api :: lang/cpp/template-function/TestTemplateFunctions.py (1495 of 2142) PASS: lldb-shell :: ScriptInterpreter/None/none.test (1496 of 2142) PASS: lldb-unit :: Host/./HostTests/NativeProcessProtocolTest.ReadCStringFromMemory (1497 of 2142) PASS: lldb-unit :: Process/minidump/./LLDBMinidumpTests/MinidumpParserTest.GetFilteredModuleList (1498 of 2142) PASS: lldb-unit :: Utility/./UtilityTests/StreamTeeTest.Constructor2Streams (1499 of 2142) PASS: lldb-api :: commands/expression/completion-crash-incomplete-record/TestCompletionCrashIncompleteRecord.py (1500 of 2142) PASS: lldb-unit :: Language/CPlusPlus/./LanguageCPlusPlusTests/CPlusPlusLanguage.CPlusPlusNameParser (1501 of 2142) PASS: lldb-api :: python_api/sbtype_typeclass/TestSBTypeTypeClass.py (1502 of 2142) PASS: lldb-shell :: Reproducer/Functionalities/TestDataFormatter.test (1503 of 2142) PASS: lldb-unit :: Utility/./UtilityTests/BroadcasterTest.BroadcastEvent (1504 of 2142) PASS: lldb-api :: functionalities/limit-debug-info/TestLimitDebugInfo.py (1505 of 2142) UNSUPPORTED: lldb-api :: functionalities/darwin_log/filter/exact_match/category/TestDarwinLogFilterMatchCategory.py (1506 of 2142) PASS: lldb-api :: functionalities/data-formatter/data-formatter-synthval/TestDataFormatterSynthVal.py (1507 of 2142) PASS: lldb-unit :: Language/Highlighting/./HighlighterTests/HighlighterTest.ClangSquareBrackets (1508 of 2142) PASS: lldb-api :: commands/disassemble/basic/TestDisassembleBreakpoint.py (1509 of 2142) PASS: lldb-api :: functionalities/pointer_num_children/TestPointerNumChildren.py (1510 of 2142) PASS: lldb-unit :: Utility/./UtilityTests/ArchSpecTest.OperatorBool (1511 of 2142) PASS: lldb-unit :: Host/./HostTests/SocketTest.UDPConnect (1512 of 2142) PASS: lldb-unit :: Utility/./UtilityTests/TimerTest.CategoryTimes2 (1513 of 2142) PASS: lldb-api :: commands/expression/import-std-module/basic/TestImportStdModule.py (1514 of 2142) PASS: lldb-unit :: ScriptInterpreter/Python/./ScriptInterpreterPythonTests/PythonDataObjectsTest.TestRun (1515 of 2142) PASS: lldb-unit :: Utility/./UtilityTests/RecordReplayTest.InstrumentedBarPtr (1516 of 2142) PASS: lldb-unit :: Utility/./UtilityTests/StreamTeeTest.Write (1517 of 2142) PASS: lldb-api :: lang/objc/foundation/TestFoundationDisassembly.py (1518 of 2142) UNSUPPORTED: lldb-api :: functionalities/signal/handle-segv/TestHandleSegv.py (1519 of 2142) PASS: lldb-unit :: ScriptInterpreter/Python/./ScriptInterpreterPythonTests/PythonDataObjectsTest.TestObjectAttributes (1520 of 2142) UNSUPPORTED: lldb-shell :: SymbolFile/DWARF/DW_TAG_GNU_call_site-DW_AT_low_pc.s (1521 of 2142) PASS: lldb-unit :: UnwindAssembly/x86/./UnwindAssemblyx86Tests/Testx86AssemblyInspectionEngine.TestPushRBPWithREX (1522 of 2142) PASS: lldb-unit :: SymbolFile/NativePDB/./SymbolFileNativePDBTests/PDBFPOProgramToDWARFExpressionTests.UnresolvedRegisterReference (1523 of 2142) PASS: lldb-shell :: Driver/TestCommands.test (1524 of 2142) PASS: lldb-api :: functionalities/data-formatter/data-formatter-stl/libcxx/tuple/TestDataFormatterLibcxxTuple.py (1525 of 2142) PASS: lldb-api :: python_api/symbol-context/TestSymbolContext.py (1526 of 2142) PASS: lldb-api :: functionalities/thread/concurrent_events/TestConcurrentBreakpointOneDelayBreakpointThreads.py (1527 of 2142) PASS: lldb-api :: source-manager/TestSourceManager.py (1528 of 2142) PASS: lldb-api :: commands/expression/formatters/TestFormatters.py (1529 of 2142) PASS: lldb-api :: commands/expression/pr35310/TestExprsBug35310.py (1530 of 2142) PASS: lldb-shell :: SymbolFile/DWARF/childless-compile-unit.s (1531 of 2142) PASS: lldb-shell :: SymbolFile/DWARF/DW_AT_const_value.s (1532 of 2142) PASS: lldb-unit :: Utility/./UtilityTests/StringListTest.PopBack (1533 of 2142) PASS: lldb-unit :: Utility/./UtilityTests/OptionsWithRawTest.QuotedSuffix (1534 of 2142) PASS: lldb-shell :: SymbolFile/NativePDB/bitfields.cpp (1535 of 2142) PASS: lldb-unit :: Utility/./UtilityTests/StringListTest.CopyListEmpty (1536 of 2142) UNSUPPORTED: lldb-shell :: Register/x86-64-xmm16-write.test (1537 of 2142) PASS: lldb-unit :: Utility/./UtilityTests/StringExtractorTest.GetHexU8_Extra_NoEof (1538 of 2142) PASS: lldb-api :: python_api/process/io/TestProcessIO.py (1539 of 2142) PASS: lldb-shell :: Settings/TestSettingsSet.test (1540 of 2142) PASS: lldb-unit :: Utility/./UtilityTests/DataExtractorTest.GetMaxU64_unchecked (1541 of 2142) PASS: lldb-api :: types/TestIntegerType.py (1542 of 2142) PASS: lldb-shell :: SymbolFile/DWARF/DW_OP_piece-smaller-than-struct.s (1543 of 2142) PASS: lldb-unit :: Utility/./UtilityTests/AnsiTerminal.AtEnd (1544 of 2142) PASS: lldb-api :: functionalities/paths/TestPaths.py (1545 of 2142) PASS: lldb-shell :: Breakpoint/jitbp_elf.test (1546 of 2142) PASS: lldb-shell :: ObjectFile/ELF/minidebuginfo-find-symbols.yaml (1547 of 2142) PASS: lldb-api :: functionalities/data-formatter/data-formatter-objc/TestDataFormatterObjCNSError.py (1548 of 2142) PASS: lldb-api :: functionalities/data-formatter/data-formatter-smart-array/TestDataFormatterSmartArray.py (1549 of 2142) PASS: lldb-shell :: SymbolFile/Breakpad/line-table-edgecases.test (1550 of 2142) PASS: lldb-unit :: Symbol/./SymbolTests/TestTypeSystemClang.TestGetTypeClassTypeOfExpr (1551 of 2142) PASS: lldb-unit :: Utility/./UtilityTests/ScalarTest.Equality (1552 of 2142) PASS: lldb-unit :: Utility/./UtilityTests/ArchSpecTest.MergeFrom (1553 of 2142) PASS: lldb-unit :: Utility/./UtilityTests/StreamTest.PutCharNull (1554 of 2142) PASS: lldb-api :: types/TestCharType.py (1555 of 2142) PASS: lldb-shell :: ObjectFile/ELF/section-addresses.yaml (1556 of 2142) PASS: lldb-unit :: Utility/./UtilityTests/VMRange.ContainsRange (1557 of 2142) PASS: lldb-api :: functionalities/inferior-crashing/recursive-inferior/TestRecursiveInferior.py (1558 of 2142) PASS: lldb-api :: lang/cpp/call-function/TestCallCPPFunction.py (1559 of 2142) PASS: lldb-api :: lang/cpp/std-function-step-into-callable/TestStdFunctionStepIntoCallable.py (1560 of 2142) UNSUPPORTED: lldb-api :: functionalities/thread/multi_break/TestMultipleBreakpoints.py (1561 of 2142) PASS: lldb-unit :: Interpreter/./InterpreterTests/OptionArgParserTest.toChar (1562 of 2142) PASS: lldb-api :: functionalities/asan/TestReportData.py (1563 of 2142) PASS: lldb-unit :: Process/./ProcessEventDataTests/ProcessEventDataTest.ShouldStop (1564 of 2142) PASS: lldb-api :: functionalities/data-formatter/data-formatter-advanced/TestDataFormatterAdv.py (1565 of 2142) PASS: lldb-api :: tools/lldb-server/TestGdbRemoteThreadsInStopReply.py (1566 of 2142) PASS: lldb-unit :: UnwindAssembly/x86/./UnwindAssemblyx86Tests/Testx86AssemblyInspectionEngine.TestPushESI (1567 of 2142) PASS: lldb-api :: lang/cpp/typedef/TestCppTypedef.py (1568 of 2142) UNSUPPORTED: lldb-shell :: SymbolFile/PDB/calling-conventions.test (1569 of 2142) PASS: lldb-unit :: debugserver/./debugserverTests/RNBSocket.AnyListen (1570 of 2142) PASS: lldb-unit :: Utility/./UtilityTests/CompletionRequest.DuplicateFilteringWithComments (1571 of 2142) PASS: lldb-api :: commands/expression/deleting-implicit-copy-constructor/TestDeletingImplicitCopyConstructor.py (1572 of 2142) PASS: lldb-api :: lang/objcxx/hide-runtime-values/TestObjCXXHideRuntimeValues.py (1573 of 2142) PASS: lldb-unit :: Utility/./UtilityTests/StringLexerTest.HasAtLeast (1574 of 2142) PASS: lldb-api :: lang/objc/objc-runtime-ivars/TestRuntimeIvars.py (1575 of 2142) PASS: lldb-unit :: Host/./HostTests/FileSystemTest.EnumerateDirectory (1576 of 2142) PASS: lldb-unit :: UnwindAssembly/PPC64/./PPC64InstEmulationTests/TestPPC64InstEmulation.TestSimpleFunction (1577 of 2142) PASS: lldb-api :: functionalities/process_group/TestChangeProcessGroup.py (1578 of 2142) PASS: lldb-shell :: Register/x86-64-read.test (1579 of 2142) PASS: lldb-unit :: Process/minidump/./LLDBMinidumpTests/MinidumpParserTest.GetThreadContext_x86_64 (1580 of 2142) PASS: lldb-api :: tools/lldb-server/TestGdbRemoteHostInfo.py (1581 of 2142) PASS: lldb-api :: commands/version/TestVersion.py (1582 of 2142) PASS: lldb-unit :: Process/minidump/./LLDBMinidumpTests/MinidumpParserTest.GetPid (1583 of 2142) PASS: lldb-unit :: Utility/./UtilityTests/StringListTest.GetSize (1584 of 2142) PASS: lldb-api :: lang/cpp/rvalue-references/TestRvalueReferences.py (1585 of 2142) PASS: lldb-shell :: Settings/TestFrameFormatNoColor.test (1586 of 2142) UNSUPPORTED: lldb-api :: lang/cpp/function-template-parameter-pack/TestFunctionTemplateParameterPack.py (1587 of 2142) PASS: lldb-unit :: Utility/./UtilityTests/SerializationRountripTest.SerializeDeserializeCString (1588 of 2142) PASS: lldb-unit :: Symbol/./SymbolTests/TestTypeSystemClang.AddMethodToObjCObjectType (1589 of 2142) PASS: lldb-unit :: Utility/./UtilityTests/CompletionRequest.ShiftArguments (1590 of 2142) PASS: lldb-api :: functionalities/process_crash_info/TestProcessCrashInfo.py (1591 of 2142) PASS: lldb-api :: tools/lldb-server/inferior-crash/TestGdbRemoteSegFault.py (1592 of 2142) PASS: lldb-unit :: Process/minidump/./LLDBMinidumpTests/MinidumpParserTest.GetThreadsAndGetThreadContext (1593 of 2142) PASS: lldb-api :: lang/objc/objc-stepping/TestObjCStepping.py (1594 of 2142) PASS: lldb-unit :: Utility/./UtilityTests/StreamTest.PutRawBytesToBigEndian (1595 of 2142) PASS: lldb-unit :: Utility/./UtilityTests/ScalarTest.SetValueFromCString (1596 of 2142) PASS: lldb-unit :: Utility/./UtilityTests/StreamTeeTest.SetStreamAtIndexOutOfBounds (1597 of 2142) PASS: lldb-unit :: DataFormatter/./LLDBFormatterTests/StringPrinterTests.CxxASCII (1598 of 2142) PASS: lldb-shell :: BuildScript/modes.test (1599 of 2142) PASS: lldb-api :: functionalities/thread/exit_during_break/TestExitDuringBreak.py (1600 of 2142) PASS: lldb-unit :: Utility/./UtilityTests/EnvironmentTest.EnvpConversion (1601 of 2142) PASS: lldb-api :: functionalities/data-formatter/data-formatter-stl/libcxx/list/TestDataFormatterLibcxxList.py (1602 of 2142) PASS: lldb-api :: functionalities/unwind/noreturn/module-end/TestNoReturnModuleEnd.py (1603 of 2142) PASS: lldb-unit :: Language/Highlighting/./HighlighterTests/HighlighterTest.ClangCursorPos (1604 of 2142) PASS: lldb-unit :: Host/./HostTests/SocketAddressTest.GetAddressInfo (1605 of 2142) PASS: lldb-api :: tools/lldb-vscode/module/TestVSCode_module.py (1606 of 2142) PASS: lldb-api :: python_api/process/read-mem-cstring/TestReadMemCString.py (1607 of 2142) PASS: lldb-unit :: Utility/./UtilityTests/Flags.AllSet (1608 of 2142) PASS: lldb-shell :: ObjectFile/MachO/lc_build_version.yaml (1609 of 2142) PASS: lldb-unit :: ObjectFile/ELF/./ObjectFileELFTests/ObjectFileELFTest.GetModuleSpecifications_EarlySectionHeaders (1610 of 2142) PASS: lldb-unit :: UnwindAssembly/x86/./UnwindAssemblyx86Tests/Testx86AssemblyInspectionEngine.TestPushR12 (1611 of 2142) PASS: lldb-unit :: ScriptInterpreter/Python/./ScriptInterpreterPythonTests/PythonDataObjectsTest.TestExtractingUInt64ThroughStructuredData (1612 of 2142) PASS: lldb-unit :: Utility/./UtilityTests/ScalarTest.SetValueFromData (1613 of 2142) PASS: lldb-api :: commands/quit/TestQuit.py (1614 of 2142) PASS: lldb-unit :: Utility/./UtilityTests/UUIDTest.RelationalOperators (1615 of 2142) PASS: lldb-unit :: UnwindAssembly/x86/./UnwindAssemblyx86Tests/Testx86AssemblyInspectionEngine.TestDisassemblyJunkBytes (1616 of 2142) PASS: lldb-api :: functionalities/value_md5_crash/TestValueMD5Crash.py (1617 of 2142) PASS: lldb-shell :: Reproducer/TestDriverOptions.test (1618 of 2142) PASS: lldb-shell :: SymbolFile/Breakpad/line-table.test (1619 of 2142) PASS: lldb-api :: functionalities/data-formatter/vector-types/TestVectorTypesFormatting.py (1620 of 2142) PASS: lldb-unit :: SymbolFile/DWARF/./SymbolFileDWARFTests/SymbolFileDWARFTests.TestAbbrevOutOfOrder (1621 of 2142) PASS: lldb-api :: functionalities/type_completion/TestTypeCompletion.py (1622 of 2142) PASS: lldb-shell :: ObjectFile/ELF/PT_LOAD-overlap.yaml (1623 of 2142) PASS: lldb-shell :: SymbolFile/DWARF/debug-types-basic.test (1624 of 2142) PASS: lldb-api :: tools/lldb-vscode/breakpoint/TestVSCode_setExceptionBreakpoints.py (1625 of 2142) UNSUPPORTED: lldb-api :: functionalities/thread/state/TestThreadStates.py (1626 of 2142) PASS: lldb-unit :: Utility/./UtilityTests/ArgsTest.TestArgv (1627 of 2142) PASS: lldb-api :: commands/frame/diagnose/local-variable/TestLocalVariable.py (1628 of 2142) PASS: lldb-unit :: Utility/./UtilityTests/BroadcasterTest.EventTypeHasListeners (1629 of 2142) PASS: lldb-unit :: Utility/./UtilityTests/UriParserTest.SchemeHostSeparator2 (1630 of 2142) PASS: lldb-unit :: Utility/./UtilityTests/SerializationRountripTest.SerializeDeserializePod (1631 of 2142) UNSUPPORTED: lldb-api :: arm/breakpoint-thumb-codesection/TestBreakpointThumbCodesection.py (1632 of 2142) PASS: lldb-unit :: Expression/./ExpressionTests/DiagnosticManagerTest.HasFixits (1633 of 2142) PASS: lldb-unit :: Symbol/./SymbolTests/TestTypeSystemClang.TestGetEnumIntegerTypeBasicTypes (1634 of 2142) PASS: lldb-api :: commands/platform/file/read/TestPlatformFileRead.py (1635 of 2142) PASS: lldb-api :: terminal/TestSTTYBeforeAndAfter.py (1636 of 2142) PASS: lldb-unit :: Utility/./UtilityTests/ConstStringTest.YAML (1637 of 2142) PASS: lldb-shell :: ObjectFile/ELF/PT_LOAD.yaml (1638 of 2142) PASS: lldb-unit :: Host/./HostTests/SocketTest.TCPGetAddress (1639 of 2142) PASS: lldb-unit :: Utility/./UtilityTests/OptionsWithRawTest.UnterminatedQuote (1640 of 2142) UNSUPPORTED: lldb-api :: python_api/event/TestEvents.py (1641 of 2142) PASS: lldb-api :: functionalities/tail_call_frames/sbapi_support/TestTailCallFrameSBAPI.py (1642 of 2142) PASS: lldb-api :: commands/expression/char/TestExprsChar.py (1643 of 2142) PASS: lldb-api :: driver/batch_mode/TestBatchMode.py (1644 of 2142) PASS: lldb-unit :: ScriptInterpreter/Python/./ScriptInterpreterPythonTests/PythonDataObjectsTest.TestPythonListToStructuredList (1645 of 2142) PASS: lldb-unit :: Utility/./UtilityTests/BinaryStreamTest.PutULEB128EightBytes (1646 of 2142) PASS: lldb-api :: macosx/safe-to-func-call/TestSafeFuncCalls.py (1647 of 2142) PASS: lldb-api :: tools/lldb-vscode/console/TestVSCode_console.py (1648 of 2142) PASS: lldb-unit :: Language/Highlighting/./HighlighterTests/HighlighterTest.ClangOperators (1649 of 2142) PASS: lldb-api :: commands/frame/diagnose/dereference-this/TestDiagnoseDereferenceThis.py (1650 of 2142) PASS: lldb-unit :: Process/minidump/./LLDBMinidumpTests/MinidumpParserTest.GetMiscInfoWindows (1651 of 2142) PASS: lldb-unit :: Utility/./UtilityTests/StreamTeeTest.Flush (1652 of 2142) PASS: lldb-api :: commands/command/nested_alias/TestNestedAlias.py (1653 of 2142) PASS: lldb-unit :: Utility/./UtilityTests/Flags.IsClear (1654 of 2142) PASS: lldb-api :: python_api/frame/inlines/TestInlinedFrame.py (1655 of 2142) PASS: lldb-api :: commands/target/select/TestTargetSelect.py (1656 of 2142) PASS: lldb-unit :: Process/minidump/./LLDBMinidumpTests/MinidumpParserTest.MinidumpDuplicateModuleMappedSecond (1657 of 2142) PASS: lldb-shell :: Commands/command-backtrace.test (1658 of 2142) PASS: lldb-shell :: Reproducer/TestCrash.test (1659 of 2142) PASS: lldb-shell :: Reproducer/TestDebugSymbols.test (1660 of 2142) PASS: lldb-shell :: ObjectFile/PECOFF/disassemble-thumb.yaml (1661 of 2142) PASS: lldb-api :: functionalities/deleted-executable/TestDeletedExecutable.py (1662 of 2142) PASS: lldb-shell :: SymbolFile/DWARF/debug_line-tombstone.s (1663 of 2142) PASS: lldb-shell :: Watchpoint/SetErrorCases.test (1664 of 2142) PASS: lldb-api :: lang/objc/foundation/TestObjCMethods.py (1665 of 2142) PASS: lldb-api :: commands/frame/var-scope/TestFrameVariableScope.py (1666 of 2142) PASS: lldb-api :: functionalities/breakpoint/breakpoint_by_file_colon_line/TestBreakpointByFileColonLine.py (1667 of 2142) PASS: lldb-api :: functionalities/thread/concurrent_events/TestConcurrentManyBreakpoints.py (1668 of 2142) PASS: lldb-api :: lang/cpp/nsimport/TestCppNsImport.py (1669 of 2142) PASS: lldb-unit :: Process/gdb-remote/./ProcessGdbRemoteTests/GDBRemoteCommunicationClientTest.SendGetDataPacket (1670 of 2142) PASS: lldb-unit :: Utility/./UtilityTests/StringExtractorTest.DecodeHexU8_Extra (1671 of 2142) XFAIL: lldb-shell :: Register/x86-64-ymm-write.test (1672 of 2142) PASS: lldb-unit :: Process/gdb-remote/./ProcessGdbRemoteTests/GDBRemoteCommunicationClientTest.SaveRestoreRegistersNoSuffix (1673 of 2142) PASS: lldb-api :: functionalities/gdb_remote_client/TestQemuAArch64TargetXml.py (1674 of 2142) PASS: lldb-unit :: Language/Highlighting/./HighlighterTests/HighlighterTest.ClangScalarLiterals (1675 of 2142) PASS: lldb-unit :: Utility/./UtilityTests/StreamTest.PutHex32ByteOrderBig (1676 of 2142) PASS: lldb-unit :: Utility/./UtilityTests/ArgsTest.TestQuotedUnknownEscape (1677 of 2142) PASS: lldb-unit :: Utility/./UtilityTests/StringExtractorTest.InitMisc (1678 of 2142) PASS: lldb-api :: python_api/watchpoint/TestWatchpointIgnoreCount.py (1679 of 2142) PASS: lldb-api :: commands/expression/import-std-module/vector-of-vectors/TestVectorOfVectorsFromStdModule.py (1680 of 2142) PASS: lldb-api :: tools/lldb-server/TestGdbRemote_qThreadStopInfo.py (1681 of 2142) UNSUPPORTED: lldb-api :: functionalities/darwin_log/filter/regex/activity-chain/TestDarwinLogFilterRegexActivityChain.py (1682 of 2142) PASS: lldb-unit :: Utility/./UtilityTests/UriParserTest.BracketedHostnameWithPortIPv6 (1683 of 2142) PASS: lldb-shell :: Reproducer/TestProcessList.test (1684 of 2142) PASS: lldb-unit :: Utility/./UtilityTests/ArchSpecTest.TestSetTriple (1685 of 2142) PASS: lldb-shell :: SymbolFile/DWARF/dwo-type-in-main-file.s (1686 of 2142) PASS: lldb-unit :: Utility/./UtilityTests/RangeTest.DoesAdjoinOrIntersect (1687 of 2142) PASS: lldb-unit :: Utility/./UtilityTests/StringLexerTest.NextIf (1688 of 2142) PASS: lldb-api :: tools/lldb-vscode/variables/TestVSCode_variables.py (1689 of 2142) PASS: lldb-api :: functionalities/data-formatter/setvaluefromcstring/TestSetValueFromCString.py (1690 of 2142) PASS: lldb-unit :: Utility/./UtilityTests/SerializationRountripTest.SerializeDeserializeCStringArray (1691 of 2142) PASS: lldb-api :: functionalities/non-overlapping-index-variable-i/TestIndexVariable.py (1692 of 2142) PASS: lldb-unit :: ScriptInterpreter/Python/./ScriptInterpreterPythonTests/PythonDataObjectsTest.TestPythonString (1693 of 2142) PASS: lldb-api :: commands/expression/top-level/TestTopLevelExprs.py (1694 of 2142) PASS: lldb-unit :: Utility/./UtilityTests/RangeTest.ContainsAddr (1695 of 2142) PASS: lldb-api :: functionalities/abbreviation/TestCommonShortSpellings.py (1696 of 2142) PASS: lldb-api :: functionalities/tail_call_frames/ambiguous_tail_call_seq1/TestAmbiguousTailCallSeq1.py (1697 of 2142) PASS: lldb-shell :: Commands/command-regex-delete.test (1698 of 2142) PASS: lldb-unit :: Utility/./UtilityTests/StringListTest.AppendStringStdString (1699 of 2142) PASS: lldb-unit :: Language/Highlighting/./HighlighterTests/HighlighterTest.ClangTrailingBackslashBeforeNewline (1700 of 2142) PASS: lldb-unit :: Host/./HostTests/FileSystemTest.GetByteSize (1701 of 2142) PASS: lldb-unit :: Target/./TargetTests/ExecutionContextTest.GetByteOrder (1702 of 2142) PASS: lldb-unit :: Utility/./UtilityTests/StreamTest.PutPtr (1703 of 2142) PASS: lldb-api :: commands/process/attach-resume/TestAttachResume.py (1704 of 2142) PASS: lldb-unit :: Utility/./UtilityTests/StreamTest.PutHex16ByteOrderBig (1705 of 2142) PASS: lldb-api :: functionalities/data-formatter/data-formatter-ptr-to-array/TestPtrToArrayFormatting.py (1706 of 2142) PASS: lldb-shell :: SymbolFile/NativePDB/break-by-line.cpp (1707 of 2142) PASS: lldb-unit :: Expression/./ExpressionTests/CppModuleConfigurationTest.MissingLibCpp (1708 of 2142) PASS: lldb-api :: functionalities/data-formatter/data-formatter-objc/nsstring/TestDataFormatterNSString.py (1709 of 2142) PASS: lldb-api :: functionalities/tail_call_frames/thread_step_out_or_return/TestSteppingOutWithArtificialFrames.py (1710 of 2142) PASS: lldb-unit :: Utility/./UtilityTests/ArchSpecTest.TripleComponentsWereSpecified (1711 of 2142) PASS: lldb-unit :: Utility/./UtilityTests/ArgsTest.EscapeLLDBCommandArgument (1712 of 2142) PASS: lldb-api :: functionalities/multidebugger_commands/TestMultipleDebuggersCommands.py (1713 of 2142) PASS: lldb-unit :: Signals/./SignalsTests/UnixSignalsTest.VersionChange (1714 of 2142) PASS: lldb-api :: commands/expression/regression-access-function-template-in-record/TestRegressionAccessFunctionTemplateInRecord.py (1715 of 2142) PASS: lldb-unit :: Core/./LLDBCoreTests/ModuleSpecTest.TestELFFile (1716 of 2142) PASS: lldb-api :: commands/expression/ir-interpreter-phi-nodes/TestIRInterpreterPHINodes.py (1717 of 2142) PASS: lldb-unit :: Utility/./UtilityTests/BinaryStreamTest.PutSLEB128OneByte (1718 of 2142) PASS: lldb-unit :: Utility/./UtilityTests/StringListTest.AppendStringMove (1719 of 2142) PASS: lldb-api :: functionalities/thread/concurrent_events/TestConcurrentWatchpointDelayWatchpointOneBreakpoint.py (1720 of 2142) PASS: lldb-api :: functionalities/breakpoint/cpp/TestCPPBreakpointLocations.py (1721 of 2142) PASS: lldb-unit :: Utility/./UtilityTests/XcodeSDKTest.GetCanonicalNameAndConstruct (1722 of 2142) PASS: lldb-api :: commands/expression/call-function/TestCallStopAndContinue.py (1723 of 2142) PASS: lldb-unit :: Utility/./UtilityTests/RangeDataVector.CustomSort (1724 of 2142) PASS: lldb-api :: macosx/load-kext/TestLoadKext.py (1725 of 2142) PASS: lldb-unit :: Utility/./UtilityTests/SharedCluster.ClusterManager (1726 of 2142) PASS: lldb-unit :: Utility/./UtilityTests/ConstStringTest.CompareConstString (1727 of 2142) PASS: lldb-api :: lang/cpp/class_types/TestClassTypesDisassembly.py (1728 of 2142) UNSUPPORTED: lldb-api :: commands/register/register/intel_xtended_registers/mpx_bound_violation/TestBoundViolation.py (1729 of 2142) PASS: lldb-api :: lang/cpp/incomplete-types/TestCppIncompleteTypes.py (1730 of 2142) PASS: lldb-api :: functionalities/breakpoint/breakpoint_callback_command_source/TestBreakpointCallbackCommandSource.py (1731 of 2142) PASS: lldb-api :: commands/expression/no-deadlock/TestExprDoesntBlock.py (1732 of 2142) PASS: lldb-api :: types/TestLongTypes.py (1733 of 2142) PASS: lldb-shell :: Driver/TestProcessAttach.test (1734 of 2142) PASS: lldb-unit :: Expression/./ExpressionTests/CppModuleConfigurationTest.MissingUsrInclude (1735 of 2142) PASS: lldb-unit :: Utility/./UtilityTests/NameMatchesTest.StartsWith (1736 of 2142) PASS: lldb-shell :: Settings/TestDisassemblyFormat.test (1737 of 2142) PASS: lldb-api :: commands/settings/use_source_cache/TestUseSourceCache.py (1738 of 2142) PASS: lldb-api :: functionalities/reproducers/attach/TestReproducerAttach.py (1739 of 2142) PASS: lldb-api :: lang/objc/objc-class-method/TestObjCClassMethod.py (1740 of 2142) PASS: lldb-api :: functionalities/breakpoint/hardware_breakpoints/require_hw_breakpoints/TestRequireHWBreakpoints.py (1741 of 2142) PASS: lldb-shell :: ObjectFile/MachO/lc_version_min.yaml (1742 of 2142) PASS: lldb-unit :: Process/minidump/./LLDBMinidumpTests/MinidumpParserTest.GetLinuxProcStatus_no_stream (1743 of 2142) PASS: lldb-unit :: Utility/./UtilityTests/AnsiTerminal.Empty (1744 of 2142) PASS: lldb-unit :: Expression/./ExpressionTests/DWARFExpression.DW_OP_unknown (1745 of 2142) PASS: lldb-unit :: Utility/./UtilityTests/RecordReplayTest.InstrumentedFoo (1746 of 2142) PASS: lldb-api :: functionalities/data-formatter/data-formatter-python-synth/TestDataFormatterPythonSynth.py (1747 of 2142) PASS: lldb-shell :: Minidump/fb-dump.test (1748 of 2142) PASS: lldb-shell :: SymbolFile/DWARF/anon_class_w_and_wo_export_symbols.ll (1749 of 2142) PASS: lldb-api :: lang/objc/foundation/TestRuntimeTypes.py (1750 of 2142) UNSUPPORTED: lldb-shell :: Register/x86-gp-read.test (1751 of 2142) PASS: lldb-shell :: Settings/TestSettingsWrite.test (1752 of 2142) PASS: lldb-unit :: UnwindAssembly/x86/./UnwindAssemblyx86Tests/Testx86AssemblyInspectionEngine.TestAddRSP (1753 of 2142) PASS: lldb-unit :: UnwindAssembly/x86/./UnwindAssemblyx86Tests/Testx86AssemblyInspectionEngine.TestPopEBP (1754 of 2142) PASS: lldb-unit :: Host/./HostTests/SocketTest.DomainGetConnectURI (1755 of 2142) PASS: lldb-api :: tools/lldb-server/commandline/TestStubReverseConnect.py (1756 of 2142) PASS: lldb-unit :: Utility/./UtilityTests/OptionsWithRawTest.EmptyArgsOnlySuffix (1757 of 2142) PASS: lldb-api :: commands/platform/process/list/TestProcessList.py (1758 of 2142) PASS: lldb-unit :: Utility/./UtilityTests/RangeTest.ContainsRangeStartingFromZero (1759 of 2142) PASS: lldb-unit :: SymbolFile/DWARF/./SymbolFileDWARFTests/SymbolFileDWARFTests.TestAbbrevOrder1Start1 (1760 of 2142) PASS: lldb-unit :: UnwindAssembly/x86/./UnwindAssemblyx86Tests/Testx86AssemblyInspectionEngine.TestPushImm (1761 of 2142) PASS: lldb-api :: lang/objc/modules/TestObjCModules.py (1762 of 2142) UNSUPPORTED: lldb-api :: lang/c/typedef/Testtypedef.py (1763 of 2142) PASS: lldb-unit :: Process/minidump/./LLDBMinidumpTests/MinidumpParserTest.FindMemoryRangeWithFullMemoryMinidump (1764 of 2142) PASS: lldb-unit :: Symbol/./SymbolTests/TestTypeSystemClang.TemplateArguments (1765 of 2142) PASS: lldb-api :: commands/expression/call-function/TestCallStdStringFunction.py (1766 of 2142) PASS: lldb-unit :: Utility/./UtilityTests/StringListTest.LongestCommonPrefixDuplicateElement (1767 of 2142) PASS: lldb-shell :: Unwind/thread-step-out-ret-addr-check.test (1768 of 2142) PASS: lldb-api :: functionalities/thread/concurrent_events/TestConcurrentWatchBreak.py (1769 of 2142) PASS: lldb-unit :: Utility/./UtilityTests/StringExtractorTest.GetHexBytes_OddPair2 (1770 of 2142) PASS: lldb-unit :: Host/./HostTests/MainLoopTest.Signal (1771 of 2142) PASS: lldb-unit :: Utility/./UtilityTests/StreamTest.PutCharWhitespace (1772 of 2142) PASS: lldb-unit :: Language/CLanguages/./LanguageCLanguagesTests/CLanguages.LookupCLanguagesByLanguageType (1773 of 2142) PASS: lldb-unit :: Platform/./LLDBPlatformTests/PlatformAppleSimulatorTest.TestHostPlatformToSim (1774 of 2142) PASS: lldb-api :: python_api/sbplatform/TestSBPlatform.py (1775 of 2142) PASS: lldb-unit :: Utility/./UtilityTests/StringLexerTest.Peek (1776 of 2142) PASS: lldb-api :: functionalities/thread/concurrent_events/TestConcurrentManyWatchpoints.py (1777 of 2142) PASS: lldb-shell :: Commands/command-script-import.test (1778 of 2142) PASS: lldb-shell :: Driver/TestConvenienceVariables.test (1779 of 2142) PASS: lldb-unit :: Utility/./UtilityTests/StringExtractorTest.GetHexU8_Underflow_NoEof (1780 of 2142) PASS: lldb-api :: functionalities/data-formatter/nsarraysynth/TestNSArraySynthetic.py (1781 of 2142) PASS: lldb-unit :: Process/gdb-remote/./ProcessGdbRemoteTests/GDBRemoteCommunicationClientTest.SendStopTracePacket (1782 of 2142) PASS: lldb-api :: lang/objc/radar-9691614/TestObjCMethodReturningBOOL.py (1783 of 2142) PASS: lldb-shell :: SymbolFile/DWARF/find-function-regex.cpp (1784 of 2142) PASS: lldb-unit :: Utility/./UtilityTests/GeneratorTest.YamlMultiProvider (1785 of 2142) PASS: lldb-unit :: Utility/./UtilityTests/StreamTest.PutStringAsRawHex8 (1786 of 2142) PASS: lldb-unit :: UnwindAssembly/x86/./UnwindAssemblyx86Tests/Testx86AssemblyInspectionEngine.TestSpillRegToStackViaMOVx86_64 (1787 of 2142) PASS: lldb-unit :: Utility/./UtilityTests/OptionsWithRawTest.ArgsButNoDelimiter (1788 of 2142) PASS: lldb-api :: functionalities/data-formatter/language_category_updates/TestDataFormatterLanguageCategoryUpdates.py (1789 of 2142) UNSUPPORTED: lldb-api :: tools/lldb-server/TestGdbRemoteCompletion.py (1790 of 2142) PASS: lldb-unit :: Utility/./UtilityTests/RangeTest.Constructor (1791 of 2142) PASS: lldb-shell :: SymbolFile/DWARF/DW_TAG_variable-DW_AT_const_value.s (1792 of 2142) PASS: lldb-unit :: Utility/./UtilityTests/StreamTest.PutCString (1793 of 2142) PASS: lldb-shell :: Commands/command-disassemble-process.yaml (1794 of 2142) PASS: lldb-api :: macosx/duplicate-archive-members/TestDuplicateMembers.py (1795 of 2142) PASS: lldb-unit :: Language/Highlighting/./HighlighterTests/HighlighterTest.FallbackHighlighter (1796 of 2142) PASS: lldb-unit :: Core/./LLDBCoreTests/RichManglingContextTest.Basic (1797 of 2142) PASS: lldb-api :: lang/cpp/subst_template_type_param/TestSubstTemplateTypeParam.py (1798 of 2142) PASS: lldb-api :: functionalities/data-formatter/data-formatter-stl/libcxx/unordered/TestDataFormatterUnordered.py (1799 of 2142) UNSUPPORTED: lldb-api :: tools/lldb-server/signal-filtering/TestGdbRemote_QPassSignals.py (1800 of 2142) PASS: lldb-api :: commands/platform/basic/TestPlatformCommand.py (1801 of 2142) PASS: lldb-unit :: SymbolFile/NativePDB/./SymbolFileNativePDBTests/PDBFPOProgramToDWARFExpressionTests.UnknownOp (1802 of 2142) UNSUPPORTED: lldb-shell :: ScriptInterpreter/Lua/persistent_state.test (1803 of 2142) PASS: lldb-shell :: Reproducer/TestPythonImport.test (1804 of 2142) PASS: lldb-api :: commands/expression/import-std-module/forward_list-dbg-info-content/TestDbgInfoContentForwardListFromStdModule.py (1805 of 2142) PASS: lldb-unit :: Utility/./UtilityTests/StringListTest.LongestCommonPrefixNoPrefix (1806 of 2142) PASS: lldb-unit :: UnwindAssembly/x86/./UnwindAssemblyx86Tests/Testx86AssemblyInspectionEngine.TestPushEDX (1807 of 2142) PASS: lldb-api :: tools/lldb-vscode/breakpoint/TestVSCode_setFunctionBreakpoints.py (1808 of 2142) UNSUPPORTED: lldb-api :: tools/intel-features/intel-pt/test/TestIntelPTSimpleBinary.py (1809 of 2142) PASS: lldb-api :: commands/gui/basic/TestGuiBasic.py (1810 of 2142) PASS: lldb-api :: python_api/sblaunchinfo/TestSBLaunchInfo.py (1811 of 2142) PASS: lldb-unit :: debugserver/./debugserverTests/JSON.Parse (1812 of 2142) PASS: lldb-shell :: Settings/TestModuleCacheSanity.test (1813 of 2142) PASS: lldb-unit :: Utility/./UtilityTests/TimerTest.CategoryTimesNested (1814 of 2142) PASS: lldb-unit :: Core/./LLDBCoreTests/CommunicationTest.SynchronizeWhileClosing (1815 of 2142) PASS: lldb-api :: functionalities/thread/step_out/TestThreadStepOut.py (1816 of 2142) PASS: lldb-api :: functionalities/archives/TestBSDArchives.py (1817 of 2142) PASS: lldb-api :: functionalities/tail_call_frames/disambiguate_tail_call_seq/TestDisambiguateTailCallSeq.py (1818 of 2142) UNSUPPORTED: lldb-shell :: Breakpoint/case-insensitive.test (1819 of 2142) PASS: lldb-api :: lang/c/global_variables/TestGlobalVariables.py (1820 of 2142) PASS: lldb-unit :: SymbolFile/NativePDB/./SymbolFileNativePDBTests/PDBFPOProgramToDWARFExpressionTests.InvalidAssignmentSingle (1821 of 2142) PASS: lldb-api :: lang/objc/foundation/TestObjectDescriptionAPI.py (1822 of 2142) PASS: lldb-api :: functionalities/thread_plan/TestThreadPlanCommands.py (1823 of 2142) PASS: lldb-unit :: Language/Highlighting/./HighlighterTests/HighlighterTest.ClangTrailingBackslashMissingNewLine (1824 of 2142) PASS: lldb-api :: macosx/universal/TestUniversal.py (1825 of 2142) PASS: lldb-unit :: ObjectFile/MachO/./ObjectFileMachOTests/ObjectFileMachOTest.ModuleFromSharedCacheInfo (1826 of 2142) PASS: lldb-api :: functionalities/thread/concurrent_events/TestConcurrentDelaySignalWatch.py (1827 of 2142) PASS: lldb-unit :: UnwindAssembly/x86/./UnwindAssemblyx86Tests/Testx86AssemblyInspectionEngine.TestStackRealign32BitDisp_x86_64 (1828 of 2142) PASS: lldb-unit :: Editline/./EditlineTests/EditlineTestFixture.EditlineReceivesSingleLineText (1829 of 2142) PASS: lldb-api :: tools/lldb-server/TestGdbRemoteExpeditedRegisters.py (1830 of 2142) PASS: lldb-api :: functionalities/breakpoint/address_breakpoints/TestAddressBreakpoints.py (1831 of 2142) PASS: lldb-api :: lang/objc/objc_direct-methods/TestObjCDirectMethods.py (1832 of 2142) PASS: lldb-unit :: Utility/./UtilityTests/BinaryStreamTest.PutSLEB128TwoBytes (1833 of 2142) PASS: lldb-api :: functionalities/param_entry_vals/basic_entry_values/TestBasicEntryValues.py (1834 of 2142) PASS: lldb-unit :: Expression/./ExpressionTests/DiagnosticManagerTest.PutStringSeverities (1835 of 2142) PASS: lldb-unit :: Symbol/./SymbolTests/TestTypeSystemClang.TestOwningModule (1836 of 2142) PASS: lldb-unit :: Utility/./UtilityTests/ProcessInfoTest.Constructor (1837 of 2142) PASS: lldb-api :: lang/objc/objc++/TestObjCXX.py (1838 of 2142) PASS: lldb-api :: commands/expression/dollar-in-variable/TestDollarInVariable.py (1839 of 2142) PASS: lldb-shell :: Minidump/disassemble-no-module.yaml (1840 of 2142) PASS: lldb-unit :: SymbolFile/NativePDB/./SymbolFileNativePDBTests/PDBFPOProgramToDWARFExpressionTests.MultipleIndependentAssignments (1841 of 2142) PASS: lldb-unit :: Expression/./ExpressionTests/DiagnosticManagerTest.GetStringMultiline (1842 of 2142) PASS: lldb-unit :: Utility/./UtilityTests/RangeTest.NotEqualInvalid (1843 of 2142) UNSUPPORTED: lldb-shell :: SymbolFile/NativePDB/local-variables.cpp (1844 of 2142) PASS: lldb-api :: functionalities/rerun/TestRerun.py (1845 of 2142) PASS: lldb-unit :: Host/./HostTests/MainLoopTest.UnmonitoredSignal (1846 of 2142) PASS: lldb-api :: functionalities/thread/concurrent_events/TestConcurrentTwoWatchpointsOneDelayBreakpoint.py (1847 of 2142) PASS: lldb-unit :: Host/./HostTests/FileSystemTest.Readable (1848 of 2142) PASS: lldb-api :: lang/objc/ptr_refs/TestPtrRefsObjC.py (1849 of 2142) UNSUPPORTED: lldb-api :: linux/sepdebugsymlink/TestTargetSymbolsSepDebugSymlink.py (1850 of 2142) PASS: lldb-unit :: Utility/./UtilityTests/LogChannelTest.List (1851 of 2142) UNSUPPORTED: lldb-shell :: ExecControl/StopHook/stop-hook-threads.test (1852 of 2142) PASS: lldb-api :: functionalities/data-formatter/cstring-utf8-summary/TestCstringUnicode.py (1853 of 2142) PASS: lldb-unit :: UnwindAssembly/ARM64/./Arm64InstEmulationTests/TestArm64InstEmulation.TestCFARegisterTrackedAcrossJumps (1854 of 2142) PASS: lldb-api :: tools/lldb-server/TestGdbRemoteSingleStep.py (1855 of 2142) PASS: lldb-api :: lang/objc/objc-struct-argument/TestObjCStructArgument.py (1856 of 2142) PASS: lldb-unit :: Utility/./UtilityTests/StreamTest.PutCStringWithStringRef (1857 of 2142) PASS: lldb-api :: lang/cpp/alignas_base_class/TestAlignAsBaseClass.py (1858 of 2142) PASS: lldb-unit :: Process/minidump/./LLDBMinidumpTests/MinidumpParserTest.GetPidWow64 (1859 of 2142) PASS: lldb-unit :: Host/./HostTests/NativeProcessProtocolTest.ReadCStringFromMemory_CrossPageBoundary (1860 of 2142) PASS: lldb-api :: types/TestShortType.py (1861 of 2142) PASS: lldb-api :: commands/expression/function_template_specialization_temp_args/TestFunctionTemplateSpecializationTempArgs.py (1862 of 2142) PASS: lldb-unit :: Utility/./UtilityTests/ArgsTest.TestMultipleArgs (1863 of 2142) PASS: lldb-api :: lang/cpp/limit-debug-info/TestWithLimitDebugInfo.py (1864 of 2142) PASS: lldb-shell :: ObjectFile/ELF/netbsd-core-amd64.test (1865 of 2142) PASS: lldb-unit :: UnwindAssembly/x86/./UnwindAssemblyx86Tests/Testx86AssemblyInspectionEngine.TestPushEDI (1866 of 2142) PASS: lldb-unit :: Utility/./UtilityTests/OptionsWithRawTest.TerminatedQuote (1867 of 2142) PASS: lldb-unit :: Utility/./UtilityTests/FileSpecTest.Yaml (1868 of 2142) PASS: lldb-api :: functionalities/tail_call_frames/disambiguate_paths_to_common_sink/TestDisambiguatePathsToCommonSink.py (1869 of 2142) PASS: lldb-unit :: Utility/./UtilityTests/StreamTest.PutHex64ByteOrderBig (1870 of 2142) PASS: lldb-shell :: SymbolFile/Breakpad/stack-cfi-parsing.test (1871 of 2142) PASS: lldb-unit :: Utility/./UtilityTests/ArgsTest.TestOverwriteArgs (1872 of 2142) PASS: lldb-api :: lang/objc/forward-decl/TestForwardDecl.py (1873 of 2142) PASS: lldb-unit :: Utility/./UtilityTests/StreamTeeTest.AppendStream (1874 of 2142) PASS: lldb-unit :: Process/gdb-remote/./ProcessGdbRemoteTests/GDBRemoteCommunicationServerTest.SendErrorResponse_ErrorNumber (1875 of 2142) PASS: lldb-unit :: ScriptInterpreter/Python/./ScriptInterpreterPythonTests/PythonDataObjectsTest.TestResetting (1876 of 2142) UNSUPPORTED: lldb-api :: functionalities/tty/TestTerminal.py (1877 of 2142) PASS: lldb-api :: lang/cpp/enum_types/TestCPP11EnumTypes.py (1878 of 2142) PASS: lldb-unit :: Host/./HostTests/Host.WaitStatusFormat (1879 of 2142) PASS: lldb-unit :: Symbol/./SymbolTests/TestTypeSystemClang.TestFunctionTemplateConstruction (1880 of 2142) PASS: lldb-unit :: UnwindAssembly/x86/./UnwindAssemblyx86Tests/Testx86AssemblyInspectionEngine.TestStackRealignMSVC_i386 (1881 of 2142) PASS: lldb-unit :: Utility/./UtilityTests/ScalarTest.APIntConstructor (1882 of 2142) PASS: lldb-api :: commands/expression/weak_symbols/TestWeakSymbols.py (1883 of 2142) UNSUPPORTED: lldb-api :: commands/register/register/intel_xtended_registers/TestMPXRegisters.py (1884 of 2142) PASS: lldb-unit :: Utility/./UtilityTests/StringListTest.GetMaxStringLengthDecreasingSize (1885 of 2142) PASS: lldb-unit :: Utility/./UtilityTests/EventTest.DumpEventDataBytes (1886 of 2142) PASS: lldb-api :: macosx/profile_vrs_detach/TestDetachVrsProfile.py (1887 of 2142) PASS: lldb-api :: functionalities/memory/find/TestMemoryFind.py (1888 of 2142) UNSUPPORTED: lldb-api :: benchmarks/startup/TestStartupDelays.py (1889 of 2142) PASS: lldb-api :: commands/expression/namespace_local_var_same_name_cpp_and_c/TestNamespaceLocalVarSameNameCppAndC.py (1890 of 2142) PASS: lldb-api :: python_api/exprpath_synthetic/TestExprPathSynthetic.py (1891 of 2142) PASS: lldb-api :: lang/cpp/frame-var-anon-unions/TestFrameVariableAnonymousUnions.py (1892 of 2142) PASS: lldb-unit :: Utility/./UtilityTests/VMRange.Clear (1893 of 2142) PASS: lldb-api :: functionalities/thread/concurrent_events/TestConcurrentDelayedCrashWithBreakpointWatchpoint.py (1894 of 2142) UNSUPPORTED: lldb-api :: functionalities/data-formatter/data-formatter-stl/libstdcpp/smart_ptr/TestDataFormatterStdSmartPtr.py (1895 of 2142) UNSUPPORTED: lldb-shell :: Register/x86-64-gp-write.test (1896 of 2142) PASS: lldb-unit :: Utility/./UtilityTests/ArchSpecTest.Compatibility (1897 of 2142) PASS: lldb-api :: lang/c/stepping/TestStepAndBreakpoints.py (1898 of 2142) PASS: lldb-unit :: Utility/./UtilityTests/RangeTest.EqualInvalid (1899 of 2142) PASS: lldb-unit :: Utility/./UtilityTests/UriParserTest.LongPath (1900 of 2142) PASS: lldb-api :: lang/c/array_types/TestArrayTypes.py (1901 of 2142) PASS: lldb-unit :: Interpreter/./InterpreterTests/OptionArgParserTest.toBoolean (1902 of 2142) PASS: lldb-api :: lang/cpp/global_variables/TestCPPGlobalVariables.py (1903 of 2142) PASS: lldb-unit :: Expression/./ExpressionTests/DiagnosticManagerTest.GetStringPreserveOrder (1904 of 2142) PASS: lldb-unit :: Process/gdb-remote/./ProcessGdbRemoteTests/GDBRemoteClientBaseTest.InterruptNoResponse (1905 of 2142) PASS: lldb-api :: functionalities/data-formatter/data-formatter-objc/cmtime/TestDataFormatterCMTime.py (1906 of 2142) PASS: lldb-api :: commands/frame/diagnose/virtual-method-call/TestDiagnoseDereferenceVirtualMethodCall.py (1907 of 2142) PASS: lldb-unit :: ObjectFile/Breakpad/./ObjectFileBreakpadTests/Record.classify (1908 of 2142) PASS: lldb-api :: lang/cpp/exceptions/TestCPPExceptionBreakpoints.py (1909 of 2142) PASS: lldb-unit :: Process/gdb-remote/./ProcessGdbRemoteTests/GDBRemoteCommunicationClientTest.WriteRegisterNoSuffix (1910 of 2142) PASS: lldb-unit :: DataFormatter/./LLDBFormatterTests/TypeMatcherTests.GetMatchStringRegex (1911 of 2142) PASS: lldb-unit :: Utility/./UtilityTests/RegisterValueTest.GetSet8 (1912 of 2142) PASS: lldb-unit :: Utility/./UtilityTests/RangeTest.ClearWithStarAddress (1913 of 2142) PASS: lldb-shell :: Commands/CommandScriptImmediateOutput/CommandScriptImmediateOutputFile.test (1914 of 2142) PASS: lldb-unit :: SymbolFile/NativePDB/./SymbolFileNativePDBTests/PDBFPOProgramToDWARFExpressionTests.UnsupportedRASearch (1915 of 2142) PASS: lldb-unit :: Utility/./UtilityTests/UriParserTest.SchemeHostSeparator (1916 of 2142) PASS: lldb-api :: functionalities/thread/concurrent_events/TestConcurrentSignalDelayWatch.py (1917 of 2142) PASS: lldb-unit :: Utility/./UtilityTests/BinaryStreamTest.PutULEB128One (1918 of 2142) PASS: lldb-shell :: SymbolFile/DWARF/debug_line-relative_path.s (1919 of 2142) PASS: lldb-api :: lang/cpp/namespace/TestNamespaceLookup.py (1920 of 2142) PASS: lldb-unit :: Utility/./UtilityTests/ScalarTest.LongLongAssigmentOperator (1921 of 2142) PASS: lldb-api :: macosx/queues/TestQueues.py (1922 of 2142) PASS: lldb-api :: commands/expression/radar_9673664/TestExprHelpExamples.py (1923 of 2142) UNSUPPORTED: lldb-shell :: ObjectFile/ELF/minidebuginfo-no-lzma.yaml (1924 of 2142) PASS: lldb-unit :: ObjectFile/Breakpad/./ObjectFileBreakpadTests/LineRecord.parse (1925 of 2142) PASS: lldb-unit :: Utility/./UtilityTests/VMRange.IsValid (1926 of 2142) PASS: lldb-api :: functionalities/exec/TestExec.py (1927 of 2142) PASS: lldb-api :: functionalities/data-formatter/data-formatter-proper-plurals/TestFormattersOneIsSingular.py (1928 of 2142) UNSUPPORTED: lldb-shell :: SymbolFile/PDB/vbases.test (1929 of 2142) PASS: lldb-api :: functionalities/thread/backtrace_limit/TestBacktraceLimit.py (1930 of 2142) PASS: lldb-unit :: Utility/./UtilityTests/StringListTest.GetMaxStringLengthIncreasingSize (1931 of 2142) PASS: lldb-unit :: DataFormatter/./LLDBFormatterTests/FormatManagerTests.CompatibleLangs (1932 of 2142) PASS: lldb-unit :: Process/gdb-remote/./ProcessGdbRemoteTests/GDBRemoteCommunicationClientTest.GetMemoryRegionInfoInvalidResponse (1933 of 2142) PASS: lldb-api :: lang/objc/modules-auto-import/TestModulesAutoImport.py (1934 of 2142) PASS: lldb-api :: lang/cpp/const_this/TestConstThis.py (1935 of 2142) PASS: lldb-unit :: Utility/./UtilityTests/OptionsWithRawTest.WhitespaceInput (1936 of 2142) PASS: lldb-shell :: Commands/command-breakpoint-col.test (1937 of 2142) PASS: lldb-api :: python_api/objc_type/TestObjCType.py (1938 of 2142) UNSUPPORTED: lldb-shell :: Process/Windows/exception_access_violation.cpp (1939 of 2142) UNSUPPORTED: lldb-shell :: Register/x86-64-ymm16-read.test (1940 of 2142) PASS: lldb-shell :: Commands/command-disassemble.s (1941 of 2142) PASS: lldb-api :: functionalities/gdb_remote_client/TestNestedRegDefinitions.py (1942 of 2142) PASS: lldb-api :: lang/cpp/accelerator-table/TestCPPAccelerator.py (1943 of 2142) PASS: lldb-api :: functionalities/breakpoint/scripted_bkpt/TestScriptedResolver.py (1944 of 2142) PASS: lldb-unit :: Utility/./UtilityTests/FileSpecTest.IsRelative (1945 of 2142) PASS: lldb-shell :: Driver/TestNoUseColor.test (1946 of 2142) PASS: lldb-unit :: Utility/./UtilityTests/Predicate.WaitForValueEqualTo (1947 of 2142) PASS: lldb-unit :: Utility/./UtilityTests/RegularExpression.Valid (1948 of 2142) PASS: lldb-unit :: Utility/./UtilityTests/StreamTest.PutHex32ByteOrderLittle (1949 of 2142) PASS: lldb-unit :: Utility/./UtilityTests/UriParserTest.SchemeHostSeparator4 (1950 of 2142) PASS: lldb-api :: functionalities/postmortem/elf-core/TestLinuxCore.py (1951 of 2142) PASS: lldb-unit :: ScriptInterpreter/Python/./ScriptInterpreterPythonTests/PythonDataObjectsTest.TestPythonInteger (1952 of 2142) PASS: lldb-api :: python_api/interpreter/TestCommandInterpreterAPI.py (1953 of 2142) PASS: lldb-unit :: Language/Highlighting/./HighlighterTests/HighlighterTest.ClangCursorPosBeforeOtherToken (1954 of 2142) PASS: lldb-api :: functionalities/data-formatter/data-formatter-enum-format/TestDataFormatterEnumFormat.py (1955 of 2142) PASS: lldb-api :: functionalities/data-formatter/stringprinter/TestStringPrinter.py (1956 of 2142) PASS: lldb-api :: commands/target/stop-hook/delete/TestTargetStopHookDelete.py (1957 of 2142) UNSUPPORTED: lldb-shell :: ScriptInterpreter/Lua/bindings.test (1958 of 2142) PASS: lldb-api :: functionalities/gdb_remote_client/TestqOffsets.py (1959 of 2142) PASS: lldb-unit :: Core/./LLDBCoreTests/UniqueCStringMap.NoDefaultConstructor (1960 of 2142) PASS: lldb-shell :: ObjectFile/ELF/minidebuginfo-corrupt-xz.yaml (1961 of 2142) PASS: lldb-api :: functionalities/thread/concurrent_events/TestConcurrentNWatchNBreak.py (1962 of 2142) PASS: lldb-api :: lang/c/local_types/TestUseClosestType.py (1963 of 2142) PASS: lldb-shell :: Register/x86-64-gp-read.test (1964 of 2142) PASS: lldb-api :: functionalities/gdb_remote_client/TestRecognizeBreakpoint.py (1965 of 2142) PASS: lldb-api :: lang/cpp/gmodules-templates/TestGModules.py (1966 of 2142) PASS: lldb-api :: functionalities/inferior-crashing/recursive-inferior/TestRecursiveInferiorStep.py (1967 of 2142) PASS: lldb-api :: macosx/function-starts/TestFunctionStarts.py (1968 of 2142) PASS: lldb-unit :: Expression/./ExpressionTests/DiagnosticManagerTest.GetStringNoDiags (1969 of 2142) PASS: lldb-unit :: Process/gdb-remote/./ProcessGdbRemoteTests/GDBRemoteCommunicationServerTest.SendErrorResponse_UnimplementedError (1970 of 2142) PASS: lldb-unit :: Utility/./UtilityTests/StringListTest.LongestCommonPrefixEmpty (1971 of 2142) PASS: lldb-api :: functionalities/data-formatter/data-formatter-script/TestDataFormatterScript.py (1972 of 2142) PASS: lldb-unit :: Symbol/./SymbolTests/TestTypeSystemClang.TestGetBasicTypeFromEnum (1973 of 2142) UNSUPPORTED: lldb-api :: lang/objc/objc-dynamic-value/TestObjCDynamicValue.py (1974 of 2142) PASS: lldb-unit :: Utility/./UtilityTests/StringExtractorTest.GetU32LittleEndian (1975 of 2142) PASS: lldb-api :: functionalities/data-formatter/data-formatter-objc/TestDataFormatterObjCNSBundle.py (1976 of 2142) PASS: lldb-api :: functionalities/set-data/TestSetData.py (1977 of 2142) PASS: lldb-shell :: ObjectFile/ELF/basic-info.yaml (1978 of 2142) PASS: lldb-api :: functionalities/thread/exit_during_step/TestExitDuringStep.py (1979 of 2142) PASS: lldb-unit :: Utility/./UtilityTests/StreamTest.PutHex16ByteOrderLittle (1980 of 2142) PASS: lldb-shell :: SymbolFile/DWARF/gnu-style-compression.cpp (1981 of 2142) PASS: lldb-unit :: Symbol/./SymbolTests/TestTypeSystemClang.TestRecordHasFields (1982 of 2142) PASS: lldb-api :: commands/watchpoints/watchpoint_disable/TestWatchpointDisable.py (1983 of 2142) PASS: lldb-unit :: Process/gdb-remote/./ProcessGdbRemoteTests/GDBRemoteCommunicationClientTest.SendGetTraceConfigPacket (1984 of 2142) PASS: lldb-unit :: Symbol/./SymbolTests/TestClangASTImporter.CopyTypeTagDecl (1985 of 2142) UNSUPPORTED: lldb-shell :: Register/arm-fp-read.test (1986 of 2142) PASS: lldb-unit :: Utility/./UtilityTests/FileSpecTest.RemoveLastPathComponent (1987 of 2142) PASS: lldb-api :: functionalities/stats_api/TestStatisticsAPI.py (1988 of 2142) UNSUPPORTED: lldb-shell :: Register/x86-64-zmm-write.test (1989 of 2142) PASS: lldb-unit :: Process/gdb-remote/./ProcessGdbRemoteTests/GDBRemoteCommunicationServerTest.SendErrorResponse_ErrorList (1990 of 2142) PASS: lldb-unit :: Utility/./UtilityTests/StringExtractorTest.GetHexBytesAvail (1991 of 2142) PASS: lldb-api :: commands/expression/codegen-crash-typedefdecl-not-in_declcontext/TestCodegenCrashTypedefDeclNotInDeclContext.py (1992 of 2142) PASS: lldb-api :: python_api/sbvalue_const_addrof/TestSBValueConstAddrOf.py (1993 of 2142) PASS: lldb-api :: tools/lldb-vscode/runInTerminal/TestVSCode_runInTerminal.py (1994 of 2142) PASS: lldb-api :: python_api/watchpoint/TestSetWatchpoint.py (1995 of 2142) PASS: lldb-api :: functionalities/breakpoint/step_over_breakpoint/TestStepOverBreakpoint.py (1996 of 2142) PASS: lldb-unit :: Host/./HostTests/HostInfoTest.GetXcodeSDK (1997 of 2142) PASS: lldb-unit :: UnwindAssembly/x86/./UnwindAssemblyx86Tests/Testx86AssemblyInspectionEngine.TestSpillRegToStackViaMOVi386 (1998 of 2142) PASS: lldb-api :: functionalities/thread/concurrent_events/TestConcurrentSignalDelayBreak.py (1999 of 2142) PASS: lldb-unit :: Utility/./UtilityTests/StatusTest.ErrorConversion (2000 of 2142) PASS: lldb-unit :: Utility/./UtilityTests/StringExtractorTest.DecodeHexU8_Exact (2001 of 2142) PASS: lldb-unit :: Language/Highlighting/./HighlighterTests/HighlighterTest.DefaultHighlighterWithCursor (2002 of 2142) PASS: lldb-unit :: Utility/./UtilityTests/RangeVector.CombineConsecutiveRanges (2003 of 2142) PASS: lldb-api :: lang/cpp/symbols/TestSymbols.py (2004 of 2142) PASS: lldb-unit :: Utility/./UtilityTests/StringListTest.LongestCommonPrefix (2005 of 2142) PASS: lldb-unit :: SymbolFile/DWARF/./SymbolFileDWARFTests/SymbolFileDWARFTests.ParseArangesNonzeroSegmentSize (2006 of 2142) PASS: lldb-unit :: ObjectFile/Breakpad/./ObjectFileBreakpadTests/InfoRecord.parse (2007 of 2142) PASS: lldb-unit :: SymbolFile/DWARF/./SymbolFileDWARFTests/SymbolFileDWARFTests.TestAbbrevOrder1Start5 (2008 of 2142) PASS: lldb-api :: commands/expression/persistent_ptr_update/TestPersistentPtrUpdate.py (2009 of 2142) UNSUPPORTED: lldb-api :: functionalities/darwin_log/filter/exact_match/activity/TestDarwinLogFilterMatchActivity.py (2010 of 2142) PASS: lldb-api :: lang/cpp/modules-import/TestCXXModulesImport.py (2011 of 2142) PASS: lldb-api :: lang/cpp/breakpoint_in_member_func_w_non_primitive_params/TestBreakpointInMemberFuncWNonPrimitiveParams.py (2012 of 2142) PASS: lldb-unit :: Host/./HostTests/NativeProcessProtocolTest.ReadMemoryWithoutTrap (2013 of 2142) PASS: lldb-shell :: SymbolFile/DWARF/debug-types-signature-loop.s (2014 of 2142) PASS: lldb-shell :: Reproducer/TestFileRepro.test (2015 of 2142) PASS: lldb-unit :: Utility/./UtilityTests/AnsiTerminal.Basic (2016 of 2142) PASS: lldb-api :: functionalities/data-formatter/data-formatter-stl/libcxx/multiset/TestDataFormatterLibcxxMultiSet.py (2017 of 2142) PASS: lldb-unit :: UnwindAssembly/x86/./UnwindAssemblyx86Tests/Testx86AssemblyInspectionEngine.TestPopRBPWithREX (2018 of 2142) PASS: lldb-unit :: Symbol/./SymbolTests/TestClangASTImporter.MetadataPropagationAfterCopying (2019 of 2142) PASS: lldb-unit :: Utility/./UtilityTests/FileSpecTest.AppendPathComponent (2020 of 2142) PASS: lldb-api :: functionalities/tail_call_frames/ambiguous_tail_call_seq2/TestAmbiguousTailCallSeq2.py (2021 of 2142) PASS: lldb-unit :: Process/minidump/./LLDBMinidumpTests/RegisterContextMinidump.ConvertMinidumpContext_x86_64 (2022 of 2142) UNSUPPORTED: lldb-api :: functionalities/darwin_log/filter/regex/message/TestDarwinLogFilterRegexMessage.py (2023 of 2142) PASS: lldb-shell :: Reproducer/TestCaptureEnvOverride.test (2024 of 2142) PASS: lldb-unit :: Utility/./UtilityTests/RangeTest.Union (2025 of 2142) PASS: lldb-unit :: Utility/./UtilityTests/OptionsWithRawTest.SingleWordSuffix (2026 of 2142) PASS: lldb-api :: types/TestDoubleTypes.py (2027 of 2142) PASS: lldb-unit :: Utility/./UtilityTests/PassiveReplayTest.InstrumentedBarPtr (2028 of 2142) PASS: lldb-unit :: Language/Highlighting/./HighlighterTests/HighlighterTest.ClangPPDirectives (2029 of 2142) PASS: lldb-unit :: Utility/./UtilityTests/StringListTest.Clear (2030 of 2142) UNSUPPORTED: lldb-shell :: ScriptInterpreter/Lua/convenience_variables.test (2031 of 2142) PASS: lldb-unit :: Utility/./UtilityTests/BinaryStreamTest.PutULEB128SevenBytes (2032 of 2142) PASS: lldb-api :: functionalities/data-formatter/data-formatter-objc/TestDataFormatterObjCExpr.py (2033 of 2142) PASS: lldb-shell :: Breakpoint/debug_rnglist_basic.test (2034 of 2142) PASS: lldb-unit :: Expression/./ExpressionTests/ClangHostTest.ComputeClangResourceDirectory (2035 of 2142) PASS: lldb-api :: commands/command/script_alias/TestCommandScriptAlias.py (2036 of 2142) PASS: lldb-api :: commands/expression/namespace_local_var_same_name_obj_c/TestNamespaceLocalVarSameNameObjC.py (2037 of 2142) PASS: lldb-api :: types/TestIntegerTypeExpr.py (2038 of 2142) PASS: lldb-api :: commands/expression/import-std-module/vector/TestVectorFromStdModule.py (2039 of 2142) PASS: lldb-api :: python_api/value/TestValueAPI.py (2040 of 2142) PASS: lldb-shell :: ObjectFile/wasm/unified-debug-sections.yaml (2041 of 2142) UNSUPPORTED: lldb-api :: functionalities/data-formatter/data-formatter-stl/libstdcpp/tuple/TestDataFormatterStdTuple.py (2042 of 2142) PASS: lldb-api :: arm/emulation/TestEmulations.py (2043 of 2142) PASS: lldb-api :: types/TestDoubleTypesExpr.py (2044 of 2142) PASS: lldb-unit :: tools/lldb-server/tests/./LLDBServerTests/TestBase.DebugserverEnv (2045 of 2142) PASS: lldb-api :: functionalities/postmortem/minidump-new/TestMiniDumpUUID.py (2046 of 2142) UNSUPPORTED: lldb-api :: functionalities/darwin_log/source/info/TestDarwinLogSourceInfo.py (2047 of 2142) PASS: lldb-unit :: Utility/./UtilityTests/RangeTest.DoesIntersect (2048 of 2142) PASS: lldb-unit :: Utility/./UtilityTests/DataExtractorTest.GetBitfield (2049 of 2142) PASS: lldb-unit :: Utility/./UtilityTests/DataExtractorTest.GetMaxS64 (2050 of 2142) PASS: lldb-api :: functionalities/data-formatter/data-formatter-stl/libcxx/function/TestLibCxxFunction.py (2051 of 2142) PASS: lldb-unit :: Utility/./UtilityTests/ArgsTest.TestTrailingBackslash (2052 of 2142) PASS: lldb-unit :: Utility/./UtilityTests/Flags.GetBitSize (2053 of 2142) PASS: lldb-unit :: Host/./HostTests/FileSystemTest.EmptyTest (2054 of 2142) PASS: lldb-api :: lang/c/enum_types/TestEnumTypes.py (2055 of 2142) PASS: lldb-shell :: SymbolFile/Breakpad/unwind-via-stack-win-no-memory-info.yaml (2056 of 2142) PASS: lldb-api :: lang/cpp/signed_types/TestSignedTypes.py (2057 of 2142) PASS: lldb-unit :: Utility/./UtilityTests/LogChannelEnabledTest.LLDB_LOG_ERROR (2058 of 2142) UNSUPPORTED: lldb-api :: functionalities/darwin_log/filter/regex/category/TestDarwinLogFilterRegexCategory.py (2059 of 2142) PASS: lldb-unit :: Utility/./UtilityTests/StringExtractorTest.InitEmpty (2060 of 2142) PASS: lldb-shell :: SymbolFile/DWARF/DW_TAG_variable-invalid_location.s (2061 of 2142) PASS: lldb-api :: commands/expression/multiline-navigation/TestMultilineNavigation.py (2062 of 2142) PASS: lldb-unit :: Utility/./UtilityTests/XcodeSDKTest.ParseTest (2063 of 2142) PASS: lldb-unit :: Utility/./UtilityTests/LogTest.LLDB_LOG_nullptr (2064 of 2142) PASS: lldb-api :: functionalities/show_location/TestShowLocationDwarf5.py (2065 of 2142) PASS: lldb-unit :: UnwindAssembly/x86/./UnwindAssemblyx86Tests/Testx86AssemblyInspectionEngine.TestSpArithx86_64Augmented (2066 of 2142) PASS: lldb-unit :: Host/./HostTests/SocketTest.TCPListen0ConnectAccept (2067 of 2142) PASS: lldb-unit :: Host/./HostTests/ConnectionFileDescriptorTest.TCPGetURIv4 (2068 of 2142) PASS: lldb-api :: functionalities/thread/concurrent_events/TestConcurrentCrashWithSignal.py (2069 of 2142) PASS: lldb-api :: functionalities/postmortem/elf-core/gcore/TestGCore.py (2070 of 2142) PASS: lldb-unit :: Utility/./UtilityTests/ArgsTest.AppendArguments (2071 of 2142) PASS: lldb-unit :: Process/gdb-remote/./ProcessGdbRemoteTests/GDBRemoteCommunicationClientTest.GetModulesInfo_UUID20 (2072 of 2142) UNSUPPORTED: lldb-shell :: SymbolFile/DWARF/debug-types-expressions.test (2073 of 2142) PASS: lldb-shell :: Quit/TestQuitExitCode-30.test (2074 of 2142) PASS: lldb-shell :: ObjectFile/PECOFF/export-dllfunc.yaml (2075 of 2142) PASS: lldb-api :: commands/target/basic/TestTargetCommand.py (2076 of 2142) PASS: lldb-unit :: DataFormatter/./LLDBFormatterTests/StringPrinterTests.SwiftUTF8 (2077 of 2142) PASS: lldb-shell :: SymbolFile/Breakpad/unwind-via-stack-win.test (2078 of 2142) PASS: lldb-unit :: Symbol/./SymbolTests/PostfixExpression.ParseOneExpression (2079 of 2142) PASS: lldb-api :: lang/objc/print-obj/TestPrintObj.py (2080 of 2142) PASS: lldb-api :: functionalities/thread/concurrent_events/TestConcurrentDelaySignalBreak.py (2081 of 2142) PASS: lldb-unit :: Language/Highlighting/./HighlighterTests/HighlighterTest.ClangComments (2082 of 2142) PASS: lldb-shell :: SymbolFile/DWARF/dwarf5-partial-index.cpp (2083 of 2142) PASS: lldb-unit :: ScriptInterpreter/Python/./ScriptInterpreterPythonTests/PythonDataObjectsTest.TestScript (2084 of 2142) PASS: lldb-api :: commands/expression/import-std-module/deque-dbg-info-content/TestDbgInfoContentDequeFromStdModule.py (2085 of 2142) PASS: lldb-api :: commands/watchpoints/watchpoint_count/TestWatchpointCount.py (2086 of 2142) PASS: lldb-api :: functionalities/data-formatter/data-formatter-objc/TestDataFormatterObjNSException.py (2087 of 2142) PASS: lldb-shell :: ObjectFile/ELF/base-address.yaml (2088 of 2142) PASS: lldb-api :: functionalities/data-formatter/data-formatter-cpp/TestDataFormatterCpp.py (2089 of 2142) PASS: lldb-api :: commands/platform/file/close/TestPlatformFileClose.py (2090 of 2142) PASS: lldb-unit :: Utility/./UtilityTests/StringListTest.AppendList (2091 of 2142) PASS: lldb-unit :: Target/./TargetTests/ModuleCacheTest.GetAndPutStrangeHostname (2092 of 2142) PASS: lldb-unit :: UnwindAssembly/x86/./UnwindAssemblyx86Tests/Testx86AssemblyInspectionEngine.TestSimple64bitFrameFunction (2093 of 2142) PASS: lldb-api :: commands/reproducer/invalid-args/TestInvalidArgsReproducer.py (2094 of 2142) PASS: lldb-api :: lang/cpp/global_operators/TestCppGlobalOperators.py (2095 of 2142) PASS: lldb-unit :: Utility/./UtilityTests/Flags.Reset (2096 of 2142) PASS: lldb-api :: functionalities/gdb_remote_client/TestWasm.py (2097 of 2142) PASS: lldb-api :: functionalities/thread/concurrent_events/TestConcurrentCrashWithWatchpoint.py (2098 of 2142) PASS: lldb-api :: functionalities/data-formatter/nssetsynth/TestNSSetSynthetic.py (2099 of 2142) PASS: lldb-api :: functionalities/gdb_remote_client/TestGDBRemoteDiskFileCompletion.py (2100 of 2142) PASS: lldb-unit :: Interpreter/./InterpreterTests/CompletionTest.DirCompletionUsername (2101 of 2142) PASS: lldb-unit :: SymbolFile/DWARF/./SymbolFileDWARFTests/XcodeSDKModuleTests.TestModuleGetXcodeSDK (2102 of 2142) PASS: lldb-unit :: Language/Highlighting/./HighlighterTests/HighlighterTest.HighlighterSelectionPath (2103 of 2142) PASS: lldb-unit :: ScriptInterpreter/Python/./ScriptInterpreterPythonTests/PythonDataObjectsTest.TestPythonTupleSize (2104 of 2142) UNSUPPORTED: lldb-shell :: ScriptInterpreter/Lua/command_script_import.test (2105 of 2142) PASS: lldb-unit :: Utility/./UtilityTests/UriParserTest.BadPort2 (2106 of 2142) PASS: lldb-unit :: Symbol/./SymbolTests/DWARFCallFrameInfoTest.Basic_dwarf4 (2107 of 2142) PASS: lldb-api :: functionalities/gdb_remote_client/TestNoGPacketSupported.py (2108 of 2142) PASS: lldb-unit :: ObjectFile/Breakpad/./ObjectFileBreakpadTests/StackWinRecord.parse (2109 of 2142) PASS: lldb-unit :: Target/./TargetTests/PathMappingListTest.RemapRoot (2110 of 2142) PASS: lldb-unit :: Utility/./UtilityTests/StringListTest.AppendListCStringArray (2111 of 2142) PASS: lldb-unit :: UnwindAssembly/x86/./UnwindAssemblyx86Tests/Testx86AssemblyInspectionEngine.TestSimplex86_64Augmented (2112 of 2142) PASS: lldb-api :: commands/watchpoints/watchpoint_commands/TestWatchpointCommands.py (2113 of 2142) PASS: lldb-shell :: SymbolFile/DWARF/dwarf5-atomic.s (2114 of 2142) PASS: lldb-unit :: SymbolFile/DWARF/./SymbolFileDWARFTests/DWARFASTParserClangTests.EnsureAllDIEsInDeclContextHaveBeenParsedParsesOnlyMatchingEntries (2115 of 2142) PASS: lldb-unit :: Utility/./UtilityTests/UriParserTest.BracketedHostname (2116 of 2142) PASS: lldb-unit :: Utility/./UtilityTests/VMRange.Comparison (2117 of 2142) UNSUPPORTED: lldb-api :: android/platform/TestDefaultCacheLineSize.py (2118 of 2142) PASS: lldb-api :: functionalities/data-formatter/data-formatter-objc/TestDataFormatterObjCKVO.py (2119 of 2142) PASS: lldb-unit :: Utility/./UtilityTests/ScalarTest.GetBytes (2120 of 2142) PASS: lldb-shell :: Process/TestAbortExitCode.test (2121 of 2142) UNSUPPORTED: lldb-shell :: Register/aarch64-fp-read.test (2122 of 2142) PASS: lldb-shell :: Reproducer/TestMultipleTargets.test (2123 of 2142) PASS: lldb-api :: functionalities/data-formatter/poarray/TestPrintObjectArray.py (2124 of 2142) PASS: lldb-shell :: ObjectFile/PECOFF/symbol.yaml (2125 of 2142) PASS: lldb-shell :: SymbolFile/NativePDB/globals-bss.cpp (2126 of 2142) PASS: lldb-unit :: Expression/./ExpressionTests/DWARFExpression.DW_OP_piece (2127 of 2142) PASS: lldb-shell :: SymbolFile/DWARF/find-method.cpp (2128 of 2142) UNSUPPORTED: lldb-shell :: Register/x86-64-xmm16-read.test (2129 of 2142) PASS: lldb-unit :: Utility/./UtilityTests/ArgsTest.TestInsertArg (2130 of 2142) PASS: lldb-unit :: Utility/./UtilityTests/OptionsWithRawTest.EmptyInput (2131 of 2142) PASS: lldb-unit :: Utility/./UtilityTests/OptionsWithRawTest.SingleWhitespaceInput (2132 of 2142) PASS: lldb-unit :: Process/gdb-remote/./ProcessGdbRemoteTests/GDBRemoteCommunicationClientTest.GetModulesInfoInvalidResponse (2133 of 2142) PASS: lldb-api :: python_api/watchpoint/watchlocation/TestTargetWatchAddress.py (2134 of 2142) PASS: lldb-unit :: Disassembler/./DisassemblerTests/TestArm64Disassembly.TestArmv81Instruction (2135 of 2142) PASS: lldb-unit :: Symbol/./SymbolTests/TestTypeSystemClang.TestGetTypeClassDeclType (2136 of 2142) PASS: lldb-shell :: SymbolFile/DWARF/array-sizes.s (2137 of 2142) PASS: lldb-shell :: VSCode/TestOptions.test (2138 of 2142) PASS: lldb-api :: lang/cpp/nested-class-other-compilation-unit/TestNestedClassWithParentInAnotherCU.py (2139 of 2142) PASS: lldb-api :: tools/lldb-server/commandline/TestStubSetSID.py (2140 of 2142) PASS: lldb-api :: commands/expression/argument_passing_restrictions/TestArgumentPassingRestrictions.py (2141 of 2142) PASS: lldb-api :: lang/c/function_types/TestFunctionTypes.py (2142 of 2142) Slowest Tests: -------------------------------------------------------------------------- 600.49s: lldb-api :: macosx/simulator/TestSimulatorPlatform.py 529.46s: lldb-api :: functionalities/postmortem/mach-core/TestMachCore.py 317.44s: lldb-api :: lang/objc/objc-static-method/TestObjCStaticMethod.py 260.02s: lldb-api :: lang/objc/hidden-ivars/TestHiddenIvars.py 150.63s: lldb-api :: lang/cpp/dynamic-value/TestDynamicValue.py 117.24s: lldb-api :: commands/log/basic/TestLogging.py 104.04s: lldb-api :: tools/lldb-server/TestLldbGdbServer.py 83.97s: lldb-api :: lang/c/struct_types/TestStructTypes.py 74.48s: lldb-api :: lang/objc/foundation/TestObjCMethods.py 69.49s: lldb-api :: python_api/interpreter/TestRunCommandInterpreterAPI.py 57.06s: lldb-api :: lang/objc/foundation/TestFoundationDisassembly.py 54.19s: lldb-api :: lang/objc/exceptions/TestObjCExceptions.py 52.86s: lldb-api :: api/multithreaded/TestMultithreaded.py 51.97s: lldb-api :: functionalities/load_unload/TestLoadUnload.py 46.27s: lldb-api :: types/TestLongTypesExpr.py 44.78s: lldb-api :: lang/cpp/namespace/TestNamespaceLookup.py 44.42s: lldb-shell :: ObjectFile/PECOFF/disassemble-thumb.yaml 43.83s: lldb-api :: python_api/frame/TestFrames.py 40.55s: lldb-api :: functionalities/completion/TestCompletion.py 40.33s: lldb-api :: lang/objc/objc-new-syntax/TestObjCNewSyntaxLiteral.py

Hide Details

Tests Times: -------------------------------------------------------------------------- [ Range ] :: [ Percentage ] :: [ Count ] -------------------------------------------------------------------------- [600s,650s) :: [ ] :: [ 1/2142] [550s,600s) :: [ ] :: [ 1/2142] [500s,550s) :: [ ] :: [ 0/2142] [450s,500s) :: [ ] :: [ 0/2142] [400s,450s) :: [ ] :: [ 0/2142] [350s,400s) :: [ ] :: [ 0/2142] [300s,350s) :: [ ] :: [ 1/2142] [250s,300s) :: [ ] :: [ 1/2142] [200s,250s) :: [ ] :: [ 0/2142] [150s,200s) :: [ ] :: [ 1/2142] [100s,150s) :: [ ] :: [ 2/2142] [ 50s,100s) :: [ ] :: [ 8/2142] [ 0s, 50s) :: [*************************************** ] :: [2127/2142] -------------------------------------------------------------------------- ******************** Timed Out Tests (1): lldb-api :: macosx/simulator/TestSimulatorPlatform.py

Hide Details

Hide Details

Testing Time: 2130.95s Unsupported : 150 Passed : 1985 Expectedly Failed: 6 Timed Out : 1 FAILED: tools/lldb/test/CMakeFiles/check-lldb-lit cd /Users/buildslave/jenkins/workspace/lldb-cmake/lldb-build/tools/lldb/test && /usr/local/Frameworks/Python.framework/Versions/3.7/bin/python3.7 /Users/buildslave/jenkins/workspace/lldb-cmake/lldb-build/./bin/llvm-lit -v --time-tests --shuffle --xunit-xml-output=/Users/buildslave/jenkins/workspace/lldb-cmake/test/results.xml -v -j 4 /Users/buildslave/jenkins/workspace/lldb-cmake/lldb-build/tools/lldb/test ninja: build stopped: subcommand failed. Command failed: Command '['/usr/bin/env', 'TERM=vt100', '/usr/local/bin/ninja', '-v', 'check-lldb']' returned non-zero exit status 1 Command: ['/usr/bin/env', 'TERM=vt100', '/usr/local/bin/ninja', '-v', 'check-lldb'] [Pipeline] } [Pipeline] // timeout [Pipeline] } [Pipeline] // stage [Pipeline] stage [Pipeline] { (Declarative: Post Actions) [Pipeline] scanForIssues [Clang (LLVM based)] Sleeping for 5 seconds due to JENKINS-32191... [Clang (LLVM based)] Parsing console log (workspace: '/Users/buildslave/jenkins/workspace/lldb-cmake') [Clang (LLVM based)] Successfully parsed console log [Clang (LLVM based)] -> found 8 issues (skipped 12 duplicates) [Clang (LLVM based)] Post processing issues on 'green-dragon-10' with source code encoding 'UTF-8' [Clang (LLVM based)] Creating SCM blamer to obtain author and commit information for affected files [Clang (LLVM based)] Creating SCM miner to obtain statistics for affected repository files [Clang (LLVM based)] Resolving file names for all issues in source directory '/Users/buildslave/jenkins/workspace/lldb-cmake' [Clang (LLVM based)] -> resolved paths in source directory (6 found, 0 not found) [Clang (LLVM based)] Resolving module names from module definitions (build.xml, pom.xml, or Manifest.mf files) [Clang (LLVM based)] -> resolved module names for 8 issues [Clang (LLVM based)] Resolving package names (or namespaces) by parsing the affected files [Clang (LLVM based)] -> resolved package names of 6 affected files [Clang (LLVM based)] No filter has been set, publishing all 8 issues [Clang (LLVM based)] Creating fingerprints for all affected code blocks to track issues over different builds [Clang (LLVM based)] -> created fingerprints for 8 issues (skipped 0 issues) [Clang (LLVM based)] Copying affected files to Jenkins' build folder '/Users/Shared/Jenkins/Home/jobs/lldb-cmake/builds/23829/files-with-issues' [Clang (LLVM based)] -> 4 copied, 2 not in workspace, 0 not-found, 0 with I/O error [Pipeline] junit Recording test results [Pipeline] } [Pipeline] // stage [Pipeline] } [Pipeline] // withEnv [Pipeline] } [Pipeline] // node [Pipeline] End of Pipeline ERROR: script returned exit code 1 Finished: FAILURE