AbortedConsole Output

Skipping 9,085 KB.. Full Log
 of 2145)
PASS: lldb-api :: macosx/queues/TestQueues.py (751 of 2145)
PASS: lldb-unit :: UnwindAssembly/ARM64/./Arm64InstEmulationTests/TestArm64InstEmulation.TestRegisterDoubleSpills (752 of 2145)
PASS: lldb-api :: functionalities/thread/thread_exit/TestThreadExit.py (753 of 2145)
PASS: lldb-api :: commands/frame/diagnose/array/TestArray.py (754 of 2145)
PASS: lldb-api :: functionalities/object-file/TestImageListMultiArchitecture.py (755 of 2145)
PASS: lldb-unit :: Utility/./UtilityTests/ArchSpecTest.TestParseMachCPUDashSubtypeTripleExtra (756 of 2145)
PASS: lldb-api :: commands/expression/import-std-module/vector-of-vectors/TestVectorOfVectorsFromStdModule.py (757 of 2145)
UNSUPPORTED: lldb-shell :: SymbolFile/PDB/type-quals.test (758 of 2145)
UNSUPPORTED: lldb-api :: benchmarks/continue/TestBenchmarkContinue.py (759 of 2145)
PASS: lldb-unit :: Process/gdb-remote/./ProcessGdbRemoteTests/GDBRemoteCommunicationClientTest.GetModulesInfoInvalidResponse (760 of 2145)
PASS: lldb-unit :: Utility/./UtilityTests/EventTest.DumpEventDataBytes (761 of 2145)
PASS: lldb-shell :: SymbolFile/Breakpad/stack-cfi-parsing.test (762 of 2145)
PASS: lldb-unit :: Language/CPlusPlus/./LanguageCPlusPlusTests/CPlusPlusLanguage.MethodNameParsing (763 of 2145)
UNSUPPORTED: lldb-shell :: ScriptInterpreter/Lua/independent_state.test (764 of 2145)
PASS: lldb-api :: commands/expression/context-object/TestContextObject.py (765 of 2145)
PASS: lldb-api :: functionalities/data-formatter/varscript_formatting/TestDataFormatterVarScriptFormatting.py (766 of 2145)
PASS: lldb-api :: lang/objc/modules-hash-mismatch/TestClangModulesHashMismatch.py (767 of 2145)
PASS: lldb-unit :: Host/./HostTests/File.GetWaitableHandleFileno (768 of 2145)
PASS: lldb-api :: functionalities/testid/TestTestId.py (769 of 2145)
PASS: lldb-api :: commands/disassemble/basic/TestFrameDisassemble.py (770 of 2145)
PASS: lldb-api :: functionalities/mtc/simple/TestMTCSimple.py (771 of 2145)
PASS: lldb-api :: functionalities/thread/backtrace_limit/TestBacktraceLimit.py (772 of 2145)
PASS: lldb-api :: lang/objc/foundation/TestObjectDescriptionAPI.py (773 of 2145)
PASS: lldb-unit :: Host/./HostTests/NativeProcessProtocolTest.SetBreakpoint (774 of 2145)
PASS: lldb-api :: python_api/watchpoint/condition/TestWatchpointConditionAPI.py (775 of 2145)
PASS: lldb-unit :: Host/./HostTests/FileActionTest.Open (776 of 2145)
PASS: lldb-unit :: Symbol/./SymbolTests/TestTypeSystemClang.TestIsClangType (777 of 2145)
PASS: lldb-unit :: Utility/./UtilityTests/BinaryStreamTest.PutSLEB128EightBytes (778 of 2145)
PASS: lldb-shell :: ObjectFile/ELF/PT_LOAD-overlap-PT_TLS.yaml (779 of 2145)
PASS: lldb-unit :: Process/minidump/./LLDBMinidumpTests/MinidumpParserTest.InvalidMinidump (780 of 2145)
PASS: lldb-unit :: Utility/./UtilityTests/OptionsWithRawTest.QuotedSuffix (781 of 2145)
PASS: lldb-api :: tools/lldb-vscode/launch/TestVSCode_launch.py (782 of 2145)
UNSUPPORTED: lldb-shell :: Register/x86-gp-read.test (783 of 2145)
PASS: lldb-unit :: Utility/./UtilityTests/RangeTest.NotEqual (784 of 2145)
PASS: lldb-unit :: Utility/./UtilityTests/UriParserTest.MinimalPort (785 of 2145)
PASS: lldb-api :: functionalities/gdb_remote_client/TestProcessConnect.py (786 of 2145)
PASS: lldb-unit :: Utility/./UtilityTests/ArchSpecTest.OperatorBool (787 of 2145)
PASS: lldb-unit :: Process/minidump/./LLDBMinidumpTests/MinidumpParserTest.GetThreadContext_x86_64 (788 of 2145)
PASS: lldb-unit :: Expression/./ExpressionTests/CppModuleConfigurationTest.UnrelatedLibrary (789 of 2145)
PASS: lldb-unit :: Utility/./UtilityTests/LogChannelEnabledTest.log_options (790 of 2145)
PASS: lldb-unit :: Utility/./UtilityTests/StringListTest.LongestCommonPrefixNoPrefix (791 of 2145)
PASS: lldb-unit :: Utility/./UtilityTests/LogChannelTest.EnableOptions (792 of 2145)
PASS: lldb-unit :: Process/minidump/./LLDBMinidumpTests/MinidumpParserTest.GetLinuxProcStatus (793 of 2145)
PASS: lldb-shell :: SymbolFile/DWARF/debug_rnglists-dwo.s (794 of 2145)
PASS: lldb-unit :: Process/minidump/./LLDBMinidumpTests/MinidumpParserTest.MinidumpDuplicateModuleMappedSecond (795 of 2145)
PASS: lldb-unit :: Target/./TargetTests/PathMappingListTest.RelativeTests (796 of 2145)
PASS: lldb-shell :: Reproducer/TestRelativePath.test (797 of 2145)
PASS: lldb-unit :: Expression/./ExpressionTests/DiagnosticManagerTest.AppendMessageNoDiag (798 of 2145)
PASS: lldb-api :: commands/process/launch-with-shellexpand/TestLaunchWithShellExpand.py (799 of 2145)
PASS: lldb-api :: tools/lldb-vscode/module/TestVSCode_module.py (800 of 2145)
PASS: lldb-api :: api/multithreaded/TestMultithreaded.py (801 of 2145)
PASS: lldb-unit :: Utility/./UtilityTests/VMRange.IsValid (802 of 2145)
PASS: lldb-api :: functionalities/tail_call_frames/disambiguate_paths_to_common_sink/TestDisambiguatePathsToCommonSink.py (803 of 2145)
PASS: lldb-shell :: Settings/TestDisassemblyFormat.test (804 of 2145)
PASS: lldb-unit :: Utility/./UtilityTests/BinaryStreamTest.PutULEB128SixBytes (805 of 2145)
PASS: lldb-unit :: Utility/./UtilityTests/FileSpecTest.EqualDotsPosixRoot (806 of 2145)
PASS: lldb-unit :: ScriptInterpreter/Python/./ScriptInterpreterPythonTests/PythonDataObjectsTest.TestRun (807 of 2145)
PASS: lldb-unit :: Utility/./UtilityTests/StringListTest.PopBack (808 of 2145)
PASS: lldb-shell :: Breakpoint/ppc64-localentry.test (809 of 2145)
PASS: lldb-api :: commands/expression/issue_11588/Test11588.py (810 of 2145)
PASS: lldb-api :: commands/command/delete/TestCommandDelete.py (811 of 2145)
PASS: lldb-api :: lang/c/vla/TestVLA.py (812 of 2145)
PASS: lldb-unit :: Utility/./UtilityTests/DataExtractorTest.GetCStrEmpty (813 of 2145)
PASS: lldb-unit :: Utility/./UtilityTests/StringListTest.GetMaxStringLengthIncreasingSize (814 of 2145)
PASS: lldb-api :: python_api/hello_world/TestHelloWorld.py (815 of 2145)
PASS: lldb-api :: lang/cpp/member-and-local-vars-with-same-name/TestMembersAndLocalsWithSameName.py (816 of 2145)
PASS: lldb-unit :: Process/gdb-remote/./ProcessGdbRemoteTests/GDBRemoteCommunicationClientTest.SendSignalsToIgnore (817 of 2145)
PASS: lldb-api :: lang/cpp/covariant-return-types/TestCovariantReturnTypes.py (818 of 2145)
PASS: lldb-unit :: Utility/./UtilityTests/ArgsTest.TestAppendArg (819 of 2145)
UNSUPPORTED: lldb-api :: macosx/macCatalystAppMacOSFramework/TestMacCatalystAppWithMacOSFramework.py (820 of 2145)
PASS: lldb-unit :: UnwindAssembly/x86/./UnwindAssemblyx86Tests/Testx86AssemblyInspectionEngine.TestAddESP (821 of 2145)
PASS: lldb-api :: commands/expression/xvalue/TestXValuePrinting.py (822 of 2145)
PASS: lldb-unit :: ScriptInterpreter/Python/./ScriptInterpreterPythonTests/PythonDataObjectsTest.TestPythonTupleSize (823 of 2145)
PASS: lldb-unit :: Process/gdb-remote/./ProcessGdbRemoteTests/GDBRemoteCommunicationClientTest.SyncThreadState (824 of 2145)
PASS: lldb-api :: functionalities/thread/backtrace_all/TestBacktraceAll.py (825 of 2145)
PASS: lldb-unit :: ScriptInterpreter/Python/./ScriptInterpreterPythonTests/PythonDataObjectsTest.TestResetting (826 of 2145)
PASS: lldb-api :: commands/expression/invalid-args/TestInvalidArgsExpression.py (827 of 2145)
PASS: lldb-unit :: Host/./HostTests/SocketTest.TCPListen0ConnectAccept (828 of 2145)
PASS: lldb-unit :: Utility/./UtilityTests/StringListTest.Join (829 of 2145)
PASS: lldb-api :: functionalities/data-formatter/typedef_array/TestTypedefArray.py (830 of 2145)
PASS: lldb-api :: python_api/function_symbol/TestDisasmAPI.py (831 of 2145)
PASS: lldb-api :: functionalities/thread/concurrent_events/TestConcurrentTwoBreakpointsOneDelaySignal.py (832 of 2145)
PASS: lldb-api :: commands/watchpoints/watchpoint_events/TestWatchpointEvents.py (833 of 2145)
PASS: lldb-unit :: Utility/./UtilityTests/StreamTest.PutCString (834 of 2145)
PASS: lldb-shell :: SymbolFile/DWARF/array-sizes.s (835 of 2145)
PASS: lldb-api :: lang/cpp/dynamic-value/TestDynamicValue.py (836 of 2145)
PASS: lldb-api :: functionalities/step_scripted/TestStepScripted.py (837 of 2145)
PASS: lldb-unit :: SymbolFile/DWARF/./SymbolFileDWARFTests/SymbolFileDWARFTests.TestAbilitiesForDWARF (838 of 2145)
PASS: lldb-unit :: Utility/./UtilityTests/StreamTest.PutCharWhitespace (839 of 2145)
PASS: lldb-unit :: Symbol/./SymbolTests/TestClangASTImporter.RecordLayout (840 of 2145)
UNSUPPORTED: lldb-api :: tools/lldb-server/TestGdbRemoteAuxvSupport.py (841 of 2145)
PASS: lldb-api :: functionalities/data-formatter/data-formatter-stl/libcxx/queue/TestDataFormatterLibcxxQueue.py (842 of 2145)
PASS: lldb-unit :: Expression/./ExpressionTests/CppModuleConfigurationTest.IgnoreLibStdCpp (843 of 2145)
PASS: lldb-shell :: Breakpoint/split-dwarf-5-addrbase.test (844 of 2145)
PASS: lldb-api :: functionalities/ubsan/basic/TestUbsanBasic.py (845 of 2145)
PASS: lldb-unit :: Interpreter/./InterpreterTests/CompletionTest.DirCompletionAbsolute (846 of 2145)
PASS: lldb-unit :: ScriptInterpreter/Python/./ScriptInterpreterPythonTests/PythonDataObjectsTest.TestPythonStringToStructuredString (847 of 2145)
PASS: lldb-api :: lang/c/inlines/TestRedefinitionsInInlines.py (848 of 2145)
PASS: lldb-shell :: SymbolFile/DWARF/apple-index-is-used.cpp (849 of 2145)
PASS: lldb-unit :: Editline/./EditlineTests/EditlineTestFixture.EditlineReceivesMultiLineText (850 of 2145)
PASS: lldb-api :: functionalities/thread/exit_during_expression/TestExitDuringExpression.py (851 of 2145)
PASS: lldb-shell :: SymbolFile/DWARF/DW_AT_low_pc-addrx.s (852 of 2145)
PASS: lldb-unit :: Process/gdb-remote/./ProcessGdbRemoteTests/GDBRemoteCommunicationClientTest.GetQOffsets (853 of 2145)
PASS: lldb-shell :: ObjectFile/Breakpad/breakpad-identification.test (854 of 2145)
UNSUPPORTED: lldb-shell :: Register/aarch64-gp-read.test (855 of 2145)
PASS: lldb-shell :: SymbolFile/DWARF/find-basic-type.cpp (856 of 2145)
XFAIL: lldb-shell :: Unwind/prefer-debug-over-eh-frame.test (857 of 2145)
PASS: lldb-unit :: ScriptInterpreter/Python/./ScriptInterpreterPythonTests/PythonDataObjectsTest.TestPythonFile (858 of 2145)
PASS: lldb-unit :: Utility/./UtilityTests/StructuredDataTest.StringDump (859 of 2145)
PASS: lldb-unit :: Symbol/./SymbolTests/LineEntryTest.GetSameLineContiguousAddressRangeNoInlines (860 of 2145)
PASS: lldb-unit :: UnwindAssembly/x86/./UnwindAssemblyx86Tests/Testx86AssemblyInspectionEngine.TestPopEBX (861 of 2145)
PASS: lldb-shell :: SymbolFile/Breakpad/unwind-via-raSearch.test (862 of 2145)
PASS: lldb-api :: functionalities/data-formatter/user-format-vs-summary/TestUserFormatVsSummary.py (863 of 2145)
UNSUPPORTED: lldb-shell :: Register/x86-64-gp-write.test (864 of 2145)
PASS: lldb-api :: commands/expression/persistent_types/TestNestedPersistentTypes.py (865 of 2145)
PASS: lldb-unit :: Utility/./UtilityTests/ScalarTest.SetValueFromCString (866 of 2145)
PASS: lldb-api :: functionalities/postmortem/elf-core/gcore/TestGCore.py (867 of 2145)
PASS: lldb-unit :: Symbol/./SymbolTests/Type.CompilerContextPattern (868 of 2145)
PASS: lldb-shell :: SymbolFile/DWARF/DW_AT_const_value-bitfields.s (869 of 2145)
UNSUPPORTED: lldb-api :: benchmarks/libcxxmap/TestBenchmarkLibcxxMap.py (870 of 2145)
PASS: lldb-unit :: Process/./ProcessEventDataTests/ProcessEventDataTest.DoOnRemoval (871 of 2145)
PASS: lldb-unit :: Utility/./UtilityTests/SerializationRountripTest.SerializeDeserializePod (872 of 2145)
PASS: lldb-unit :: UnwindAssembly/x86/./UnwindAssemblyx86Tests/Testx86AssemblyInspectionEngine.TestSubESP (873 of 2145)
PASS: lldb-shell :: SymbolFile/NativePDB/tag-types.cpp (874 of 2145)
PASS: lldb-unit :: DataFormatter/./LLDBFormatterTests/TypeMatcherTests.CreatedBySameMatchString (875 of 2145)
PASS: lldb-unit :: Utility/./UtilityTests/TimeoutTest.Format (876 of 2145)
UNSUPPORTED: lldb-api :: tools/lldb-server/TestGdbRemoteCompletion.py (877 of 2145)
PASS: lldb-unit :: ScriptInterpreter/Python/./ScriptInterpreterPythonTests/PythonDataObjectsTest.TestExceptions (878 of 2145)
PASS: lldb-api :: lang/objc/objc-static-method/TestObjCStaticMethod.py (879 of 2145)
PASS: lldb-unit :: Process/minidump/./LLDBMinidumpTests/MinidumpParserTest.GetMemoryRegionInfoFromMemoryList (880 of 2145)
PASS: lldb-unit :: Utility/./UtilityTests/ArchSpecTest.TripleComponentsWereSpecified (881 of 2145)
UNSUPPORTED: lldb-shell :: SymbolFile/NativePDB/local-variables.cpp (882 of 2145)
PASS: lldb-api :: functionalities/data-formatter/data-formatter-script/TestDataFormatterScript.py (883 of 2145)
UNSUPPORTED: lldb-shell :: Unwind/eh-frame-augment-noop.test (884 of 2145)
PASS: lldb-unit :: SymbolFile/NativePDB/./SymbolFileNativePDBTests/PDBFPOProgramToDWARFExpressionTests.InvalidOpUnary (885 of 2145)
PASS: lldb-unit :: Utility/./UtilityTests/StringLexerTest.PutBack (886 of 2145)
PASS: lldb-api :: functionalities/unwind/sigtramp/TestSigtrampUnwind.py (887 of 2145)
PASS: lldb-api :: lang/cpp/rvalue-references/TestRvalueReferences.py (888 of 2145)
UNSUPPORTED: lldb-shell :: ObjectFile/ELF/minidebuginfo-no-lzma.yaml (889 of 2145)
PASS: lldb-api :: lang/cpp/virtual-functions/TestCppVirtualFunctions.py (890 of 2145)
PASS: lldb-api :: functionalities/conditional_break/TestConditionalBreak.py (891 of 2145)
PASS: lldb-unit :: Utility/./UtilityTests/UriParserTest.TypicalPortPathIPv6 (892 of 2145)
PASS: lldb-unit :: Utility/./UtilityTests/RangeDataVector.CustomSort (893 of 2145)
PASS: lldb-unit :: Utility/./UtilityTests/UriParserTest.BadPort (894 of 2145)
PASS: lldb-unit :: Symbol/./SymbolTests/TestTypeSystemClang.TestGetTypeClassTypeOf (895 of 2145)
PASS: lldb-unit :: Utility/./UtilityTests/StreamTest.PutHex64ByteOrderLittle (896 of 2145)
PASS: lldb-api :: functionalities/data-formatter/data-formatter-caching/TestDataFormatterCaching.py (897 of 2145)
PASS: lldb-unit :: Utility/./UtilityTests/StreamTest.PutChar (898 of 2145)
PASS: lldb-shell :: SymbolFile/DWARF/debug-types-dwarf5.s (899 of 2145)
PASS: lldb-api :: lang/objc/direct-dispatch-step/TestObjCDirectDispatchStepping.py (900 of 2145)
PASS: lldb-unit :: Utility/./UtilityTests/ScalarTest.GetBytes (901 of 2145)
PASS: lldb-unit :: Target/./TargetTests/ExecutionContextTest.GetByteOrderProcess (902 of 2145)
PASS: lldb-api :: api/multiple-targets/TestMultipleTargets.py (903 of 2145)
PASS: lldb-api :: commands/watchpoints/watchpoint_disable/TestWatchpointDisable.py (904 of 2145)
PASS: lldb-api :: functionalities/thread/concurrent_events/TestConcurrentSignalDelayBreak.py (905 of 2145)
PASS: lldb-unit :: Expression/./ExpressionTests/DiagnosticManagerTest.PutString (906 of 2145)
PASS: lldb-shell :: SymbolFile/DWARF/debug_loclists-dwo.s (907 of 2145)
PASS: lldb-unit :: UnwindAssembly/x86/./UnwindAssemblyx86Tests/Testx86AssemblyInspectionEngine.TestPopR12 (908 of 2145)
PASS: lldb-unit :: Utility/./UtilityTests/LogChannelTest.Disable (909 of 2145)
PASS: lldb-unit :: Utility/./UtilityTests/RangeTest.ContainsRangeStartingFromZero (910 of 2145)
PASS: lldb-unit :: Utility/./UtilityTests/CompletionRequest.DuplicateFiltering (911 of 2145)
PASS: lldb-shell :: ObjectFile/wasm/basic.yaml (912 of 2145)
PASS: lldb-shell :: SymbolFile/DWARF/DW_AT_declaration-with-children.s (913 of 2145)
PASS: lldb-api :: functionalities/breakpoint/move_nearest/TestMoveNearest.py (914 of 2145)
UNSUPPORTED: lldb-api :: linux/add-symbols/TestTargetSymbolsAddCommand.py (915 of 2145)
PASS: lldb-shell :: SymbolFile/NativePDB/disassembly.cpp (916 of 2145)
PASS: lldb-unit :: Utility/./UtilityTests/StreamTeeTest.Flush (917 of 2145)
PASS: lldb-unit :: Core/./LLDBCoreTests/MangledTest.ResultForValidName (918 of 2145)
PASS: lldb-unit :: Utility/./UtilityTests/FileSpecTest.Match (919 of 2145)
PASS: lldb-unit :: UnwindAssembly/x86/./UnwindAssemblyx86Tests/Testx86AssemblyInspectionEngine.Test32bitFramelessSmallStackFrame (920 of 2145)
PASS: lldb-unit :: Expression/./ExpressionTests/CppModuleConfigurationTest.Xcode (921 of 2145)
PASS: lldb-unit :: Process/minidump/./LLDBMinidumpTests/MinidumpParserTest.GetPidWow64 (922 of 2145)
PASS: lldb-unit :: Platform/./LLDBPlatformTests/PlatformAppleSimulatorTest.TestSimHasSimEnvionament (923 of 2145)
PASS: lldb-unit :: Expression/./ExpressionTests/DWARFExpression.DW_OP_pick (924 of 2145)
PASS: lldb-api :: commands/session/history/TestSessionHistory.py (925 of 2145)
PASS: lldb-unit :: Utility/./UtilityTests/ArchSpecTest.TestSetTriple (926 of 2145)
PASS: lldb-unit :: Process/gdb-remote/./ProcessGdbRemoteTests/GDBRemoteCommunicationClientTest.WriteRegisterNoSuffix (927 of 2145)
PASS: lldb-unit :: Utility/./UtilityTests/GeneratorTest.YamlMultiProvider (928 of 2145)
PASS: lldb-api :: commands/gui/viewlarge/TestGuiViewLarge.py (929 of 2145)
PASS: lldb-unit :: Utility/./UtilityTests/XcodeSDKTest.SDKSupportsSwift (930 of 2145)
PASS: lldb-api :: commands/platform/file/read/TestPlatformFileRead.py (931 of 2145)
PASS: lldb-api :: commands/expression/vector_of_enums/TestVectorOfEnums.py (932 of 2145)
PASS: lldb-shell :: SymbolFile/DWARF/dwo-type-in-main-file.s (933 of 2145)
UNSUPPORTED: lldb-api :: functionalities/darwin_log/source/debug/TestDarwinLogSourceDebug.py (934 of 2145)
PASS: lldb-api :: python_api/watchpoint/watchlocation/TestTargetWatchAddress.py (935 of 2145)
PASS: lldb-shell :: ObjectFile/MachO/lc_build_version_notools.yaml (936 of 2145)
PASS: lldb-unit :: Utility/./UtilityTests/StreamTest.AddressNoSuffix (937 of 2145)
PASS: lldb-api :: functionalities/data-formatter/summary-string-onfail/Test-rdar-9974002.py (938 of 2145)
PASS: lldb-api :: python_api/sbvalue_persist/TestSBValuePersist.py (939 of 2145)
PASS: lldb-api :: functionalities/value_md5_crash/TestValueMD5Crash.py (940 of 2145)
PASS: lldb-unit :: Utility/./UtilityTests/StringListTest.Assignment (941 of 2145)
PASS: lldb-unit :: SymbolFile/DWARF/./SymbolFileDWARFTests/SymbolFileDWARFTests.TestAbbrevOrder1Start5 (942 of 2145)
PASS: lldb-unit :: Utility/./UtilityTests/StreamTeeTest.GetStreamAtIndexOutOfBoundsEmpty (943 of 2145)
PASS: lldb-unit :: Utility/./UtilityTests/UUIDTest.RelationalOperators (944 of 2145)
PASS: lldb-unit :: Host/./HostTests/FileSystemTest.FileAndDirectoryComponents (945 of 2145)
PASS: lldb-unit :: debugserver/./debugserverTests/RNBSocket.LoopBackConnectIPv6 (946 of 2145)
PASS: lldb-unit :: Utility/./UtilityTests/SerializationRountripTest.SerializeDeserializeCStringArrayNullptrElem (947 of 2145)
UNSUPPORTED: lldb-shell :: SymbolFile/PDB/func-symbols.test (948 of 2145)
PASS: lldb-shell :: Breakpoint/dummy-target.test (949 of 2145)
PASS: lldb-unit :: Core/./LLDBCoreTests/ModuleSpecTest.TestMachOFile (950 of 2145)
PASS: lldb-unit :: Host/./HostTests/NativeProcessProtocolTest.ReadCStringFromMemory_CrossPageBoundary (951 of 2145)
PASS: lldb-api :: functionalities/process_crash_info/TestProcessCrashInfo.py (952 of 2145)
PASS: lldb-api :: functionalities/tail_call_frames/thread_step_out_message/TestArtificialFrameStepOutMessage.py (953 of 2145)
PASS: lldb-shell :: SymbolFile/Breakpad/symtab.test (954 of 2145)
PASS: lldb-unit :: Process/gdb-remote/./ProcessGdbRemoteTests/GDBRemoteClientBaseTest.SendContinueAndLateInterrupt (955 of 2145)
PASS: lldb-unit :: Host/./HostTests/SocketTest.UDPConnect (956 of 2145)
UNSUPPORTED: lldb-api :: functionalities/thread/state/TestThreadStates.py (957 of 2145)
PASS: lldb-unit :: Core/./LLDBCoreTests/RichManglingContextTest.SwitchProvider (958 of 2145)
PASS: lldb-shell :: SymbolFile/DWARF/DW_TAG_variable-DW_AT_const_value.s (959 of 2145)
PASS: lldb-shell :: Process/TestEnvironment.test (960 of 2145)
PASS: lldb-unit :: Utility/./UtilityTests/StreamTest.PutNHex8 (961 of 2145)
PASS: lldb-api :: lang/objc/foundation/TestConstStrings.py (962 of 2145)
PASS: lldb-api :: functionalities/tsan/global_location/TestTsanGlobalLocation.py (963 of 2145)
PASS: lldb-unit :: Utility/./UtilityTests/EnvironmentTest.EnvpConversion (964 of 2145)
PASS: lldb-api :: commands/expression/import-std-module/vector-bool/TestVectorBoolFromStdModule.py (965 of 2145)
PASS: lldb-api :: functionalities/breakpoint/address_breakpoints/TestAddressBreakpoints.py (966 of 2145)
PASS: lldb-unit :: Utility/./UtilityTests/DataExtractorTest.GetCStrAtNullOffset (967 of 2145)
PASS: lldb-unit :: Utility/./UtilityTests/FileSpecTest.EqualDotsPosix (968 of 2145)
PASS: lldb-shell :: Breakpoint/jitbp_elf.test (969 of 2145)
PASS: lldb-shell :: ObjectFile/ELF/section-types.yaml (970 of 2145)
PASS: lldb-api :: commands/expression/ignore-artificial-constructors/TestIgnoreArtificialConstructors.py (971 of 2145)
PASS: lldb-api :: functionalities/data-formatter/data-formatter-stl/libcxx/initializerlist/TestInitializerList.py (972 of 2145)
PASS: lldb-shell :: ScriptInterpreter/None/import_module.test (973 of 2145)
PASS: lldb-unit :: Symbol/./SymbolTests/TestTypeSystemClang.AddMethodToObjCObjectType (974 of 2145)
PASS: lldb-unit :: Utility/./UtilityTests/ArchSpecTest.TestParseMachCPUDashSubtypeTripleSimple (975 of 2145)
PASS: lldb-unit :: ScriptInterpreter/Python/./ScriptInterpreterPythonTests/PythonDataObjectsTest.TestInstanceNameResolutionNoDot (976 of 2145)
PASS: lldb-unit :: SymbolFile/DWARF/./SymbolFileDWARFTests/SymbolFileDWARFTests.TestAbbrevNullAttrValidForm (977 of 2145)
PASS: lldb-api :: functionalities/data-formatter/synthcapping/TestSyntheticCapping.py (978 of 2145)
PASS: lldb-shell :: Minidump/Windows/broken-unwind.test (979 of 2145)
PASS: lldb-unit :: Expression/./ExpressionTests/ClangExpressionDeclMapTest.TestPersistentDeclLookup (980 of 2145)
PASS: lldb-unit :: Signals/./SignalsTests/UnixSignalsTest.GetFilteredSignals (981 of 2145)
PASS: lldb-unit :: debugserver/./debugserverTests/RNBSocket.LoopBackListenIPv6 (982 of 2145)
PASS: lldb-unit :: Symbol/./SymbolTests/DWARFCallFrameInfoTest.Basic_eh (983 of 2145)
PASS: lldb-shell :: SymbolFile/DWARF/static_scope.s (984 of 2145)
PASS: lldb-unit :: Language/Highlighting/./HighlighterTests/HighlighterTest.ClangTrailingBackslashWithWhitespace (985 of 2145)
PASS: lldb-api :: functionalities/tail_call_frames/cross_dso/TestCrossDSOTailCalls.py (986 of 2145)
PASS: lldb-unit :: Utility/./UtilityTests/DataExtractorTest.GetDouble (987 of 2145)
PASS: lldb-unit :: Utility/./UtilityTests/AnsiTerminal.Unknown (988 of 2145)
PASS: lldb-unit :: UnwindAssembly/x86/./UnwindAssemblyx86Tests/Testx86AssemblyInspectionEngine.TestPopR13 (989 of 2145)
PASS: lldb-api :: commands/expression/class_template_specialization_empty_pack/TestClassTemplateSpecializationParametersHandling.py (990 of 2145)
PASS: lldb-unit :: DataFormatter/./LLDBFormatterTests/StringPrinterTests.CxxUTF8 (991 of 2145)
PASS: lldb-unit :: Utility/./UtilityTests/ReproducerTest.SetReplay (992 of 2145)
PASS: lldb-unit :: SymbolFile/NativePDB/./SymbolFileNativePDBTests/PDBFPOProgramToDWARFExpressionTests.MultipleIndependentAssignments (993 of 2145)
PASS: lldb-shell :: SymbolFile/DWARF/dwarf5_locations.s (994 of 2145)
PASS: lldb-api :: lang/objc/foundation/TestObjCMethodsNSArray.py (995 of 2145)
PASS: lldb-shell :: Breakpoint/debug_rnglistx_rlex.test (996 of 2145)
PASS: lldb-api :: tools/lldb-server/commandline/TestStubReverseConnect.py (997 of 2145)
PASS: lldb-unit :: Utility/./UtilityTests/ArgsTest.TestMultipleArgs (998 of 2145)
PASS: lldb-api :: commands/expression/import-std-module/list/TestListFromStdModule.py (999 of 2145)
PASS: lldb-api :: lang/cpp/const_this/TestConstThis.py (1000 of 2145)
PASS: lldb-api :: lang/objc/unicode-string/TestUnicodeString.py (1001 of 2145)
PASS: lldb-shell :: SymbolFile/DWARF/debug-types-signature-loop.s (1002 of 2145)
PASS: lldb-api :: functionalities/completion/TestCompletion.py (1003 of 2145)
PASS: lldb-shell :: SymbolFile/Breakpad/symtab-macho.test (1004 of 2145)
PASS: lldb-shell :: Settings/TestSettingsSet.test (1005 of 2145)
PASS: lldb-shell :: SymbolFile/DWARF/dwarf5-partial-index.cpp (1006 of 2145)
PASS: lldb-api :: macosx/thread_suspend/TestInternalThreadSuspension.py (1007 of 2145)
PASS: lldb-unit :: Process/gdb-remote/./ProcessGdbRemoteTests/GDBRemoteCommunicationClientTest.GetModulesInfo_UUID20 (1008 of 2145)
PASS: lldb-api :: lang/objc/objc-class-method/TestObjCClassMethod.py (1009 of 2145)
PASS: lldb-api :: functionalities/gdb_remote_client/TestTargetXMLArch.py (1010 of 2145)
PASS: lldb-unit :: Utility/./UtilityTests/Flags.AnySet (1011 of 2145)
UNSUPPORTED: lldb-api :: functionalities/darwin_log/filter/regex/subsystem/TestDarwinLogFilterRegexSubsystem.py (1012 of 2145)
PASS: lldb-unit :: UnwindAssembly/x86/./UnwindAssemblyx86Tests/Testx86AssemblyInspectionEngine.TestPushR14 (1013 of 2145)
UNSUPPORTED: lldb-shell :: BuildScript/toolchain-msvc.test (1014 of 2145)
PASS: lldb-api :: functionalities/breakpoint/breakpoint_hit_count/TestBreakpointHitCount.py (1015 of 2145)
PASS: lldb-api :: tools/lldb-server/TestGdbRemoteExitCode.py (1016 of 2145)
PASS: lldb-unit :: Expression/./ExpressionTests/CppModuleConfigurationTest.Linux (1017 of 2145)
PASS: lldb-api :: lang/c/unions/TestUnionMembers.py (1018 of 2145)
PASS: lldb-api :: functionalities/unwind/noreturn/TestNoreturnUnwind.py (1019 of 2145)
PASS: lldb-api :: functionalities/tsan/thread_leak/TestTsanThreadLeak.py (1020 of 2145)
PASS: lldb-api :: lang/c/register_variables/TestRegisterVariables.py (1021 of 2145)
PASS: lldb-unit :: UnwindAssembly/x86/./UnwindAssemblyx86Tests/Testx86AssemblyInspectionEngine.TestPushECX (1022 of 2145)
UNSUPPORTED: lldb-api :: tools/lldb-server/registers-target-xml-reading/TestGdbRemoteTargetXmlPacket.py (1023 of 2145)
PASS: lldb-api :: commands/target/modules/search-paths/insert/TestTargetModulesSearchpathsInsert.py (1024 of 2145)
PASS: lldb-api :: commands/watchpoints/step_over_watchpoint/TestStepOverWatchpoint.py (1025 of 2145)
PASS: lldb-unit :: Utility/./UtilityTests/StringListTest.CopyListEmpty (1026 of 2145)
PASS: lldb-api :: lang/c/array_types/TestArrayTypes.py (1027 of 2145)
PASS: lldb-unit :: Host/./HostTests/SocketTest.TCPListen0GetPort (1028 of 2145)
PASS: lldb-unit :: Process/minidump/./LLDBMinidumpTests/MinidumpParserTest.GetMiscInfo_no_stream (1029 of 2145)
PASS: lldb-unit :: Utility/./UtilityTests/ScalarTest.Getters (1030 of 2145)
PASS: lldb-unit :: Utility/./UtilityTests/StreamTest.ShiftOperatorChars (1031 of 2145)
PASS: lldb-unit :: Process/gdb-remote/./ProcessGdbRemoteTests/GDBRemoteCommunicationClientTest.SendGetTraceConfigPacket (1032 of 2145)
PASS: lldb-unit :: ScriptInterpreter/Python/./ScriptInterpreterPythonTests/PythonDataObjectsTest.TestPythonListManipulation (1033 of 2145)
PASS: lldb-unit :: ScriptInterpreter/Python/./ScriptInterpreterPythonTests/PythonDataObjectsTest.TestPythonDictionaryManipulation (1034 of 2145)
PASS: lldb-api :: macosx/nslog/TestDarwinNSLogOutput.py (1035 of 2145)
PASS: lldb-api :: commands/gui/invalid-args/TestInvalidArgsGui.py (1036 of 2145)
UNSUPPORTED: lldb-api :: commands/watchpoints/variable_out_of_scope/TestWatchedVarHitWhenInScope.py (1037 of 2145)
UNSUPPORTED: lldb-api :: tools/lldb-server/TestGdbRemoteModuleInfo.py (1038 of 2145)
UNSUPPORTED: lldb-api :: functionalities/darwin_log/filter/exact_match/subsystem/TestDarwinLogFilterMatchSubsystem.py (1039 of 2145)
PASS: lldb-unit :: Utility/./UtilityTests/StreamTest.PutMaxHex64ByteOrderLittle (1040 of 2145)
PASS: lldb-unit :: ObjectFile/ELF/./ObjectFileELFTests/ObjectFileELFTest.GetSymtab_NoSymEntryPointArmAddressClass (1041 of 2145)
PASS: lldb-unit :: Symbol/./SymbolTests/TestClangASTImporter.MetadataPropagationIndirectImport (1042 of 2145)
PASS: lldb-shell :: Settings/TestModuleCacheSanity.test (1043 of 2145)
PASS: lldb-shell :: Driver/TestError.test (1044 of 2145)
PASS: lldb-api :: functionalities/data-formatter/data-formatter-objc/cmtime/TestDataFormatterCMTime.py (1045 of 2145)
PASS: lldb-unit :: Utility/./UtilityTests/StringListTest.LongestCommonPrefixEmpty (1046 of 2145)
PASS: lldb-unit :: Utility/./UtilityTests/StreamTest.PutCStringWithStringRef (1047 of 2145)
PASS: lldb-shell :: SymbolFile/Breakpad/unwind-via-stack-win-no-memory-info.yaml (1048 of 2145)
PASS: lldb-api :: commands/platform/basic/TestPlatformCommand.py (1049 of 2145)
PASS: lldb-unit :: Language/Highlighting/./HighlighterTests/HighlighterTest.ClangBraces (1050 of 2145)
PASS: lldb-api :: commands/expression/radar_9673664/TestExprHelpExamples.py (1051 of 2145)
PASS: lldb-shell :: SymbolFile/DWARF/DW_AT_data_bit_offset-DW_OP_stack_value.s (1052 of 2145)
UNSUPPORTED: lldb-api :: linux/thread/create_during_instruction_step/TestCreateDuringInstructionStep.py (1053 of 2145)
PASS: lldb-api :: lang/cpp/inlines/TestInlines.py (1054 of 2145)
PASS: lldb-unit :: Utility/./UtilityTests/ArgsTest.StringListConstructor (1055 of 2145)
PASS: lldb-shell :: SymbolFile/Breakpad/stack-cfi-arm.yaml (1056 of 2145)
PASS: lldb-shell :: ObjectFile/ELF/minidebuginfo-corrupt-xz.yaml (1057 of 2145)
PASS: lldb-unit :: Process/gdb-remote/./ProcessGdbRemoteTests/GDBRemoteCommunicationServerTest.SendErrorResponse_UnimplementedError (1058 of 2145)
UNSUPPORTED: lldb-shell :: Register/arm-fp-read.test (1059 of 2145)
PASS: lldb-unit :: Utility/./UtilityTests/ProcessInstanceInfoMatch.Name (1060 of 2145)
PASS: lldb-api :: macosx/dyld-trie-symbols/TestDyldTrieSymbols.py (1061 of 2145)
PASS: lldb-api :: commands/watchpoints/multiple_threads/TestWatchpointMultipleThreads.py (1062 of 2145)
PASS: lldb-unit :: Symbol/./SymbolTests/TestTypeSystemClang.TestNotDeletingUserCopyCstrDueToMoveCStr (1063 of 2145)
PASS: lldb-api :: lang/c/set_values/TestSetValues.py (1064 of 2145)
PASS: lldb-shell :: SymbolFile/DWARF/find-qualified-variable.cpp (1065 of 2145)
PASS: lldb-shell :: Driver/TestProcessAttach.test (1066 of 2145)
PASS: lldb-api :: python_api/symbol-context/TestSymbolContext.py (1067 of 2145)
PASS: lldb-api :: commands/expression/inline-namespace/TestInlineNamespace.py (1068 of 2145)
PASS: lldb-shell :: ObjectFile/PECOFF/basic-info.yaml (1069 of 2145)
PASS: lldb-api :: commands/expression/ir-interpreter/TestIRInterpreter.py (1070 of 2145)
PASS: lldb-shell :: SymbolFile/DWARF/clang-ast-from-dwarf-objc-property.m (1071 of 2145)
UNSUPPORTED: lldb-api :: functionalities/thread/concurrent_events/TestConcurrentManySignals.py (1072 of 2145)
PASS: lldb-unit :: Utility/./UtilityTests/DataExtractorTest.GetBitfield (1073 of 2145)
PASS: lldb-api :: commands/expression/import-std-module/forward_list/TestForwardListFromStdModule.py (1074 of 2145)
UNSUPPORTED: lldb-api :: functionalities/darwin_log/filter/regex/activity-chain/TestDarwinLogFilterRegexActivityChain.py (1075 of 2145)
PASS: lldb-api :: functionalities/postmortem/minidump-new/TestMiniDumpNew.py (1076 of 2145)
UNSUPPORTED: lldb-shell :: SymbolFile/PDB/enums-layout.test (1077 of 2145)
PASS: lldb-api :: lang/c/local_variables/TestLocalVariables.py (1078 of 2145)
PASS: lldb-shell :: SymbolFile/DWARF/debug_line-tombstone.s (1079 of 2145)
PASS: lldb-unit :: ScriptInterpreter/Python/./ScriptInterpreterPythonTests/PythonDataObjectsTest.TestGlobalNameResolutionNoDot (1080 of 2145)
PASS: lldb-api :: terminal/TestEditline.py (1081 of 2145)
UNSUPPORTED: lldb-api :: tools/lldb-vscode/disconnect/TestVSCode_disconnect.py (1082 of 2145)
PASS: lldb-api :: python_api/signals/TestSignalsAPI.py (1083 of 2145)
PASS: lldb-api :: functionalities/thread/exit_during_break/TestExitDuringBreak.py (1084 of 2145)
PASS: lldb-api :: lang/objc/ptr_refs/TestPtrRefsObjC.py (1085 of 2145)
PASS: lldb-shell :: Settings/TestLineMarkerColor.test (1086 of 2145)
PASS: lldb-api :: lang/c/blocks/TestBlocks.py (1087 of 2145)
PASS: lldb-api :: lang/cpp/accelerator-table/TestCPPAccelerator.py (1088 of 2145)
PASS: lldb-api :: functionalities/data-formatter/hexcaps/TestDataFormatterHexCaps.py (1089 of 2145)
PASS: lldb-unit :: Process/gdb-remote/./ProcessGdbRemoteTests/GDBRemoteClientBaseTest.InterruptNoResponse (1090 of 2145)
PASS: lldb-api :: commands/expression/import-std-module/shared_ptr-dbg-info-content/TestSharedPtrDbgInfoContentFromStdModule.py (1091 of 2145)
PASS: lldb-unit :: Target/./TargetTests/ModuleCacheTest.GetAndPutStrangeHostname (1092 of 2145)
PASS: lldb-unit :: Utility/./UtilityTests/Flags.IsClear (1093 of 2145)
PASS: lldb-unit :: Core/./LLDBCoreTests/RichManglingContextTest.Basic (1094 of 2145)
PASS: lldb-unit :: Utility/./UtilityTests/Flags.AllClear (1095 of 2145)
PASS: lldb-api :: commands/expression/regression-access-function-template-in-record/TestRegressionAccessFunctionTemplateInRecord.py (1096 of 2145)
PASS: lldb-api :: functionalities/postmortem/mach-core/TestMachCore.py (1097 of 2145)
PASS: lldb-unit :: Expression/./ExpressionTests/CppModuleConfigurationTest.LibCppV2 (1098 of 2145)
PASS: lldb-unit :: Utility/./UtilityTests/StreamTest.PutPtr (1099 of 2145)
PASS: lldb-unit :: Utility/./UtilityTests/FileSpecTest.OperatorBool (1100 of 2145)
PASS: lldb-shell :: SymbolFile/DWARF/dir-separator-no-comp-dir.s (1101 of 2145)
PASS: lldb-api :: functionalities/thread/concurrent_events/TestConcurrentManyBreakpoints.py (1102 of 2145)
UNSUPPORTED: lldb-shell :: SymbolFile/NativePDB/ast-functions-msvc.cpp (1103 of 2145)
PASS: lldb-unit :: Expression/./ExpressionTests/CppModuleConfigurationTest.AmbiguousCLib (1104 of 2145)
PASS: lldb-api :: functionalities/thread/concurrent_events/TestConcurrentBreakpointOneDelayBreakpointThreads.py (1105 of 2145)
PASS: lldb-unit :: Utility/./UtilityTests/CompletionRequest.Constructor (1106 of 2145)
PASS: lldb-unit :: Utility/./UtilityTests/UriParserTest.MinimalPortPath (1107 of 2145)
UNSUPPORTED: lldb-api :: lang/cpp/static_members/TestCPPStaticMembers.py (1108 of 2145)
PASS: lldb-api :: tools/lldb-server/TestGdbRemoteAttach.py (1109 of 2145)
PASS: lldb-unit :: Utility/./UtilityTests/StringExtractorTest.GetHexBytes_Underflow (1110 of 2145)
PASS: lldb-api :: tools/lldb-server/TestGdbRemoteKill.py (1111 of 2145)
PASS: lldb-api :: sample_test/TestSampleTest.py (1112 of 2145)
PASS: lldb-api :: macosx/indirect_symbol/TestIndirectSymbols.py (1113 of 2145)
PASS: lldb-unit :: Expression/./ExpressionTests/DWARFExpression.DW_OP_unknown (1114 of 2145)
PASS: lldb-unit :: Utility/./UtilityTests/ProcessInstanceInfo.DumpTable_invalidUID (1115 of 2145)
PASS: lldb-api :: commands/expression/unwind_expression/TestUnwindExpression.py (1116 of 2145)
PASS: lldb-api :: functionalities/tail_call_frames/ambiguous_tail_call_seq2/TestAmbiguousTailCallSeq2.py (1117 of 2145)
UNSUPPORTED: lldb-shell :: Register/arm-gp-read.test (1118 of 2145)
PASS: lldb-shell :: Driver/TestPositionalArgs.test (1119 of 2145)
PASS: lldb-api :: lang/objc/foundation/TestSymbolTable.py (1120 of 2145)
PASS: lldb-unit :: Utility/./UtilityTests/StreamTest.PutBytesAsRawHex8ToBigEndian (1121 of 2145)
PASS: lldb-shell :: SymbolFile/NativePDB/function-types-calling-conv.cpp (1122 of 2145)
PASS: lldb-unit :: Utility/./UtilityTests/StringExtractorTest.GetNameColonValueNoSemicolon (1123 of 2145)
PASS: lldb-api :: commands/process/signal/TestProcessSignal.py (1124 of 2145)
UNSUPPORTED: lldb-shell :: SymbolFile/PDB/calling-conventions.test (1125 of 2145)
PASS: lldb-api :: functionalities/data-formatter/data-formatter-stl/libcxx/set/TestDataFormatterLibcxxSet.py (1126 of 2145)
PASS: lldb-api :: python_api/value/empty_class/TestValueAPIEmptyClass.py (1127 of 2145)
PASS: lldb-unit :: Utility/./UtilityTests/StreamTest.PutRawBytesToBigEndian (1128 of 2145)
PASS: lldb-shell :: Reproducer/TestDump.test (1129 of 2145)
PASS: lldb-shell :: ObjectFile/ELF/many-sections.s (1130 of 2145)
PASS: lldb-unit :: Process/minidump/./LLDBMinidumpTests/MinidumpParserTest.GetMiscInfoWindows (1131 of 2145)
PASS: lldb-unit :: Utility/./UtilityTests/SerializationRountripTest.SerializeDeserializeCString (1132 of 2145)
PASS: lldb-unit :: UnwindAssembly/x86/./UnwindAssemblyx86Tests/Testx86AssemblyInspectionEngine.TestPopR15 (1133 of 2145)
PASS: lldb-shell :: Driver/TestConvenienceVariables.test (1134 of 2145)
PASS: lldb-unit :: Utility/./UtilityTests/StringListTest.Clear (1135 of 2145)
PASS: lldb-unit :: Utility/./UtilityTests/StreamTest.PutULEB128 (1136 of 2145)
PASS: lldb-api :: commands/command/invalid-args/TestInvalidArgsCommand.py (1137 of 2145)
PASS: lldb-unit :: UnwindAssembly/x86/./UnwindAssemblyx86Tests/Testx86AssemblyInspectionEngine.TestDisassemblyMidFunctionEpilogues (1138 of 2145)
PASS: lldb-unit :: UnwindAssembly/x86/./UnwindAssemblyx86Tests/Testx86AssemblyInspectionEngine.TestAddRSP (1139 of 2145)
PASS: lldb-api :: functionalities/thread/concurrent_events/TestConcurrentNWatchNBreak.py (1140 of 2145)
PASS: lldb-unit :: Utility/./UtilityTests/ScalarTest.CastOperations (1141 of 2145)
PASS: lldb-api :: lang/c/global_variables/TestGlobalVariables.py (1142 of 2145)
PASS: lldb-unit :: Language/Highlighting/./HighlighterTests/HighlighterTest.ClangStringLiterals (1143 of 2145)
PASS: lldb-unit :: Utility/./UtilityTests/Flags.Test (1144 of 2145)
PASS: lldb-unit :: Symbol/./SymbolTests/PostfixExpression.ToDWARF (1145 of 2145)
PASS: lldb-api :: functionalities/data-formatter/type_summary_list_script/TestTypeSummaryListScript.py (1146 of 2145)
PASS: lldb-api :: sanity/TestSettingSkipping.py (1147 of 2145)
PASS: lldb-api :: api/log/TestAPILog.py (1148 of 2145)
PASS: lldb-unit :: Utility/./UtilityTests/RangeTest.Clear (1149 of 2145)
PASS: lldb-unit :: Utility/./UtilityTests/CompletionRequest.TryCompleteCurrentArgMode (1150 of 2145)
PASS: lldb-api :: api/listeners/TestListener.py (1151 of 2145)
PASS: lldb-api :: functionalities/data-formatter/dump_dynamic/TestDumpDynamic.py (1152 of 2145)
PASS: lldb-api :: commands/expression/import-std-module/sysroot/TestStdModuleSysroot.py (1153 of 2145)
PASS: lldb-unit :: Utility/./UtilityTests/ArchSpecTest.YAML (1154 of 2145)
PASS: lldb-api :: functionalities/tail_call_frames/ambiguous_tail_call_seq1/TestAmbiguousTailCallSeq1.py (1155 of 2145)
PASS: lldb-api :: functionalities/breakpoint/scripted_bkpt/TestScriptedResolver.py (1156 of 2145)
PASS: lldb-api :: types/TestDoubleTypes.py (1157 of 2145)
PASS: lldb-unit :: Utility/./UtilityTests/ConstStringTest.YAML (1158 of 2145)
PASS: lldb-api :: commands/watchpoints/watchpoint_size/TestWatchpointSizes.py (1159 of 2145)
PASS: lldb-unit :: Utility/./UtilityTests/StringExtractorTest.GetHexBytes (1160 of 2145)
PASS: lldb-unit :: Utility/./UtilityTests/StringExtractorTest.GetHexBytes_Partial (1161 of 2145)
PASS: lldb-unit :: Utility/./UtilityTests/XcodeSDKTest.GetSDKTypeForTriple (1162 of 2145)
PASS: lldb-api :: python_api/module_section/TestModuleAndSection.py (1163 of 2145)
PASS: lldb-api :: commands/expression/timeout/TestCallWithTimeout.py (1164 of 2145)
PASS: lldb-shell :: BuildScript/modes.test (1165 of 2145)
PASS: lldb-api :: tools/lldb-vscode/step/TestVSCode_step.py (1166 of 2145)
PASS: lldb-unit :: Utility/./UtilityTests/BinaryStreamTest.PutULEB128EightBytes (1167 of 2145)
UNSUPPORTED: lldb-shell :: Watchpoint/netbsd-nouserdbregs.test (1168 of 2145)
UNSUPPORTED: lldb-shell :: ExecControl/StopHook/stop-hook-threads.test (1169 of 2145)
PASS: lldb-api :: functionalities/thread/exit_during_step/TestExitDuringStep.py (1170 of 2145)
UNSUPPORTED: lldb-api :: benchmarks/turnaround/TestCompileRunToBreakpointTurnaround.py (1171 of 2145)
PASS: lldb-api :: commands/reproducer/invalid-args/TestInvalidArgsReproducer.py (1172 of 2145)
PASS: lldb-unit :: Symbol/./SymbolTests/TestTypeSystemClang.TestFunctionTemplateConstruction (1173 of 2145)
PASS: lldb-unit :: Utility/./UtilityTests/ScalarTest.Comparison (1174 of 2145)
PASS: lldb-api :: functionalities/data-formatter/data-formatter-stl/libcxx/multimap/TestDataFormatterLibccMultiMap.py (1175 of 2145)
PASS: lldb-unit :: ObjectFile/Breakpad/./ObjectFileBreakpadTests/LineRecord.parse (1176 of 2145)
PASS: lldb-api :: functionalities/tail_call_frames/cross_object/TestCrossObjectTailCalls.py (1177 of 2145)
PASS: lldb-shell :: Settings/TestFrameFormatColor.test (1178 of 2145)
PASS: lldb-unit :: Utility/./UtilityTests/StreamTeeTest.SetStreamAtIndexOverwrite (1179 of 2145)
PASS: lldb-api :: functionalities/thread/concurrent_events/TestConcurrentWatchBreakDelay.py (1180 of 2145)
PASS: lldb-api :: lang/objc/foundation/TestObjCMethods.py (1181 of 2145)
PASS: lldb-api :: functionalities/data-formatter/data-formatter-skip-summary/TestDataFormatterSkipSummary.py (1182 of 2145)
PASS: lldb-shell :: Reproducer/TestPythonImport.test (1183 of 2145)
PASS: lldb-api :: types/TestShortTypeExpr.py (1184 of 2145)
PASS: lldb-api :: lang/objc/objc-optimized/TestObjcOptimized.py (1185 of 2145)
PASS: lldb-unit :: DataFormatter/./LLDBFormatterTests/StringPrinterTests.SwiftUTF8 (1186 of 2145)
PASS: lldb-api :: functionalities/tsan/basic/TestTsanBasic.py (1187 of 2145)
PASS: lldb-unit :: Process/gdb-remote/./ProcessGdbRemoteTests/GDBRemoteClientBaseTest.SendPacketAndReceiveResponseWithOutputSupport (1188 of 2145)
PASS: lldb-unit :: Language/Highlighting/./HighlighterTests/HighlighterTest.Keywords (1189 of 2145)
PASS: lldb-unit :: UnwindAssembly/x86/./UnwindAssemblyx86Tests/Testx86AssemblyInspectionEngine.TestMovRSPtoRBP (1190 of 2145)
PASS: lldb-unit :: Utility/./UtilityTests/RangeDataVector.FindEntryThatContains (1191 of 2145)
PASS: lldb-unit :: Utility/./UtilityTests/StringListTest.JoinSingle (1192 of 2145)
PASS: lldb-unit :: Process/gdb-remote/./ProcessGdbRemoteTests/GDBRemoteClientBaseTest.SendContinueAndInterrupt2PacketBug (1193 of 2145)
PASS: lldb-unit :: Core/./LLDBCoreTests/SourceFileCache.FindSourceFileFound (1194 of 2145)
PASS: lldb-api :: functionalities/fat_archives/TestFatArchives.py (1195 of 2145)
PASS: lldb-unit :: Utility/./UtilityTests/ArchSpecTest.Compatibility (1196 of 2145)
PASS: lldb-unit :: Expression/./ExpressionTests/DiagnosticManagerTest.GetStringSeverityLabels (1197 of 2145)
PASS: lldb-unit :: ScriptInterpreter/Python/./ScriptInterpreterPythonTests/PythonDataObjectsTest.TestPythonStringToStr (1198 of 2145)
PASS: lldb-unit :: Platform/./LLDBPlatformTests/PlatformDarwinTest.TestParseVersionBuildDir (1199 of 2145)
PASS: lldb-unit :: UnwindAssembly/x86/./UnwindAssemblyx86Tests/Testx86AssemblyInspectionEngine.Testi386IgnoredRegisters (1200 of 2145)
PASS: lldb-unit :: Expression/./ExpressionTests/DWARFExpression.DW_OP_stack_value (1201 of 2145)
PASS: lldb-unit :: Utility/./UtilityTests/VMRange.ContainsRange (1202 of 2145)
UNSUPPORTED: lldb-api :: functionalities/darwin_log/filter/regex/message/TestDarwinLogFilterRegexMessage.py (1203 of 2145)
UNSUPPORTED: lldb-api :: functionalities/darwin_log/basic/TestDarwinLogBasic.py (1204 of 2145)
PASS: lldb-unit :: Utility/./UtilityTests/VMRange.CollectionContains (1205 of 2145)
PASS: lldb-api :: functionalities/thread/concurrent_events/TestConcurrentSignalDelayWatch.py (1206 of 2145)
PASS: lldb-api :: functionalities/data-formatter/data-formatter-stl/libstdcpp/unique_ptr/invalid/TestDataFormatterInvalidStdUniquePtr.py (1207 of 2145)
PASS: lldb-unit :: Utility/./UtilityTests/StreamTest.PutHex32ByteOrderBig (1208 of 2145)
PASS: lldb-api :: python_api/symbol-context/two-files/TestSymbolContextTwoFiles.py (1209 of 2145)
PASS: lldb-api :: functionalities/tsan/thread_numbers/TestTsanThreadNumbers.py (1210 of 2145)
PASS: lldb-unit :: Utility/./UtilityTests/FileSpecTest.Yaml (1211 of 2145)
PASS: lldb-shell :: Settings/TestFrameFormatNoColor.test (1212 of 2145)
PASS: lldb-shell :: SymbolFile/DWARF/debug-types-missing-signature.test (1213 of 2145)
PASS: lldb-api :: functionalities/data-formatter/data-formatter-python-synth/TestDataFormatterPythonSynth.py (1214 of 2145)
PASS: lldb-api :: macosx/find-app-in-bundle/TestFindAppInBundle.py (1215 of 2145)
UNSUPPORTED: lldb-shell :: SymbolFile/PDB/function-level-linking.test (1216 of 2145)
PASS: lldb-api :: lang/c/strings/TestCStrings.py (1217 of 2145)
XFAIL: lldb-shell :: Register/x86-mm-xmm-read.test (1218 of 2145)
PASS: lldb-unit :: Utility/./UtilityTests/UriParserTest.SchemeHostSeparator2 (1219 of 2145)
PASS: lldb-api :: functionalities/data-formatter/data-formatter-smart-array/TestDataFormatterSmartArray.py (1220 of 2145)
PASS: lldb-unit :: Symbol/./SymbolTests/TestTypeSystemClang.TestConvertAccessTypeToAccessSpecifier (1221 of 2145)
PASS: lldb-api :: lang/c/function_types/TestFunctionTypes.py (1222 of 2145)
PASS: lldb-api :: lang/objc/objc-ivar-protocols/TestIvarProtocols.py (1223 of 2145)
PASS: lldb-unit :: Disassembler/./DisassemblerTests/TestArm64Disassembly.TestArmv81Instruction (1224 of 2145)
PASS: lldb-unit :: Utility/./UtilityTests/UriParserTest.BadPort2 (1225 of 2145)
PASS: lldb-unit :: Language/CLanguages/./LanguageCLanguagesTests/CLanguages.LookupCLanguagesByLanguageType (1226 of 2145)
PASS: lldb-api :: functionalities/data-formatter/synthupdate/TestSyntheticFilterRecompute.py (1227 of 2145)
PASS: lldb-api :: commands/expression/po_verbosity/TestPoVerbosity.py (1228 of 2145)
PASS: lldb-unit :: Process/gdb-remote/./ProcessGdbRemoteTests/GDBRemoteCommunicationClientTest.SendStopTracePacket (1229 of 2145)
PASS: lldb-unit :: Utility/./UtilityTests/AnsiTerminal.WhiteSpace (1230 of 2145)
PASS: lldb-api :: lang/objc/objc-builtin-types/TestObjCBuiltinTypes.py (1231 of 2145)
PASS: lldb-shell :: ObjectFile/MachO/subsections.yaml (1232 of 2145)
PASS: lldb-unit :: Utility/./UtilityTests/RegularExpression.Match (1233 of 2145)
PASS: lldb-unit :: Utility/./UtilityTests/RangeVector.CombineConsecutiveRanges (1234 of 2145)
PASS: lldb-unit :: Utility/./UtilityTests/ArgsTest.TestUnknownEscape (1235 of 2145)
PASS: lldb-api :: lang/objc/modules-incomplete/TestIncompleteModules.py (1236 of 2145)
PASS: lldb-unit :: Host/./HostTests/MainLoopTest.DetectsEOF (1237 of 2145)
PASS: lldb-api :: functionalities/breakpoint/breakpoint_callback_command_source/TestBreakpointCallbackCommandSource.py (1238 of 2145)
UNSUPPORTED: lldb-api :: functionalities/data-formatter/data-formatter-stl/libstdcpp/tuple/TestDataFormatterStdTuple.py (1239 of 2145)
PASS: lldb-api :: lang/c/complex/TestComplexC99.py (1240 of 2145)
PASS: lldb-unit :: Utility/./UtilityTests/PassiveReplayTest.InstrumentedBarPtr (1241 of 2145)
PASS: lldb-unit :: Utility/./UtilityTests/ArgsTest.ReplaceArgumentAtIndexOutOfRange (1242 of 2145)
PASS: lldb-unit :: Platform/./LLDBPlatformTests/PlatformAppleSimulatorTest.TestHostPlatformToSim (1243 of 2145)
PASS: lldb-api :: iohandler/unicode/TestUnicode.py (1244 of 2145)
PASS: lldb-unit :: Process/gdb-remote/./ProcessGdbRemoteTests/GDBRemoteCommunicationServerTest.SendErrorResponse_ErrorList (1245 of 2145)
PASS: lldb-api :: commands/version/TestVersion.py (1246 of 2145)
PASS: lldb-api :: macosx/load-kext/TestLoadKext.py (1247 of 2145)
PASS: lldb-api :: lang/objc/modules-compile-error/TestModulesCompileError.py (1248 of 2145)
PASS: lldb-unit :: Host/./HostTests/FileSystemTest.EmptyTest (1249 of 2145)
PASS: lldb-unit :: Symbol/./SymbolTests/Type.GetTypeScopeAndBasename (1250 of 2145)
PASS: lldb-unit :: Process/minidump/./LLDBMinidumpTests/MinidumpParserTest.GetMemoryRegionInfo (1251 of 2145)
PASS: lldb-shell :: ObjectFile/PECOFF/sections.yaml (1252 of 2145)
PASS: lldb-unit :: Utility/./UtilityTests/StringExtractorTest.DecodeHexU8_Underflow2 (1253 of 2145)
PASS: lldb-api :: tools/lldb-server/inferior-crash/TestGdbRemoteSegFault.py (1254 of 2145)
PASS: lldb-unit :: Utility/./UtilityTests/StringExtractorTest.GetHexBytesAvail_OddPair (1255 of 2145)
PASS: lldb-unit :: Host/./HostTests/SocketTest.TCPGetAddress (1256 of 2145)
PASS: lldb-api :: functionalities/postmortem/wow64_minidump/TestWow64MiniDump.py (1257 of 2145)
PASS: lldb-unit :: ScriptInterpreter/Python/./ScriptInterpreterPythonTests/PythonDataObjectsTest.TestDictionaryResolutionWithDot (1258 of 2145)
PASS: lldb-unit :: Utility/./UtilityTests/ProcessInstanceInfo.DumpTable (1259 of 2145)
PASS: lldb-unit :: Host/./HostTests/File.GetStreamFromDescriptor (1260 of 2145)
PASS: lldb-unit :: Expression/./ExpressionTests/CppModuleConfigurationTest.UnknownLibCppFile (1261 of 2145)
PASS: lldb-unit :: Process/gdb-remote/./ProcessGdbRemoteTests/GDBRemoteCommunicationClientTest.TestPacketSpeedJSON (1262 of 2145)
PASS: lldb-unit :: ObjectFile/Breakpad/./ObjectFileBreakpadTests/Record.classify (1263 of 2145)
PASS: lldb-api :: sanity/TestModuleCacheSanity.py (1264 of 2145)
PASS: lldb-api :: commands/expression/codegen-crash-typedefdecl-not-in_declcontext/TestCodegenCrashTypedefDeclNotInDeclContext.py (1265 of 2145)
PASS: lldb-api :: functionalities/avoids-fd-leak/TestFdLeak.py (1266 of 2145)
UNSUPPORTED: lldb-shell :: SymbolFile/PDB/vbases.test (1267 of 2145)
PASS: lldb-api :: functionalities/reproducers/attach/TestReproducerAttach.py (1268 of 2145)
PASS: lldb-shell :: ObjectFile/ELF/avr-basic-info.yaml (1269 of 2145)
UNSUPPORTED: lldb-shell :: Register/x86-64-xmm16-write.test (1270 of 2145)
PASS: lldb-unit :: ObjectFile/Breakpad/./ObjectFileBreakpadTests/PublicRecord.parse (1271 of 2145)
PASS: lldb-shell :: Reproducer/TestDebugSymbols.test (1272 of 2145)
PASS: lldb-shell :: ObjectFile/ELF/build-id-case.yaml (1273 of 2145)
PASS: lldb-unit :: Utility/./UtilityTests/StreamTest.PutHex8 (1274 of 2145)
UNSUPPORTED: lldb-shell :: Register/x86-gp-write.test (1275 of 2145)
UNSUPPORTED: lldb-shell :: Register/x86-ymm-read.test (1276 of 2145)
PASS: lldb-unit :: Core/./LLDBCoreTests/ModuleSpecTest.TestCOFFFile (1277 of 2145)
PASS: lldb-shell :: SymbolFile/DWARF/inline-function-address.ll (1278 of 2145)
PASS: lldb-shell :: ObjectFile/ELF/base-address.yaml (1279 of 2145)
PASS: lldb-api :: commands/expression/two-files/TestObjCTypeQueryFromOtherCompileUnit.py (1280 of 2145)
PASS: lldb-unit :: Language/Highlighting/./HighlighterTests/HighlighterTest.ClangCursorPosEndOfLine (1281 of 2145)
PASS: lldb-unit :: Symbol/./SymbolTests/TestTypeSystemClang.TestRemoveFastQualifiers (1282 of 2145)
PASS: lldb-api :: functionalities/non-overlapping-index-variable-i/TestIndexVariable.py (1283 of 2145)
PASS: lldb-api :: functionalities/tail_call_frames/disambiguate_tail_call_seq/TestDisambiguateTailCallSeq.py (1284 of 2145)
PASS: lldb-unit :: ScriptInterpreter/Python/./ScriptInterpreterPythonTests/PythonDataObjectsTest.TestPythonTupleInitializerList2 (1285 of 2145)
PASS: lldb-unit :: UnwindAssembly/x86/./UnwindAssemblyx86Tests/Testx86AssemblyInspectionEngine.Test32BitOnlyInstruction (1286 of 2145)
PASS: lldb-unit :: Utility/./UtilityTests/ConstStringTest.NullAndEmptyStates (1287 of 2145)
PASS: lldb-unit :: Utility/./UtilityTests/ArgsTest.TestInsertArg (1288 of 2145)
PASS: lldb-api :: commands/target/stop-hook/enable/TestTargetStopHookEnable.py (1289 of 2145)
PASS: lldb-unit :: Utility/./UtilityTests/RangeTest.ContainsAddrInvalid (1290 of 2145)
PASS: lldb-shell :: SymbolFile/Breakpad/line-table-edgecases.test (1291 of 2145)
PASS: lldb-unit :: Process/minidump/./LLDBMinidumpTests/MinidumpParserTest.MinidumpModuleOrder (1292 of 2145)
PASS: lldb-api :: commands/expression/call-function/TestCallStdStringFunction.py (1293 of 2145)
PASS: lldb-api :: functionalities/asan/TestReportData.py (1294 of 2145)
PASS: lldb-unit :: Utility/./UtilityTests/BinaryStreamTest.PutSLEB128TwoBytes (1295 of 2145)
PASS: lldb-api :: commands/help/TestHelp.py (1296 of 2145)
PASS: lldb-api :: python_api/watchpoint/TestWatchpointIter.py (1297 of 2145)
PASS: lldb-shell :: SymbolFile/NativePDB/source-list.cpp (1298 of 2145)
PASS: lldb-unit :: Utility/./UtilityTests/FileSpecTest.Equal (1299 of 2145)
PASS: lldb-unit :: ObjectFile/ELF/./ObjectFileELFTests/ObjectFileELFTest.GetModuleSpecifications_EarlySectionHeaders (1300 of 2145)
PASS: lldb-shell :: Quit/TestQuitExitCodeHex0.test (1301 of 2145)
PASS: lldb-shell :: SymbolFile/DWARF/DW_OP_piece-smaller-than-struct.s (1302 of 2145)
PASS: lldb-unit :: Process/minidump/./LLDBMinidumpTests/MinidumpParserTest.GetMemory (1303 of 2145)
PASS: lldb-api :: lang/cpp/breakpoint_in_member_func_w_non_primitive_params/TestBreakpointInMemberFuncWNonPrimitiveParams.py (1304 of 2145)
UNSUPPORTED: lldb-shell :: ObjectFile/ELF/minidebuginfo-set-and-hit-breakpoint.test (1305 of 2145)
PASS: lldb-unit :: UnwindAssembly/PPC64/./PPC64InstEmulationTests/TestPPC64InstEmulation.TestSimpleFunction (1306 of 2145)
PASS: lldb-unit :: Utility/./UtilityTests/UriParserTest.SchemeHostSeparator3 (1307 of 2145)
PASS: lldb-unit :: Utility/./UtilityTests/StringListTest.LongestCommonPrefixDuplicateElement (1308 of 2145)
PASS: lldb-unit :: Utility/./UtilityTests/OptionsWithRawTest.ArgsButNoLeadingDash (1309 of 2145)
UNSUPPORTED: lldb-shell :: ScriptInterpreter/Lua/nested_sessions.test (1310 of 2145)
PASS: lldb-unit :: UnwindAssembly/x86/./UnwindAssemblyx86Tests/Testx86AssemblyInspectionEngine.TestPushExtended (1311 of 2145)
PASS: lldb-shell :: SymbolFile/NativePDB/bitfields.cpp (1312 of 2145)
PASS: lldb-api :: functionalities/thread/concurrent_events/TestConcurrentTwoWatchpointsOneBreakpoint.py (1313 of 2145)
PASS: lldb-api :: functionalities/data-formatter/pyobjsynthprovider/TestPyObjSynthProvider.py (1314 of 2145)
PASS: lldb-api :: commands/expression/argument_passing_restrictions/TestArgumentPassingRestrictions.py (1315 of 2145)
PASS: lldb-shell :: Watchpoint/SetErrorCases.test (1316 of 2145)
PASS: lldb-unit :: Utility/./UtilityTests/StringListTest.AppendStringStdString (1317 of 2145)
PASS: lldb-shell :: SymbolFile/DWARF/dwp-separate-debug-file.cpp (1318 of 2145)
PASS: lldb-api :: commands/watchpoints/watchpoint_commands/TestWatchpointCommands.py (1319 of 2145)
PASS: lldb-shell :: Breakpoint/debug_rnglist_rlestartend.test (1320 of 2145)
PASS: lldb-unit :: Utility/./UtilityTests/ProcessInfoTest.Constructor (1321 of 2145)
PASS: lldb-api :: functionalities/breakpoint/breakpoint_set_restart/TestBreakpointSetRestart.py (1322 of 2145)
PASS: lldb-api :: functionalities/tail_call_frames/sbapi_support/TestTailCallFrameSBAPI.py (1323 of 2145)
PASS: lldb-api :: types/TestShortType.py (1324 of 2145)
PASS: lldb-unit :: Utility/./UtilityTests/DataExtractorTest.GetCStrUnterminated (1325 of 2145)
PASS: lldb-unit :: SymbolFile/NativePDB/./SymbolFileNativePDBTests/PDBFPOProgramToDWARFExpressionTests.UnresolvedRegisterAssignmentReference (1326 of 2145)
PASS: lldb-api :: functionalities/thread/concurrent_events/TestConcurrentCrashWithBreak.py (1327 of 2145)
PASS: lldb-api :: lang/objc/hidden-ivars/TestHiddenIvars.py (1328 of 2145)
PASS: lldb-api :: functionalities/thread/concurrent_events/TestConcurrentDelayWatchBreak.py (1329 of 2145)
PASS: lldb-api :: commands/gui/basic/TestGuiBasic.py (1330 of 2145)
PASS: lldb-unit :: Symbol/./SymbolTests/TestClangASTImporter.MetadataPropagation (1331 of 2145)
PASS: lldb-unit :: Expression/./ExpressionTests/DiagnosticManagerTest.GetStringPreserveOrder (1332 of 2145)
PASS: lldb-api :: commands/expression/import-std-module/empty-module/TestEmptyStdModule.py (1333 of 2145)
PASS: lldb-api :: functionalities/thread/concurrent_events/TestConcurrentWatchpointWithDelayWatchpointThreads.py (1334 of 2145)
PASS: lldb-unit :: debugserver/./debugserverTests/RNBSocket.LoopBackConnectIPv4 (1335 of 2145)
PASS: lldb-unit :: Utility/./UtilityTests/RangeTest.DoesIntersect (1336 of 2145)
PASS: lldb-unit :: Utility/./UtilityTests/StreamTest.PutSLEB128 (1337 of 2145)
PASS: lldb-unit :: ScriptInterpreter/Python/./ScriptInterpreterPythonTests/PythonDataObjectsTest.TestPythonCallableInvoke (1338 of 2145)
PASS: lldb-shell :: SymbolFile/Breakpad/line-table-missing-file.test (1339 of 2145)
PASS: lldb-api :: functionalities/abbreviation/TestAbbreviations.py (1340 of 2145)
PASS: lldb-unit :: Interpreter/./InterpreterTests/OptionArgParserTest.toChar (1341 of 2145)
UNSUPPORTED: lldb-api :: tools/lldb-server/signal-filtering/TestGdbRemote_QPassSignals.py (1342 of 2145)
PASS: lldb-api :: functionalities/data-formatter/var-in-aggregate-misuse/TestVarInAggregateMisuse.py (1343 of 2145)
PASS: lldb-shell :: SymbolFile/DWARF/debug_loc-aslr.s (1344 of 2145)
PASS: lldb-api :: functionalities/deleted-executable/TestDeletedExecutable.py (1345 of 2145)
PASS: lldb-unit :: Utility/./UtilityTests/StringExtractorTest.GetHexBytesAvail_Partial (1346 of 2145)
PASS: lldb-unit :: Utility/./UtilityTests/StatusTest.ErrorConstructor (1347 of 2145)
PASS: lldb-api :: functionalities/float-display/TestFloatDisplay.py (1348 of 2145)
PASS: lldb-shell :: Settings/TestFrameFormatMangling.test (1349 of 2145)
PASS: lldb-unit :: Utility/./UtilityTests/ConstStringTest.CompareConstString (1350 of 2145)
PASS: lldb-unit :: Utility/./UtilityTests/NameMatchesTest.RegularExpression (1351 of 2145)
PASS: lldb-api :: macosx/simulator/TestSimulatorPlatform.py (1352 of 2145)
PASS: lldb-api :: lang/c/bitfields/TestBitfields.py (1353 of 2145)
PASS: lldb-unit :: UnwindAssembly/x86/./UnwindAssemblyx86Tests/Testx86AssemblyInspectionEngine.TestPushR15 (1354 of 2145)
PASS: lldb-unit :: Utility/./UtilityTests/ScalarTest.GetValue (1355 of 2145)
PASS: lldb-api :: functionalities/thread/concurrent_events/TestConcurrentCrashWithWatchpointBreakpointSignal.py (1356 of 2145)
PASS: lldb-api :: macosx/universal/TestUniversal.py (1357 of 2145)
UNSUPPORTED: lldb-api :: commands/target/auto-install-main-executable/TestAutoInstallMainExecutable.py (1358 of 2145)
PASS: lldb-api :: functionalities/breakpoint/step_over_breakpoint/TestStepOverBreakpoint.py (1359 of 2145)
PASS: lldb-shell :: Driver/TestFile.test (1360 of 2145)
PASS: lldb-unit :: Symbol/./SymbolTests/TestTypeSystemClang.TestGetEnumIntegerTypeBasicTypes (1361 of 2145)
PASS: lldb-unit :: Utility/./UtilityTests/ScalarTest.TruncOrExtendTo (1362 of 2145)
PASS: lldb-unit :: Utility/./UtilityTests/BinaryStreamTest.PutULEB128MaxValue (1363 of 2145)
PASS: lldb-shell :: Reproducer/TestSynchronous.test (1364 of 2145)
PASS: lldb-unit :: UnwindAssembly/x86/./UnwindAssemblyx86Tests/Testx86AssemblyInspectionEngine.TestPopRBPWithREX (1365 of 2145)
PASS: lldb-api :: functionalities/data-formatter/data-formatter-stl/libcxx/iterator/TestDataFormatterLibccIterator.py (1366 of 2145)
PASS: lldb-unit :: ObjectFile/PECOFF/./ObjectFilePECOFFTests/PECallFrameInfoTest.Frame_reg_eh (1367 of 2145)
PASS: lldb-unit :: Utility/./UtilityTests/ConstStringTest.FromMidOfBufferStringRef (1368 of 2145)
PASS: lldb-api :: terminal/TestSTTYBeforeAndAfter.py (1369 of 2145)
PASS: lldb-shell :: SymbolFile/DWARF/find-method.cpp (1370 of 2145)
PASS: lldb-unit :: Host/./HostTests/FileSystemTest.EnumerateDirectory (1371 of 2145)
PASS: lldb-shell :: ExecControl/StopHook/stop-hook.test (1372 of 2145)
PASS: lldb-api :: functionalities/data-formatter/data-formatter-cpp/TestDataFormatterCpp.py (1373 of 2145)
UNSUPPORTED: lldb-shell :: Expr/TestIRMemoryMapWindows.test (1374 of 2145)
PASS: lldb-unit :: DataFormatter/./LLDBFormatterTests/TypeMatcherTests.RegexName (1375 of 2145)
PASS: lldb-unit :: Interpreter/./InterpreterTests/OptionValueFileColonLine.setFromString (1376 of 2145)
PASS: lldb-api :: functionalities/data-formatter/ostypeformatting/TestFormattersOsType.py (1377 of 2145)
PASS: lldb-api :: lang/objc/objc-super/TestObjCSuper.py (1378 of 2145)
PASS: lldb-api :: lang/objc/objc-dyn-sbtype/TestObjCDynamicSBType.py (1379 of 2145)
PASS: lldb-shell :: Reproducer/TestFileRepro.test (1380 of 2145)
PASS: lldb-unit :: Utility/./UtilityTests/StringExtractorTest.GetHexU8_Extra (1381 of 2145)
UNSUPPORTED: lldb-api :: python_api/event/TestEvents.py (1382 of 2145)
PASS: lldb-api :: lang/objc/ivar-IMP/TestObjCiVarIMP.py (1383 of 2145)
PASS: lldb-unit :: UnwindAssembly/x86/./UnwindAssemblyx86Tests/Testx86AssemblyInspectionEngine.Test32bitFramelessBigStackFrame (1384 of 2145)
PASS: lldb-unit :: Utility/./UtilityTests/BinaryStreamTest.PutULEB128One (1385 of 2145)
PASS: lldb-api :: functionalities/gdb_remote_client/TestStopPCs.py (1386 of 2145)
PASS: lldb-unit :: Utility/./UtilityTests/RecordReplayTest.InstrumentedBarPtr (1387 of 2145)
PASS: lldb-shell :: Driver/TestRepl.test (1388 of 2145)
PASS: lldb-api :: commands/expression/call-function/TestCallBuiltinFunction.py (1389 of 2145)
UNSUPPORTED: lldb-shell :: SymbolFile/PDB/function-nested-block.test (1390 of 2145)
PASS: lldb-shell :: ObjectFile/wasm/unified-debug-sections.yaml (1391 of 2145)
PASS: lldb-unit :: SymbolFile/NativePDB/./SymbolFileNativePDBTests/PDBFPOProgramToDWARFExpressionTests.MultipleDependentAssignments (1392 of 2145)
PASS: lldb-api :: commands/expression/import-std-module/shared_ptr/TestSharedPtrFromStdModule.py (1393 of 2145)
PASS: lldb-unit :: Symbol/./SymbolTests/TestTypeSystemClang.TestDeletingImplicitCopyCstrDueToMoveCStr (1394 of 2145)
PASS: lldb-api :: iohandler/resize/TestIOHandlerResizeNoEditline.py (1395 of 2145)
PASS: lldb-unit :: Utility/./UtilityTests/ScalarTest.Scalar_512 (1396 of 2145)
PASS: lldb-api :: commands/frame/diagnose/dereference-this/TestDiagnoseDereferenceThis.py (1397 of 2145)
PASS: lldb-unit :: Utility/./UtilityTests/ArgsTest.TestQuotedUnknownEscape (1398 of 2145)
PASS: lldb-unit :: Utility/./UtilityTests/StringListTest.InsertStringAtIndexEnd (1399 of 2145)
PASS: lldb-shell :: ObjectFile/ELF/section-overlap.yaml (1400 of 2145)
PASS: lldb-unit :: Utility/./UtilityTests/ProcessInstanceInfoList.Yaml (1401 of 2145)
PASS: lldb-shell :: SymbolFile/DWARF/childless-compile-unit.s (1402 of 2145)
PASS: lldb-api :: commands/add-dsym/uuid/TestAddDsymCommand.py (1403 of 2145)
XFAIL: lldb-shell :: SymbolFile/DWARF/find-type-in-function.cpp (1404 of 2145)
PASS: lldb-shell :: Reproducer/TestMultipleTargets.test (1405 of 2145)
PASS: lldb-api :: functionalities/data-formatter/data-formatter-categories/TestDataFormatterCategories.py (1406 of 2145)
PASS: lldb-unit :: Utility/./UtilityTests/StringExtractorTest.InitEmpty (1407 of 2145)
PASS: lldb-api :: lang/objc/variadic_methods/TestVariadicMethods.py (1408 of 2145)
PASS: lldb-api :: commands/expression/options/TestExprOptions.py (1409 of 2145)
PASS: lldb-unit :: Utility/./UtilityTests/UUIDTest.Validity (1410 of 2145)
PASS: lldb-unit :: Utility/./UtilityTests/ScalarTest.ComparisonFloat (1411 of 2145)
PASS: lldb-api :: functionalities/breakpoint/breakpoint_options/TestBreakpointOptions.py (1412 of 2145)
PASS: lldb-api :: lang/objc/foundation/TestObjCMethodsNSError.py (1413 of 2145)
PASS: lldb-unit :: ObjectFile/PECOFF/./ObjectFilePECOFFTests/PECallFrameInfoTest.Basic_eh (1414 of 2145)
PASS: lldb-unit :: Process/gdb-remote/./ProcessGdbRemoteTests/GDBRemoteClientBaseTest.SendContinueAndAsyncPacket (1415 of 2145)
PASS: lldb-unit :: Target/./TargetTests/ExecutionContextTest.GetByteOrderTarget (1416 of 2145)
PASS: lldb-unit :: Host/./HostTests/SocketAddressTest.Set (1417 of 2145)
PASS: lldb-api :: lang/objc/orderedset/TestOrderedSet.py (1418 of 2145)
PASS: lldb-unit :: Thread/./ThreadTests/ThreadTest.GetPrivateStopInfo (1419 of 2145)
PASS: lldb-unit :: Symbol/./SymbolTests/TestClangASTImporter.CopyDeclTagDecl (1420 of 2145)
PASS: lldb-api :: python_api/frame/get-variables/TestGetVariables.py (1421 of 2145)
PASS: lldb-unit :: Host/./HostTests/MainLoopTest.Signal (1422 of 2145)
PASS: lldb-api :: functionalities/postmortem/minidump/TestMiniDump.py (1423 of 2145)
PASS: lldb-unit :: Utility/./UtilityTests/PassiveReplayTest.InstrumentedFoo (1424 of 2145)
PASS: lldb-api :: source-manager/TestSourceManager.py (1425 of 2145)
PASS: lldb-unit :: Utility/./UtilityTests/StringExtractorTest.GetHexBytes_OddPair2 (1426 of 2145)
PASS: lldb-api :: lang/cpp/template/TestTemplateArgs.py (1427 of 2145)
PASS: lldb-api :: lang/objc/self/TestObjCSelf.py (1428 of 2145)
PASS: lldb-shell :: Quit/TestQuitExitCodeTooManyArgs.test (1429 of 2145)
PASS: lldb-api :: functionalities/signal/raise/TestRaise.py (1430 of 2145)
PASS: lldb-unit :: SymbolFile/NativePDB/./SymbolFileNativePDBTests/PDBFPOProgramToDWARFExpressionTests.DependencyChain (1431 of 2145)
PASS: lldb-api :: commands/frame/diagnose/local-variable/TestLocalVariable.py (1432 of 2145)
PASS: lldb-unit :: Utility/./UtilityTests/ArgsTest.GetArgumentArrayRef (1433 of 2145)
UNSUPPORTED: lldb-shell :: SymbolFile/PDB/udt-layout.test (1434 of 2145)
PASS: lldb-unit :: Language/Highlighting/./HighlighterTests/HighlighterTest.ClangOperators (1435 of 2145)
PASS: lldb-unit :: Utility/./UtilityTests/ArchSpecTest.MergeFromMachOUnknown (1436 of 2145)
PASS: lldb-api :: commands/command/source/TestCommandSource.py (1437 of 2145)
PASS: lldb-unit :: Target/./TargetTests/StackFrameRecognizerTest.NullModuleRegex (1438 of 2145)
PASS: lldb-api :: functionalities/data-formatter/data-formatter-globals/TestDataFormatterGlobals.py (1439 of 2145)
PASS: lldb-unit :: Process/gdb-remote/./ProcessGdbRemoteTests/GDBRemoteCommunicationClientTest.SendStartTracePacket (1440 of 2145)
PASS: lldb-api :: commands/expression/calculator_mode/TestCalculatorMode.py (1441 of 2145)
PASS: lldb-api :: commands/expression/persistent_types/TestPersistentTypes.py (1442 of 2145)
PASS: lldb-unit :: Expression/./ExpressionTests/CppModuleConfigurationTest.MissingUsrInclude (1443 of 2145)
PASS: lldb-api :: commands/expression/call-throws/TestCallThatThrows.py (1444 of 2145)
PASS: lldb-api :: functionalities/breakpoint/address_breakpoints/TestBadAddressBreakpoints.py (1445 of 2145)
PASS: lldb-api :: functionalities/data-formatter/data-formatter-synth/TestDataFormatterSynth.py (1446 of 2145)
PASS: lldb-unit :: Symbol/./SymbolTests/SymbolsTest.TerminateLocateExecutableSymbolFileForUnknownExecutableAndUnknownSymbolFile (1447 of 2145)
PASS: lldb-shell :: ScriptInterpreter/Python/scripted_breakpoint.test (1448 of 2145)
PASS: lldb-shell :: SymbolFile/NativePDB/nested-types.cpp (1449 of 2145)
PASS: lldb-api :: lang/objc/objc-checker/TestObjCCheckers.py (1450 of 2145)
PASS: lldb-unit :: Utility/./UtilityTests/SubsystemRAIITest.SubsystemWithErrorSuccess (1451 of 2145)
PASS: lldb-unit :: Utility/./UtilityTests/CompletionRequest.TryCompleteCurrentArgBad (1452 of 2145)
PASS: lldb-api :: commands/statistics/basic/TestStats.py (1453 of 2145)
PASS: lldb-shell :: Minidump/memory-region.yaml (1454 of 2145)
PASS: lldb-api :: functionalities/data-formatter/data-formatter-objc/TestDataFormatterObjCNSBundle.py (1455 of 2145)
PASS: lldb-api :: lang/objc/real-definition/TestRealDefinition.py (1456 of 2145)
PASS: lldb-unit :: Symbol/./SymbolTests/TestTypeSystemClang.TestOwningModule (1457 of 2145)
PASS: lldb-api :: commands/frame/diagnose/inheritance/TestDiagnoseInheritance.py (1458 of 2145)
PASS: lldb-unit :: Utility/./UtilityTests/AnsiTerminal.Empty (1459 of 2145)
PASS: lldb-api :: functionalities/signal/handle-abrt/TestHandleAbort.py (1460 of 2145)
PASS: lldb-api :: lang/cpp/gmodules/TestWithModuleDebugging.py (1461 of 2145)
UNSUPPORTED: lldb-api :: arm/breakpoint-it/TestBreakpointIt.py (1462 of 2145)
PASS: lldb-unit :: ObjectFile/ELF/./ObjectFileELFTests/ObjectFileELFTest.GetSymtab_NoSymEntryPointArmThumbAddressClass (1463 of 2145)
PASS: lldb-api :: commands/expression/import-std-module/unique_ptr/TestUniquePtrFromStdModule.py (1464 of 2145)
PASS: lldb-unit :: Utility/./UtilityTests/StringListTest.InsertStringAtIndexMove (1465 of 2145)
PASS: lldb-unit :: UnwindAssembly/x86/./UnwindAssemblyx86Tests/Testx86AssemblyInspectionEngine.TestSimple64bitFrameFunction (1466 of 2145)
PASS: lldb-shell :: SymbolFile/DWARF/dir-separator-windows.s (1467 of 2145)
PASS: lldb-unit :: Utility/./UtilityTests/XcodeSDKTest.SDKSupportsModules (1468 of 2145)
PASS: lldb-shell :: ObjectFile/ELF/PT_LOAD-overlap-section.yaml (1469 of 2145)
PASS: lldb-unit :: Breakpoint/./LLDBBreakpointTests/BreakpointIDTest.StringIsBreakpointName (1470 of 2145)
PASS: lldb-unit :: Utility/./UtilityTests/StringExtractorTest.DecodeHexU8_Extra (1471 of 2145)
PASS: lldb-shell :: Minidump/disassemble-no-module.yaml (1472 of 2145)
PASS: lldb-shell :: SymbolFile/DWARF/limit-debug-info.s (1473 of 2145)
PASS: lldb-unit :: Utility/./UtilityTests/StreamTest.Indent (1474 of 2145)
UNSUPPORTED: lldb-api :: benchmarks/expression/TestRepeatedExprs.py (1475 of 2145)
PASS: lldb-api :: commands/frame/var-scope/TestFrameVariableScope.py (1476 of 2145)
PASS: lldb-api :: functionalities/gdb_remote_client/TestNestedRegDefinitions.py (1477 of 2145)
PASS: lldb-shell :: SymbolFile/DWARF/dwarf5-index-is-used.cpp (1478 of 2145)
PASS: lldb-api :: functionalities/data-formatter/stringprinter/TestStringPrinter.py (1479 of 2145)
PASS: lldb-unit :: Process/minidump/./LLDBMinidumpTests/MinidumpParserTest.FindMemoryRange (1480 of 2145)
PASS: lldb-unit :: Process/./ProcessEventDataTests/ProcessEventDataTest.ShouldStop (1481 of 2145)
PASS: lldb-unit :: Utility/./UtilityTests/UUIDTest.SetFromStringRef (1482 of 2145)
UNSUPPORTED: lldb-shell :: Register/x86-ymm-write.test (1483 of 2145)
PASS: lldb-unit :: Utility/./UtilityTests/StreamTest.PutRawBytesToMixedEndian (1484 of 2145)
PASS: lldb-unit :: UnwindAssembly/x86/./UnwindAssemblyx86Tests/Testx86AssemblyInspectionEngine.TestStackRealign8BitDisp_i386 (1485 of 2145)
PASS: lldb-api :: commands/watchpoints/watchpoint_set_command/TestWatchLocationWithWatchSet.py (1486 of 2145)
PASS: lldb-api :: functionalities/dead-strip/TestDeadStrip.py (1487 of 2145)
PASS: lldb-unit :: Process/gdb-remote/./ProcessGdbRemoteTests/GDBRemoteCommunicationClientTest.WriteRegister (1488 of 2145)
PASS: lldb-api :: types/TestFloatTypesExpr.py (1489 of 2145)
PASS: lldb-unit :: Language/Highlighting/./HighlighterTests/HighlighterTest.ClangIdentifiers (1490 of 2145)
PASS: lldb-unit :: UnwindAssembly/x86/./UnwindAssemblyx86Tests/Testx86AssemblyInspectionEngine.TestPushRBPWithREX (1491 of 2145)
PASS: lldb-api :: functionalities/param_entry_vals/basic_entry_values/TestBasicEntryValues.py (1492 of 2145)
PASS: lldb-api :: commands/gui/breakpoints/TestGuiBreakpoints.py (1493 of 2145)
PASS: lldb-api :: macosx/duplicate-archive-members/TestDuplicateMembers.py (1494 of 2145)
PASS: lldb-unit :: Language/Highlighting/./HighlighterTests/HighlighterTest.Colons (1495 of 2145)
PASS: lldb-unit :: Utility/./UtilityTests/StringListTest.ForRange (1496 of 2145)
PASS: lldb-api :: lang/objc/objc-ivar-offsets/TestObjCIvarOffsets.py (1497 of 2145)
PASS: lldb-api :: functionalities/stats_api/TestStatisticsAPI.py (1498 of 2145)
PASS: lldb-api :: types/TestFloatTypes.py (1499 of 2145)
PASS: lldb-shell :: SymbolFile/DWARF/win-i386-line-table.s (1500 of 2145)
PASS: lldb-shell :: ObjectFile/ELF/netbsd-core-amd64.test (1501 of 2145)
PASS: lldb-shell :: SymbolFile/DWARF/parallel-indexing-stress.s (1502 of 2145)
PASS: lldb-api :: lang/objc/modules-non-objc-target/TestObjCModulesNonObjCTarget.py (1503 of 2145)
PASS: lldb-unit :: debugserver/./debugserverTests/JSON.Parse (1504 of 2145)
PASS: lldb-unit :: Language/CPlusPlus/./LanguageCPlusPlusTests/CPlusPlusLanguage.CPlusPlusNameParser (1505 of 2145)
PASS: lldb-api :: python_api/lldbutil/iter/TestLLDBIterator.py (1506 of 2145)
PASS: lldb-unit :: Utility/./UtilityTests/StringLexerTest.NextIfList (1507 of 2145)
PASS: lldb-unit :: Language/Highlighting/./HighlighterTests/HighlighterTest.DefaultHighlighterWithCursor (1508 of 2145)
PASS: lldb-unit :: Host/./HostTests/SocketTest.DomainListenConnectAccept (1509 of 2145)
UNSUPPORTED: lldb-api :: benchmarks/expression/TestExpressionCmd.py (1510 of 2145)
UNSUPPORTED: lldb-api :: benchmarks/stepping/TestSteppingSpeed.py (1511 of 2145)
PASS: lldb-shell :: SymbolFile/dissassemble-entry-point.s (1512 of 2145)
PASS: lldb-api :: tools/lldb-server/TestAppleSimulatorOSType.py (1513 of 2145)
PASS: lldb-shell :: ObjectFile/ELF/compressed-sections.yaml (1514 of 2145)
PASS: lldb-api :: functionalities/gdb_remote_client/TestPlatformClient.py (1515 of 2145)
PASS: lldb-unit :: Process/gdb-remote/./ProcessGdbRemoteTests/GDBRemoteCommunicationClientTest.ReadRegister (1516 of 2145)
PASS: lldb-api :: lang/cpp/virtual-overload/TestVirtualOverload.py (1517 of 2145)
PASS: lldb-unit :: Utility/./UtilityTests/IndexToObjectTest.ObjectForIndex (1518 of 2145)
PASS: lldb-unit :: Utility/./UtilityTests/StreamTest.PutCharNull (1519 of 2145)
PASS: lldb-api :: functionalities/data-formatter/data-formatter-stl/libcxx/function/TestLibCxxFunction.py (1520 of 2145)
PASS: lldb-unit :: UnwindAssembly/x86/./UnwindAssemblyx86Tests/Testx86AssemblyInspectionEngine.TestPushR13 (1521 of 2145)
PASS: lldb-shell :: Breakpoint/implicit_const_form_support.test (1522 of 2145)
PASS: lldb-unit :: Utility/./UtilityTests/StringListTest.CopyListSingle (1523 of 2145)
PASS: lldb-api :: commands/expression/import-std-module/forward_list-dbg-info-content/TestDbgInfoContentForwardListFromStdModule.py (1524 of 2145)
PASS: lldb-unit :: Utility/./UtilityTests/ArgsTest.TestSingleQuotedArgWithSpace (1525 of 2145)
PASS: lldb-shell :: Process/UnsupportedLanguage.test (1526 of 2145)
PASS: lldb-unit :: Utility/./UtilityTests/StringListTest.ShiftCString (1527 of 2145)
PASS: lldb-unit :: Utility/./UtilityTests/StringListTest.GetMaxStringLengthEmpty (1528 of 2145)
PASS: lldb-api :: commands/command/nested_alias/TestNestedAlias.py (1529 of 2145)
PASS: lldb-api :: commands/expression/save_jit_objects/TestSaveJITObjects.py (1530 of 2145)
PASS: lldb-api :: functionalities/pointer_num_children/TestPointerNumChildren.py (1531 of 2145)
PASS: lldb-api :: commands/expression/multiline-completion/TestMultilineCompletion.py (1532 of 2145)
PASS: lldb-shell :: BuildScript/script-args.test (1533 of 2145)
PASS: lldb-unit :: Platform/Android/./AdbClientTests/AdbClientTest.CreateByDeviceId (1534 of 2145)
PASS: lldb-unit :: Utility/./UtilityTests/AnsiTerminal.Twice (1535 of 2145)
PASS: lldb-shell :: SymbolFile/DWARF/DW_TAG_variable-invalid_location.s (1536 of 2145)
PASS: lldb-api :: functionalities/data-formatter/data-formatter-objc/nsindexpath/TestDataFormatterNSIndexPath.py (1537 of 2145)
PASS: lldb-api :: functionalities/breakpoint/inlined_breakpoints/TestInlinedBreakpoints.py (1538 of 2145)
PASS: lldb-api :: functionalities/unwind/noreturn/module-end/TestNoReturnModuleEnd.py (1539 of 2145)
PASS: lldb-api :: python_api/lldbutil/process/TestPrintStackTraces.py (1540 of 2145)
PASS: lldb-unit :: Utility/./UtilityTests/ConstStringTest.UpdateMangledCounterpart (1541 of 2145)
PASS: lldb-unit :: Process/minidump/./LLDBMinidumpTests/MinidumpParserTest.MinidumpDuplicateModuleMappedFirst (1542 of 2145)
PASS: lldb-shell :: Commands/command-disassemble-process.yaml (1543 of 2145)
PASS: lldb-api :: lang/cpp/bitfields/TestCppBitfields.py (1544 of 2145)
PASS: lldb-unit :: Utility/./UtilityTests/StringListTest.AppendListCStringArrayEmpty (1545 of 2145)
PASS: lldb-api :: commands/expression/namespace_local_var_same_name_cpp_and_c/TestNamespaceLocalVarSameNameCppAndC.py (1546 of 2145)
PASS: lldb-api :: lang/cpp/std-function-step-into-callable/TestStdFunctionStepIntoCallable.py (1547 of 2145)
PASS: lldb-unit :: UnwindAssembly/x86/./UnwindAssemblyx86Tests/Testx86AssemblyInspectionEngine.TestSimple32bitFrameFunction (1548 of 2145)
PASS: lldb-shell :: SymbolFile/DWARF/clang-ast-from-dwarf-unamed-and-anon-structs.cpp (1549 of 2145)
PASS: lldb-api :: python_api/frame/TestFrames.py (1550 of 2145)
PASS: lldb-unit :: Utility/./UtilityTests/UriParserTest.BracketedHostnameWithPortIPv4 (1551 of 2145)
PASS: lldb-unit :: SymbolFile/DWARF/./SymbolFileDWARFTests/XcodeSDKModuleTests.TestModuleGetXcodeSDK (1552 of 2145)
PASS: lldb-shell :: Reproducer/TestDiscard.test (1553 of 2145)
PASS: lldb-unit :: Host/./HostTests/FileSystemTest.OpenErrno (1554 of 2145)
PASS: lldb-api :: lang/objc/objc_direct-methods/TestObjCDirectMethods.py (1555 of 2145)
PASS: lldb-api :: functionalities/data-formatter/data-formatter-stl/libcxx/atomic/TestLibCxxAtomic.py (1556 of 2145)
UNSUPPORTED: lldb-api :: commands/expression/call-restarts/TestCallThatRestarts.py (1557 of 2145)
PASS: lldb-api :: lang/c/complex_int/TestComplexInt.py (1558 of 2145)
PASS: lldb-unit :: UnwindAssembly/ARM64/./Arm64InstEmulationTests/TestArm64InstEmulation.TestRegisterSavedTwice (1559 of 2145)
PASS: lldb-api :: commands/settings/use_source_cache/TestUseSourceCache.py (1560 of 2145)
PASS: lldb-api :: functionalities/memory-region/TestMemoryRegion.py (1561 of 2145)
UNSUPPORTED: lldb-shell :: Register/x86-zmm-read.test (1562 of 2145)
PASS: lldb-unit :: Utility/./UtilityTests/StringExtractorTest.GetHexU8_Underflow2 (1563 of 2145)
PASS: lldb-api :: commands/platform/file/close/TestPlatformFileClose.py (1564 of 2145)
PASS: lldb-api :: functionalities/exec/TestExec.py (1565 of 2145)
PASS: lldb-api :: commands/expression/unicode-in-variable/TestUnicodeInVariable.py (1566 of 2145)
PASS: lldb-api :: commands/target/stop-hook/disable/TestTargetStopHookDisable.py (1567 of 2145)
PASS: lldb-unit :: Utility/./UtilityTests/BinaryStreamTest.PutSLEB128ThreeBytes (1568 of 2145)
PASS: lldb-api :: lang/objc/single-entry-dictionary/TestObjCSingleEntryDictionary.py (1569 of 2145)
PASS: lldb-unit :: Utility/./UtilityTests/StreamTest.PutHex64ByteOrderBig (1570 of 2145)
PASS: lldb-api :: tools/lldb-server/commandline/TestStubSetSID.py (1571 of 2145)
PASS: lldb-unit :: Utility/./UtilityTests/StreamTest.PutMaxHex64ByteOrderBig (1572 of 2145)
PASS: lldb-unit :: Utility/./UtilityTests/StreamTest.PutRawBytesToLittleEndian (1573 of 2145)
PASS: lldb-unit :: Utility/./UtilityTests/NameMatchesTest.Equals (1574 of 2145)
PASS: lldb-unit :: Utility/./UtilityTests/CompletionRequest.FakeLastArg (1575 of 2145)
PASS: lldb-api :: functionalities/postmortem/elf-core/TestLinuxCore.py (1576 of 2145)
PASS: lldb-api :: commands/expression/import-std-module/pair/TestPairFromStdModule.py (1577 of 2145)
UNSUPPORTED: lldb-shell :: SymbolFile/PDB/ast-restore.test (1578 of 2145)
PASS: lldb-unit :: Utility/./UtilityTests/StringListTest.GetMaxStringLengthEqualSize (1579 of 2145)
PASS: lldb-api :: functionalities/tail_call_frames/unambiguous_sequence/TestUnambiguousTailCalls.py (1580 of 2145)
PASS: lldb-unit :: SymbolFile/DWARF/./SymbolFileDWARFTests/SymbolFileDWARFTests.TestAbbrevInvalidNULLTag (1581 of 2145)
UNSUPPORTED: lldb-api :: tools/lldb-vscode/completions/TestVSCode_completions.py (1582 of 2145)
PASS: lldb-unit :: Symbol/./SymbolTests/TestTypeSystemClang.TestDisplayName (1583 of 2145)
PASS: lldb-api :: commands/expression/import-std-module/conflicts/TestStdModuleWithConflicts.py (1584 of 2145)
PASS: lldb-unit :: Process/minidump/./LLDBMinidumpTests/MinidumpParserTest.GetThreadsAndGetThreadContext (1585 of 2145)
PASS: lldb-unit :: ScriptInterpreter/Python/./ScriptInterpreterPythonTests/PythonDataObjectsTest.TestExtractingUInt64ThroughStructuredData (1586 of 2145)
PASS: lldb-shell :: SymbolFile/DWARF/dwarf5-debug_line.s (1587 of 2145)
PASS: lldb-unit :: Utility/./UtilityTests/SerializationRountripTest.SerializeDeserializePodReferences (1588 of 2145)
PASS: lldb-unit :: Expression/./ExpressionTests/CppModuleConfigurationTest.LinuxLocalLibCpp (1589 of 2145)
PASS: lldb-api :: functionalities/data-formatter/data-formatter-stl/libcxx/unordered/TestDataFormatterUnordered.py (1590 of 2145)
PASS: lldb-unit :: Process/minidump/./LLDBMinidumpTests/RegisterContextMinidump.CheckRegisterContextMinidump_ARM (1591 of 2145)
XFAIL: lldb-shell :: Register/x86-64-ymm-write.test (1592 of 2145)
PASS: lldb-api :: lang/cpp/call-function/TestCallCPPFunction.py (1593 of 2145)
PASS: lldb-shell :: ScriptInterpreter/None/none.test (1594 of 2145)
PASS: lldb-unit :: Utility/./UtilityTests/ScalarTest.LongLongAssigmentOperator (1595 of 2145)
PASS: lldb-unit :: Process/gdb-remote/./ProcessGdbRemoteTests/GDBRemoteClientBaseTest.SendContinueAndInterrupt (1596 of 2145)
PASS: lldb-api :: functionalities/memory/cache/TestMemoryCache.py (1597 of 2145)
PASS: lldb-api :: functionalities/data-formatter/data-formatter-objc/TestDataFormatterObjCNSURL.py (1598 of 2145)
PASS: lldb-unit :: Utility/./UtilityTests/UserIDResolver.GetGroupName (1599 of 2145)
PASS: lldb-api :: functionalities/gdb_remote_client/TestRegDefinitionInParts.py (1600 of 2145)
PASS: lldb-api :: lang/objc/objc-ivar-stripped/TestObjCIvarStripped.py (1601 of 2145)
PASS: lldb-api :: functionalities/gdb_remote_client/TestRecognizeBreakpoint.py (1602 of 2145)
PASS: lldb-api :: functionalities/breakpoint/breakpoint_conditions/TestBreakpointConditions.py (1603 of 2145)
PASS: lldb-api :: commands/expression/weak_symbols/TestWeakSymbols.py (1604 of 2145)
PASS: lldb-unit :: Language/Highlighting/./HighlighterTests/HighlighterTest.ClangPPDirectives (1605 of 2145)
PASS: lldb-unit :: Host/./HostTests/ConnectionFileDescriptorTest.TCPGetURIv4 (1606 of 2145)
PASS: lldb-api :: python_api/interpreter/TestCommandInterpreterAPI.py (1607 of 2145)
PASS: lldb-api :: commands/watchpoints/watchpoint_on_vectors/TestValueOfVectorVariable.py (1608 of 2145)
PASS: lldb-unit :: Utility/./UtilityTests/PassiveReplayTest.InstrumentedFooInvalid (1609 of 2145)
PASS: lldb-unit :: Utility/./UtilityTests/UriParserTest.TypicalPortPathIPv4 (1610 of 2145)
PASS: lldb-shell :: ObjectFile/ELF/basic-info.yaml (1611 of 2145)
PASS: lldb-unit :: Utility/./UtilityTests/ArgsTest.TestSingleArgWithQuotedSpace (1612 of 2145)
PASS: lldb-unit :: Language/Highlighting/./HighlighterTests/HighlighterTest.ClangCursorPos (1613 of 2145)
PASS: lldb-api :: python_api/lldbutil/TestSwigVersion.py (1614 of 2145)
PASS: lldb-api :: lang/cpp/incomplete-types/TestCppIncompleteTypes.py (1615 of 2145)
PASS: lldb-unit :: ScriptInterpreter/Python/./ScriptInterpreterPythonTests/PythonDataObjectsTest.TestPythonIntegerToStructuredInteger (1616 of 2145)
PASS: lldb-api :: functionalities/thread/concurrent_events/TestConcurrentDelayedCrashWithBreakpointWatchpoint.py (1617 of 2145)
PASS: lldb-unit :: Utility/./UtilityTests/StreamTeeTest.SetStreamAtIndexOutOfBounds (1618 of 2145)
PASS: lldb-api :: functionalities/history/TestHistoryRecall.py (1619 of 2145)
PASS: lldb-api :: lang/objc/modules-auto-import/TestModulesAutoImport.py (1620 of 2145)
PASS: lldb-api :: functionalities/lazy-loading/TestLazyLoading.py (1621 of 2145)
PASS: lldb-shell :: ObjectFile/PECOFF/dep-modules.yaml (1622 of 2145)
PASS: lldb-api :: python_api/class_members/TestSBTypeClassMembers.py (1623 of 2145)
PASS: lldb-unit :: Host/./HostTests/Host.GetEnvironment (1624 of 2145)
PASS: lldb-unit :: Host/./HostTests/HostInfoTest.GetHostname (1625 of 2145)
PASS: lldb-unit :: Utility/./UtilityTests/RangeTest.SetRangeBase (1626 of 2145)
PASS: lldb-unit :: Utility/./UtilityTests/StringExtractorTest.GetHexBytes_OddPair (1627 of 2145)
PASS: lldb-unit :: Process/minidump/./LLDBMinidumpTests/MinidumpParserTest.GetArchitectureWindows (1628 of 2145)
PASS: lldb-api :: functionalities/inferior-crashing/recursive-inferior/TestRecursiveInferiorStep.py (1629 of 2145)
PASS: lldb-api :: functionalities/set-data/TestSetData.py (1630 of 2145)
PASS: lldb-api :: functionalities/tail_call_frames/disambiguate_call_site/TestDisambiguateCallSite.py (1631 of 2145)
PASS: lldb-unit :: Utility/./UtilityTests/StringExtractorTest.GetU32BigEndian (1632 of 2145)
PASS: lldb-unit :: ScriptInterpreter/Python/./ScriptInterpreterPythonTests/PythonDataObjectsTest.TestPythonBoolean (1633 of 2145)
PASS: lldb-api :: functionalities/breakpoint/comp_dir_symlink/TestCompDirSymLink.py (1634 of 2145)
PASS: lldb-unit :: Host/./HostTests/SocketTest.UDPGetConnectURI (1635 of 2145)
PASS: lldb-api :: lang/objc/blocks/TestObjCIvarsInBlocks.py (1636 of 2145)
PASS: lldb-api :: python_api/findvalue_duplist/TestSBFrameFindValue.py (1637 of 2145)
PASS: lldb-api :: lang/cpp/class_types/TestClassTypes.py (1638 of 2145)
PASS: lldb-shell :: ObjectFile/ELF/PT_LOAD-empty.yaml (1639 of 2145)
PASS: lldb-unit :: Host/./HostTests/FileSystemTest.Exists (1640 of 2145)
PASS: lldb-unit :: Utility/./UtilityTests/StringExtractorTest.GetHexU8_InvalidHex_NoEof (1641 of 2145)
PASS: lldb-unit :: Language/Highlighting/./HighlighterTests/HighlighterTest.ClangComments (1642 of 2145)
PASS: lldb-unit :: Target/./TargetTests/MCBasedABI.MapRegisterName (1643 of 2145)
PASS: lldb-shell :: SymbolFile/DWARF/DW_AT_loclists_base.s (1644 of 2145)
PASS: lldb-unit :: SymbolFile/DWARF/./SymbolFileDWARFTests/SymbolFileDWARFTests.TestAbbrevOutOfOrder (1645 of 2145)
PASS: lldb-unit :: Utility/./UtilityTests/StringListTest.InsertStringAtIndexStart (1646 of 2145)
PASS: lldb-api :: assert_messages_test/TestAssertMessages.py (1647 of 2145)
PASS: lldb-unit :: Utility/./UtilityTests/RangeTest.EqualInvalid (1648 of 2145)
PASS: lldb-unit :: Language/Highlighting/./HighlighterTests/HighlighterTest.ClangCursorOutOfBounds (1649 of 2145)
PASS: lldb-unit :: Utility/./UtilityTests/VMRange.Comparison (1650 of 2145)
PASS: lldb-unit :: Symbol/./SymbolTests/TestClangASTImporter.ImportInvalidType (1651 of 2145)
PASS: lldb-unit :: Core/./LLDBCoreTests/MangledTest.ResultForBlockInvocation (1652 of 2145)
PASS: lldb-api :: functionalities/data-formatter/data-formatter-synthtype/TestDataFormatterSynthType.py (1653 of 2145)
PASS: lldb-api :: functionalities/inline-stepping/TestInlineStepping.py (1654 of 2145)
PASS: lldb-unit :: Utility/./UtilityTests/StreamTeeTest.CopyConstructor (1655 of 2145)
PASS: lldb-shell :: ScriptInterpreter/Python/python.test (1656 of 2145)
PASS: lldb-unit :: ScriptInterpreter/Python/./ScriptInterpreterPythonTests/PythonDataObjectsTest.TestObjectAttributes (1657 of 2145)
PASS: lldb-shell :: SymbolFile/NativePDB/function-types-classes.cpp (1658 of 2145)
PASS: lldb-unit :: Expression/./ExpressionTests/DWARFExpression.DW_OP_convert (1659 of 2145)
PASS: lldb-api :: commands/frame/diagnose/virtual-method-call/TestDiagnoseDereferenceVirtualMethodCall.py (1660 of 2145)
PASS: lldb-unit :: Utility/./UtilityTests/StreamTest.AddressPrefix (1661 of 2145)
PASS: lldb-shell :: SymbolFile/DWARF/split-dwarf-multiple-cu.ll (1662 of 2145)
PASS: lldb-api :: functionalities/breakpoint/breakpoint_command/TestRegexpBreakCommand.py (1663 of 2145)
PASS: lldb-api :: functionalities/data-formatter/boolreference/TestFormattersBoolRefPtr.py (1664 of 2145)
UNSUPPORTED: lldb-api :: commands/register/register/intel_xtended_registers/TestMPXRegisters.py (1665 of 2145)
PASS: lldb-unit :: Utility/./UtilityTests/DataExtractorTest.GetSLEB128_bit63 (1666 of 2145)
PASS: lldb-unit :: ScriptInterpreter/Python/./ScriptInterpreterPythonTests/PythonDataObjectsTest.TestPythonByteArray (1667 of 2145)
PASS: lldb-api :: functionalities/breakpoint/breakpoint_by_line_and_column/TestBreakpointByLineAndColumn.py (1668 of 2145)
PASS: lldb-unit :: UnwindAssembly/x86/./UnwindAssemblyx86Tests/Testx86AssemblyInspectionEngine.TestPopRBX (1669 of 2145)
PASS: lldb-unit :: Utility/./UtilityTests/StringListTest.GetMaxStringLengthMixed (1670 of 2145)
PASS: lldb-unit :: Utility/./UtilityTests/StringExtractorTest.InitMisc (1671 of 2145)
PASS: lldb-unit :: Host/./HostTests/MainLoopTest.ReadObject (1672 of 2145)
PASS: lldb-api :: commands/expression/import_builtin_fileid/TestImportBuiltinFileID.py (1673 of 2145)
PASS: lldb-api :: functionalities/process_group/TestChangeProcessGroup.py (1674 of 2145)
PASS: lldb-api :: macosx/find-dsym/bundle-with-dot-in-filename/TestBundleWithDotInFilename.py (1675 of 2145)
PASS: lldb-unit :: Host/./HostTests/SocketTest.DecodeHostAndPort (1676 of 2145)
UNSUPPORTED: lldb-api :: functionalities/longjmp/TestLongjmp.py (1677 of 2145)
PASS: lldb-api :: commands/expression/expr-in-syscall/TestExpressionInSyscall.py (1678 of 2145)
PASS: lldb-api :: commands/breakpoint/command/list/TestBreakpointCommandList.py (1679 of 2145)
UNSUPPORTED: lldb-api :: functionalities/darwin_log/filter/regex/activity/TestDarwinLogFilterRegexActivity.py (1680 of 2145)
PASS: lldb-api :: functionalities/tail_call_frames/inlining_and_tail_calls/TestInliningAndTailCalls.py (1681 of 2145)
PASS: lldb-api :: functionalities/inferior-crashing/TestInferiorCrashing.py (1682 of 2145)
PASS: lldb-unit :: SymbolFile/NativePDB/./SymbolFileNativePDBTests/PDBFPOProgramToDWARFExpressionTests.UnsupportedRASearch (1683 of 2145)
PASS: lldb-api :: commands/expression/import-std-module/unique_ptr-dbg-info-content/TestUniquePtrDbgInfoContent.py (1684 of 2145)
PASS: lldb-shell :: Expr/TestIRMemoryMap.test (1685 of 2145)
PASS: lldb-api :: lang/objc/objc++/TestObjCXX.py (1686 of 2145)
PASS: lldb-api :: functionalities/data-formatter/builtin-formats/TestBuiltinFormats.py (1687 of 2145)
PASS: lldb-api :: functionalities/thread/concurrent_events/TestConcurrentTwoBreakpointThreads.py (1688 of 2145)
PASS: lldb-shell :: Reproducer/TestCaptureEnvOverride.test (1689 of 2145)
PASS: lldb-shell :: SymbolFile/NativePDB/locate-pdb.cpp (1690 of 2145)
PASS: lldb-unit :: Symbol/./SymbolTests/TestClangASTImporter.CompleteFwdDeclWithOtherOrigin (1691 of 2145)
PASS: lldb-api :: macosx/safe-to-func-call/TestSafeFuncCalls.py (1692 of 2145)
PASS: lldb-unit :: Expression/./ExpressionTests/CppModuleConfigurationTest.AmbiguousLibCpp (1693 of 2145)
UNSUPPORTED: lldb-api :: functionalities/data-formatter/data-formatter-stl/libstdcpp/map/TestDataFormatterStdMap.py (1694 of 2145)
PASS: lldb-api :: lang/cpp/subst_template_type_param/TestSubstTemplateTypeParam.py (1695 of 2145)
PASS: lldb-shell :: SymbolFile/NativePDB/globals-fundamental.cpp (1696 of 2145)
PASS: lldb-unit :: UnwindAssembly/x86/./UnwindAssemblyx86Tests/Testx86AssemblyInspectionEngine.TestLEAVE (1697 of 2145)
PASS: lldb-api :: tools/lldb-server/TestGdbRemoteRegisterState.py (1698 of 2145)
PASS: lldb-unit :: Utility/./UtilityTests/StreamTeeTest.Write (1699 of 2145)
PASS: lldb-api :: functionalities/data-formatter/data-formatter-stl/libcxx/unique_ptr/TestDataFormatterLibcxxUniquePtr.py (1700 of 2145)
PASS: lldb-unit :: Utility/./UtilityTests/StringListTest.ShiftStdString (1701 of 2145)
PASS: lldb-unit :: UnwindAssembly/x86/./UnwindAssemblyx86Tests/Testx86AssemblyInspectionEngine.TestPushEBP (1702 of 2145)
PASS: lldb-api :: commands/expression/deleting-implicit-copy-constructor/TestDeletingImplicitCopyConstructor.py (1703 of 2145)
PASS: lldb-unit :: Utility/./UtilityTests/ListenerTest.GetEventWait (1704 of 2145)
PASS: lldb-unit :: Utility/./UtilityTests/StringExtractorTest.GetU32LittleEndian (1705 of 2145)
PASS: lldb-api :: python_api/lldbutil/frame/TestFrameUtils.py (1706 of 2145)
PASS: lldb-unit :: Symbol/./SymbolTests/TestTypeSystemClang.TestGetTypeClassTypeOfExpr (1707 of 2145)
PASS: lldb-api :: functionalities/thread/thread_specific_break/TestThreadSpecificBreakpoint.py (1708 of 2145)
PASS: lldb-unit :: Expression/./ExpressionTests/DiagnosticManagerTest.PutStringMultiple (1709 of 2145)
PASS: lldb-api :: commands/expression/char/TestExprsChar.py (1710 of 2145)
PASS: lldb-unit :: Core/./LLDBCoreTests/ModuleSpecTest.TestELFFile (1711 of 2145)
PASS: lldb-api :: commands/expression/import-std-module/weak_ptr-dbg-info-content/TestDbgInfoContentWeakPtrFromStdModule.py (1712 of 2145)
UNSUPPORTED: lldb-api :: arm/breakpoint-thumb-codesection/TestBreakpointThumbCodesection.py (1713 of 2145)
PASS: lldb-unit :: UnwindAssembly/x86/./UnwindAssemblyx86Tests/Testx86AssemblyInspectionEngine.TestPopESI (1714 of 2145)
UNSUPPORTED: lldb-api :: linux/sepdebugsymlink/TestTargetSymbolsSepDebugSymlink.py (1715 of 2145)
PASS: lldb-unit :: Utility/./UtilityTests/Predicate.WaitForValueNotEqualTo (1716 of 2145)
PASS: lldb-shell :: ObjectFile/Breakpad/sections.test (1717 of 2145)
PASS: lldb-unit :: Language/Highlighting/./HighlighterTests/HighlighterTest.ClangCursorPosAfterOtherToken (1718 of 2145)
PASS: lldb-shell :: Reproducer/Functionalities/TestStepping.test (1719 of 2145)
PASS: lldb-api :: functionalities/limit-debug-info/TestLimitDebugInfo.py (1720 of 2145)
PASS: lldb-api :: lang/objc/modules-update/TestClangModulesUpdate.py (1721 of 2145)
PASS: lldb-unit :: UnwindAssembly/ARM64/./Arm64InstEmulationTests/TestArm64InstEmulation.TestFramelessThreeEpilogueFunction (1722 of 2145)
PASS: lldb-unit :: Process/minidump/./LLDBMinidumpTests/MinidumpParserTest.FindMemoryRangeWithFullMemoryMinidump (1723 of 2145)
PASS: lldb-api :: lang/objc/rdar-11355592/TestRdar11355592.py (1724 of 2145)
PASS: lldb-shell :: Reproducer/Functionalities/TestDataFormatter.test (1725 of 2145)
UNSUPPORTED: lldb-api :: commands/register/register/intel_xtended_registers/mpx_bound_violation/TestBoundViolation.py (1726 of 2145)
PASS: lldb-api :: commands/log/invalid-args/TestInvalidArgsLog.py (1727 of 2145)
PASS: lldb-unit :: DataFormatter/./LLDBFormatterTests/FormatManagerTests.CompatibleLangs (1728 of 2145)
PASS: lldb-api :: functionalities/tsan/multiple/TestTsanMultiple.py (1729 of 2145)
PASS: lldb-api :: functionalities/data-formatter/data-formatter-stl/libcxx/forward_list/TestDataFormatterLibcxxForwardList.py (1730 of 2145)
PASS: lldb-shell :: SymbolFile/Breakpad/unwind-via-stack-cfi.test (1731 of 2145)
PASS: lldb-api :: functionalities/paths/TestPaths.py (1732 of 2145)
PASS: lldb-unit :: Symbol/./SymbolTests/TestTypeSystemClang.TemplateArguments (1733 of 2145)
PASS: lldb-api :: functionalities/data-formatter/data-formatter-advanced/TestDataFormatterAdv.py (1734 of 2145)
PASS: lldb-unit :: Utility/./UtilityTests/RegularExpression.Valid (1735 of 2145)
PASS: lldb-unit :: Utility/./UtilityTests/UriParserTest.BracketedHostname (1736 of 2145)
PASS: lldb-unit :: Process/minidump/./LLDBMinidumpTests/RegisterContextMinidump.ConvertMinidumpContext_x86_64 (1737 of 2145)
PASS: lldb-api :: lang/objc/modules/TestObjCModules.py (1738 of 2145)
PASS: lldb-shell :: SymbolFile/NativePDB/ast-functions.cpp (1739 of 2145)
PASS: lldb-unit :: Utility/./UtilityTests/ScalarTest.SetValueFromData (1740 of 2145)
PASS: lldb-api :: commands/frame/language/TestGuessLanguage.py (1741 of 2145)
PASS: lldb-api :: functionalities/data-formatter/language_category_updates/TestDataFormatterLanguageCategoryUpdates.py (1742 of 2145)
PASS: lldb-shell :: Minidump/Windows/find-module.test (1743 of 2145)
PASS: lldb-unit :: Host/./HostTests/HostInfoTest.GetAugmentedArchSpec (1744 of 2145)
PASS: lldb-api :: lang/cpp/limit-debug-info/TestWithLimitDebugInfo.py (1745 of 2145)
PASS: lldb-unit :: Utility/./UtilityTests/StreamTest.ShiftOperatorStrings (1746 of 2145)
PASS: lldb-shell :: SymbolFile/DWARF/debug_loc.s (1747 of 2145)
PASS: lldb-api :: functionalities/wrong_commands/TestWrongCommands.py (1748 of 2145)
PASS: lldb-unit :: Utility/./UtilityTests/LogChannelEnabledTest.LogVerboseThread (1749 of 2145)
PASS: lldb-api :: tools/lldb-server/TestGdbRemoteSingleStep.py (1750 of 2145)
PASS: lldb-api :: functionalities/data-formatter/data-formatter-stl/libcxx/tuple/TestDataFormatterLibcxxTuple.py (1751 of 2145)
PASS: lldb-api :: lang/c/local_types/TestUseClosestType.py (1752 of 2145)
PASS: lldb-unit :: Utility/./UtilityTests/RangeTest.ContainsAddr (1753 of 2145)
PASS: lldb-shell :: ObjectFile/ELF/netbsd-exec-8.99.30-amd64.yaml (1754 of 2145)
PASS: lldb-shell :: Quit/TestQuitExitCodeNonInt.test (1755 of 2145)
PASS: lldb-api :: commands/expression/anonymous-struct/TestCallUserAnonTypedef.py (1756 of 2145)
PASS: lldb-unit :: Utility/./UtilityTests/UriParserTest.BracketedHostnameWithColon (1757 of 2145)
PASS: lldb-unit :: Utility/./UtilityTests/TimerTest.CategoryTimesNested (1758 of 2145)
PASS: lldb-unit :: Host/./HostTests/FileSystemTest.Readable (1759 of 2145)
PASS: lldb-unit :: DataFormatter/./LLDBFormatterTests/StringPrinterTests.CxxASCII (1760 of 2145)
PASS: lldb-api :: python_api/disassemble-raw-data/TestDisassemble_VST1_64.py (1761 of 2145)
PASS: lldb-shell :: BuildScript/toolchain-clang.test (1762 of 2145)
PASS: lldb-shell :: Quit/TestQuitExitCode30.test (1763 of 2145)
PASS: lldb-shell :: SymbolFile/DWARF/DW_TAG_basic_type_DW_ATE_UTF_nonC.ll (1764 of 2145)
PASS: lldb-unit :: Expression/./ExpressionTests/DiagnosticManagerTest.FixedExpression (1765 of 2145)
PASS: lldb-unit :: Utility/./UtilityTests/ArgsTest.TestSingleArg (1766 of 2145)
PASS: lldb-shell :: Quit/TestQuitExitCode0.test (1767 of 2145)
PASS: lldb-shell :: ObjectFile/Breakpad/discontiguous-sections.test (1768 of 2145)
PASS: lldb-unit :: Utility/./UtilityTests/UriParserTest.MinimalPath (1769 of 2145)
PASS: lldb-api :: api/multiple-debuggers/TestMultipleDebuggers.py (1770 of 2145)
PASS: lldb-api :: lang/c/unicode/TestUnicodeSymbols.py (1771 of 2145)
PASS: lldb-unit :: Host/./HostTests/SocketTest.TCPGetConnectURI (1772 of 2145)
PASS: lldb-unit :: ScriptInterpreter/Python/./ScriptInterpreterPythonTests/PythonDataObjectsTest.TestPythonIntegerToStr (1773 of 2145)
PASS: lldb-unit :: Expression/./ExpressionTests/DiagnosticManagerTest.AddDiagnostic (1774 of 2145)
PASS: lldb-unit :: ObjectFile/MachO/./ObjectFileMachOTests/ObjectFileMachOTest.ModuleFromSharedCacheInfo (1775 of 2145)
PASS: lldb-unit :: Language/Highlighting/./HighlighterTests/HighlighterTest.FallbackHighlighter (1776 of 2145)
UNSUPPORTED: lldb-api :: functionalities/unwind/standard/TestStandardUnwind.py (1777 of 2145)
PASS: lldb-unit :: UnwindAssembly/x86/./UnwindAssemblyx86Tests/Testx86AssemblyInspectionEngine.TestCALLNextInsn (1778 of 2145)
UNSUPPORTED: lldb-api :: lang/cpp/printf/TestPrintf.py (1779 of 2145)
PASS: lldb-unit :: Utility/./UtilityTests/RangeTest.Constructor (1780 of 2145)
PASS: lldb-api :: lang/cpp/operator-overload/TestOperatorOverload.py (1781 of 2145)
PASS: lldb-unit :: Utility/./UtilityTests/StructuredDataTest.ParseJSONFromFile (1782 of 2145)
UNSUPPORTED: lldb-api :: functionalities/signal/handle-segv/TestHandleSegv.py (1783 of 2145)
PASS: lldb-api :: functionalities/thread/concurrent_events/TestConcurrentManyWatchpoints.py (1784 of 2145)
PASS: lldb-api :: lang/mixed/TestMixedLanguages.py (1785 of 2145)
PASS: lldb-unit :: Utility/./UtilityTests/OptionsWithRawTest.EmptyInput (1786 of 2145)
PASS: lldb-shell :: SymbolFile/DWARF/debug_aranges-empty-section.s (1787 of 2145)
PASS: lldb-unit :: Symbol/./SymbolTests/DWARFCallFrameInfoTest.Basic_dwarf3 (1788 of 2145)
PASS: lldb-shell :: ObjectFile/ELF/duplicate-section.yaml (1789 of 2145)
PASS: lldb-unit :: Process/gdb-remote/./ProcessGdbRemoteTests/GDBRemoteClientBaseTest.SendContinueDelegateStructuredDataReceipt (1790 of 2145)
PASS: lldb-unit :: SymbolFile/NativePDB/./SymbolFileNativePDBTests/PDBFPOProgramToDWARFExpressionTests.InvalidOpBinary (1791 of 2145)
PASS: lldb-api :: functionalities/step-avoids-no-debug/TestStepNoDebug.py (1792 of 2145)
UNSUPPORTED: lldb-api :: functionalities/darwin_log/filter/exact_match/activity-chain/TestDarwinLogFilterMatchActivityChain.py (1793 of 2145)
PASS: lldb-api :: lang/c/modules/TestCModules.py (1794 of 2145)
UNSUPPORTED: lldb-shell :: ScriptInterpreter/Lua/convenience_variables.test (1795 of 2145)
PASS: lldb-api :: lang/cpp/unsigned_types/TestUnsignedTypes.py (1796 of 2145)
PASS: lldb-api :: types/TestLongTypes.py (1797 of 2145)
UNSUPPORTED: lldb-shell :: SymbolFile/target-symbols-add-unwind.test (1798 of 2145)
PASS: lldb-api :: commands/command/script_alias/TestCommandScriptAlias.py (1799 of 2145)
PASS: lldb-unit :: UnwindAssembly/x86/./UnwindAssemblyx86Tests/Testx86AssemblyInspectionEngine.TestSpillRegToStackViaMOVi386 (1800 of 2145)
UNSUPPORTED: lldb-api :: functionalities/unwind/ehframe/TestEhFrameUnwind.py (1801 of 2145)
PASS: lldb-api :: lang/c/anonymous/TestAnonymous.py (1802 of 2145)
PASS: lldb-shell :: Driver/TestTarget.test (1803 of 2145)
PASS: lldb-unit :: Utility/./UtilityTests/RangeDataVector.FindEntryIndexesThatContain (1804 of 2145)
UNSUPPORTED: lldb-shell :: Reproducer/TestLuaImport.test (1805 of 2145)
PASS: lldb-unit :: Utility/./UtilityTests/AnsiTerminal.AtEnd (1806 of 2145)
PASS: lldb-api :: commands/expression/pr35310/TestExprsBug35310.py (1807 of 2145)
PASS: lldb-api :: functionalities/breakpoint/dummy_target_breakpoints/TestBreakpointsWithNoTargets.py (1808 of 2145)
PASS: lldb-api :: python_api/sbvalue_const_addrof/TestSBValueConstAddrOf.py (1809 of 2145)
PASS: lldb-unit :: Utility/./UtilityTests/Predicate.WaitForValueEqualTo (1810 of 2145)
PASS: lldb-unit :: UnwindAssembly/ARM64/./Arm64InstEmulationTests/TestArm64InstEmulation.TestMediumDarwinFunction (1811 of 2145)
PASS: lldb-unit :: Utility/./UtilityTests/StringListTest.GetSize (1812 of 2145)
PASS: lldb-unit :: Utility/./UtilityTests/RegularExpression.CopyAssignment (1813 of 2145)
PASS: lldb-api :: lang/cpp/namespace_definitions/TestNamespaceDefinitions.py (1814 of 2145)
PASS: lldb-api :: functionalities/breakpoint/objc/TestObjCBreakpoints.py (1815 of 2145)
PASS: lldb-api :: commands/settings/TestSettings.py (1816 of 2145)
PASS: lldb-api :: functionalities/data-formatter/data-formatter-objc/TestDataFormatterObjCExpr.py (1817 of 2145)
PASS: lldb-api :: functionalities/breakpoint/debugbreak/TestDebugBreak.py (1818 of 2145)
PASS: lldb-unit :: Utility/./UtilityTests/BinaryStreamTest.PutSLEB128One (1819 of 2145)
PASS: lldb-unit :: Language/Highlighting/./HighlighterTests/HighlighterTest.ClangCursorPosInOtherToken (1820 of 2145)
PASS: lldb-api :: lang/cpp/class_static/TestStaticVariables.py (1821 of 2145)
PASS: lldb-unit :: UnwindAssembly/x86/./UnwindAssemblyx86Tests/Testx86AssemblyInspectionEngine.TestPopRBP (1822 of 2145)
PASS: lldb-unit :: Utility/./UtilityTests/FileSpecTest.CopyByAppendingPathComponent (1823 of 2145)
PASS: lldb-unit :: Host/./HostTests/NativeProcessProtocolTest.SetBreakpointFailRead (1824 of 2145)
PASS: lldb-api :: functionalities/gdb_remote_client/TestGDBRemoteClient.py (1825 of 2145)
PASS: lldb-unit :: Utility/./UtilityTests/StringListTest.LongestCommonPrefix (1826 of 2145)
PASS: lldb-unit :: Signals/./SignalsTests/UnixSignalsTest.VersionChange (1827 of 2145)
PASS: lldb-unit :: Symbol/./SymbolTests/TestClangASTImporter.DeportTypeTagDecl (1828 of 2145)
PASS: lldb-unit :: Expression/./ExpressionTests/ClangExpressionDeclMapTest.TestUnknownIdentifierLookup (1829 of 2145)
PASS: lldb-unit :: Utility/./UtilityTests/LogChannelEnabledTest.LLDB_LOG_ERROR (1830 of 2145)
PASS: lldb-unit :: UnwindAssembly/x86/./UnwindAssemblyx86Tests/Testx86AssemblyInspectionEngine.TestPushESI (1831 of 2145)
PASS: lldb-unit :: Utility/./UtilityTests/EnvironmentTest.EnvpConstruction (1832 of 2145)
PASS: lldb-unit :: Instruction/./EmulatorTests/TestAArch64Emulator.TestOverflow (1833 of 2145)
PASS: lldb-api :: lang/c/stepping/TestStepAndBreakpoints.py (1834 of 2145)
PASS: lldb-api :: commands/platform/basic/TestPlatformPython.py (1835 of 2145)
PASS: lldb-unit :: Utility/./UtilityTests/SerializationRountripTest.SerializeDeserializePodPointers (1836 of 2145)
UNSUPPORTED: lldb-shell :: Register/x86-64-ymm16-write.test (1837 of 2145)
PASS: lldb-api :: functionalities/data-formatter/data-formatter-objc/TestDataFormatterObjCKVO.py (1838 of 2145)
PASS: lldb-api :: commands/expression/import-std-module/deque-dbg-info-content/TestDbgInfoContentDequeFromStdModule.py (1839 of 2145)
PASS: lldb-api :: lang/cpp/thread_local/TestThreadLocal.py (1840 of 2145)
PASS: lldb-unit :: Utility/./UtilityTests/Flags.GetBitSize (1841 of 2145)
PASS: lldb-api :: tools/lldb-server/register-reading/TestGdbRemoteGPacket.py (1842 of 2145)
PASS: lldb-api :: lang/cpp/trivial_abi/TestTrivialABI.py (1843 of 2145)
PASS: lldb-shell :: ObjectFile/PECOFF/section-types.yaml (1844 of 2145)
PASS: lldb-unit :: Utility/./UtilityTests/StringExtractorTest.DecodeHexU8_Underflow (1845 of 2145)
PASS: lldb-unit :: Process/minidump/./LLDBMinidumpTests/MinidumpParserTest.GetThreadContext_x86_32 (1846 of 2145)
PASS: lldb-shell :: ObjectFile/PECOFF/basic-info-arm64.yaml (1847 of 2145)
PASS: lldb-unit :: Expression/./ExpressionTests/DiagnosticManagerTest.GetStringMultiline (1848 of 2145)
PASS: lldb-unit :: Utility/./UtilityTests/DataExtractorTest.UncommonAddressSize (1849 of 2145)
PASS: lldb-unit :: Process/gdb-remote/./ProcessGdbRemoteTests/GDBRemoteCommunicationServerTest.SendErrorResponse_ErrorNumber (1850 of 2145)
PASS: lldb-unit :: Symbol/./SymbolTests/TestTypeSystemClang.TestFunctionTemplateInRecordConstruction (1851 of 2145)
PASS: lldb-unit :: Utility/./UtilityTests/ArgsTest.BareSingleQuote (1852 of 2145)
PASS: lldb-shell :: Settings/TestStopCommandSourceOnError.test (1853 of 2145)
PASS: lldb-shell :: SymbolFile/DWARF/debug-names-compressed.cpp (1854 of 2145)
PASS: lldb-api :: functionalities/data-formatter/cstring-utf8-summary/TestCstringUnicode.py (1855 of 2145)
PASS: lldb-unit :: SymbolFile/DWARF/./SymbolFileDWARFTests/SymbolFileDWARFTests.TestAbbrevValidAttrNullForm (1856 of 2145)
PASS: lldb-unit :: Utility/./UtilityTests/StringListTest.SplitIntoLines (1857 of 2145)
UNSUPPORTED: lldb-api :: functionalities/data-formatter/data-formatter-stl/libstdcpp/vector/TestDataFormatterStdVector.py (1858 of 2145)
PASS: lldb-api :: tools/lldb-server/inferior-crash/TestGdbRemoteAbort.py (1859 of 2145)
PASS: lldb-unit :: Target/./TargetTests/MemoryRegionInfoTest.Formatv (1860 of 2145)
PASS: lldb-unit :: ScriptInterpreter/Python/./ScriptInterpreterPythonTests/PythonDataObjectsTest.TestPythonInteger (1861 of 2145)
PASS: lldb-unit :: Target/./TargetTests/PathMappingListTest.AbsoluteTests (1862 of 2145)
UNSUPPORTED: lldb-api :: functionalities/data-formatter/data-formatter-stl/libstdcpp/list/TestDataFormatterStdList.py (1863 of 2145)
PASS: lldb-unit :: Utility/./UtilityTests/StreamTest.AddressPrefixAndSuffix (1864 of 2145)
PASS: lldb-api :: functionalities/thread/concurrent_events/TestConcurrentSignalWatch.py (1865 of 2145)
PASS: lldb-shell :: Commands/command-disassemble.s (1866 of 2145)
PASS: lldb-unit :: Process/gdb-remote/./ProcessGdbRemoteTests/GDBRemoteCommunicationClientTest.SaveRestoreRegistersNoSuffix (1867 of 2145)
UNSUPPORTED: lldb-api :: lang/cpp/function-template-parameter-pack/TestFunctionTemplateParameterPack.py (1868 of 2145)
PASS: lldb-unit :: UnwindAssembly/x86/./UnwindAssemblyx86Tests/Testx86AssemblyInspectionEngine.TestSimplex86_64Augmented (1869 of 2145)
PASS: lldb-api :: functionalities/target_var/TestTargetVar.py (1870 of 2145)
PASS: lldb-unit :: Platform/Android/./AdbClientTests/AdbClientTest.CreateByDeviceId_ByEnvVar (1871 of 2145)
PASS: lldb-unit :: Symbol/./SymbolTests/TestClangASTImporter.CopyTypeTagDecl (1872 of 2145)
PASS: lldb-api :: commands/expression/entry-bp/TestExprEntryBP.py (1873 of 2145)
PASS: lldb-shell :: SymbolFile/DWARF/debug-line-basic.s (1874 of 2145)
PASS: lldb-unit :: Utility/./UtilityTests/StringExtractorTest.GetHexBytesAvail_OddPair2 (1875 of 2145)
PASS: lldb-api :: lang/cpp/wchar_t/TestCxxWCharT.py (1876 of 2145)
PASS: lldb-unit :: Process/minidump/./LLDBMinidumpTests/MinidumpParserTest.GetPidWindows (1877 of 2145)
UNSUPPORTED: lldb-shell :: SymbolFile/PDB/variables-locations.test (1878 of 2145)
PASS: lldb-unit :: Utility/./UtilityTests/OptionsWithRawTest.EmptyArgsOnlySuffix (1879 of 2145)
PASS: lldb-unit :: Utility/./UtilityTests/RangeTest.SlideZero (1880 of 2145)
PASS: lldb-api :: macosx/version_zero/TestGetVersionZeroVersion.py (1881 of 2145)
PASS: lldb-unit :: ObjectFile/Breakpad/./ObjectFileBreakpadTests/FuncRecord.parse (1882 of 2145)
PASS: lldb-unit :: Target/./TargetTests/ExecutionContextTest.GetByteOrder (1883 of 2145)
PASS: lldb-api :: functionalities/thread/concurrent_events/TestConcurrentTwoWatchpointsOneDelayBreakpoint.py (1884 of 2145)
PASS: lldb-unit :: Host/./HostTests/FileSystemTest.GetPermissions (1885 of 2145)
PASS: lldb-shell :: Reproducer/TestReuseDirectory.test (1886 of 2145)
PASS: lldb-api :: lang/objc/modules-app-update/TestClangModulesAppUpdate.py (1887 of 2145)
PASS: lldb-api :: functionalities/gdb_remote_client/TestQemuAArch64TargetXml.py (1888 of 2145)
PASS: lldb-unit :: Expression/./ExpressionTests/DiagnosticManagerTest.AppendMessageAttachToLastDiag (1889 of 2145)
PASS: lldb-unit :: UnwindAssembly/x86/./UnwindAssemblyx86Tests/Testx86AssemblyInspectionEngine.Test64bitFramelessSmallStackFrame (1890 of 2145)
PASS: lldb-api :: lang/c/step_over_no_deadlock/TestStepOverDoesntBlock.py (1891 of 2145)
PASS: lldb-shell :: SymbolFile/DWARF/module-ownership.mm (1892 of 2145)
PASS: lldb-api :: functionalities/breakpoint/breakpoint_by_file_colon_line/TestBreakpointByFileColonLine.py (1893 of 2145)
PASS: lldb-unit :: Symbol/./SymbolTests/TestTypeSystemClang.TestBuiltinTypeForEncodingAndBitSize (1894 of 2145)
PASS: lldb-unit :: Utility/./UtilityTests/UUIDTest.StringConverion (1895 of 2145)
PASS: lldb-unit :: SymbolFile/NativePDB/./SymbolFileNativePDBTests/PDBFPOProgramToDWARFExpressionTests.MissingTargetRegister (1896 of 2145)
PASS: lldb-shell :: SymbolFile/DWARF/debug_line-relative_path.s (1897 of 2145)
PASS: lldb-api :: functionalities/thread/step_out/TestThreadStepOut.py (1898 of 2145)
PASS: lldb-unit :: Language/Highlighting/./HighlighterTests/HighlighterTest.HighlighterSelectionType (1899 of 2145)
PASS: lldb-unit :: Utility/./UtilityTests/ArgsTest.AppendArguments (1900 of 2145)
PASS: lldb-unit :: Symbol/./SymbolTests/TestTypeSystemClang.TestGetBasicTypeFromName (1901 of 2145)
PASS: lldb-unit :: UnwindAssembly/ARM64/./Arm64InstEmulationTests/TestArm64InstEmulation.TestCFARegisterTrackedAcrossJumps (1902 of 2145)
PASS: lldb-api :: commands/expression/scoped_enums/TestScopedEnumType.py (1903 of 2145)
PASS: lldb-api :: commands/expression/import-std-module/deque-basic/TestDequeFromStdModule.py (1904 of 2145)
PASS: lldb-shell :: SymbolFile/DWARF/deterministic-build.cpp (1905 of 2145)
PASS: lldb-unit :: Utility/./UtilityTests/StreamTest.AddressRange (1906 of 2145)
PASS: lldb-shell :: SymbolFile/DWARF/dwp.s (1907 of 2145)
PASS: lldb-shell :: Unwind/eh-frame-dwarf-unwind.test (1908 of 2145)
PASS: lldb-api :: functionalities/data-formatter/data-formatter-stl/libcxx/list/loop/TestDataFormatterLibcxxListLoop.py (1909 of 2145)
PASS: lldb-api :: functionalities/data-formatter/data-formatter-synthval/TestDataFormatterSynthVal.py (1910 of 2145)
PASS: lldb-unit :: Utility/./UtilityTests/StreamTest.AddressRangeEmptyRange (1911 of 2145)
PASS: lldb-api :: functionalities/thread/concurrent_events/TestConcurrentTwoBreakpointsOneWatchpoint.py (1912 of 2145)
UNSUPPORTED: lldb-api :: lang/objc/objc-dynamic-value/TestObjCDynamicValue.py (1913 of 2145)
PASS: lldb-api :: functionalities/data-formatter/array_typedef/TestArrayTypedef.py (1914 of 2145)
PASS: lldb-api :: lang/c/const_variables/TestConstVariables.py (1915 of 2145)
PASS: lldb-api :: functionalities/load_unload/TestLoadUnload.py (1916 of 2145)
PASS: lldb-api :: lang/objc/objc-new-syntax/TestObjCNewSyntaxLiteral.py (1917 of 2145)
PASS: lldb-api :: python_api/sbstructureddata/TestStructuredDataAPI.py (1918 of 2145)
PASS: lldb-unit :: Utility/./UtilityTests/SubsystemRAIITest.SubsystemWithErrorFailure (1919 of 2145)
PASS: lldb-shell :: Commands/command-regex-unalias.test (1920 of 2145)
PASS: lldb-unit :: Process/gdb-remote/./ProcessGdbRemoteTests/GDBRemoteCommunicationClientTest.SendGetMetaDataPacket (1921 of 2145)
UNSUPPORTED: lldb-api :: functionalities/breakpoint/hardware_breakpoints/hardware_breakpoint_on_multiple_threads/TestHWBreakMultiThread.py (1922 of 2145)
PASS: lldb-shell :: SymbolFile/NativePDB/function-types-builtins.cpp (1923 of 2145)
PASS: lldb-unit :: Utility/./UtilityTests/BinaryStreamTest.PutSLEB128SevenBytes (1924 of 2145)
PASS: lldb-unit :: ObjectFile/Breakpad/./ObjectFileBreakpadTests/ModuleRecord.parse (1925 of 2145)
PASS: lldb-shell :: SymbolFile/NativePDB/s_constant.cpp (1926 of 2145)
PASS: lldb-unit :: Disassembler/./DisassemblerTests/TestArmv7Disassembly.TestCortexFPDisass (1927 of 2145)
PASS: lldb-unit :: Host/./HostTests/NativeProcessProtocolTest.ReadCStringFromMemory_MaxSize (1928 of 2145)
PASS: lldb-unit :: SymbolFile/DWARF/./SymbolFileDWARFTests/DWARFASTParserClangTests.EnsureAllDIEsInDeclContextHaveBeenParsedParsesOnlyMatchingEntries (1929 of 2145)
PASS: lldb-unit :: SymbolFile/NativePDB/./SymbolFileNativePDBTests/PDBFPOProgramToDWARFExpressionTests.UnresolvedRegisterReference (1930 of 2145)
PASS: lldb-api :: python_api/value/linked_list/TestValueAPILinkedList.py (1931 of 2145)
UNSUPPORTED: lldb-api :: functionalities/tty/TestTerminal.py (1932 of 2145)
PASS: lldb-shell :: Minidump/dump-all.test (1933 of 2145)
PASS: lldb-unit :: Language/Highlighting/./HighlighterTests/HighlighterTest.ClangSquareBrackets (1934 of 2145)
PASS: lldb-api :: commands/expression/radar_9531204/TestPrintfAfterUp.py (1935 of 2145)
PASS: lldb-shell :: SymbolFile/DWARF/dir-separator-no-comp-dir-relative-name.s (1936 of 2145)
PASS: lldb-unit :: Expression/./ExpressionTests/CppModuleConfigurationTest.MissingLibCpp (1937 of 2145)
PASS: lldb-shell :: Commands/command-breakpoint-col.test (1938 of 2145)
PASS: lldb-api :: functionalities/postmortem/minidump-new/TestMiniDumpUUID.py (1939 of 2145)
PASS: lldb-api :: commands/expression/static-initializers/TestStaticInitializers.py (1940 of 2145)
PASS: lldb-api :: commands/expression/top-level/TestTopLevelExprs.py (1941 of 2145)
UNSUPPORTED: lldb-shell :: ScriptInterpreter/Lua/bindings.test (1942 of 2145)
UNSUPPORTED: lldb-shell :: SymbolFile/PDB/variables.test (1943 of 2145)
PASS: lldb-api :: iohandler/autosuggestion/TestAutosuggestion.py (1944 of 2145)
PASS: lldb-api :: lang/cpp/enum_types/TestCPP11EnumTypes.py (1945 of 2145)
PASS: lldb-unit :: ScriptInterpreter/Python/./ScriptInterpreterPythonTests/PythonDataObjectsTest.TestCallable (1946 of 2145)
PASS: lldb-unit :: Expression/./ExpressionTests/DiagnosticManagerTest.AppendMessageSubsequentDiags (1947 of 2145)
PASS: lldb-api :: functionalities/postmortem/elf-core/thread_crash/TestLinuxCoreThreads.py (1948 of 2145)
PASS: lldb-api :: python_api/value/TestValueAPI.py (1949 of 2145)
PASS: lldb-api :: lang/objc/print-obj/TestPrintObj.py (1950 of 2145)
UNSUPPORTED: lldb-api :: commands/register/register/intel_xtended_registers/mpx_offset_intersection/TestMPXOffsetIntersection.py (1951 of 2145)
PASS: lldb-shell :: ObjectFile/ELF/short-build-id.yaml (1952 of 2145)
PASS: lldb-unit :: Utility/./UtilityTests/VMRange.Reset (1953 of 2145)
PASS: lldb-shell :: SymbolFile/DWARF/debug-types-dwo-cross-reference.cpp (1954 of 2145)
PASS: lldb-api :: lang/cpp/this_class_type_mixing/TestThisClassTypeMixing.py (1955 of 2145)
PASS: lldb-unit :: ScriptInterpreter/Python/./ScriptInterpreterPythonTests/PythonDataObjectsTest.TestPythonTupleInitializerList (1956 of 2145)
PASS: lldb-api :: python_api/formatters/TestFormattersSBAPI.py (1957 of 2145)
PASS: lldb-api :: functionalities/thread/concurrent_events/TestConcurrentBreakpointDelayBreakpointOneSignal.py (1958 of 2145)
PASS: lldb-api :: functionalities/thread/concurrent_events/TestConcurrentSignalBreak.py (1959 of 2145)
PASS: lldb-unit :: Utility/./UtilityTests/UriParserTest.BracketedHostnamePort (1960 of 2145)
PASS: lldb-api :: commands/quit/TestQuit.py (1961 of 2145)
PASS: lldb-api :: lang/cpp/alignas_base_class/TestAlignAsBaseClass.py (1962 of 2145)
PASS: lldb-api :: commands/expression/test/TestExprs2.py (1963 of 2145)
PASS: lldb-unit :: Utility/./UtilityTests/VMRange.SetEndAddress (1964 of 2145)
PASS: lldb-unit :: Utility/./UtilityTests/TimerTest.CategoryTimesStats (1965 of 2145)
PASS: lldb-unit :: Utility/./UtilityTests/StreamTest.PutStringAsRawHex8 (1966 of 2145)
PASS: lldb-api :: lang/cpp/type_lookup/TestCppTypeLookup.py (1967 of 2145)
PASS: lldb-api :: python_api/debugger/TestDebuggerAPI.py (1968 of 2145)
PASS: lldb-shell :: Breakpoint/case-sensitive.test (1969 of 2145)
PASS: lldb-shell :: SymbolFile/DWARF/DW_OP_piece-struct.s (1970 of 2145)
PASS: lldb-api :: functionalities/data-formatter/data-formatter-objc/nsstring/TestDataFormatterNSString.py (1971 of 2145)
UNSUPPORTED: lldb-api :: commands/watchpoints/hello_watchlocation/TestWatchLocation.py (1972 of 2145)
PASS: lldb-api :: tools/lldb-server/TestGdbRemote_vCont.py (1973 of 2145)
PASS: lldb-unit :: Utility/./UtilityTests/ProcessInstanceInfo.Yaml (1974 of 2145)
PASS: lldb-unit :: Utility/./UtilityTests/SubsystemRAIITest.NormalSubsystem (1975 of 2145)
PASS: lldb-api :: python_api/exprpath_synthetic/TestExprPathSynthetic.py (1976 of 2145)
PASS: lldb-unit :: Utility/./UtilityTests/StreamTest.QuotedCString (1977 of 2145)
PASS: lldb-unit :: Utility/./UtilityTests/BinaryStreamTest.PutULEB128ThreeBytes (1978 of 2145)
PASS: lldb-unit :: DataFormatter/./LLDBFormatterTests/TypeMatcherTests.RegexMatchPart (1979 of 2145)
PASS: lldb-unit :: Utility/./UtilityTests/BinaryStreamTest.PutULEB128TwoBytes (1980 of 2145)
PASS: lldb-unit :: Utility/./UtilityTests/TimerTest.CategoryTimes2 (1981 of 2145)
UNSUPPORTED: lldb-api :: functionalities/darwin_log/filter/exact_match/activity/TestDarwinLogFilterMatchActivity.py (1982 of 2145)
UNSUPPORTED: lldb-api :: functionalities/data-formatter/data-formatter-stl/libstdcpp/iterator/TestDataFormatterStdIterator.py (1983 of 2145)
PASS: lldb-unit :: Utility/./UtilityTests/StringExtractorTest.GetHexBytes_FullString (1984 of 2145)
PASS: lldb-unit :: Utility/./UtilityTests/ArgsTest.ReplaceArgumentAtIndexFarOutOfRange (1985 of 2145)
PASS: lldb-api :: functionalities/data-formatter/data-formatter-objc/TestDataFormatterObjCPlain.py (1986 of 2145)
PASS: lldb-unit :: Utility/./UtilityTests/StreamTeeTest.GetStreamAtIndexOutOfBounds (1987 of 2145)
PASS: lldb-unit :: Utility/./UtilityTests/OptionsWithRawTest.EmptySuffix (1988 of 2145)
PASS: lldb-unit :: Language/Highlighting/./HighlighterTests/HighlighterTest.ClangScalarLiterals (1989 of 2145)
PASS: lldb-api :: functionalities/thread/concurrent_events/TestConcurrentBreakpointsDelayedBreakpointOneWatchpoint.py (1990 of 2145)
PASS: lldb-unit :: Utility/./UtilityTests/RecordReplayTest.InstrumentedBar (1991 of 2145)
PASS: lldb-shell :: SymbolFile/DWARF/inline-function-address-shared.test (1992 of 2145)
PASS: lldb-api :: lang/objc/objc-foundation-dictionary-empty/TestNSDictionary0.py (1993 of 2145)
PASS: lldb-api :: commands/session/save/TestSessionSave.py (1994 of 2145)
PASS: lldb-unit :: Utility/./UtilityTests/StreamTeeTest.Assignment (1995 of 2145)
PASS: lldb-unit :: Process/minidump/./LLDBMinidumpTests/MinidumpParserTest.MinidumpDuplicateModuleMinAddress (1996 of 2145)
PASS: lldb-unit :: Utility/./UtilityTests/LogChannelEnabledTest.LogGetLogThread (1997 of 2145)
PASS: lldb-unit :: Utility/./UtilityTests/UriParserTest.PortOverflow (1998 of 2145)
PASS: lldb-api :: commands/expression/formatters/TestFormatters.py (1999 of 2145)
PASS: lldb-unit :: Target/./TargetTests/ModuleCacheTest.GetAndPutUuidExists (2000 of 2145)
PASS: lldb-unit :: Utility/./UtilityTests/StreamTest.AddressEmptyPrefix (2001 of 2145)
PASS: lldb-unit :: Utility/./UtilityTests/RangeTest.DefaultConstructor (2002 of 2145)
PASS: lldb-unit :: Utility/./UtilityTests/ReproducerTest.SetCapture (2003 of 2145)
PASS: lldb-unit :: Utility/./UtilityTests/DataExtractorTest.GetCStr (2004 of 2145)
PASS: lldb-unit :: Utility/./UtilityTests/StreamTest.ChangingByteOrder (2005 of 2145)
PASS: lldb-api :: commands/target/create-deps/TestTargetCreateDeps.py (2006 of 2145)
PASS: lldb-api :: functionalities/thread/concurrent_events/TestConcurrentSignalWatchBreak.py (2007 of 2145)
PASS: lldb-api :: python_api/thread/TestThreadAPI.py (2008 of 2145)
PASS: lldb-unit :: Utility/./UtilityTests/StringListTest.SetSize (2009 of 2145)
PASS: lldb-api :: functionalities/abbreviation/TestCommonShortSpellings.py (2010 of 2145)
PASS: lldb-api :: functionalities/thread/jump/TestThreadJump.py (2011 of 2145)
PASS: lldb-api :: lang/objc/objc-new-syntax/TestObjCNewSyntaxDictionary.py (2012 of 2145)
UNSUPPORTED: lldb-api :: functionalities/data-formatter/data-formatter-stl/libstdcpp/smart_ptr/TestDataFormatterStdSmartPtr.py (2013 of 2145)
PASS: lldb-api :: lang/cpp/namespace_conflicts/TestNamespaceConflicts.py (2014 of 2145)
PASS: lldb-api :: commands/expression/import_base_class_when_class_has_derived_member/TestImportBaseClassWhenClassHasDerivedMember.py (2015 of 2145)
PASS: lldb-api :: functionalities/asan/TestMemoryHistory.py (2016 of 2145)
PASS: lldb-unit :: Process/minidump/./LLDBMinidumpTests/MinidumpParserTest.GetLinuxProcStatus_no_stream (2017 of 2145)
PASS: lldb-unit :: Utility/./UtilityTests/StreamTeeTest.AppendStream (2018 of 2145)
PASS: lldb-unit :: UnwindAssembly/x86/./UnwindAssemblyx86Tests/Testx86AssemblyInspectionEngine.TestStackRealignMSVC_i386 (2019 of 2145)
PASS: lldb-api :: commands/frame/recognizer/TestFrameRecognizer.py (2020 of 2145)
PASS: lldb-unit :: Utility/./UtilityTests/RangeTest.LessThanInvalid (2021 of 2145)
PASS: lldb-api :: commands/expression/multiline-navigation/TestMultilineNavigation.py (2022 of 2145)
PASS: lldb-unit :: Language/Highlighting/./HighlighterTests/HighlighterTest.ClangEmptyInput (2023 of 2145)
PASS: lldb-unit :: Symbol/./SymbolTests/TestClangASTImporter.DeportDeclTagDecl (2024 of 2145)
PASS: lldb-unit :: ScriptInterpreter/Python/./ScriptInterpreterPythonTests/PythonDataObjectsTest.TestModuleNameResolutionNoDot (2025 of 2145)
PASS: lldb-api :: functionalities/recursion/TestValueObjectRecursion.py (2026 of 2145)
PASS: lldb-unit :: Utility/./UtilityTests/StringListTest.JoinThree (2027 of 2145)
UNSUPPORTED: lldb-shell :: Unwind/unwind-plan-dwarf-dump.test (2028 of 2145)
PASS: lldb-api :: functionalities/thread/concurrent_events/TestConcurrentWatchpointDelayWatchpointOneBreakpoint.py (2029 of 2145)
PASS: lldb-api :: functionalities/optimized_code/TestNoASanExceptionAfterEvalOP_piece.py (2030 of 2145)
PASS: lldb-unit :: Utility/./UtilityTests/OptionsWithRawTest.UnterminatedQuote (2031 of 2145)
PASS: lldb-unit :: Utility/./UtilityTests/StringListTest.AppendStringCString (2032 of 2145)
PASS: lldb-unit :: Utility/./UtilityTests/OptionsWithRawTest.WhitespaceInput (2033 of 2145)
PASS: lldb-api :: functionalities/breakpoint/breakpoint_command/TestBreakpointCommandsFromPython.py (2034 of 2145)
PASS: lldb-api :: lang/objc/objc-struct-return/TestObjCStructReturn.py (2035 of 2145)
PASS: lldb-unit :: DataFormatter/./LLDBFormatterTests/TypeMatcherTests.GetMatchStringExactName (2036 of 2145)
PASS: lldb-unit :: Host/./HostTests/SocketAddressTest.GetAddressInfo (2037 of 2145)
PASS: lldb-unit :: Utility/./UtilityTests/FileSpecTest.GetPath (2038 of 2145)
PASS: lldb-shell :: Commands/command-source.test (2039 of 2145)
PASS: lldb-unit :: SymbolFile/NativePDB/./SymbolFileNativePDBTests/PDBFPOProgramToDWARFExpressionTests.SingleAssignmentRegisterRef (2040 of 2145)
PASS: lldb-unit :: ScriptInterpreter/Python/./ScriptInterpreterPythonTests/PythonDataObjectsTest.TestBorrowedReferences (2041 of 2145)
PASS: lldb-unit :: Process/minidump/./LLDBMinidumpTests/MinidumpParserTest.GetArchitecture (2042 of 2145)
PASS: lldb-unit :: Utility/./UtilityTests/StreamTest.AddressSize (2043 of 2145)
PASS: lldb-shell :: Minidump/memory-region-from-module.yaml (2044 of 2145)
PASS: lldb-api :: commands/expression/fixits/TestFixIts.py (2045 of 2145)
PASS: lldb-api :: lang/cpp/function_refs/TestFunctionRefs.py (2046 of 2145)
PASS: lldb-api :: lang/c/offsetof/TestOffsetof.py (2047 of 2145)
PASS: lldb-unit :: tools/lldb-server/tests/./LLDBServerTests/TestBase.DebugserverEnv (2048 of 2145)
PASS: lldb-unit :: Utility/./UtilityTests/RangeTest.Union (2049 of 2145)
PASS: lldb-unit :: Utility/./UtilityTests/ConstStringTest.CompareStringRef (2050 of 2145)
PASS: lldb-unit :: DataFormatter/./LLDBFormatterTests/TypeMatcherTests.CreatedBySameMatchStringExactNamePrefixes (2051 of 2145)
PASS: lldb-unit :: Utility/./UtilityTests/VMRange.Clear (2052 of 2145)
PASS: lldb-api :: types/TestLongTypesExpr.py (2053 of 2145)
PASS: lldb-api :: lang/objc/radar-9691614/TestObjCMethodReturningBOOL.py (2054 of 2145)
PASS: lldb-api :: functionalities/load_using_paths/TestLoadUsingPaths.py (2055 of 2145)
PASS: lldb-api :: functionalities/data-formatter/data-formatter-stl/libcxx/map/TestDataFormatterLibccMap.py (2056 of 2145)
PASS: lldb-api :: commands/settings/quoting/TestQuoting.py (2057 of 2145)
PASS: lldb-api :: tools/lldb-vscode/breakpoint/TestVSCode_setExceptionBreakpoints.py (2058 of 2145)
PASS: lldb-api :: lang/objcxx/objcxx-ivar-vector/TestIvarVector.py (2059 of 2145)
PASS: lldb-unit :: Utility/./UtilityTests/LogChannelTest.List (2060 of 2145)
PASS: lldb-api :: lang/objc/bitfield_ivars/TestBitfieldIvars.py (2061 of 2145)
PASS: lldb-unit :: Utility/./UtilityTests/StringExtractorTest.DecodeHexU8_InvalidHex (2062 of 2145)
FAIL: lldb-api :: commands/expression/persist_objc_pointeetype/TestPersistObjCPointeeType.py (2063 of 2145)
******************** TEST 'lldb-api :: commands/expression/persist_objc_pointeetype/TestPersistObjCPointeeType.py' FAILED ********************
Script:
--
/usr/local/Frameworks/Python.framework/Versions/3.7/bin/python3.7 /Users/buildslave/jenkins/workspace/lldb-cmake/llvm-project/lldb/test/API/dotest.py -s /Users/buildslave/jenkins/workspace/lldb-cmake/lldb-build/lldb-test-traces -S nm -u CXXFLAGS -u CFLAGS --codesign-identity - --server /Users/buildslave/jenkins/workspace/lldb-cmake/lldb-build/./bin/debugserver --arch x86_64 --build-dir /Users/buildslave/jenkins/workspace/lldb-cmake/lldb-build/lldb-test-build.noindex -s=/Users/buildslave/jenkins/workspace/lldb-cmake/test/logs -t --env TERM=vt100 --env LLVM_LIBS_DIR=/Users/buildslave/jenkins/workspace/lldb-cmake/lldb-build/./lib --arch x86_64 --build-dir /Users/buildslave/jenkins/workspace/lldb-cmake/lldb-build/lldb-test-build.noindex --lldb-module-cache-dir /Users/buildslave/jenkins/workspace/lldb-cmake/lldb-build/lldb-test-build.noindex/module-cache-lldb/lldb-api --clang-module-cache-dir /Users/buildslave/jenkins/workspace/lldb-cmake/lldb-build/lldb-test-build.noindex/module-cache-clang/lldb-api --executable /Users/buildslave/jenkins/workspace/lldb-cmake/lldb-build/./bin/lldb --compiler /Users/buildslave/jenkins/workspace/lldb-cmake/lldb-build/./bin/clang --dsymutil /Users/buildslave/jenkins/workspace/lldb-cmake/lldb-build/./bin/dsymutil --filecheck /Users/buildslave/jenkins/workspace/lldb-cmake/lldb-build/./bin/FileCheck --yaml2obj /Users/buildslave/jenkins/workspace/lldb-cmake/lldb-build/./bin/yaml2obj --lldb-libs-dir /Users/buildslave/jenkins/workspace/lldb-cmake/lldb-build/./lib /Users/buildslave/jenkins/workspace/lldb-cmake/llvm-project/lldb/test/API/commands/expression/persist_objc_pointeetype -p TestPersistObjCPointeeType.py
--
Exit Code: 1

Hide Details

Command Output (stdout): -- lldb version 12.0.99 clang revision b76f523be6ea606d9cf494e247546cec1cd7f209 llvm revision b76f523be6ea606d9cf494e247546cec1cd7f209 libstdcxx tests will not be run because: Don't know how to build with libstdcxx on macosx Skipping following debug info categories: ['dwo']

Hide Details

-- Command Output (stderr): --

Hide Details

Session logs for test failures/errors/unexpected successes will go into directory '/Users/buildslave/jenkins/workspace/lldb-cmake/test/logs' Change dir to: /Users/buildslave/jenkins/workspace/lldb-cmake/llvm-project/lldb/test/API/commands/expression/persist_objc_pointeetype runCmd: settings clear -all output:

Hide Details

runCmd: settings set symbols.enable-external-lookup false output:

Hide Details

runCmd: settings set target.inherit-tcc true output:

Hide Details

runCmd: settings set target.auto-apply-fixits false output:

Hide Details

runCmd: settings set plugin.process.gdb-remote.packet-timeout 60 output:

Hide Details

runCmd: settings set symbols.clang-modules-cache-path "/Users/buildslave/jenkins/workspace/lldb-cmake/lldb-build/lldb-test-build.noindex/module-cache-lldb/lldb-api" output:

Hide Details

runCmd: settings set use-color false output:

Hide Details

runCmd: setting set target.prefer-dynamic-value no-dynamic-values output:

Hide Details

Adding tearDown hook: def cleanup(): pass

Hide Details

Hide Details

runCmd: file /Users/buildslave/jenkins/workspace/lldb-cmake/lldb-build/lldb-test-build.noindex/commands/expression/persist_objc_pointeetype/TestPersistObjCPointeeType.test_with_dsym/a.out output: Current executable set to '/Users/buildslave/jenkins/workspace/lldb-cmake/lldb-build/lldb-test-build.noindex/commands/expression/persist_objc_pointeetype/TestPersistObjCPointeeType.test_with_dsym/a.out' (x86_64).

Hide Details

Hide Details

runCmd: breakpoint set -f "main.m" -l 42 output: Breakpoint 1: where = a.out`-[SubClass initThatDoesNotAssert] + 560 at main.m:42:5, address = 0x0000000100001510

Hide Details

Hide Details

Expecting pattern: ^Breakpoint (?P<bpno>[0-9]+): (?P<num_locations>[0-9]+) locations\.$ Not matched

Hide Details

Expecting pattern: ^Breakpoint (?P<bpno>[0-9]+): (?P<num_locations>no) locations \(pending\)\. Not matched

Hide Details

Expecting pattern: ^Breakpoint (?P<bpno>[0-9]+): where = (?P<module>.*)`(?P<symbol>[+\-]{0,1}[^+]+)( \+ (?P<offset>[0-9]+)){0,1}( \[inlined\] (?P<inline_symbol>.*)){0,1} at (?P<file>[^:]+):(?P<line_no>[0-9]+)(?P<column>(:[0-9]+)?), address = (?P<address>0x[0-9a-fA-F]+)$ Matched

Hide Details

runCmd: run output: Process 71376 stopped * thread #1, queue = 'com.apple.main-thread', stop reason = breakpoint 1.1 frame #0: 0x0000000100001510 a.out`-[SubClass initThatDoesNotAssert](self=0x0000000100407b80, _cmd="initThatDoesNotAssert") at main.m:42:5 39 assert(_sc_name5 == nil); 40 assert(_sc_name6 == nil); 41 assert(_sc_name7 == nil); -> 42 assert(_sc_name8 == nil); // break here ^ 43 44 if ((self = [super _initWithContainer:(CKContainer*)@"foo" scope:0xff])) { 45 assert(_sc_name == nil);

Hide Details

Process 71376 launched: '/Users/buildslave/jenkins/workspace/lldb-cmake/lldb-build/lldb-test-build.noindex/commands/expression/persist_objc_pointeetype/TestPersistObjCPointeeType.test_with_dsym/a.out' (x86_64)

Hide Details

Hide Details

runCmd: p *self output: (SubClass) $0 = { CKDatabase = { NSObject = { isa = SubClass } } _sc_name = nil _sc_name2 = nil _sc_name3 = nil _sc_name4 = nil _sc_name5 = nil _sc_name6 = nil _sc_name7 = nil _sc_name8 = nil }

Hide Details

Hide Details

Ran command: "p *self"

Hide Details

Got output: (SubClass) $0 = { CKDatabase = { NSObject = { isa = SubClass } } _sc_name = nil _sc_name2 = nil _sc_name3 = nil _sc_name4 = nil _sc_name5 = nil _sc_name6 = nil _sc_name7 = nil _sc_name8 = nil }

Hide Details

Expecting sub string: "_sc_name = nil" (was found) Expecting sub string: "_sc_name2 = nil" (was found) Expecting sub string: "_sc_name3 = nil" (was found) Expecting sub string: "_sc_name4 = nil" (was found) Expecting sub string: "_sc_name5 = nil" (was found) Expecting sub string: "_sc_name6 = nil" (was found) Expecting sub string: "_sc_name7 = nil" (was found) Expecting sub string: "_sc_name8 = nil" (was found)

Hide Details

<bound method SBProcess.Kill of <lldb.SBProcess; proxy of <Swig Object of type 'lldb::SBProcess *' at 0x10323b360> >>: success

Hide Details

Executing tearDown hook: def cleanup(): pass

Hide Details

Hide Details

PASS: LLDB (/Users/buildslave/jenkins/workspace/lldb-cmake/lldb-build/bin/clang-x86_64) :: test_with_dsym (TestPersistObjCPointeeType.PersistObjCPointeeType) runCmd: settings clear -all output:

Hide Details

runCmd: settings set symbols.enable-external-lookup false output:

Hide Details

runCmd: settings set target.inherit-tcc true output:

Hide Details

runCmd: settings set target.auto-apply-fixits false output:

Hide Details

runCmd: settings set plugin.process.gdb-remote.packet-timeout 60 output:

Hide Details

runCmd: settings set symbols.clang-modules-cache-path "/Users/buildslave/jenkins/workspace/lldb-cmake/lldb-build/lldb-test-build.noindex/module-cache-lldb/lldb-api" output:

Hide Details

runCmd: settings set use-color false output:

Hide Details

runCmd: setting set target.prefer-dynamic-value no-dynamic-values output:

Hide Details

Adding tearDown hook: def cleanup(): pass

Hide Details

Hide Details

runCmd: file /Users/buildslave/jenkins/workspace/lldb-cmake/lldb-build/lldb-test-build.noindex/commands/expression/persist_objc_pointeetype/TestPersistObjCPointeeType.test_with_dwarf/a.out output: Current executable set to '/Users/buildslave/jenkins/workspace/lldb-cmake/lldb-build/lldb-test-build.noindex/commands/expression/persist_objc_pointeetype/TestPersistObjCPointeeType.test_with_dwarf/a.out' (x86_64).

Hide Details

Hide Details

runCmd: breakpoint set -f "main.m" -l 42 output: Breakpoint 1: where = a.out`-[SubClass initThatDoesNotAssert] + 560 at main.m:42:5, address = 0x0000000100001510

Hide Details

Hide Details

Expecting pattern: ^Breakpoint (?P<bpno>[0-9]+): (?P<num_locations>[0-9]+) locations\.$ Not matched

Hide Details

Expecting pattern: ^Breakpoint (?P<bpno>[0-9]+): (?P<num_locations>no) locations \(pending\)\. Not matched

Hide Details

Expecting pattern: ^Breakpoint (?P<bpno>[0-9]+): where = (?P<module>.*)`(?P<symbol>[+\-]{0,1}[^+]+)( \+ (?P<offset>[0-9]+)){0,1}( \[inlined\] (?P<inline_symbol>.*)){0,1} at (?P<file>[^:]+):(?P<line_no>[0-9]+)(?P<column>(:[0-9]+)?), address = (?P<address>0x[0-9a-fA-F]+)$ Matched

Hide Details

runCmd: run runCmd failed! error: process exited with status -1 (tried to attach to process already being debugged)

Hide Details

Hide Details

Command 'run' failed!

Hide Details

FAIL: LLDB (/Users/buildslave/jenkins/workspace/lldb-cmake/lldb-build/bin/clang-x86_64) :: test_with_dwarf (TestPersistObjCPointeeType.PersistObjCPointeeType) <bound method SBProcess.Kill of <lldb.SBProcess; proxy of <Swig Object of type 'lldb::SBProcess *' at 0x103018120> >>: success

Hide Details

Executing tearDown hook: def cleanup(): pass

Hide Details

Hide Details

UNSUPPORTED: LLDB (/Users/buildslave/jenkins/workspace/lldb-cmake/lldb-build/bin/clang-x86_64) :: test_with_dwo (TestPersistObjCPointeeType.PersistObjCPointeeType) (test case does not fall in any category of interest for this run) runCmd: settings clear -all output:

Hide Details

runCmd: settings set symbols.enable-external-lookup false output:

Hide Details

runCmd: settings set target.inherit-tcc true output:

Hide Details

runCmd: settings set target.auto-apply-fixits false output:

Hide Details

runCmd: settings set plugin.process.gdb-remote.packet-timeout 60 output:

Hide Details

runCmd: settings set symbols.clang-modules-cache-path "/Users/buildslave/jenkins/workspace/lldb-cmake/lldb-build/lldb-test-build.noindex/module-cache-lldb/lldb-api" output:

Hide Details

runCmd: settings set use-color false output:

Hide Details

runCmd: setting set target.prefer-dynamic-value no-dynamic-values output:

Hide Details

Adding tearDown hook: def cleanup(): pass

Hide Details

Hide Details

runCmd: file /Users/buildslave/jenkins/workspace/lldb-cmake/lldb-build/lldb-test-build.noindex/commands/expression/persist_objc_pointeetype/TestPersistObjCPointeeType.test_with_gmodules/a.out output: Current executable set to '/Users/buildslave/jenkins/workspace/lldb-cmake/lldb-build/lldb-test-build.noindex/commands/expression/persist_objc_pointeetype/TestPersistObjCPointeeType.test_with_gmodules/a.out' (x86_64).

Hide Details

Hide Details

runCmd: breakpoint set -f "main.m" -l 42 output: Breakpoint 1: where = a.out`-[SubClass initThatDoesNotAssert] + 560 at main.m:42:5, address = 0x0000000100001510

Hide Details

Hide Details

Expecting pattern: ^Breakpoint (?P<bpno>[0-9]+): (?P<num_locations>[0-9]+) locations\.$ Not matched

Hide Details

Expecting pattern: ^Breakpoint (?P<bpno>[0-9]+): (?P<num_locations>no) locations \(pending\)\. Not matched

Hide Details

Expecting pattern: ^Breakpoint (?P<bpno>[0-9]+): where = (?P<module>.*)`(?P<symbol>[+\-]{0,1}[^+]+)( \+ (?P<offset>[0-9]+)){0,1}( \[inlined\] (?P<inline_symbol>.*)){0,1} at (?P<file>[^:]+):(?P<line_no>[0-9]+)(?P<column>(:[0-9]+)?), address = (?P<address>0x[0-9a-fA-F]+)$ Matched

Hide Details

runCmd: run output: Process 72128 stopped * thread #1, queue = 'com.apple.main-thread', stop reason = breakpoint 1.1 frame #0: 0x0000000100001510 a.out`-[SubClass initThatDoesNotAssert](self=0x0000000100307e20, _cmd="initThatDoesNotAssert") at main.m:42:5 39 assert(_sc_name5 == nil); 40 assert(_sc_name6 == nil); 41 assert(_sc_name7 == nil); -> 42 assert(_sc_name8 == nil); // break here ^ 43 44 if ((self = [super _initWithContainer:(CKContainer*)@"foo" scope:0xff])) { 45 assert(_sc_name == nil);

Hide Details

Process 72128 launched: '/Users/buildslave/jenkins/workspace/lldb-cmake/lldb-build/lldb-test-build.noindex/commands/expression/persist_objc_pointeetype/TestPersistObjCPointeeType.test_with_gmodules/a.out' (x86_64)

Hide Details

Hide Details

runCmd: p *self output: (SubClass) $0 = { CKDatabase = { NSObject = { isa = SubClass } } _sc_name = nil _sc_name2 = nil _sc_name3 = nil _sc_name4 = nil _sc_name5 = nil _sc_name6 = nil _sc_name7 = nil _sc_name8 = nil }

Hide Details

Hide Details

Ran command: "p *self"

Hide Details

Got output: (SubClass) $0 = { CKDatabase = { NSObject = { isa = SubClass } } _sc_name = nil _sc_name2 = nil _sc_name3 = nil _sc_name4 = nil _sc_name5 = nil _sc_name6 = nil _sc_name7 = nil _sc_name8 = nil }

Hide Details

Expecting sub string: "_sc_name = nil" (was found) Expecting sub string: "_sc_name2 = nil" (was found) Expecting sub string: "_sc_name3 = nil" (was found) Expecting sub string: "_sc_name4 = nil" (was found) Expecting sub string: "_sc_name5 = nil" (was found) Expecting sub string: "_sc_name6 = nil" (was found) Expecting sub string: "_sc_name7 = nil" (was found) Expecting sub string: "_sc_name8 = nil" (was found)

Hide Details

<bound method SBProcess.Kill of <lldb.SBProcess; proxy of <Swig Object of type 'lldb::SBProcess *' at 0x103171a80> >>: success

Hide Details

Executing tearDown hook: def cleanup(): pass

Hide Details

Hide Details

PASS: LLDB (/Users/buildslave/jenkins/workspace/lldb-cmake/lldb-build/bin/clang-x86_64) :: test_with_gmodules (TestPersistObjCPointeeType.PersistObjCPointeeType) Restore dir to: /Users/buildslave/jenkins/workspace/lldb-cmake/lldb-build/tools/lldb/test ====================================================================== FAIL: test_with_dwarf (TestPersistObjCPointeeType.PersistObjCPointeeType) Test that we can p *objcObject ---------------------------------------------------------------------- Traceback (most recent call last): File "/Users/buildslave/jenkins/workspace/lldb-cmake/llvm-project/lldb/packages/Python/lldbsuite/test/lldbtest.py", line 1825, in test_method return attrvalue(self) File "/Users/buildslave/jenkins/workspace/lldb-cmake/llvm-project/lldb/packages/Python/lldbsuite/test/decorators.py", line 134, in wrapper return func(*args, **kwargs) File "/Users/buildslave/jenkins/workspace/lldb-cmake/llvm-project/lldb/packages/Python/lldbsuite/test/decorators.py", line 134, in wrapper return func(*args, **kwargs) File "/Users/buildslave/jenkins/workspace/lldb-cmake/llvm-project/lldb/test/API/commands/expression/persist_objc_pointeetype/TestPersistObjCPointeeType.py", line 41, in test_with self.runCmd("run", RUN_SUCCEEDED) File "/Users/buildslave/jenkins/workspace/lldb-cmake/llvm-project/lldb/packages/Python/lldbsuite/test/lldbtest.py", line 2155, in runCmd msg if (msg) else CMD_MSG(cmd)) AssertionError: False is not True : Process is launched successfully Error output: error: process exited with status -1 (tried to attach to process already being debugged)

Hide Details

Config=x86_64-/Users/buildslave/jenkins/workspace/lldb-cmake/lldb-build/bin/clang ---------------------------------------------------------------------- Ran 4 tests in 14.776s

Hide Details

RESULT: FAILED (2 passes, 1 failures, 0 errors, 1 skipped, 0 expected failures, 0 unexpected successes)

Hide Details

--

Hide Details

******************** PASS: lldb-unit :: Utility/./UtilityTests/ArgsTest.TestTrailingBackslash (2064 of 2145) PASS: lldb-unit :: Utility/./UtilityTests/UriParserTest.Minimal (2065 of 2145) PASS: lldb-api :: lang/cpp/operators/TestCppOperators.py (2066 of 2145) PASS: lldb-unit :: UnwindAssembly/x86/./UnwindAssemblyx86Tests/Testx86AssemblyInspectionEngine.TestSpillRegToStackViaMOVx86_64 (2067 of 2145) PASS: lldb-unit :: Utility/./UtilityTests/ScalarTest.Promotion (2068 of 2145) PASS: lldb-unit :: Utility/./UtilityTests/OptionsWithRawTest.ArgsButNoDelimiter (2069 of 2145) PASS: lldb-shell :: BuildScript/compiler-full-path.test (2070 of 2145) PASS: lldb-unit :: Utility/./UtilityTests/AnsiTerminal.AtStart (2071 of 2145) PASS: lldb-shell :: Breakpoint/debug_rnglist_offset_pair.test (2072 of 2145) PASS: lldb-unit :: Utility/./UtilityTests/BinaryStreamTest.PutULEB128SevenBytes (2073 of 2145) PASS: lldb-api :: functionalities/thread/concurrent_events/TestConcurrentDelaySignalBreak.py (2074 of 2145) PASS: lldb-api :: python_api/type/TestTypeList.py (2075 of 2145) PASS: lldb-unit :: SymbolFile/NativePDB/./SymbolFileNativePDBTests/PDBFPOProgramToDWARFExpressionTests.InvalidAssignmentSingle (2076 of 2145) PASS: lldb-api :: lang/cpp/namespace/TestNamespaceLookup.py (2077 of 2145) PASS: lldb-unit :: Utility/./UtilityTests/StringListTest.RemoveBlankLines (2078 of 2145) PASS: lldb-api :: functionalities/data-formatter/frameformat_smallstruct/TestFrameFormatSmallStruct.py (2079 of 2145) PASS: lldb-api :: functionalities/thread/concurrent_events/TestConcurrentTwoWatchpointThreads.py (2080 of 2145) PASS: lldb-unit :: Utility/./UtilityTests/StringExtractorTest.GetHexU8_InvalidHex (2081 of 2145) PASS: lldb-shell :: Register/x86-64-gp-read.test (2082 of 2145) PASS: lldb-api :: functionalities/thread/concurrent_events/TestConcurrentManyCrash.py (2083 of 2145) PASS: lldb-api :: tools/lldb-server/TestLldbGdbServer.py (2084 of 2145) PASS: lldb-api :: types/TestDoubleTypesExpr.py (2085 of 2145) PASS: lldb-unit :: Process/gdb-remote/./ProcessGdbRemoteTests/GDBRemoteClientBaseTest.SendContinueDelegateInterface (2086 of 2145) PASS: lldb-unit :: Utility/./UtilityTests/StringListTest.DefaultConstructor (2087 of 2145) PASS: lldb-unit :: Utility/./UtilityTests/StringListTest.JoinEmpty (2088 of 2145) PASS: lldb-api :: macosx/order/TestOrderFile.py (2089 of 2145) PASS: lldb-shell :: SymbolFile/Breakpad/unwind-via-stack-win.test (2090 of 2145) PASS: lldb-unit :: Symbol/./SymbolTests/TestTypeSystemClang.TestGetTypeClassNested (2091 of 2145) PASS: lldb-unit :: Utility/./UtilityTests/ArchSpecTest.MergeFrom (2092 of 2145) PASS: lldb-unit :: Symbol/./SymbolTests/TestTypeSystemClang.TestUnifyAccessSpecifiers (2093 of 2145) PASS: lldb-api :: commands/watchpoints/watchpoint_count/TestWatchpointCount.py (2094 of 2145) PASS: lldb-shell :: SymbolFile/NativePDB/ast-types.cpp (2095 of 2145) PASS: lldb-api :: commands/expression/dollar-in-variable/TestDollarInVariable.py (2096 of 2145) PASS: lldb-api :: functionalities/breakpoint/global_constructor/TestBreakpointInGlobalConstructor.py (2097 of 2145) PASS: lldb-api :: functionalities/jitloader_gdb/TestJITLoaderGDB.py (2098 of 2145) PASS: lldb-api :: lang/c/struct_types/TestStructTypes.py (2099 of 2145) PASS: lldb-api :: python_api/sbtype_typeclass/TestSBTypeTypeClass.py (2100 of 2145) PASS: lldb-api :: lang/cpp/llvm-style/TestLLVMStyle.py (2101 of 2145) PASS: lldb-api :: macosx/add-dsym/TestAddDsymMidExecutionCommand.py (2102 of 2145) PASS: lldb-api :: python_api/target/TestTargetAPI.py (2103 of 2145) PASS: lldb-unit :: Utility/./UtilityTests/Flags.AnyClear (2104 of 2145) UNSUPPORTED: lldb-api :: linux/mix-dwo-and-regular-objects/TestMixedDwarfBinary.py (2105 of 2145) PASS: lldb-unit :: UnwindAssembly/x86/./UnwindAssemblyx86Tests/Testx86AssemblyInspectionEngine.TestPopEBP (2106 of 2145) PASS: lldb-unit :: ScriptInterpreter/Python/./ScriptInterpreterPythonTests/PythonDataObjectsTest.TestPythonListValueEquality (2107 of 2145) PASS: lldb-shell :: Commands/command-regex-delete.test (2108 of 2145) PASS: lldb-unit :: Utility/./UtilityTests/GeneratorTest.Create (2109 of 2145) PASS: lldb-unit :: Symbol/./SymbolTests/LineEntryTest.GetSameLineContiguousAddressRangeNestedInline (2110 of 2145) PASS: lldb-api :: lang/cpp/frame-var-anon-unions/TestFrameVariableAnonymousUnions.py (2111 of 2145) PASS: lldb-api :: commands/command/script/TestCommandScript.py (2112 of 2145) PASS: lldb-unit :: Signals/./SignalsTests/UnixSignalsTest.Iteration (2113 of 2145) PASS: lldb-unit :: Utility/./UtilityTests/StringListTest.InsertStringAtIndexStdString (2114 of 2145) PASS: lldb-unit :: Utility/./UtilityTests/ArgsTest.Yaml (2115 of 2145) PASS: lldb-unit :: Utility/./UtilityTests/SharedCluster.ClusterManager (2116 of 2145) PASS: lldb-api :: lang/cpp/class-template-parameter-pack/TestClassTemplateParameterPack.py (2117 of 2145) PASS: lldb-unit :: Utility/./UtilityTests/StringListTest.GetMaxStringLengthDecreasingSize (2118 of 2145) PASS: lldb-unit :: Utility/./UtilityTests/ProcessInstanceInfo.Dump (2119 of 2145) PASS: lldb-shell :: SymbolFile/DWARF/dwarf5-atomic.s (2120 of 2145) UNSUPPORTED: lldb-api :: tools/lldb-server/platform-process-connect/TestPlatformProcessConnect.py (2121 of 2145) PASS: lldb-unit :: Utility/./UtilityTests/ConstStringTest.MangledCounterpart (2122 of 2145) PASS: lldb-unit :: Utility/./UtilityTests/RangeDataVector.FindEntryThatContains_Overlap (2123 of 2145) PASS: lldb-api :: lang/cpp/char8_t/TestCxxChar8_t.py (2124 of 2145) PASS: lldb-api :: python_api/name_lookup/TestNameLookup.py (2125 of 2145) PASS: lldb-api :: functionalities/thread/state_after_expression/TestStateAfterExpression.py (2126 of 2145) PASS: lldb-shell :: ObjectFile/wasm/stripped-debug-sections.yaml (2127 of 2145) PASS: lldb-shell :: ObjectFile/ELF/PT_LOAD-overlap-PT_INTERP.yaml (2128 of 2145) PASS: lldb-api :: commands/register/register/register_command/TestRegisters.py (2129 of 2145) PASS: lldb-unit :: Utility/./UtilityTests/StringExtractorTest.GetHexU8_Exact (2130 of 2145) PASS: lldb-unit :: Utility/./UtilityTests/SerializationRountripTest.SerializeDeserializeObjectReference (2131 of 2145) PASS: lldb-api :: commands/watchpoints/hello_watchpoint/TestMyFirstWatchpoint.py (2132 of 2145) PASS: lldb-api :: lang/cpp/class_types/TestClassTypesDisassembly.py (2133 of 2145) PASS: lldb-shell :: ScriptInterpreter/Python/crashlog.test (2134 of 2145) PASS: lldb-api :: lang/objc/exceptions/TestObjCExceptions.py (2135 of 2145) PASS: lldb-shell :: SymbolFile/DWARF/DW_AT_location-DW_AT_const_value.s (2136 of 2145) PASS: lldb-unit :: Utility/./UtilityTests/SerializationRountripTest.SerializeDeserializeCStringNull (2137 of 2145) PASS: lldb-api :: commands/process/attach-resume/TestAttachResume.py (2138 of 2145) PASS: lldb-api :: functionalities/gdb_remote_client/TestWasm.py (2139 of 2145) PASS: lldb-shell :: SymbolFile/DWARF/debug_ranges.s (2140 of 2145) PASS: lldb-api :: lang/c/stepping/TestThreadStepping.py (2141 of 2145) PASS: lldb-api :: functionalities/breakpoint/consecutive_breakpoints/TestConsecutiveBreakpoints.py (2142 of 2145) PASS: lldb-api :: functionalities/thread/concurrent_events/TestConcurrentWatchBreak.py (2143 of 2145) PASS: lldb-api :: lang/objcxx/class-name-clash/TestNameClash.py (2144 of 2145) Cancelling nested steps due to timeout Sending interrupt signal to process ninja: build stopped: interrupted by user. script returned exit code 143 [Pipeline] } [Pipeline] // timeout [Pipeline] } [Pipeline] // stage [Pipeline] stage [Pipeline] { (Declarative: Post Actions) [Pipeline] scanForIssues [Clang (LLVM based)] Sleeping for 5 seconds due to JENKINS-32191... [Clang (LLVM based)] Parsing console log (workspace: '/Users/buildslave/jenkins/workspace/lldb-cmake') [Clang (LLVM based)] Successfully parsed console log [Clang (LLVM based)] -> found 13 issues (skipped 36 duplicates) [Clang (LLVM based)] Post processing issues on 'green-dragon-10' with source code encoding 'UTF-8' [Clang (LLVM based)] Creating SCM blamer to obtain author and commit information for affected files [Clang (LLVM based)] Creating SCM miner to obtain statistics for affected repository files [Clang (LLVM based)] Resolving file names for all issues in source directory '/Users/buildslave/jenkins/workspace/lldb-cmake' [Clang (LLVM based)] -> resolved paths in source directory (8 found, 0 not found) [Clang (LLVM based)] Resolving module names from module definitions (build.xml, pom.xml, or Manifest.mf files) [Clang (LLVM based)] -> resolved module names for 13 issues [Clang (LLVM based)] Resolving package names (or namespaces) by parsing the affected files [Clang (LLVM based)] -> resolved package names of 8 affected files [Clang (LLVM based)] No filter has been set, publishing all 13 issues [Clang (LLVM based)] Creating fingerprints for all affected code blocks to track issues over different builds [Clang (LLVM based)] -> created fingerprints for 13 issues (skipped 0 issues) [Clang (LLVM based)] Copying affected files to Jenkins' build folder '/Users/Shared/Jenkins/Home/jobs/lldb-cmake/builds/23846/files-with-issues' [Clang (LLVM based)] -> 6 copied, 2 not in workspace, 0 not-found, 0 with I/O error [Pipeline] junit Recording test results [Pipeline] emailext Warning: ogiroux@gmail.com is not a recognized user, but sending mail anyway Warning: jasonliu.development@gmail.com is not a recognized user, but sending mail anyway Warning: listmail@philipreames.com is not a recognized user, but sending mail anyway Warning: Stanislav.Mekhanoshin@amd.com is not a recognized user, but sending mail anyway Warning: daniel.kiss@arm.com is not a recognized user, but sending mail anyway Warning: dag@cray.com is not a recognized user, but sending mail anyway Warning: michael.hliao@gmail.com is not a recognized user, but sending mail anyway Warning: Yaxun.Liu@amd.com is not a recognized user, but sending mail anyway Warning: asbirlea@google.com is not a recognized user, but sending mail anyway Warning: rahmanl@google.com is not a recognized user, but sending mail anyway Warning: phosek@chromium.org is not a recognized user, but sending mail anyway Warning: aeubanks@google.com is not a recognized user, but sending mail anyway Warning: mtrofin@google.com is not a recognized user, but sending mail anyway Warning: andrew_litteken@apple.com is not a recognized user, but sending mail anyway Warning: zhanghb97@126.com is not a recognized user, but sending mail anyway Warning: rupprecht@google.com is not a recognized user, but sending mail anyway Warning: richard@metafoo.co.uk is not a recognized user, but sending mail anyway Warning: maskray@google.com is not a recognized user, but sending mail anyway Warning: psteinfeld@nvidia.com is not a recognized user, but sending mail anyway Warning: thakis@chromium.org is not a recognized user, but sending mail anyway Warning: llvm-project@meinersbur.de is not a recognized user, but sending mail anyway Warning: akhuang@google.com is not a recognized user, but sending mail anyway Warning: craig.topper@intel.com is not a recognized user, but sending mail anyway Warning: tianshilei1992@gmail.com is not a recognized user, but sending mail anyway Warning: richard@metafoo.co.uk is not a recognized user, but sending mail anyway Warning: aeubanks@google.com is not a recognized user, but sending mail anyway Warning: asbirlea@google.com is not a recognized user, but sending mail anyway Warning: andrew_litteken@apple.com is not a recognized user, but sending mail anyway Warning: craig.topper@intel.com is not a recognized user, but sending mail anyway Warning: zhanghb97@126.com is not a recognized user, but sending mail anyway

Hide Details

Begin Pre-Send Script... Sending email to: Florian Hahn <florian_hahn@apple.com> Florian Hahn <florian_hahn@apple.com> Azhar Mohammed <azhar@apple.com>
[Pipeline] } [Pipeline] // stage [Pipeline] } [Pipeline] // withEnv [Pipeline] } [Pipeline] // node [Pipeline] End of Pipeline Timeout has been exceeded Finished: ABORTED