FailedConsole Output

Skipping 9,109 KB.. Full Log
aImport.test (945 of 2145)
PASS: lldb-unit :: Utility/./UtilityTests/UUIDTest.Validity (946 of 2145)
PASS: lldb-api :: functionalities/data-formatter/data-formatter-objc/TestDataFormatterObjCCF.py (947 of 2145)
PASS: lldb-unit :: ObjectFile/Breakpad/./ObjectFileBreakpadTests/InfoRecord.parse (948 of 2145)
PASS: lldb-api :: lang/c/stepping/TestStepAndBreakpoints.py (949 of 2145)
PASS: lldb-shell :: ObjectFile/ELF/many-sections.s (950 of 2145)
PASS: lldb-unit :: Utility/./UtilityTests/SerializationRountripTest.SerializeDeserializeCStringArrayNullptr (951 of 2145)
PASS: lldb-api :: functionalities/data-formatter/parray/TestPrintArray.py (952 of 2145)
PASS: lldb-unit :: Utility/./UtilityTests/SubsystemRAIITest.SubsystemWithErrorFailure (953 of 2145)
PASS: lldb-unit :: Symbol/./SymbolTests/PostfixExpression.ParseOneExpression (954 of 2145)
PASS: lldb-api :: lang/cpp/modules-import/TestCXXModulesImport.py (955 of 2145)
UNSUPPORTED: lldb-shell :: SymbolFile/PDB/function-level-linking.test (956 of 2145)
PASS: lldb-api :: functionalities/data-formatter/data-formatter-stl/libcxx/vector/TestDataFormatterLibcxxVector.py (957 of 2145)
PASS: lldb-unit :: Utility/./UtilityTests/StringExtractorTest.DecodeHexU8_Underflow (958 of 2145)
PASS: lldb-unit :: Utility/./UtilityTests/FileSpecTest.Equal (959 of 2145)
PASS: lldb-unit :: Host/./HostTests/SocketTest.DomainGetConnectURI (960 of 2145)
PASS: lldb-shell :: ObjectFile/PECOFF/export-dllfunc.yaml (961 of 2145)
PASS: lldb-unit :: Host/./HostTests/ConnectionFileDescriptorTest.TCPGetURIv4 (962 of 2145)
PASS: lldb-unit :: Utility/./UtilityTests/LogChannelEnabledTest.LogThread (963 of 2145)
PASS: lldb-unit :: Process/minidump/./LLDBMinidumpTests/RegisterContextMinidump.CheckRegisterContextMinidump_ARM (964 of 2145)
UNSUPPORTED: lldb-shell :: SymbolFile/PDB/enums-layout.test (965 of 2145)
PASS: lldb-shell :: SymbolFile/DWARF/debug_ranges.s (966 of 2145)
PASS: lldb-api :: python_api/section/TestSectionAPI.py (967 of 2145)
PASS: lldb-api :: python_api/watchpoint/watchlocation/TestSetWatchlocation.py (968 of 2145)
PASS: lldb-unit :: Utility/./UtilityTests/StreamTest.PutMaxHex64ByteOrderLittle (969 of 2145)
PASS: lldb-shell :: Commands/command-disassemble-process.yaml (970 of 2145)
PASS: lldb-api :: functionalities/data-formatter/data-formatter-objc/nsstring/TestDataFormatterNSString.py (971 of 2145)
PASS: lldb-unit :: Language/Highlighting/./HighlighterTests/HighlighterTest.ClangSquareBrackets (972 of 2145)
PASS: lldb-unit :: Symbol/./SymbolTests/TestClangASTImporter.MetadataPropagationIndirectImport (973 of 2145)
PASS: lldb-unit :: Utility/./UtilityTests/LogChannelTest.Disable (974 of 2145)
PASS: lldb-api :: functionalities/postmortem/elf-core/TestLinuxCore.py (975 of 2145)
PASS: lldb-unit :: Process/minidump/./LLDBMinidumpTests/MinidumpParserTest.FindMemoryRangeWithFullMemoryMinidump (976 of 2145)
PASS: lldb-api :: functionalities/abbreviation/TestAbbreviations.py (977 of 2145)
UNSUPPORTED: lldb-shell :: Breakpoint/case-insensitive.test (978 of 2145)
PASS: lldb-api :: functionalities/reproducers/attach/TestReproducerAttach.py (979 of 2145)
PASS: lldb-unit :: Signals/./SignalsTests/UnixSignalsTest.VersionChange (980 of 2145)
PASS: lldb-unit :: Utility/./UtilityTests/XcodeSDKTest.SDKSupportsSwift (981 of 2145)
PASS: lldb-shell :: Reproducer/TestWorkingDir.test (982 of 2145)
PASS: lldb-unit :: Language/CPlusPlus/./LanguageCPlusPlusTests/CPlusPlusLanguage.FindAlternateFunctionManglings (983 of 2145)
PASS: lldb-unit :: Symbol/./SymbolTests/DWARFCallFrameInfoTest.Basic_eh (984 of 2145)
PASS: lldb-api :: commands/expression/test/TestExprs2.py (985 of 2145)
PASS: lldb-api :: linux/builtin_trap/TestBuiltinTrap.py (986 of 2145)
PASS: lldb-unit :: Utility/./UtilityTests/Flags.AnySet (987 of 2145)
PASS: lldb-unit :: Language/Highlighting/./HighlighterTests/HighlighterTest.HighlighterSelectionType (988 of 2145)
UNSUPPORTED: lldb-shell :: Register/x86-zmm-read.test (989 of 2145)
PASS: lldb-unit :: Utility/./UtilityTests/UriParserTest.TypicalPortPathIPv4 (990 of 2145)
PASS: lldb-shell :: SymbolFile/NativePDB/break-by-function.cpp (991 of 2145)
PASS: lldb-shell :: Reproducer/TestPythonImport.test (992 of 2145)
PASS: lldb-api :: functionalities/data-formatter/data-formatter-objc/TestDataFormatterObjCNSURL.py (993 of 2145)
PASS: lldb-api :: functionalities/data-formatter/hexcaps/TestDataFormatterHexCaps.py (994 of 2145)
PASS: lldb-unit :: UnwindAssembly/x86/./UnwindAssemblyx86Tests/Testx86AssemblyInspectionEngine.TestPopR14 (995 of 2145)
PASS: lldb-shell :: Settings/TestLineMarkerColor.test (996 of 2145)
PASS: lldb-shell :: Minidump/memory-region.yaml (997 of 2145)
PASS: lldb-unit :: Utility/./UtilityTests/OptionsWithRawTest.LeadingSpaceArgs (998 of 2145)
PASS: lldb-api :: functionalities/postmortem/mach-core/TestMachCore.py (999 of 2145)
PASS: lldb-unit :: Utility/./UtilityTests/AnsiTerminal.Basic (1000 of 2145)
PASS: lldb-unit :: ScriptInterpreter/Python/./ScriptInterpreterPythonTests/PythonDataObjectsTest.TestDictionaryResolutionWithDot (1001 of 2145)
PASS: lldb-unit :: Utility/./UtilityTests/StreamTest.PutBytesAsRawHex8ToBigEndian (1002 of 2145)
PASS: lldb-api :: functionalities/thread/concurrent_events/TestConcurrentManyBreakpoints.py (1003 of 2145)
PASS: lldb-unit :: Utility/./UtilityTests/OptionsWithRawTest.MultiWordSuffix (1004 of 2145)
PASS: lldb-api :: functionalities/asan/TestReportData.py (1005 of 2145)
UNSUPPORTED: lldb-api :: android/platform/TestDefaultCacheLineSize.py (1006 of 2145)
PASS: lldb-api :: functionalities/breakpoint/move_nearest/TestMoveNearest.py (1007 of 2145)
PASS: lldb-unit :: Host/./HostTests/FileSystemTest.Exists (1008 of 2145)
PASS: lldb-unit :: ObjectFile/MachO/./ObjectFileMachOTests/ObjectFileMachOTest.ModuleFromSharedCacheInfo (1009 of 2145)
PASS: lldb-unit :: Utility/./UtilityTests/AnsiTerminal.Twice (1010 of 2145)
PASS: lldb-api :: functionalities/thread/concurrent_events/TestConcurrentTwoWatchpointThreads.py (1011 of 2145)
PASS: lldb-api :: functionalities/show_location/TestShowLocationDwarf5.py (1012 of 2145)
PASS: lldb-api :: lang/cpp/trivial_abi/TestTrivialABI.py (1013 of 2145)
PASS: lldb-unit :: Utility/./UtilityTests/StringExtractorTest.GetHexBytes_FullString (1014 of 2145)
PASS: lldb-api :: commands/platform/process/list/TestProcessList.py (1015 of 2145)
PASS: lldb-shell :: Driver/TestNoUseColor.test (1016 of 2145)
PASS: lldb-api :: macosx/find-dsym/deep-bundle/TestDeepBundle.py (1017 of 2145)
PASS: lldb-unit :: SymbolFile/NativePDB/./SymbolFileNativePDBTests/PDBFPOProgramToDWARFExpressionTests.MissingTargetRegister (1018 of 2145)
PASS: lldb-unit :: Utility/./UtilityTests/StringExtractorTest.GetHexBytesAvail_OddPair (1019 of 2145)
PASS: lldb-unit :: Utility/./UtilityTests/RegularExpression.CopyAssignment (1020 of 2145)
PASS: lldb-unit :: UnwindAssembly/x86/./UnwindAssemblyx86Tests/Testx86AssemblyInspectionEngine.Test64bitFramelessBigStackFrame (1021 of 2145)
PASS: lldb-unit :: UnwindAssembly/x86/./UnwindAssemblyx86Tests/Testx86AssemblyInspectionEngine.TestPushRBP (1022 of 2145)
PASS: lldb-unit :: Utility/./UtilityTests/OptionsWithRawTest.TerminatedQuote (1023 of 2145)
PASS: lldb-api :: api/command-return-object/TestSBCommandReturnObject.py (1024 of 2145)
PASS: lldb-api :: functionalities/load_using_paths/TestLoadUsingPaths.py (1025 of 2145)
PASS: lldb-api :: commands/source/info/TestSourceInfo.py (1026 of 2145)
PASS: lldb-api :: functionalities/breakpoint/cpp_exception/TestCPPExceptionBreakpoint.py (1027 of 2145)
PASS: lldb-api :: lang/objcxx/cxx-bridged-po/TestObjCXXBridgedPO.py (1028 of 2145)
PASS: lldb-unit :: Utility/./UtilityTests/DataExtractorTest.GetCStrAtEnd (1029 of 2145)
PASS: lldb-shell :: Driver/TestCore.test (1030 of 2145)
PASS: lldb-api :: lang/objc/modules-update/TestClangModulesUpdate.py (1031 of 2145)
PASS: lldb-unit :: Utility/./UtilityTests/ArgsTest.ReplaceArgumentAtIndexShort (1032 of 2145)
PASS: lldb-unit :: UnwindAssembly/x86/./UnwindAssemblyx86Tests/Testx86AssemblyInspectionEngine.Test32bitFramelessSmallStackFrame (1033 of 2145)
PASS: lldb-unit :: Symbol/./SymbolTests/TestTypeSystemClang.TestGetTypeClassTypeOfExpr (1034 of 2145)
PASS: lldb-api :: tools/lldb-server/TestGdbRemoteThreadsInStopReply.py (1035 of 2145)
PASS: lldb-api :: python_api/hello_world/TestHelloWorld.py (1036 of 2145)
PASS: lldb-shell :: SymbolFile/Breakpad/stack-cfi-arm.yaml (1037 of 2145)
PASS: lldb-shell :: SymbolFile/DWARF/debug-types-missing-signature.test (1038 of 2145)
PASS: lldb-api :: functionalities/data-formatter/data-formatter-stl/libstdcpp/unique_ptr/invalid/TestDataFormatterInvalidStdUniquePtr.py (1039 of 2145)
PASS: lldb-api :: python_api/exprpath_synthetic/TestExprPathSynthetic.py (1040 of 2145)
PASS: lldb-api :: lang/cpp/stl/TestStdCXXDisassembly.py (1041 of 2145)
PASS: lldb-api :: commands/expression/import-std-module/deque-dbg-info-content/TestDbgInfoContentDequeFromStdModule.py (1042 of 2145)
PASS: lldb-api :: lang/c/complex/TestComplexC99.py (1043 of 2145)
PASS: lldb-unit :: Target/./TargetTests/MCBasedABI.MapRegisterName (1044 of 2145)
PASS: lldb-unit :: Expression/./ExpressionTests/CppModuleConfigurationTest.Sysroot (1045 of 2145)
PASS: lldb-api :: lang/cpp/breakpoint_in_member_func_w_non_primitive_params/TestBreakpointInMemberFuncWNonPrimitiveParams.py (1046 of 2145)
UNSUPPORTED: lldb-api :: functionalities/darwin_log/basic/TestDarwinLogBasic.py (1047 of 2145)
PASS: lldb-shell :: ObjectFile/ELF/section-addresses.yaml (1048 of 2145)
PASS: lldb-unit :: Expression/./ExpressionTests/DiagnosticManagerTest.GetStringBasic (1049 of 2145)
PASS: lldb-unit :: Utility/./UtilityTests/RangeDataVector.FindEntryThatContains_Overlap (1050 of 2145)
PASS: lldb-unit :: Utility/./UtilityTests/CompletionRequest.ShiftArguments (1051 of 2145)
PASS: lldb-api :: functionalities/data-formatter/data-formatter-proper-plurals/TestFormattersOneIsSingular.py (1052 of 2145)
PASS: lldb-api :: macosx/nslog/TestDarwinNSLogOutput.py (1053 of 2145)
PASS: lldb-unit :: Interpreter/./InterpreterTests/OptionArgParserTest.toScriptLanguage (1054 of 2145)
UNSUPPORTED: lldb-shell :: Register/aarch64-gp-read.test (1055 of 2145)
UNSUPPORTED: lldb-api :: lang/cpp/static_members/TestCPPStaticMembers.py (1056 of 2145)
PASS: lldb-api :: lang/c/shared_lib_stripped_symbols/TestSharedLibStrippedSymbols.py (1057 of 2145)
PASS: lldb-unit :: Expression/./ExpressionTests/DiagnosticManagerTest.AppendMessageNoDiag (1058 of 2145)
PASS: lldb-unit :: Process/minidump/./LLDBMinidumpTests/MinidumpParserTest.MinidumpDuplicateModuleMappedSecond (1059 of 2145)
PASS: lldb-api :: functionalities/breakpoint/breakpoint_command/TestBreakpointCommandsFromPython.py (1060 of 2145)
PASS: lldb-unit :: ScriptInterpreter/Python/./ScriptInterpreterPythonTests/PythonDataObjectsTest.TestPythonListToStructuredList (1061 of 2145)
PASS: lldb-unit :: Utility/./UtilityTests/BinaryStreamTest.PutSLEB128SevenBytes (1062 of 2145)
PASS: lldb-api :: commands/expression/import-std-module/no-std-module/TestMissingStdModule.py (1063 of 2145)
PASS: lldb-unit :: Utility/./UtilityTests/StringExtractorTest.GetU64LittleEndian (1064 of 2145)
PASS: lldb-unit :: Process/gdb-remote/./ProcessGdbRemoteTests/GDBRemoteClientBaseTest.SendContinueAndAsyncSignal (1065 of 2145)
PASS: lldb-api :: commands/command/script/TestCommandScript.py (1066 of 2145)
PASS: lldb-unit :: Utility/./UtilityTests/StreamTest.AddressRangeInvalidRange (1067 of 2145)
PASS: lldb-unit :: ScriptInterpreter/Python/./ScriptInterpreterPythonTests/PythonDataObjectsTest.TestGlobalNameResolutionWithDot (1068 of 2145)
PASS: lldb-shell :: SymbolFile/dissassemble-entry-point.s (1069 of 2145)
PASS: lldb-unit :: Host/./HostTests/ConnectionFileDescriptorTest.TCPGetURIv6 (1070 of 2145)
PASS: lldb-shell :: SymbolFile/DWARF/debug_rnglists.s (1071 of 2145)
PASS: lldb-shell :: ObjectFile/ELF/duplicate-section.yaml (1072 of 2145)
PASS: lldb-shell :: ObjectFile/ELF/netbsd-core-amd64.test (1073 of 2145)
PASS: lldb-unit :: Host/./HostTests/MainLoopTest.Signal (1074 of 2145)
PASS: lldb-api :: functionalities/thread/concurrent_events/TestConcurrentTwoBreakpointsOneDelaySignal.py (1075 of 2145)
PASS: lldb-unit :: Core/./LLDBCoreTests/RichManglingContextTest.SwitchProvider (1076 of 2145)
PASS: lldb-unit :: Utility/./UtilityTests/XcodeSDKTest.GetCanonicalNameAndConstruct (1077 of 2145)
UNSUPPORTED: lldb-api :: functionalities/data-formatter/data-formatter-stl/libstdcpp/smart_ptr/TestDataFormatterStdSmartPtr.py (1078 of 2145)
PASS: lldb-api :: commands/expression/import-std-module/forward_decl_from_module/TestForwardDeclFromStdModule.py (1079 of 2145)
PASS: lldb-api :: functionalities/tail_call_frames/inlining_and_tail_calls/TestInliningAndTailCalls.py (1080 of 2145)
UNSUPPORTED: lldb-shell :: ExecControl/StopHook/stop-hook-threads.test (1081 of 2145)
PASS: lldb-unit :: Thread/./ThreadTests/ThreadTest.GetPrivateStopInfo (1082 of 2145)
XFAIL: lldb-shell :: Unwind/prefer-debug-over-eh-frame.test (1083 of 2145)
PASS: lldb-unit :: debugserver/./debugserverTests/RNBSocket.AnyListen (1084 of 2145)
PASS: lldb-unit :: Utility/./UtilityTests/ScalarTest.Promotion (1085 of 2145)
UNSUPPORTED: lldb-api :: tools/lldb-vscode/completions/TestVSCode_completions.py (1086 of 2145)
PASS: lldb-api :: commands/frame/diagnose/bad-reference/TestBadReference.py (1087 of 2145)
PASS: lldb-shell :: Settings/TestFrameFormatMangling.test (1088 of 2145)
PASS: lldb-unit :: Utility/./UtilityTests/FileSpecTest.AppendPathComponent (1089 of 2145)
PASS: lldb-api :: functionalities/data-formatter/data-formatter-stl/libcxx/queue/TestDataFormatterLibcxxQueue.py (1090 of 2145)
PASS: lldb-api :: tools/lldb-server/inferior-crash/TestGdbRemoteAbort.py (1091 of 2145)
PASS: lldb-shell :: ObjectFile/MachO/lc_version_min.yaml (1092 of 2145)
PASS: lldb-unit :: Utility/./UtilityTests/FileSpecTest.OperatorBool (1093 of 2145)
UNSUPPORTED: lldb-api :: functionalities/breakpoint/breakpoint_in_delayslot/TestAvoidBreakpointInDelaySlot.py (1094 of 2145)
PASS: lldb-api :: functionalities/tsan/multiple/TestTsanMultiple.py (1095 of 2145)
PASS: lldb-api :: lang/objc/objc-struct-return/TestObjCStructReturn.py (1096 of 2145)
PASS: lldb-api :: functionalities/breakpoint/hardware_breakpoints/require_hw_breakpoints/TestRequireHWBreakpoints.py (1097 of 2145)
PASS: lldb-unit :: tools/lldb-server/tests/./LLDBServerTests/TestBase.DebugserverEnv (1098 of 2145)
PASS: lldb-unit :: Symbol/./SymbolTests/TestTypeSystemClang.TestGetBasicTypeFromEnum (1099 of 2145)
UNSUPPORTED: lldb-shell :: ObjectFile/ELF/minidebuginfo-no-lzma.yaml (1100 of 2145)
PASS: lldb-shell :: Settings/TestFrameFormatColor.test (1101 of 2145)
PASS: lldb-api :: functionalities/abbreviation/TestCommonShortSpellings.py (1102 of 2145)
PASS: lldb-api :: lang/objc/objc-new-syntax/TestObjCNewSyntaxArray.py (1103 of 2145)
PASS: lldb-unit :: Utility/./UtilityTests/StringListTest.AppendListCStringArrayEmpty (1104 of 2145)
PASS: lldb-api :: lang/c/register_variables/TestRegisterVariables.py (1105 of 2145)
UNSUPPORTED: lldb-api :: tools/lldb-server/platform-process-connect/TestPlatformProcessConnect.py (1106 of 2145)
PASS: lldb-api :: python_api/sbvalue_persist/TestSBValuePersist.py (1107 of 2145)
PASS: lldb-unit :: Utility/./UtilityTests/ProcessInfoTest.Constructor (1108 of 2145)
PASS: lldb-api :: commands/expression/inline-namespace/TestInlineNamespace.py (1109 of 2145)
PASS: lldb-shell :: SymbolFile/DWARF/debug_loclists-dwo.s (1110 of 2145)
PASS: lldb-api :: functionalities/data-formatter/data-formatter-objc/TestDataFormatterObjCNSData.py (1111 of 2145)
PASS: lldb-unit :: SymbolFile/DWARF/./SymbolFileDWARFTests/SymbolFileDWARFTests.TestAbbrevMissingTerminator (1112 of 2145)
PASS: lldb-shell :: SymbolFile/DWARF/module-ownership.mm (1113 of 2145)
PASS: lldb-unit :: Symbol/./SymbolTests/SymbolsTest.LocateExecutableSymbolFileForUnknownExecutableAndMissingSymbolFile (1114 of 2145)
PASS: lldb-unit :: Expression/./ExpressionTests/DiagnosticManagerTest.AppendMessageSubsequentDiags (1115 of 2145)
UNSUPPORTED: lldb-api :: lang/objc/objc-dynamic-value/TestObjCDynamicValue.py (1116 of 2145)
PASS: lldb-api :: functionalities/thread/thread_exit/TestThreadExit.py (1117 of 2145)
PASS: lldb-api :: tools/lldb-vscode/stackTrace/TestVSCode_stackTrace.py (1118 of 2145)
PASS: lldb-api :: commands/watchpoints/watchpoint_count/TestWatchpointCount.py (1119 of 2145)
PASS: lldb-unit :: Utility/./UtilityTests/RecordReplayTest.InstrumentedBarRef (1120 of 2145)
PASS: lldb-unit :: Utility/./UtilityTests/BinaryStreamTest.PutSLEB128FiveBytes (1121 of 2145)
PASS: lldb-api :: lang/objc/radar-9691614/TestObjCMethodReturningBOOL.py (1122 of 2145)
PASS: lldb-unit :: SymbolFile/NativePDB/./SymbolFileNativePDBTests/PDBFPOProgramToDWARFExpressionTests.InvalidAssignmentMultiple (1123 of 2145)
PASS: lldb-unit :: Utility/./UtilityTests/RegularExpression.Empty (1124 of 2145)
PASS: lldb-api :: lang/objc/objc-new-syntax/TestObjCNewSyntaxLiteral.py (1125 of 2145)
PASS: lldb-shell :: SymbolFile/NativePDB/global-classes.cpp (1126 of 2145)
PASS: lldb-api :: functionalities/breakpoint/comp_dir_symlink/TestCompDirSymLink.py (1127 of 2145)
PASS: lldb-api :: functionalities/tail_call_frames/disambiguate_paths_to_common_sink/TestDisambiguatePathsToCommonSink.py (1128 of 2145)
UNSUPPORTED: lldb-api :: functionalities/darwin_log/filter/regex/subsystem/TestDarwinLogFilterRegexSubsystem.py (1129 of 2145)
UNSUPPORTED: lldb-api :: tools/lldb-server/TestGdbRemoteModuleInfo.py (1130 of 2145)
PASS: lldb-shell :: SymbolFile/DWARF/debug_ranges_and_rnglists.test (1131 of 2145)
PASS: lldb-unit :: Process/minidump/./LLDBMinidumpTests/MinidumpParserTest.FindMemoryRange (1132 of 2145)
PASS: lldb-unit :: Utility/./UtilityTests/StreamTest.PutRawBytesToBigEndian (1133 of 2145)
PASS: lldb-unit :: Process/gdb-remote/./ProcessGdbRemoteTests/GDBRemoteCommunicationServerTest.SendErrorResponse_UnimplementedError (1134 of 2145)
PASS: lldb-unit :: Utility/./UtilityTests/VMRange.Reset (1135 of 2145)
PASS: lldb-api :: functionalities/gdb_remote_client/TestRestartBug.py (1136 of 2145)
PASS: lldb-api :: commands/expression/regression-access-function-template-in-record/TestRegressionAccessFunctionTemplateInRecord.py (1137 of 2145)
PASS: lldb-unit :: Utility/./UtilityTests/ArgsTest.ReplaceArgumentAtIndexFarOutOfRange (1138 of 2145)
UNSUPPORTED: lldb-shell :: SymbolFile/NativePDB/stack_unwinding01.cpp (1139 of 2145)
PASS: lldb-shell :: Settings/TestModuleCacheSanity.test (1140 of 2145)
PASS: lldb-unit :: Symbol/./SymbolTests/TestClangASTImporter.DeportDeclTagDecl (1141 of 2145)
UNSUPPORTED: lldb-shell :: SymbolFile/NativePDB/local-variables.cpp (1142 of 2145)
PASS: lldb-unit :: Utility/./UtilityTests/StringExtractorTest.GetHexU8_Underflow_NoEof (1143 of 2145)
PASS: lldb-api :: api/multithreaded/TestMultithreaded.py (1144 of 2145)
PASS: lldb-api :: commands/expression/entry-bp/TestExprEntryBP.py (1145 of 2145)
PASS: lldb-unit :: Process/minidump/./LLDBMinidumpTests/MinidumpParserTest.GetMemoryRegionInfoFromMemoryList (1146 of 2145)
PASS: lldb-shell :: SymbolFile/DWARF/limit-debug-info.s (1147 of 2145)
PASS: lldb-api :: commands/gui/viewlarge/TestGuiViewLarge.py (1148 of 2145)
PASS: lldb-api :: commands/expression/scoped_enums/TestScopedEnumType.py (1149 of 2145)
PASS: lldb-unit :: Expression/./ExpressionTests/CppModuleConfigurationTest.IgnoreLibStdCpp (1150 of 2145)
PASS: lldb-api :: functionalities/unwind/noreturn/TestNoreturnUnwind.py (1151 of 2145)
PASS: lldb-api :: python_api/sbplatform/TestSBPlatform.py (1152 of 2145)
PASS: lldb-api :: lang/cpp/template-function/TestTemplateFunctions.py (1153 of 2145)
UNSUPPORTED: lldb-shell :: SymbolFile/PDB/func-symbols.test (1154 of 2145)
PASS: lldb-api :: functionalities/signal/raise/TestRaise.py (1155 of 2145)
PASS: lldb-unit :: Utility/./UtilityTests/ArgsTest.TestUnknownEscape (1156 of 2145)
PASS: lldb-unit :: Utility/./UtilityTests/StreamTest.PutCStringWithStringRef (1157 of 2145)
PASS: lldb-unit :: Symbol/./SymbolTests/TestClangASTImporter.MetadataPropagation (1158 of 2145)
PASS: lldb-unit :: Utility/./UtilityTests/AnsiTerminal.Empty (1159 of 2145)
PASS: lldb-api :: commands/frame/recognizer/TestFrameRecognizer.py (1160 of 2145)
PASS: lldb-unit :: Host/./HostTests/MainLoopTest.TerminatesImmediately (1161 of 2145)
PASS: lldb-api :: functionalities/dynamic_value_child_count/TestDynamicValueChildCount.py (1162 of 2145)
PASS: lldb-unit :: Utility/./UtilityTests/StreamTest.PutNHex8 (1163 of 2145)
PASS: lldb-unit :: SymbolFile/DWARF/./SymbolFileDWARFTests/SymbolFileDWARFTests.TestAbbrevInvalidNULLTag (1164 of 2145)
PASS: lldb-unit :: ObjectFile/Breakpad/./ObjectFileBreakpadTests/StackCFIRecord.parse (1165 of 2145)
UNSUPPORTED: lldb-api :: tools/lldb-server/signal-filtering/TestGdbRemote_QPassSignals.py (1166 of 2145)
PASS: lldb-api :: functionalities/data-formatter/data-formatter-stl/libcxx/unique_ptr/TestDataFormatterLibcxxUniquePtr.py (1167 of 2145)
PASS: lldb-api :: commands/expression/result_numbering/TestResultNumbering.py (1168 of 2145)
PASS: lldb-unit :: Host/./HostTests/FileSystemTest.GetPermissions (1169 of 2145)
PASS: lldb-unit :: Utility/./UtilityTests/ScalarTest.Comparison (1170 of 2145)
PASS: lldb-api :: lang/cpp/global_operators/TestCppGlobalOperators.py (1171 of 2145)
PASS: lldb-shell :: ObjectFile/wasm/basic.yaml (1172 of 2145)
PASS: lldb-api :: functionalities/thread/concurrent_events/TestConcurrentSignalWatch.py (1173 of 2145)
PASS: lldb-api :: lang/cpp/bool/TestCPPBool.py (1174 of 2145)
PASS: lldb-api :: lang/mixed/TestMixedLanguages.py (1175 of 2145)
PASS: lldb-unit :: Host/./HostTests/FileSystemTest.EmptyTest (1176 of 2145)
PASS: lldb-api :: functionalities/data-formatter/data-formatter-stl/libcxx/multiset/TestDataFormatterLibcxxMultiSet.py (1177 of 2145)
PASS: lldb-shell :: Commands/command-backtrace.test (1178 of 2145)
UNSUPPORTED: lldb-shell :: Register/x86-64-gp-write.test (1179 of 2145)
PASS: lldb-unit :: ScriptInterpreter/Python/./ScriptInterpreterPythonTests/PythonDataObjectsTest.TestPythonString (1180 of 2145)
PASS: lldb-unit :: Utility/./UtilityTests/StreamTeeTest.Assignment (1181 of 2145)
PASS: lldb-unit :: Utility/./UtilityTests/UriParserTest.BracketedHostnameWithPortIPv6 (1182 of 2145)
PASS: lldb-api :: functionalities/tsan/global_location/TestTsanGlobalLocation.py (1183 of 2145)
PASS: lldb-unit :: Host/./HostTests/SocketTest.UDPConnect (1184 of 2145)
PASS: lldb-api :: commands/expression/persistent_types/TestNestedPersistentTypes.py (1185 of 2145)
PASS: lldb-unit :: Symbol/./SymbolTests/LineEntryTest.GetSameLineContiguousAddressRangeNestedInline (1186 of 2145)
PASS: lldb-api :: functionalities/breakpoint/breakpoint_ids/TestBreakpointIDs.py (1187 of 2145)
PASS: lldb-unit :: Utility/./UtilityTests/DataExtractorTest.GetDoubleUnaligned (1188 of 2145)
PASS: lldb-unit :: Utility/./UtilityTests/ArchSpecTest.TestParseMachCPUDashSubtypeTripleSimple (1189 of 2145)
PASS: lldb-api :: commands/frame/diagnose/dereference-argument/TestDiagnoseDereferenceArgument.py (1190 of 2145)
UNSUPPORTED: lldb-shell :: Register/arm-fp-read.test (1191 of 2145)
UNSUPPORTED: lldb-api :: functionalities/process_save_core/TestProcessSaveCore.py (1192 of 2145)
PASS: lldb-shell :: Reproducer/TestCaptureEnvOverride.test (1193 of 2145)
UNSUPPORTED: lldb-api :: commands/register/register/intel_xtended_registers/mpx_bound_violation/TestBoundViolation.py (1194 of 2145)
PASS: lldb-unit :: Utility/./UtilityTests/StringExtractorTest.GetNameColonValueContainsColon (1195 of 2145)
UNSUPPORTED: lldb-shell :: SymbolFile/PDB/vbases.test (1196 of 2145)
PASS: lldb-unit :: Utility/./UtilityTests/StatusTest.ErrorCodeConstructor (1197 of 2145)
PASS: lldb-api :: driver/batch_mode/TestBatchMode.py (1198 of 2145)
PASS: lldb-unit :: Utility/./UtilityTests/RangeTest.DoesIntersect (1199 of 2145)
PASS: lldb-shell :: Breakpoint/single-file-split-dwarf.test (1200 of 2145)
PASS: lldb-api :: lang/c/anonymous/TestAnonymous.py (1201 of 2145)
PASS: lldb-api :: commands/frame/diagnose/virtual-method-call/TestDiagnoseDereferenceVirtualMethodCall.py (1202 of 2145)
PASS: lldb-api :: lang/objc/foundation/TestFoundationDisassembly.py (1203 of 2145)
PASS: lldb-api :: lang/objc/foundation/TestObjCMethodsString.py (1204 of 2145)
UNSUPPORTED: lldb-api :: functionalities/darwin_log/filter/exact_match/subsystem/TestDarwinLogFilterMatchSubsystem.py (1205 of 2145)
PASS: lldb-api :: lang/c/local_types/TestUseClosestType.py (1206 of 2145)
UNSUPPORTED: lldb-api :: commands/watchpoints/multi_watchpoint_slots/TestWatchpointMultipleSlots.py (1207 of 2145)
PASS: lldb-unit :: Utility/./UtilityTests/StreamTest.PutHex32ByteOrderBig (1208 of 2145)
PASS: lldb-unit :: Utility/./UtilityTests/BinaryStreamTest.PutULEB128SevenBytes (1209 of 2145)
PASS: lldb-unit :: Host/./HostTests/HostInfoTest.GetXcodeSDK (1210 of 2145)
UNSUPPORTED: lldb-api :: linux/thread/create_during_instruction_step/TestCreateDuringInstructionStep.py (1211 of 2145)
PASS: lldb-unit :: ScriptInterpreter/Python/./ScriptInterpreterPythonTests/PythonDataObjectsTest.TestPythonIntegerToStr (1212 of 2145)
PASS: lldb-unit :: Utility/./UtilityTests/OptionsWithRawTest.ArgsButNoDelimiter (1213 of 2145)
PASS: lldb-shell :: SymbolFile/DWARF/find-method.cpp (1214 of 2145)
PASS: lldb-api :: lang/c/find_struct_type/TestFindStructTypes.py (1215 of 2145)
PASS: lldb-api :: functionalities/thread/exit_during_break/TestExitDuringBreak.py (1216 of 2145)
PASS: lldb-api :: functionalities/thread/concurrent_events/TestConcurrentSignalNWatchNBreak.py (1217 of 2145)
PASS: lldb-api :: functionalities/data-formatter/data-formatter-stl/libcxx/optional/TestDataFormatterLibcxxOptional.py (1218 of 2145)
PASS: lldb-unit :: Process/minidump/./LLDBMinidumpTests/MinidumpParserTest.GetPidWow64 (1219 of 2145)
PASS: lldb-unit :: Utility/./UtilityTests/ScalarTest.Getters (1220 of 2145)
PASS: lldb-api :: lang/objc/foundation/TestConstStrings.py (1221 of 2145)
PASS: lldb-unit :: UnwindAssembly/x86/./UnwindAssemblyx86Tests/Testx86AssemblyInspectionEngine.TestPopR15 (1222 of 2145)
PASS: lldb-api :: functionalities/gdb_remote_client/TestNoWatchpointSupportInfo.py (1223 of 2145)
PASS: lldb-api :: tools/lldb-server/TestGdbRemoteHostInfo.py (1224 of 2145)
PASS: lldb-unit :: Utility/./UtilityTests/ScalarTest.ExtractBitfield (1225 of 2145)
PASS: lldb-api :: tools/lldb-server/TestLldbGdbServer.py (1226 of 2145)
PASS: lldb-unit :: Utility/./UtilityTests/OptionsWithRawTest.WhitespaceSuffix (1227 of 2145)
PASS: lldb-unit :: ScriptInterpreter/Python/./ScriptInterpreterPythonTests/PythonDataObjectsTest.TestPythonTupleToStructuredList (1228 of 2145)
PASS: lldb-unit :: Utility/./UtilityTests/ScalarTest.GetValue (1229 of 2145)
PASS: lldb-unit :: Utility/./UtilityTests/RangeTest.ContainsRange (1230 of 2145)
PASS: lldb-api :: functionalities/thread/concurrent_events/TestConcurrentTwoBreakpointsOneSignal.py (1231 of 2145)
PASS: lldb-shell :: BuildScript/compiler-full-path.test (1232 of 2145)
PASS: lldb-api :: commands/watchpoints/watchpoint_set_command/TestWatchLocationWithWatchSet.py (1233 of 2145)
PASS: lldb-api :: commands/expression/import-std-module/unique_ptr/TestUniquePtrFromStdModule.py (1234 of 2145)
PASS: lldb-unit :: Core/./LLDBCoreTests/CommunicationTest.SynchronizeWhileClosing (1235 of 2145)
PASS: lldb-shell :: Reproducer/Functionalities/TestStepping.test (1236 of 2145)
UNSUPPORTED: lldb-api :: functionalities/thread/create_during_step/TestCreateDuringStep.py (1237 of 2145)
PASS: lldb-api :: commands/version/TestVersion.py (1238 of 2145)
UNSUPPORTED: lldb-api :: functionalities/data-formatter/data-formatter-stl/libstdcpp/list/TestDataFormatterStdList.py (1239 of 2145)
PASS: lldb-unit :: Utility/./UtilityTests/StringListTest.ForRange (1240 of 2145)
PASS: lldb-api :: lang/cpp/frame-var-anon-unions/TestFrameVariableAnonymousUnions.py (1241 of 2145)
PASS: lldb-api :: functionalities/data-formatter/data-formatter-stl/libcxx/iterator/TestDataFormatterLibccIterator.py (1242 of 2145)
PASS: lldb-api :: commands/expression/call-throws/TestCallThatThrows.py (1243 of 2145)
PASS: lldb-api :: functionalities/memory/find/TestMemoryFind.py (1244 of 2145)
PASS: lldb-shell :: ObjectFile/ELF/section-overlap.yaml (1245 of 2145)
PASS: lldb-unit :: Utility/./UtilityTests/UriParserTest.BracketedHostnameWithPortIPv4 (1246 of 2145)
PASS: lldb-shell :: ObjectFile/Breakpad/discontiguous-sections.test (1247 of 2145)
PASS: lldb-unit :: Utility/./UtilityTests/VMRange.Ordering (1248 of 2145)
PASS: lldb-unit :: Host/./HostTests/MainLoopTest.DetectsEOF (1249 of 2145)
PASS: lldb-api :: functionalities/data-formatter/ostypeformatting/TestFormattersOsType.py (1250 of 2145)
PASS: lldb-unit :: Utility/./UtilityTests/StatusTest.ErrorConstructor (1251 of 2145)
PASS: lldb-unit :: Utility/./UtilityTests/UriParserTest.PortOverflow (1252 of 2145)
PASS: lldb-api :: macosx/save_crashlog/TestSaveCrashlog.py (1253 of 2145)
PASS: lldb-unit :: UnwindAssembly/x86/./UnwindAssemblyx86Tests/Testx86AssemblyInspectionEngine.TestStackRealignMSVC_i386 (1254 of 2145)
PASS: lldb-shell :: SymbolFile/NativePDB/function-types-classes.cpp (1255 of 2145)
PASS: lldb-unit :: Symbol/./SymbolTests/SymbolsTest.TerminateLocateExecutableSymbolFileForUnknownExecutableAndUnknownSymbolFile (1256 of 2145)
TIMEOUT: lldb-api :: macosx/simulator/TestSimulatorPlatform.py (1257 of 2145)
******************** TEST 'lldb-api :: macosx/simulator/TestSimulatorPlatform.py' FAILED ********************
Script:
--
/usr/local/Frameworks/Python.framework/Versions/3.7/bin/python3.7 /Users/buildslave/jenkins/workspace/lldb-cmake/llvm-project/lldb/test/API/dotest.py -s /Users/buildslave/jenkins/workspace/lldb-cmake/lldb-build/lldb-test-traces -S nm -u CXXFLAGS -u CFLAGS --codesign-identity - --server /Users/buildslave/jenkins/workspace/lldb-cmake/lldb-build/./bin/debugserver --arch x86_64 --build-dir /Users/buildslave/jenkins/workspace/lldb-cmake/lldb-build/lldb-test-build.noindex -s=/Users/buildslave/jenkins/workspace/lldb-cmake/test/logs -t --env TERM=vt100 --env LLVM_LIBS_DIR=/Users/buildslave/jenkins/workspace/lldb-cmake/lldb-build/./lib --arch x86_64 --build-dir /Users/buildslave/jenkins/workspace/lldb-cmake/lldb-build/lldb-test-build.noindex --lldb-module-cache-dir /Users/buildslave/jenkins/workspace/lldb-cmake/lldb-build/lldb-test-build.noindex/module-cache-lldb/lldb-api --clang-module-cache-dir /Users/buildslave/jenkins/workspace/lldb-cmake/lldb-build/lldb-test-build.noindex/module-cache-clang/lldb-api --executable /Users/buildslave/jenkins/workspace/lldb-cmake/lldb-build/./bin/lldb --compiler /Users/buildslave/jenkins/workspace/lldb-cmake/lldb-build/./bin/clang --dsymutil /Users/buildslave/jenkins/workspace/lldb-cmake/lldb-build/./bin/dsymutil --filecheck /Users/buildslave/jenkins/workspace/lldb-cmake/lldb-build/./bin/FileCheck --yaml2obj /Users/buildslave/jenkins/workspace/lldb-cmake/lldb-build/./bin/yaml2obj --lldb-libs-dir /Users/buildslave/jenkins/workspace/lldb-cmake/lldb-build/./lib /Users/buildslave/jenkins/workspace/lldb-cmake/llvm-project/lldb/test/API/macosx/simulator -p TestSimulatorPlatform.py
--
Exit Code: -9
Timeout: Reached timeout of 600 seconds

Hide Details

Command Output (stdout): -- lldb version 12.0.99 clang revision 1cee33e9dbb6c30ff1dd30453a263696bfccfd8a llvm revision 1cee33e9dbb6c30ff1dd30453a263696bfccfd8a

Hide Details

-- Command Output (stderr): --

Hide Details

Session logs for test failures/errors/unexpected successes will go into directory '/Users/buildslave/jenkins/workspace/lldb-cmake/test/logs' Change dir to: /Users/buildslave/jenkins/workspace/lldb-cmake/llvm-project/lldb/test/API/macosx/simulator runCmd: settings clear -all output:

Hide Details

runCmd: settings set symbols.enable-external-lookup false output:

Hide Details

runCmd: settings set target.inherit-tcc true output:

Hide Details

runCmd: settings set target.auto-apply-fixits false output:

Hide Details

runCmd: settings set plugin.process.gdb-remote.packet-timeout 60 output:

Hide Details

runCmd: settings set symbols.clang-modules-cache-path "/Users/buildslave/jenkins/workspace/lldb-cmake/lldb-build/lldb-test-build.noindex/module-cache-lldb/lldb-api" output:

Hide Details

runCmd: settings set use-color false output:

Hide Details

runCmd: setting set target.prefer-dynamic-value no-dynamic-values output:

Hide Details

runCmd: log enable gdb-remote packets -f /Users/buildslave/jenkins/workspace/lldb-cmake/lldb-build/lldb-test-build.noindex/macosx/simulator/TestSimulatorPlatform.test_ios/packets.log output:

Hide Details

Ran command: "log enable gdb-remote packets -f /Users/buildslave/jenkins/workspace/lldb-cmake/lldb-build/lldb-test-build.noindex/macosx/simulator/TestSimulatorPlatform.test_ios/packets.log"

Hide Details

Got output:

Hide Details

Hide Details

runCmd: image list -b -t output: [ 0] a.out x86_64-apple-ios13.5.0-simulator [ 1] dyld x86_64-apple-macosx10.15.0 [ 2] dyld_sim x86_64-apple-ios13.5.0-simulator [ 3] libc++.1.dylib x86_64-apple-ios13.5.0-simulator [ 4] libSystem.B.dylib x86_64-apple-ios13.5.0-simulator [ 5] libc++abi.dylib x86_64-apple-ios13.5.0-simulator [ 6] libcache.dylib x86_64-apple-ios13.5.0-simulator [ 7] libcommonCrypto.dylib x86_64-apple-ios13.5.0-simulator [ 8] libcompiler_rt.dylib x86_64-apple-ios13.5.0-simulator [ 9] libcopyfile.dylib x86_64-apple-ios13.5.0-simulator [ 10] libcorecrypto.dylib x86_64-apple-ios13.5.0-simulator [ 11] libdispatch.dylib x86_64-apple-ios13.5.0-simulator [ 12] libdyld.dylib x86_64-apple-ios13.5.0-simulator [ 13] liblaunch.dylib x86_64-apple-ios13.5.0-simulator [ 14] libmacho.dylib x86_64-apple-ios13.5.0-simulator [ 15] libremovefile.dylib x86_64-apple-ios13.5.0-simulator [ 16] libsystem_asl.dylib x86_64-apple-ios13.5.0-simulator [ 17] libsystem_blocks.dylib x86_64-apple-ios13.5.0-simulator [ 18] libsystem_c.dylib x86_64-apple-ios13.5.0-simulator [ 19] libsystem_configuration.dylib x86_64-apple-ios13.5.0-simulator [ 20] libsystem_containermanager.dylib x86_64-apple-ios13.5.0-simulator [ 21] libsystem_coreservices.dylib x86_64-apple-ios13.5.0-simulator [ 22] libsystem_darwin.dylib x86_64-apple-ios13.5.0-simulator [ 23] libsystem_dnssd.dylib x86_64-apple-ios13.5.0-simulator [ 24] libsystem_featureflags.dylib x86_64-apple-ios13.5.0-simulator [ 25] libsystem_info.dylib x86_64-apple-ios13.5.0-simulator [ 26] libsystem_m.dylib x86_64-apple-ios13.5.0-simulator [ 27] libsystem_malloc.dylib x86_64-apple-ios13.5.0-simulator [ 28] libsystem_notify.dylib x86_64-apple-ios13.5.0-simulator [ 29] libsystem_sandbox.dylib x86_64-apple-ios13.5.0-simulator [ 30] libsystem_sim_kernel.dylib x86_64-apple-ios13.5.0-simulator [ 31] libsystem_sim_platform.dylib x86_64-apple-ios13.5.0-simulator [ 32] libsystem_sim_pthread.dylib x86_64-apple-ios13.5.0-simulator [ 33] libsystem_trace.dylib x86_64-apple-ios13.5.0-simulator [ 34] libunwind.dylib x86_64-apple-ios13.5.0-simulator [ 35] libxpc.dylib x86_64-apple-ios13.5.0-simulator [ 36] libsystem_sim_pthread_host.dylib x86_64-apple-ios13.5.0-simulator [ 37] libsystem_sim_platform_host.dylib x86_64-apple-ios13.5.0-simulator [ 38] libsystem_sim_kernel_host.dylib x86_64-apple-ios13.5.0-simulator [ 39] libsystem_kernel.dylib x86_64-apple-macosx10.15.0-simulator(0x00007fff51b5a000) [ 40] libobjc.A.dylib x86_64-apple-ios13.5.0-simulator [ 41] libsystem_platform.dylib x86_64-apple-macosx10.15.0-simulator(0x00007fff51bfd000) [ 42] libsystem_pthread.dylib x86_64-apple-macosx10.15.0-simulator(0x00007fff51c06000)

Hide Details

Hide Details

Ran command: "image list -b -t"

Hide Details

Got output: [ 0] a.out x86_64-apple-ios13.5.0-simulator [ 1] dyld x86_64-apple-macosx10.15.0 [ 2] dyld_sim x86_64-apple-ios13.5.0-simulator [ 3] libc++.1.dylib x86_64-apple-ios13.5.0-simulator [ 4] libSystem.B.dylib x86_64-apple-ios13.5.0-simulator [ 5] libc++abi.dylib x86_64-apple-ios13.5.0-simulator [ 6] libcache.dylib x86_64-apple-ios13.5.0-simulator [ 7] libcommonCrypto.dylib x86_64-apple-ios13.5.0-simulator [ 8] libcompiler_rt.dylib x86_64-apple-ios13.5.0-simulator [ 9] libcopyfile.dylib x86_64-apple-ios13.5.0-simulator [ 10] libcorecrypto.dylib x86_64-apple-ios13.5.0-simulator [ 11] libdispatch.dylib x86_64-apple-ios13.5.0-simulator [ 12] libdyld.dylib x86_64-apple-ios13.5.0-simulator [ 13] liblaunch.dylib x86_64-apple-ios13.5.0-simulator [ 14] libmacho.dylib x86_64-apple-ios13.5.0-simulator [ 15] libremovefile.dylib x86_64-apple-ios13.5.0-simulator [ 16] libsystem_asl.dylib x86_64-apple-ios13.5.0-simulator [ 17] libsystem_blocks.dylib x86_64-apple-ios13.5.0-simulator [ 18] libsystem_c.dylib x86_64-apple-ios13.5.0-simulator [ 19] libsystem_configuration.dylib x86_64-apple-ios13.5.0-simulator [ 20] libsystem_containermanager.dylib x86_64-apple-ios13.5.0-simulator [ 21] libsystem_coreservices.dylib x86_64-apple-ios13.5.0-simulator [ 22] libsystem_darwin.dylib x86_64-apple-ios13.5.0-simulator [ 23] libsystem_dnssd.dylib x86_64-apple-ios13.5.0-simulator [ 24] libsystem_featureflags.dylib x86_64-apple-ios13.5.0-simulator [ 25] libsystem_info.dylib x86_64-apple-ios13.5.0-simulator [ 26] libsystem_m.dylib x86_64-apple-ios13.5.0-simulator [ 27] libsystem_malloc.dylib x86_64-apple-ios13.5.0-simulator [ 28] libsystem_notify.dylib x86_64-apple-ios13.5.0-simulator [ 29] libsystem_sandbox.dylib x86_64-apple-ios13.5.0-simulator [ 30] libsystem_sim_kernel.dylib x86_64-apple-ios13.5.0-simulator [ 31] libsystem_sim_platform.dylib x86_64-apple-ios13.5.0-simulator [ 32] libsystem_sim_pthread.dylib x86_64-apple-ios13.5.0-simulator [ 33] libsystem_trace.dylib x86_64-apple-ios13.5.0-simulator [ 34] libunwind.dylib x86_64-apple-ios13.5.0-simulator [ 35] libxpc.dylib x86_64-apple-ios13.5.0-simulator [ 36] libsystem_sim_pthread_host.dylib x86_64-apple-ios13.5.0-simulator [ 37] libsystem_sim_platform_host.dylib x86_64-apple-ios13.5.0-simulator [ 38] libsystem_sim_kernel_host.dylib x86_64-apple-ios13.5.0-simulator [ 39] libsystem_kernel.dylib x86_64-apple-macosx10.15.0-simulator(0x00007fff51b5a000) [ 40] libobjc.A.dylib x86_64-apple-ios13.5.0-simulator [ 41] libsystem_platform.dylib x86_64-apple-macosx10.15.0-simulator(0x00007fff51bfd000) [ 42] libsystem_pthread.dylib x86_64-apple-macosx10.15.0-simulator(0x00007fff51c06000)

Hide Details

Expecting regex pattern: "a\.out x86_64-apple-ios13.5.*-simulator" (was found, matched "a.out x86_64-apple-ios13.5.0-simulator")

Hide Details

<bound method SBProcess.Kill of <lldb.SBProcess; proxy of <Swig Object of type 'lldb::SBProcess *' at 0x109d82fc0> >>: success

Hide Details

PASS: LLDB (/Users/buildslave/jenkins/workspace/lldb-cmake/lldb-build/bin/clang-x86_64) :: test_ios (TestSimulatorPlatform.TestSimulatorPlatformLaunching) runCmd: settings clear -all output:

Hide Details

runCmd: settings set symbols.enable-external-lookup false output:

Hide Details

runCmd: settings set target.inherit-tcc true output:

Hide Details

runCmd: settings set target.auto-apply-fixits false output:

Hide Details

runCmd: settings set plugin.process.gdb-remote.packet-timeout 60 output:

Hide Details

runCmd: settings set symbols.clang-modules-cache-path "/Users/buildslave/jenkins/workspace/lldb-cmake/lldb-build/lldb-test-build.noindex/module-cache-lldb/lldb-api" output:

Hide Details

runCmd: settings set use-color false output:

Hide Details

runCmd: setting set target.prefer-dynamic-value no-dynamic-values output:

Hide Details

UNSUPPORTED: LLDB (/Users/buildslave/jenkins/workspace/lldb-cmake/lldb-build/bin/clang-x86_64) :: test_ios_backdeploy_apple_silicon (TestSimulatorPlatform.TestSimulatorPlatformLaunching) (skipping due to the following parameter(s): architecture) runCmd: settings clear -all output:

Hide Details

runCmd: settings set symbols.enable-external-lookup false output:

Hide Details

runCmd: settings set target.inherit-tcc true output:

Hide Details

runCmd: settings set target.auto-apply-fixits false output:

Hide Details

runCmd: settings set plugin.process.gdb-remote.packet-timeout 60 output:

Hide Details

runCmd: settings set symbols.clang-modules-cache-path "/Users/buildslave/jenkins/workspace/lldb-cmake/lldb-build/lldb-test-build.noindex/module-cache-lldb/lldb-api" output:

Hide Details

runCmd: settings set use-color false output:

Hide Details

runCmd: setting set target.prefer-dynamic-value no-dynamic-values output:

Hide Details

runCmd: log enable gdb-remote packets -f /Users/buildslave/jenkins/workspace/lldb-cmake/lldb-build/lldb-test-build.noindex/macosx/simulator/TestSimulatorPlatform.test_ios_backdeploy_x86/packets.log output:

Hide Details

Ran command: "log enable gdb-remote packets -f /Users/buildslave/jenkins/workspace/lldb-cmake/lldb-build/lldb-test-build.noindex/macosx/simulator/TestSimulatorPlatform.test_ios_backdeploy_x86/packets.log"

Hide Details

Got output:

Hide Details

Hide Details

runCmd: image list -b -t output: [ 0] a.out x86_64-apple-ios13.0.0-simulator [ 1] dyld x86_64-apple-macosx10.15.0 [ 2] dyld_sim x86_64-apple-ios13.5.0-simulator [ 3] libc++.1.dylib x86_64-apple-ios13.5.0-simulator [ 4] libSystem.B.dylib x86_64-apple-ios13.5.0-simulator [ 5] libc++abi.dylib x86_64-apple-ios13.5.0-simulator [ 6] libcache.dylib x86_64-apple-ios13.5.0-simulator [ 7] libcommonCrypto.dylib x86_64-apple-ios13.5.0-simulator [ 8] libcompiler_rt.dylib x86_64-apple-ios13.5.0-simulator [ 9] libcopyfile.dylib x86_64-apple-ios13.5.0-simulator [ 10] libcorecrypto.dylib x86_64-apple-ios13.5.0-simulator [ 11] libdispatch.dylib x86_64-apple-ios13.5.0-simulator [ 12] libdyld.dylib x86_64-apple-ios13.5.0-simulator [ 13] liblaunch.dylib x86_64-apple-ios13.5.0-simulator [ 14] libmacho.dylib x86_64-apple-ios13.5.0-simulator [ 15] libremovefile.dylib x86_64-apple-ios13.5.0-simulator [ 16] libsystem_asl.dylib x86_64-apple-ios13.5.0-simulator [ 17] libsystem_blocks.dylib x86_64-apple-ios13.5.0-simulator [ 18] libsystem_c.dylib x86_64-apple-ios13.5.0-simulator [ 19] libsystem_configuration.dylib x86_64-apple-ios13.5.0-simulator [ 20] libsystem_containermanager.dylib x86_64-apple-ios13.5.0-simulator [ 21] libsystem_coreservices.dylib x86_64-apple-ios13.5.0-simulator [ 22] libsystem_darwin.dylib x86_64-apple-ios13.5.0-simulator [ 23] libsystem_dnssd.dylib x86_64-apple-ios13.5.0-simulator [ 24] libsystem_featureflags.dylib x86_64-apple-ios13.5.0-simulator [ 25] libsystem_info.dylib x86_64-apple-ios13.5.0-simulator [ 26] libsystem_m.dylib x86_64-apple-ios13.5.0-simulator [ 27] libsystem_malloc.dylib x86_64-apple-ios13.5.0-simulator [ 28] libsystem_notify.dylib x86_64-apple-ios13.5.0-simulator [ 29] libsystem_sandbox.dylib x86_64-apple-ios13.5.0-simulator [ 30] libsystem_sim_kernel.dylib x86_64-apple-ios13.5.0-simulator [ 31] libsystem_sim_platform.dylib x86_64-apple-ios13.5.0-simulator [ 32] libsystem_sim_pthread.dylib x86_64-apple-ios13.5.0-simulator [ 33] libsystem_trace.dylib x86_64-apple-ios13.5.0-simulator [ 34] libunwind.dylib x86_64-apple-ios13.5.0-simulator [ 35] libxpc.dylib x86_64-apple-ios13.5.0-simulator [ 36] libsystem_sim_pthread_host.dylib x86_64-apple-ios13.5.0-simulator [ 37] libsystem_sim_platform_host.dylib x86_64-apple-ios13.5.0-simulator [ 38] libsystem_sim_kernel_host.dylib x86_64-apple-ios13.5.0-simulator [ 39] libsystem_kernel.dylib x86_64-apple-macosx10.15.0-simulator(0x00007fff51b5a000) [ 40] libobjc.A.dylib x86_64-apple-ios13.5.0-simulator [ 41] libsystem_platform.dylib x86_64-apple-macosx10.15.0-simulator(0x00007fff51bfd000) [ 42] libsystem_pthread.dylib x86_64-apple-macosx10.15.0-simulator(0x00007fff51c06000)

Hide Details

Hide Details

Ran command: "image list -b -t"

Hide Details

Got output: [ 0] a.out x86_64-apple-ios13.0.0-simulator [ 1] dyld x86_64-apple-macosx10.15.0 [ 2] dyld_sim x86_64-apple-ios13.5.0-simulator [ 3] libc++.1.dylib x86_64-apple-ios13.5.0-simulator [ 4] libSystem.B.dylib x86_64-apple-ios13.5.0-simulator [ 5] libc++abi.dylib x86_64-apple-ios13.5.0-simulator [ 6] libcache.dylib x86_64-apple-ios13.5.0-simulator [ 7] libcommonCrypto.dylib x86_64-apple-ios13.5.0-simulator [ 8] libcompiler_rt.dylib x86_64-apple-ios13.5.0-simulator [ 9] libcopyfile.dylib x86_64-apple-ios13.5.0-simulator [ 10] libcorecrypto.dylib x86_64-apple-ios13.5.0-simulator [ 11] libdispatch.dylib x86_64-apple-ios13.5.0-simulator [ 12] libdyld.dylib x86_64-apple-ios13.5.0-simulator [ 13] liblaunch.dylib x86_64-apple-ios13.5.0-simulator [ 14] libmacho.dylib x86_64-apple-ios13.5.0-simulator [ 15] libremovefile.dylib x86_64-apple-ios13.5.0-simulator [ 16] libsystem_asl.dylib x86_64-apple-ios13.5.0-simulator [ 17] libsystem_blocks.dylib x86_64-apple-ios13.5.0-simulator [ 18] libsystem_c.dylib x86_64-apple-ios13.5.0-simulator [ 19] libsystem_configuration.dylib x86_64-apple-ios13.5.0-simulator [ 20] libsystem_containermanager.dylib x86_64-apple-ios13.5.0-simulator [ 21] libsystem_coreservices.dylib x86_64-apple-ios13.5.0-simulator [ 22] libsystem_darwin.dylib x86_64-apple-ios13.5.0-simulator [ 23] libsystem_dnssd.dylib x86_64-apple-ios13.5.0-simulator [ 24] libsystem_featureflags.dylib x86_64-apple-ios13.5.0-simulator [ 25] libsystem_info.dylib x86_64-apple-ios13.5.0-simulator [ 26] libsystem_m.dylib x86_64-apple-ios13.5.0-simulator [ 27] libsystem_malloc.dylib x86_64-apple-ios13.5.0-simulator [ 28] libsystem_notify.dylib x86_64-apple-ios13.5.0-simulator [ 29] libsystem_sandbox.dylib x86_64-apple-ios13.5.0-simulator [ 30] libsystem_sim_kernel.dylib x86_64-apple-ios13.5.0-simulator [ 31] libsystem_sim_platform.dylib x86_64-apple-ios13.5.0-simulator [ 32] libsystem_sim_pthread.dylib x86_64-apple-ios13.5.0-simulator [ 33] libsystem_trace.dylib x86_64-apple-ios13.5.0-simulator [ 34] libunwind.dylib x86_64-apple-ios13.5.0-simulator [ 35] libxpc.dylib x86_64-apple-ios13.5.0-simulator [ 36] libsystem_sim_pthread_host.dylib x86_64-apple-ios13.5.0-simulator [ 37] libsystem_sim_platform_host.dylib x86_64-apple-ios13.5.0-simulator [ 38] libsystem_sim_kernel_host.dylib x86_64-apple-ios13.5.0-simulator [ 39] libsystem_kernel.dylib x86_64-apple-macosx10.15.0-simulator(0x00007fff51b5a000) [ 40] libobjc.A.dylib x86_64-apple-ios13.5.0-simulator [ 41] libsystem_platform.dylib x86_64-apple-macosx10.15.0-simulator(0x00007fff51bfd000) [ 42] libsystem_pthread.dylib x86_64-apple-macosx10.15.0-simulator(0x00007fff51c06000)

Hide Details

Expecting regex pattern: "a\.out x86_64-apple-ios13.0.*-simulator" (was found, matched "a.out x86_64-apple-ios13.0.0-simulator")

Hide Details

<bound method SBProcess.Kill of <lldb.SBProcess; proxy of <Swig Object of type 'lldb::SBProcess *' at 0x1087b3db0> >>: success

Hide Details

PASS: LLDB (/Users/buildslave/jenkins/workspace/lldb-cmake/lldb-build/bin/clang-x86_64) :: test_ios_backdeploy_x86 (TestSimulatorPlatform.TestSimulatorPlatformLaunching) runCmd: settings clear -all output:

Hide Details

runCmd: settings set symbols.enable-external-lookup false output:

Hide Details

runCmd: settings set target.inherit-tcc true output:

Hide Details

runCmd: settings set target.auto-apply-fixits false output:

Hide Details

runCmd: settings set plugin.process.gdb-remote.packet-timeout 60 output:

Hide Details

runCmd: settings set symbols.clang-modules-cache-path "/Users/buildslave/jenkins/workspace/lldb-cmake/lldb-build/lldb-test-build.noindex/module-cache-lldb/lldb-api" output:

Hide Details

runCmd: settings set use-color false output:

Hide Details

runCmd: setting set target.prefer-dynamic-value no-dynamic-values output:

Hide Details

runCmd: log enable gdb-remote packets -f /Users/buildslave/jenkins/workspace/lldb-cmake/lldb-build/lldb-test-build.noindex/macosx/simulator/TestSimulatorPlatform.test_lc_version_min_iphoneos/packets.log output:

Hide Details

Ran command: "log enable gdb-remote packets -f /Users/buildslave/jenkins/workspace/lldb-cmake/lldb-build/lldb-test-build.noindex/macosx/simulator/TestSimulatorPlatform.test_lc_version_min_iphoneos/packets.log"

Hide Details

Got output:

Hide Details

Hide Details

runCmd: image list -b -t output: [ 0] a.out x86_64-apple-ios11.0.0-simulator [ 1] dyld x86_64-apple-macosx10.15.0 [ 2] dyld_sim x86_64-apple-ios13.5.0-simulator [ 3] libc++.1.dylib x86_64-apple-ios13.5.0-simulator [ 4] libSystem.B.dylib x86_64-apple-ios13.5.0-simulator [ 5] libc++abi.dylib x86_64-apple-ios13.5.0-simulator [ 6] libcache.dylib x86_64-apple-ios13.5.0-simulator [ 7] libcommonCrypto.dylib x86_64-apple-ios13.5.0-simulator [ 8] libcompiler_rt.dylib x86_64-apple-ios13.5.0-simulator [ 9] libcopyfile.dylib x86_64-apple-ios13.5.0-simulator [ 10] libcorecrypto.dylib x86_64-apple-ios13.5.0-simulator [ 11] libdispatch.dylib x86_64-apple-ios13.5.0-simulator [ 12] libdyld.dylib x86_64-apple-ios13.5.0-simulator [ 13] liblaunch.dylib x86_64-apple-ios13.5.0-simulator [ 14] libmacho.dylib x86_64-apple-ios13.5.0-simulator [ 15] libremovefile.dylib x86_64-apple-ios13.5.0-simulator [ 16] libsystem_asl.dylib x86_64-apple-ios13.5.0-simulator [ 17] libsystem_blocks.dylib x86_64-apple-ios13.5.0-simulator [ 18] libsystem_c.dylib x86_64-apple-ios13.5.0-simulator [ 19] libsystem_configuration.dylib x86_64-apple-ios13.5.0-simulator [ 20] libsystem_containermanager.dylib x86_64-apple-ios13.5.0-simulator [ 21] libsystem_coreservices.dylib x86_64-apple-ios13.5.0-simulator [ 22] libsystem_darwin.dylib x86_64-apple-ios13.5.0-simulator [ 23] libsystem_dnssd.dylib x86_64-apple-ios13.5.0-simulator [ 24] libsystem_featureflags.dylib x86_64-apple-ios13.5.0-simulator [ 25] libsystem_info.dylib x86_64-apple-ios13.5.0-simulator [ 26] libsystem_m.dylib x86_64-apple-ios13.5.0-simulator [ 27] libsystem_malloc.dylib x86_64-apple-ios13.5.0-simulator [ 28] libsystem_notify.dylib x86_64-apple-ios13.5.0-simulator [ 29] libsystem_sandbox.dylib x86_64-apple-ios13.5.0-simulator [ 30] libsystem_sim_kernel.dylib x86_64-apple-ios13.5.0-simulator [ 31] libsystem_sim_platform.dylib x86_64-apple-ios13.5.0-simulator [ 32] libsystem_sim_pthread.dylib x86_64-apple-ios13.5.0-simulator [ 33] libsystem_trace.dylib x86_64-apple-ios13.5.0-simulator [ 34] libunwind.dylib x86_64-apple-ios13.5.0-simulator [ 35] libxpc.dylib x86_64-apple-ios13.5.0-simulator [ 36] libsystem_sim_pthread_host.dylib x86_64-apple-ios13.5.0-simulator [ 37] libsystem_sim_platform_host.dylib x86_64-apple-ios13.5.0-simulator [ 38] libsystem_sim_kernel_host.dylib x86_64-apple-ios13.5.0-simulator [ 39] libsystem_kernel.dylib x86_64-apple-macosx10.15.0-simulator(0x00007fff51b5a000) [ 40] libobjc.A.dylib x86_64-apple-ios13.5.0-simulator [ 41] libsystem_platform.dylib x86_64-apple-macosx10.15.0-simulator(0x00007fff51bfd000) [ 42] libsystem_pthread.dylib x86_64-apple-macosx10.15.0-simulator(0x00007fff51c06000)

Hide Details

Hide Details

Ran command: "image list -b -t"

Hide Details

Got output: [ 0] a.out x86_64-apple-ios11.0.0-simulator [ 1] dyld x86_64-apple-macosx10.15.0 [ 2] dyld_sim x86_64-apple-ios13.5.0-simulator [ 3] libc++.1.dylib x86_64-apple-ios13.5.0-simulator [ 4] libSystem.B.dylib x86_64-apple-ios13.5.0-simulator [ 5] libc++abi.dylib x86_64-apple-ios13.5.0-simulator [ 6] libcache.dylib x86_64-apple-ios13.5.0-simulator [ 7] libcommonCrypto.dylib x86_64-apple-ios13.5.0-simulator [ 8] libcompiler_rt.dylib x86_64-apple-ios13.5.0-simulator [ 9] libcopyfile.dylib x86_64-apple-ios13.5.0-simulator [ 10] libcorecrypto.dylib x86_64-apple-ios13.5.0-simulator [ 11] libdispatch.dylib x86_64-apple-ios13.5.0-simulator [ 12] libdyld.dylib x86_64-apple-ios13.5.0-simulator [ 13] liblaunch.dylib x86_64-apple-ios13.5.0-simulator [ 14] libmacho.dylib x86_64-apple-ios13.5.0-simulator [ 15] libremovefile.dylib x86_64-apple-ios13.5.0-simulator [ 16] libsystem_asl.dylib x86_64-apple-ios13.5.0-simulator [ 17] libsystem_blocks.dylib x86_64-apple-ios13.5.0-simulator [ 18] libsystem_c.dylib x86_64-apple-ios13.5.0-simulator [ 19] libsystem_configuration.dylib x86_64-apple-ios13.5.0-simulator [ 20] libsystem_containermanager.dylib x86_64-apple-ios13.5.0-simulator [ 21] libsystem_coreservices.dylib x86_64-apple-ios13.5.0-simulator [ 22] libsystem_darwin.dylib x86_64-apple-ios13.5.0-simulator [ 23] libsystem_dnssd.dylib x86_64-apple-ios13.5.0-simulator [ 24] libsystem_featureflags.dylib x86_64-apple-ios13.5.0-simulator [ 25] libsystem_info.dylib x86_64-apple-ios13.5.0-simulator [ 26] libsystem_m.dylib x86_64-apple-ios13.5.0-simulator [ 27] libsystem_malloc.dylib x86_64-apple-ios13.5.0-simulator [ 28] libsystem_notify.dylib x86_64-apple-ios13.5.0-simulator [ 29] libsystem_sandbox.dylib x86_64-apple-ios13.5.0-simulator [ 30] libsystem_sim_kernel.dylib x86_64-apple-ios13.5.0-simulator [ 31] libsystem_sim_platform.dylib x86_64-apple-ios13.5.0-simulator [ 32] libsystem_sim_pthread.dylib x86_64-apple-ios13.5.0-simulator [ 33] libsystem_trace.dylib x86_64-apple-ios13.5.0-simulator [ 34] libunwind.dylib x86_64-apple-ios13.5.0-simulator [ 35] libxpc.dylib x86_64-apple-ios13.5.0-simulator [ 36] libsystem_sim_pthread_host.dylib x86_64-apple-ios13.5.0-simulator [ 37] libsystem_sim_platform_host.dylib x86_64-apple-ios13.5.0-simulator [ 38] libsystem_sim_kernel_host.dylib x86_64-apple-ios13.5.0-simulator [ 39] libsystem_kernel.dylib x86_64-apple-macosx10.15.0-simulator(0x00007fff51b5a000) [ 40] libobjc.A.dylib x86_64-apple-ios13.5.0-simulator [ 41] libsystem_platform.dylib x86_64-apple-macosx10.15.0-simulator(0x00007fff51bfd000) [ 42] libsystem_pthread.dylib x86_64-apple-macosx10.15.0-simulator(0x00007fff51c06000)

Hide Details

Expecting regex pattern: "a\.out x86_64-apple-ios11.0.*-simulator" (was found, matched "a.out x86_64-apple-ios11.0.0-simulator")

Hide Details

<bound method SBProcess.Kill of <lldb.SBProcess; proxy of <Swig Object of type 'lldb::SBProcess *' at 0x10863dc60> >>: success

Hide Details

PASS: LLDB (/Users/buildslave/jenkins/workspace/lldb-cmake/lldb-build/bin/clang-x86_64) :: test_lc_version_min_iphoneos (TestSimulatorPlatform.TestSimulatorPlatformLaunching) runCmd: settings clear -all output:

Hide Details

runCmd: settings set symbols.enable-external-lookup false output:

Hide Details

runCmd: settings set target.inherit-tcc true output:

Hide Details

runCmd: settings set target.auto-apply-fixits false output:

Hide Details

runCmd: settings set plugin.process.gdb-remote.packet-timeout 60 output:

Hide Details

runCmd: settings set symbols.clang-modules-cache-path "/Users/buildslave/jenkins/workspace/lldb-cmake/lldb-build/lldb-test-build.noindex/module-cache-lldb/lldb-api" output:

Hide Details

runCmd: settings set use-color false output:

Hide Details

runCmd: setting set target.prefer-dynamic-value no-dynamic-values output:

Hide Details

runCmd: log enable gdb-remote packets -f /Users/buildslave/jenkins/workspace/lldb-cmake/lldb-build/lldb-test-build.noindex/macosx/simulator/TestSimulatorPlatform.test_lc_version_min_macosx/packets.log output:

Hide Details

Ran command: "log enable gdb-remote packets -f /Users/buildslave/jenkins/workspace/lldb-cmake/lldb-build/lldb-test-build.noindex/macosx/simulator/TestSimulatorPlatform.test_lc_version_min_macosx/packets.log"

Hide Details

Got output:

Hide Details

Hide Details

runCmd: image list -b -t output: [ 0] a.out x86_64-apple-macosx10.9.0 [ 1] dyld x86_64-apple-macosx10.15.0 [ 2] libc++.1.dylib x86_64-apple-macosx10.15.0 [ 3] libSystem.B.dylib x86_64-apple-macosx10.15.0 [ 4] libc++abi.dylib x86_64-apple-macosx10.15.0 [ 5] libcache.dylib x86_64-apple-macosx10.15.0 [ 6] libcommonCrypto.dylib x86_64-apple-macosx10.15.0 [ 7] libcompiler_rt.dylib x86_64-apple-macosx10.15.0 [ 8] libcopyfile.dylib x86_64-apple-macosx10.15.0 [ 9] libcorecrypto.dylib x86_64-apple-macosx10.15.0 [ 10] libdispatch.dylib x86_64-apple-macosx10.15.0 [ 11] libdyld.dylib x86_64-apple-macosx10.15.0 [ 12] libkeymgr.dylib x86_64-apple-macosx10.15.0 [ 13] liblaunch.dylib x86_64-apple-macosx10.15.0 [ 14] libmacho.dylib x86_64-apple-macosx10.15.0 [ 15] libquarantine.dylib x86_64-apple-macosx10.15.0 [ 16] libremovefile.dylib x86_64-apple-macosx10.15.0 [ 17] libsystem_asl.dylib x86_64-apple-macosx10.15.0 [ 18] libsystem_blocks.dylib x86_64-apple-macosx10.15.0 [ 19] libsystem_c.dylib x86_64-apple-macosx10.15.0 [ 20] libsystem_configuration.dylib x86_64-apple-macosx10.15.0 [ 21] libsystem_coreservices.dylib x86_64-apple-macosx10.15.0 [ 22] libsystem_darwin.dylib x86_64-apple-macosx10.15.0 [ 23] libsystem_dnssd.dylib x86_64-apple-macosx10.15.0 [ 24] libsystem_featureflags.dylib x86_64-apple-macosx10.15.0 [ 25] libsystem_info.dylib x86_64-apple-macosx10.15.0 [ 26] libsystem_m.dylib x86_64-apple-macosx10.15.0 [ 27] libsystem_malloc.dylib x86_64-apple-macosx10.15.0 [ 28] libsystem_networkextension.dylib x86_64-apple-macosx10.15.0 [ 29] libsystem_notify.dylib x86_64-apple-macosx10.15.0 [ 30] libsystem_sandbox.dylib x86_64-apple-macosx10.15.0 [ 31] libsystem_secinit.dylib x86_64-apple-macosx10.15.0 [ 32] libsystem_kernel.dylib x86_64-apple-macosx10.15.0 [ 33] libsystem_platform.dylib x86_64-apple-macosx10.15.0 [ 34] libsystem_pthread.dylib x86_64-apple-macosx10.15.0 [ 35] libsystem_symptoms.dylib x86_64-apple-macosx10.15.0 [ 36] libsystem_trace.dylib x86_64-apple-macosx10.15.0 [ 37] libunwind.dylib x86_64-apple-macosx10.15.0 [ 38] libxpc.dylib x86_64-apple-macosx10.15.0 [ 39] libobjc.A.dylib x86_64-apple-macosx10.15.0

Hide Details

Hide Details

Ran command: "image list -b -t"

Hide Details

Got output: [ 0] a.out x86_64-apple-macosx10.9.0 [ 1] dyld x86_64-apple-macosx10.15.0 [ 2] libc++.1.dylib x86_64-apple-macosx10.15.0 [ 3] libSystem.B.dylib x86_64-apple-macosx10.15.0 [ 4] libc++abi.dylib x86_64-apple-macosx10.15.0 [ 5] libcache.dylib x86_64-apple-macosx10.15.0 [ 6] libcommonCrypto.dylib x86_64-apple-macosx10.15.0 [ 7] libcompiler_rt.dylib x86_64-apple-macosx10.15.0 [ 8] libcopyfile.dylib x86_64-apple-macosx10.15.0 [ 9] libcorecrypto.dylib x86_64-apple-macosx10.15.0 [ 10] libdispatch.dylib x86_64-apple-macosx10.15.0 [ 11] libdyld.dylib x86_64-apple-macosx10.15.0 [ 12] libkeymgr.dylib x86_64-apple-macosx10.15.0 [ 13] liblaunch.dylib x86_64-apple-macosx10.15.0 [ 14] libmacho.dylib x86_64-apple-macosx10.15.0 [ 15] libquarantine.dylib x86_64-apple-macosx10.15.0 [ 16] libremovefile.dylib x86_64-apple-macosx10.15.0 [ 17] libsystem_asl.dylib x86_64-apple-macosx10.15.0 [ 18] libsystem_blocks.dylib x86_64-apple-macosx10.15.0 [ 19] libsystem_c.dylib x86_64-apple-macosx10.15.0 [ 20] libsystem_configuration.dylib x86_64-apple-macosx10.15.0 [ 21] libsystem_coreservices.dylib x86_64-apple-macosx10.15.0 [ 22] libsystem_darwin.dylib x86_64-apple-macosx10.15.0 [ 23] libsystem_dnssd.dylib x86_64-apple-macosx10.15.0 [ 24] libsystem_featureflags.dylib x86_64-apple-macosx10.15.0 [ 25] libsystem_info.dylib x86_64-apple-macosx10.15.0 [ 26] libsystem_m.dylib x86_64-apple-macosx10.15.0 [ 27] libsystem_malloc.dylib x86_64-apple-macosx10.15.0 [ 28] libsystem_networkextension.dylib x86_64-apple-macosx10.15.0 [ 29] libsystem_notify.dylib x86_64-apple-macosx10.15.0 [ 30] libsystem_sandbox.dylib x86_64-apple-macosx10.15.0 [ 31] libsystem_secinit.dylib x86_64-apple-macosx10.15.0 [ 32] libsystem_kernel.dylib x86_64-apple-macosx10.15.0 [ 33] libsystem_platform.dylib x86_64-apple-macosx10.15.0 [ 34] libsystem_pthread.dylib x86_64-apple-macosx10.15.0 [ 35] libsystem_symptoms.dylib x86_64-apple-macosx10.15.0 [ 36] libsystem_trace.dylib x86_64-apple-macosx10.15.0 [ 37] libunwind.dylib x86_64-apple-macosx10.15.0 [ 38] libxpc.dylib x86_64-apple-macosx10.15.0 [ 39] libobjc.A.dylib x86_64-apple-macosx10.15.0

Hide Details

Expecting regex pattern: "a\.out x86_64-apple-macosx10.9.*" (was found, matched "a.out x86_64-apple-macosx10.9.0")

Hide Details

--

Hide Details

******************** PASS: lldb-shell :: Watchpoint/SetErrorCases.test (1258 of 2145) PASS: lldb-unit :: Utility/./UtilityTests/DataExtractorTest.GetULEB128_bit63 (1259 of 2145) PASS: lldb-unit :: Expression/./ExpressionTests/DWARFExpression.DW_OP_pick (1260 of 2145) PASS: lldb-unit :: Utility/./UtilityTests/ArgsTest.TestSingleArg (1261 of 2145) PASS: lldb-shell :: SymbolFile/DWARF/debug_aranges-empty-section.s (1262 of 2145) PASS: lldb-api :: lang/cpp/member-and-local-vars-with-same-name/TestMembersAndLocalsWithSameName.py (1263 of 2145) PASS: lldb-unit :: Process/gdb-remote/./ProcessGdbRemoteTests/GDBRemoteCommunicationClientTest.ReadRegister (1264 of 2145) PASS: lldb-api :: functionalities/breakpoint/source_regexp/TestSourceRegexBreakpoints.py (1265 of 2145) PASS: lldb-unit :: ScriptInterpreter/Python/./ScriptInterpreterPythonTests/PythonDataObjectsTest.TestGlobalNameResolutionNoDot (1266 of 2145) UNSUPPORTED: lldb-api :: benchmarks/libcxxlist/TestBenchmarkLibcxxList.py (1267 of 2145) PASS: lldb-api :: tools/lldb-server/register-reading/TestGdbRemoteGPacket.py (1268 of 2145) PASS: lldb-unit :: Process/gdb-remote/./ProcessGdbRemoteTests/GDBRemoteCommunicationClientTest.GetModulesInfo (1269 of 2145) PASS: lldb-unit :: Symbol/./SymbolTests/TestTypeSystemClang.TestGetBasicTypeFromName (1270 of 2145) PASS: lldb-unit :: SymbolFile/DWARF/./SymbolFileDWARFTests/SymbolFileDWARFTests.TestAbbrevOrder1Start5 (1271 of 2145) PASS: lldb-unit :: Utility/./UtilityTests/StructuredDataTest.StringDump (1272 of 2145) PASS: lldb-unit :: Interpreter/./InterpreterTests/CompletionTest.FileCompletionAbsolute (1273 of 2145) PASS: lldb-unit :: Symbol/./SymbolTests/TestTypeSystemClang.TestRecordHasFields (1274 of 2145) PASS: lldb-api :: commands/expression/call-function/TestCallBuiltinFunction.py (1275 of 2145) PASS: lldb-shell :: SymbolFile/DWARF/DW_AT_location-DW_AT_const_value.s (1276 of 2145) PASS: lldb-shell :: SymbolFile/DWARF/split-dwarf-multiple-cu.ll (1277 of 2145) PASS: lldb-api :: commands/gui/invalid-args/TestInvalidArgsGui.py (1278 of 2145) PASS: lldb-unit :: Utility/./UtilityTests/FileSpecTest.FileAndDirectoryComponents (1279 of 2145) PASS: lldb-api :: commands/target/dump-symtab-demangle/TestDumpSymtabDemangle.py (1280 of 2145) PASS: lldb-unit :: UnwindAssembly/x86/./UnwindAssemblyx86Tests/Testx86AssemblyInspectionEngine.TestSubESP (1281 of 2145) PASS: lldb-api :: functionalities/data-formatter/data-formatter-synthval/TestDataFormatterSynthVal.py (1282 of 2145) PASS: lldb-shell :: ObjectFile/ELF/section-types-edgecases.yaml (1283 of 2145) PASS: lldb-api :: python_api/frame/inlines/TestInlinedFrame.py (1284 of 2145) PASS: lldb-unit :: Signals/./SignalsTests/UnixSignalsTest.GetInfo (1285 of 2145) PASS: lldb-api :: commands/expression/persistent_variables/TestPersistentVariables.py (1286 of 2145) UNSUPPORTED: lldb-api :: functionalities/data-formatter/data-formatter-stl/libstdcpp/map/TestDataFormatterStdMap.py (1287 of 2145) PASS: lldb-api :: functionalities/unwind/zeroth_frame/TestZerothFrame.py (1288 of 2145) PASS: lldb-unit :: Editline/./EditlineTests/EditlineTestFixture.EditlineReceivesSingleLineText (1289 of 2145) PASS: lldb-api :: functionalities/tsan/thread_leak/TestTsanThreadLeak.py (1290 of 2145) PASS: lldb-unit :: Host/./HostTests/FileSystemTest.MakeAbsolute (1291 of 2145) PASS: lldb-api :: python_api/interpreter/TestRunCommandInterpreterAPI.py (1292 of 2145) PASS: lldb-api :: tools/lldb-vscode/console/TestVSCode_console.py (1293 of 2145) PASS: lldb-api :: functionalities/plugins/python_os_plugin/stepping_plugin_threads/TestOSPluginStepping.py (1294 of 2145) PASS: lldb-unit :: Utility/./UtilityTests/PassiveReplayTest.InstrumentedBar (1295 of 2145) PASS: lldb-unit :: Utility/./UtilityTests/ArchSpecTest.YAML (1296 of 2145) PASS: lldb-unit :: Utility/./UtilityTests/StringListTest.JoinMultiCharSeparator (1297 of 2145) PASS: lldb-api :: functionalities/gdb_remote_client/TestWriteMemory.py (1298 of 2145) PASS: lldb-unit :: UnwindAssembly/ARM64/./Arm64InstEmulationTests/TestArm64InstEmulation.TestRegisterDoubleSpills (1299 of 2145) PASS: lldb-unit :: Utility/./UtilityTests/EnvironmentTest.EnvpConversion (1300 of 2145) PASS: lldb-unit :: Utility/./UtilityTests/AnsiTerminal.AtEnd (1301 of 2145) PASS: lldb-shell :: SymbolFile/DWARF/anon_class_w_and_wo_export_symbols.ll (1302 of 2145) PASS: lldb-unit :: UnwindAssembly/x86/./UnwindAssemblyx86Tests/Testx86AssemblyInspectionEngine.TestPushR12 (1303 of 2145) PASS: lldb-api :: functionalities/history/TestHistoryRecall.py (1304 of 2145) PASS: lldb-api :: lang/objc/bitfield_ivars/TestBitfieldIvars.py (1305 of 2145) PASS: lldb-unit :: Utility/./UtilityTests/FileSpecTest.EqualSeparator (1306 of 2145) PASS: lldb-api :: functionalities/breakpoint/breakpoint_callback_command_source/TestBreakpointCallbackCommandSource.py (1307 of 2145) PASS: lldb-unit :: DataFormatter/./LLDBFormatterTests/StringPrinterTests.SwiftUTF8 (1308 of 2145) PASS: lldb-api :: lang/objc/rdar-10967107/TestRdar10967107.py (1309 of 2145) PASS: lldb-unit :: Utility/./UtilityTests/ListenerTest.GetEventImmediate (1310 of 2145) UNSUPPORTED: lldb-shell :: Register/x86-64-zmm-read.test (1311 of 2145) PASS: lldb-unit :: Utility/./UtilityTests/XcodeSDKTest.MergeTest (1312 of 2145) PASS: lldb-api :: commands/expression/timeout/TestCallWithTimeout.py (1313 of 2145) PASS: lldb-api :: lang/cpp/limit-debug-info/TestWithLimitDebugInfo.py (1314 of 2145) PASS: lldb-unit :: Utility/./UtilityTests/SerializationRountripTest.SerializeDeserializeObjectReference (1315 of 2145) UNSUPPORTED: lldb-api :: functionalities/data-formatter/data-formatter-stl/libstdcpp/unique_ptr/TestDataFormatterStdUniquePtr.py (1316 of 2145) PASS: lldb-api :: functionalities/breakpoint/step_over_breakpoint/TestStepOverBreakpoint.py (1317 of 2145) PASS: lldb-api :: lang/c/local_variables/TestLocalVariables.py (1318 of 2145) PASS: lldb-api :: commands/target/modules/search-paths/insert/TestTargetModulesSearchpathsInsert.py (1319 of 2145) PASS: lldb-unit :: Utility/./UtilityTests/RangeDataVector.FindEntryIndexesThatContain (1320 of 2145) PASS: lldb-api :: functionalities/archives/TestBSDArchives.py (1321 of 2145) PASS: lldb-api :: lang/cpp/extern_c/TestExternCSymbols.py (1322 of 2145) PASS: lldb-api :: lang/cpp/typedef/TestCppTypedef.py (1323 of 2145) PASS: lldb-shell :: SymbolFile/NativePDB/source-list.cpp (1324 of 2145) PASS: lldb-api :: lang/objc/modules-compile-error/TestModulesCompileError.py (1325 of 2145) PASS: lldb-shell :: SymbolFile/DWARF/clang-ast-from-dwarf-objc-property.m (1326 of 2145) UNSUPPORTED: lldb-api :: functionalities/darwin_log/filter/exact_match/message/TestDarwinLogFilterMatchMessage.py (1327 of 2145) PASS: lldb-api :: lang/c/global_variables/TestGlobalVariables.py (1328 of 2145) PASS: lldb-unit :: Language/Highlighting/./HighlighterTests/HighlighterTest.DefaultHighlighterWithCursorOutOfBounds (1329 of 2145) PASS: lldb-unit :: Utility/./UtilityTests/StringLexerTest.NextIf (1330 of 2145) PASS: lldb-unit :: Language/Highlighting/./HighlighterTests/HighlighterTest.ClangCursorPos (1331 of 2145) PASS: lldb-api :: functionalities/return-value/TestReturnValue.py (1332 of 2145) PASS: lldb-shell :: SymbolFile/Breakpad/stack-cfi-parsing.test (1333 of 2145) PASS: lldb-api :: commands/expression/argument_passing_restrictions/TestArgumentPassingRestrictions.py (1334 of 2145) PASS: lldb-api :: tools/lldb-server/TestGdbRemoteExitCode.py (1335 of 2145) PASS: lldb-unit :: Utility/./UtilityTests/ScalarTest.LongLongAssigmentOperator (1336 of 2145) PASS: lldb-unit :: Utility/./UtilityTests/BinaryStreamTest.PutSLEB128TwoBytes (1337 of 2145) PASS: lldb-unit :: Core/./LLDBCoreTests/RichManglingContextTest.Basic (1338 of 2145) PASS: lldb-unit :: Utility/./UtilityTests/StreamTest.AddressSize (1339 of 2145) UNSUPPORTED: lldb-api :: benchmarks/continue/TestBenchmarkContinue.py (1340 of 2145) PASS: lldb-api :: lang/cpp/covariant-return-types/TestCovariantReturnTypes.py (1341 of 2145) PASS: lldb-unit :: Utility/./UtilityTests/NameMatchesTest.Contains (1342 of 2145) PASS: lldb-shell :: SymbolFile/DWARF/debug-types-dwarf5.s (1343 of 2145) PASS: lldb-unit :: Utility/./UtilityTests/StatusTest.ErrorConversion (1344 of 2145) PASS: lldb-unit :: Utility/./UtilityTests/UserIDResolver.GetUserName (1345 of 2145) PASS: lldb-api :: commands/expression/invalid-args/TestInvalidArgsExpression.py (1346 of 2145) PASS: lldb-api :: commands/expression/ignore-artificial-constructors/TestIgnoreArtificialConstructors.py (1347 of 2145) PASS: lldb-shell :: ObjectFile/ELF/aarch64-relocations.yaml (1348 of 2145) PASS: lldb-shell :: SymbolFile/DWARF/find-basic-type.cpp (1349 of 2145) PASS: lldb-shell :: SymbolFile/DWARF/debug_loc-aslr.s (1350 of 2145) PASS: lldb-api :: sample_test/TestSampleInlineTest.py (1351 of 2145) PASS: lldb-unit :: Core/./LLDBCoreTests/RichManglingContextTest.FromCxxMethodName (1352 of 2145) PASS: lldb-shell :: Driver/TestHelp.test (1353 of 2145) PASS: lldb-api :: python_api/watchpoint/watchlocation/TestTargetWatchAddress.py (1354 of 2145) PASS: lldb-shell :: SymbolFile/DWARF/DW_AT_loclists_base.s (1355 of 2145) PASS: lldb-api :: macosx/queues/TestQueues.py (1356 of 2145) PASS: lldb-unit :: Host/./HostTests/ProcessLaunchInfoTest.Constructor (1357 of 2145) PASS: lldb-unit :: UnwindAssembly/x86/./UnwindAssemblyx86Tests/Testx86AssemblyInspectionEngine.TestPushEDX (1358 of 2145) PASS: lldb-api :: lang/objc/orderedset/TestOrderedSet.py (1359 of 2145) PASS: lldb-shell :: Minidump/Windows/find-module.test (1360 of 2145) PASS: lldb-api :: functionalities/data-formatter/data-formatter-objc/TestDataFormatterObjNSException.py (1361 of 2145) UNSUPPORTED: lldb-shell :: Register/x86-gp-write.test (1362 of 2145) PASS: lldb-api :: lang/c/record_decl_in_expr/TestRecordDeclInExpr.py (1363 of 2145) PASS: lldb-api :: macosx/load-kext/TestLoadKext.py (1364 of 2145) PASS: lldb-unit :: Host/./HostTests/Host.GetEnvironment (1365 of 2145) PASS: lldb-unit :: Utility/./UtilityTests/StringListTest.JoinSingle (1366 of 2145) PASS: lldb-api :: functionalities/gdb_remote_client/TestJLink6Armv7RegisterDefinition.py (1367 of 2145) PASS: lldb-shell :: Breakpoint/split-dwarf-5-addrbase.test (1368 of 2145) PASS: lldb-unit :: UnwindAssembly/ARM64/./Arm64InstEmulationTests/TestArm64InstEmulation.TestCFARegisterTrackedAcrossJumps (1369 of 2145) UNSUPPORTED: lldb-api :: tools/lldb-server/libraries-svr4/TestGdbRemoteLibrariesSvr4Support.py (1370 of 2145) PASS: lldb-unit :: Host/./HostTests/SocketAddressTest.GetAddressInfo (1371 of 2145) PASS: lldb-api :: functionalities/tail_call_frames/disambiguate_tail_call_seq/TestDisambiguateTailCallSeq.py (1372 of 2145) UNSUPPORTED: lldb-shell :: Register/x86-64-xmm16-read.test (1373 of 2145) PASS: lldb-unit :: Utility/./UtilityTests/ProcessInstanceInfo.Yaml (1374 of 2145) PASS: lldb-unit :: debugserver/./debugserverTests/RNBSocket.LoopBackConnectIPv6 (1375 of 2145) PASS: lldb-unit :: Utility/./UtilityTests/StringListTest.GetMaxStringLengthMixed (1376 of 2145) PASS: lldb-shell :: SymbolFile/DWARF/dwarf5-atomic.s (1377 of 2145) PASS: lldb-unit :: Utility/./UtilityTests/StreamTest.PutHex64ByteOrderBig (1378 of 2145) PASS: lldb-unit :: Expression/./ExpressionTests/DiagnosticManagerTest.AddDiagnostic (1379 of 2145) PASS: lldb-api :: functionalities/gdb_remote_client/TestRegDefinitionInParts.py (1380 of 2145) PASS: lldb-unit :: Process/minidump/./LLDBMinidumpTests/MinidumpParserTest.GetThreadContext_x86_32 (1381 of 2145) PASS: lldb-api :: tools/lldb-server/TestAppleSimulatorOSType.py (1382 of 2145) PASS: lldb-api :: functionalities/data-formatter/data-formatter-objc/TestDataFormatterObjCNSBundle.py (1383 of 2145) PASS: lldb-api :: lang/objc/objc-checker/TestObjCCheckers.py (1384 of 2145) PASS: lldb-unit :: Process/gdb-remote/./ProcessGdbRemoteTests/GDBRemoteCommunicationClientTest.GetModulesInfoInvalidResponse (1385 of 2145) PASS: lldb-shell :: ScriptInterpreter/Python/python.test (1386 of 2145) PASS: lldb-unit :: Symbol/./SymbolTests/Type.GetTypeScopeAndBasename (1387 of 2145) PASS: lldb-api :: commands/expression/multiline-navigation/TestMultilineNavigation.py (1388 of 2145) PASS: lldb-api :: commands/expression/expr-in-syscall/TestExpressionInSyscall.py (1389 of 2145) PASS: lldb-shell :: Driver/TestProcessAttach.test (1390 of 2145) PASS: lldb-api :: functionalities/target_var/TestTargetVar.py (1391 of 2145) PASS: lldb-api :: commands/expression/rdar44436068/Test128BitsInteger.py (1392 of 2145) PASS: lldb-unit :: Symbol/./SymbolTests/TestTypeSystemClang.TestGetTypeClassNested (1393 of 2145) PASS: lldb-api :: functionalities/data-formatter/data-formatter-categories/TestDataFormatterCategories.py (1394 of 2145) PASS: lldb-api :: commands/expression/import-std-module/queue/TestQueueFromStdModule.py (1395 of 2145) PASS: lldb-api :: commands/frame/diagnose/local-variable/TestLocalVariable.py (1396 of 2145) UNSUPPORTED: lldb-api :: benchmarks/expression/TestExpressionCmd.py (1397 of 2145) PASS: lldb-shell :: Minidump/memory-region-from-module.yaml (1398 of 2145) PASS: lldb-api :: commands/target/stop-hook/delete/TestTargetStopHookDelete.py (1399 of 2145) PASS: lldb-shell :: SymbolFile/DWARF/childless-compile-unit.s (1400 of 2145) PASS: lldb-api :: functionalities/data-formatter/data-formatter-stl/libcxx/variant/TestDataFormatterLibcxxVariant.py (1401 of 2145) PASS: lldb-unit :: Utility/./UtilityTests/OptionsWithRawTest.QuotedSuffix (1402 of 2145) UNSUPPORTED: lldb-api :: functionalities/tty/TestTerminal.py (1403 of 2145) PASS: lldb-api :: iohandler/autosuggestion/TestAutosuggestion.py (1404 of 2145) PASS: lldb-unit :: Utility/./UtilityTests/UriParserTest.SchemeHostSeparator3 (1405 of 2145) PASS: lldb-api :: functionalities/thread/concurrent_events/TestConcurrentSignalDelayBreak.py (1406 of 2145) PASS: lldb-unit :: Utility/./UtilityTests/StringListTest.InsertStringAtIndexStart (1407 of 2145) PASS: lldb-unit :: Utility/./UtilityTests/UriParserTest.BracketedHostname (1408 of 2145) PASS: lldb-unit :: Utility/./UtilityTests/StringListTest.AppendList (1409 of 2145) PASS: lldb-unit :: Utility/./UtilityTests/StringExtractorTest.GetU32LittleEndian (1410 of 2145) PASS: lldb-shell :: ObjectFile/Breakpad/breakpad-identification.test (1411 of 2145) PASS: lldb-unit :: Utility/./UtilityTests/DataExtractorTest.UncommonAddressSize (1412 of 2145) PASS: lldb-api :: commands/command/script/import/rdar-12586188/TestRdar12586188.py (1413 of 2145) PASS: lldb-api :: macosx/indirect_symbol/TestIndirectSymbols.py (1414 of 2145) PASS: lldb-unit :: Utility/./UtilityTests/StreamTest.PutULEB128 (1415 of 2145) UNSUPPORTED: lldb-shell :: ScriptInterpreter/Lua/nested_sessions.test (1416 of 2145) PASS: lldb-unit :: Utility/./UtilityTests/ArgsTest.TestQuotedTrailingBackslash (1417 of 2145) PASS: lldb-api :: commands/expression/persistent_ptr_update/TestPersistentPtrUpdate.py (1418 of 2145) PASS: lldb-api :: functionalities/data-formatter/data-formatter-stl/libcxx/string/TestDataFormatterLibcxxString.py (1419 of 2145) PASS: lldb-unit :: Host/./HostTests/File.GetWaitableHandleFileno (1420 of 2145) PASS: lldb-api :: functionalities/gdb_remote_client/TestPlatformClient.py (1421 of 2145) UNSUPPORTED: lldb-shell :: Process/Windows/exception_access_violation.cpp (1422 of 2145) PASS: lldb-unit :: Utility/./UtilityTests/ArgsTest.TestSingleQuotedArgWithSpace (1423 of 2145) PASS: lldb-api :: lang/objc/self/TestObjCSelf.py (1424 of 2145) PASS: lldb-unit :: Utility/./UtilityTests/VASprintfTest.BufferResize (1425 of 2145) PASS: lldb-api :: commands/watchpoints/step_over_watchpoint/TestStepOverWatchpoint.py (1426 of 2145) PASS: lldb-unit :: Utility/./UtilityTests/VMRange.SetEndAddress (1427 of 2145) UNSUPPORTED: lldb-api :: arm/breakpoint-thumb-codesection/TestBreakpointThumbCodesection.py (1428 of 2145) PASS: lldb-unit :: Language/CPlusPlus/./LanguageCPlusPlusTests/CPlusPlusLanguage.ExtractContextAndIdentifier (1429 of 2145) PASS: lldb-api :: functionalities/data-formatter/data-formatter-script/TestDataFormatterScript.py (1430 of 2145) PASS: lldb-unit :: Process/./ProcessEventDataTests/ProcessEventDataTest.ShouldStop (1431 of 2145) PASS: lldb-unit :: Utility/./UtilityTests/UriParserTest.BracketedHostnameWithColon (1432 of 2145) PASS: lldb-api :: lang/cpp/class-template-parameter-pack/TestClassTemplateParameterPack.py (1433 of 2145) PASS: lldb-api :: functionalities/data-formatter/data-formatter-stl/libcxx/multimap/TestDataFormatterLibccMultiMap.py (1434 of 2145) PASS: lldb-api :: lang/cpp/unique-types/TestUniqueTypes.py (1435 of 2145) PASS: lldb-unit :: Utility/./UtilityTests/AnsiTerminal.AtStart (1436 of 2145) PASS: lldb-unit :: Symbol/./SymbolTests/TestTypeSystemClang.TestGetTypeClassDeclType (1437 of 2145) UNSUPPORTED: lldb-shell :: Register/x86-64-xmm16-write.test (1438 of 2145) PASS: lldb-shell :: ObjectFile/ELF/gnu-debuglink.yaml (1439 of 2145) UNSUPPORTED: lldb-api :: tools/lldb-server/TestGdbRemote_vContThreads.py (1440 of 2145) PASS: lldb-api :: functionalities/paths/TestPaths.py (1441 of 2145) PASS: lldb-unit :: UnwindAssembly/x86/./UnwindAssemblyx86Tests/Testx86AssemblyInspectionEngine.TestDisassemblyMidFunctionEpilogues (1442 of 2145) UNSUPPORTED: lldb-api :: tools/lldb-server/TestGdbRemoteAuxvSupport.py (1443 of 2145) PASS: lldb-api :: lang/cpp/global_variables/TestCPPGlobalVariables.py (1444 of 2145) PASS: lldb-unit :: Platform/./LLDBPlatformTests/PlatformAppleSimulatorTest.TestHostPlatformToSim (1445 of 2145) PASS: lldb-unit :: Utility/./UtilityTests/GeneratorTest.YamlMultiProvider (1446 of 2145) PASS: lldb-unit :: SymbolFile/NativePDB/./SymbolFileNativePDBTests/PDBFPOProgramToDWARFExpressionTests.UnknownOp (1447 of 2145) PASS: lldb-api :: commands/expression/calculator_mode/TestCalculatorMode.py (1448 of 2145) PASS: lldb-unit :: Expression/./ExpressionTests/CppModuleConfigurationTest.LibCppV2 (1449 of 2145) PASS: lldb-api :: functionalities/thread/crash_during_step/TestCrashDuringStep.py (1450 of 2145) PASS: lldb-unit :: Utility/./UtilityTests/StreamTest.PutCharNull (1451 of 2145) PASS: lldb-unit :: Symbol/./SymbolTests/LineEntryTest.GetSameLineContiguousAddressRangeNoInlines (1452 of 2145) PASS: lldb-unit :: UnwindAssembly/x86/./UnwindAssemblyx86Tests/Testx86AssemblyInspectionEngine.TestPopEBX (1453 of 2145) PASS: lldb-unit :: Expression/./ExpressionTests/CppModuleConfigurationTest.MissingUsrInclude (1454 of 2145) PASS: lldb-api :: lang/cpp/template/TestTemplateArgs.py (1455 of 2145) PASS: lldb-api :: functionalities/thread/concurrent_events/TestConcurrentTwoBreakpointThreads.py (1456 of 2145) PASS: lldb-unit :: Utility/./UtilityTests/StringListTest.GetMaxStringLengthIncreasingSize (1457 of 2145) PASS: lldb-unit :: Utility/./UtilityTests/BinaryStreamTest.PutULEB128FiveBytes (1458 of 2145) PASS: lldb-api :: functionalities/breakpoint/breakpoint_ignore_count/TestBreakpointIgnoreCount.py (1459 of 2145) PASS: lldb-unit :: Utility/./UtilityTests/XcodeSDKTest.ParseTest (1460 of 2145) PASS: lldb-unit :: Breakpoint/./LLDBBreakpointTests/BreakpointIDTest.StringIsBreakpointName (1461 of 2145) PASS: lldb-unit :: Utility/./UtilityTests/StreamTest.PutHex16ByteOrderLittle (1462 of 2145) PASS: lldb-unit :: UnwindAssembly/x86/./UnwindAssemblyx86Tests/Testx86AssemblyInspectionEngine.TestPushESI (1463 of 2145) PASS: lldb-api :: lang/cpp/rvalue-references/TestRvalueReferences.py (1464 of 2145) PASS: lldb-unit :: Utility/./UtilityTests/TimerTest.CategoryTimes2 (1465 of 2145) PASS: lldb-unit :: ScriptInterpreter/Python/./ScriptInterpreterPythonTests/PythonDataObjectsTest.TestPythonTupleInitializerList2 (1466 of 2145) PASS: lldb-api :: functionalities/data-formatter/data-formatter-stl/libcxx/map/TestDataFormatterLibccMap.py (1467 of 2145) PASS: lldb-api :: lang/cpp/llvm-style/TestLLVMStyle.py (1468 of 2145) PASS: lldb-unit :: Process/minidump/./LLDBMinidumpTests/MinidumpParserTest.GetMemoryRegionInfoFromMemory64List (1469 of 2145) PASS: lldb-unit :: Utility/./UtilityTests/StreamTest.Indent (1470 of 2145) PASS: lldb-unit :: Core/./LLDBCoreTests/UniqueCStringMap.NoDefaultConstructor (1471 of 2145) PASS: lldb-unit :: Expression/./ExpressionTests/CppModuleConfigurationTest.LinuxLocalLibCpp (1472 of 2145) PASS: lldb-unit :: Utility/./UtilityTests/BinaryStreamTest.PutSLEB128Zero (1473 of 2145) PASS: lldb-unit :: tools/lldb-server/tests/./LLDBServerTests/StandardStartupTest.TestStopReplyContainsThreadPcs (1474 of 2145) PASS: lldb-api :: tools/lldb-vscode/breakpoint/TestVSCode_setExceptionBreakpoints.py (1475 of 2145) PASS: lldb-unit :: ScriptInterpreter/Python/./ScriptInterpreterPythonTests/PythonDataObjectsTest.TestTypeNameResolutionNoDot (1476 of 2145) PASS: lldb-unit :: Language/Highlighting/./HighlighterTests/HighlighterTest.ClangIdentifiers (1477 of 2145) PASS: lldb-api :: functionalities/type_completion/TestTypeCompletion.py (1478 of 2145) PASS: lldb-shell :: ObjectFile/PECOFF/basic-info-arm.yaml (1479 of 2145) PASS: lldb-shell :: SymbolFile/DWARF/debug-types-line-tables.s (1480 of 2145) PASS: lldb-unit :: Utility/./UtilityTests/GeneratorTest.Create (1481 of 2145) PASS: lldb-shell :: Host/TestCustomShell.test (1482 of 2145) PASS: lldb-api :: tools/lldb-vscode/breakpoint-events/TestVSCode_breakpointEvents.py (1483 of 2145) PASS: lldb-unit :: Utility/./UtilityTests/StreamTeeTest.SetStreamAtIndexOutOfBounds (1484 of 2145) PASS: lldb-api :: functionalities/thread/concurrent_events/TestConcurrentWatchBreakDelay.py (1485 of 2145) PASS: lldb-api :: types/TestCharType.py (1486 of 2145) PASS: lldb-unit :: Utility/./UtilityTests/StreamTest.PutSLEB128 (1487 of 2145) PASS: lldb-unit :: Utility/./UtilityTests/StringExtractorTest.GetHexU8_Extra_NoEof (1488 of 2145) PASS: lldb-shell :: SymbolFile/DWARF/dwarf5-partial-index.cpp (1489 of 2145) PASS: lldb-shell :: ObjectFile/ELF/PT_LOAD-overlap-PT_INTERP.yaml (1490 of 2145) PASS: lldb-api :: functionalities/object-file/TestImageListMultiArchitecture.py (1491 of 2145) PASS: lldb-unit :: Utility/./UtilityTests/UUIDTest.StringConverion (1492 of 2145) PASS: lldb-unit :: Interpreter/./InterpreterTests/CompletionTest.DirCompletionAbsolute (1493 of 2145) PASS: lldb-api :: functionalities/thread/concurrent_events/TestConcurrentBreakpointOneDelayBreakpointThreads.py (1494 of 2145) PASS: lldb-unit :: Utility/./UtilityTests/DataExtractorTest.GetDouble (1495 of 2145) PASS: lldb-unit :: ScriptInterpreter/Python/./ScriptInterpreterPythonTests/PythonDataObjectsTest.TestPythonDictionaryManipulation (1496 of 2145) PASS: lldb-api :: functionalities/data-formatter/type_summary_list_script/TestTypeSummaryListScript.py (1497 of 2145) PASS: lldb-api :: lang/objc/single-entry-dictionary/TestObjCSingleEntryDictionary.py (1498 of 2145) PASS: lldb-api :: functionalities/breakpoint/consecutive_breakpoints/TestConsecutiveBreakpoints.py (1499 of 2145) PASS: lldb-unit :: Utility/./UtilityTests/SharedCluster.ClusterManager (1500 of 2145) PASS: lldb-unit :: Core/./LLDBCoreTests/MangledTest.NameIndexes_FindFunctionSymbols (1501 of 2145) PASS: lldb-shell :: Settings/TestSettingsSet.test (1502 of 2145) PASS: lldb-unit :: Process/minidump/./LLDBMinidumpTests/MinidumpParserTest.GetLinuxProcStatus (1503 of 2145) PASS: lldb-shell :: Reproducer/TestCrash.test (1504 of 2145) PASS: lldb-api :: functionalities/target-new-solib-notifications/TestModuleLoadedNotifys.py (1505 of 2145) PASS: lldb-api :: functionalities/data-formatter/synthcapping/TestSyntheticCapping.py (1506 of 2145) PASS: lldb-shell :: Commands/CommandScriptImmediateOutput/CommandScriptImmediateOutputFile.test (1507 of 2145) PASS: lldb-api :: python_api/lldbutil/TestSwigVersion.py (1508 of 2145) PASS: lldb-shell :: SymbolFile/DWARF/DW_AT_low_pc-addrx.s (1509 of 2145) PASS: lldb-unit :: Utility/./UtilityTests/UriParserTest.SchemeHostSeparator4 (1510 of 2145) PASS: lldb-api :: functionalities/breakpoint/breakpoint_by_line_and_column/TestBreakpointByLineAndColumn.py (1511 of 2145) PASS: lldb-api :: functionalities/data-formatter/data-formatter-python-synth/TestDataFormatterPythonSynth.py (1512 of 2145) PASS: lldb-unit :: Process/gdb-remote/./ProcessGdbRemoteTests/GDBRemoteCommunicationClientTest.TestPacketSpeedJSON (1513 of 2145) PASS: lldb-unit :: Utility/./UtilityTests/StreamTest.PutBytesAsRawHex8ToLittleEndian (1514 of 2145) PASS: lldb-unit :: Process/minidump/./LLDBMinidumpTests/MinidumpParserTest.GetMemoryRegionInfoLinuxMaps (1515 of 2145) PASS: lldb-shell :: SymbolFile/DWARF/find-inline-method.s (1516 of 2145) UNSUPPORTED: lldb-api :: functionalities/longjmp/TestLongjmp.py (1517 of 2145) PASS: lldb-api :: commands/frame/var-scope/TestFrameVariableScope.py (1518 of 2145) PASS: lldb-shell :: SymbolFile/Breakpad/symtab.test (1519 of 2145) PASS: lldb-shell :: BuildScript/script-args.test (1520 of 2145) UNSUPPORTED: lldb-shell :: Register/x86-gp-read.test (1521 of 2145) PASS: lldb-unit :: Utility/./UtilityTests/BinaryStreamTest.PutSLEB128OneByte (1522 of 2145) PASS: lldb-unit :: Host/./HostTests/NativeProcessProtocolTest.SetBreakpointFailRead (1523 of 2145) PASS: lldb-api :: functionalities/pre_run_dylibs/TestPreRunDylibs.py (1524 of 2145) PASS: lldb-api :: functionalities/data-formatter/data-formatter-objc/TestDataFormatterObjCNSError.py (1525 of 2145) PASS: lldb-api :: lang/objc/objc-foundation-dictionary-empty/TestNSDictionary0.py (1526 of 2145) PASS: lldb-unit :: Language/Highlighting/./HighlighterTests/HighlighterTest.ClangCursorOutOfBounds (1527 of 2145) PASS: lldb-shell :: ObjectFile/ELF/section-types.yaml (1528 of 2145) UNSUPPORTED: lldb-api :: functionalities/data-formatter/data-formatter-stl/libstdcpp/iterator/TestDataFormatterStdIterator.py (1529 of 2145) PASS: lldb-api :: python_api/value_var_update/TestValueVarUpdate.py (1530 of 2145) PASS: lldb-unit :: Utility/./UtilityTests/CompletionRequest.FakeLastArg (1531 of 2145) UNSUPPORTED: lldb-api :: functionalities/unwind/standard/TestStandardUnwind.py (1532 of 2145) PASS: lldb-shell :: Commands/command-script-import.test (1533 of 2145) UNSUPPORTED: lldb-api :: functionalities/darwin_log/filter/regex/message/TestDarwinLogFilterRegexMessage.py (1534 of 2145) UNSUPPORTED: lldb-api :: functionalities/darwin_log/filter/exact_match/category/TestDarwinLogFilterMatchCategory.py (1535 of 2145) PASS: lldb-unit :: Utility/./UtilityTests/RangeTest.Constructor (1536 of 2145) UNSUPPORTED: lldb-shell :: ScriptInterpreter/Lua/lua-python.test (1537 of 2145) PASS: lldb-unit :: DataFormatter/./LLDBFormatterTests/TypeMatcherTests.RegexMatchPart (1538 of 2145) PASS: lldb-unit :: Utility/./UtilityTests/StreamTest.PutHex8 (1539 of 2145) PASS: lldb-unit :: Utility/./UtilityTests/ScalarTest.Scalar_512 (1540 of 2145) PASS: lldb-unit :: Utility/./UtilityTests/LogTest.LLDB_LOG_nullptr (1541 of 2145) PASS: lldb-shell :: ObjectFile/wasm/embedded-debug-sections.yaml (1542 of 2145) PASS: lldb-shell :: ScriptInterpreter/Python/crashlog.test (1543 of 2145) PASS: lldb-shell :: ScriptInterpreter/None/none.test (1544 of 2145) PASS: lldb-api :: functionalities/plugins/command_plugin/TestPluginCommands.py (1545 of 2145) PASS: lldb-unit :: Utility/./UtilityTests/BinaryStreamTest.PutSLEB128ThreeBytes (1546 of 2145) PASS: lldb-api :: commands/expression/vector_of_enums/TestVectorOfEnums.py (1547 of 2145) PASS: lldb-api :: commands/disassemble/basic/TestFrameDisassemble.py (1548 of 2145) PASS: lldb-api :: functionalities/data-formatter/nsdictionarysynth/TestNSDictionarySynthetic.py (1549 of 2145) PASS: lldb-api :: tools/lldb-vscode/breakpoint/TestVSCode_setBreakpoints.py (1550 of 2145) PASS: lldb-api :: lang/cpp/auto/TestCPPAuto.py (1551 of 2145) PASS: lldb-api :: sanity/TestModuleCacheSanity.py (1552 of 2145) PASS: lldb-unit :: Process/gdb-remote/./ProcessGdbRemoteTests/GDBRemoteClientBaseTest.SendContinueAndInterrupt2PacketBug (1553 of 2145) PASS: lldb-api :: functionalities/recursion/TestValueObjectRecursion.py (1554 of 2145) PASS: lldb-api :: functionalities/thread/concurrent_events/TestConcurrentCrashWithWatchpointBreakpointSignal.py (1555 of 2145) PASS: lldb-unit :: Process/gdb-remote/./ProcessGdbRemoteTests/GDBRemoteCommunicationClientTest.SendGetTraceConfigPacket (1556 of 2145) PASS: lldb-api :: commands/expression/pr35310/TestExprsBug35310.py (1557 of 2145) PASS: lldb-api :: commands/expression/persistent_types/TestPersistentTypes.py (1558 of 2145) PASS: lldb-unit :: UnwindAssembly/x86/./UnwindAssemblyx86Tests/Testx86AssemblyInspectionEngine.TestPopESI (1559 of 2145) PASS: lldb-unit :: Utility/./UtilityTests/BinaryStreamTest.PutSLEB128SixBytes (1560 of 2145) PASS: lldb-api :: commands/watchpoints/watchpoint_events/TestWatchpointEvents.py (1561 of 2145) PASS: lldb-api :: lang/objc/hidden-ivars/TestHiddenIvars.py (1562 of 2145) PASS: lldb-api :: functionalities/memory/cache/TestMemoryCache.py (1563 of 2145) PASS: lldb-shell :: ScriptInterpreter/Python/sb_address_exception.test (1564 of 2145) PASS: lldb-shell :: Settings/TestSettingsWrite.test (1565 of 2145) PASS: lldb-api :: functionalities/data-formatter/data-formatter-stl/libcxx/function/TestLibCxxFunction.py (1566 of 2145) PASS: lldb-api :: lang/cpp/static_methods/TestCPPStaticMethods.py (1567 of 2145) PASS: lldb-unit :: Utility/./UtilityTests/VASprintfTest.NoBufferResize (1568 of 2145) PASS: lldb-shell :: Reproducer/Functionalities/TestDataFormatter.test (1569 of 2145) PASS: lldb-unit :: Process/gdb-remote/./ProcessGdbRemoteTests/GDBRemoteClientBaseTest.InterruptNoResponse (1570 of 2145) PASS: lldb-api :: lang/objc/foundation/TestObjectDescriptionAPI.py (1571 of 2145) PASS: lldb-unit :: Host/./HostTests/MainLoopTest.UnmonitoredSignal (1572 of 2145) PASS: lldb-api :: functionalities/data-formatter/data-formatter-stl/libcxx/atomic/TestLibCxxAtomic.py (1573 of 2145) PASS: lldb-api :: functionalities/data-formatter/ptr_ref_typedef/TestPtrRef2Typedef.py (1574 of 2145) PASS: lldb-api :: lang/cpp/class_types/TestClassTypesDisassembly.py (1575 of 2145) PASS: lldb-unit :: Utility/./UtilityTests/SerializationRountripTest.SerializeDeserializePodReferences (1576 of 2145) PASS: lldb-unit :: Symbol/./SymbolTests/TestTypeSystemClang.TestFunctionTemplateInRecordConstruction (1577 of 2145) PASS: lldb-unit :: UnwindAssembly/x86/./UnwindAssemblyx86Tests/Testx86AssemblyInspectionEngine.TestSimplex86_64Augmented (1578 of 2145) PASS: lldb-unit :: Utility/./UtilityTests/Flags.AnyClear (1579 of 2145) PASS: lldb-shell :: SymbolFile/NativePDB/function-types-calling-conv.cpp (1580 of 2145) PASS: lldb-api :: python_api/default-constructor/TestDefaultConstructorForAPIObjects.py (1581 of 2145) PASS: lldb-unit :: Utility/./UtilityTests/StreamTeeTest.Constructor2Streams (1582 of 2145) PASS: lldb-api :: functionalities/data-formatter/poarray/TestPrintObjectArray.py (1583 of 2145) PASS: lldb-unit :: ObjectFile/Breakpad/./ObjectFileBreakpadTests/StackWinRecord.parse (1584 of 2145) PASS: lldb-unit :: Utility/./UtilityTests/StreamTest.PutRawBytesToMixedEndian (1585 of 2145) UNSUPPORTED: lldb-api :: functionalities/thread/thread_specific_break_plus_condition/TestThreadSpecificBpPlusCondition.py (1586 of 2145) PASS: lldb-unit :: Utility/./UtilityTests/NameMatchesTest.Equals (1587 of 2145) PASS: lldb-api :: functionalities/breakpoint/breakpoint_language/TestBreakpointLanguage.py (1588 of 2145) PASS: lldb-shell :: Reproducer/TestRelativePath.test (1589 of 2145) PASS: lldb-unit :: Symbol/./SymbolTests/TestTypeSystemClang.TestGetEnumIntegerTypeInvalid (1590 of 2145) PASS: lldb-unit :: Utility/./UtilityTests/RangeTest.SetRangeBase (1591 of 2145) PASS: lldb-unit :: Process/gdb-remote/./ProcessGdbRemoteTests/GDBRemoteCommunicationServerTest.SendErrorResponse_ErrorList (1592 of 2145) PASS: lldb-unit :: Process/gdb-remote/./ProcessGdbRemoteTests/GDBRemoteClientBaseTest.SendContinueDelegateInterface (1593 of 2145) PASS: lldb-unit :: Utility/./UtilityTests/RangeTest.DoesAdjoinOrIntersect (1594 of 2145) PASS: lldb-shell :: Reproducer/TestDriverOptions.test (1595 of 2145) PASS: lldb-shell :: ObjectFile/ELF/build-id-case.yaml (1596 of 2145) PASS: lldb-unit :: Symbol/./SymbolTests/PostfixExpression.ParseFPOProgram (1597 of 2145) PASS: lldb-unit :: Target/./TargetTests/StackFrameRecognizerTest.NullModuleRegex (1598 of 2145) PASS: lldb-unit :: ObjectFile/Breakpad/./ObjectFileBreakpadTests/LineRecord.parse (1599 of 2145) PASS: lldb-unit :: Host/./HostTests/SocketTest.TCPGetConnectURI (1600 of 2145) PASS: lldb-shell :: Breakpoint/split-dwarf5-debug-stroffsets.test (1601 of 2145) PASS: lldb-shell :: ObjectFile/MachO/lc_build_version.yaml (1602 of 2145) PASS: lldb-api :: functionalities/breakpoint/breakpoint_set_restart/TestBreakpointSetRestart.py (1603 of 2145) PASS: lldb-shell :: SymbolFile/DWARF/deterministic-build.cpp (1604 of 2145) PASS: lldb-api :: commands/breakpoint/set/func-regex/TestBreakpointRegexError.py (1605 of 2145) PASS: lldb-unit :: Utility/./UtilityTests/SerializationRountripTest.SerializeDeserializePodPointers (1606 of 2145) PASS: lldb-api :: commands/command/script/import/TestImport.py (1607 of 2145) PASS: lldb-api :: lang/cpp/alignas_base_class/TestAlignAsBaseClass.py (1608 of 2145) PASS: lldb-unit :: Process/minidump/./LLDBMinidumpTests/MinidumpParserTest.GetThreadContext_x86_64 (1609 of 2145) PASS: lldb-unit :: Expression/./ExpressionTests/DiagnosticManagerTest.GetStringNoDiags (1610 of 2145) PASS: lldb-unit :: Utility/./UtilityTests/TimerTest.CategoryTimes (1611 of 2145) PASS: lldb-unit :: Utility/./UtilityTests/VMRange.Clear (1612 of 2145) PASS: lldb-shell :: SymbolFile/DWARF/debug-types-dwo-cross-reference.cpp (1613 of 2145) PASS: lldb-api :: functionalities/inferior-crashing/recursive-inferior/TestRecursiveInferior.py (1614 of 2145) PASS: lldb-shell :: Commands/command-regex-delete.test (1615 of 2145) PASS: lldb-api :: commands/expression/namespace_local_var_same_name_obj_c/TestNamespaceLocalVarSameNameObjC.py (1616 of 2145) PASS: lldb-unit :: Utility/./UtilityTests/EnvironmentTest.EnvpConstruction (1617 of 2145) UNSUPPORTED: lldb-api :: commands/target/auto-install-main-executable/TestAutoInstallMainExecutable.py (1618 of 2145) PASS: lldb-unit :: ScriptInterpreter/Python/./ScriptInterpreterPythonTests/PythonDataObjectsTest.TestPythonStringToStr (1619 of 2145) PASS: lldb-api :: functionalities/data-formatter/data-formatter-ptr-to-array/TestPtrToArrayFormatting.py (1620 of 2145) UNSUPPORTED: lldb-api :: functionalities/darwin_log/source/info/TestDarwinLogSourceInfo.py (1621 of 2145) PASS: lldb-unit :: Target/./TargetTests/ModuleCacheTest.GetAndPutStrangeHostname (1622 of 2145) PASS: lldb-unit :: Utility/./UtilityTests/StreamTeeTest.Constructor1Stream (1623 of 2145) PASS: lldb-unit :: Host/./HostTests/FileSystemTest.OpenErrno (1624 of 2145) PASS: lldb-api :: lang/c/function_types/TestFunctionTypes.py (1625 of 2145) PASS: lldb-unit :: ObjectFile/Breakpad/./ObjectFileBreakpadTests/FileRecord.parse (1626 of 2145) PASS: lldb-api :: api/log/TestAPILog.py (1627 of 2145) PASS: lldb-api :: commands/expression/import-std-module/deque-basic/TestDequeFromStdModule.py (1628 of 2145) PASS: lldb-unit :: Disassembler/./DisassemblerTests/TestArmv7Disassembly.TestCortexFPDisass (1629 of 2145) PASS: lldb-api :: lang/objc/objc-property/TestObjCProperty.py (1630 of 2145) PASS: lldb-api :: lang/objc/foundation/TestObjCMethodsNSArray.py (1631 of 2145) PASS: lldb-unit :: Utility/./UtilityTests/XcodeSDKTest.FindXcodeContentsDirectoryInPath (1632 of 2145) PASS: lldb-unit :: Utility/./UtilityTests/StreamTeeTest.DefaultConstructor (1633 of 2145) PASS: lldb-unit :: Language/Highlighting/./HighlighterTests/HighlighterTest.ClangCursorPosInOtherToken (1634 of 2145) PASS: lldb-shell :: VSCode/TestOptions.test (1635 of 2145) PASS: lldb-unit :: Interpreter/./InterpreterTests/OptionArgParserTest.toBoolean (1636 of 2145) PASS: lldb-unit :: Process/minidump/./LLDBMinidumpTests/MinidumpParserTest.GetPid (1637 of 2145) UNSUPPORTED: lldb-shell :: ScriptInterpreter/Lua/persistent_state.test (1638 of 2145) PASS: lldb-api :: functionalities/data-formatter/data-formatter-globals/TestDataFormatterGlobals.py (1639 of 2145) PASS: lldb-unit :: ScriptInterpreter/Python/./ScriptInterpreterPythonTests/PythonDataObjectsTest.TestPythonBytes (1640 of 2145) PASS: lldb-unit :: UnwindAssembly/x86/./UnwindAssemblyx86Tests/Testx86AssemblyInspectionEngine.TestSimple64bitFrameFunction (1641 of 2145) PASS: lldb-api :: lang/objc/blocks/TestObjCIvarsInBlocks.py (1642 of 2145) PASS: lldb-shell :: SymbolFile/DWARF/debug_loc.s (1643 of 2145) PASS: lldb-api :: functionalities/tsan/cpp_global_location/TestTsanCPPGlobalLocation.py (1644 of 2145) PASS: lldb-api :: functionalities/gdb_remote_client/TestNoGPacketSupported.py (1645 of 2145) PASS: lldb-api :: python_api/sblaunchinfo/TestSBLaunchInfo.py (1646 of 2145) PASS: lldb-api :: commands/expression/import_builtin_fileid/TestImportBuiltinFileID.py (1647 of 2145) PASS: lldb-unit :: Utility/./UtilityTests/NameMatchesTest.EndsWith (1648 of 2145) PASS: lldb-unit :: Utility/./UtilityTests/StringExtractorTest.GetHexBytes_OddPair (1649 of 2145) PASS: lldb-unit :: Utility/./UtilityTests/ScalarTest.SetValueFromData (1650 of 2145) PASS: lldb-unit :: Utility/./UtilityTests/StringListTest.InsertStringAtIndexStdString (1651 of 2145) PASS: lldb-api :: commands/expression/formatters/TestFormatters.py (1652 of 2145) PASS: lldb-api :: macosx/find-dsym/bundle-with-dot-in-filename/TestBundleWithDotInFilename.py (1653 of 2145) PASS: lldb-api :: functionalities/breakpoint/debugbreak/TestDebugBreak.py (1654 of 2145) PASS: lldb-api :: functionalities/thread/num_threads/TestNumThreads.py (1655 of 2145) PASS: lldb-api :: functionalities/data-formatter/nsarraysynth/TestNSArraySynthetic.py (1656 of 2145) PASS: lldb-api :: commands/expression/import-std-module/weak_ptr/TestWeakPtrFromStdModule.py (1657 of 2145) PASS: lldb-api :: commands/watchpoints/multiple_hits/TestMultipleHits.py (1658 of 2145) PASS: lldb-api :: lang/objc/objc-class-method/TestObjCClassMethod.py (1659 of 2145) PASS: lldb-shell :: SymbolFile/DWARF/static_scope.s (1660 of 2145) PASS: lldb-unit :: Utility/./UtilityTests/ArchSpecTest.TripleComponentsWereSpecified (1661 of 2145) PASS: lldb-unit :: Utility/./UtilityTests/CompletionRequest.Constructor (1662 of 2145) PASS: lldb-unit :: Utility/./UtilityTests/StringExtractorTest.GetHexBytesAvail_OddPair2 (1663 of 2145) PASS: lldb-unit :: Utility/./UtilityTests/StatusTest.Formatv (1664 of 2145) PASS: lldb-unit :: Utility/./UtilityTests/StringListTest.JoinEmpty (1665 of 2145) PASS: lldb-unit :: Utility/./UtilityTests/StreamTeeTest.CopyConstructor (1666 of 2145) PASS: lldb-unit :: Utility/./UtilityTests/StringListTest.PopBack (1667 of 2145) UNSUPPORTED: lldb-api :: commands/expression/macros/TestMacros.py (1668 of 2145) PASS: lldb-unit :: Symbol/./SymbolTests/DWARFCallFrameInfoTest.Basic_dwarf3 (1669 of 2145) PASS: lldb-unit :: Utility/./UtilityTests/ArgsTest.TestArgv (1670 of 2145) PASS: lldb-api :: commands/expression/xvalue/TestXValuePrinting.py (1671 of 2145) PASS: lldb-api :: tools/lldb-server/commandline/TestStubReverseConnect.py (1672 of 2145) PASS: lldb-shell :: SymbolFile/Breakpad/unwind-via-stack-win.test (1673 of 2145) PASS: lldb-api :: lang/cpp/namespace/TestNamespace.py (1674 of 2145) PASS: lldb-unit :: Utility/./UtilityTests/StringExtractorTest.DecodeHexU8_InvalidHex (1675 of 2145) PASS: lldb-unit :: SymbolFile/DWARF/./SymbolFileDWARFTests/SymbolFileDWARFTests.TestAbbrevOrder1Start1 (1676 of 2145) UNSUPPORTED: lldb-api :: lang/cpp/function-template-parameter-pack/TestFunctionTemplateParameterPack.py (1677 of 2145) UNSUPPORTED: lldb-shell :: ScriptInterpreter/Lua/independent_state.test (1678 of 2145) PASS: lldb-shell :: ObjectFile/ELF/avr-basic-info.yaml (1679 of 2145) PASS: lldb-api :: python_api/disassemble-raw-data/TestDisassembleRawData.py (1680 of 2145) PASS: lldb-unit :: SymbolFile/DWARF/./SymbolFileDWARFTests/SymbolFileDWARFTests.ParseAranges (1681 of 2145) PASS: lldb-unit :: Language/Highlighting/./HighlighterTests/HighlighterTest.ClangComments (1682 of 2145) PASS: lldb-unit :: Host/./HostTests/FileSystemTest.GetByteSize (1683 of 2145) UNSUPPORTED: lldb-api :: functionalities/darwin_log/filter/regex/activity/TestDarwinLogFilterRegexActivity.py (1684 of 2145) PASS: lldb-unit :: UnwindAssembly/ARM64/./Arm64InstEmulationTests/TestArm64InstEmulation.TestRegisterSavedTwice (1685 of 2145) PASS: lldb-unit :: Symbol/./SymbolTests/TestClangASTImporter.MetadataPropagationAfterCopying (1686 of 2145) PASS: lldb-unit :: Utility/./UtilityTests/StringExtractorTest.GetHexBytesAvail (1687 of 2145) PASS: lldb-api :: macosx/thread-names/TestInterruptThreadNames.py (1688 of 2145) PASS: lldb-unit :: Utility/./UtilityTests/SerializationRountripTest.SerializeDeserializeObjectPointer (1689 of 2145) PASS: lldb-api :: functionalities/multidebugger_commands/TestMultipleDebuggersCommands.py (1690 of 2145) PASS: lldb-api :: types/TestIntegerType.py (1691 of 2145) PASS: lldb-unit :: SymbolFile/NativePDB/./SymbolFileNativePDBTests/PDBFPOProgramToDWARFExpressionTests.UnresolvedDependentCyclicRegisterAssignmentReference (1692 of 2145) PASS: lldb-unit :: Language/Highlighting/./HighlighterTests/HighlighterTest.FallbackHighlighter (1693 of 2145) PASS: lldb-unit :: UnwindAssembly/x86/./UnwindAssemblyx86Tests/Testx86AssemblyInspectionEngine.TestPopRBPWithREX (1694 of 2145) PASS: lldb-unit :: SymbolFile/NativePDB/./SymbolFileNativePDBTests/PDBFPOProgramToDWARFExpressionTests.MultipleIndependentAssignments (1695 of 2145) PASS: lldb-api :: functionalities/thread/concurrent_events/TestConcurrentManyWatchpoints.py (1696 of 2145) PASS: lldb-api :: lang/cpp/virtual-overload/TestVirtualOverload.py (1697 of 2145) PASS: lldb-unit :: Utility/./UtilityTests/LogChannelEnabledTest.LogVerboseThread (1698 of 2145) PASS: lldb-unit :: Utility/./UtilityTests/PassiveReplayTest.InstrumentedFoo (1699 of 2145) PASS: lldb-api :: lang/c/step_over_no_deadlock/TestStepOverDoesntBlock.py (1700 of 2145) PASS: lldb-api :: commands/expression/import-std-module/forward_list-dbg-info-content/TestDbgInfoContentForwardListFromStdModule.py (1701 of 2145) PASS: lldb-shell :: Reproducer/TestProcessList.test (1702 of 2145) PASS: lldb-api :: python_api/frame/get-variables/TestGetVariables.py (1703 of 2145) PASS: lldb-shell :: ObjectFile/MachO/subsections.yaml (1704 of 2145) PASS: lldb-unit :: Utility/./UtilityTests/BinaryStreamTest.PutSLEB128One (1705 of 2145) PASS: lldb-api :: commands/expression/namespace_local_var_same_name_cpp_and_c/TestNamespaceLocalVarSameNameCppAndC.py (1706 of 2145) PASS: lldb-unit :: Host/./HostTests/NativeProcessProtocolTest.ReadCStringFromMemory_MaxSize (1707 of 2145) PASS: lldb-api :: functionalities/thread/concurrent_events/TestConcurrentManyCrash.py (1708 of 2145) PASS: lldb-api :: functionalities/thread/exit_during_step/TestExitDuringStep.py (1709 of 2145) PASS: lldb-api :: commands/gui/basic/TestGuiBasic.py (1710 of 2145) PASS: lldb-shell :: Quit/TestQuitExitCodeHex0.test (1711 of 2145) PASS: lldb-api :: commands/watchpoints/multiple_threads/TestWatchpointMultipleThreads.py (1712 of 2145) PASS: lldb-api :: commands/expression/import-std-module/shared_ptr/TestSharedPtrFromStdModule.py (1713 of 2145) PASS: lldb-shell :: Reproducer/TestMultipleTargets.test (1714 of 2145) UNSUPPORTED: lldb-api :: benchmarks/expression/TestRepeatedExprs.py (1715 of 2145) PASS: lldb-api :: functionalities/tail_call_frames/thread_step_out_message/TestArtificialFrameStepOutMessage.py (1716 of 2145) PASS: lldb-unit :: Utility/./UtilityTests/ReproducerTest.SetCapture (1717 of 2145) PASS: lldb-unit :: Utility/./UtilityTests/StreamTest.PutHex32ByteOrderLittle (1718 of 2145) UNSUPPORTED: lldb-shell :: SymbolFile/PDB/variables.test (1719 of 2145) PASS: lldb-unit :: Expression/./ExpressionTests/CppModuleConfigurationTest.Xcode (1720 of 2145) PASS: lldb-api :: functionalities/thread/concurrent_events/TestConcurrentTwoWatchpointsOneDelayBreakpoint.py (1721 of 2145) PASS: lldb-unit :: ScriptInterpreter/Python/./ScriptInterpreterPythonTests/PythonDataObjectsTest.TestExtractingUInt64ThroughStructuredData (1722 of 2145) UNSUPPORTED: lldb-shell :: Unwind/unwind-plan-dwarf-dump.test (1723 of 2145) PASS: lldb-api :: lang/cpp/breakpoint-commands/TestCPPBreakpointCommands.py (1724 of 2145) PASS: lldb-shell :: ObjectFile/ELF/netbsd-exec-8.99.30-amd64.yaml (1725 of 2145) PASS: lldb-unit :: Symbol/./SymbolTests/TestTypeSystemClang.TestUnifyAccessSpecifiers (1726 of 2145) PASS: lldb-unit :: Utility/./UtilityTests/BinaryStreamTest.PutULEB128NineBytes (1727 of 2145) PASS: lldb-unit :: Utility/./UtilityTests/NameMatchesTest.StartsWith (1728 of 2145) PASS: lldb-api :: functionalities/breakpoint/breakpoint_conditions/TestBreakpointConditions.py (1729 of 2145) PASS: lldb-shell :: Quit/TestQuitExitCodeHexA.test (1730 of 2145) PASS: lldb-api :: commands/watchpoints/watchpoint_disable/TestWatchpointDisable.py (1731 of 2145) PASS: lldb-api :: tools/lldb-server/TestGdbRemote_vCont.py (1732 of 2145) PASS: lldb-shell :: Driver/LocalLLDBInit.test (1733 of 2145) PASS: lldb-unit :: Utility/./UtilityTests/ArgsTest.DoubleQuotedItem (1734 of 2145) PASS: lldb-shell :: SymbolFile/DWARF/inline-function-address-shared.test (1735 of 2145) PASS: lldb-api :: functionalities/backticks/TestBackticksWithoutATarget.py (1736 of 2145) PASS: lldb-api :: python_api/value/TestValueAPI.py (1737 of 2145) PASS: lldb-unit :: UnwindAssembly/x86/./UnwindAssemblyx86Tests/Testx86AssemblyInspectionEngine.TestPushEAX (1738 of 2145) PASS: lldb-api :: lang/c/enum_types/TestEnumTypes.py (1739 of 2145) PASS: lldb-unit :: Host/./HostTests/SocketTest.DomainListenConnectAccept (1740 of 2145) PASS: lldb-unit :: Utility/./UtilityTests/DataExtractorTest.GetMaxU64 (1741 of 2145) PASS: lldb-api :: commands/target/stop-hook/enable/TestTargetStopHookEnable.py (1742 of 2145) PASS: lldb-unit :: UnwindAssembly/x86/./UnwindAssemblyx86Tests/Testx86AssemblyInspectionEngine.TestStackRealign32BitDisp_x86_64 (1743 of 2145) PASS: lldb-unit :: Utility/./UtilityTests/StreamTest.ShiftOperatorPtr (1744 of 2145) PASS: lldb-unit :: Language/Highlighting/./HighlighterTests/HighlighterTest.ClangBraces (1745 of 2145) PASS: lldb-api :: commands/log/basic/TestLogging.py (1746 of 2145) PASS: lldb-unit :: Utility/./UtilityTests/StringListTest.RemoveBlankLines (1747 of 2145) PASS: lldb-shell :: SymbolFile/NativePDB/s_constant.cpp (1748 of 2145) PASS: lldb-unit :: Utility/./UtilityTests/RecordReplayTest.InstrumentedBar (1749 of 2145) PASS: lldb-unit :: Utility/./UtilityTests/ConstStringTest.FromMidOfBufferStringRef (1750 of 2145) PASS: lldb-api :: lang/c/blocks/TestBlocks.py (1751 of 2145) PASS: lldb-api :: commands/expression/radar_8638051/Test8638051.py (1752 of 2145) PASS: lldb-unit :: Utility/./UtilityTests/DataExtractorTest.PeekData (1753 of 2145) PASS: lldb-shell :: Expr/TestMultilineExpr.test (1754 of 2145) PASS: lldb-api :: lang/cpp/stl/TestSTL.py (1755 of 2145) PASS: lldb-api :: functionalities/data-formatter/cstring-utf8-summary/TestCstringUnicode.py (1756 of 2145) PASS: lldb-unit :: DataFormatter/./LLDBFormatterTests/TypeMatcherTests.ExactName (1757 of 2145) PASS: lldb-unit :: ObjectFile/PECOFF/./ObjectFilePECOFFTests/PECallFrameInfoTest.Chained_eh (1758 of 2145) PASS: lldb-api :: python_api/watchpoint/TestWatchpointIgnoreCount.py (1759 of 2145) PASS: lldb-shell :: SymbolFile/DWARF/array-sizes.s (1760 of 2145) PASS: lldb-api :: lang/objc/modules-inline-functions/TestModulesInlineFunctions.py (1761 of 2145) PASS: lldb-unit :: Utility/./UtilityTests/StringListTest.ForRangeEmpty (1762 of 2145) PASS: lldb-unit :: Utility/./UtilityTests/StreamTest.AddressPrefixAndSuffix (1763 of 2145) PASS: lldb-unit :: ScriptInterpreter/Python/./ScriptInterpreterPythonTests/PythonDataObjectsTest.TestRun (1764 of 2145) PASS: lldb-unit :: SymbolFile/NativePDB/./SymbolFileNativePDBTests/PDBFPOProgramToDWARFExpressionTests.InvalidOpBinary (1765 of 2145) PASS: lldb-api :: lang/cpp/gmodules/TestWithModuleDebugging.py (1766 of 2145) PASS: lldb-api :: functionalities/breakpoint/breakpoint_hit_count/TestBreakpointHitCount.py (1767 of 2145) PASS: lldb-api :: commands/expression/completion-crash-incomplete-record/TestCompletionCrashIncompleteRecord.py (1768 of 2145) PASS: lldb-unit :: Utility/./UtilityTests/FileSpecTest.GetPath (1769 of 2145) PASS: lldb-api :: commands/expression/weak_symbols/TestWeakSymbols.py (1770 of 2145) PASS: lldb-unit :: Language/Highlighting/./HighlighterTests/HighlighterTest.Colons (1771 of 2145) PASS: lldb-unit :: Utility/./UtilityTests/ArgsTest.ReplaceArgumentAtIndexLonger (1772 of 2145) PASS: lldb-shell :: SymbolFile/DWARF/dir-separator-posix.s (1773 of 2145) PASS: lldb-unit :: Host/./HostTests/SocketTest.UDPGetConnectURI (1774 of 2145) PASS: lldb-unit :: Utility/./UtilityTests/DataExtractorTest.GetSLEB128_bit63 (1775 of 2145) PASS: lldb-api :: lang/c/offsetof/TestOffsetof.py (1776 of 2145) PASS: lldb-unit :: Utility/./UtilityTests/CompletionRequest.TryCompleteCurrentArgGood (1777 of 2145) PASS: lldb-api :: tools/lldb-vscode/module/TestVSCode_module.py (1778 of 2145) PASS: lldb-shell :: SymbolFile/NativePDB/ast-functions.cpp (1779 of 2145) PASS: lldb-unit :: UnwindAssembly/x86/./UnwindAssemblyx86Tests/Testx86AssemblyInspectionEngine.Test32BitOnlyInstruction (1780 of 2145) PASS: lldb-shell :: Reproducer/TestVerify.test (1781 of 2145) PASS: lldb-unit :: Process/minidump/./LLDBMinidumpTests/MinidumpParserTest.MinidumpDuplicateModuleMappedFirst (1782 of 2145) PASS: lldb-unit :: Utility/./UtilityTests/ArgsTest.GetArgumentArrayRef (1783 of 2145) PASS: lldb-unit :: Utility/./UtilityTests/ProcessInstanceInfo.Dump (1784 of 2145) PASS: lldb-unit :: Host/./HostTests/FileSystemTest.Readable (1785 of 2145) PASS: lldb-unit :: Language/Highlighting/./HighlighterTests/HighlighterTest.ClangCursorPosAfterOtherToken (1786 of 2145) PASS: lldb-api :: iohandler/resize/TestIOHandlerResize.py (1787 of 2145) PASS: lldb-api :: lang/cpp/inlines/TestInlines.py (1788 of 2145) PASS: lldb-unit :: Host/./HostTests/SocketTest.TCPListen0ConnectAccept (1789 of 2145) PASS: lldb-unit :: Utility/./UtilityTests/StringExtractorTest.GetHexU8_Underflow2 (1790 of 2145) PASS: lldb-api :: commands/expression/codegen-crash-typedefdecl-not-in_declcontext/TestCodegenCrashTypedefDeclNotInDeclContext.py (1791 of 2145) PASS: lldb-unit :: Utility/./UtilityTests/StringExtractorTest.GetHexU8_InvalidHex (1792 of 2145) PASS: lldb-api :: commands/watchpoints/watchpoint_commands/command/TestWatchpointCommandLLDB.py (1793 of 2145) PASS: lldb-unit :: UnwindAssembly/x86/./UnwindAssemblyx86Tests/Testx86AssemblyInspectionEngine.Testi386IgnoredRegisters (1794 of 2145) PASS: lldb-api :: commands/frame/diagnose/array/TestArray.py (1795 of 2145) UNSUPPORTED: lldb-shell :: Register/x86-64-ymm16-read.test (1796 of 2145) PASS: lldb-unit :: Utility/./UtilityTests/StreamTeeTest.SetStreamAtIndexOverwrite (1797 of 2145) PASS: lldb-unit :: Symbol/./SymbolTests/TestTypeSystemClang.TestDeletingImplicitCopyCstrDueToMoveCStr (1798 of 2145) PASS: lldb-shell :: SymbolFile/DWARF/debug-line-basic.s (1799 of 2145) PASS: lldb-api :: api/check_public_api_headers/TestPublicAPIHeaders.py (1800 of 2145) PASS: lldb-api :: lang/objc/objc-baseclass-sbtype/TestObjCBaseClassSBType.py (1801 of 2145) PASS: lldb-unit :: Utility/./UtilityTests/CompletionRequest.TryCompleteCurrentArgMode (1802 of 2145) PASS: lldb-unit :: ScriptInterpreter/Python/./ScriptInterpreterPythonTests/PythonDataObjectsTest.TestPythonTupleSize (1803 of 2145) PASS: lldb-api :: lang/cpp/const_this/TestConstThis.py (1804 of 2145) PASS: lldb-shell :: Quit/TestQuitExitCode-30.test (1805 of 2145) PASS: lldb-api :: lang/objc/objc-static-method/TestObjCStaticMethod.py (1806 of 2145) PASS: lldb-api :: commands/expression/import-std-module/forward_list/TestForwardListFromStdModule.py (1807 of 2145) PASS: lldb-api :: commands/platform/file/read/TestPlatformFileRead.py (1808 of 2145) PASS: lldb-unit :: Utility/./UtilityTests/RangeTest.DefaultConstructor (1809 of 2145) PASS: lldb-unit :: UnwindAssembly/ARM64/./Arm64InstEmulationTests/TestArm64InstEmulation.TestMediumDarwinFunction (1810 of 2145) PASS: lldb-api :: types/TestCharTypeExpr.py (1811 of 2145) PASS: lldb-unit :: Utility/./UtilityTests/StringListTest.InsertStringAtIndexEnd (1812 of 2145) PASS: lldb-unit :: Utility/./UtilityTests/VASprintfTest.EncodingError (1813 of 2145) PASS: lldb-api :: functionalities/thread/concurrent_events/TestConcurrentSignalBreak.py (1814 of 2145) PASS: lldb-unit :: ObjectFile/ELF/./ObjectFileELFTests/ObjectFileELFTest.SectionsResolveConsistently (1815 of 2145) PASS: lldb-api :: functionalities/data-formatter/summary-string-onfail/Test-rdar-9974002.py (1816 of 2145) PASS: lldb-api :: lang/objc/modules-incomplete/TestIncompleteModules.py (1817 of 2145) PASS: lldb-api :: lang/cpp/dynamic-value/TestDynamicValue.py (1818 of 2145) PASS: lldb-api :: commands/watchpoints/watchpoint_commands/condition/TestWatchpointConditionCmd.py (1819 of 2145) PASS: lldb-unit :: Utility/./UtilityTests/StringExtractorTest.GetNameColonValueSuccess (1820 of 2145) PASS: lldb-api :: functionalities/thread/concurrent_events/TestConcurrentCrashWithSignal.py (1821 of 2145) PASS: lldb-api :: lang/cpp/wchar_t/TestCxxWCharT.py (1822 of 2145) PASS: lldb-shell :: Settings/TestDisassemblyFormat.test (1823 of 2145) PASS: lldb-api :: commands/platform/basic/TestPlatformPython.py (1824 of 2145) PASS: lldb-shell :: ObjectFile/PECOFF/basic-info.yaml (1825 of 2145) PASS: lldb-unit :: Utility/./UtilityTests/StringExtractorTest.GetNameColonValueNoColon (1826 of 2145) PASS: lldb-unit :: Interpreter/./InterpreterTests/OptionArgParserTest.toChar (1827 of 2145) PASS: lldb-api :: commands/expression/call-function/TestCallStopAndContinue.py (1828 of 2145) PASS: lldb-unit :: Utility/./UtilityTests/BinaryStreamTest.PutULEB128TwoBytes (1829 of 2145) PASS: lldb-shell :: SymbolFile/NativePDB/disassembly.cpp (1830 of 2145) PASS: lldb-unit :: Utility/./UtilityTests/CompletionRequest.DuplicateFiltering (1831 of 2145) UNSUPPORTED: lldb-shell :: Register/x86-ymm-write.test (1832 of 2145) PASS: lldb-unit :: Host/./HostTests/NativeProcessProtocolTest.ReadCStringFromMemory (1833 of 2145) PASS: lldb-unit :: Symbol/./SymbolTests/TestClangASTImporter.CopyDeclTagDecl (1834 of 2145) PASS: lldb-shell :: SymbolFile/Breakpad/unwind-via-stack-cfi.test (1835 of 2145) PASS: lldb-api :: types/TestShortType.py (1836 of 2145) PASS: lldb-shell :: Settings/TestFrameFormatNoColor.test (1837 of 2145) PASS: lldb-unit :: Utility/./UtilityTests/UserIDResolver.GetGroupName (1838 of 2145) PASS: lldb-unit :: Utility/./UtilityTests/StringExtractorTest.GetHexBytes (1839 of 2145) PASS: lldb-unit :: Utility/./UtilityTests/StreamTest.PutCString (1840 of 2145) PASS: lldb-unit :: Language/Highlighting/./HighlighterTests/HighlighterTest.ClangCursorPosEndOfLine (1841 of 2145) PASS: lldb-api :: lang/objc/objc-runtime-ivars/TestRuntimeIvars.py (1842 of 2145) PASS: lldb-api :: commands/expression/radar_9673664/TestExprHelpExamples.py (1843 of 2145) PASS: lldb-api :: functionalities/inferior-assert/TestInferiorAssert.py (1844 of 2145) PASS: lldb-unit :: Utility/./UtilityTests/UriParserTest.BadPort2 (1845 of 2145) PASS: lldb-shell :: Heap/heap-cstr.test (1846 of 2145) PASS: lldb-unit :: Utility/./UtilityTests/StringExtractorTest.DecodeHexU8_Extra (1847 of 2145) PASS: lldb-api :: commands/expression/function_template_specialization_temp_args/TestFunctionTemplateSpecializationTempArgs.py (1848 of 2145) PASS: lldb-api :: functionalities/tail_call_frames/thread_step_out_or_return/TestSteppingOutWithArtificialFrames.py (1849 of 2145) PASS: lldb-unit :: Host/./HostTests/NativeProcessProtocolTest.ReadCStringFromMemory_CrossPageBoundary (1850 of 2145) PASS: lldb-shell :: Settings/TestDisableColor.test (1851 of 2145) PASS: lldb-unit :: Utility/./UtilityTests/StringListTest.GetMaxStringLengthEmpty (1852 of 2145) PASS: lldb-shell :: Driver/TestConvenienceVariables.test (1853 of 2145) UNSUPPORTED: lldb-api :: commands/register/register/aarch64_sve_registers/rw_access_static_config/TestSVERegisters.py (1854 of 2145) PASS: lldb-unit :: Utility/./UtilityTests/LogChannelEnabledTest.LogGetLogThread (1855 of 2145) PASS: lldb-api :: commands/expression/no-deadlock/TestExprDoesntBlock.py (1856 of 2145) UNSUPPORTED: lldb-shell :: SymbolFile/PDB/variables-locations.test (1857 of 2145) PASS: lldb-unit :: Utility/./UtilityTests/RegularExpression.Valid (1858 of 2145) PASS: lldb-api :: functionalities/gdb_remote_client/TestGDBRemoteClient.py (1859 of 2145) PASS: lldb-unit :: ScriptInterpreter/Python/./ScriptInterpreterPythonTests/PythonDataObjectsTest.TestPythonBoolean (1860 of 2145) PASS: lldb-api :: functionalities/thread/concurrent_events/TestConcurrentBreakpointDelayBreakpointOneSignal.py (1861 of 2145) PASS: lldb-unit :: UnwindAssembly/x86/./UnwindAssemblyx86Tests/Testx86AssemblyInspectionEngine.TestStackRealign8BitDisp_i386 (1862 of 2145) PASS: lldb-unit :: Utility/./UtilityTests/GeneratorTest.Get (1863 of 2145) PASS: lldb-shell :: Reproducer/TestReuseDirectory.test (1864 of 2145) PASS: lldb-shell :: SymbolFile/DWARF/dwarf5_locations.s (1865 of 2145) PASS: lldb-unit :: Utility/./UtilityTests/StringExtractorTest.GetHexU8_Underflow (1866 of 2145) PASS: lldb-shell :: Breakpoint/dummy-target.test (1867 of 2145) PASS: lldb-api :: lang/objc/objc-dyn-sbtype/TestObjCDynamicSBType.py (1868 of 2145) PASS: lldb-unit :: Utility/./UtilityTests/RangeTest.ContainsEndInclusiveInvalid (1869 of 2145) PASS: lldb-api :: python_api/process/read-mem-cstring/TestReadMemCString.py (1870 of 2145) PASS: lldb-unit :: Expression/./ExpressionTests/DiagnosticManagerTest.PutString (1871 of 2145) PASS: lldb-unit :: UnwindAssembly/x86/./UnwindAssemblyx86Tests/Testx86AssemblyInspectionEngine.TestSpArithx86_64Augmented (1872 of 2145) PASS: lldb-unit :: Language/Highlighting/./HighlighterTests/HighlighterTest.ClangPPDirectives (1873 of 2145) UNSUPPORTED: lldb-api :: macosx/macCatalystAppMacOSFramework/TestMacCatalystAppWithMacOSFramework.py (1874 of 2145) PASS: lldb-unit :: Utility/./UtilityTests/RangeTest.ContainsRangeStartingFromZero (1875 of 2145) PASS: lldb-unit :: Utility/./UtilityTests/StringListTest.SplitIntoLinesSingleTrailingCR (1876 of 2145) PASS: lldb-unit :: Utility/./UtilityTests/StreamTest.PutCharWhitespace (1877 of 2145) UNSUPPORTED: lldb-api :: functionalities/darwin_log/source/debug/TestDarwinLogSourceDebug.py (1878 of 2145) PASS: lldb-unit :: Process/gdb-remote/./ProcessGdbRemoteTests/GDBRemoteCommunicationTest.ReadPacket_checksum (1879 of 2145) PASS: lldb-unit :: ScriptInterpreter/Python/./ScriptInterpreterPythonTests/PythonDataObjectsTest.TestBorrowedReferences (1880 of 2145) PASS: lldb-api :: commands/quit/TestQuit.py (1881 of 2145) PASS: lldb-api :: tools/lldb-vscode/variables/TestVSCode_variables.py (1882 of 2145) PASS: lldb-unit :: Language/Highlighting/./HighlighterTests/HighlighterTest.ClangOperators (1883 of 2145) PASS: lldb-api :: functionalities/data-formatter/data-formatter-objc/TestDataFormatterObjCNSDate.py (1884 of 2145) PASS: lldb-unit :: Utility/./UtilityTests/StringExtractorTest.GetHexU8_Exact_NoEof (1885 of 2145) PASS: lldb-api :: lang/cpp/type_lookup/TestCppTypeLookup.py (1886 of 2145) PASS: lldb-api :: commands/process/launch/TestProcessLaunch.py (1887 of 2145) PASS: lldb-api :: commands/expression/ir-interpreter/TestIRInterpreter.py (1888 of 2145) PASS: lldb-api :: lang/c/vla/TestVLA.py (1889 of 2145) PASS: lldb-shell :: SymbolFile/NativePDB/tag-types.cpp (1890 of 2145) PASS: lldb-unit :: UnwindAssembly/x86/./UnwindAssemblyx86Tests/Testx86AssemblyInspectionEngine.TestLEAVE (1891 of 2145) PASS: lldb-unit :: Utility/./UtilityTests/LogTest.Unregister (1892 of 2145) PASS: lldb-api :: python_api/lldbutil/process/TestPrintStackTraces.py (1893 of 2145) PASS: lldb-unit :: Utility/./UtilityTests/DataExtractorTest.GetCStrUnterminated (1894 of 2145) PASS: lldb-unit :: Expression/./ExpressionTests/DiagnosticManagerTest.FixedExpression (1895 of 2145) PASS: lldb-api :: lang/cpp/bitfields/TestCppBitfields.py (1896 of 2145) PASS: lldb-api :: functionalities/data-formatter/dump_dynamic/TestDumpDynamic.py (1897 of 2145) PASS: lldb-api :: tools/lldb-vscode/attach/TestVSCode_attach.py (1898 of 2145) PASS: lldb-unit :: Instruction/./EmulatorTests/TestAArch64Emulator.TestOverflow (1899 of 2145) PASS: lldb-api :: commands/frame/diagnose/complicated-expression/TestComplicatedExpression.py (1900 of 2145) PASS: lldb-unit :: Utility/./UtilityTests/Flags.Clear (1901 of 2145) PASS: lldb-unit :: Utility/./UtilityTests/CompletionRequest.TryCompleteCurrentArgBad (1902 of 2145) PASS: lldb-unit :: Symbol/./SymbolTests/TestClangASTImporter.RecordLayout (1903 of 2145) PASS: lldb-unit :: Utility/./UtilityTests/StringListTest.GetSize (1904 of 2145) PASS: lldb-unit :: DataFormatter/./LLDBFormatterTests/TypeMatcherTests.RegexName (1905 of 2145) PASS: lldb-shell :: Minidump/Windows/Sigsegv/sigsegv.test (1906 of 2145) PASS: lldb-api :: lang/cpp/call-function/TestCallCPPFunction.py (1907 of 2145) PASS: lldb-unit :: Process/minidump/./LLDBMinidumpTests/RegisterContextMinidump.ConvertMinidumpContext_x86_64 (1908 of 2145) UNSUPPORTED: lldb-api :: benchmarks/turnaround/TestCompileRunToBreakpointTurnaround.py (1909 of 2145) PASS: lldb-api :: types/TestDoubleTypes.py (1910 of 2145) UNSUPPORTED: lldb-shell :: SymbolFile/NativePDB/ast-functions-msvc.cpp (1911 of 2145) PASS: lldb-api :: functionalities/breakpoint/breakpoint_names/TestBreakpointNames.py (1912 of 2145) PASS: lldb-unit :: Host/./HostTests/SocketTest.DecodeHostAndPort (1913 of 2145) PASS: lldb-api :: lang/cpp/dynamic-value/TestCppValueCast.py (1914 of 2145) PASS: lldb-api :: lang/c/array_types/TestArrayTypes.py (1915 of 2145) PASS: lldb-unit :: Utility/./UtilityTests/StringExtractorTest.GetHexU8_Extra (1916 of 2145) PASS: lldb-shell :: ObjectFile/ELF/PT_LOAD-overlap.yaml (1917 of 2145) PASS: lldb-unit :: Utility/./UtilityTests/ConstStringTest.MangledCounterpart (1918 of 2145) PASS: lldb-unit :: Utility/./UtilityTests/ArchSpecTest.OperatorBool (1919 of 2145) PASS: lldb-unit :: Utility/./UtilityTests/RangeTest.SizeTypes (1920 of 2145) PASS: lldb-unit :: Utility/./UtilityTests/StringListTest.DefaultConstructor (1921 of 2145) UNSUPPORTED: lldb-shell :: Expr/TestIRMemoryMapWindows.test (1922 of 2145) PASS: lldb-unit :: debugserver/./debugserverTests/RNBSocket.LoopBackListenIPv4 (1923 of 2145) PASS: lldb-shell :: Unwind/thread-step-out-ret-addr-check.test (1924 of 2145) PASS: lldb-unit :: UnwindAssembly/x86/./UnwindAssemblyx86Tests/Testx86AssemblyInspectionEngine.TestPopEDI (1925 of 2145) PASS: lldb-api :: functionalities/dlopen_other_executable/TestDlopenOtherExecutable.py (1926 of 2145) PASS: lldb-unit :: SymbolFile/NativePDB/./SymbolFileNativePDBTests/PDBFPOProgramToDWARFExpressionTests.InvalidAssignmentSingle (1927 of 2145) PASS: lldb-unit :: UnwindAssembly/x86/./UnwindAssemblyx86Tests/Testx86AssemblyInspectionEngine.TestReturnDetect (1928 of 2145) PASS: lldb-api :: lang/objc/modules-app-update/TestClangModulesAppUpdate.py (1929 of 2145) PASS: lldb-api :: lang/cpp/scope/TestCppScope.py (1930 of 2145) PASS: lldb-unit :: Utility/./UtilityTests/BinaryStreamTest.PutSLEB128MaxValue (1931 of 2145) PASS: lldb-api :: lang/cpp/dynamic-value-same-basename/TestDynamicValueSameBase.py (1932 of 2145) PASS: lldb-unit :: Process/gdb-remote/./ProcessGdbRemoteTests/GDBRemoteClientBaseTest.SendPacketAndReceiveResponseWithOutputSupport (1933 of 2145) PASS: lldb-api :: functionalities/breakpoint/address_breakpoints/TestAddressBreakpoints.py (1934 of 2145) PASS: lldb-unit :: ScriptInterpreter/Python/./ScriptInterpreterPythonTests/PythonDataObjectsTest.TestExceptions (1935 of 2145) PASS: lldb-api :: lang/objc/print-obj/TestPrintObj.py (1936 of 2145) PASS: lldb-api :: macosx/function-starts/TestFunctionStarts.py (1937 of 2145) PASS: lldb-unit :: UnwindAssembly/x86/./UnwindAssemblyx86Tests/Testx86AssemblyInspectionEngine.Test64bitFramelessSmallStackFrame (1938 of 2145) PASS: lldb-unit :: Utility/./UtilityTests/VMRange.CollectionContains (1939 of 2145) PASS: lldb-unit :: Utility/./UtilityTests/NameMatchesTest.Ignore (1940 of 2145) PASS: lldb-shell :: Minidump/fb-dump.test (1941 of 2145) PASS: lldb-unit :: Utility/./UtilityTests/StringExtractorTest.DecodeHexU8_Underflow2 (1942 of 2145) PASS: lldb-unit :: Utility/./UtilityTests/StreamTest.AddressRangeSize (1943 of 2145) PASS: lldb-shell :: SymbolFile/DWARF/DW_OP_piece-struct.s (1944 of 2145) UNSUPPORTED: lldb-shell :: SymbolFile/DWARF/debug-types-expressions.test (1945 of 2145) PASS: lldb-unit :: Utility/./UtilityTests/RangeDataVector.CustomSort (1946 of 2145) PASS: lldb-api :: lang/c/strings/TestCStrings.py (1947 of 2145) PASS: lldb-unit :: Utility/./UtilityTests/BinaryStreamTest.PutULEB128SixBytes (1948 of 2145) PASS: lldb-api :: functionalities/data-formatter/data-formatter-objc/nsindexpath/TestDataFormatterNSIndexPath.py (1949 of 2145) PASS: lldb-unit :: DataFormatter/./LLDBFormatterTests/TypeMatcherTests.GetMatchStringRegex (1950 of 2145) PASS: lldb-api :: python_api/watchpoint/condition/TestWatchpointConditionAPI.py (1951 of 2145) PASS: lldb-shell :: SymbolFile/NativePDB/function-types-builtins.cpp (1952 of 2145) PASS: lldb-shell :: SymbolFile/DWARF/dwarf5-index-is-used.cpp (1953 of 2145) PASS: lldb-unit :: Process/gdb-remote/./ProcessGdbRemoteTests/GDBRemoteCommunicationClientTest.GetMemoryRegionInfoInvalidResponse (1954 of 2145) PASS: lldb-api :: functionalities/inferior-crashing/TestInferiorCrashing.py (1955 of 2145) PASS: lldb-unit :: Symbol/./SymbolTests/TestClangASTImporter.DeportTypeTagDecl (1956 of 2145) PASS: lldb-api :: python_api/interpreter/TestCommandInterpreterAPI.py (1957 of 2145) PASS: lldb-unit :: Utility/./UtilityTests/PassiveReplayTest.InstrumentedFooInvalid (1958 of 2145) PASS: lldb-api :: functionalities/data-formatter/builtin-formats/TestBuiltinFormats.py (1959 of 2145) PASS: lldb-unit :: Utility/./UtilityTests/TimerTest.CategoryTimesStats (1960 of 2145) PASS: lldb-unit :: Symbol/./SymbolTests/TestClangASTImporter.CopyTypeTagDecl (1961 of 2145) PASS: lldb-unit :: Utility/./UtilityTests/StringListTest.LongestCommonPrefix (1962 of 2145) PASS: lldb-api :: functionalities/plugins/python_os_plugin/TestPythonOSPlugin.py (1963 of 2145) PASS: lldb-shell :: Reproducer/TestDiscard.test (1964 of 2145) PASS: lldb-api :: functionalities/breakpoint/cpp/TestCPPBreakpointLocations.py (1965 of 2145) PASS: lldb-shell :: Commands/command-thread-select.test (1966 of 2145) PASS: lldb-shell :: SymbolFile/Breakpad/line-table-edgecases.test (1967 of 2145) PASS: lldb-unit :: Utility/./UtilityTests/RangeTest.Union (1968 of 2145) PASS: lldb-api :: lang/cpp/std-function-step-into-callable/TestStdFunctionStepIntoCallable.py (1969 of 2145) PASS: lldb-api :: commands/expression/po_verbosity/TestPoVerbosity.py (1970 of 2145) PASS: lldb-api :: commands/apropos/with-process/TestAproposWithProcess.py (1971 of 2145) UNSUPPORTED: lldb-shell :: SymbolFile/DWARF/DW_TAG_GNU_call_site-DW_AT_low_pc.s (1972 of 2145) PASS: lldb-unit :: Utility/./UtilityTests/RegularExpression.Invalid (1973 of 2145) PASS: lldb-api :: functionalities/data-formatter/user-format-vs-summary/TestUserFormatVsSummary.py (1974 of 2145) PASS: lldb-unit :: Utility/./UtilityTests/BinaryStreamTest.PutULEB128ThreeBytes (1975 of 2145) PASS: lldb-api :: assert_messages_test/TestAssertMessages.py (1976 of 2145) PASS: lldb-unit :: Utility/./UtilityTests/StreamTest.PutChar (1977 of 2145) UNSUPPORTED: lldb-shell :: ScriptInterpreter/Lua/breakpoint_callback.test (1978 of 2145) PASS: lldb-api :: commands/expression/context-object-objc/TestContextObjectObjc.py (1979 of 2145) PASS: lldb-api :: types/TestLongTypes.py (1980 of 2145) PASS: lldb-api :: commands/expression/import-std-module/empty-module/TestEmptyStdModule.py (1981 of 2145) PASS: lldb-api :: functionalities/thread/concurrent_events/TestConcurrentSignalWatchBreak.py (1982 of 2145) PASS: lldb-api :: functionalities/tail_call_frames/ambiguous_tail_call_seq2/TestAmbiguousTailCallSeq2.py (1983 of 2145) PASS: lldb-api :: functionalities/thread/backtrace_limit/TestBacktraceLimit.py (1984 of 2145) PASS: lldb-api :: python_api/target/TestTargetAPI.py (1985 of 2145) PASS: lldb-api :: python_api/type/TestTypeList.py (1986 of 2145) PASS: lldb-api :: lang/objc/ivar-IMP/TestObjCiVarIMP.py (1987 of 2145) PASS: lldb-unit :: Target/./TargetTests/PathMappingListTest.AbsoluteTests (1988 of 2145) PASS: lldb-shell :: Quit/TestQuitExitCodeTooManyArgs.test (1989 of 2145) PASS: lldb-unit :: Utility/./UtilityTests/OptionsWithRawTest.WhitespaceInput (1990 of 2145) PASS: lldb-api :: python_api/objc_type/TestObjCType.py (1991 of 2145) PASS: lldb-unit :: Process/gdb-remote/./ProcessGdbRemoteTests/GDBRemoteClientBaseTest.SendContinueDelegateStructuredDataReceipt (1992 of 2145) PASS: lldb-unit :: Utility/./UtilityTests/StringExtractorTest.DecodeHexU8_InvalidHex2 (1993 of 2145) PASS: lldb-shell :: ObjectFile/ELF/PT_TLS-overlap-PT_LOAD.yaml (1994 of 2145) PASS: lldb-unit :: Utility/./UtilityTests/BroadcasterTest.EventTypeHasListeners (1995 of 2145) PASS: lldb-unit :: UnwindAssembly/PPC64/./PPC64InstEmulationTests/TestPPC64InstEmulation.TestMediumFunction (1996 of 2145) PASS: lldb-api :: commands/watchpoints/hello_watchpoint/TestMyFirstWatchpoint.py (1997 of 2145) PASS: lldb-api :: lang/cpp/this_class_type_mixing/TestThisClassTypeMixing.py (1998 of 2145) PASS: lldb-api :: tools/lldb-server/TestGdbRemote_qThreadStopInfo.py (1999 of 2145) PASS: lldb-unit :: Utility/./UtilityTests/StringListTest.AppendStringCString (2000 of 2145) PASS: lldb-api :: lang/objc/objc++/TestObjCXX.py (2001 of 2145) PASS: lldb-shell :: ObjectFile/ELF/minidebuginfo-corrupt-xz.yaml (2002 of 2145) PASS: lldb-api :: lang/objcxx/objcxx-ivar-vector/TestIvarVector.py (2003 of 2145) PASS: lldb-unit :: Expression/./ExpressionTests/DWARFExpression.DW_OP_piece (2004 of 2145) PASS: lldb-unit :: Platform/./LLDBPlatformTests/PlatformDarwinTest.TestParseVersionBuildDir (2005 of 2145) PASS: lldb-unit :: SymbolFile/DWARF/./SymbolFileDWARFTests/SymbolFileDWARFTests.TestAbbrevNullAttrValidForm (2006 of 2145) PASS: lldb-shell :: SymbolFile/DWARF/parallel-indexing-stress.s (2007 of 2145) PASS: lldb-shell :: SymbolFile/Breakpad/unwind-via-raSearch.test (2008 of 2145) PASS: lldb-unit :: Utility/./UtilityTests/OptionsWithRawTest.EmptySuffixSingleWhitespace (2009 of 2145) PASS: lldb-unit :: ObjectFile/Breakpad/./ObjectFileBreakpadTests/PublicRecord.parse (2010 of 2145) PASS: lldb-shell :: Minidump/Windows/broken-unwind.test (2011 of 2145) PASS: lldb-shell :: SymbolFile/NativePDB/nested-types.cpp (2012 of 2145) PASS: lldb-shell :: Reproducer/TestFileRepro.test (2013 of 2145) PASS: lldb-unit :: Symbol/./SymbolTests/PostfixExpression.ToDWARF (2014 of 2145) PASS: lldb-api :: python_api/signals/TestSignalsAPI.py (2015 of 2145) PASS: lldb-unit :: Utility/./UtilityTests/FileSpecTest.EqualDotsPosixRoot (2016 of 2145) PASS: lldb-shell :: SymbolFile/DWARF/dwp.s (2017 of 2145) UNSUPPORTED: lldb-shell :: Register/x86-64-zmm-write.test (2018 of 2145) PASS: lldb-unit :: Utility/./UtilityTests/StateTest.Formatv (2019 of 2145) PASS: lldb-api :: commands/expression/import-std-module/weak_ptr-dbg-info-content/TestDbgInfoContentWeakPtrFromStdModule.py (2020 of 2145) PASS: lldb-api :: functionalities/gdb_remote_client/TestProcessConnect.py (2021 of 2145) PASS: lldb-unit :: API/./APITests/SBCommandInterpreterTest.MultiWordCommand (2022 of 2145) PASS: lldb-api :: api/multiple-targets/TestMultipleTargets.py (2023 of 2145) PASS: lldb-unit :: Utility/./UtilityTests/PassiveReplayTest.InstrumentedBarRef (2024 of 2145) PASS: lldb-unit :: Utility/./UtilityTests/ArchSpecTest.TestParseMachCPUDashSubtypeTripleExtra (2025 of 2145) PASS: lldb-shell :: ObjectFile/PECOFF/uuid.yaml (2026 of 2145) UNSUPPORTED: lldb-shell :: Unwind/eh-frame-augment-noop.test (2027 of 2145) PASS: lldb-unit :: Utility/./UtilityTests/StringListTest.Clear (2028 of 2145) PASS: lldb-api :: functionalities/data-formatter/data-formatter-stl/libcxx/initializerlist/TestInitializerList.py (2029 of 2145) PASS: lldb-api :: functionalities/data-formatter/data-formatter-stl/libcxx/vbool/TestDataFormatterLibcxxVBool.py (2030 of 2145) PASS: lldb-unit :: SymbolFile/NativePDB/./SymbolFileNativePDBTests/PDBFPOProgramToDWARFExpressionTests.DependencyChain (2031 of 2145) PASS: lldb-shell :: Process/TestAbortExitCode.test (2032 of 2145) PASS: lldb-api :: functionalities/gdb_remote_client/TestWasm.py (2033 of 2145) PASS: lldb-api :: functionalities/breakpoint/global_constructor/TestBreakpointInGlobalConstructor.py (2034 of 2145) PASS: lldb-unit :: Utility/./UtilityTests/ArgsTest.GetQuotedCommandString (2035 of 2145) PASS: lldb-api :: python_api/disassemble-raw-data/TestDisassemble_VST1_64.py (2036 of 2145) PASS: lldb-unit :: Utility/./UtilityTests/ConstStringTest.YAML (2037 of 2145) PASS: lldb-shell :: ObjectFile/ELF/PT_LOAD-overlap-PT_TLS.yaml (2038 of 2145) PASS: lldb-api :: commands/expression/import-std-module/shared_ptr-dbg-info-content/TestSharedPtrDbgInfoContentFromStdModule.py (2039 of 2145) PASS: lldb-unit :: Process/gdb-remote/./ProcessGdbRemoteTests/GDBRemoteCommunicationClientTest.GetMemoryRegionInfo (2040 of 2145) PASS: lldb-unit :: Utility/./UtilityTests/CompletionRequest.DuplicateFilteringWithComments (2041 of 2145) PASS: lldb-unit :: Utility/./UtilityTests/ConstStringTest.UpdateMangledCounterpart (2042 of 2145) PASS: lldb-api :: commands/expression/call-function/TestCallStdStringFunction.py (2043 of 2145) PASS: lldb-unit :: Target/./TargetTests/ModuleCacheTest.GetAndPut (2044 of 2145) PASS: lldb-api :: python_api/sbenvironment/TestSBEnvironment.py (2045 of 2145) PASS: lldb-shell :: ScriptInterpreter/None/import_module.test (2046 of 2145) PASS: lldb-shell :: SymbolFile/DWARF/dwp-debug-types.s (2047 of 2145) PASS: lldb-shell :: SymbolFile/Breakpad/line-table-mixed-path-styles.test (2048 of 2145) PASS: lldb-api :: functionalities/ubsan/basic/TestUbsanBasic.py (2049 of 2145) PASS: lldb-api :: arm/emulation/TestEmulations.py (2050 of 2145) PASS: lldb-api :: commands/expression/import-std-module/basic/TestImportStdModule.py (2051 of 2145) PASS: lldb-unit :: Utility/./UtilityTests/Predicate.WaitForValueEqualTo (2052 of 2145) PASS: lldb-unit :: ObjectFile/Breakpad/./ObjectFileBreakpadTests/ModuleRecord.parse (2053 of 2145) PASS: lldb-api :: commands/expression/import-std-module/list-dbg-info-content/TestDbgInfoContentListFromStdModule.py (2054 of 2145) PASS: lldb-unit :: Expression/./ExpressionTests/DiagnosticManagerTest.HasFixits (2055 of 2145) PASS: lldb-api :: functionalities/breakpoint/inlined_breakpoints/TestInlinedBreakpoints.py (2056 of 2145) PASS: lldb-api :: functionalities/data-formatter/data-formatter-stl/libcxx/forward_list/TestDataFormatterLibcxxForwardList.py (2057 of 2145) PASS: lldb-api :: commands/watchpoints/watchpoint_commands/TestWatchpointCommands.py (2058 of 2145) PASS: lldb-unit :: ScriptInterpreter/Python/./ScriptInterpreterPythonTests/PythonDataObjectsTest.TestPythonFile (2059 of 2145) PASS: lldb-unit :: Utility/./UtilityTests/OptionsWithRawTest.ArgsButNoLeadingDash (2060 of 2145) PASS: lldb-unit :: Utility/./UtilityTests/RangeTest.NotEqual (2061 of 2145) PASS: lldb-unit :: ScriptInterpreter/Python/./ScriptInterpreterPythonTests/PythonDataObjectsTest.TestScript (2062 of 2145) PASS: lldb-api :: functionalities/gdb_remote_client/TestGDBRemoteDiskFileCompletion.py (2063 of 2145) PASS: lldb-unit :: Symbol/./SymbolTests/Type.CompilerContextPattern (2064 of 2145) PASS: lldb-api :: python_api/class_members/TestSBTypeClassMembers.py (2065 of 2145) PASS: lldb-api :: macosx/macCatalyst/TestMacCatalyst.py (2066 of 2145) PASS: lldb-api :: functionalities/data-formatter/stringprinter/TestStringPrinter.py (2067 of 2145) PASS: lldb-unit :: Utility/./UtilityTests/StringExtractorTest.GetHexU8_InvalidHex_NoEof (2068 of 2145) PASS: lldb-unit :: ObjectFile/PECOFF/./ObjectFilePECOFFTests/PECallFrameInfoTest.Frame_reg_eh (2069 of 2145) PASS: lldb-unit :: Utility/./UtilityTests/StreamTest.QuotedCString (2070 of 2145) PASS: lldb-api :: lang/c/bitfields/TestBitfields.py (2071 of 2145) PASS: lldb-api :: functionalities/breakpoint/objc/TestObjCBreakpoints.py (2072 of 2145) PASS: lldb-api :: functionalities/gdb_remote_client/TestArmRegisterDefinition.py (2073 of 2145) PASS: lldb-unit :: Language/Highlighting/./HighlighterTests/HighlighterTest.DefaultHighlighterWithCursor (2074 of 2145) PASS: lldb-shell :: Reproducer/TestDSYM.test (2075 of 2145) PASS: lldb-unit :: DataFormatter/./LLDBFormatterTests/TypeMatcherTests.CreatedBySameMatchStringExactNamePrefixes (2076 of 2145) PASS: lldb-api :: python_api/get-value-32bit-int/TestGetValue32BitInt.py (2077 of 2145) PASS: lldb-unit :: Utility/./UtilityTests/ConstStringTest.NullAndEmptyStates (2078 of 2145) PASS: lldb-unit :: Utility/./UtilityTests/StringListTest.Join (2079 of 2145) PASS: lldb-api :: lang/cpp/char1632_t/TestChar1632T.py (2080 of 2145) PASS: lldb-unit :: UnwindAssembly/PPC64/./PPC64InstEmulationTests/TestPPC64InstEmulation.TestSimpleFunction (2081 of 2145) PASS: lldb-api :: functionalities/gdb_remote_client/TestGDBRemoteLoad.py (2082 of 2145) PASS: lldb-api :: python_api/module_section/TestModuleAndSection.py (2083 of 2145) PASS: lldb-unit :: Process/gdb-remote/./ProcessGdbRemoteTests/GDBRemoteCommunicationClientTest.SyncThreadState (2084 of 2145) PASS: lldb-unit :: Host/./HostTests/MainLoopTest.ReadObject (2085 of 2145) XFAIL: lldb-shell :: Register/x86-mm-xmm-read.test (2086 of 2145) PASS: lldb-unit :: Expression/./ExpressionTests/CppModuleConfigurationTest.AmbiguousLibCpp (2087 of 2145) PASS: lldb-shell :: Process/Optimization.test (2088 of 2145) PASS: lldb-api :: commands/expression/class_template_specialization_empty_pack/TestClassTemplateSpecializationParametersHandling.py (2089 of 2145) PASS: lldb-api :: sample_test/TestSampleTest.py (2090 of 2145) PASS: lldb-api :: sanity/TestSettingSkipping.py (2091 of 2145) PASS: lldb-unit :: Expression/./ExpressionTests/ClangHostTest.ComputeClangResourceDirectory (2092 of 2145) PASS: lldb-api :: functionalities/postmortem/minidump/TestMiniDump.py (2093 of 2145) PASS: lldb-unit :: Utility/./UtilityTests/VMRange.Comparison (2094 of 2145) PASS: lldb-shell :: SymbolFile/NativePDB/globals-fundamental.cpp (2095 of 2145) PASS: lldb-unit :: Utility/./UtilityTests/TimeoutTest.Construction (2096 of 2145) PASS: lldb-unit :: Core/./LLDBCoreTests/SourceFileCache.FindSourceFileNotFound (2097 of 2145) PASS: lldb-api :: commands/expression/radar_9531204/TestPrintfAfterUp.py (2098 of 2145) PASS: lldb-api :: commands/expression/two-files/TestObjCTypeQueryFromOtherCompileUnit.py (2099 of 2145) PASS: lldb-api :: functionalities/data-formatter/language_category_updates/TestDataFormatterLanguageCategoryUpdates.py (2100 of 2145) PASS: lldb-api :: macosx/DBGSourcePathRemapping/TestDSYMSourcePathRemapping.py (2101 of 2145) PASS: lldb-unit :: Utility/./UtilityTests/ConstStringTest.CompareConstString (2102 of 2145) PASS: lldb-api :: functionalities/wrong_commands/TestWrongCommands.py (2103 of 2145) PASS: lldb-api :: lang/cpp/overloaded-functions/TestOverloadedFunctions.py (2104 of 2145) PASS: lldb-api :: functionalities/thread/concurrent_events/TestConcurrentWatchpointWithDelayWatchpointThreads.py (2105 of 2145) PASS: lldb-api :: lang/objc/global_ptrs/TestGlobalObjects.py (2106 of 2145) PASS: lldb-unit :: Utility/./UtilityTests/RangeTest.SlideZero (2107 of 2145) PASS: lldb-unit :: Utility/./UtilityTests/StringListTest.SplitIntoLinesEmpty (2108 of 2145) PASS: lldb-unit :: Utility/./UtilityTests/SerializationRountripTest.SerializeDeserializePod (2109 of 2145) PASS: lldb-unit :: Utility/./UtilityTests/RangeTest.NotEqualInvalid (2110 of 2145) PASS: lldb-api :: functionalities/data-formatter/format-propagation/TestFormatPropagation.py (2111 of 2145) PASS: lldb-shell :: ObjectFile/MachO/symtab.yaml (2112 of 2145) PASS: lldb-api :: commands/expression/static-initializers/TestStaticInitializers.py (2113 of 2145) PASS: lldb-unit :: Utility/./UtilityTests/StringListTest.JoinNonSpace (2114 of 2145) PASS: lldb-unit :: Host/./HostTests/SocketAddressTest.Set (2115 of 2145) PASS: lldb-unit :: Symbol/./SymbolTests/TestClangASTImporter.ImportInvalidType (2116 of 2145) PASS: lldb-api :: functionalities/thread/concurrent_events/TestConcurrentSignalDelayWatch.py (2117 of 2145) PASS: lldb-unit :: Target/./TargetTests/PathMappingListTest.RemapRoot (2118 of 2145) PASS: lldb-shell :: Breakpoint/implicit_const_form_support.test (2119 of 2145) PASS: lldb-api :: functionalities/inferior-crashing/recursive-inferior/TestRecursiveInferiorStep.py (2120 of 2145) PASS: lldb-api :: lang/cpp/char8_t/TestCxxChar8_t.py (2121 of 2145) PASS: lldb-unit :: Signals/./SignalsTests/UnixSignalsTest.Iteration (2122 of 2145) PASS: lldb-api :: commands/expression/options/TestExprOptions.py (2123 of 2145) PASS: lldb-api :: lang/c/const_variables/TestConstVariables.py (2124 of 2145) PASS: lldb-unit :: Process/minidump/./LLDBMinidumpTests/MinidumpParserTest.MinidumpDuplicateModuleSeparateCode (2125 of 2145) PASS: lldb-api :: commands/frame/diagnose/dereference-function-return/TestDiagnoseDereferenceFunctionReturn.py (2126 of 2145) PASS: lldb-api :: commands/expression/fixits/TestFixIts.py (2127 of 2145) PASS: lldb-api :: commands/command/script_alias/TestCommandScriptAlias.py (2128 of 2145) PASS: lldb-api :: tools/lldb-vscode/breakpoint/TestVSCode_setFunctionBreakpoints.py (2129 of 2145) PASS: lldb-unit :: Target/./TargetTests/ModuleCacheTest.GetAndPutUuidExists (2130 of 2145) PASS: lldb-unit :: Expression/./ExpressionTests/DiagnosticManagerTest.AppendMessageAttachToLastDiag (2131 of 2145) PASS: lldb-api :: lang/objc/objc-stepping/TestObjCStepping.py (2132 of 2145) PASS: lldb-unit :: Utility/./UtilityTests/StringListTest.InsertStringAtIndexMove (2133 of 2145) PASS: lldb-api :: commands/apropos/basic/TestApropos.py (2134 of 2145) PASS: lldb-api :: functionalities/thread/concurrent_events/TestConcurrentTwoBreakpointsOneWatchpoint.py (2135 of 2145) PASS: lldb-unit :: Process/./ProcessEventDataTests/ProcessEventDataTest.DoOnRemoval (2136 of 2145) PASS: lldb-api :: lang/c/tls_globals/TestTlsGlobals.py (2137 of 2145) PASS: lldb-shell :: ExecControl/StopHook/stop-hook.test (2138 of 2145) PASS: lldb-api :: python_api/sbdata/TestSBData.py (2139 of 2145) PASS: lldb-api :: functionalities/asan/TestMemoryHistory.py (2140 of 2145) PASS: lldb-unit :: Utility/./UtilityTests/SubsystemRAIITest.NormalSubsystem (2141 of 2145) XFAIL: lldb-shell :: Register/x86-64-ymm-write.test (2142 of 2145) PASS: lldb-api :: commands/settings/quoting/TestQuoting.py (2143 of 2145) PASS: lldb-api :: lang/cpp/nested-class-other-compilation-unit/TestNestedClassWithParentInAnotherCU.py (2144 of 2145) PASS: lldb-api :: lang/objc/conflicting-definition/TestConflictingDefinition.py (2145 of 2145) Slowest Tests: -------------------------------------------------------------------------- 600.90s: lldb-api :: macosx/simulator/TestSimulatorPlatform.py 257.51s: lldb-api :: tools/lldb-server/TestLldbGdbServer.py 148.38s: lldb-api :: lang/objc/foundation/TestConstStrings.py 125.36s: lldb-api :: lang/cpp/member-and-local-vars-with-same-name/TestMembersAndLocalsWithSameName.py 117.17s: lldb-api :: lang/objc/foundation/TestObjCMethodsString.py 99.93s: lldb-api :: functionalities/breakpoint/source_regexp/TestSourceRegexBreakpoints.py 81.10s: lldb-api :: functionalities/data-formatter/data-formatter-stl/libcxx/iterator/TestDataFormatterLibccIterator.py 79.72s: lldb-api :: functionalities/data-formatter/data-formatter-stl/libcxx/optional/TestDataFormatterLibcxxOptional.py 76.85s: lldb-api :: functionalities/gdb_remote_client/TestNoWatchpointSupportInfo.py 75.85s: lldb-api :: commands/expression/call-throws/TestCallThatThrows.py 70.34s: lldb-api :: lang/objc/foundation/TestFoundationDisassembly.py 67.21s: lldb-api :: lang/c/anonymous/TestAnonymous.py 65.07s: lldb-shell :: Watchpoint/SetErrorCases.test 64.24s: lldb-api :: functionalities/thread/create_during_step/TestCreateDuringStep.py 63.32s: lldb-api :: lang/objc/hidden-ivars/TestHiddenIvars.py 56.56s: lldb-api :: api/multithreaded/TestMultithreaded.py 54.83s: lldb-api :: lang/objc/foundation/TestObjCMethods.py 54.10s: lldb-api :: lang/objc/exceptions/TestObjCExceptions.py 52.49s: lldb-shell :: SymbolFile/NativePDB/function-types-classes.cpp 49.84s: lldb-api :: functionalities/postmortem/mach-core/TestMachCore.py

Hide Details

Tests Times: -------------------------------------------------------------------------- [ Range ] :: [ Percentage ] :: [ Count ] -------------------------------------------------------------------------- [600s,650s) :: [ ] :: [ 1/2145] [550s,600s) :: [ ] :: [ 0/2145] [500s,550s) :: [ ] :: [ 0/2145] [450s,500s) :: [ ] :: [ 0/2145] [400s,450s) :: [ ] :: [ 0/2145] [350s,400s) :: [ ] :: [ 0/2145] [300s,350s) :: [ ] :: [ 0/2145] [250s,300s) :: [ ] :: [ 1/2145] [200s,250s) :: [ ] :: [ 0/2145] [150s,200s) :: [ ] :: [ 1/2145] [100s,150s) :: [ ] :: [ 3/2145] [ 50s,100s) :: [ ] :: [ 16/2145] [ 0s, 50s) :: [*************************************** ] :: [2123/2145] -------------------------------------------------------------------------- ******************** Timed Out Tests (1): lldb-api :: macosx/simulator/TestSimulatorPlatform.py

Hide Details

Hide Details

Testing Time: 2045.92s Unsupported : 151 Passed : 1987 Expectedly Failed: 6 Timed Out : 1 FAILED: tools/lldb/test/CMakeFiles/check-lldb-lit cd /Users/buildslave/jenkins/workspace/lldb-cmake/lldb-build/tools/lldb/test && /usr/local/Frameworks/Python.framework/Versions/3.7/bin/python3.7 /Users/buildslave/jenkins/workspace/lldb-cmake/lldb-build/./bin/llvm-lit -v --time-tests --shuffle --xunit-xml-output=/Users/buildslave/jenkins/workspace/lldb-cmake/test/results.xml -v -j 4 /Users/buildslave/jenkins/workspace/lldb-cmake/lldb-build/tools/lldb/test ninja: build stopped: subcommand failed. Command failed: Command '['/usr/bin/env', 'TERM=vt100', '/usr/local/bin/ninja', '-v', 'check-lldb']' returned non-zero exit status 1 Command: ['/usr/bin/env', 'TERM=vt100', '/usr/local/bin/ninja', '-v', 'check-lldb'] [Pipeline] } [Pipeline] // timeout [Pipeline] } [Pipeline] // stage [Pipeline] stage [Pipeline] { (Declarative: Post Actions) [Pipeline] scanForIssues [Clang (LLVM based)] Sleeping for 5 seconds due to JENKINS-32191... [Clang (LLVM based)] Parsing console log (workspace: '/Users/buildslave/jenkins/workspace/lldb-cmake') [Clang (LLVM based)] Successfully parsed console log [Clang (LLVM based)] -> found 11 issues (skipped 36 duplicates) [Clang (LLVM based)] Post processing issues on 'green-dragon-10' with source code encoding 'UTF-8' [Clang (LLVM based)] Creating SCM blamer to obtain author and commit information for affected files [Clang (LLVM based)] Creating SCM miner to obtain statistics for affected repository files [Clang (LLVM based)] Resolving file names for all issues in source directory '/Users/buildslave/jenkins/workspace/lldb-cmake' [Clang (LLVM based)] -> resolved paths in source directory (7 found, 0 not found) [Clang (LLVM based)] Resolving module names from module definitions (build.xml, pom.xml, or Manifest.mf files) [Clang (LLVM based)] -> resolved module names for 11 issues [Clang (LLVM based)] Resolving package names (or namespaces) by parsing the affected files [Clang (LLVM based)] -> resolved package names of 7 affected files [Clang (LLVM based)] No filter has been set, publishing all 11 issues [Clang (LLVM based)] Creating fingerprints for all affected code blocks to track issues over different builds [Clang (LLVM based)] -> created fingerprints for 11 issues (skipped 0 issues) [Clang (LLVM based)] Copying affected files to Jenkins' build folder '/Users/Shared/Jenkins/Home/jobs/lldb-cmake/builds/23871/files-with-issues' [Clang (LLVM based)] -> 5 copied, 2 not in workspace, 0 not-found, 0 with I/O error [Pipeline] junit Recording test results [Pipeline] emailext Warning: uday@polymagelabs.com is not a recognized user, but sending mail anyway Warning: wei.huang@ibm.com is not a recognized user, but sending mail anyway Warning: nikita.ppv@gmail.com is not a recognized user, but sending mail anyway Warning: andrew_litteken@apple.com is not a recognized user, but sending mail anyway Warning: llvmgnsyncbot@gmail.com is not a recognized user, but sending mail anyway Warning: mcinally@cray.com is not a recognized user, but sending mail anyway Warning: jonathan_roelofs@apple.com is not a recognized user, but sending mail anyway Warning: whitneyt@recycler.canlab.ibm.com is not a recognized user, but sending mail anyway Warning: rnk@google.com is not a recognized user, but sending mail anyway Warning: Yaxun.Liu@amd.com is not a recognized user, but sending mail anyway Warning: spatel@rotateright.com is not a recognized user, but sending mail anyway Warning: craig.topper@intel.com is not a recognized user, but sending mail anyway Warning: flo@fhahn.com is not a recognized user, but sending mail anyway Warning: uday@polymagelabs.com is not a recognized user, but sending mail anyway Warning: wei.huang@ibm.com is not a recognized user, but sending mail anyway Warning: nikita.ppv@gmail.com is not a recognized user, but sending mail anyway Warning: andrew_litteken@apple.com is not a recognized user, but sending mail anyway Warning: llvmgnsyncbot@gmail.com is not a recognized user, but sending mail anyway Warning: mcinally@cray.com is not a recognized user, but sending mail anyway Warning: jonathan_roelofs@apple.com is not a recognized user, but sending mail anyway Warning: whitneyt@recycler.canlab.ibm.com is not a recognized user, but sending mail anyway Warning: rnk@google.com is not a recognized user, but sending mail anyway Warning: Yaxun.Liu@amd.com is not a recognized user, but sending mail anyway Warning: spatel@rotateright.com is not a recognized user, but sending mail anyway Warning: craig.topper@intel.com is not a recognized user, but sending mail anyway Warning: flo@fhahn.com is not a recognized user, but sending mail anyway

Hide Details

Begin Pre-Send Script... Sending email to: Florian Hahn <florian_hahn@apple.com> Florian Hahn <florian_hahn@apple.com> Azhar Mohammed <azhar@apple.com>
[Pipeline] } [Pipeline] // stage [Pipeline] } [Pipeline] // withEnv [Pipeline] } [Pipeline] // node [Pipeline] End of Pipeline ERROR: script returned exit code 1 Finished: FAILURE