FailedConsole Output

Skipping 8,260 KB.. Full Log
d-initializers -pedantic -Wno-long-long -Wimplicit-fallthrough -Wcovered-switch-default -Wno-noexcept-type -Wnon-virtual-dtor -Wdelete-non-virtual-dtor -Wsuggest-override -Wstring-conversion -fdiagnostics-color -O3  -isysroot /Applications/Xcode.app/Contents/Developer/Platforms/MacOSX.platform/Developer/SDKs/MacOSX10.15.sdk -Wl,-search_paths_first -Wl,-headerpad_max_install_names -Wl,-dead_strip tools/llvm-reduce/CMakeFiles/llvm-reduce.dir/TestRunner.cpp.o tools/llvm-reduce/CMakeFiles/llvm-reduce.dir/deltas/Delta.cpp.o tools/llvm-reduce/CMakeFiles/llvm-reduce.dir/deltas/ReduceArguments.cpp.o tools/llvm-reduce/CMakeFiles/llvm-reduce.dir/deltas/ReduceAttributes.cpp.o tools/llvm-reduce/CMakeFiles/llvm-reduce.dir/deltas/ReduceBasicBlocks.cpp.o tools/llvm-reduce/CMakeFiles/llvm-reduce.dir/deltas/ReduceFunctionBodies.cpp.o tools/llvm-reduce/CMakeFiles/llvm-reduce.dir/deltas/ReduceFunctions.cpp.o tools/llvm-reduce/CMakeFiles/llvm-reduce.dir/deltas/ReduceGlobalVars.cpp.o tools/llvm-reduce/CMakeFiles/llvm-reduce.dir/deltas/ReduceInstructions.cpp.o tools/llvm-reduce/CMakeFiles/llvm-reduce.dir/deltas/ReduceMetadata.cpp.o tools/llvm-reduce/CMakeFiles/llvm-reduce.dir/deltas/ReduceOperandBundles.cpp.o tools/llvm-reduce/CMakeFiles/llvm-reduce.dir/llvm-reduce.cpp.o  -o bin/llvm-reduce  -Wl,-rpath,@loader_path/../lib  lib/libLLVMAArch64AsmParser.a  lib/libLLVMAMDGPUAsmParser.a  lib/libLLVMARMAsmParser.a  lib/libLLVMAVRAsmParser.a  lib/libLLVMBPFAsmParser.a  lib/libLLVMHexagonAsmParser.a  lib/libLLVMLanaiAsmParser.a  lib/libLLVMMipsAsmParser.a  lib/libLLVMMSP430AsmParser.a  lib/libLLVMPowerPCAsmParser.a  lib/libLLVMRISCVAsmParser.a  lib/libLLVMSparcAsmParser.a  lib/libLLVMSystemZAsmParser.a  lib/libLLVMWebAssemblyAsmParser.a  lib/libLLVMX86AsmParser.a  lib/libLLVMAArch64CodeGen.a  lib/libLLVMAMDGPUCodeGen.a  lib/libLLVMARMCodeGen.a  lib/libLLVMAVRCodeGen.a  lib/libLLVMBPFCodeGen.a  lib/libLLVMHexagonCodeGen.a  lib/libLLVMLanaiCodeGen.a  lib/libLLVMMipsCodeGen.a  lib/libLLVMMSP430CodeGen.a  lib/libLLVMNVPTXCodeGen.a  lib/libLLVMPowerPCCodeGen.a  lib/libLLVMRISCVCodeGen.a  lib/libLLVMSparcCodeGen.a  lib/libLLVMSystemZCodeGen.a  lib/libLLVMWebAssemblyCodeGen.a  lib/libLLVMX86CodeGen.a  lib/libLLVMXCoreCodeGen.a  lib/libLLVMAArch64Desc.a  lib/libLLVMAMDGPUDesc.a  lib/libLLVMARMDesc.a  lib/libLLVMAVRDesc.a  lib/libLLVMBPFDesc.a  lib/libLLVMHexagonDesc.a  lib/libLLVMLanaiDesc.a  lib/libLLVMMipsDesc.a  lib/libLLVMMSP430Desc.a  lib/libLLVMNVPTXDesc.a  lib/libLLVMPowerPCDesc.a  lib/libLLVMRISCVDesc.a  lib/libLLVMSparcDesc.a  lib/libLLVMSystemZDesc.a  lib/libLLVMWebAssemblyDesc.a  lib/libLLVMX86Desc.a  lib/libLLVMXCoreDesc.a  lib/libLLVMAArch64Info.a  lib/libLLVMAMDGPUInfo.a  lib/libLLVMARMInfo.a  lib/libLLVMAVRInfo.a  lib/libLLVMBPFInfo.a  lib/libLLVMHexagonInfo.a  lib/libLLVMLanaiInfo.a  lib/libLLVMMipsInfo.a  lib/libLLVMMSP430Info.a  lib/libLLVMNVPTXInfo.a  lib/libLLVMPowerPCInfo.a  lib/libLLVMRISCVInfo.a  lib/libLLVMSparcInfo.a  lib/libLLVMSystemZInfo.a  lib/libLLVMWebAssemblyInfo.a  lib/libLLVMX86Info.a  lib/libLLVMXCoreInfo.a  lib/libLLVMCore.a  lib/libLLVMIRReader.a  lib/libLLVMSupport.a  lib/libLLVMTarget.a  lib/libLLVMTransformUtils.a  lib/libLLVMAArch64Utils.a  lib/libLLVMAMDGPUUtils.a  lib/libLLVMMIRParser.a  lib/libLLVMARMUtils.a  lib/libLLVMHexagonAsmParser.a  lib/libLLVMHexagonDesc.a  lib/libLLVMHexagonInfo.a  lib/libLLVMLanaiAsmParser.a  lib/libLLVMLanaiDesc.a  lib/libLLVMLanaiInfo.a  lib/libLLVMipo.a  lib/libLLVMIRReader.a  lib/libLLVMAsmParser.a  lib/libLLVMVectorize.a  lib/libLLVMFrontendOpenMP.a  lib/libLLVMInstrumentation.a  lib/libLLVMLinker.a  lib/libLLVMRISCVUtils.a  lib/libLLVMMCDisassembler.a  lib/libLLVMCFGuard.a  lib/libLLVMGlobalISel.a  lib/libLLVMAsmPrinter.a  lib/libLLVMDebugInfoDWARF.a  lib/libLLVMSelectionDAG.a  lib/libLLVMCodeGen.a  lib/libLLVMTarget.a  lib/libLLVMScalarOpts.a  lib/libLLVMAggressiveInstCombine.a  lib/libLLVMInstCombine.a  lib/libLLVMTransformUtils.a  lib/libLLVMBitWriter.a  lib/libLLVMAnalysis.a  lib/libLLVMProfileData.a  lib/libLLVMObject.a  lib/libLLVMMCParser.a  lib/libLLVMMC.a  lib/libLLVMDebugInfoCodeView.a  lib/libLLVMDebugInfoMSF.a  lib/libLLVMBitReader.a  lib/libLLVMCore.a  lib/libLLVMRemarks.a  lib/libLLVMBitstreamReader.a  lib/libLLVMTextAPI.a  lib/libLLVMBinaryFormat.a  lib/libLLVMSupport.a  -lm  /usr/lib/libz.dylib  /usr/lib/libcurses.dylib  lib/libLLVMDemangle.a && :
[5105/5184] /Users/buildslave/jenkins/workspace/lldb-cmake/host-compiler/bin/clang++  -DGTEST_HAS_RTTI=0 -D_DEBUG -D__STDC_CONSTANT_MACROS -D__STDC_FORMAT_MACROS -D__STDC_LIMIT_MACROS -Itools/llvm-split -I/Users/buildslave/jenkins/workspace/lldb-cmake/llvm-project/llvm/tools/llvm-split -Iinclude -I/Users/buildslave/jenkins/workspace/lldb-cmake/llvm-project/llvm/include -Wdocumentation -fPIC -fvisibility-inlines-hidden -Werror=date-time -Werror=unguarded-availability-new -fmodules -fmodules-cache-path=/Users/buildslave/jenkins/workspace/lldb-cmake/lldb-build/module.cache -fcxx-modules -Xclang -fmodules-local-submodule-visibility -Wall -Wextra -Wno-unused-parameter -Wwrite-strings -Wcast-qual -Wmissing-field-initializers -pedantic -Wno-long-long -Wimplicit-fallthrough -Wcovered-switch-default -Wno-noexcept-type -Wnon-virtual-dtor -Wdelete-non-virtual-dtor -Wsuggest-override -Wstring-conversion -fdiagnostics-color -O3  -isysroot /Applications/Xcode.app/Contents/Developer/Platforms/MacOSX.platform/Developer/SDKs/MacOSX10.15.sdk    -fno-exceptions -fno-rtti -UNDEBUG -std=c++14 -MD -MT tools/llvm-split/CMakeFiles/llvm-split.dir/llvm-split.cpp.o -MF tools/llvm-split/CMakeFiles/llvm-split.dir/llvm-split.cpp.o.d -o tools/llvm-split/CMakeFiles/llvm-split.dir/llvm-split.cpp.o -c /Users/buildslave/jenkins/workspace/lldb-cmake/llvm-project/llvm/tools/llvm-split/llvm-split.cpp
[5106/5184] : && /Users/buildslave/jenkins/workspace/lldb-cmake/host-compiler/bin/clang++  -Wdocumentation -fPIC -fvisibility-inlines-hidden -Werror=date-time -Werror=unguarded-availability-new -fmodules -fmodules-cache-path=/Users/buildslave/jenkins/workspace/lldb-cmake/lldb-build/module.cache -fcxx-modules -Xclang -fmodules-local-submodule-visibility -Wall -Wextra -Wno-unused-parameter -Wwrite-strings -Wcast-qual -Wmissing-field-initializers -pedantic -Wno-long-long -Wimplicit-fallthrough -Wcovered-switch-default -Wno-noexcept-type -Wnon-virtual-dtor -Wdelete-non-virtual-dtor -Wsuggest-override -Wstring-conversion -fdiagnostics-color -O3  -isysroot /Applications/Xcode.app/Contents/Developer/Platforms/MacOSX.platform/Developer/SDKs/MacOSX10.15.sdk -Wl,-search_paths_first -Wl,-headerpad_max_install_names -Wl,-dead_strip tools/llvm-split/CMakeFiles/llvm-split.dir/llvm-split.cpp.o  -o bin/llvm-split  -Wl,-rpath,@loader_path/../lib  lib/libLLVMTransformUtils.a  lib/libLLVMBitWriter.a  lib/libLLVMCore.a  lib/libLLVMIRReader.a  lib/libLLVMSupport.a  lib/libLLVMAnalysis.a  lib/libLLVMProfileData.a  lib/libLLVMObject.a  lib/libLLVMMCParser.a  lib/libLLVMMC.a  lib/libLLVMDebugInfoCodeView.a  lib/libLLVMDebugInfoMSF.a  lib/libLLVMTextAPI.a  lib/libLLVMAsmParser.a  lib/libLLVMBitReader.a  lib/libLLVMCore.a  lib/libLLVMBinaryFormat.a  lib/libLLVMRemarks.a  lib/libLLVMBitstreamReader.a  lib/libLLVMSupport.a  -lm  /usr/lib/libz.dylib  /usr/lib/libcurses.dylib  lib/libLLVMDemangle.a && :
[5107/5184] /Users/buildslave/jenkins/workspace/lldb-cmake/host-compiler/bin/clang++  -DGTEST_HAS_RTTI=0 -D_DEBUG -D__STDC_CONSTANT_MACROS -D__STDC_FORMAT_MACROS -D__STDC_LIMIT_MACROS -Itools/llvm-undname -I/Users/buildslave/jenkins/workspace/lldb-cmake/llvm-project/llvm/tools/llvm-undname -Iinclude -I/Users/buildslave/jenkins/workspace/lldb-cmake/llvm-project/llvm/include -Wdocumentation -fPIC -fvisibility-inlines-hidden -Werror=date-time -Werror=unguarded-availability-new -fmodules -fmodules-cache-path=/Users/buildslave/jenkins/workspace/lldb-cmake/lldb-build/module.cache -fcxx-modules -Xclang -fmodules-local-submodule-visibility -Wall -Wextra -Wno-unused-parameter -Wwrite-strings -Wcast-qual -Wmissing-field-initializers -pedantic -Wno-long-long -Wimplicit-fallthrough -Wcovered-switch-default -Wno-noexcept-type -Wnon-virtual-dtor -Wdelete-non-virtual-dtor -Wsuggest-override -Wstring-conversion -fdiagnostics-color -O3  -isysroot /Applications/Xcode.app/Contents/Developer/Platforms/MacOSX.platform/Developer/SDKs/MacOSX10.15.sdk    -fno-exceptions -fno-rtti -UNDEBUG -std=c++14 -MD -MT tools/llvm-undname/CMakeFiles/llvm-undname.dir/llvm-undname.cpp.o -MF tools/llvm-undname/CMakeFiles/llvm-undname.dir/llvm-undname.cpp.o.d -o tools/llvm-undname/CMakeFiles/llvm-undname.dir/llvm-undname.cpp.o -c /Users/buildslave/jenkins/workspace/lldb-cmake/llvm-project/llvm/tools/llvm-undname/llvm-undname.cpp
[5108/5184] : && /Users/buildslave/jenkins/workspace/lldb-cmake/host-compiler/bin/clang++  -Wdocumentation -fPIC -fvisibility-inlines-hidden -Werror=date-time -Werror=unguarded-availability-new -fmodules -fmodules-cache-path=/Users/buildslave/jenkins/workspace/lldb-cmake/lldb-build/module.cache -fcxx-modules -Xclang -fmodules-local-submodule-visibility -Wall -Wextra -Wno-unused-parameter -Wwrite-strings -Wcast-qual -Wmissing-field-initializers -pedantic -Wno-long-long -Wimplicit-fallthrough -Wcovered-switch-default -Wno-noexcept-type -Wnon-virtual-dtor -Wdelete-non-virtual-dtor -Wsuggest-override -Wstring-conversion -fdiagnostics-color -O3  -isysroot /Applications/Xcode.app/Contents/Developer/Platforms/MacOSX.platform/Developer/SDKs/MacOSX10.15.sdk -Wl,-search_paths_first -Wl,-headerpad_max_install_names -Wl,-dead_strip tools/llvm-undname/CMakeFiles/llvm-undname.dir/llvm-undname.cpp.o  -o bin/llvm-undname  -Wl,-rpath,@loader_path/../lib  lib/libLLVMDemangle.a  lib/libLLVMSupport.a  lib/libLLVMDemangle.a  -lm  /usr/lib/libz.dylib  /usr/lib/libcurses.dylib && :
[5109/5184] /Users/buildslave/jenkins/workspace/lldb-cmake/host-compiler/bin/clang++  -DGTEST_HAS_RTTI=0 -D_DEBUG -D__STDC_CONSTANT_MACROS -D__STDC_FORMAT_MACROS -D__STDC_LIMIT_MACROS -Itools/llvm-strings -I/Users/buildslave/jenkins/workspace/lldb-cmake/llvm-project/llvm/tools/llvm-strings -Iinclude -I/Users/buildslave/jenkins/workspace/lldb-cmake/llvm-project/llvm/include -Wdocumentation -fPIC -fvisibility-inlines-hidden -Werror=date-time -Werror=unguarded-availability-new -fmodules -fmodules-cache-path=/Users/buildslave/jenkins/workspace/lldb-cmake/lldb-build/module.cache -fcxx-modules -Xclang -fmodules-local-submodule-visibility -Wall -Wextra -Wno-unused-parameter -Wwrite-strings -Wcast-qual -Wmissing-field-initializers -pedantic -Wno-long-long -Wimplicit-fallthrough -Wcovered-switch-default -Wno-noexcept-type -Wnon-virtual-dtor -Wdelete-non-virtual-dtor -Wsuggest-override -Wstring-conversion -fdiagnostics-color -O3  -isysroot /Applications/Xcode.app/Contents/Developer/Platforms/MacOSX.platform/Developer/SDKs/MacOSX10.15.sdk    -fno-exceptions -fno-rtti -UNDEBUG -std=c++14 -MD -MT tools/llvm-strings/CMakeFiles/llvm-strings.dir/llvm-strings.cpp.o -MF tools/llvm-strings/CMakeFiles/llvm-strings.dir/llvm-strings.cpp.o.d -o tools/llvm-strings/CMakeFiles/llvm-strings.dir/llvm-strings.cpp.o -c /Users/buildslave/jenkins/workspace/lldb-cmake/llvm-project/llvm/tools/llvm-strings/llvm-strings.cpp
[5110/5184] : && /Users/buildslave/jenkins/workspace/lldb-cmake/host-compiler/bin/clang++  -Wdocumentation -fPIC -fvisibility-inlines-hidden -Werror=date-time -Werror=unguarded-availability-new -fmodules -fmodules-cache-path=/Users/buildslave/jenkins/workspace/lldb-cmake/lldb-build/module.cache -fcxx-modules -Xclang -fmodules-local-submodule-visibility -Wall -Wextra -Wno-unused-parameter -Wwrite-strings -Wcast-qual -Wmissing-field-initializers -pedantic -Wno-long-long -Wimplicit-fallthrough -Wcovered-switch-default -Wno-noexcept-type -Wnon-virtual-dtor -Wdelete-non-virtual-dtor -Wsuggest-override -Wstring-conversion -fdiagnostics-color -O3  -isysroot /Applications/Xcode.app/Contents/Developer/Platforms/MacOSX.platform/Developer/SDKs/MacOSX10.15.sdk -Wl,-search_paths_first -Wl,-headerpad_max_install_names -Wl,-dead_strip tools/llvm-strings/CMakeFiles/llvm-strings.dir/llvm-strings.cpp.o  -o bin/llvm-strings  -Wl,-rpath,@loader_path/../lib  lib/libLLVMCore.a  lib/libLLVMObject.a  lib/libLLVMSupport.a  lib/libLLVMBitReader.a  lib/libLLVMCore.a  lib/libLLVMRemarks.a  lib/libLLVMBitstreamReader.a  lib/libLLVMMCParser.a  lib/libLLVMMC.a  lib/libLLVMDebugInfoCodeView.a  lib/libLLVMDebugInfoMSF.a  lib/libLLVMTextAPI.a  lib/libLLVMBinaryFormat.a  lib/libLLVMSupport.a  -lm  /usr/lib/libz.dylib  /usr/lib/libcurses.dylib  lib/libLLVMDemangle.a && :
[5111/5184] /Users/buildslave/jenkins/workspace/lldb-cmake/host-compiler/bin/clang++  -DGTEST_HAS_RTTI=0 -D_DEBUG -D__STDC_CONSTANT_MACROS -D__STDC_FORMAT_MACROS -D__STDC_LIMIT_MACROS -Itools/llvm-xray -I/Users/buildslave/jenkins/workspace/lldb-cmake/llvm-project/llvm/tools/llvm-xray -Iinclude -I/Users/buildslave/jenkins/workspace/lldb-cmake/llvm-project/llvm/include -Wdocumentation -fPIC -fvisibility-inlines-hidden -Werror=date-time -Werror=unguarded-availability-new -fmodules -fmodules-cache-path=/Users/buildslave/jenkins/workspace/lldb-cmake/lldb-build/module.cache -fcxx-modules -Xclang -fmodules-local-submodule-visibility -Wall -Wextra -Wno-unused-parameter -Wwrite-strings -Wcast-qual -Wmissing-field-initializers -pedantic -Wno-long-long -Wimplicit-fallthrough -Wcovered-switch-default -Wno-noexcept-type -Wnon-virtual-dtor -Wdelete-non-virtual-dtor -Wsuggest-override -Wstring-conversion -fdiagnostics-color -O3  -isysroot /Applications/Xcode.app/Contents/Developer/Platforms/MacOSX.platform/Developer/SDKs/MacOSX10.15.sdk    -fno-exceptions -fno-rtti -UNDEBUG -std=c++14 -MD -MT tools/llvm-xray/CMakeFiles/llvm-xray.dir/llvm-xray.cpp.o -MF tools/llvm-xray/CMakeFiles/llvm-xray.dir/llvm-xray.cpp.o.d -o tools/llvm-xray/CMakeFiles/llvm-xray.dir/llvm-xray.cpp.o -c /Users/buildslave/jenkins/workspace/lldb-cmake/llvm-project/llvm/tools/llvm-xray/llvm-xray.cpp
[5112/5184] /Users/buildslave/jenkins/workspace/lldb-cmake/host-compiler/bin/clang++  -DGTEST_HAS_RTTI=0 -D_DEBUG -D__STDC_CONSTANT_MACROS -D__STDC_FORMAT_MACROS -D__STDC_LIMIT_MACROS -Itools/llvm-xray -I/Users/buildslave/jenkins/workspace/lldb-cmake/llvm-project/llvm/tools/llvm-xray -Iinclude -I/Users/buildslave/jenkins/workspace/lldb-cmake/llvm-project/llvm/include -Wdocumentation -fPIC -fvisibility-inlines-hidden -Werror=date-time -Werror=unguarded-availability-new -fmodules -fmodules-cache-path=/Users/buildslave/jenkins/workspace/lldb-cmake/lldb-build/module.cache -fcxx-modules -Xclang -fmodules-local-submodule-visibility -Wall -Wextra -Wno-unused-parameter -Wwrite-strings -Wcast-qual -Wmissing-field-initializers -pedantic -Wno-long-long -Wimplicit-fallthrough -Wcovered-switch-default -Wno-noexcept-type -Wnon-virtual-dtor -Wdelete-non-virtual-dtor -Wsuggest-override -Wstring-conversion -fdiagnostics-color -O3  -isysroot /Applications/Xcode.app/Contents/Developer/Platforms/MacOSX.platform/Developer/SDKs/MacOSX10.15.sdk    -fno-exceptions -fno-rtti -UNDEBUG -std=c++14 -MD -MT tools/llvm-xray/CMakeFiles/llvm-xray.dir/xray-color-helper.cpp.o -MF tools/llvm-xray/CMakeFiles/llvm-xray.dir/xray-color-helper.cpp.o.d -o tools/llvm-xray/CMakeFiles/llvm-xray.dir/xray-color-helper.cpp.o -c /Users/buildslave/jenkins/workspace/lldb-cmake/llvm-project/llvm/tools/llvm-xray/xray-color-helper.cpp
[5113/5184] /Users/buildslave/jenkins/workspace/lldb-cmake/host-compiler/bin/clang++  -DGTEST_HAS_RTTI=0 -D_DEBUG -D__STDC_CONSTANT_MACROS -D__STDC_FORMAT_MACROS -D__STDC_LIMIT_MACROS -Itools/llvm-symbolizer -I/Users/buildslave/jenkins/workspace/lldb-cmake/llvm-project/llvm/tools/llvm-symbolizer -Iinclude -I/Users/buildslave/jenkins/workspace/lldb-cmake/llvm-project/llvm/include -Wdocumentation -fPIC -fvisibility-inlines-hidden -Werror=date-time -Werror=unguarded-availability-new -fmodules -fmodules-cache-path=/Users/buildslave/jenkins/workspace/lldb-cmake/lldb-build/module.cache -fcxx-modules -Xclang -fmodules-local-submodule-visibility -Wall -Wextra -Wno-unused-parameter -Wwrite-strings -Wcast-qual -Wmissing-field-initializers -pedantic -Wno-long-long -Wimplicit-fallthrough -Wcovered-switch-default -Wno-noexcept-type -Wnon-virtual-dtor -Wdelete-non-virtual-dtor -Wsuggest-override -Wstring-conversion -fdiagnostics-color -O3  -isysroot /Applications/Xcode.app/Contents/Developer/Platforms/MacOSX.platform/Developer/SDKs/MacOSX10.15.sdk    -fno-exceptions -fno-rtti -UNDEBUG -std=c++14 -MD -MT tools/llvm-symbolizer/CMakeFiles/llvm-symbolizer.dir/llvm-symbolizer.cpp.o -MF tools/llvm-symbolizer/CMakeFiles/llvm-symbolizer.dir/llvm-symbolizer.cpp.o.d -o tools/llvm-symbolizer/CMakeFiles/llvm-symbolizer.dir/llvm-symbolizer.cpp.o -c /Users/buildslave/jenkins/workspace/lldb-cmake/llvm-project/llvm/tools/llvm-symbolizer/llvm-symbolizer.cpp
[5114/5184] /Users/buildslave/jenkins/workspace/lldb-cmake/host-compiler/bin/clang++  -DGTEST_HAS_RTTI=0 -D_DEBUG -D__STDC_CONSTANT_MACROS -D__STDC_FORMAT_MACROS -D__STDC_LIMIT_MACROS -Itools/llvm-stress -I/Users/buildslave/jenkins/workspace/lldb-cmake/llvm-project/llvm/tools/llvm-stress -Iinclude -I/Users/buildslave/jenkins/workspace/lldb-cmake/llvm-project/llvm/include -Wdocumentation -fPIC -fvisibility-inlines-hidden -Werror=date-time -Werror=unguarded-availability-new -fmodules -fmodules-cache-path=/Users/buildslave/jenkins/workspace/lldb-cmake/lldb-build/module.cache -fcxx-modules -Xclang -fmodules-local-submodule-visibility -Wall -Wextra -Wno-unused-parameter -Wwrite-strings -Wcast-qual -Wmissing-field-initializers -pedantic -Wno-long-long -Wimplicit-fallthrough -Wcovered-switch-default -Wno-noexcept-type -Wnon-virtual-dtor -Wdelete-non-virtual-dtor -Wsuggest-override -Wstring-conversion -fdiagnostics-color -O3  -isysroot /Applications/Xcode.app/Contents/Developer/Platforms/MacOSX.platform/Developer/SDKs/MacOSX10.15.sdk    -fno-exceptions -fno-rtti -UNDEBUG -std=c++14 -MD -MT tools/llvm-stress/CMakeFiles/llvm-stress.dir/llvm-stress.cpp.o -MF tools/llvm-stress/CMakeFiles/llvm-stress.dir/llvm-stress.cpp.o.d -o tools/llvm-stress/CMakeFiles/llvm-stress.dir/llvm-stress.cpp.o -c /Users/buildslave/jenkins/workspace/lldb-cmake/llvm-project/llvm/tools/llvm-stress/llvm-stress.cpp
[5115/5184] /Users/buildslave/jenkins/workspace/lldb-cmake/host-compiler/bin/clang++  -DGTEST_HAS_RTTI=0 -D_DEBUG -D__STDC_CONSTANT_MACROS -D__STDC_FORMAT_MACROS -D__STDC_LIMIT_MACROS -Itools/llvm-xray -I/Users/buildslave/jenkins/workspace/lldb-cmake/llvm-project/llvm/tools/llvm-xray -Iinclude -I/Users/buildslave/jenkins/workspace/lldb-cmake/llvm-project/llvm/include -Wdocumentation -fPIC -fvisibility-inlines-hidden -Werror=date-time -Werror=unguarded-availability-new -fmodules -fmodules-cache-path=/Users/buildslave/jenkins/workspace/lldb-cmake/lldb-build/module.cache -fcxx-modules -Xclang -fmodules-local-submodule-visibility -Wall -Wextra -Wno-unused-parameter -Wwrite-strings -Wcast-qual -Wmissing-field-initializers -pedantic -Wno-long-long -Wimplicit-fallthrough -Wcovered-switch-default -Wno-noexcept-type -Wnon-virtual-dtor -Wdelete-non-virtual-dtor -Wsuggest-override -Wstring-conversion -fdiagnostics-color -O3  -isysroot /Applications/Xcode.app/Contents/Developer/Platforms/MacOSX.platform/Developer/SDKs/MacOSX10.15.sdk    -fno-exceptions -fno-rtti -UNDEBUG -std=c++14 -MD -MT tools/llvm-xray/CMakeFiles/llvm-xray.dir/func-id-helper.cpp.o -MF tools/llvm-xray/CMakeFiles/llvm-xray.dir/func-id-helper.cpp.o.d -o tools/llvm-xray/CMakeFiles/llvm-xray.dir/func-id-helper.cpp.o -c /Users/buildslave/jenkins/workspace/lldb-cmake/llvm-project/llvm/tools/llvm-xray/func-id-helper.cpp
[5116/5184] : && /Users/buildslave/jenkins/workspace/lldb-cmake/host-compiler/bin/clang++  -Wdocumentation -fPIC -fvisibility-inlines-hidden -Werror=date-time -Werror=unguarded-availability-new -fmodules -fmodules-cache-path=/Users/buildslave/jenkins/workspace/lldb-cmake/lldb-build/module.cache -fcxx-modules -Xclang -fmodules-local-submodule-visibility -Wall -Wextra -Wno-unused-parameter -Wwrite-strings -Wcast-qual -Wmissing-field-initializers -pedantic -Wno-long-long -Wimplicit-fallthrough -Wcovered-switch-default -Wno-noexcept-type -Wnon-virtual-dtor -Wdelete-non-virtual-dtor -Wsuggest-override -Wstring-conversion -fdiagnostics-color -O3  -isysroot /Applications/Xcode.app/Contents/Developer/Platforms/MacOSX.platform/Developer/SDKs/MacOSX10.15.sdk -Wl,-search_paths_first -Wl,-headerpad_max_install_names -Wl,-dead_strip tools/llvm-symbolizer/CMakeFiles/llvm-symbolizer.dir/llvm-symbolizer.cpp.o  -o bin/llvm-symbolizer  -Wl,-rpath,@loader_path/../lib  lib/libLLVMDebugInfoDWARF.a  lib/libLLVMDebugInfoPDB.a  lib/libLLVMDemangle.a  lib/libLLVMObject.a  lib/libLLVMOption.a  lib/libLLVMSupport.a  lib/libLLVMSymbolize.a  lib/libLLVMDebugInfoDWARF.a  lib/libLLVMDebugInfoPDB.a  lib/libLLVMObject.a  lib/libLLVMBitReader.a  lib/libLLVMCore.a  lib/libLLVMRemarks.a  lib/libLLVMBitstreamReader.a  lib/libLLVMMCParser.a  lib/libLLVMMC.a  lib/libLLVMDebugInfoCodeView.a  lib/libLLVMDebugInfoMSF.a  lib/libLLVMTextAPI.a  lib/libLLVMBinaryFormat.a  lib/libLLVMSupport.a  lib/libLLVMDemangle.a  -lm  /usr/lib/libz.dylib  /usr/lib/libcurses.dylib && :
[5117/5184] cd /Users/buildslave/jenkins/workspace/lldb-cmake/lldb-build/tools/llvm-symbolizer && /usr/local/Cellar/cmake/3.17.2/bin/cmake -E create_symlink llvm-symbolizer /Users/buildslave/jenkins/workspace/lldb-cmake/lldb-build/./bin/llvm-addr2line
[5118/5184] : && /Users/buildslave/jenkins/workspace/lldb-cmake/host-compiler/bin/clang++  -Wdocumentation -fPIC -fvisibility-inlines-hidden -Werror=date-time -Werror=unguarded-availability-new -fmodules -fmodules-cache-path=/Users/buildslave/jenkins/workspace/lldb-cmake/lldb-build/module.cache -fcxx-modules -Xclang -fmodules-local-submodule-visibility -Wall -Wextra -Wno-unused-parameter -Wwrite-strings -Wcast-qual -Wmissing-field-initializers -pedantic -Wno-long-long -Wimplicit-fallthrough -Wcovered-switch-default -Wno-noexcept-type -Wnon-virtual-dtor -Wdelete-non-virtual-dtor -Wsuggest-override -Wstring-conversion -fdiagnostics-color -O3  -isysroot /Applications/Xcode.app/Contents/Developer/Platforms/MacOSX.platform/Developer/SDKs/MacOSX10.15.sdk -Wl,-search_paths_first -Wl,-headerpad_max_install_names -Wl,-dead_strip tools/llvm-stress/CMakeFiles/llvm-stress.dir/llvm-stress.cpp.o  -o bin/llvm-stress  -Wl,-rpath,@loader_path/../lib  lib/libLLVMAnalysis.a  lib/libLLVMCore.a  lib/libLLVMSupport.a  lib/libLLVMObject.a  lib/libLLVMBitReader.a  lib/libLLVMMCParser.a  lib/libLLVMMC.a  lib/libLLVMDebugInfoCodeView.a  lib/libLLVMDebugInfoMSF.a  lib/libLLVMTextAPI.a  lib/libLLVMProfileData.a  lib/libLLVMCore.a  lib/libLLVMBinaryFormat.a  lib/libLLVMRemarks.a  lib/libLLVMBitstreamReader.a  lib/libLLVMSupport.a  -lm  /usr/lib/libz.dylib  /usr/lib/libcurses.dylib  lib/libLLVMDemangle.a && :
[5119/5184] /Users/buildslave/jenkins/workspace/lldb-cmake/host-compiler/bin/clang++  -DGTEST_HAS_RTTI=0 -D_DEBUG -D__STDC_CONSTANT_MACROS -D__STDC_FORMAT_MACROS -D__STDC_LIMIT_MACROS -Itools/llvm-size -I/Users/buildslave/jenkins/workspace/lldb-cmake/llvm-project/llvm/tools/llvm-size -Iinclude -I/Users/buildslave/jenkins/workspace/lldb-cmake/llvm-project/llvm/include -Wdocumentation -fPIC -fvisibility-inlines-hidden -Werror=date-time -Werror=unguarded-availability-new -fmodules -fmodules-cache-path=/Users/buildslave/jenkins/workspace/lldb-cmake/lldb-build/module.cache -fcxx-modules -Xclang -fmodules-local-submodule-visibility -Wall -Wextra -Wno-unused-parameter -Wwrite-strings -Wcast-qual -Wmissing-field-initializers -pedantic -Wno-long-long -Wimplicit-fallthrough -Wcovered-switch-default -Wno-noexcept-type -Wnon-virtual-dtor -Wdelete-non-virtual-dtor -Wsuggest-override -Wstring-conversion -fdiagnostics-color -O3  -isysroot /Applications/Xcode.app/Contents/Developer/Platforms/MacOSX.platform/Developer/SDKs/MacOSX10.15.sdk    -fno-exceptions -fno-rtti -UNDEBUG -std=c++14 -MD -MT tools/llvm-size/CMakeFiles/llvm-size.dir/llvm-size.cpp.o -MF tools/llvm-size/CMakeFiles/llvm-size.dir/llvm-size.cpp.o.d -o tools/llvm-size/CMakeFiles/llvm-size.dir/llvm-size.cpp.o -c /Users/buildslave/jenkins/workspace/lldb-cmake/llvm-project/llvm/tools/llvm-size/llvm-size.cpp
[5120/5184] : && /Users/buildslave/jenkins/workspace/lldb-cmake/host-compiler/bin/clang++  -Wdocumentation -fPIC -fvisibility-inlines-hidden -Werror=date-time -Werror=unguarded-availability-new -fmodules -fmodules-cache-path=/Users/buildslave/jenkins/workspace/lldb-cmake/lldb-build/module.cache -fcxx-modules -Xclang -fmodules-local-submodule-visibility -Wall -Wextra -Wno-unused-parameter -Wwrite-strings -Wcast-qual -Wmissing-field-initializers -pedantic -Wno-long-long -Wimplicit-fallthrough -Wcovered-switch-default -Wno-noexcept-type -Wnon-virtual-dtor -Wdelete-non-virtual-dtor -Wsuggest-override -Wstring-conversion -fdiagnostics-color -O3  -isysroot /Applications/Xcode.app/Contents/Developer/Platforms/MacOSX.platform/Developer/SDKs/MacOSX10.15.sdk -Wl,-search_paths_first -Wl,-headerpad_max_install_names -Wl,-dead_strip tools/llvm-size/CMakeFiles/llvm-size.dir/llvm-size.cpp.o  -o bin/llvm-size  -Wl,-rpath,@loader_path/../lib  lib/libLLVMObject.a  lib/libLLVMSupport.a  lib/libLLVMBitReader.a  lib/libLLVMCore.a  lib/libLLVMRemarks.a  lib/libLLVMBitstreamReader.a  lib/libLLVMMCParser.a  lib/libLLVMMC.a  lib/libLLVMDebugInfoCodeView.a  lib/libLLVMDebugInfoMSF.a  lib/libLLVMTextAPI.a  lib/libLLVMBinaryFormat.a  lib/libLLVMSupport.a  -lm  /usr/lib/libz.dylib  /usr/lib/libcurses.dylib  lib/libLLVMDemangle.a && :
[5121/5184] /Users/buildslave/jenkins/workspace/lldb-cmake/host-compiler/bin/clang++  -DGTEST_HAS_RTTI=0 -D_DEBUG -D__STDC_CONSTANT_MACROS -D__STDC_FORMAT_MACROS -D__STDC_LIMIT_MACROS -Itools/llvm-xray -I/Users/buildslave/jenkins/workspace/lldb-cmake/llvm-project/llvm/tools/llvm-xray -Iinclude -I/Users/buildslave/jenkins/workspace/lldb-cmake/llvm-project/llvm/include -Wdocumentation -fPIC -fvisibility-inlines-hidden -Werror=date-time -Werror=unguarded-availability-new -fmodules -fmodules-cache-path=/Users/buildslave/jenkins/workspace/lldb-cmake/lldb-build/module.cache -fcxx-modules -Xclang -fmodules-local-submodule-visibility -Wall -Wextra -Wno-unused-parameter -Wwrite-strings -Wcast-qual -Wmissing-field-initializers -pedantic -Wno-long-long -Wimplicit-fallthrough -Wcovered-switch-default -Wno-noexcept-type -Wnon-virtual-dtor -Wdelete-non-virtual-dtor -Wsuggest-override -Wstring-conversion -fdiagnostics-color -O3  -isysroot /Applications/Xcode.app/Contents/Developer/Platforms/MacOSX.platform/Developer/SDKs/MacOSX10.15.sdk    -fno-exceptions -fno-rtti -UNDEBUG -std=c++14 -MD -MT tools/llvm-xray/CMakeFiles/llvm-xray.dir/xray-registry.cpp.o -MF tools/llvm-xray/CMakeFiles/llvm-xray.dir/xray-registry.cpp.o.d -o tools/llvm-xray/CMakeFiles/llvm-xray.dir/xray-registry.cpp.o -c /Users/buildslave/jenkins/workspace/lldb-cmake/llvm-project/llvm/tools/llvm-xray/xray-registry.cpp
[5122/5184] /Users/buildslave/jenkins/workspace/lldb-cmake/host-compiler/bin/clang++  -DGTEST_HAS_RTTI=0 -D_DEBUG -D__STDC_CONSTANT_MACROS -D__STDC_FORMAT_MACROS -D__STDC_LIMIT_MACROS -Itools/llvm-xray -I/Users/buildslave/jenkins/workspace/lldb-cmake/llvm-project/llvm/tools/llvm-xray -Iinclude -I/Users/buildslave/jenkins/workspace/lldb-cmake/llvm-project/llvm/include -Wdocumentation -fPIC -fvisibility-inlines-hidden -Werror=date-time -Werror=unguarded-availability-new -fmodules -fmodules-cache-path=/Users/buildslave/jenkins/workspace/lldb-cmake/lldb-build/module.cache -fcxx-modules -Xclang -fmodules-local-submodule-visibility -Wall -Wextra -Wno-unused-parameter -Wwrite-strings -Wcast-qual -Wmissing-field-initializers -pedantic -Wno-long-long -Wimplicit-fallthrough -Wcovered-switch-default -Wno-noexcept-type -Wnon-virtual-dtor -Wdelete-non-virtual-dtor -Wsuggest-override -Wstring-conversion -fdiagnostics-color -O3  -isysroot /Applications/Xcode.app/Contents/Developer/Platforms/MacOSX.platform/Developer/SDKs/MacOSX10.15.sdk    -fno-exceptions -fno-rtti -UNDEBUG -std=c++14 -MD -MT tools/llvm-xray/CMakeFiles/llvm-xray.dir/xray-fdr-dump.cpp.o -MF tools/llvm-xray/CMakeFiles/llvm-xray.dir/xray-fdr-dump.cpp.o.d -o tools/llvm-xray/CMakeFiles/llvm-xray.dir/xray-fdr-dump.cpp.o -c /Users/buildslave/jenkins/workspace/lldb-cmake/llvm-project/llvm/tools/llvm-xray/xray-fdr-dump.cpp
[5123/5184] /Users/buildslave/jenkins/workspace/lldb-cmake/host-compiler/bin/clang++  -DGTEST_HAS_RTTI=0 -D_DEBUG -D__STDC_CONSTANT_MACROS -D__STDC_FORMAT_MACROS -D__STDC_LIMIT_MACROS -Itools/llvm-yaml-numeric-parser-fuzzer -I/Users/buildslave/jenkins/workspace/lldb-cmake/llvm-project/llvm/tools/llvm-yaml-numeric-parser-fuzzer -Iinclude -I/Users/buildslave/jenkins/workspace/lldb-cmake/llvm-project/llvm/include -Wdocumentation -fPIC -fvisibility-inlines-hidden -Werror=date-time -Werror=unguarded-availability-new -fmodules -fmodules-cache-path=/Users/buildslave/jenkins/workspace/lldb-cmake/lldb-build/module.cache -fcxx-modules -Xclang -fmodules-local-submodule-visibility -Wall -Wextra -Wno-unused-parameter -Wwrite-strings -Wcast-qual -Wmissing-field-initializers -pedantic -Wno-long-long -Wimplicit-fallthrough -Wcovered-switch-default -Wno-noexcept-type -Wnon-virtual-dtor -Wdelete-non-virtual-dtor -Wsuggest-override -Wstring-conversion -fdiagnostics-color -O3  -isysroot /Applications/Xcode.app/Contents/Developer/Platforms/MacOSX.platform/Developer/SDKs/MacOSX10.15.sdk    -fno-exceptions -fno-rtti -UNDEBUG -std=c++14 -MD -MT tools/llvm-yaml-numeric-parser-fuzzer/CMakeFiles/llvm-yaml-numeric-parser-fuzzer.dir/DummyYAMLNumericParserFuzzer.cpp.o -MF tools/llvm-yaml-numeric-parser-fuzzer/CMakeFiles/llvm-yaml-numeric-parser-fuzzer.dir/DummyYAMLNumericParserFuzzer.cpp.o.d -o tools/llvm-yaml-numeric-parser-fuzzer/CMakeFiles/llvm-yaml-numeric-parser-fuzzer.dir/DummyYAMLNumericParserFuzzer.cpp.o -c /Users/buildslave/jenkins/workspace/lldb-cmake/llvm-project/llvm/tools/llvm-yaml-numeric-parser-fuzzer/DummyYAMLNumericParserFuzzer.cpp
[5124/5184] /Users/buildslave/jenkins/workspace/lldb-cmake/host-compiler/bin/clang++  -DGTEST_HAS_RTTI=0 -D_DEBUG -D__STDC_CONSTANT_MACROS -D__STDC_FORMAT_MACROS -D__STDC_LIMIT_MACROS -Itools/llvm-exegesis -I/Users/buildslave/jenkins/workspace/lldb-cmake/llvm-project/llvm/tools/llvm-exegesis -Iinclude -I/Users/buildslave/jenkins/workspace/lldb-cmake/llvm-project/llvm/include -Wdocumentation -fPIC -fvisibility-inlines-hidden -Werror=date-time -Werror=unguarded-availability-new -fmodules -fmodules-cache-path=/Users/buildslave/jenkins/workspace/lldb-cmake/lldb-build/module.cache -fcxx-modules -Xclang -fmodules-local-submodule-visibility -Wall -Wextra -Wno-unused-parameter -Wwrite-strings -Wcast-qual -Wmissing-field-initializers -pedantic -Wno-long-long -Wimplicit-fallthrough -Wcovered-switch-default -Wno-noexcept-type -Wnon-virtual-dtor -Wdelete-non-virtual-dtor -Wsuggest-override -Wstring-conversion -fdiagnostics-color -O3  -isysroot /Applications/Xcode.app/Contents/Developer/Platforms/MacOSX.platform/Developer/SDKs/MacOSX10.15.sdk    -fno-exceptions -fno-rtti -UNDEBUG -std=c++14 -DLLVM_EXEGESIS_INITIALIZE_NATIVE_TARGET=InitializeX86ExegesisTarget -MD -MT tools/llvm-exegesis/CMakeFiles/llvm-exegesis.dir/llvm-exegesis.cpp.o -MF tools/llvm-exegesis/CMakeFiles/llvm-exegesis.dir/llvm-exegesis.cpp.o.d -o tools/llvm-exegesis/CMakeFiles/llvm-exegesis.dir/llvm-exegesis.cpp.o -c /Users/buildslave/jenkins/workspace/lldb-cmake/llvm-project/llvm/tools/llvm-exegesis/llvm-exegesis.cpp
While building module 'LLVM_Backend' imported from /Users/buildslave/jenkins/workspace/lldb-cmake/llvm-project/llvm/tools/llvm-exegesis/lib/Assembler.h:24:
While building module 'LLVM_Analysis' imported from /Users/buildslave/jenkins/workspace/lldb-cmake/llvm-project/llvm/include/llvm/CodeGen/MachineFunction.h:27:
In file included from <module-includes>:38:
/Users/buildslave/jenkins/workspace/lldb-cmake/llvm-project/llvm/include/llvm/Analysis/IRSimilarityIdentifier.h:146:19: warning: parameter 'Value' not found in the function declaration [-Wdocumentation]
  /// \param [in] Value - The IRInstructionData instance to be hashed.
                  ^~~~~
/Users/buildslave/jenkins/workspace/lldb-cmake/llvm-project/llvm/include/llvm/Analysis/IRSimilarityIdentifier.h:146:19: note: did you mean 'ID'?
  /// \param [in] Value - The IRInstructionData instance to be hashed.
                  ^~~~~
                  ID
/Users/buildslave/jenkins/workspace/lldb-cmake/llvm-project/llvm/include/llvm/Analysis/IRSimilarityIdentifier.h:290:23: warning: parameter 'InstrList' not found in the function declaration [-Wdocumentation]
  /// \param [in,out] InstrList - Vector of InstructionData to append
                      ^~~~~~~~~
/Users/buildslave/jenkins/workspace/lldb-cmake/llvm-project/llvm/include/llvm/Analysis/IRSimilarityIdentifier.h:290:23: note: did you mean 'InstrListForBB'?
  /// \param [in,out] InstrList - Vector of InstructionData to append
                      ^~~~~~~~~
                      InstrListForBB
/Users/buildslave/jenkins/workspace/lldb-cmake/llvm-project/llvm/include/llvm/Analysis/IRSimilarityIdentifier.h:301:23: warning: parameter 'InstrList' not found in the function declaration [-Wdocumentation]
  /// \param [in,out] InstrList - Vector of IRInstructionData to append to.
                      ^~~~~~~~~
/Users/buildslave/jenkins/workspace/lldb-cmake/llvm-project/llvm/include/llvm/Analysis/IRSimilarityIdentifier.h:301:23: note: did you mean 'InstrListForBB'?
  /// \param [in,out] InstrList - Vector of IRInstructionData to append to.
                      ^~~~~~~~~
                      InstrListForBB
While building module 'LLVM_Backend' imported from /Users/buildslave/jenkins/workspace/lldb-cmake/llvm-project/llvm/tools/llvm-exegesis/lib/Assembler.h:24:
In file included from <module-includes>:106:
/Users/buildslave/jenkins/workspace/lldb-cmake/llvm-project/llvm/include/llvm/CodeGen/MachinePassManager.h:94:8: warning: '\returns' command used in a comment that is not attached to a function or method declaration [-Wdocumentation]
  /// \returns null if there is no cached result.
      ~^~~~~~~~~~~~~~~~~~~~~~~~~~~~~~~~~~~~~~~~~~
4 warnings generated.
[5125/5184] /Users/buildslave/jenkins/workspace/lldb-cmake/host-compiler/bin/clang++  -DGTEST_HAS_RTTI=0 -D_DEBUG -D__STDC_CONSTANT_MACROS -D__STDC_FORMAT_MACROS -D__STDC_LIMIT_MACROS -Itools/llvm-xray -I/Users/buildslave/jenkins/workspace/lldb-cmake/llvm-project/llvm/tools/llvm-xray -Iinclude -I/Users/buildslave/jenkins/workspace/lldb-cmake/llvm-project/llvm/include -Wdocumentation -fPIC -fvisibility-inlines-hidden -Werror=date-time -Werror=unguarded-availability-new -fmodules -fmodules-cache-path=/Users/buildslave/jenkins/workspace/lldb-cmake/lldb-build/module.cache -fcxx-modules -Xclang -fmodules-local-submodule-visibility -Wall -Wextra -Wno-unused-parameter -Wwrite-strings -Wcast-qual -Wmissing-field-initializers -pedantic -Wno-long-long -Wimplicit-fallthrough -Wcovered-switch-default -Wno-noexcept-type -Wnon-virtual-dtor -Wdelete-non-virtual-dtor -Wsuggest-override -Wstring-conversion -fdiagnostics-color -O3  -isysroot /Applications/Xcode.app/Contents/Developer/Platforms/MacOSX.platform/Developer/SDKs/MacOSX10.15.sdk    -fno-exceptions -fno-rtti -UNDEBUG -std=c++14 -MD -MT tools/llvm-xray/CMakeFiles/llvm-xray.dir/xray-extract.cpp.o -MF tools/llvm-xray/CMakeFiles/llvm-xray.dir/xray-extract.cpp.o.d -o tools/llvm-xray/CMakeFiles/llvm-xray.dir/xray-extract.cpp.o -c /Users/buildslave/jenkins/workspace/lldb-cmake/llvm-project/llvm/tools/llvm-xray/xray-extract.cpp
[5126/5184] /Users/buildslave/jenkins/workspace/lldb-cmake/host-compiler/bin/clang++  -DGTEST_HAS_RTTI=0 -D_DEBUG -D__STDC_CONSTANT_MACROS -D__STDC_FORMAT_MACROS -D__STDC_LIMIT_MACROS -Itools/llvm-yaml-numeric-parser-fuzzer -I/Users/buildslave/jenkins/workspace/lldb-cmake/llvm-project/llvm/tools/llvm-yaml-numeric-parser-fuzzer -Iinclude -I/Users/buildslave/jenkins/workspace/lldb-cmake/llvm-project/llvm/include -Wdocumentation -fPIC -fvisibility-inlines-hidden -Werror=date-time -Werror=unguarded-availability-new -fmodules -fmodules-cache-path=/Users/buildslave/jenkins/workspace/lldb-cmake/lldb-build/module.cache -fcxx-modules -Xclang -fmodules-local-submodule-visibility -Wall -Wextra -Wno-unused-parameter -Wwrite-strings -Wcast-qual -Wmissing-field-initializers -pedantic -Wno-long-long -Wimplicit-fallthrough -Wcovered-switch-default -Wno-noexcept-type -Wnon-virtual-dtor -Wdelete-non-virtual-dtor -Wsuggest-override -Wstring-conversion -fdiagnostics-color -O3  -isysroot /Applications/Xcode.app/Contents/Developer/Platforms/MacOSX.platform/Developer/SDKs/MacOSX10.15.sdk    -fno-exceptions -fno-rtti -UNDEBUG -std=c++14 -MD -MT tools/llvm-yaml-numeric-parser-fuzzer/CMakeFiles/llvm-yaml-numeric-parser-fuzzer.dir/yaml-numeric-parser-fuzzer.cpp.o -MF tools/llvm-yaml-numeric-parser-fuzzer/CMakeFiles/llvm-yaml-numeric-parser-fuzzer.dir/yaml-numeric-parser-fuzzer.cpp.o.d -o tools/llvm-yaml-numeric-parser-fuzzer/CMakeFiles/llvm-yaml-numeric-parser-fuzzer.dir/yaml-numeric-parser-fuzzer.cpp.o -c /Users/buildslave/jenkins/workspace/lldb-cmake/llvm-project/llvm/tools/llvm-yaml-numeric-parser-fuzzer/yaml-numeric-parser-fuzzer.cpp
[5127/5184] : && /Users/buildslave/jenkins/workspace/lldb-cmake/host-compiler/bin/clang++  -Wdocumentation -fPIC -fvisibility-inlines-hidden -Werror=date-time -Werror=unguarded-availability-new -fmodules -fmodules-cache-path=/Users/buildslave/jenkins/workspace/lldb-cmake/lldb-build/module.cache -fcxx-modules -Xclang -fmodules-local-submodule-visibility -Wall -Wextra -Wno-unused-parameter -Wwrite-strings -Wcast-qual -Wmissing-field-initializers -pedantic -Wno-long-long -Wimplicit-fallthrough -Wcovered-switch-default -Wno-noexcept-type -Wnon-virtual-dtor -Wdelete-non-virtual-dtor -Wsuggest-override -Wstring-conversion -fdiagnostics-color -O3  -isysroot /Applications/Xcode.app/Contents/Developer/Platforms/MacOSX.platform/Developer/SDKs/MacOSX10.15.sdk -Wl,-search_paths_first -Wl,-headerpad_max_install_names -Wl,-dead_strip tools/llvm-yaml-numeric-parser-fuzzer/CMakeFiles/llvm-yaml-numeric-parser-fuzzer.dir/DummyYAMLNumericParserFuzzer.cpp.o tools/llvm-yaml-numeric-parser-fuzzer/CMakeFiles/llvm-yaml-numeric-parser-fuzzer.dir/yaml-numeric-parser-fuzzer.cpp.o  -o bin/llvm-yaml-numeric-parser-fuzzer  -Wl,-rpath,@loader_path/../lib  lib/libLLVMSupport.a  lib/libLLVMFuzzMutate.a  lib/libLLVMBitWriter.a  lib/libLLVMScalarOpts.a  lib/libLLVMAggressiveInstCombine.a  lib/libLLVMInstCombine.a  lib/libLLVMTransformUtils.a  lib/libLLVMTarget.a  lib/libLLVMAnalysis.a  lib/libLLVMObject.a  lib/libLLVMBitReader.a  lib/libLLVMMCParser.a  lib/libLLVMTextAPI.a  lib/libLLVMProfileData.a  lib/libLLVMCore.a  lib/libLLVMRemarks.a  lib/libLLVMBitstreamReader.a  lib/libLLVMMC.a  lib/libLLVMBinaryFormat.a  lib/libLLVMDebugInfoCodeView.a  lib/libLLVMDebugInfoMSF.a  lib/libLLVMSupport.a  -lm  /usr/lib/libz.dylib  /usr/lib/libcurses.dylib  lib/libLLVMDemangle.a && :
[5128/5184] : && /Users/buildslave/jenkins/workspace/lldb-cmake/host-compiler/bin/clang++  -Wdocumentation -fPIC -fvisibility-inlines-hidden -Werror=date-time -Werror=unguarded-availability-new -fmodules -fmodules-cache-path=/Users/buildslave/jenkins/workspace/lldb-cmake/lldb-build/module.cache -fcxx-modules -Xclang -fmodules-local-submodule-visibility -Wall -Wextra -Wno-unused-parameter -Wwrite-strings -Wcast-qual -Wmissing-field-initializers -pedantic -Wno-long-long -Wimplicit-fallthrough -Wcovered-switch-default -Wno-noexcept-type -Wnon-virtual-dtor -Wdelete-non-virtual-dtor -Wsuggest-override -Wstring-conversion -fdiagnostics-color -O3  -isysroot /Applications/Xcode.app/Contents/Developer/Platforms/MacOSX.platform/Developer/SDKs/MacOSX10.15.sdk -Wl,-search_paths_first -Wl,-headerpad_max_install_names -Wl,-dead_strip tools/llvm-exegesis/CMakeFiles/llvm-exegesis.dir/llvm-exegesis.cpp.o  -o bin/llvm-exegesis  -Wl,-rpath,@loader_path/../lib  lib/libLLVMMCParser.a  lib/libLLVMSupport.a  lib/libLLVMX86CodeGen.a  lib/libLLVMX86AsmParser.a  lib/libLLVMX86Desc.a  lib/libLLVMX86Disassembler.a  lib/libLLVMX86Info.a  lib/libLLVMExegesis.a  lib/libLLVMExegesisX86.a  lib/libLLVMX86CodeGen.a  lib/libLLVMAsmPrinter.a  lib/libLLVMDebugInfoDWARF.a  lib/libLLVMCFGuard.a  lib/libLLVMX86AsmParser.a  lib/libLLVMX86Desc.a  lib/libLLVMX86Disassembler.a  lib/libLLVMX86Info.a  lib/libLLVMExegesis.a  lib/libLLVMGlobalISel.a  lib/libLLVMSelectionDAG.a  lib/libLLVMCodeGen.a  lib/libLLVMBitWriter.a  lib/libLLVMScalarOpts.a  lib/libLLVMAggressiveInstCombine.a  lib/libLLVMInstCombine.a  lib/libLLVMTransformUtils.a  lib/libLLVMMCDisassembler.a  lib/libLLVMMCJIT.a  lib/libLLVMExecutionEngine.a  lib/libLLVMTarget.a  lib/libLLVMAnalysis.a  lib/libLLVMProfileData.a  lib/libLLVMRuntimeDyld.a  lib/libLLVMObjectYAML.a  lib/libLLVMObject.a  lib/libLLVMMCParser.a  lib/libLLVMMC.a  lib/libLLVMBitReader.a  lib/libLLVMCore.a  lib/libLLVMRemarks.a  lib/libLLVMBitstreamReader.a  lib/libLLVMTextAPI.a  lib/libLLVMBinaryFormat.a  lib/libLLVMDebugInfoCodeView.a  lib/libLLVMDebugInfoMSF.a  lib/libLLVMSupport.a  -lm  /usr/lib/libz.dylib  /usr/lib/libcurses.dylib  lib/libLLVMDemangle.a && :
[5129/5184] /Users/buildslave/jenkins/workspace/lldb-cmake/host-compiler/bin/clang++  -DGTEST_HAS_RTTI=0 -D_DEBUG -D__STDC_CONSTANT_MACROS -D__STDC_FORMAT_MACROS -D__STDC_LIMIT_MACROS -Itools/llvm-rtdyld -I/Users/buildslave/jenkins/workspace/lldb-cmake/llvm-project/llvm/tools/llvm-rtdyld -Iinclude -I/Users/buildslave/jenkins/workspace/lldb-cmake/llvm-project/llvm/include -Wdocumentation -fPIC -fvisibility-inlines-hidden -Werror=date-time -Werror=unguarded-availability-new -fmodules -fmodules-cache-path=/Users/buildslave/jenkins/workspace/lldb-cmake/lldb-build/module.cache -fcxx-modules -Xclang -fmodules-local-submodule-visibility -Wall -Wextra -Wno-unused-parameter -Wwrite-strings -Wcast-qual -Wmissing-field-initializers -pedantic -Wno-long-long -Wimplicit-fallthrough -Wcovered-switch-default -Wno-noexcept-type -Wnon-virtual-dtor -Wdelete-non-virtual-dtor -Wsuggest-override -Wstring-conversion -fdiagnostics-color -O3  -isysroot /Applications/Xcode.app/Contents/Developer/Platforms/MacOSX.platform/Developer/SDKs/MacOSX10.15.sdk    -fno-exceptions -fno-rtti -UNDEBUG -std=c++14 -MD -MT tools/llvm-rtdyld/CMakeFiles/llvm-rtdyld.dir/llvm-rtdyld.cpp.o -MF tools/llvm-rtdyld/CMakeFiles/llvm-rtdyld.dir/llvm-rtdyld.cpp.o.d -o tools/llvm-rtdyld/CMakeFiles/llvm-rtdyld.dir/llvm-rtdyld.cpp.o -c /Users/buildslave/jenkins/workspace/lldb-cmake/llvm-project/llvm/tools/llvm-rtdyld/llvm-rtdyld.cpp
[5130/5184] /Users/buildslave/jenkins/workspace/lldb-cmake/host-compiler/bin/clang++  -DGTEST_HAS_RTTI=0 -D_DEBUG -D__STDC_CONSTANT_MACROS -D__STDC_FORMAT_MACROS -D__STDC_LIMIT_MACROS -Itools/obj2yaml -I/Users/buildslave/jenkins/workspace/lldb-cmake/llvm-project/llvm/tools/obj2yaml -Iinclude -I/Users/buildslave/jenkins/workspace/lldb-cmake/llvm-project/llvm/include -Wdocumentation -fPIC -fvisibility-inlines-hidden -Werror=date-time -Werror=unguarded-availability-new -fmodules -fmodules-cache-path=/Users/buildslave/jenkins/workspace/lldb-cmake/lldb-build/module.cache -fcxx-modules -Xclang -fmodules-local-submodule-visibility -Wall -Wextra -Wno-unused-parameter -Wwrite-strings -Wcast-qual -Wmissing-field-initializers -pedantic -Wno-long-long -Wimplicit-fallthrough -Wcovered-switch-default -Wno-noexcept-type -Wnon-virtual-dtor -Wdelete-non-virtual-dtor -Wsuggest-override -Wstring-conversion -fdiagnostics-color -O3  -isysroot /Applications/Xcode.app/Contents/Developer/Platforms/MacOSX.platform/Developer/SDKs/MacOSX10.15.sdk    -fno-exceptions -fno-rtti -UNDEBUG -std=c++14 -MD -MT tools/obj2yaml/CMakeFiles/obj2yaml.dir/obj2yaml.cpp.o -MF tools/obj2yaml/CMakeFiles/obj2yaml.dir/obj2yaml.cpp.o.d -o tools/obj2yaml/CMakeFiles/obj2yaml.dir/obj2yaml.cpp.o -c /Users/buildslave/jenkins/workspace/lldb-cmake/llvm-project/llvm/tools/obj2yaml/obj2yaml.cpp
[5131/5184] : && /Users/buildslave/jenkins/workspace/lldb-cmake/host-compiler/bin/clang++  -Wdocumentation -fPIC -fvisibility-inlines-hidden -Werror=date-time -Werror=unguarded-availability-new -fmodules -fmodules-cache-path=/Users/buildslave/jenkins/workspace/lldb-cmake/lldb-build/module.cache -fcxx-modules -Xclang -fmodules-local-submodule-visibility -Wall -Wextra -Wno-unused-parameter -Wwrite-strings -Wcast-qual -Wmissing-field-initializers -pedantic -Wno-long-long -Wimplicit-fallthrough -Wcovered-switch-default -Wno-noexcept-type -Wnon-virtual-dtor -Wdelete-non-virtual-dtor -Wsuggest-override -Wstring-conversion -fdiagnostics-color -O3  -isysroot /Applications/Xcode.app/Contents/Developer/Platforms/MacOSX.platform/Developer/SDKs/MacOSX10.15.sdk -Wl,-search_paths_first -Wl,-headerpad_max_install_names -Wl,-dead_strip tools/llvm-rtdyld/CMakeFiles/llvm-rtdyld.dir/llvm-rtdyld.cpp.o  -o bin/llvm-rtdyld  -Wl,-rpath,@loader_path/../lib  lib/libLLVMAArch64Disassembler.a  lib/libLLVMAMDGPUDisassembler.a  lib/libLLVMARMDisassembler.a  lib/libLLVMAVRDisassembler.a  lib/libLLVMBPFDisassembler.a  lib/libLLVMHexagonDisassembler.a  lib/libLLVMLanaiDisassembler.a  lib/libLLVMMipsDisassembler.a  lib/libLLVMMSP430Disassembler.a  lib/libLLVMPowerPCDisassembler.a  lib/libLLVMRISCVDisassembler.a  lib/libLLVMSparcDisassembler.a  lib/libLLVMSystemZDisassembler.a  lib/libLLVMWebAssemblyDisassembler.a  lib/libLLVMX86Disassembler.a  lib/libLLVMXCoreDisassembler.a  lib/libLLVMAArch64Desc.a  lib/libLLVMAMDGPUDesc.a  lib/libLLVMARMDesc.a  lib/libLLVMAVRDesc.a  lib/libLLVMBPFDesc.a  lib/libLLVMHexagonDesc.a  lib/libLLVMLanaiDesc.a  lib/libLLVMMipsDesc.a  lib/libLLVMMSP430Desc.a  lib/libLLVMNVPTXDesc.a  lib/libLLVMPowerPCDesc.a  lib/libLLVMRISCVDesc.a  lib/libLLVMSparcDesc.a  lib/libLLVMSystemZDesc.a  lib/libLLVMWebAssemblyDesc.a  lib/libLLVMX86Desc.a  lib/libLLVMXCoreDesc.a  lib/libLLVMAArch64Info.a  lib/libLLVMAMDGPUInfo.a  lib/libLLVMARMInfo.a  lib/libLLVMAVRInfo.a  lib/libLLVMBPFInfo.a  lib/libLLVMHexagonInfo.a  lib/libLLVMLanaiInfo.a  lib/libLLVMMipsInfo.a  lib/libLLVMMSP430Info.a  lib/libLLVMNVPTXInfo.a  lib/libLLVMPowerPCInfo.a  lib/libLLVMRISCVInfo.a  lib/libLLVMSparcInfo.a  lib/libLLVMSystemZInfo.a  lib/libLLVMWebAssemblyInfo.a  lib/libLLVMX86Info.a  lib/libLLVMXCoreInfo.a  lib/libLLVMDebugInfoDWARF.a  lib/libLLVMExecutionEngine.a  lib/libLLVMMC.a  lib/libLLVMObject.a  lib/libLLVMRuntimeDyld.a  lib/libLLVMSupport.a  lib/libLLVMAArch64Utils.a  lib/libLLVMAMDGPUUtils.a  lib/libLLVMARMUtils.a  lib/libLLVMRISCVUtils.a  lib/libLLVMMCDisassembler.a  lib/libLLVMTarget.a  lib/libLLVMAnalysis.a  lib/libLLVMObject.a  lib/libLLVMBitReader.a  lib/libLLVMMCParser.a  lib/libLLVMMC.a  lib/libLLVMDebugInfoCodeView.a  lib/libLLVMDebugInfoMSF.a  lib/libLLVMTextAPI.a  lib/libLLVMProfileData.a  lib/libLLVMCore.a  lib/libLLVMBinaryFormat.a  lib/libLLVMRemarks.a  lib/libLLVMBitstreamReader.a  lib/libLLVMSupport.a  -lm  /usr/lib/libz.dylib  /usr/lib/libcurses.dylib  lib/libLLVMDemangle.a && :
[5132/5184] /Users/buildslave/jenkins/workspace/lldb-cmake/host-compiler/bin/clang++  -DGTEST_HAS_RTTI=0 -D_DEBUG -D__STDC_CONSTANT_MACROS -D__STDC_FORMAT_MACROS -D__STDC_LIMIT_MACROS -Itools/llvm-xray -I/Users/buildslave/jenkins/workspace/lldb-cmake/llvm-project/llvm/tools/llvm-xray -Iinclude -I/Users/buildslave/jenkins/workspace/lldb-cmake/llvm-project/llvm/include -Wdocumentation -fPIC -fvisibility-inlines-hidden -Werror=date-time -Werror=unguarded-availability-new -fmodules -fmodules-cache-path=/Users/buildslave/jenkins/workspace/lldb-cmake/lldb-build/module.cache -fcxx-modules -Xclang -fmodules-local-submodule-visibility -Wall -Wextra -Wno-unused-parameter -Wwrite-strings -Wcast-qual -Wmissing-field-initializers -pedantic -Wno-long-long -Wimplicit-fallthrough -Wcovered-switch-default -Wno-noexcept-type -Wnon-virtual-dtor -Wdelete-non-virtual-dtor -Wsuggest-override -Wstring-conversion -fdiagnostics-color -O3  -isysroot /Applications/Xcode.app/Contents/Developer/Platforms/MacOSX.platform/Developer/SDKs/MacOSX10.15.sdk    -fno-exceptions -fno-rtti -UNDEBUG -std=c++14 -MD -MT tools/llvm-xray/CMakeFiles/llvm-xray.dir/xray-converter.cpp.o -MF tools/llvm-xray/CMakeFiles/llvm-xray.dir/xray-converter.cpp.o.d -o tools/llvm-xray/CMakeFiles/llvm-xray.dir/xray-converter.cpp.o -c /Users/buildslave/jenkins/workspace/lldb-cmake/llvm-project/llvm/tools/llvm-xray/xray-converter.cpp
[5133/5184] /Users/buildslave/jenkins/workspace/lldb-cmake/host-compiler/bin/clang++  -DGTEST_HAS_RTTI=0 -D_DEBUG -D__STDC_CONSTANT_MACROS -D__STDC_FORMAT_MACROS -D__STDC_LIMIT_MACROS -Itools/obj2yaml -I/Users/buildslave/jenkins/workspace/lldb-cmake/llvm-project/llvm/tools/obj2yaml -Iinclude -I/Users/buildslave/jenkins/workspace/lldb-cmake/llvm-project/llvm/include -Wdocumentation -fPIC -fvisibility-inlines-hidden -Werror=date-time -Werror=unguarded-availability-new -fmodules -fmodules-cache-path=/Users/buildslave/jenkins/workspace/lldb-cmake/lldb-build/module.cache -fcxx-modules -Xclang -fmodules-local-submodule-visibility -Wall -Wextra -Wno-unused-parameter -Wwrite-strings -Wcast-qual -Wmissing-field-initializers -pedantic -Wno-long-long -Wimplicit-fallthrough -Wcovered-switch-default -Wno-noexcept-type -Wnon-virtual-dtor -Wdelete-non-virtual-dtor -Wsuggest-override -Wstring-conversion -fdiagnostics-color -O3  -isysroot /Applications/Xcode.app/Contents/Developer/Platforms/MacOSX.platform/Developer/SDKs/MacOSX10.15.sdk    -fno-exceptions -fno-rtti -UNDEBUG -std=c++14 -MD -MT tools/obj2yaml/CMakeFiles/obj2yaml.dir/minidump2yaml.cpp.o -MF tools/obj2yaml/CMakeFiles/obj2yaml.dir/minidump2yaml.cpp.o.d -o tools/obj2yaml/CMakeFiles/obj2yaml.dir/minidump2yaml.cpp.o -c /Users/buildslave/jenkins/workspace/lldb-cmake/llvm-project/llvm/tools/obj2yaml/minidump2yaml.cpp
[5134/5184] /Users/buildslave/jenkins/workspace/lldb-cmake/host-compiler/bin/clang++  -DGTEST_HAS_RTTI=0 -D_DEBUG -D__STDC_CONSTANT_MACROS -D__STDC_FORMAT_MACROS -D__STDC_LIMIT_MACROS -Itools/llvm-xray -I/Users/buildslave/jenkins/workspace/lldb-cmake/llvm-project/llvm/tools/llvm-xray -Iinclude -I/Users/buildslave/jenkins/workspace/lldb-cmake/llvm-project/llvm/include -Wdocumentation -fPIC -fvisibility-inlines-hidden -Werror=date-time -Werror=unguarded-availability-new -fmodules -fmodules-cache-path=/Users/buildslave/jenkins/workspace/lldb-cmake/lldb-build/module.cache -fcxx-modules -Xclang -fmodules-local-submodule-visibility -Wall -Wextra -Wno-unused-parameter -Wwrite-strings -Wcast-qual -Wmissing-field-initializers -pedantic -Wno-long-long -Wimplicit-fallthrough -Wcovered-switch-default -Wno-noexcept-type -Wnon-virtual-dtor -Wdelete-non-virtual-dtor -Wsuggest-override -Wstring-conversion -fdiagnostics-color -O3  -isysroot /Applications/Xcode.app/Contents/Developer/Platforms/MacOSX.platform/Developer/SDKs/MacOSX10.15.sdk    -fno-exceptions -fno-rtti -UNDEBUG -std=c++14 -MD -MT tools/llvm-xray/CMakeFiles/llvm-xray.dir/xray-graph-diff.cpp.o -MF tools/llvm-xray/CMakeFiles/llvm-xray.dir/xray-graph-diff.cpp.o.d -o tools/llvm-xray/CMakeFiles/llvm-xray.dir/xray-graph-diff.cpp.o -c /Users/buildslave/jenkins/workspace/lldb-cmake/llvm-project/llvm/tools/llvm-xray/xray-graph-diff.cpp
[5135/5184] /Users/buildslave/jenkins/workspace/lldb-cmake/host-compiler/bin/clang++  -DGTEST_HAS_RTTI=0 -D_DEBUG -D__STDC_CONSTANT_MACROS -D__STDC_FORMAT_MACROS -D__STDC_LIMIT_MACROS -Itools/llvm-xray -I/Users/buildslave/jenkins/workspace/lldb-cmake/llvm-project/llvm/tools/llvm-xray -Iinclude -I/Users/buildslave/jenkins/workspace/lldb-cmake/llvm-project/llvm/include -Wdocumentation -fPIC -fvisibility-inlines-hidden -Werror=date-time -Werror=unguarded-availability-new -fmodules -fmodules-cache-path=/Users/buildslave/jenkins/workspace/lldb-cmake/lldb-build/module.cache -fcxx-modules -Xclang -fmodules-local-submodule-visibility -Wall -Wextra -Wno-unused-parameter -Wwrite-strings -Wcast-qual -Wmissing-field-initializers -pedantic -Wno-long-long -Wimplicit-fallthrough -Wcovered-switch-default -Wno-noexcept-type -Wnon-virtual-dtor -Wdelete-non-virtual-dtor -Wsuggest-override -Wstring-conversion -fdiagnostics-color -O3  -isysroot /Applications/Xcode.app/Contents/Developer/Platforms/MacOSX.platform/Developer/SDKs/MacOSX10.15.sdk    -fno-exceptions -fno-rtti -UNDEBUG -std=c++14 -MD -MT tools/llvm-xray/CMakeFiles/llvm-xray.dir/xray-graph.cpp.o -MF tools/llvm-xray/CMakeFiles/llvm-xray.dir/xray-graph.cpp.o.d -o tools/llvm-xray/CMakeFiles/llvm-xray.dir/xray-graph.cpp.o -c /Users/buildslave/jenkins/workspace/lldb-cmake/llvm-project/llvm/tools/llvm-xray/xray-graph.cpp
[5136/5184] /Users/buildslave/jenkins/workspace/lldb-cmake/host-compiler/bin/clang++  -DGTEST_HAS_RTTI=0 -D_DEBUG -D__STDC_CONSTANT_MACROS -D__STDC_FORMAT_MACROS -D__STDC_LIMIT_MACROS -Itools/opt -I/Users/buildslave/jenkins/workspace/lldb-cmake/llvm-project/llvm/tools/opt -Iinclude -I/Users/buildslave/jenkins/workspace/lldb-cmake/llvm-project/llvm/include -Wdocumentation -fPIC -fvisibility-inlines-hidden -Werror=date-time -Werror=unguarded-availability-new -fmodules -fmodules-cache-path=/Users/buildslave/jenkins/workspace/lldb-cmake/lldb-build/module.cache -fcxx-modules -Xclang -fmodules-local-submodule-visibility -Wall -Wextra -Wno-unused-parameter -Wwrite-strings -Wcast-qual -Wmissing-field-initializers -pedantic -Wno-long-long -Wimplicit-fallthrough -Wcovered-switch-default -Wno-noexcept-type -Wnon-virtual-dtor -Wdelete-non-virtual-dtor -Wsuggest-override -Wstring-conversion -fdiagnostics-color -O3  -isysroot /Applications/Xcode.app/Contents/Developer/Platforms/MacOSX.platform/Developer/SDKs/MacOSX10.15.sdk    -fno-exceptions -fno-rtti -UNDEBUG -std=c++14 -MD -MT tools/opt/CMakeFiles/opt.dir/GraphPrinters.cpp.o -MF tools/opt/CMakeFiles/opt.dir/GraphPrinters.cpp.o.d -o tools/opt/CMakeFiles/opt.dir/GraphPrinters.cpp.o -c /Users/buildslave/jenkins/workspace/lldb-cmake/llvm-project/llvm/tools/opt/GraphPrinters.cpp
[5137/5184] /Users/buildslave/jenkins/workspace/lldb-cmake/host-compiler/bin/clang++  -DGTEST_HAS_RTTI=0 -D_DEBUG -D__STDC_CONSTANT_MACROS -D__STDC_FORMAT_MACROS -D__STDC_LIMIT_MACROS -Itools/obj2yaml -I/Users/buildslave/jenkins/workspace/lldb-cmake/llvm-project/llvm/tools/obj2yaml -Iinclude -I/Users/buildslave/jenkins/workspace/lldb-cmake/llvm-project/llvm/include -Wdocumentation -fPIC -fvisibility-inlines-hidden -Werror=date-time -Werror=unguarded-availability-new -fmodules -fmodules-cache-path=/Users/buildslave/jenkins/workspace/lldb-cmake/lldb-build/module.cache -fcxx-modules -Xclang -fmodules-local-submodule-visibility -Wall -Wextra -Wno-unused-parameter -Wwrite-strings -Wcast-qual -Wmissing-field-initializers -pedantic -Wno-long-long -Wimplicit-fallthrough -Wcovered-switch-default -Wno-noexcept-type -Wnon-virtual-dtor -Wdelete-non-virtual-dtor -Wsuggest-override -Wstring-conversion -fdiagnostics-color -O3  -isysroot /Applications/Xcode.app/Contents/Developer/Platforms/MacOSX.platform/Developer/SDKs/MacOSX10.15.sdk    -fno-exceptions -fno-rtti -UNDEBUG -std=c++14 -MD -MT tools/obj2yaml/CMakeFiles/obj2yaml.dir/xcoff2yaml.cpp.o -MF tools/obj2yaml/CMakeFiles/obj2yaml.dir/xcoff2yaml.cpp.o.d -o tools/obj2yaml/CMakeFiles/obj2yaml.dir/xcoff2yaml.cpp.o -c /Users/buildslave/jenkins/workspace/lldb-cmake/llvm-project/llvm/tools/obj2yaml/xcoff2yaml.cpp
[5138/5184] /Users/buildslave/jenkins/workspace/lldb-cmake/host-compiler/bin/clang++  -DGTEST_HAS_RTTI=0 -D_DEBUG -D__STDC_CONSTANT_MACROS -D__STDC_FORMAT_MACROS -D__STDC_LIMIT_MACROS -Itools/obj2yaml -I/Users/buildslave/jenkins/workspace/lldb-cmake/llvm-project/llvm/tools/obj2yaml -Iinclude -I/Users/buildslave/jenkins/workspace/lldb-cmake/llvm-project/llvm/include -Wdocumentation -fPIC -fvisibility-inlines-hidden -Werror=date-time -Werror=unguarded-availability-new -fmodules -fmodules-cache-path=/Users/buildslave/jenkins/workspace/lldb-cmake/lldb-build/module.cache -fcxx-modules -Xclang -fmodules-local-submodule-visibility -Wall -Wextra -Wno-unused-parameter -Wwrite-strings -Wcast-qual -Wmissing-field-initializers -pedantic -Wno-long-long -Wimplicit-fallthrough -Wcovered-switch-default -Wno-noexcept-type -Wnon-virtual-dtor -Wdelete-non-virtual-dtor -Wsuggest-override -Wstring-conversion -fdiagnostics-color -O3  -isysroot /Applications/Xcode.app/Contents/Developer/Platforms/MacOSX.platform/Developer/SDKs/MacOSX10.15.sdk    -fno-exceptions -fno-rtti -UNDEBUG -std=c++14 -MD -MT tools/obj2yaml/CMakeFiles/obj2yaml.dir/coff2yaml.cpp.o -MF tools/obj2yaml/CMakeFiles/obj2yaml.dir/coff2yaml.cpp.o.d -o tools/obj2yaml/CMakeFiles/obj2yaml.dir/coff2yaml.cpp.o -c /Users/buildslave/jenkins/workspace/lldb-cmake/llvm-project/llvm/tools/obj2yaml/coff2yaml.cpp
[5139/5184] /Users/buildslave/jenkins/workspace/lldb-cmake/host-compiler/bin/clang++  -DGTEST_HAS_RTTI=0 -D_DEBUG -D__STDC_CONSTANT_MACROS -D__STDC_FORMAT_MACROS -D__STDC_LIMIT_MACROS -Itools/opt -I/Users/buildslave/jenkins/workspace/lldb-cmake/llvm-project/llvm/tools/opt -Iinclude -I/Users/buildslave/jenkins/workspace/lldb-cmake/llvm-project/llvm/include -Wdocumentation -fPIC -fvisibility-inlines-hidden -Werror=date-time -Werror=unguarded-availability-new -fmodules -fmodules-cache-path=/Users/buildslave/jenkins/workspace/lldb-cmake/lldb-build/module.cache -fcxx-modules -Xclang -fmodules-local-submodule-visibility -Wall -Wextra -Wno-unused-parameter -Wwrite-strings -Wcast-qual -Wmissing-field-initializers -pedantic -Wno-long-long -Wimplicit-fallthrough -Wcovered-switch-default -Wno-noexcept-type -Wnon-virtual-dtor -Wdelete-non-virtual-dtor -Wsuggest-override -Wstring-conversion -fdiagnostics-color -O3  -isysroot /Applications/Xcode.app/Contents/Developer/Platforms/MacOSX.platform/Developer/SDKs/MacOSX10.15.sdk    -fno-exceptions -fno-rtti -UNDEBUG -std=c++14 -MD -MT tools/opt/CMakeFiles/opt.dir/PassPrinters.cpp.o -MF tools/opt/CMakeFiles/opt.dir/PassPrinters.cpp.o.d -o tools/opt/CMakeFiles/opt.dir/PassPrinters.cpp.o -c /Users/buildslave/jenkins/workspace/lldb-cmake/llvm-project/llvm/tools/opt/PassPrinters.cpp
[5140/5184] /Users/buildslave/jenkins/workspace/lldb-cmake/host-compiler/bin/clang++  -DGTEST_HAS_RTTI=0 -D_DEBUG -D__STDC_CONSTANT_MACROS -D__STDC_FORMAT_MACROS -D__STDC_LIMIT_MACROS -Itools/opt -I/Users/buildslave/jenkins/workspace/lldb-cmake/llvm-project/llvm/tools/opt -Iinclude -I/Users/buildslave/jenkins/workspace/lldb-cmake/llvm-project/llvm/include -Wdocumentation -fPIC -fvisibility-inlines-hidden -Werror=date-time -Werror=unguarded-availability-new -fmodules -fmodules-cache-path=/Users/buildslave/jenkins/workspace/lldb-cmake/lldb-build/module.cache -fcxx-modules -Xclang -fmodules-local-submodule-visibility -Wall -Wextra -Wno-unused-parameter -Wwrite-strings -Wcast-qual -Wmissing-field-initializers -pedantic -Wno-long-long -Wimplicit-fallthrough -Wcovered-switch-default -Wno-noexcept-type -Wnon-virtual-dtor -Wdelete-non-virtual-dtor -Wsuggest-override -Wstring-conversion -fdiagnostics-color -O3  -isysroot /Applications/Xcode.app/Contents/Developer/Platforms/MacOSX.platform/Developer/SDKs/MacOSX10.15.sdk    -fno-exceptions -fno-rtti -UNDEBUG -std=c++14 -MD -MT tools/opt/CMakeFiles/opt.dir/AnalysisWrappers.cpp.o -MF tools/opt/CMakeFiles/opt.dir/AnalysisWrappers.cpp.o.d -o tools/opt/CMakeFiles/opt.dir/AnalysisWrappers.cpp.o -c /Users/buildslave/jenkins/workspace/lldb-cmake/llvm-project/llvm/tools/opt/AnalysisWrappers.cpp
[5141/5184] /Users/buildslave/jenkins/workspace/lldb-cmake/host-compiler/bin/clang++  -DGTEST_HAS_RTTI=0 -D_DEBUG -D__STDC_CONSTANT_MACROS -D__STDC_FORMAT_MACROS -D__STDC_LIMIT_MACROS -Itools/opt -I/Users/buildslave/jenkins/workspace/lldb-cmake/llvm-project/llvm/tools/opt -Iinclude -I/Users/buildslave/jenkins/workspace/lldb-cmake/llvm-project/llvm/include -Wdocumentation -fPIC -fvisibility-inlines-hidden -Werror=date-time -Werror=unguarded-availability-new -fmodules -fmodules-cache-path=/Users/buildslave/jenkins/workspace/lldb-cmake/lldb-build/module.cache -fcxx-modules -Xclang -fmodules-local-submodule-visibility -Wall -Wextra -Wno-unused-parameter -Wwrite-strings -Wcast-qual -Wmissing-field-initializers -pedantic -Wno-long-long -Wimplicit-fallthrough -Wcovered-switch-default -Wno-noexcept-type -Wnon-virtual-dtor -Wdelete-non-virtual-dtor -Wsuggest-override -Wstring-conversion -fdiagnostics-color -O3  -isysroot /Applications/Xcode.app/Contents/Developer/Platforms/MacOSX.platform/Developer/SDKs/MacOSX10.15.sdk    -fno-exceptions -fno-rtti -UNDEBUG -std=c++14 -MD -MT tools/opt/CMakeFiles/opt.dir/BreakpointPrinter.cpp.o -MF tools/opt/CMakeFiles/opt.dir/BreakpointPrinter.cpp.o.d -o tools/opt/CMakeFiles/opt.dir/BreakpointPrinter.cpp.o -c /Users/buildslave/jenkins/workspace/lldb-cmake/llvm-project/llvm/tools/opt/BreakpointPrinter.cpp
[5142/5184] /Users/buildslave/jenkins/workspace/lldb-cmake/host-compiler/bin/clang++  -DGTEST_HAS_RTTI=0 -D_DEBUG -D__STDC_CONSTANT_MACROS -D__STDC_FORMAT_MACROS -D__STDC_LIMIT_MACROS -Itools/llvm-xray -I/Users/buildslave/jenkins/workspace/lldb-cmake/llvm-project/llvm/tools/llvm-xray -Iinclude -I/Users/buildslave/jenkins/workspace/lldb-cmake/llvm-project/llvm/include -Wdocumentation -fPIC -fvisibility-inlines-hidden -Werror=date-time -Werror=unguarded-availability-new -fmodules -fmodules-cache-path=/Users/buildslave/jenkins/workspace/lldb-cmake/lldb-build/module.cache -fcxx-modules -Xclang -fmodules-local-submodule-visibility -Wall -Wextra -Wno-unused-parameter -Wwrite-strings -Wcast-qual -Wmissing-field-initializers -pedantic -Wno-long-long -Wimplicit-fallthrough -Wcovered-switch-default -Wno-noexcept-type -Wnon-virtual-dtor -Wdelete-non-virtual-dtor -Wsuggest-override -Wstring-conversion -fdiagnostics-color -O3  -isysroot /Applications/Xcode.app/Contents/Developer/Platforms/MacOSX.platform/Developer/SDKs/MacOSX10.15.sdk    -fno-exceptions -fno-rtti -UNDEBUG -std=c++14 -MD -MT tools/llvm-xray/CMakeFiles/llvm-xray.dir/xray-stacks.cpp.o -MF tools/llvm-xray/CMakeFiles/llvm-xray.dir/xray-stacks.cpp.o.d -o tools/llvm-xray/CMakeFiles/llvm-xray.dir/xray-stacks.cpp.o -c /Users/buildslave/jenkins/workspace/lldb-cmake/llvm-project/llvm/tools/llvm-xray/xray-stacks.cpp
[5143/5184] /Users/buildslave/jenkins/workspace/lldb-cmake/host-compiler/bin/clang++  -DGTEST_HAS_RTTI=0 -D_DEBUG -D__STDC_CONSTANT_MACROS -D__STDC_FORMAT_MACROS -D__STDC_LIMIT_MACROS -Itools/remarks-shlib -I/Users/buildslave/jenkins/workspace/lldb-cmake/llvm-project/llvm/tools/remarks-shlib -Iinclude -I/Users/buildslave/jenkins/workspace/lldb-cmake/llvm-project/llvm/include -Wdocumentation -fPIC -fvisibility-inlines-hidden -Werror=date-time -Werror=unguarded-availability-new -fmodules -fmodules-cache-path=/Users/buildslave/jenkins/workspace/lldb-cmake/lldb-build/module.cache -fcxx-modules -Xclang -fmodules-local-submodule-visibility -Wall -Wextra -Wno-unused-parameter -Wwrite-strings -Wcast-qual -Wmissing-field-initializers -pedantic -Wno-long-long -Wimplicit-fallthrough -Wcovered-switch-default -Wno-noexcept-type -Wnon-virtual-dtor -Wdelete-non-virtual-dtor -Wsuggest-override -Wstring-conversion -fdiagnostics-color -O3  -isysroot /Applications/Xcode.app/Contents/Developer/Platforms/MacOSX.platform/Developer/SDKs/MacOSX10.15.sdk -fPIC    -fno-exceptions -fno-rtti -UNDEBUG -std=c++14 -MD -MT tools/remarks-shlib/CMakeFiles/Remarks.dir/libremarks.cpp.o -MF tools/remarks-shlib/CMakeFiles/Remarks.dir/libremarks.cpp.o.d -o tools/remarks-shlib/CMakeFiles/Remarks.dir/libremarks.cpp.o -c /Users/buildslave/jenkins/workspace/lldb-cmake/llvm-project/llvm/tools/remarks-shlib/libremarks.cpp
[5144/5184] /Users/buildslave/jenkins/workspace/lldb-cmake/host-compiler/bin/clang++  -DGTEST_HAS_RTTI=0 -D_DEBUG -D__STDC_CONSTANT_MACROS -D__STDC_FORMAT_MACROS -D__STDC_LIMIT_MACROS -Itools/llvm-xray -I/Users/buildslave/jenkins/workspace/lldb-cmake/llvm-project/llvm/tools/llvm-xray -Iinclude -I/Users/buildslave/jenkins/workspace/lldb-cmake/llvm-project/llvm/include -Wdocumentation -fPIC -fvisibility-inlines-hidden -Werror=date-time -Werror=unguarded-availability-new -fmodules -fmodules-cache-path=/Users/buildslave/jenkins/workspace/lldb-cmake/lldb-build/module.cache -fcxx-modules -Xclang -fmodules-local-submodule-visibility -Wall -Wextra -Wno-unused-parameter -Wwrite-strings -Wcast-qual -Wmissing-field-initializers -pedantic -Wno-long-long -Wimplicit-fallthrough -Wcovered-switch-default -Wno-noexcept-type -Wnon-virtual-dtor -Wdelete-non-virtual-dtor -Wsuggest-override -Wstring-conversion -fdiagnostics-color -O3  -isysroot /Applications/Xcode.app/Contents/Developer/Platforms/MacOSX.platform/Developer/SDKs/MacOSX10.15.sdk    -fno-exceptions -fno-rtti -UNDEBUG -std=c++14 -MD -MT tools/llvm-xray/CMakeFiles/llvm-xray.dir/xray-account.cpp.o -MF tools/llvm-xray/CMakeFiles/llvm-xray.dir/xray-account.cpp.o.d -o tools/llvm-xray/CMakeFiles/llvm-xray.dir/xray-account.cpp.o -c /Users/buildslave/jenkins/workspace/lldb-cmake/llvm-project/llvm/tools/llvm-xray/xray-account.cpp
[5145/5184] : && /Users/buildslave/jenkins/workspace/lldb-cmake/host-compiler/bin/clang++ -Wdocumentation -fPIC -fvisibility-inlines-hidden -Werror=date-time -Werror=unguarded-availability-new -fmodules -fmodules-cache-path=/Users/buildslave/jenkins/workspace/lldb-cmake/lldb-build/module.cache -fcxx-modules -Xclang -fmodules-local-submodule-visibility -Wall -Wextra -Wno-unused-parameter -Wwrite-strings -Wcast-qual -Wmissing-field-initializers -pedantic -Wno-long-long -Wimplicit-fallthrough -Wcovered-switch-default -Wno-noexcept-type -Wnon-virtual-dtor -Wdelete-non-virtual-dtor -Wsuggest-override -Wstring-conversion -fdiagnostics-color -O3 -isysroot /Applications/Xcode.app/Contents/Developer/Platforms/MacOSX.platform/Developer/SDKs/MacOSX10.15.sdk -dynamiclib -Wl,-headerpad_max_install_names -Wl,-dead_strip -Wl,-exported_symbols_list,"/Users/buildslave/jenkins/workspace/lldb-cmake/lldb-build/tools/remarks-shlib/Remarks.exports" -compatibility_version 1 -current_version 12.0.99 -o lib/libRemarks.dylib -install_name @rpath/libRemarks.dylib tools/remarks-shlib/CMakeFiles/Remarks.dir/libremarks.cpp.o  -Wl,-rpath,@loader_path/../lib  lib/libLLVMRemarks.a  lib/libLLVMBitstreamReader.a  lib/libLLVMSupport.a  -lm  /usr/lib/libz.dylib  /usr/lib/libcurses.dylib  lib/libLLVMDemangle.a && :
[5146/5184] : && /Users/buildslave/jenkins/workspace/lldb-cmake/host-compiler/bin/clang++  -Wdocumentation -fPIC -fvisibility-inlines-hidden -Werror=date-time -Werror=unguarded-availability-new -fmodules -fmodules-cache-path=/Users/buildslave/jenkins/workspace/lldb-cmake/lldb-build/module.cache -fcxx-modules -Xclang -fmodules-local-submodule-visibility -Wall -Wextra -Wno-unused-parameter -Wwrite-strings -Wcast-qual -Wmissing-field-initializers -pedantic -Wno-long-long -Wimplicit-fallthrough -Wcovered-switch-default -Wno-noexcept-type -Wnon-virtual-dtor -Wdelete-non-virtual-dtor -Wsuggest-override -Wstring-conversion -fdiagnostics-color -O3  -isysroot /Applications/Xcode.app/Contents/Developer/Platforms/MacOSX.platform/Developer/SDKs/MacOSX10.15.sdk -Wl,-search_paths_first -Wl,-headerpad_max_install_names -Wl,-dead_strip tools/llvm-xray/CMakeFiles/llvm-xray.dir/func-id-helper.cpp.o tools/llvm-xray/CMakeFiles/llvm-xray.dir/llvm-xray.cpp.o tools/llvm-xray/CMakeFiles/llvm-xray.dir/xray-account.cpp.o tools/llvm-xray/CMakeFiles/llvm-xray.dir/xray-color-helper.cpp.o tools/llvm-xray/CMakeFiles/llvm-xray.dir/xray-converter.cpp.o tools/llvm-xray/CMakeFiles/llvm-xray.dir/xray-extract.cpp.o tools/llvm-xray/CMakeFiles/llvm-xray.dir/xray-fdr-dump.cpp.o tools/llvm-xray/CMakeFiles/llvm-xray.dir/xray-graph-diff.cpp.o tools/llvm-xray/CMakeFiles/llvm-xray.dir/xray-graph.cpp.o tools/llvm-xray/CMakeFiles/llvm-xray.dir/xray-registry.cpp.o tools/llvm-xray/CMakeFiles/llvm-xray.dir/xray-stacks.cpp.o  -o bin/llvm-xray  -Wl,-rpath,@loader_path/../lib  lib/libLLVMDebugInfoDWARF.a  lib/libLLVMObject.a  lib/libLLVMSupport.a  lib/libLLVMSymbolize.a  lib/libLLVMXRay.a  lib/libLLVMDebugInfoDWARF.a  lib/libLLVMDebugInfoPDB.a  lib/libLLVMObject.a  lib/libLLVMBitReader.a  lib/libLLVMCore.a  lib/libLLVMRemarks.a  lib/libLLVMBitstreamReader.a  lib/libLLVMMCParser.a  lib/libLLVMMC.a  lib/libLLVMDebugInfoCodeView.a  lib/libLLVMDebugInfoMSF.a  lib/libLLVMTextAPI.a  lib/libLLVMBinaryFormat.a  lib/libLLVMSupport.a  -lm  /usr/lib/libz.dylib  /usr/lib/libcurses.dylib  lib/libLLVMDemangle.a && :
[5147/5184] /Users/buildslave/jenkins/workspace/lldb-cmake/host-compiler/bin/clang++  -DGTEST_HAS_RTTI=0 -D_DEBUG -D__STDC_CONSTANT_MACROS -D__STDC_FORMAT_MACROS -D__STDC_LIMIT_MACROS -Itools/obj2yaml -I/Users/buildslave/jenkins/workspace/lldb-cmake/llvm-project/llvm/tools/obj2yaml -Iinclude -I/Users/buildslave/jenkins/workspace/lldb-cmake/llvm-project/llvm/include -Wdocumentation -fPIC -fvisibility-inlines-hidden -Werror=date-time -Werror=unguarded-availability-new -fmodules -fmodules-cache-path=/Users/buildslave/jenkins/workspace/lldb-cmake/lldb-build/module.cache -fcxx-modules -Xclang -fmodules-local-submodule-visibility -Wall -Wextra -Wno-unused-parameter -Wwrite-strings -Wcast-qual -Wmissing-field-initializers -pedantic -Wno-long-long -Wimplicit-fallthrough -Wcovered-switch-default -Wno-noexcept-type -Wnon-virtual-dtor -Wdelete-non-virtual-dtor -Wsuggest-override -Wstring-conversion -fdiagnostics-color -O3  -isysroot /Applications/Xcode.app/Contents/Developer/Platforms/MacOSX.platform/Developer/SDKs/MacOSX10.15.sdk    -fno-exceptions -fno-rtti -UNDEBUG -std=c++14 -MD -MT tools/obj2yaml/CMakeFiles/obj2yaml.dir/dwarf2yaml.cpp.o -MF tools/obj2yaml/CMakeFiles/obj2yaml.dir/dwarf2yaml.cpp.o.d -o tools/obj2yaml/CMakeFiles/obj2yaml.dir/dwarf2yaml.cpp.o -c /Users/buildslave/jenkins/workspace/lldb-cmake/llvm-project/llvm/tools/obj2yaml/dwarf2yaml.cpp
[5148/5184] /Users/buildslave/jenkins/workspace/lldb-cmake/host-compiler/bin/clang++  -DGTEST_HAS_RTTI=0 -D_DEBUG -D__STDC_CONSTANT_MACROS -D__STDC_FORMAT_MACROS -D__STDC_LIMIT_MACROS -Itools/opt -I/Users/buildslave/jenkins/workspace/lldb-cmake/llvm-project/llvm/tools/opt -Iinclude -I/Users/buildslave/jenkins/workspace/lldb-cmake/llvm-project/llvm/include -Wdocumentation -fPIC -fvisibility-inlines-hidden -Werror=date-time -Werror=unguarded-availability-new -fmodules -fmodules-cache-path=/Users/buildslave/jenkins/workspace/lldb-cmake/lldb-build/module.cache -fcxx-modules -Xclang -fmodules-local-submodule-visibility -Wall -Wextra -Wno-unused-parameter -Wwrite-strings -Wcast-qual -Wmissing-field-initializers -pedantic -Wno-long-long -Wimplicit-fallthrough -Wcovered-switch-default -Wno-noexcept-type -Wnon-virtual-dtor -Wdelete-non-virtual-dtor -Wsuggest-override -Wstring-conversion -fdiagnostics-color -O3  -isysroot /Applications/Xcode.app/Contents/Developer/Platforms/MacOSX.platform/Developer/SDKs/MacOSX10.15.sdk    -fno-exceptions -fno-rtti -UNDEBUG -std=c++14 -MD -MT tools/opt/CMakeFiles/opt.dir/PrintSCC.cpp.o -MF tools/opt/CMakeFiles/opt.dir/PrintSCC.cpp.o.d -o tools/opt/CMakeFiles/opt.dir/PrintSCC.cpp.o -c /Users/buildslave/jenkins/workspace/lldb-cmake/llvm-project/llvm/tools/opt/PrintSCC.cpp
[5149/5184] /Users/buildslave/jenkins/workspace/lldb-cmake/host-compiler/bin/clang++  -DGTEST_HAS_RTTI=0 -D_DEBUG -D__STDC_CONSTANT_MACROS -D__STDC_FORMAT_MACROS -D__STDC_LIMIT_MACROS -Itools/obj2yaml -I/Users/buildslave/jenkins/workspace/lldb-cmake/llvm-project/llvm/tools/obj2yaml -Iinclude -I/Users/buildslave/jenkins/workspace/lldb-cmake/llvm-project/llvm/include -Wdocumentation -fPIC -fvisibility-inlines-hidden -Werror=date-time -Werror=unguarded-availability-new -fmodules -fmodules-cache-path=/Users/buildslave/jenkins/workspace/lldb-cmake/lldb-build/module.cache -fcxx-modules -Xclang -fmodules-local-submodule-visibility -Wall -Wextra -Wno-unused-parameter -Wwrite-strings -Wcast-qual -Wmissing-field-initializers -pedantic -Wno-long-long -Wimplicit-fallthrough -Wcovered-switch-default -Wno-noexcept-type -Wnon-virtual-dtor -Wdelete-non-virtual-dtor -Wsuggest-override -Wstring-conversion -fdiagnostics-color -O3  -isysroot /Applications/Xcode.app/Contents/Developer/Platforms/MacOSX.platform/Developer/SDKs/MacOSX10.15.sdk    -fno-exceptions -fno-rtti -UNDEBUG -std=c++14 -MD -MT tools/obj2yaml/CMakeFiles/obj2yaml.dir/wasm2yaml.cpp.o -MF tools/obj2yaml/CMakeFiles/obj2yaml.dir/wasm2yaml.cpp.o.d -o tools/obj2yaml/CMakeFiles/obj2yaml.dir/wasm2yaml.cpp.o -c /Users/buildslave/jenkins/workspace/lldb-cmake/llvm-project/llvm/tools/obj2yaml/wasm2yaml.cpp
[5150/5184] /Users/buildslave/jenkins/workspace/lldb-cmake/host-compiler/bin/clang++  -DGTEST_HAS_RTTI=0 -D_DEBUG -D__STDC_CONSTANT_MACROS -D__STDC_FORMAT_MACROS -D__STDC_LIMIT_MACROS -Itools/split-file -I/Users/buildslave/jenkins/workspace/lldb-cmake/llvm-project/llvm/tools/split-file -Iinclude -I/Users/buildslave/jenkins/workspace/lldb-cmake/llvm-project/llvm/include -Wdocumentation -fPIC -fvisibility-inlines-hidden -Werror=date-time -Werror=unguarded-availability-new -fmodules -fmodules-cache-path=/Users/buildslave/jenkins/workspace/lldb-cmake/lldb-build/module.cache -fcxx-modules -Xclang -fmodules-local-submodule-visibility -Wall -Wextra -Wno-unused-parameter -Wwrite-strings -Wcast-qual -Wmissing-field-initializers -pedantic -Wno-long-long -Wimplicit-fallthrough -Wcovered-switch-default -Wno-noexcept-type -Wnon-virtual-dtor -Wdelete-non-virtual-dtor -Wsuggest-override -Wstring-conversion -fdiagnostics-color -O3  -isysroot /Applications/Xcode.app/Contents/Developer/Platforms/MacOSX.platform/Developer/SDKs/MacOSX10.15.sdk    -fno-exceptions -fno-rtti -UNDEBUG -std=c++14 -MD -MT tools/split-file/CMakeFiles/split-file.dir/split-file.cpp.o -MF tools/split-file/CMakeFiles/split-file.dir/split-file.cpp.o.d -o tools/split-file/CMakeFiles/split-file.dir/split-file.cpp.o -c /Users/buildslave/jenkins/workspace/lldb-cmake/llvm-project/llvm/tools/split-file/split-file.cpp
[5151/5184] : && /Users/buildslave/jenkins/workspace/lldb-cmake/host-compiler/bin/clang++  -Wdocumentation -fPIC -fvisibility-inlines-hidden -Werror=date-time -Werror=unguarded-availability-new -fmodules -fmodules-cache-path=/Users/buildslave/jenkins/workspace/lldb-cmake/lldb-build/module.cache -fcxx-modules -Xclang -fmodules-local-submodule-visibility -Wall -Wextra -Wno-unused-parameter -Wwrite-strings -Wcast-qual -Wmissing-field-initializers -pedantic -Wno-long-long -Wimplicit-fallthrough -Wcovered-switch-default -Wno-noexcept-type -Wnon-virtual-dtor -Wdelete-non-virtual-dtor -Wsuggest-override -Wstring-conversion -fdiagnostics-color -O3  -isysroot /Applications/Xcode.app/Contents/Developer/Platforms/MacOSX.platform/Developer/SDKs/MacOSX10.15.sdk -Wl,-search_paths_first -Wl,-headerpad_max_install_names -Wl,-dead_strip tools/split-file/CMakeFiles/split-file.dir/split-file.cpp.o  -o bin/split-file  -Wl,-rpath,@loader_path/../lib  lib/libLLVMSupport.a  -lm  /usr/lib/libz.dylib  /usr/lib/libcurses.dylib  lib/libLLVMDemangle.a && :
[5152/5184] /Users/buildslave/jenkins/workspace/lldb-cmake/host-compiler/bin/clang++  -DGTEST_HAS_RTTI=0 -D_DEBUG -D__STDC_CONSTANT_MACROS -D__STDC_FORMAT_MACROS -D__STDC_LIMIT_MACROS -Itools/sanstats -I/Users/buildslave/jenkins/workspace/lldb-cmake/llvm-project/llvm/tools/sanstats -Iinclude -I/Users/buildslave/jenkins/workspace/lldb-cmake/llvm-project/llvm/include -Wdocumentation -fPIC -fvisibility-inlines-hidden -Werror=date-time -Werror=unguarded-availability-new -fmodules -fmodules-cache-path=/Users/buildslave/jenkins/workspace/lldb-cmake/lldb-build/module.cache -fcxx-modules -Xclang -fmodules-local-submodule-visibility -Wall -Wextra -Wno-unused-parameter -Wwrite-strings -Wcast-qual -Wmissing-field-initializers -pedantic -Wno-long-long -Wimplicit-fallthrough -Wcovered-switch-default -Wno-noexcept-type -Wnon-virtual-dtor -Wdelete-non-virtual-dtor -Wsuggest-override -Wstring-conversion -fdiagnostics-color -O3  -isysroot /Applications/Xcode.app/Contents/Developer/Platforms/MacOSX.platform/Developer/SDKs/MacOSX10.15.sdk    -fno-exceptions -fno-rtti -UNDEBUG -std=c++14 -MD -MT tools/sanstats/CMakeFiles/sanstats.dir/sanstats.cpp.o -MF tools/sanstats/CMakeFiles/sanstats.dir/sanstats.cpp.o.d -o tools/sanstats/CMakeFiles/sanstats.dir/sanstats.cpp.o -c /Users/buildslave/jenkins/workspace/lldb-cmake/llvm-project/llvm/tools/sanstats/sanstats.cpp
[5153/5184] : && /Users/buildslave/jenkins/workspace/lldb-cmake/host-compiler/bin/clang++  -Wdocumentation -fPIC -fvisibility-inlines-hidden -Werror=date-time -Werror=unguarded-availability-new -fmodules -fmodules-cache-path=/Users/buildslave/jenkins/workspace/lldb-cmake/lldb-build/module.cache -fcxx-modules -Xclang -fmodules-local-submodule-visibility -Wall -Wextra -Wno-unused-parameter -Wwrite-strings -Wcast-qual -Wmissing-field-initializers -pedantic -Wno-long-long -Wimplicit-fallthrough -Wcovered-switch-default -Wno-noexcept-type -Wnon-virtual-dtor -Wdelete-non-virtual-dtor -Wsuggest-override -Wstring-conversion -fdiagnostics-color -O3  -isysroot /Applications/Xcode.app/Contents/Developer/Platforms/MacOSX.platform/Developer/SDKs/MacOSX10.15.sdk -Wl,-search_paths_first -Wl,-headerpad_max_install_names -Wl,-dead_strip tools/sanstats/CMakeFiles/sanstats.dir/sanstats.cpp.o  -o bin/sanstats  -Wl,-rpath,@loader_path/../lib  lib/libLLVMSupport.a  lib/libLLVMSymbolize.a  lib/libLLVMDebugInfoDWARF.a  lib/libLLVMDebugInfoPDB.a  lib/libLLVMObject.a  lib/libLLVMBitReader.a  lib/libLLVMCore.a  lib/libLLVMRemarks.a  lib/libLLVMBitstreamReader.a  lib/libLLVMMCParser.a  lib/libLLVMMC.a  lib/libLLVMDebugInfoCodeView.a  lib/libLLVMDebugInfoMSF.a  lib/libLLVMTextAPI.a  lib/libLLVMBinaryFormat.a  lib/libLLVMSupport.a  -lm  /usr/lib/libz.dylib  /usr/lib/libcurses.dylib  lib/libLLVMDemangle.a && :
[5154/5184] /Users/buildslave/jenkins/workspace/lldb-cmake/host-compiler/bin/clang++  -DGTEST_HAS_RTTI=0 -D_DEBUG -D__STDC_CONSTANT_MACROS -D__STDC_FORMAT_MACROS -D__STDC_LIMIT_MACROS -Itools/verify-uselistorder -I/Users/buildslave/jenkins/workspace/lldb-cmake/llvm-project/llvm/tools/verify-uselistorder -Iinclude -I/Users/buildslave/jenkins/workspace/lldb-cmake/llvm-project/llvm/include -Wdocumentation -fPIC -fvisibility-inlines-hidden -Werror=date-time -Werror=unguarded-availability-new -fmodules -fmodules-cache-path=/Users/buildslave/jenkins/workspace/lldb-cmake/lldb-build/module.cache -fcxx-modules -Xclang -fmodules-local-submodule-visibility -Wall -Wextra -Wno-unused-parameter -Wwrite-strings -Wcast-qual -Wmissing-field-initializers -pedantic -Wno-long-long -Wimplicit-fallthrough -Wcovered-switch-default -Wno-noexcept-type -Wnon-virtual-dtor -Wdelete-non-virtual-dtor -Wsuggest-override -Wstring-conversion -fdiagnostics-color -O3  -isysroot /Applications/Xcode.app/Contents/Developer/Platforms/MacOSX.platform/Developer/SDKs/MacOSX10.15.sdk    -fno-exceptions -fno-rtti -UNDEBUG -std=c++14 -MD -MT tools/verify-uselistorder/CMakeFiles/verify-uselistorder.dir/verify-uselistorder.cpp.o -MF tools/verify-uselistorder/CMakeFiles/verify-uselistorder.dir/verify-uselistorder.cpp.o.d -o tools/verify-uselistorder/CMakeFiles/verify-uselistorder.dir/verify-uselistorder.cpp.o -c /Users/buildslave/jenkins/workspace/lldb-cmake/llvm-project/llvm/tools/verify-uselistorder/verify-uselistorder.cpp
[5155/5184] : && /Users/buildslave/jenkins/workspace/lldb-cmake/host-compiler/bin/clang++  -Wdocumentation -fPIC -fvisibility-inlines-hidden -Werror=date-time -Werror=unguarded-availability-new -fmodules -fmodules-cache-path=/Users/buildslave/jenkins/workspace/lldb-cmake/lldb-build/module.cache -fcxx-modules -Xclang -fmodules-local-submodule-visibility -Wall -Wextra -Wno-unused-parameter -Wwrite-strings -Wcast-qual -Wmissing-field-initializers -pedantic -Wno-long-long -Wimplicit-fallthrough -Wcovered-switch-default -Wno-noexcept-type -Wnon-virtual-dtor -Wdelete-non-virtual-dtor -Wsuggest-override -Wstring-conversion -fdiagnostics-color -O3  -isysroot /Applications/Xcode.app/Contents/Developer/Platforms/MacOSX.platform/Developer/SDKs/MacOSX10.15.sdk -Wl,-search_paths_first -Wl,-headerpad_max_install_names -Wl,-dead_strip tools/verify-uselistorder/CMakeFiles/verify-uselistorder.dir/verify-uselistorder.cpp.o  -o bin/verify-uselistorder  -Wl,-rpath,@loader_path/../lib  lib/libLLVMAsmParser.a  lib/libLLVMBitReader.a  lib/libLLVMBitWriter.a  lib/libLLVMCore.a  lib/libLLVMIRReader.a  lib/libLLVMSupport.a  lib/libLLVMAnalysis.a  lib/libLLVMProfileData.a  lib/libLLVMObject.a  lib/libLLVMMCParser.a  lib/libLLVMMC.a  lib/libLLVMDebugInfoCodeView.a  lib/libLLVMDebugInfoMSF.a  lib/libLLVMTextAPI.a  lib/libLLVMAsmParser.a  lib/libLLVMBitReader.a  lib/libLLVMCore.a  lib/libLLVMBinaryFormat.a  lib/libLLVMRemarks.a  lib/libLLVMBitstreamReader.a  lib/libLLVMSupport.a  -lm  /usr/lib/libz.dylib  /usr/lib/libcurses.dylib  lib/libLLVMDemangle.a && :
[5156/5184] /Users/buildslave/jenkins/workspace/lldb-cmake/host-compiler/bin/clang++  -DGTEST_HAS_RTTI=0 -D_DEBUG -D__STDC_CONSTANT_MACROS -D__STDC_FORMAT_MACROS -D__STDC_LIMIT_MACROS -Iexamples/Bye -I/Users/buildslave/jenkins/workspace/lldb-cmake/llvm-project/llvm/examples/Bye -Iinclude -I/Users/buildslave/jenkins/workspace/lldb-cmake/llvm-project/llvm/include -Wdocumentation -fPIC -fvisibility-inlines-hidden -Werror=date-time -Werror=unguarded-availability-new -fmodules -fmodules-cache-path=/Users/buildslave/jenkins/workspace/lldb-cmake/lldb-build/module.cache -fcxx-modules -Xclang -fmodules-local-submodule-visibility -Wall -Wextra -Wno-unused-parameter -Wwrite-strings -Wcast-qual -Wmissing-field-initializers -pedantic -Wno-long-long -Wimplicit-fallthrough -Wcovered-switch-default -Wno-noexcept-type -Wnon-virtual-dtor -Wdelete-non-virtual-dtor -Wsuggest-override -Wstring-conversion -fdiagnostics-color -O3  -isysroot /Applications/Xcode.app/Contents/Developer/Platforms/MacOSX.platform/Developer/SDKs/MacOSX10.15.sdk -fPIC    -fno-exceptions -fno-rtti -UNDEBUG -std=c++14 -MD -MT examples/Bye/CMakeFiles/Bye.dir/Bye.cpp.o -MF examples/Bye/CMakeFiles/Bye.dir/Bye.cpp.o.d -o examples/Bye/CMakeFiles/Bye.dir/Bye.cpp.o -c /Users/buildslave/jenkins/workspace/lldb-cmake/llvm-project/llvm/examples/Bye/Bye.cpp
[5157/5184] : && /Users/buildslave/jenkins/workspace/lldb-cmake/host-compiler/bin/clang++ -Wdocumentation -fPIC -fvisibility-inlines-hidden -Werror=date-time -Werror=unguarded-availability-new -fmodules -fmodules-cache-path=/Users/buildslave/jenkins/workspace/lldb-cmake/lldb-build/module.cache -fcxx-modules -Xclang -fmodules-local-submodule-visibility -Wall -Wextra -Wno-unused-parameter -Wwrite-strings -Wcast-qual -Wmissing-field-initializers -pedantic -Wno-long-long -Wimplicit-fallthrough -Wcovered-switch-default -Wno-noexcept-type -Wnon-virtual-dtor -Wdelete-non-virtual-dtor -Wsuggest-override -Wstring-conversion -fdiagnostics-color -O3 -isysroot /Applications/Xcode.app/Contents/Developer/Platforms/MacOSX.platform/Developer/SDKs/MacOSX10.15.sdk -bundle -Wl,-headerpad_max_install_names -Wl,-flat_namespace -Wl,-undefined -Wl,suppress   -Wl,-dead_strip -o lib/Bye.dylib examples/Bye/CMakeFiles/Bye.dir/Bye.cpp.o  -Wl,-rpath,@loader_path/../lib && :
[5158/5184] /Users/buildslave/jenkins/workspace/lldb-cmake/host-compiler/bin/clang++  -DGTEST_HAS_RTTI=0 -D_DEBUG -D__STDC_CONSTANT_MACROS -D__STDC_FORMAT_MACROS -D__STDC_LIMIT_MACROS -Itools/obj2yaml -I/Users/buildslave/jenkins/workspace/lldb-cmake/llvm-project/llvm/tools/obj2yaml -Iinclude -I/Users/buildslave/jenkins/workspace/lldb-cmake/llvm-project/llvm/include -Wdocumentation -fPIC -fvisibility-inlines-hidden -Werror=date-time -Werror=unguarded-availability-new -fmodules -fmodules-cache-path=/Users/buildslave/jenkins/workspace/lldb-cmake/lldb-build/module.cache -fcxx-modules -Xclang -fmodules-local-submodule-visibility -Wall -Wextra -Wno-unused-parameter -Wwrite-strings -Wcast-qual -Wmissing-field-initializers -pedantic -Wno-long-long -Wimplicit-fallthrough -Wcovered-switch-default -Wno-noexcept-type -Wnon-virtual-dtor -Wdelete-non-virtual-dtor -Wsuggest-override -Wstring-conversion -fdiagnostics-color -O3  -isysroot /Applications/Xcode.app/Contents/Developer/Platforms/MacOSX.platform/Developer/SDKs/MacOSX10.15.sdk    -fno-exceptions -fno-rtti -UNDEBUG -std=c++14 -MD -MT tools/obj2yaml/CMakeFiles/obj2yaml.dir/macho2yaml.cpp.o -MF tools/obj2yaml/CMakeFiles/obj2yaml.dir/macho2yaml.cpp.o.d -o tools/obj2yaml/CMakeFiles/obj2yaml.dir/macho2yaml.cpp.o -c /Users/buildslave/jenkins/workspace/lldb-cmake/llvm-project/llvm/tools/obj2yaml/macho2yaml.cpp
[5159/5184] /Users/buildslave/jenkins/workspace/lldb-cmake/host-compiler/bin/clang++  -DGTEST_HAS_RTTI=0 -D_DEBUG -D__STDC_CONSTANT_MACROS -D__STDC_FORMAT_MACROS -D__STDC_LIMIT_MACROS -Itools/yaml2obj -I/Users/buildslave/jenkins/workspace/lldb-cmake/llvm-project/llvm/tools/yaml2obj -Iinclude -I/Users/buildslave/jenkins/workspace/lldb-cmake/llvm-project/llvm/include -Wdocumentation -fPIC -fvisibility-inlines-hidden -Werror=date-time -Werror=unguarded-availability-new -fmodules -fmodules-cache-path=/Users/buildslave/jenkins/workspace/lldb-cmake/lldb-build/module.cache -fcxx-modules -Xclang -fmodules-local-submodule-visibility -Wall -Wextra -Wno-unused-parameter -Wwrite-strings -Wcast-qual -Wmissing-field-initializers -pedantic -Wno-long-long -Wimplicit-fallthrough -Wcovered-switch-default -Wno-noexcept-type -Wnon-virtual-dtor -Wdelete-non-virtual-dtor -Wsuggest-override -Wstring-conversion -fdiagnostics-color -O3  -isysroot /Applications/Xcode.app/Contents/Developer/Platforms/MacOSX.platform/Developer/SDKs/MacOSX10.15.sdk    -fno-exceptions -fno-rtti -UNDEBUG -std=c++14 -MD -MT tools/yaml2obj/CMakeFiles/yaml2obj.dir/yaml2obj.cpp.o -MF tools/yaml2obj/CMakeFiles/yaml2obj.dir/yaml2obj.cpp.o.d -o tools/yaml2obj/CMakeFiles/yaml2obj.dir/yaml2obj.cpp.o -c /Users/buildslave/jenkins/workspace/lldb-cmake/llvm-project/llvm/tools/yaml2obj/yaml2obj.cpp
[5160/5184] : && /Users/buildslave/jenkins/workspace/lldb-cmake/host-compiler/bin/clang++  -Wdocumentation -fPIC -fvisibility-inlines-hidden -Werror=date-time -Werror=unguarded-availability-new -fmodules -fmodules-cache-path=/Users/buildslave/jenkins/workspace/lldb-cmake/lldb-build/module.cache -fcxx-modules -Xclang -fmodules-local-submodule-visibility -Wall -Wextra -Wno-unused-parameter -Wwrite-strings -Wcast-qual -Wmissing-field-initializers -pedantic -Wno-long-long -Wimplicit-fallthrough -Wcovered-switch-default -Wno-noexcept-type -Wnon-virtual-dtor -Wdelete-non-virtual-dtor -Wsuggest-override -Wstring-conversion -fdiagnostics-color -O3  -isysroot /Applications/Xcode.app/Contents/Developer/Platforms/MacOSX.platform/Developer/SDKs/MacOSX10.15.sdk -Wl,-search_paths_first -Wl,-headerpad_max_install_names -Wl,-dead_strip tools/yaml2obj/CMakeFiles/yaml2obj.dir/yaml2obj.cpp.o  -o bin/yaml2obj  -Wl,-rpath,@loader_path/../lib  lib/libLLVMObjectYAML.a  lib/libLLVMSupport.a  lib/libLLVMObject.a  lib/libLLVMBitReader.a  lib/libLLVMCore.a  lib/libLLVMRemarks.a  lib/libLLVMBitstreamReader.a  lib/libLLVMMCParser.a  lib/libLLVMMC.a  lib/libLLVMDebugInfoCodeView.a  lib/libLLVMDebugInfoMSF.a  lib/libLLVMTextAPI.a  lib/libLLVMBinaryFormat.a  lib/libLLVMSupport.a  -lm  /usr/lib/libz.dylib  /usr/lib/libcurses.dylib  lib/libLLVMDemangle.a && :
[5161/5184] /Users/buildslave/jenkins/workspace/lldb-cmake/host-compiler/bin/clang++  -DGTEST_HAS_RTTI=0 -D_DEBUG -D__STDC_CONSTANT_MACROS -D__STDC_FORMAT_MACROS -D__STDC_LIMIT_MACROS -Itools/opt -I/Users/buildslave/jenkins/workspace/lldb-cmake/llvm-project/llvm/tools/opt -Iinclude -I/Users/buildslave/jenkins/workspace/lldb-cmake/llvm-project/llvm/include -Wdocumentation -fPIC -fvisibility-inlines-hidden -Werror=date-time -Werror=unguarded-availability-new -fmodules -fmodules-cache-path=/Users/buildslave/jenkins/workspace/lldb-cmake/lldb-build/module.cache -fcxx-modules -Xclang -fmodules-local-submodule-visibility -Wall -Wextra -Wno-unused-parameter -Wwrite-strings -Wcast-qual -Wmissing-field-initializers -pedantic -Wno-long-long -Wimplicit-fallthrough -Wcovered-switch-default -Wno-noexcept-type -Wnon-virtual-dtor -Wdelete-non-virtual-dtor -Wsuggest-override -Wstring-conversion -fdiagnostics-color -O3  -isysroot /Applications/Xcode.app/Contents/Developer/Platforms/MacOSX.platform/Developer/SDKs/MacOSX10.15.sdk    -fno-exceptions -fno-rtti -UNDEBUG -std=c++14 -MD -MT tools/opt/CMakeFiles/opt.dir/NewPMDriver.cpp.o -MF tools/opt/CMakeFiles/opt.dir/NewPMDriver.cpp.o.d -o tools/opt/CMakeFiles/opt.dir/NewPMDriver.cpp.o -c /Users/buildslave/jenkins/workspace/lldb-cmake/llvm-project/llvm/tools/opt/NewPMDriver.cpp
[5162/5184] /Users/buildslave/jenkins/workspace/lldb-cmake/host-compiler/bin/clang++  -DGTEST_HAS_RTTI=0 -D_DEBUG -D__STDC_CONSTANT_MACROS -D__STDC_FORMAT_MACROS -D__STDC_LIMIT_MACROS -Itools/opt -I/Users/buildslave/jenkins/workspace/lldb-cmake/llvm-project/llvm/tools/opt -Iinclude -I/Users/buildslave/jenkins/workspace/lldb-cmake/llvm-project/llvm/include -Wdocumentation -fPIC -fvisibility-inlines-hidden -Werror=date-time -Werror=unguarded-availability-new -fmodules -fmodules-cache-path=/Users/buildslave/jenkins/workspace/lldb-cmake/lldb-build/module.cache -fcxx-modules -Xclang -fmodules-local-submodule-visibility -Wall -Wextra -Wno-unused-parameter -Wwrite-strings -Wcast-qual -Wmissing-field-initializers -pedantic -Wno-long-long -Wimplicit-fallthrough -Wcovered-switch-default -Wno-noexcept-type -Wnon-virtual-dtor -Wdelete-non-virtual-dtor -Wsuggest-override -Wstring-conversion -fdiagnostics-color -O3  -isysroot /Applications/Xcode.app/Contents/Developer/Platforms/MacOSX.platform/Developer/SDKs/MacOSX10.15.sdk    -fno-exceptions -fno-rtti -UNDEBUG -std=c++14 -MD -MT tools/opt/CMakeFiles/opt.dir/opt.cpp.o -MF tools/opt/CMakeFiles/opt.dir/opt.cpp.o.d -o tools/opt/CMakeFiles/opt.dir/opt.cpp.o -c /Users/buildslave/jenkins/workspace/lldb-cmake/llvm-project/llvm/tools/opt/opt.cpp
[5163/5184] /Users/buildslave/jenkins/workspace/lldb-cmake/host-compiler/bin/clang++  -DPipSqueak_EXPORTS -D_DEBUG -D__STDC_CONSTANT_MACROS -D__STDC_FORMAT_MACROS -D__STDC_LIMIT_MACROS -Iunittests/Support/DynamicLibrary -I/Users/buildslave/jenkins/workspace/lldb-cmake/llvm-project/llvm/unittests/Support/DynamicLibrary -Iinclude -I/Users/buildslave/jenkins/workspace/lldb-cmake/llvm-project/llvm/include -Wdocumentation -fPIC -fvisibility-inlines-hidden -Werror=date-time -Werror=unguarded-availability-new -fmodules -fmodules-cache-path=/Users/buildslave/jenkins/workspace/lldb-cmake/lldb-build/module.cache -fcxx-modules -Xclang -fmodules-local-submodule-visibility -Wall -Wextra -Wno-unused-parameter -Wwrite-strings -Wcast-qual -Wmissing-field-initializers -pedantic -Wno-long-long -Wimplicit-fallthrough -Wcovered-switch-default -Wno-noexcept-type -Wnon-virtual-dtor -Wdelete-non-virtual-dtor -Wsuggest-override -Wstring-conversion -fdiagnostics-color -O3  -isysroot /Applications/Xcode.app/Contents/Developer/Platforms/MacOSX.platform/Developer/SDKs/MacOSX10.15.sdk -fPIC   -UNDEBUG -std=c++14 -MD -MT unittests/Support/DynamicLibrary/CMakeFiles/PipSqueak.dir/PipSqueak.cpp.o -MF unittests/Support/DynamicLibrary/CMakeFiles/PipSqueak.dir/PipSqueak.cpp.o.d -o unittests/Support/DynamicLibrary/CMakeFiles/PipSqueak.dir/PipSqueak.cpp.o -c /Users/buildslave/jenkins/workspace/lldb-cmake/llvm-project/llvm/unittests/Support/DynamicLibrary/PipSqueak.cpp
[5164/5184] /Users/buildslave/jenkins/workspace/lldb-cmake/host-compiler/bin/clang++  -DGTEST_HAS_RTTI=0 -D_DEBUG -D__STDC_CONSTANT_MACROS -D__STDC_FORMAT_MACROS -D__STDC_LIMIT_MACROS -Itools/sancov -I/Users/buildslave/jenkins/workspace/lldb-cmake/llvm-project/llvm/tools/sancov -Iinclude -I/Users/buildslave/jenkins/workspace/lldb-cmake/llvm-project/llvm/include -Wdocumentation -fPIC -fvisibility-inlines-hidden -Werror=date-time -Werror=unguarded-availability-new -fmodules -fmodules-cache-path=/Users/buildslave/jenkins/workspace/lldb-cmake/lldb-build/module.cache -fcxx-modules -Xclang -fmodules-local-submodule-visibility -Wall -Wextra -Wno-unused-parameter -Wwrite-strings -Wcast-qual -Wmissing-field-initializers -pedantic -Wno-long-long -Wimplicit-fallthrough -Wcovered-switch-default -Wno-noexcept-type -Wnon-virtual-dtor -Wdelete-non-virtual-dtor -Wsuggest-override -Wstring-conversion -fdiagnostics-color -O3  -isysroot /Applications/Xcode.app/Contents/Developer/Platforms/MacOSX.platform/Developer/SDKs/MacOSX10.15.sdk    -fno-exceptions -fno-rtti -UNDEBUG -std=c++14 -MD -MT tools/sancov/CMakeFiles/sancov.dir/sancov.cpp.o -MF tools/sancov/CMakeFiles/sancov.dir/sancov.cpp.o.d -o tools/sancov/CMakeFiles/sancov.dir/sancov.cpp.o -c /Users/buildslave/jenkins/workspace/lldb-cmake/llvm-project/llvm/tools/sancov/sancov.cpp
[5165/5184] : && /Users/buildslave/jenkins/workspace/lldb-cmake/host-compiler/bin/clang++ -Wdocumentation -fPIC -fvisibility-inlines-hidden -Werror=date-time -Werror=unguarded-availability-new -fmodules -fmodules-cache-path=/Users/buildslave/jenkins/workspace/lldb-cmake/lldb-build/module.cache -fcxx-modules -Xclang -fmodules-local-submodule-visibility -Wall -Wextra -Wno-unused-parameter -Wwrite-strings -Wcast-qual -Wmissing-field-initializers -pedantic -Wno-long-long -Wimplicit-fallthrough -Wcovered-switch-default -Wno-noexcept-type -Wnon-virtual-dtor -Wdelete-non-virtual-dtor -Wsuggest-override -Wstring-conversion -fdiagnostics-color -O3 -isysroot /Applications/Xcode.app/Contents/Developer/Platforms/MacOSX.platform/Developer/SDKs/MacOSX10.15.sdk -dynamiclib -Wl,-headerpad_max_install_names  -o unittests/Support/DynamicLibrary/PipSqueak.dylib -install_name @rpath/PipSqueak.dylib unittests/Support/DynamicLibrary/CMakeFiles/PipSqueak.dir/PipSqueak.cpp.o   && :
[5166/5184] : && /Users/buildslave/jenkins/workspace/lldb-cmake/host-compiler/bin/clang++  -Wdocumentation -fPIC -fvisibility-inlines-hidden -Werror=date-time -Werror=unguarded-availability-new -fmodules -fmodules-cache-path=/Users/buildslave/jenkins/workspace/lldb-cmake/lldb-build/module.cache -fcxx-modules -Xclang -fmodules-local-submodule-visibility -Wall -Wextra -Wno-unused-parameter -Wwrite-strings -Wcast-qual -Wmissing-field-initializers -pedantic -Wno-long-long -Wimplicit-fallthrough -Wcovered-switch-default -Wno-noexcept-type -Wnon-virtual-dtor -Wdelete-non-virtual-dtor -Wsuggest-override -Wstring-conversion -fdiagnostics-color -O3  -isysroot /Applications/Xcode.app/Contents/Developer/Platforms/MacOSX.platform/Developer/SDKs/MacOSX10.15.sdk -Wl,-search_paths_first -Wl,-headerpad_max_install_names -rdynamic tools/opt/CMakeFiles/opt.dir/AnalysisWrappers.cpp.o tools/opt/CMakeFiles/opt.dir/BreakpointPrinter.cpp.o tools/opt/CMakeFiles/opt.dir/GraphPrinters.cpp.o tools/opt/CMakeFiles/opt.dir/NewPMDriver.cpp.o tools/opt/CMakeFiles/opt.dir/PassPrinters.cpp.o tools/opt/CMakeFiles/opt.dir/PrintSCC.cpp.o tools/opt/CMakeFiles/opt.dir/opt.cpp.o  -o bin/opt  -Wl,-rpath,@loader_path/../lib  lib/libLLVMAArch64AsmParser.a  lib/libLLVMAMDGPUAsmParser.a  lib/libLLVMARMAsmParser.a  lib/libLLVMAVRAsmParser.a  lib/libLLVMBPFAsmParser.a  lib/libLLVMHexagonAsmParser.a  lib/libLLVMLanaiAsmParser.a  lib/libLLVMMipsAsmParser.a  lib/libLLVMMSP430AsmParser.a  lib/libLLVMPowerPCAsmParser.a  lib/libLLVMRISCVAsmParser.a  lib/libLLVMSparcAsmParser.a  lib/libLLVMSystemZAsmParser.a  lib/libLLVMWebAssemblyAsmParser.a  lib/libLLVMX86AsmParser.a  lib/libLLVMAArch64CodeGen.a  lib/libLLVMAMDGPUCodeGen.a  lib/libLLVMARMCodeGen.a  lib/libLLVMAVRCodeGen.a  lib/libLLVMBPFCodeGen.a  lib/libLLVMHexagonCodeGen.a  lib/libLLVMLanaiCodeGen.a  lib/libLLVMMipsCodeGen.a  lib/libLLVMMSP430CodeGen.a  lib/libLLVMNVPTXCodeGen.a  lib/libLLVMPowerPCCodeGen.a  lib/libLLVMRISCVCodeGen.a  lib/libLLVMSparcCodeGen.a  lib/libLLVMSystemZCodeGen.a  lib/libLLVMWebAssemblyCodeGen.a  lib/libLLVMX86CodeGen.a  lib/libLLVMXCoreCodeGen.a  lib/libLLVMAArch64Desc.a  lib/libLLVMAMDGPUDesc.a  lib/libLLVMARMDesc.a  lib/libLLVMAVRDesc.a  lib/libLLVMBPFDesc.a  lib/libLLVMHexagonDesc.a  lib/libLLVMLanaiDesc.a  lib/libLLVMMipsDesc.a  lib/libLLVMMSP430Desc.a  lib/libLLVMNVPTXDesc.a  lib/libLLVMPowerPCDesc.a  lib/libLLVMRISCVDesc.a  lib/libLLVMSparcDesc.a  lib/libLLVMSystemZDesc.a  lib/libLLVMWebAssemblyDesc.a  lib/libLLVMX86Desc.a  lib/libLLVMXCoreDesc.a  lib/libLLVMAArch64Info.a  lib/libLLVMAMDGPUInfo.a  lib/libLLVMARMInfo.a  lib/libLLVMAVRInfo.a  lib/libLLVMBPFInfo.a  lib/libLLVMHexagonInfo.a  lib/libLLVMLanaiInfo.a  lib/libLLVMMipsInfo.a  lib/libLLVMMSP430Info.a  lib/libLLVMNVPTXInfo.a  lib/libLLVMPowerPCInfo.a  lib/libLLVMRISCVInfo.a  lib/libLLVMSparcInfo.a  lib/libLLVMSystemZInfo.a  lib/libLLVMWebAssemblyInfo.a  lib/libLLVMX86Info.a  lib/libLLVMXCoreInfo.a  lib/libLLVMAggressiveInstCombine.a  lib/libLLVMAnalysis.a  lib/libLLVMAsmParser.a  lib/libLLVMBitWriter.a  lib/libLLVMCodeGen.a  lib/libLLVMCore.a  lib/libLLVMCoroutines.a  lib/libLLVMExtensions.a  lib/libLLVMipo.a  lib/libLLVMIRReader.a  lib/libLLVMInstCombine.a  lib/libLLVMInstrumentation.a  lib/libLLVMMC.a  lib/libLLVMObjCARCOpts.a  lib/libLLVMRemarks.a  lib/libLLVMScalarOpts.a  lib/libLLVMSupport.a  lib/libLLVMTarget.a  lib/libLLVMTransformUtils.a  lib/libLLVMVectorize.a  lib/libLLVMPasses.a  lib/libLLVMAArch64Utils.a  lib/libLLVMAMDGPUUtils.a  lib/libLLVMMIRParser.a  lib/libLLVMARMUtils.a  lib/libLLVMHexagonAsmParser.a  lib/libLLVMHexagonDesc.a  lib/libLLVMHexagonInfo.a  lib/libLLVMLanaiAsmParser.a  lib/libLLVMLanaiDesc.a  lib/libLLVMLanaiInfo.a  lib/libLLVMRISCVUtils.a  lib/libLLVMMCDisassembler.a  lib/libLLVMCFGuard.a  lib/libLLVMGlobalISel.a  lib/libLLVMAsmPrinter.a  lib/libLLVMDebugInfoDWARF.a  lib/libLLVMSelectionDAG.a  lib/libLLVMCodeGen.a  lib/libLLVMCoroutines.a  lib/libLLVMipo.a  lib/libLLVMBitWriter.a  lib/libLLVMIRReader.a  lib/libLLVMAsmParser.a  lib/libLLVMFrontendOpenMP.a  lib/libLLVMLinker.a  lib/libLLVMInstrumentation.a  lib/libLLVMObjCARCOpts.a  lib/libLLVMScalarOpts.a  lib/libLLVMAggressiveInstCombine.a  lib/libLLVMInstCombine.a  lib/libLLVMTarget.a  lib/libLLVMVectorize.a  lib/libLLVMTransformUtils.a  lib/libLLVMAnalysis.a  lib/libLLVMProfileData.a  lib/libLLVMObject.a  lib/libLLVMMCParser.a  lib/libLLVMMC.a  lib/libLLVMDebugInfoCodeView.a  lib/libLLVMDebugInfoMSF.a  lib/libLLVMBitReader.a  lib/libLLVMTextAPI.a  lib/libLLVMHelloNew.a  lib/libLLVMCore.a  lib/libLLVMRemarks.a  lib/libLLVMBitstreamReader.a  lib/libLLVMBinaryFormat.a  lib/libLLVMSupport.a  -lm  /usr/lib/libz.dylib  /usr/lib/libcurses.dylib  lib/libLLVMDemangle.a && :
[5167/5184] : && /Users/buildslave/jenkins/workspace/lldb-cmake/host-compiler/bin/clang++  -Wdocumentation -fPIC -fvisibility-inlines-hidden -Werror=date-time -Werror=unguarded-availability-new -fmodules -fmodules-cache-path=/Users/buildslave/jenkins/workspace/lldb-cmake/lldb-build/module.cache -fcxx-modules -Xclang -fmodules-local-submodule-visibility -Wall -Wextra -Wno-unused-parameter -Wwrite-strings -Wcast-qual -Wmissing-field-initializers -pedantic -Wno-long-long -Wimplicit-fallthrough -Wcovered-switch-default -Wno-noexcept-type -Wnon-virtual-dtor -Wdelete-non-virtual-dtor -Wsuggest-override -Wstring-conversion -fdiagnostics-color -O3  -isysroot /Applications/Xcode.app/Contents/Developer/Platforms/MacOSX.platform/Developer/SDKs/MacOSX10.15.sdk -Wl,-search_paths_first -Wl,-headerpad_max_install_names -Wl,-dead_strip tools/sancov/CMakeFiles/sancov.dir/sancov.cpp.o  -o bin/sancov  -Wl,-rpath,@loader_path/../lib  lib/libLLVMAArch64Desc.a  lib/libLLVMAMDGPUDesc.a  lib/libLLVMARMDesc.a  lib/libLLVMAVRDesc.a  lib/libLLVMBPFDesc.a  lib/libLLVMHexagonDesc.a  lib/libLLVMLanaiDesc.a  lib/libLLVMMipsDesc.a  lib/libLLVMMSP430Desc.a  lib/libLLVMNVPTXDesc.a  lib/libLLVMPowerPCDesc.a  lib/libLLVMRISCVDesc.a  lib/libLLVMSparcDesc.a  lib/libLLVMSystemZDesc.a  lib/libLLVMWebAssemblyDesc.a  lib/libLLVMX86Desc.a  lib/libLLVMXCoreDesc.a  lib/libLLVMAArch64Disassembler.a  lib/libLLVMAMDGPUDisassembler.a  lib/libLLVMARMDisassembler.a  lib/libLLVMAVRDisassembler.a  lib/libLLVMBPFDisassembler.a  lib/libLLVMHexagonDisassembler.a  lib/libLLVMLanaiDisassembler.a  lib/libLLVMMipsDisassembler.a  lib/libLLVMMSP430Disassembler.a  lib/libLLVMPowerPCDisassembler.a  lib/libLLVMRISCVDisassembler.a  lib/libLLVMSparcDisassembler.a  lib/libLLVMSystemZDisassembler.a  lib/libLLVMWebAssemblyDisassembler.a  lib/libLLVMX86Disassembler.a  lib/libLLVMXCoreDisassembler.a  lib/libLLVMAArch64Info.a  lib/libLLVMAMDGPUInfo.a  lib/libLLVMARMInfo.a  lib/libLLVMAVRInfo.a  lib/libLLVMBPFInfo.a  lib/libLLVMHexagonInfo.a  lib/libLLVMLanaiInfo.a  lib/libLLVMMipsInfo.a  lib/libLLVMMSP430Info.a  lib/libLLVMNVPTXInfo.a  lib/libLLVMPowerPCInfo.a  lib/libLLVMRISCVInfo.a  lib/libLLVMSparcInfo.a  lib/libLLVMSystemZInfo.a  lib/libLLVMWebAssemblyInfo.a  lib/libLLVMX86Info.a  lib/libLLVMXCoreInfo.a  lib/libLLVMDebugInfoDWARF.a  lib/libLLVMDebugInfoPDB.a  lib/libLLVMMC.a  lib/libLLVMMCDisassembler.a  lib/libLLVMObject.a  lib/libLLVMSupport.a  lib/libLLVMSymbolize.a  lib/libLLVMRISCVUtils.a  lib/libLLVMAArch64Desc.a  lib/libLLVMAArch64Info.a  lib/libLLVMAArch64Utils.a  lib/libLLVMAMDGPUDesc.a  lib/libLLVMAMDGPUInfo.a  lib/libLLVMAMDGPUUtils.a  lib/libLLVMARMDesc.a  lib/libLLVMARMInfo.a  lib/libLLVMARMUtils.a  lib/libLLVMHexagonDesc.a  lib/libLLVMHexagonInfo.a  lib/libLLVMLanaiDesc.a  lib/libLLVMLanaiInfo.a  lib/libLLVMSystemZDesc.a  lib/libLLVMSystemZInfo.a  lib/libLLVMWebAssemblyDesc.a  lib/libLLVMWebAssemblyInfo.a  lib/libLLVMMCDisassembler.a  lib/libLLVMDebugInfoDWARF.a  lib/libLLVMDebugInfoPDB.a  lib/libLLVMObject.a  lib/libLLVMBitReader.a  lib/libLLVMCore.a  lib/libLLVMRemarks.a  lib/libLLVMBitstreamReader.a  lib/libLLVMMCParser.a  lib/libLLVMMC.a  lib/libLLVMDebugInfoCodeView.a  lib/libLLVMDebugInfoMSF.a  lib/libLLVMTextAPI.a  lib/libLLVMBinaryFormat.a  lib/libLLVMSupport.a  -lm  /usr/lib/libz.dylib  /usr/lib/libcurses.dylib  lib/libLLVMDemangle.a && :
[5168/5184] /Users/buildslave/jenkins/workspace/lldb-cmake/host-compiler/bin/clang++  -DSecondLib_EXPORTS -D_DEBUG -D__STDC_CONSTANT_MACROS -D__STDC_FORMAT_MACROS -D__STDC_LIMIT_MACROS -Iunittests/Support/DynamicLibrary -I/Users/buildslave/jenkins/workspace/lldb-cmake/llvm-project/llvm/unittests/Support/DynamicLibrary -Iinclude -I/Users/buildslave/jenkins/workspace/lldb-cmake/llvm-project/llvm/include -Wdocumentation -fPIC -fvisibility-inlines-hidden -Werror=date-time -Werror=unguarded-availability-new -fmodules -fmodules-cache-path=/Users/buildslave/jenkins/workspace/lldb-cmake/lldb-build/module.cache -fcxx-modules -Xclang -fmodules-local-submodule-visibility -Wall -Wextra -Wno-unused-parameter -Wwrite-strings -Wcast-qual -Wmissing-field-initializers -pedantic -Wno-long-long -Wimplicit-fallthrough -Wcovered-switch-default -Wno-noexcept-type -Wnon-virtual-dtor -Wdelete-non-virtual-dtor -Wsuggest-override -Wstring-conversion -fdiagnostics-color -O3  -isysroot /Applications/Xcode.app/Contents/Developer/Platforms/MacOSX.platform/Developer/SDKs/MacOSX10.15.sdk -fPIC   -UNDEBUG -std=c++14 -MD -MT unittests/Support/DynamicLibrary/CMakeFiles/SecondLib.dir/PipSqueak.cpp.o -MF unittests/Support/DynamicLibrary/CMakeFiles/SecondLib.dir/PipSqueak.cpp.o.d -o unittests/Support/DynamicLibrary/CMakeFiles/SecondLib.dir/PipSqueak.cpp.o -c /Users/buildslave/jenkins/workspace/lldb-cmake/llvm-project/llvm/unittests/Support/DynamicLibrary/PipSqueak.cpp
[5169/5184] : && /Users/buildslave/jenkins/workspace/lldb-cmake/host-compiler/bin/clang++ -Wdocumentation -fPIC -fvisibility-inlines-hidden -Werror=date-time -Werror=unguarded-availability-new -fmodules -fmodules-cache-path=/Users/buildslave/jenkins/workspace/lldb-cmake/lldb-build/module.cache -fcxx-modules -Xclang -fmodules-local-submodule-visibility -Wall -Wextra -Wno-unused-parameter -Wwrite-strings -Wcast-qual -Wmissing-field-initializers -pedantic -Wno-long-long -Wimplicit-fallthrough -Wcovered-switch-default -Wno-noexcept-type -Wnon-virtual-dtor -Wdelete-non-virtual-dtor -Wsuggest-override -Wstring-conversion -fdiagnostics-color -O3 -isysroot /Applications/Xcode.app/Contents/Developer/Platforms/MacOSX.platform/Developer/SDKs/MacOSX10.15.sdk -dynamiclib -Wl,-headerpad_max_install_names  -o unittests/Support/DynamicLibrary/SecondLib.dylib -install_name @rpath/SecondLib.dylib unittests/Support/DynamicLibrary/CMakeFiles/SecondLib.dir/PipSqueak.cpp.o   && :
[5170/5184] /Users/buildslave/jenkins/workspace/lldb-cmake/host-compiler/bin/clang++  -DGTEST_HAS_RTTI=0 -DGTEST_HAS_TR1_TUPLE=0 -D_DEBUG -D__STDC_CONSTANT_MACROS -D__STDC_FORMAT_MACROS -D__STDC_LIMIT_MACROS -Iutils/unittest/UnitTestMain -I/Users/buildslave/jenkins/workspace/lldb-cmake/llvm-project/llvm/utils/unittest/UnitTestMain -Iinclude -I/Users/buildslave/jenkins/workspace/lldb-cmake/llvm-project/llvm/include -I/Users/buildslave/jenkins/workspace/lldb-cmake/llvm-project/llvm/utils/unittest/googletest/include -I/Users/buildslave/jenkins/workspace/lldb-cmake/llvm-project/llvm/utils/unittest/googlemock/include -Wdocumentation -fPIC -fvisibility-inlines-hidden -Werror=date-time -Werror=unguarded-availability-new -fmodules -fmodules-cache-path=/Users/buildslave/jenkins/workspace/lldb-cmake/lldb-build/module.cache -fcxx-modules -Xclang -fmodules-local-submodule-visibility -Wall -Wextra -Wno-unused-parameter -Wwrite-strings -Wcast-qual -Wmissing-field-initializers -pedantic -Wno-long-long -Wimplicit-fallthrough -Wcovered-switch-default -Wno-noexcept-type -Wnon-virtual-dtor -Wdelete-non-virtual-dtor -Wsuggest-override -Wstring-conversion -fdiagnostics-color -O3  -isysroot /Applications/Xcode.app/Contents/Developer/Platforms/MacOSX.platform/Developer/SDKs/MacOSX10.15.sdk   -Wno-variadic-macros -Wno-gnu-zero-variadic-macro-arguments -Wno-covered-switch-default -Wno-suggest-override  -fno-exceptions -UNDEBUG -Wno-suggest-override -std=c++14 -MD -MT utils/unittest/UnitTestMain/CMakeFiles/gtest_main.dir/TestMain.cpp.o -MF utils/unittest/UnitTestMain/CMakeFiles/gtest_main.dir/TestMain.cpp.o.d -o utils/unittest/UnitTestMain/CMakeFiles/gtest_main.dir/TestMain.cpp.o -c /Users/buildslave/jenkins/workspace/lldb-cmake/llvm-project/llvm/utils/unittest/UnitTestMain/TestMain.cpp
[5171/5184] /Users/buildslave/jenkins/workspace/lldb-cmake/host-compiler/bin/clang++  -D_DEBUG -D__STDC_CONSTANT_MACROS -D__STDC_FORMAT_MACROS -D__STDC_LIMIT_MACROS -Iunittests/Support/DynamicLibrary -I/Users/buildslave/jenkins/workspace/lldb-cmake/llvm-project/llvm/unittests/Support/DynamicLibrary -Iinclude -I/Users/buildslave/jenkins/workspace/lldb-cmake/llvm-project/llvm/include -Wdocumentation -fPIC -fvisibility-inlines-hidden -Werror=date-time -Werror=unguarded-availability-new -fmodules -fmodules-cache-path=/Users/buildslave/jenkins/workspace/lldb-cmake/lldb-build/module.cache -fcxx-modules -Xclang -fmodules-local-submodule-visibility -Wall -Wextra -Wno-unused-parameter -Wwrite-strings -Wcast-qual -Wmissing-field-initializers -pedantic -Wno-long-long -Wimplicit-fallthrough -Wcovered-switch-default -Wno-noexcept-type -Wnon-virtual-dtor -Wdelete-non-virtual-dtor -Wsuggest-override -Wstring-conversion -fdiagnostics-color -O3  -isysroot /Applications/Xcode.app/Contents/Developer/Platforms/MacOSX.platform/Developer/SDKs/MacOSX10.15.sdk   -UNDEBUG -std=c++14 -MD -MT unittests/Support/DynamicLibrary/CMakeFiles/DynamicLibraryLib.dir/ExportedFuncs.cpp.o -MF unittests/Support/DynamicLibrary/CMakeFiles/DynamicLibraryLib.dir/ExportedFuncs.cpp.o.d -o unittests/Support/DynamicLibrary/CMakeFiles/DynamicLibraryLib.dir/ExportedFuncs.cpp.o -c /Users/buildslave/jenkins/workspace/lldb-cmake/llvm-project/llvm/unittests/Support/DynamicLibrary/ExportedFuncs.cpp
[5172/5184] : && "/Applications/Xcode.app/Contents/Developer/Toolchains/XcodeDefault.xctoolchain/usr/bin/libtool" -static -no_warning_for_no_symbols -o lib/libDynamicLibraryLib.a  unittests/Support/DynamicLibrary/CMakeFiles/DynamicLibraryLib.dir/ExportedFuncs.cpp.o && :
[5173/5184] /Users/buildslave/jenkins/workspace/lldb-cmake/host-compiler/bin/clang++  -DGTEST_HAS_RTTI=0 -DGTEST_HAS_TR1_TUPLE=0 -D_DEBUG -D__STDC_CONSTANT_MACROS -D__STDC_FORMAT_MACROS -D__STDC_LIMIT_MACROS -Iutils/unittest -I/Users/buildslave/jenkins/workspace/lldb-cmake/llvm-project/llvm/utils/unittest -Iinclude -I/Users/buildslave/jenkins/workspace/lldb-cmake/llvm-project/llvm/include -I/Users/buildslave/jenkins/workspace/lldb-cmake/llvm-project/llvm/utils/unittest/googletest/include -I/Users/buildslave/jenkins/workspace/lldb-cmake/llvm-project/llvm/utils/unittest/googlemock/include -I/Users/buildslave/jenkins/workspace/lldb-cmake/llvm-project/llvm/utils/unittest/googletest -I/Users/buildslave/jenkins/workspace/lldb-cmake/llvm-project/llvm/utils/unittest/googlemock -Wdocumentation -fPIC -fvisibility-inlines-hidden -Werror=date-time -Werror=unguarded-availability-new -fmodules -fmodules-cache-path=/Users/buildslave/jenkins/workspace/lldb-cmake/lldb-build/module.cache -fcxx-modules -Xclang -fmodules-local-submodule-visibility -Wall -Wextra -Wno-unused-parameter -Wwrite-strings -Wcast-qual -Wmissing-field-initializers -pedantic -Wno-long-long -Wimplicit-fallthrough -Wcovered-switch-default -Wno-noexcept-type -Wnon-virtual-dtor -Wdelete-non-virtual-dtor -Wsuggest-override -Wstring-conversion -fdiagnostics-color -O3  -isysroot /Applications/Xcode.app/Contents/Developer/Platforms/MacOSX.platform/Developer/SDKs/MacOSX10.15.sdk   -Wno-variadic-macros -Wno-gnu-zero-variadic-macro-arguments -Wno-covered-switch-default -Wno-suggest-override  -fno-exceptions -UNDEBUG -std=c++14 -MD -MT utils/unittest/CMakeFiles/gtest.dir/googlemock/src/gmock-all.cc.o -MF utils/unittest/CMakeFiles/gtest.dir/googlemock/src/gmock-all.cc.o.d -o utils/unittest/CMakeFiles/gtest.dir/googlemock/src/gmock-all.cc.o -c /Users/buildslave/jenkins/workspace/lldb-cmake/llvm-project/llvm/utils/unittest/googlemock/src/gmock-all.cc
[5174/5184] /Users/buildslave/jenkins/workspace/lldb-cmake/host-compiler/bin/clang++  -DGTEST_HAS_RTTI=0 -DGTEST_HAS_TR1_TUPLE=0 -D_DEBUG -D__STDC_CONSTANT_MACROS -D__STDC_FORMAT_MACROS -D__STDC_LIMIT_MACROS -Iutils/unittest -I/Users/buildslave/jenkins/workspace/lldb-cmake/llvm-project/llvm/utils/unittest -Iinclude -I/Users/buildslave/jenkins/workspace/lldb-cmake/llvm-project/llvm/include -I/Users/buildslave/jenkins/workspace/lldb-cmake/llvm-project/llvm/utils/unittest/googletest/include -I/Users/buildslave/jenkins/workspace/lldb-cmake/llvm-project/llvm/utils/unittest/googlemock/include -I/Users/buildslave/jenkins/workspace/lldb-cmake/llvm-project/llvm/utils/unittest/googletest -I/Users/buildslave/jenkins/workspace/lldb-cmake/llvm-project/llvm/utils/unittest/googlemock -Wdocumentation -fPIC -fvisibility-inlines-hidden -Werror=date-time -Werror=unguarded-availability-new -fmodules -fmodules-cache-path=/Users/buildslave/jenkins/workspace/lldb-cmake/lldb-build/module.cache -fcxx-modules -Xclang -fmodules-local-submodule-visibility -Wall -Wextra -Wno-unused-parameter -Wwrite-strings -Wcast-qual -Wmissing-field-initializers -pedantic -Wno-long-long -Wimplicit-fallthrough -Wcovered-switch-default -Wno-noexcept-type -Wnon-virtual-dtor -Wdelete-non-virtual-dtor -Wsuggest-override -Wstring-conversion -fdiagnostics-color -O3  -isysroot /Applications/Xcode.app/Contents/Developer/Platforms/MacOSX.platform/Developer/SDKs/MacOSX10.15.sdk   -Wno-variadic-macros -Wno-gnu-zero-variadic-macro-arguments -Wno-covered-switch-default -Wno-suggest-override  -fno-exceptions -UNDEBUG -std=c++14 -MD -MT utils/unittest/CMakeFiles/gtest.dir/googletest/src/gtest-all.cc.o -MF utils/unittest/CMakeFiles/gtest.dir/googletest/src/gtest-all.cc.o.d -o utils/unittest/CMakeFiles/gtest.dir/googletest/src/gtest-all.cc.o -c /Users/buildslave/jenkins/workspace/lldb-cmake/llvm-project/llvm/utils/unittest/googletest/src/gtest-all.cc
[5175/5184] : && "/Applications/Xcode.app/Contents/Developer/Toolchains/XcodeDefault.xctoolchain/usr/bin/libtool" -static -no_warning_for_no_symbols -o lib/libgtest.a  utils/unittest/CMakeFiles/gtest.dir/googletest/src/gtest-all.cc.o utils/unittest/CMakeFiles/gtest.dir/googlemock/src/gmock-all.cc.o && :
[5176/5184] : && "/Applications/Xcode.app/Contents/Developer/Toolchains/XcodeDefault.xctoolchain/usr/bin/libtool" -static -no_warning_for_no_symbols -o lib/libgtest_main.a  utils/unittest/UnitTestMain/CMakeFiles/gtest_main.dir/TestMain.cpp.o && :
[5177/5184] : && "/Applications/Xcode.app/Contents/Developer/Toolchains/XcodeDefault.xctoolchain/usr/bin/libtool" -static -no_warning_for_no_symbols -o lib/libLLVMTestingSupport.a  lib/Testing/Support/CMakeFiles/LLVMTestingSupport.dir/Annotations.cpp.o lib/Testing/Support/CMakeFiles/LLVMTestingSupport.dir/Error.cpp.o lib/Testing/Support/CMakeFiles/LLVMTestingSupport.dir/SupportHelpers.cpp.o && :
[5178/5184] /Users/buildslave/jenkins/workspace/lldb-cmake/host-compiler/bin/clang++  -DGTEST_HAS_RTTI=0 -D_DEBUG -D__STDC_CONSTANT_MACROS -D__STDC_FORMAT_MACROS -D__STDC_LIMIT_MACROS -Itools/llvm-readobj -I/Users/buildslave/jenkins/workspace/lldb-cmake/llvm-project/llvm/tools/llvm-readobj -Iinclude -I/Users/buildslave/jenkins/workspace/lldb-cmake/llvm-project/llvm/include -Wdocumentation -fPIC -fvisibility-inlines-hidden -Werror=date-time -Werror=unguarded-availability-new -fmodules -fmodules-cache-path=/Users/buildslave/jenkins/workspace/lldb-cmake/lldb-build/module.cache -fcxx-modules -Xclang -fmodules-local-submodule-visibility -Wall -Wextra -Wno-unused-parameter -Wwrite-strings -Wcast-qual -Wmissing-field-initializers -pedantic -Wno-long-long -Wimplicit-fallthrough -Wcovered-switch-default -Wno-noexcept-type -Wnon-virtual-dtor -Wdelete-non-virtual-dtor -Wsuggest-override -Wstring-conversion -fdiagnostics-color -O3  -isysroot /Applications/Xcode.app/Contents/Developer/Platforms/MacOSX.platform/Developer/SDKs/MacOSX10.15.sdk    -fno-exceptions -fno-rtti -UNDEBUG -std=c++14 -MD -MT tools/llvm-readobj/CMakeFiles/llvm-readobj.dir/ELFDumper.cpp.o -MF tools/llvm-readobj/CMakeFiles/llvm-readobj.dir/ELFDumper.cpp.o.d -o tools/llvm-readobj/CMakeFiles/llvm-readobj.dir/ELFDumper.cpp.o -c /Users/buildslave/jenkins/workspace/lldb-cmake/llvm-project/llvm/tools/llvm-readobj/ELFDumper.cpp
[5179/5184] : && /Users/buildslave/jenkins/workspace/lldb-cmake/host-compiler/bin/clang++  -Wdocumentation -fPIC -fvisibility-inlines-hidden -Werror=date-time -Werror=unguarded-availability-new -fmodules -fmodules-cache-path=/Users/buildslave/jenkins/workspace/lldb-cmake/lldb-build/module.cache -fcxx-modules -Xclang -fmodules-local-submodule-visibility -Wall -Wextra -Wno-unused-parameter -Wwrite-strings -Wcast-qual -Wmissing-field-initializers -pedantic -Wno-long-long -Wimplicit-fallthrough -Wcovered-switch-default -Wno-noexcept-type -Wnon-virtual-dtor -Wdelete-non-virtual-dtor -Wsuggest-override -Wstring-conversion -fdiagnostics-color -O3  -isysroot /Applications/Xcode.app/Contents/Developer/Platforms/MacOSX.platform/Developer/SDKs/MacOSX10.15.sdk -Wl,-search_paths_first -Wl,-headerpad_max_install_names -Wl,-dead_strip tools/llvm-readobj/CMakeFiles/llvm-readobj.dir/ARMWinEHPrinter.cpp.o tools/llvm-readobj/CMakeFiles/llvm-readobj.dir/COFFDumper.cpp.o tools/llvm-readobj/CMakeFiles/llvm-readobj.dir/COFFImportDumper.cpp.o tools/llvm-readobj/CMakeFiles/llvm-readobj.dir/ELFDumper.cpp.o tools/llvm-readobj/CMakeFiles/llvm-readobj.dir/llvm-readobj.cpp.o tools/llvm-readobj/CMakeFiles/llvm-readobj.dir/MachODumper.cpp.o tools/llvm-readobj/CMakeFiles/llvm-readobj.dir/ObjDumper.cpp.o tools/llvm-readobj/CMakeFiles/llvm-readobj.dir/WasmDumper.cpp.o tools/llvm-readobj/CMakeFiles/llvm-readobj.dir/Win64EHDumper.cpp.o tools/llvm-readobj/CMakeFiles/llvm-readobj.dir/WindowsResourceDumper.cpp.o tools/llvm-readobj/CMakeFiles/llvm-readobj.dir/XCOFFDumper.cpp.o  -o bin/llvm-readobj  -Wl,-rpath,@loader_path/../lib  lib/libLLVMDebugInfoCodeView.a  lib/libLLVMDebugInfoDWARF.a  lib/libLLVMDemangle.a  lib/libLLVMObject.a  lib/libLLVMBinaryFormat.a  lib/libLLVMSupport.a  lib/libLLVMDebugInfoCodeView.a  lib/libLLVMDebugInfoMSF.a  lib/libLLVMDebugInfoPDB.a  lib/libLLVMObject.a  lib/libLLVMBitReader.a  lib/libLLVMCore.a  lib/libLLVMRemarks.a  lib/libLLVMBitstreamReader.a  lib/libLLVMMCParser.a  lib/libLLVMMC.a  lib/libLLVMDebugInfoCodeView.a  lib/libLLVMTextAPI.a  lib/libLLVMBinaryFormat.a  lib/libLLVMDebugInfoMSF.a  lib/libLLVMSupport.a  lib/libLLVMDemangle.a  -lm  /usr/lib/libz.dylib  /usr/lib/libcurses.dylib && :
[5180/5184] cd /Users/buildslave/jenkins/workspace/lldb-cmake/lldb-build/tools/llvm-readobj && /usr/local/Cellar/cmake/3.17.2/bin/cmake -E create_symlink llvm-readobj /Users/buildslave/jenkins/workspace/lldb-cmake/lldb-build/./bin/llvm-readelf
[5181/5184] /Users/buildslave/jenkins/workspace/lldb-cmake/host-compiler/bin/clang++  -DGTEST_HAS_RTTI=0 -DLLVM_ENABLE_PLUGINS -D_DEBUG -D__STDC_CONSTANT_MACROS -D__STDC_FORMAT_MACROS -D__STDC_LIMIT_MACROS -Iunittests/Passes -I/Users/buildslave/jenkins/workspace/lldb-cmake/llvm-project/llvm/unittests/Passes -Iinclude -I/Users/buildslave/jenkins/workspace/lldb-cmake/llvm-project/llvm/include -Wdocumentation -fPIC -fvisibility-inlines-hidden -Werror=date-time -Werror=unguarded-availability-new -fmodules -fmodules-cache-path=/Users/buildslave/jenkins/workspace/lldb-cmake/lldb-build/module.cache -fcxx-modules -Xclang -fmodules-local-submodule-visibility -Wall -Wextra -Wno-unused-parameter -Wwrite-strings -Wcast-qual -Wmissing-field-initializers -pedantic -Wno-long-long -Wimplicit-fallthrough -Wcovered-switch-default -Wno-noexcept-type -Wnon-virtual-dtor -Wdelete-non-virtual-dtor -Wsuggest-override -Wstring-conversion -fdiagnostics-color -O3  -isysroot /Applications/Xcode.app/Contents/Developer/Platforms/MacOSX.platform/Developer/SDKs/MacOSX10.15.sdk -fPIC    -fno-exceptions -fno-rtti -UNDEBUG -std=c++14 -MD -MT unittests/Passes/CMakeFiles/TestPlugin.dir/TestPlugin.cpp.o -MF unittests/Passes/CMakeFiles/TestPlugin.dir/TestPlugin.cpp.o.d -o unittests/Passes/CMakeFiles/TestPlugin.dir/TestPlugin.cpp.o -c /Users/buildslave/jenkins/workspace/lldb-cmake/llvm-project/llvm/unittests/Passes/TestPlugin.cpp
While building module 'LLVM_Analysis' imported from /Users/buildslave/jenkins/workspace/lldb-cmake/llvm-project/llvm/include/llvm/Passes/PassBuilder.h:19:
In file included from <module-includes>:38:
/Users/buildslave/jenkins/workspace/lldb-cmake/llvm-project/llvm/include/llvm/Analysis/IRSimilarityIdentifier.h:146:19: warning: parameter 'Value' not found in the function declaration [-Wdocumentation]
  /// \param [in] Value - The IRInstructionData instance to be hashed.
                  ^~~~~
/Users/buildslave/jenkins/workspace/lldb-cmake/llvm-project/llvm/include/llvm/Analysis/IRSimilarityIdentifier.h:146:19: note: did you mean 'ID'?
  /// \param [in] Value - The IRInstructionData instance to be hashed.
                  ^~~~~
                  ID
/Users/buildslave/jenkins/workspace/lldb-cmake/llvm-project/llvm/include/llvm/Analysis/IRSimilarityIdentifier.h:290:23: warning: parameter 'InstrList' not found in the function declaration [-Wdocumentation]
  /// \param [in,out] InstrList - Vector of InstructionData to append
                      ^~~~~~~~~
/Users/buildslave/jenkins/workspace/lldb-cmake/llvm-project/llvm/include/llvm/Analysis/IRSimilarityIdentifier.h:290:23: note: did you mean 'InstrListForBB'?
  /// \param [in,out] InstrList - Vector of InstructionData to append
                      ^~~~~~~~~
                      InstrListForBB
/Users/buildslave/jenkins/workspace/lldb-cmake/llvm-project/llvm/include/llvm/Analysis/IRSimilarityIdentifier.h:301:23: warning: parameter 'InstrList' not found in the function declaration [-Wdocumentation]
  /// \param [in,out] InstrList - Vector of IRInstructionData to append to.
                      ^~~~~~~~~
/Users/buildslave/jenkins/workspace/lldb-cmake/llvm-project/llvm/include/llvm/Analysis/IRSimilarityIdentifier.h:301:23: note: did you mean 'InstrListForBB'?
  /// \param [in,out] InstrList - Vector of IRInstructionData to append to.
                      ^~~~~~~~~
                      InstrListForBB
3 warnings generated.
[5182/5184] : && /Users/buildslave/jenkins/workspace/lldb-cmake/host-compiler/bin/clang++ -Wdocumentation -fPIC -fvisibility-inlines-hidden -Werror=date-time -Werror=unguarded-availability-new -fmodules -fmodules-cache-path=/Users/buildslave/jenkins/workspace/lldb-cmake/lldb-build/module.cache -fcxx-modules -Xclang -fmodules-local-submodule-visibility -Wall -Wextra -Wno-unused-parameter -Wwrite-strings -Wcast-qual -Wmissing-field-initializers -pedantic -Wno-long-long -Wimplicit-fallthrough -Wcovered-switch-default -Wno-noexcept-type -Wnon-virtual-dtor -Wdelete-non-virtual-dtor -Wsuggest-override -Wstring-conversion -fdiagnostics-color -O3 -isysroot /Applications/Xcode.app/Contents/Developer/Platforms/MacOSX.platform/Developer/SDKs/MacOSX10.15.sdk -bundle -Wl,-headerpad_max_install_names -Wl,-flat_namespace -Wl,-undefined -Wl,suppress   -Wl,-dead_strip -o unittests/Passes/TestPlugin.dylib unittests/Passes/CMakeFiles/TestPlugin.dir/TestPlugin.cpp.o  -Wl,-rpath,@loader_path/../lib && :
[5183/5184] /Users/buildslave/jenkins/workspace/lldb-cmake/host-compiler/bin/clang++  -DGTEST_HAS_RTTI=0 -D_DEBUG -D__STDC_CONSTANT_MACROS -D__STDC_FORMAT_MACROS -D__STDC_LIMIT_MACROS -Itools/obj2yaml -I/Users/buildslave/jenkins/workspace/lldb-cmake/llvm-project/llvm/tools/obj2yaml -Iinclude -I/Users/buildslave/jenkins/workspace/lldb-cmake/llvm-project/llvm/include -Wdocumentation -fPIC -fvisibility-inlines-hidden -Werror=date-time -Werror=unguarded-availability-new -fmodules -fmodules-cache-path=/Users/buildslave/jenkins/workspace/lldb-cmake/lldb-build/module.cache -fcxx-modules -Xclang -fmodules-local-submodule-visibility -Wall -Wextra -Wno-unused-parameter -Wwrite-strings -Wcast-qual -Wmissing-field-initializers -pedantic -Wno-long-long -Wimplicit-fallthrough -Wcovered-switch-default -Wno-noexcept-type -Wnon-virtual-dtor -Wdelete-non-virtual-dtor -Wsuggest-override -Wstring-conversion -fdiagnostics-color -O3  -isysroot /Applications/Xcode.app/Contents/Developer/Platforms/MacOSX.platform/Developer/SDKs/MacOSX10.15.sdk    -fno-exceptions -fno-rtti -UNDEBUG -std=c++14 -MD -MT tools/obj2yaml/CMakeFiles/obj2yaml.dir/elf2yaml.cpp.o -MF tools/obj2yaml/CMakeFiles/obj2yaml.dir/elf2yaml.cpp.o.d -o tools/obj2yaml/CMakeFiles/obj2yaml.dir/elf2yaml.cpp.o -c /Users/buildslave/jenkins/workspace/lldb-cmake/llvm-project/llvm/tools/obj2yaml/elf2yaml.cpp
[5184/5184] : && /Users/buildslave/jenkins/workspace/lldb-cmake/host-compiler/bin/clang++  -Wdocumentation -fPIC -fvisibility-inlines-hidden -Werror=date-time -Werror=unguarded-availability-new -fmodules -fmodules-cache-path=/Users/buildslave/jenkins/workspace/lldb-cmake/lldb-build/module.cache -fcxx-modules -Xclang -fmodules-local-submodule-visibility -Wall -Wextra -Wno-unused-parameter -Wwrite-strings -Wcast-qual -Wmissing-field-initializers -pedantic -Wno-long-long -Wimplicit-fallthrough -Wcovered-switch-default -Wno-noexcept-type -Wnon-virtual-dtor -Wdelete-non-virtual-dtor -Wsuggest-override -Wstring-conversion -fdiagnostics-color -O3  -isysroot /Applications/Xcode.app/Contents/Developer/Platforms/MacOSX.platform/Developer/SDKs/MacOSX10.15.sdk -Wl,-search_paths_first -Wl,-headerpad_max_install_names -Wl,-dead_strip tools/obj2yaml/CMakeFiles/obj2yaml.dir/obj2yaml.cpp.o tools/obj2yaml/CMakeFiles/obj2yaml.dir/coff2yaml.cpp.o tools/obj2yaml/CMakeFiles/obj2yaml.dir/dwarf2yaml.cpp.o tools/obj2yaml/CMakeFiles/obj2yaml.dir/elf2yaml.cpp.o tools/obj2yaml/CMakeFiles/obj2yaml.dir/macho2yaml.cpp.o tools/obj2yaml/CMakeFiles/obj2yaml.dir/minidump2yaml.cpp.o tools/obj2yaml/CMakeFiles/obj2yaml.dir/xcoff2yaml.cpp.o tools/obj2yaml/CMakeFiles/obj2yaml.dir/wasm2yaml.cpp.o  -o bin/obj2yaml  -Wl,-rpath,@loader_path/../lib  lib/libLLVMBinaryFormat.a  lib/libLLVMDebugInfoCodeView.a  lib/libLLVMDebugInfoDWARF.a  lib/libLLVMObject.a  lib/libLLVMObjectYAML.a  lib/libLLVMSupport.a  lib/libLLVMObject.a  lib/libLLVMBitReader.a  lib/libLLVMCore.a  lib/libLLVMRemarks.a  lib/libLLVMBitstreamReader.a  lib/libLLVMMCParser.a  lib/libLLVMTextAPI.a  lib/libLLVMMC.a  lib/libLLVMBinaryFormat.a  lib/libLLVMDebugInfoCodeView.a  lib/libLLVMDebugInfoMSF.a  lib/libLLVMSupport.a  -lm  /usr/lib/libz.dylib  /usr/lib/libcurses.dylib  lib/libLLVMDemangle.a && :
Completed at: 2020-09-18T14:51:58
@@@@@@
[Pipeline] }
[Pipeline] // timeout
[Pipeline] }
[Pipeline] // stage
[Pipeline] stage
[Pipeline] { (Test)
[Pipeline] timeout
Timeout set to expire in 1 hr 30 min
[Pipeline] {
[Pipeline] sh
+ set -u
+ export PATH=/usr/local/bin:/usr/local/sbin:/usr/bin:/bin:/usr/sbin:/sbin:/usr/bin:/usr/local/bin
+ PATH=/usr/local/bin:/usr/local/sbin:/usr/bin:/bin:/usr/sbin:/sbin:/usr/bin:/usr/local/bin
+ export LLDB_CAPTURE_REPRODUCER=1
+ LLDB_CAPTURE_REPRODUCER=1
+ rm -rf test/results.xml
++ sysctl hw.physicalcpu
++ awk '{print $2}'
+ export MAX_PARALLEL_TESTS=4
+ MAX_PARALLEL_TESTS=4
+ python llvm-zorg/zorg/jenkins/monorepo_build.py lldb-cmake testlong
You are using pip version 18.1, however version 20.2.3 is available.
You should consider upgrading via the 'pip install --upgrade pip' command.
You are using pip version 18.1, however version 20.2.3 is available.
You should consider upgrading via the 'pip install --upgrade pip' command.
Dependency met os_version v10.15.5
Dependency met brew cmake v3.17.2
Dependency met brew ninja v1.8.2
Dependency met pip psutil v5.4.5
Dependency met pip six v1.11.0
Dependency met xcode v11.5
Clean

Hide Details

@@@ Clean @@@ Removing module cache: /Users/buildslave/jenkins/workspace/lldb-cmake/lldb-build/module.cache Completed at: 2020-09-18T14:53:23 @@@@@@
Run Debug Info Tests

Hide Details

@@@ Run Debug Info Tests @@@ cd /Users/buildslave/jenkins/workspace/lldb-cmake/lldb-build '/usr/local/bin/ninja' '-v' 'check-debuginfo' [1/3] cd /Users/buildslave/jenkins/workspace/lldb-cmake/lldb-build/tools/lldb && /usr/local/Cellar/cmake/3.17.2/bin/cmake -E make_directory /Users/buildslave/jenkins/workspace/lldb-cmake/lldb-build/./lib/python3.7/site-packages/lldb [2/3] cd /Users/buildslave/jenkins/workspace/lldb-cmake/lldb-build/tools/lldb && /usr/local/Cellar/cmake/3.17.2/bin/cmake -E copy /Users/buildslave/jenkins/workspace/lldb-cmake/llvm-project/lldb/third_party/Python/module/six/six.py /Users/buildslave/jenkins/workspace/lldb-cmake/lldb-build/./lib/python3.7/site-packages/lldb/../six.py && cd /Users/buildslave/jenkins/workspace/lldb-cmake/lldb-build/tools/lldb && /usr/local/Cellar/cmake/3.17.2/bin/cmake -E copy /Users/buildslave/jenkins/workspace/lldb-cmake/lldb-build/tools/lldb/bindings/python/lldb.py /Users/buildslave/jenkins/workspace/lldb-cmake/lldb-build/./lib/python3.7/site-packages/lldb/__init__.py && cd /Users/buildslave/jenkins/workspace/lldb-cmake/lldb-build/tools/lldb && /usr/local/Cellar/cmake/3.17.2/bin/cmake -E copy /Users/buildslave/jenkins/workspace/lldb-cmake/llvm-project/lldb/source/Interpreter/embedded_interpreter.py /Users/buildslave/jenkins/workspace/lldb-cmake/lldb-build/./lib/python3.7/site-packages/lldb && cd /Users/buildslave/jenkins/workspace/lldb-cmake/lldb-build/lib/python3.7/site-packages/lldb && /usr/local/Cellar/cmake/3.17.2/bin/cmake -E make_directory formatters/cpp && /usr/local/Cellar/cmake/3.17.2/bin/cmake -E copy /Users/buildslave/jenkins/workspace/lldb-cmake/llvm-project/lldb/examples/synthetic/gnu_libstdcpp.py /Users/buildslave/jenkins/workspace/lldb-cmake/llvm-project/lldb/examples/synthetic/libcxx.py formatters/cpp && /usr/local/Frameworks/Python.framework/Versions/3.7/bin/python3.7 /Users/buildslave/jenkins/workspace/lldb-cmake/llvm-project/lldb/bindings/python/createPythonInit.py formatters/cpp /Users/buildslave/jenkins/workspace/lldb-cmake/llvm-project/lldb/examples/synthetic/gnu_libstdcpp.py /Users/buildslave/jenkins/workspace/lldb-cmake/llvm-project/lldb/examples/synthetic/libcxx.py && cd /Users/buildslave/jenkins/workspace/lldb-cmake/lldb-build/lib/python3.7/site-packages/lldb && /usr/local/Cellar/cmake/3.17.2/bin/cmake -E make_directory formatters && /usr/local/Cellar/cmake/3.17.2/bin/cmake -E copy /Users/buildslave/jenkins/workspace/lldb-cmake/llvm-project/lldb/examples/summaries/cocoa/cache.py /Users/buildslave/jenkins/workspace/lldb-cmake/llvm-project/lldb/examples/summaries/synth.py /Users/buildslave/jenkins/workspace/lldb-cmake/llvm-project/lldb/examples/summaries/cocoa/metrics.py /Users/buildslave/jenkins/workspace/lldb-cmake/llvm-project/lldb/examples/summaries/cocoa/attrib_fromdict.py /Users/buildslave/jenkins/workspace/lldb-cmake/llvm-project/lldb/examples/summaries/cocoa/Logger.py formatters && /usr/local/Frameworks/Python.framework/Versions/3.7/bin/python3.7 /Users/buildslave/jenkins/workspace/lldb-cmake/llvm-project/lldb/bindings/python/createPythonInit.py formatters /Users/buildslave/jenkins/workspace/lldb-cmake/llvm-project/lldb/examples/summaries/cocoa/cache.py /Users/buildslave/jenkins/workspace/lldb-cmake/llvm-project/lldb/examples/summaries/synth.py /Users/buildslave/jenkins/workspace/lldb-cmake/llvm-project/lldb/examples/summaries/cocoa/metrics.py /Users/buildslave/jenkins/workspace/lldb-cmake/llvm-project/lldb/examples/summaries/cocoa/attrib_fromdict.py /Users/buildslave/jenkins/workspace/lldb-cmake/llvm-project/lldb/examples/summaries/cocoa/Logger.py && cd /Users/buildslave/jenkins/workspace/lldb-cmake/lldb-build/lib/python3.7/site-packages/lldb && /usr/local/Cellar/cmake/3.17.2/bin/cmake -E make_directory utils && /usr/local/Cellar/cmake/3.17.2/bin/cmake -E copy /Users/buildslave/jenkins/workspace/lldb-cmake/llvm-project/lldb/examples/python/in_call_stack.py /Users/buildslave/jenkins/workspace/lldb-cmake/llvm-project/lldb/examples/python/symbolication.py utils && /usr/local/Frameworks/Python.framework/Versions/3.7/bin/python3.7 /Users/buildslave/jenkins/workspace/lldb-cmake/llvm-project/lldb/bindings/python/createPythonInit.py utils /Users/buildslave/jenkins/workspace/lldb-cmake/llvm-project/lldb/examples/python/in_call_stack.py /Users/buildslave/jenkins/workspace/lldb-cmake/llvm-project/lldb/examples/python/symbolication.py && cd /Users/buildslave/jenkins/workspace/lldb-cmake/lldb-build/lib/python3.7/site-packages/lldb && /usr/local/Cellar/cmake/3.17.2/bin/cmake -E make_directory macosx && /usr/local/Cellar/cmake/3.17.2/bin/cmake -E copy /Users/buildslave/jenkins/workspace/lldb-cmake/llvm-project/lldb/examples/python/crashlog.py /Users/buildslave/jenkins/workspace/lldb-cmake/llvm-project/lldb/examples/darwin/heap_find/heap.py macosx && /usr/local/Frameworks/Python.framework/Versions/3.7/bin/python3.7 /Users/buildslave/jenkins/workspace/lldb-cmake/llvm-project/lldb/bindings/python/createPythonInit.py macosx /Users/buildslave/jenkins/workspace/lldb-cmake/llvm-project/lldb/examples/python/crashlog.py /Users/buildslave/jenkins/workspace/lldb-cmake/llvm-project/lldb/examples/darwin/heap_find/heap.py && cd /Users/buildslave/jenkins/workspace/lldb-cmake/lldb-build/lib/python3.7/site-packages/lldb && /usr/local/Cellar/cmake/3.17.2/bin/cmake -E make_directory macosx/heap && /usr/local/Cellar/cmake/3.17.2/bin/cmake -E copy /Users/buildslave/jenkins/workspace/lldb-cmake/llvm-project/lldb/examples/darwin/heap_find/heap/heap_find.cpp /Users/buildslave/jenkins/workspace/lldb-cmake/llvm-project/lldb/examples/darwin/heap_find/heap/Makefile macosx/heap && cd /Users/buildslave/jenkins/workspace/lldb-cmake/lldb-build/lib/python3.7/site-packages/lldb && /usr/local/Cellar/cmake/3.17.2/bin/cmake -E make_directory diagnose && /usr/local/Cellar/cmake/3.17.2/bin/cmake -E copy /Users/buildslave/jenkins/workspace/lldb-cmake/llvm-project/lldb/examples/python/diagnose_unwind.py /Users/buildslave/jenkins/workspace/lldb-cmake/llvm-project/lldb/examples/python/diagnose_nsstring.py diagnose && /usr/local/Frameworks/Python.framework/Versions/3.7/bin/python3.7 /Users/buildslave/jenkins/workspace/lldb-cmake/llvm-project/lldb/bindings/python/createPythonInit.py diagnose /Users/buildslave/jenkins/workspace/lldb-cmake/llvm-project/lldb/examples/python/diagnose_unwind.py /Users/buildslave/jenkins/workspace/lldb-cmake/llvm-project/lldb/examples/python/diagnose_nsstring.py && cd /Users/buildslave/jenkins/workspace/lldb-cmake/lldb-build/lib/python3.7/site-packages/lldb && /usr/local/Cellar/cmake/3.17.2/bin/cmake -E create_symlink ../../../liblldb.dylib _lldb.so && cd /Users/buildslave/jenkins/workspace/lldb-cmake/lldb-build/lib/python3.7/site-packages/lldb && /usr/local/Cellar/cmake/3.17.2/bin/cmake -E create_symlink ../../../../bin/lldb-argdumper lldb-argdumper [2/3] cd /Users/buildslave/jenkins/workspace/lldb-cmake/lldb-build/projects/debuginfo-tests && /usr/local/Frameworks/Python.framework/Versions/3.7/bin/python3.7 /Users/buildslave/jenkins/workspace/lldb-cmake/lldb-build/./bin/llvm-lit -v --time-tests --shuffle --xunit-xml-output=/Users/buildslave/jenkins/workspace/lldb-cmake/test/results.xml -v -j 4 /Users/buildslave/jenkins/workspace/lldb-cmake/lldb-build/projects/debuginfo-tests -- Testing: 60 tests, 4 workers -- llvm-lit: /Users/buildslave/jenkins/workspace/lldb-cmake/lldb-build/bin/../../llvm-project/llvm/utils/lit/lit/llvm/config.py:347: note: using clang: /Users/buildslave/jenkins/workspace/lldb-cmake/lldb-build/bin/clang llvm-lit: /Users/buildslave/jenkins/workspace/lldb-cmake/lldb-build/bin/../../llvm-project/llvm/utils/lit/lit/llvm/config.py:347: note: using clang++: /Users/buildslave/jenkins/workspace/lldb-cmake/lldb-build/bin/clang++ llvm-lit: /Users/buildslave/jenkins/workspace/lldb-cmake/lldb-build/bin/../../llvm-project/llvm/utils/lit/lit/llvm/config.py:347: note: using clang-cl: /Users/buildslave/jenkins/workspace/lldb-cmake/lldb-build/bin/clang-cl llvm-lit: /Users/buildslave/jenkins/workspace/lldb-cmake/lldb-build/bin/../../llvm-project/llvm/utils/lit/lit/llvm/config.py:347: note: using lldb: /Users/buildslave/jenkins/workspace/lldb-cmake/lldb-build/bin/lldb llvm-lit: /Users/buildslave/jenkins/workspace/lldb-cmake/lldb-build/bin/../../llvm-project/llvm/utils/lit/lit/util.py:408: note: using SDKROOT: '/Applications/Xcode.app/Contents/Developer/Platforms/MacOSX.platform/Developer/SDKs/MacOSX10.15.sdk' UNSUPPORTED: debuginfo-tests :: dexter-tests/nrvo.cpp (1 of 60) UNSUPPORTED: debuginfo-tests :: dexter/feature_tests/commands/perfect/limit_steps/limit_steps_expect_value.cpp (2 of 60) UNSUPPORTED: debuginfo-tests :: llgdb-tests/safestack.c (3 of 60) PASS: debuginfo-tests :: llgdb-tests/nested-struct.cpp (4 of 60) UNSUPPORTED: debuginfo-tests :: llvm-prettyprinters/gdb/llvm-support.gdb (5 of 60) UNSUPPORTED: debuginfo-tests :: dexter/feature_tests/commands/penalty/expect_watch_type.cpp (6 of 60) UNSUPPORTED: debuginfo-tests :: dexter/feature_tests/commands/penalty/unreachable.cpp (7 of 60) UNSUPPORTED: debuginfo-tests :: dexter/feature_tests/commands/perfect/limit_steps/limit_steps_overlapping_ranges.cpp (8 of 60) UNSUPPORTED: debuginfo-tests :: dexter/feature_tests/commands/perfect/expect_watch_value.cpp (9 of 60) PASS: debuginfo-tests :: dexter-tests/ctor.cpp (10 of 60) UNSUPPORTED: debuginfo-tests :: dexter/feature_tests/commands/perfect/expect_program_state.cpp (11 of 60) PASS: debuginfo-tests :: llgdb-tests/asan.c (12 of 60) PASS: debuginfo-tests :: llgdb-tests/asan-deque.cpp (13 of 60) UNSUPPORTED: debuginfo-tests :: dexter/feature_tests/commands/penalty/expect_program_state.cpp (14 of 60) UNSUPPORTED: debuginfo-tests :: dexter/feature_tests/commands/perfect/expect_step_kind/func.cpp (15 of 60) UNSUPPORTED: debuginfo-tests :: dexter/feature_tests/commands/perfect/expect_watch_type.cpp (16 of 60) PASS: debuginfo-tests :: dexter-tests/dbg-arg.c (17 of 60) UNSUPPORTED: debuginfo-tests :: dexter/feature_tests/commands/perfect/expect_step_kind/small_loop.cpp (18 of 60) UNSUPPORTED: debuginfo-tests :: dexter-tests/global-constant.cpp (19 of 60) UNSUPPORTED: debuginfo-tests :: dexter/feature_tests/subtools/clang-opt-bisect/clang-opt-bisect.cpp (20 of 60) UNSUPPORTED: debuginfo-tests :: dexter/feature_tests/commands/penalty/expect_step_order.cpp (21 of 60) UNSUPPORTED: debuginfo-tests :: dexter-tests/inline-line-gap.cpp (22 of 60) UNSUPPORTED: debuginfo-tests :: dexter/feature_tests/commands/perfect/expect_step_kind/func_external.cpp (23 of 60) PASS: debuginfo-tests :: dexter/feature_tests/subtools/test/err_syntax.cpp (24 of 60) PASS: debuginfo-tests :: llgdb-tests/block_var.m (25 of 60) UNSUPPORTED: debuginfo-tests :: dexter/feature_tests/commands/perfect/limit_steps/limit_steps_check_json_step_count.cpp (26 of 60) FAIL: debuginfo-tests :: dexter-tests/vla.c (27 of 60) ******************** TEST 'debuginfo-tests :: dexter-tests/vla.c' FAILED ******************** Script: -- : 'RUN: at line 5'; "/usr/local/Frameworks/Python.framework/Versions/3.7/bin/python3.7" "/Users/buildslave/jenkins/workspace/lldb-cmake/llvm-project/debuginfo-tests/dexter/dexter.py" test --lldb-executable "/Users/buildslave/jenkins/workspace/lldb-cmake/lldb-build/bin/lldb" --fail-lt 1.0 -w --builder clang-c --debugger 'lldb' --cflags "-O0 -glldb" -- /Users/buildslave/jenkins/workspace/lldb-cmake/llvm-project/debuginfo-tests/dexter-tests/vla.c -- Exit Code: 2

Hide Details

Command Output (stdout): -- vla.c: (0.4286)

Hide Details

Hide Details

--

Hide Details

******************** PASS: debuginfo-tests :: dexter/feature_tests/subtools/test/err_type_mline.cpp (28 of 60) PASS: debuginfo-tests :: dexter-tests/nrvo-string.cpp (29 of 60) UNSUPPORTED: debuginfo-tests :: dexter-tests/realigned-frame.cpp (30 of 60) UNSUPPORTED: debuginfo-tests :: dexter/feature_tests/commands/perfect/expect_step_order.cpp (31 of 60) UNSUPPORTED: debuginfo-tests :: dexter/feature_tests/commands/perfect/limit_steps/limit_steps_expect_loop.cpp (32 of 60) PASS: debuginfo-tests :: llgdb-tests/static-member.cpp (33 of 60) PASS: debuginfo-tests :: dexter/feature_tests/subtools/test/err_paren.cpp (34 of 60) XFAIL: debuginfo-tests :: llgdb-tests/static-member-2.cpp (35 of 60) PASS: debuginfo-tests :: dexter/feature_tests/subtools/test/err_paren_mline.cpp (36 of 60) UNSUPPORTED: debuginfo-tests :: dexter/feature_tests/commands/perfect/expect_step_kind/recursive.cpp (37 of 60) XFAIL: debuginfo-tests :: dexter-tests/asan-deque.cpp (38 of 60) PASS: debuginfo-tests :: dexter/feature_tests/subtools/help/help.test (39 of 60) UNSUPPORTED: debuginfo-tests :: dexter/feature_tests/commands/penalty/expect_watch_value.cpp (40 of 60) PASS: debuginfo-tests :: llgdb-tests/blocks.m (41 of 60) PASS: debuginfo-tests :: dexter-tests/asan.c (42 of 60) PASS: debuginfo-tests :: llgdb-tests/asan-blocks.c (43 of 60) UNSUPPORTED: debuginfo-tests :: dexter/feature_tests/commands/perfect/unreachable.cpp (44 of 60) UNSUPPORTED: debuginfo-tests :: dexter/feature_tests/commands/penalty/expect_step_kinds.cpp (45 of 60) PASS: debuginfo-tests :: llgdb-tests/apple-accel.cpp (46 of 60) PASS: debuginfo-tests :: dexter/feature_tests/subtools/test/err_syntax_mline.cpp (47 of 60) PASS: debuginfo-tests :: llgdb-tests/nrvo-string.cpp (48 of 60) UNSUPPORTED: debuginfo-tests :: dexter/feature_tests/commands/perfect/expect_step_kind/direction.cpp (49 of 60) PASS: debuginfo-tests :: dexter/feature_tests/subtools/view.cpp (50 of 60) UNSUPPORTED: debuginfo-tests :: dexter-tests/hello.c (51 of 60) PASS: debuginfo-tests :: dexter/feature_tests/unittests/run.test (52 of 60) UNSUPPORTED: debuginfo-tests :: dexter/feature_tests/commands/perfect/limit_steps/limit_steps_same_line_conditional.cpp (53 of 60) PASS: debuginfo-tests :: dexter/feature_tests/subtools/test/err_type.cpp (54 of 60) PASS: debuginfo-tests :: llgdb-tests/foreach.m (55 of 60) PASS: debuginfo-tests :: dexter/feature_tests/subtools/list-debuggers/list-debuggers.test (56 of 60) PASS: debuginfo-tests :: dexter-tests/stack-var.c (57 of 60) PASS: debuginfo-tests :: llgdb-tests/forward-declare-class.cpp (58 of 60) PASS: debuginfo-tests :: dexter/feature_tests/subtools/test/source-root-dir.cpp (59 of 60) PASS: debuginfo-tests :: dexter-tests/aggregate-indirect-arg.cpp (60 of 60) Slowest Tests: -------------------------------------------------------------------------- 21.13s: debuginfo-tests :: llgdb-tests/block_var.m 19.60s: debuginfo-tests :: llgdb-tests/asan-deque.cpp 19.55s: debuginfo-tests :: llgdb-tests/asan.c 10.40s: debuginfo-tests :: llgdb-tests/nested-struct.cpp 8.43s: debuginfo-tests :: llgdb-tests/blocks.m 7.63s: debuginfo-tests :: dexter-tests/ctor.cpp 6.47s: debuginfo-tests :: dexter-tests/asan-deque.cpp 4.21s: debuginfo-tests :: dexter-tests/nrvo-string.cpp 3.21s: debuginfo-tests :: llgdb-tests/foreach.m 2.97s: debuginfo-tests :: llgdb-tests/nrvo-string.cpp 2.88s: debuginfo-tests :: dexter-tests/vla.c 2.50s: debuginfo-tests :: dexter-tests/dbg-arg.c 2.15s: debuginfo-tests :: dexter-tests/asan.c 2.08s: debuginfo-tests :: dexter-tests/aggregate-indirect-arg.cpp 1.98s: debuginfo-tests :: llgdb-tests/static-member.cpp 1.81s: debuginfo-tests :: dexter/feature_tests/subtools/view.cpp 1.74s: debuginfo-tests :: llgdb-tests/asan-blocks.c 1.67s: debuginfo-tests :: dexter-tests/stack-var.c 1.56s: debuginfo-tests :: dexter/feature_tests/subtools/test/source-root-dir.cpp 1.13s: debuginfo-tests :: dexter/feature_tests/subtools/test/err_syntax.cpp

Hide Details

Tests Times: -------------------------------------------------------------------------- [ Range ] :: [ Percentage ] :: [Count] -------------------------------------------------------------------------- [20.0s,22.0s) :: [** ] :: [ 3/60] [18.0s,20.0s) :: [ ] :: [ 0/60] [16.0s,18.0s) :: [ ] :: [ 0/60] [14.0s,16.0s) :: [ ] :: [ 0/60] [12.0s,14.0s) :: [ ] :: [ 0/60] [10.0s,12.0s) :: [ ] :: [ 1/60] [ 8.0s,10.0s) :: [ ] :: [ 1/60] [ 6.0s, 8.0s) :: [* ] :: [ 2/60] [ 4.0s, 6.0s) :: [ ] :: [ 1/60] [ 2.0s, 4.0s) :: [**** ] :: [ 7/60] [ 0.0s, 2.0s) :: [****************************** ] :: [45/60] -------------------------------------------------------------------------- ******************** Failed Tests (1): debuginfo-tests :: dexter-tests/vla.c

Hide Details

Hide Details

Testing Time: 33.69s Unsupported : 29 Passed : 28 Expectedly Failed: 2 Failed : 1 FAILED: projects/debuginfo-tests/CMakeFiles/check-debuginfo cd /Users/buildslave/jenkins/workspace/lldb-cmake/lldb-build/projects/debuginfo-tests && /usr/local/Frameworks/Python.framework/Versions/3.7/bin/python3.7 /Users/buildslave/jenkins/workspace/lldb-cmake/lldb-build/./bin/llvm-lit -v --time-tests --shuffle --xunit-xml-output=/Users/buildslave/jenkins/workspace/lldb-cmake/test/results.xml -v -j 4 /Users/buildslave/jenkins/workspace/lldb-cmake/lldb-build/projects/debuginfo-tests ninja: build stopped: subcommand failed. Command failed: Command '['/usr/local/bin/ninja', '-v', 'check-debuginfo']' returned non-zero exit status 1 Command: ['/usr/local/bin/ninja', '-v', 'check-debuginfo'] [Pipeline] } [Pipeline] // timeout [Pipeline] } [Pipeline] // stage [Pipeline] stage [Pipeline] { (Declarative: Post Actions) [Pipeline] scanForIssues [Clang (LLVM based)] Sleeping for 5 seconds due to JENKINS-32191... [Clang (LLVM based)] Parsing console log (workspace: '/Users/buildslave/jenkins/workspace/lldb-cmake') [Clang (LLVM based)] Successfully parsed console log [Clang (LLVM based)] -> found 10 issues (skipped 21 duplicates) [Clang (LLVM based)] Post processing issues on 'green-dragon-10' with source code encoding 'UTF-8' [Clang (LLVM based)] Creating SCM blamer to obtain author and commit information for affected files [Clang (LLVM based)] Creating SCM miner to obtain statistics for affected repository files [Clang (LLVM based)] Resolving file names for all issues in source directory '/Users/buildslave/jenkins/workspace/lldb-cmake' [Clang (LLVM based)] -> resolved paths in source directory (6 found, 0 not found) [Clang (LLVM based)] Resolving module names from module definitions (build.xml, pom.xml, or Manifest.mf files) [Clang (LLVM based)] -> resolved module names for 10 issues [Clang (LLVM based)] Resolving package names (or namespaces) by parsing the affected files [Clang (LLVM based)] -> resolved package names of 6 affected files [Clang (LLVM based)] No filter has been set, publishing all 10 issues [Clang (LLVM based)] Creating fingerprints for all affected code blocks to track issues over different builds [Clang (LLVM based)] -> created fingerprints for 10 issues (skipped 0 issues) [Clang (LLVM based)] Copying affected files to Jenkins' build folder '/Users/Shared/Jenkins/Home/jobs/lldb-cmake/builds/23881/files-with-issues' [Clang (LLVM based)] -> 4 copied, 2 not in workspace, 0 not-found, 0 with I/O error [Pipeline] junit Recording test results [Pipeline] emailext Warning: jyknight@google.com is not a recognized user, but sending mail anyway Warning: echristo@gmail.com is not a recognized user, but sending mail anyway Warning: zequanwu@google.com is not a recognized user, but sending mail anyway Warning: llvm-dev@redking.me.uk is not a recognized user, but sending mail anyway Warning: stellaraccident@gmail.com is not a recognized user, but sending mail anyway Warning: huihuiz@quicinc.com is not a recognized user, but sending mail anyway Warning: aeubanks@google.com is not a recognized user, but sending mail anyway Warning: dblaikie@gmail.com is not a recognized user, but sending mail anyway Warning: raul.tambre@cleveron.com is not a recognized user, but sending mail anyway Warning: thakis@chromium.org is not a recognized user, but sending mail anyway Warning: Matthew.Arsenault@amd.com is not a recognized user, but sending mail anyway Warning: kparzysz@codeaurora.org is not a recognized user, but sending mail anyway Warning: peter@pcc.me.uk is not a recognized user, but sending mail anyway Warning: vmiklos@vmiklos.hu is not a recognized user, but sending mail anyway Warning: jyknight@google.com is not a recognized user, but sending mail anyway Warning: echristo@gmail.com is not a recognized user, but sending mail anyway Warning: zequanwu@google.com is not a recognized user, but sending mail anyway Warning: llvm-dev@redking.me.uk is not a recognized user, but sending mail anyway Warning: stellaraccident@gmail.com is not a recognized user, but sending mail anyway Warning: huihuiz@quicinc.com is not a recognized user, but sending mail anyway Warning: aeubanks@google.com is not a recognized user, but sending mail anyway Warning: dblaikie@gmail.com is not a recognized user, but sending mail anyway Warning: raul.tambre@cleveron.com is not a recognized user, but sending mail anyway Warning: thakis@chromium.org is not a recognized user, but sending mail anyway Warning: Matthew.Arsenault@amd.com is not a recognized user, but sending mail anyway Warning: kparzysz@codeaurora.org is not a recognized user, but sending mail anyway Warning: peter@pcc.me.uk is not a recognized user, but sending mail anyway Warning: vmiklos@vmiklos.hu is not a recognized user, but sending mail anyway

Hide Details

Begin Pre-Send Script... Sending email to: Florian Hahn <florian_hahn@apple.com> Florian Hahn <florian_hahn@apple.com> Azhar Mohammed <azhar@apple.com>
[Pipeline] } [Pipeline] // stage [Pipeline] } [Pipeline] // withEnv [Pipeline] } [Pipeline] // node [Pipeline] End of Pipeline ERROR: script returned exit code 1 Finished: FAILURE