FailedConsole Output

Skipping 5,861 KB.. Full Log
-unit :: Symbol/./SymbolTests/TestTypeSystemClang.TestConvertAccessTypeToAccessSpecifier (894 of 2145)
PASS: lldb-shell :: Breakpoint/case-sensitive.test (895 of 2145)
PASS: lldb-api :: macosx/nslog/TestDarwinNSLogOutput.py (896 of 2145)
PASS: lldb-unit :: SymbolFile/DWARF/./SymbolFileDWARFTests/SymbolFileDWARFTests.TestAbbrevMissingTerminator (897 of 2145)
UNSUPPORTED: lldb-api :: tools/intel-features/intel-pt/test/TestIntelPTSimpleBinary.py (898 of 2145)
PASS: lldb-shell :: SymbolFile/DWARF/dwarf5-atomic.s (899 of 2145)
PASS: lldb-unit :: Process/minidump/./LLDBMinidumpTests/RegisterContextMinidump.CheckRegisterContextMinidump_ARM (900 of 2145)
PASS: lldb-unit :: Utility/./UtilityTests/StreamTest.AddressSuffix (901 of 2145)
PASS: lldb-unit :: Symbol/./SymbolTests/TestTypeSystemClang.TestBuiltinTypeForEncodingAndBitSize (902 of 2145)
PASS: lldb-unit :: Utility/./UtilityTests/BinaryStreamTest.PutULEB128SixBytes (903 of 2145)
PASS: lldb-api :: functionalities/thread/concurrent_events/TestConcurrentCrashWithWatchpoint.py (904 of 2145)
PASS: lldb-api :: functionalities/thread/create_after_attach/TestCreateAfterAttach.py (905 of 2145)
PASS: lldb-shell :: Register/x86-64-ymm-read.test (906 of 2145)
PASS: lldb-unit :: UnwindAssembly/x86/./UnwindAssemblyx86Tests/Testx86AssemblyInspectionEngine.TestPopRBPWithREX (907 of 2145)
PASS: lldb-unit :: Utility/./UtilityTests/FileSpecTest.EqualDotsWindows (908 of 2145)
PASS: lldb-shell :: Driver/TestFile.test (909 of 2145)
PASS: lldb-api :: source-manager/TestSourceManager.py (910 of 2145)
PASS: lldb-api :: commands/expression/import_builtin_fileid/TestImportBuiltinFileID.py (911 of 2145)
PASS: lldb-unit :: Utility/./UtilityTests/StringListTest.GetMaxStringLengthEqualSize (912 of 2145)
PASS: lldb-shell :: SymbolFile/DWARF/DW_AT_low_pc-addrx.s (913 of 2145)
PASS: lldb-unit :: UnwindAssembly/x86/./UnwindAssemblyx86Tests/Testx86AssemblyInspectionEngine.TestSpillRegToStackViaMOVi386 (914 of 2145)
PASS: lldb-api :: commands/expression/test/TestExprs.py (915 of 2145)
PASS: lldb-unit :: Utility/./UtilityTests/XcodeSDKTest.ParseTest (916 of 2145)
PASS: lldb-unit :: Utility/./UtilityTests/BinaryStreamTest.PutULEB128MaxValue (917 of 2145)
PASS: lldb-unit :: Utility/./UtilityTests/ArgsTest.TestInsertArg (918 of 2145)
PASS: lldb-unit :: ObjectFile/ELF/./ObjectFileELFTests/ObjectFileELFTest.GetSymtab_NoSymEntryPointArmAddressClass (919 of 2145)
PASS: lldb-api :: functionalities/data-formatter/data-formatter-stl/libcxx/optional/TestDataFormatterLibcxxOptional.py (920 of 2145)
PASS: lldb-shell :: ObjectFile/MachO/lc_version_min.yaml (921 of 2145)
PASS: lldb-api :: functionalities/data-formatter/var-in-aggregate-misuse/TestVarInAggregateMisuse.py (922 of 2145)
PASS: lldb-unit :: Expression/./ExpressionTests/DiagnosticManagerTest.FixedExpression (923 of 2145)
PASS: lldb-api :: lang/c/function_types/TestFunctionTypes.py (924 of 2145)
PASS: lldb-api :: lang/c/local_types/TestUseClosestType.py (925 of 2145)
PASS: lldb-api :: commands/expression/function_template_specialization_temp_args/TestFunctionTemplateSpecializationTempArgs.py (926 of 2145)
PASS: lldb-api :: lang/cpp/frame-var-anon-unions/TestFrameVariableAnonymousUnions.py (927 of 2145)
PASS: lldb-api :: functionalities/signal/raise/TestRaise.py (928 of 2145)
PASS: lldb-unit :: Utility/./UtilityTests/XcodeSDKTest.FindXcodeContentsDirectoryInPath (929 of 2145)
UNSUPPORTED: lldb-api :: functionalities/breakpoint/hardware_breakpoints/hardware_breakpoint_on_multiple_threads/TestHWBreakMultiThread.py (930 of 2145)
PASS: lldb-api :: commands/expression/vector_of_enums/TestVectorOfEnums.py (931 of 2145)
PASS: lldb-api :: lang/cpp/trivial_abi/TestTrivialABI.py (932 of 2145)
PASS: lldb-api :: lang/cpp/char1632_t/TestChar1632T.py (933 of 2145)
PASS: lldb-api :: commands/watchpoints/watchpoint_commands/condition/TestWatchpointConditionCmd.py (934 of 2145)
PASS: lldb-unit :: Utility/./UtilityTests/ArgsTest.StringListConstructor (935 of 2145)
PASS: lldb-unit :: Host/./HostTests/FileSystemTest.OpenErrno (936 of 2145)
PASS: lldb-api :: functionalities/param_entry_vals/basic_entry_values/TestBasicEntryValues.py (937 of 2145)
PASS: lldb-unit :: Utility/./UtilityTests/StringListTest.Assignment (938 of 2145)
PASS: lldb-unit :: Platform/./LLDBPlatformTests/PlatformAppleSimulatorTest.TestHostPlatformToSim (939 of 2145)
PASS: lldb-unit :: Utility/./UtilityTests/ArgsTest.ReplaceArgumentAtIndexFarOutOfRange (940 of 2145)
PASS: lldb-api :: functionalities/target-new-solib-notifications/TestModuleLoadedNotifys.py (941 of 2145)
PASS: lldb-api :: lang/cpp/extern_c/TestExternCSymbols.py (942 of 2145)
PASS: lldb-shell :: Breakpoint/debug_rnglist_basic.test (943 of 2145)
PASS: lldb-unit :: SymbolFile/NativePDB/./SymbolFileNativePDBTests/PDBFPOProgramToDWARFExpressionTests.InvalidAssignmentSingle (944 of 2145)
PASS: lldb-shell :: SymbolFile/DWARF/find-variable-file.cpp (945 of 2145)
PASS: lldb-unit :: ScriptInterpreter/Python/./ScriptInterpreterPythonTests/PythonDataObjectsTest.TestResetting (946 of 2145)
PASS: lldb-unit :: Utility/./UtilityTests/DataExtractorTest.GetCStr (947 of 2145)
PASS: lldb-unit :: UnwindAssembly/x86/./UnwindAssemblyx86Tests/Testx86AssemblyInspectionEngine.TestPushR15 (948 of 2145)
PASS: lldb-api :: functionalities/thread/exit_during_break/TestExitDuringBreak.py (949 of 2145)
PASS: lldb-shell :: ObjectFile/PECOFF/section-types.yaml (950 of 2145)
PASS: lldb-api :: lang/cpp/member-and-local-vars-with-same-name/TestMembersAndLocalsWithSameName.py (951 of 2145)
PASS: lldb-unit :: Utility/./UtilityTests/RangeTest.ClearWithStarAddress (952 of 2145)
UNSUPPORTED: lldb-api :: functionalities/darwin_log/filter/regex/message/TestDarwinLogFilterRegexMessage.py (953 of 2145)
PASS: lldb-unit :: Utility/./UtilityTests/BinaryStreamTest.PutSLEB128Zero (954 of 2145)
PASS: lldb-api :: functionalities/breakpoint/breakpoint_by_line_and_column/TestBreakpointByLineAndColumn.py (955 of 2145)
PASS: lldb-api :: lang/cpp/operators/TestCppOperators.py (956 of 2145)
PASS: lldb-unit :: Utility/./UtilityTests/ConstStringTest.MangledCounterpart (957 of 2145)
PASS: lldb-unit :: Utility/./UtilityTests/DataExtractorTest.GetBitfield (958 of 2145)
PASS: lldb-api :: functionalities/data-formatter/data-formatter-skip-summary/TestDataFormatterSkipSummary.py (959 of 2145)
PASS: lldb-unit :: Core/./LLDBCoreTests/ModuleSpecTest.InvalidInMemoryBufferValidFile (960 of 2145)
PASS: lldb-shell :: Commands/CommandScriptImmediateOutput/CommandScriptImmediateOutputConsole.test (961 of 2145)
PASS: lldb-unit :: Utility/./UtilityTests/BinaryStreamTest.PutULEB128EightBytes (962 of 2145)
PASS: lldb-unit :: Utility/./UtilityTests/StreamTeeTest.GetStreamAtIndexOutOfBoundsEmpty (963 of 2145)
PASS: lldb-shell :: Driver/TestTarget.test (964 of 2145)
PASS: lldb-unit :: UnwindAssembly/x86/./UnwindAssemblyx86Tests/Testx86AssemblyInspectionEngine.TestStackRealign32BitDisp_x86_64 (965 of 2145)
PASS: lldb-unit :: Expression/./ExpressionTests/CppModuleConfigurationTest.MissingLibCpp (966 of 2145)
UNSUPPORTED: lldb-shell :: Expr/TestIRMemoryMapWindows.test (967 of 2145)
PASS: lldb-unit :: Utility/./UtilityTests/NameMatchesTest.Ignore (968 of 2145)
PASS: lldb-api :: functionalities/multiword-commands/TestMultiWordCommands.py (969 of 2145)
PASS: lldb-shell :: SymbolFile/DWARF/DW_OP_piece-struct.s (970 of 2145)
PASS: lldb-api :: functionalities/show_location/TestShowLocationDwarf5.py (971 of 2145)
PASS: lldb-unit :: ObjectFile/Breakpad/./ObjectFileBreakpadTests/StackCFIRecord.parse (972 of 2145)
PASS: lldb-unit :: Utility/./UtilityTests/StateTest.Formatv (973 of 2145)
PASS: lldb-unit :: Utility/./UtilityTests/OptionsWithRawTest.LeadingSpaceArgs (974 of 2145)
PASS: lldb-api :: functionalities/optimized_code/TestNoASanExceptionAfterEvalOP_piece.py (975 of 2145)
PASS: lldb-api :: commands/gui/breakpoints/TestGuiBreakpoints.py (976 of 2145)
PASS: lldb-shell :: ScriptInterpreter/Python/crashlog.test (977 of 2145)
PASS: lldb-api :: functionalities/thread/concurrent_events/TestConcurrentDelayedCrashWithBreakpointSignal.py (978 of 2145)
PASS: lldb-api :: functionalities/data-formatter/data-formatter-objc/cmtime/TestDataFormatterCMTime.py (979 of 2145)
PASS: lldb-shell :: Commands/command-regex-unalias.test (980 of 2145)
PASS: lldb-unit :: Utility/./UtilityTests/ScalarTest.GetBytes (981 of 2145)
PASS: lldb-api :: lang/objc/modules/TestObjCModules.py (982 of 2145)
PASS: lldb-api :: tools/lldb-vscode/attach/TestVSCode_attach.py (983 of 2145)
PASS: lldb-api :: functionalities/data-formatter/data-formatter-stl/libcxx/multimap/TestDataFormatterLibccMultiMap.py (984 of 2145)
PASS: lldb-unit :: DataFormatter/./LLDBFormatterTests/StringPrinterTests.CxxUTF8 (985 of 2145)
PASS: lldb-shell :: SymbolFile/NativePDB/tag-types.cpp (986 of 2145)
PASS: lldb-shell :: Register/x86-64-read.test (987 of 2145)
PASS: lldb-api :: lang/objc/real-definition/TestRealDefinition.py (988 of 2145)
PASS: lldb-shell :: ObjectFile/Breakpad/uuid-matching-mac.test (989 of 2145)
PASS: lldb-api :: lang/cpp/const_this/TestConstThis.py (990 of 2145)
PASS: lldb-unit :: Utility/./UtilityTests/StringListTest.CopyList (991 of 2145)
PASS: lldb-api :: commands/expression/persistent_variables/TestPersistentVariables.py (992 of 2145)
PASS: lldb-unit :: Process/minidump/./LLDBMinidumpTests/MinidumpParserTest.GetArchitecture (993 of 2145)
PASS: lldb-api :: functionalities/gdb_remote_client/TestProcessConnect.py (994 of 2145)
PASS: lldb-unit :: Utility/./UtilityTests/DataExtractorTest.GetMaxU64 (995 of 2145)
PASS: lldb-unit :: Core/./LLDBCoreTests/ModuleSpecTest.TestELFFile (996 of 2145)
PASS: lldb-unit :: Core/./LLDBCoreTests/ModuleSpecTest.TestCOFFFile (997 of 2145)
PASS: lldb-api :: commands/process/attach/TestProcessAttach.py (998 of 2145)
PASS: lldb-api :: functionalities/data-formatter/data-formatter-stl/libcxx/function/TestLibCxxFunction.py (999 of 2145)
PASS: lldb-api :: tools/lldb-server/TestGdbRemoteHostInfo.py (1000 of 2145)
PASS: lldb-unit :: Utility/./UtilityTests/BinaryStreamTest.PutSLEB128SevenBytes (1001 of 2145)
PASS: lldb-api :: lang/cpp/gmodules-templates/TestGModules.py (1002 of 2145)
PASS: lldb-shell :: Settings/TestDisassemblyFormat.test (1003 of 2145)
PASS: lldb-shell :: SymbolFile/DWARF/find-basic-variable.cpp (1004 of 2145)
PASS: lldb-unit :: Language/Highlighting/./HighlighterTests/HighlighterTest.ClangTrailingBackslashBeforeNewline (1005 of 2145)
PASS: lldb-unit :: Utility/./UtilityTests/StreamTeeTest.Constructor1Stream (1006 of 2145)
PASS: lldb-api :: functionalities/gdb_remote_client/TestIOSSimulator.py (1007 of 2145)
PASS: lldb-unit :: Utility/./UtilityTests/DataExtractorTest.UncommonAddressSize (1008 of 2145)
PASS: lldb-unit :: Utility/./UtilityTests/SubsystemRAIITest.SubsystemWithErrorFailure (1009 of 2145)
PASS: lldb-unit :: Utility/./UtilityTests/DataExtractorTest.GetMaxU64_unchecked (1010 of 2145)
PASS: lldb-unit :: Utility/./UtilityTests/UriParserTest.BracketedHostnameWithPortIPv4 (1011 of 2145)
PASS: lldb-unit :: Host/./HostTests/ProcessLaunchInfoTest.Constructor (1012 of 2145)
PASS: lldb-shell :: SymbolFile/DWARF/dwarf5_locations.s (1013 of 2145)
PASS: lldb-api :: functionalities/non-overlapping-index-variable-i/TestIndexVariable.py (1014 of 2145)
PASS: lldb-shell :: Driver/TestCommands.test (1015 of 2145)
PASS: lldb-unit :: Language/Highlighting/./HighlighterTests/HighlighterTest.ClangCommas (1016 of 2145)
PASS: lldb-api :: functionalities/data-formatter/stringprinter/TestStringPrinter.py (1017 of 2145)
PASS: lldb-api :: functionalities/breakpoint/breakpoint_language/TestBreakpointLanguage.py (1018 of 2145)
PASS: lldb-api :: iohandler/unicode/TestUnicode.py (1019 of 2145)
PASS: lldb-unit :: UnwindAssembly/x86/./UnwindAssemblyx86Tests/Testx86AssemblyInspectionEngine.TestPopR12 (1020 of 2145)
PASS: lldb-api :: functionalities/breakpoint/address_breakpoints/TestAddressBreakpoints.py (1021 of 2145)
PASS: lldb-unit :: Process/gdb-remote/./ProcessGdbRemoteTests/GDBRemoteCommunicationClientTest.ReadRegister (1022 of 2145)
PASS: lldb-api :: assert_messages_test/TestAssertMessages.py (1023 of 2145)
PASS: lldb-unit :: Utility/./UtilityTests/BinaryStreamTest.PutULEB128NineBytes (1024 of 2145)
PASS: lldb-unit :: Utility/./UtilityTests/SerializationRountripTest.SerializeDeserializeCString (1025 of 2145)
PASS: lldb-unit :: Utility/./UtilityTests/NameMatchesTest.Contains (1026 of 2145)
PASS: lldb-api :: commands/frame/diagnose/dereference-this/TestDiagnoseDereferenceThis.py (1027 of 2145)
PASS: lldb-unit :: Utility/./UtilityTests/ArgsTest.DoubleQuotedItem (1028 of 2145)
PASS: lldb-api :: macosx/safe-to-func-call/TestSafeFuncCalls.py (1029 of 2145)
PASS: lldb-unit :: tools/lldb-server/tests/./LLDBServerTests/StandardStartupTest.TestStopReplyContainsThreadPcs (1030 of 2145)
PASS: lldb-unit :: Utility/./UtilityTests/StringListTest.ShiftStdString (1031 of 2145)
PASS: lldb-api :: functionalities/inferior-assert/TestInferiorAssert.py (1032 of 2145)
PASS: lldb-api :: commands/breakpoint/command/list/TestBreakpointCommandList.py (1033 of 2145)
PASS: lldb-api :: commands/expression/ignore-artificial-constructors/TestIgnoreArtificialConstructors.py (1034 of 2145)
PASS: lldb-api :: functionalities/thread/concurrent_events/TestConcurrentSignalDelayWatch.py (1035 of 2145)
PASS: lldb-api :: lang/objcxx/objcxx-ivar-vector/TestIvarVector.py (1036 of 2145)
PASS: lldb-unit :: Utility/./UtilityTests/StreamTest.ShiftOperatorPtr (1037 of 2145)
PASS: lldb-unit :: Interpreter/./InterpreterTests/CompletionTest.DirCompletionAbsolute (1038 of 2145)
PASS: lldb-shell :: SymbolFile/NativePDB/nested-types.cpp (1039 of 2145)
PASS: lldb-unit :: DataFormatter/./LLDBFormatterTests/TypeMatcherTests.CreatedBySameMatchString (1040 of 2145)
PASS: lldb-unit :: Utility/./UtilityTests/ArgsTest.BareSingleQuote (1041 of 2145)
PASS: lldb-api :: functionalities/memory/find/TestMemoryFind.py (1042 of 2145)
PASS: lldb-unit :: Utility/./UtilityTests/StringExtractorTest.GetHexBytesAvail_OddPair (1043 of 2145)
PASS: lldb-api :: python_api/sbplatform/TestSBPlatform.py (1044 of 2145)
PASS: lldb-api :: functionalities/thread/concurrent_events/TestConcurrentCrashWithSignal.py (1045 of 2145)
UNSUPPORTED: lldb-api :: functionalities/unwind/ehframe/TestEhFrameUnwind.py (1046 of 2145)
PASS: lldb-unit :: UnwindAssembly/x86/./UnwindAssemblyx86Tests/Testx86AssemblyInspectionEngine.TestPopR14 (1047 of 2145)
PASS: lldb-unit :: Language/Highlighting/./HighlighterTests/HighlighterTest.ClangPreserveNewLine (1048 of 2145)
PASS: lldb-api :: functionalities/breakpoint/breakpoint_ids/TestBreakpointIDs.py (1049 of 2145)
PASS: lldb-unit :: Expression/./ExpressionTests/DiagnosticManagerTest.PutStringSeverities (1050 of 2145)
PASS: lldb-unit :: UnwindAssembly/x86/./UnwindAssemblyx86Tests/Testx86AssemblyInspectionEngine.TestPopR13 (1051 of 2145)
PASS: lldb-api :: functionalities/tail_call_frames/disambiguate_paths_to_common_sink/TestDisambiguatePathsToCommonSink.py (1052 of 2145)
PASS: lldb-unit :: SymbolFile/NativePDB/./SymbolFileNativePDBTests/PDBFPOProgramToDWARFExpressionTests.MissingTargetRegister (1053 of 2145)
PASS: lldb-shell :: SymbolFile/NativePDB/globals-fundamental.cpp (1054 of 2145)
PASS: lldb-unit :: Utility/./UtilityTests/RangeDataVector.CustomSort (1055 of 2145)
PASS: lldb-api :: commands/expression/result_numbering/TestResultNumbering.py (1056 of 2145)
PASS: lldb-api :: functionalities/thread/thread_exit/TestThreadExit.py (1057 of 2145)
PASS: lldb-unit :: Utility/./UtilityTests/ArgsTest.TestMultipleArgs (1058 of 2145)
PASS: lldb-shell :: SymbolFile/DWARF/limit-debug-info.s (1059 of 2145)
PASS: lldb-unit :: Utility/./UtilityTests/DataExtractorTest.GetSLEB128_bit63 (1060 of 2145)
PASS: lldb-unit :: Utility/./UtilityTests/RangeTest.DoesIntersect (1061 of 2145)
UNSUPPORTED: lldb-api :: functionalities/darwin_log/filter/regex/subsystem/TestDarwinLogFilterRegexSubsystem.py (1062 of 2145)
PASS: lldb-api :: tools/lldb-vscode/module/TestVSCode_module.py (1063 of 2145)
PASS: lldb-unit :: Utility/./UtilityTests/StringExtractorTest.GetHexU8_Underflow2 (1064 of 2145)
PASS: lldb-shell :: SymbolFile/Breakpad/line-table-edgecases.test (1065 of 2145)
PASS: lldb-unit :: Utility/./UtilityTests/StringExtractorTest.GetU64BigEndian (1066 of 2145)
PASS: lldb-api :: lang/objc/objc-class-method/TestObjCClassMethod.py (1067 of 2145)
PASS: lldb-api :: functionalities/thread/state_after_expression/TestStateAfterExpression.py (1068 of 2145)
PASS: lldb-shell :: ObjectFile/ELF/netbsd-core-amd64.test (1069 of 2145)
PASS: lldb-unit :: debugserver/./debugserverTests/JSON.Parse (1070 of 2145)
PASS: lldb-shell :: Driver/TestUseColor.test (1071 of 2145)
PASS: lldb-unit :: Utility/./UtilityTests/StringListTest.CopyListSingle (1072 of 2145)
PASS: lldb-api :: iohandler/autosuggestion/TestAutosuggestion.py (1073 of 2145)
PASS: lldb-shell :: Settings/TestFrameFormatColor.test (1074 of 2145)
PASS: lldb-api :: functionalities/unwind/sigtramp/TestSigtrampUnwind.py (1075 of 2145)
PASS: lldb-api :: commands/reproducer/invalid-args/TestInvalidArgsReproducer.py (1076 of 2145)
UNSUPPORTED: lldb-api :: functionalities/unwind/standard/TestStandardUnwind.py (1077 of 2145)
PASS: lldb-api :: functionalities/completion/TestCompletion.py (1078 of 2145)
PASS: lldb-api :: commands/watchpoints/multiple_threads/TestWatchpointMultipleThreads.py (1079 of 2145)
PASS: lldb-shell :: SymbolFile/DWARF/debug-types-signature-loop.s (1080 of 2145)
PASS: lldb-api :: lang/objc/objc-optimized/TestObjcOptimized.py (1081 of 2145)
UNSUPPORTED: lldb-api :: benchmarks/frame_variable/TestFrameVariableResponse.py (1082 of 2145)
PASS: lldb-unit :: Utility/./UtilityTests/Predicate.WaitForValueEqualTo (1083 of 2145)
PASS: lldb-api :: functionalities/thread/concurrent_events/TestConcurrentTwoWatchpointsOneBreakpoint.py (1084 of 2145)
UNSUPPORTED: lldb-api :: functionalities/darwin_log/filter/exact_match/activity/TestDarwinLogFilterMatchActivity.py (1085 of 2145)
PASS: lldb-api :: commands/process/signal/TestProcessSignal.py (1086 of 2145)
PASS: lldb-shell :: SymbolFile/NativePDB/function-types-calling-conv.cpp (1087 of 2145)
PASS: lldb-unit :: Utility/./UtilityTests/BinaryStreamTest.PutSLEB128NineBytes (1088 of 2145)
PASS: lldb-api :: functionalities/inferior-crashing/recursive-inferior/TestRecursiveInferior.py (1089 of 2145)
PASS: lldb-api :: functionalities/thread/concurrent_events/TestConcurrentManyBreakpoints.py (1090 of 2145)
PASS: lldb-shell :: SymbolFile/DWARF/debug_loclists-dwo.s (1091 of 2145)
PASS: lldb-unit :: ObjectFile/PECOFF/./ObjectFilePECOFFTests/PECallFrameInfoTest.Frame_reg_eh (1092 of 2145)
PASS: lldb-unit :: Utility/./UtilityTests/FileSpecTest.Yaml (1093 of 2145)
PASS: lldb-unit :: Language/Highlighting/./HighlighterTests/HighlighterTest.ClangCursorPosAfterOtherToken (1094 of 2145)
PASS: lldb-unit :: Utility/./UtilityTests/CompletionRequest.Constructor (1095 of 2145)
PASS: lldb-api :: functionalities/data-formatter/data-formatter-objc/TestDataFormatterObjCNSBundle.py (1096 of 2145)
PASS: lldb-unit :: Utility/./UtilityTests/LogChannelTest.Disable (1097 of 2145)
UNSUPPORTED: lldb-api :: functionalities/thread/break_after_join/TestBreakAfterJoin.py (1098 of 2145)
PASS: lldb-unit :: Utility/./UtilityTests/StringListTest.LongestCommonPrefixDuplicateElement (1099 of 2145)
PASS: lldb-shell :: Reproducer/TestVersionCheck.test (1100 of 2145)
PASS: lldb-unit :: Utility/./UtilityTests/UUIDTest.SetFromStringRef (1101 of 2145)
PASS: lldb-unit :: Utility/./UtilityTests/ProcessInstanceInfo.Yaml (1102 of 2145)
PASS: lldb-shell :: SymbolFile/DWARF/dir-separator-windows.s (1103 of 2145)
PASS: lldb-api :: functionalities/tsan/global_location/TestTsanGlobalLocation.py (1104 of 2145)
PASS: lldb-unit :: Utility/./UtilityTests/OptionsWithRawTest.WhitespaceSuffix (1105 of 2145)
PASS: lldb-api :: functionalities/breakpoint/inlined_breakpoints/TestInlinedBreakpoints.py (1106 of 2145)
PASS: lldb-shell :: SymbolFile/DWARF/find-variable-dwo.cpp (1107 of 2145)
PASS: lldb-unit :: SymbolFile/NativePDB/./SymbolFileNativePDBTests/PDBFPOProgramToDWARFExpressionTests.SingleAssignmentRegisterRef (1108 of 2145)
PASS: lldb-shell :: SymbolFile/DWARF/debug-types-line-tables.s (1109 of 2145)
PASS: lldb-api :: commands/platform/basic/TestPlatformCommand.py (1110 of 2145)
PASS: lldb-unit :: ObjectFile/PECOFF/./ObjectFilePECOFFTests/PECallFrameInfoTest.Chained_eh (1111 of 2145)
PASS: lldb-unit :: Utility/./UtilityTests/OptionsWithRawTest.QuotedSuffix (1112 of 2145)
PASS: lldb-api :: lang/objc/foundation/TestSymbolTable.py (1113 of 2145)
PASS: lldb-api :: functionalities/postmortem/netbsd-core/TestNetBSDCore.py (1114 of 2145)
PASS: lldb-shell :: Settings/TestSettingsSet.test (1115 of 2145)
PASS: lldb-api :: lang/objc/foundation/TestObjCMethodsString.py (1116 of 2145)
PASS: lldb-unit :: Utility/./UtilityTests/StringListTest.LongestCommonPrefixNoPrefix (1117 of 2145)
PASS: lldb-unit :: Utility/./UtilityTests/IndexToObjectTest.ObjectForIndex (1118 of 2145)
PASS: lldb-unit :: Utility/./UtilityTests/SharedCluster.ClusterManager (1119 of 2145)
PASS: lldb-api :: lang/cpp/virtual-functions/TestCppVirtualFunctions.py (1120 of 2145)
PASS: lldb-api :: commands/expression/rdar42038760/TestScalarURem.py (1121 of 2145)
PASS: lldb-api :: functionalities/stats_api/TestStatisticsAPI.py (1122 of 2145)
PASS: lldb-api :: macosx/indirect_symbol/TestIndirectSymbols.py (1123 of 2145)
PASS: lldb-shell :: Minidump/dump-all.test (1124 of 2145)
PASS: lldb-api :: functionalities/data-formatter/data-formatter-stl/libcxx/iterator/TestDataFormatterLibccIterator.py (1125 of 2145)
PASS: lldb-api :: functionalities/data-formatter/data-formatter-enum-format/TestDataFormatterEnumFormat.py (1126 of 2145)
PASS: lldb-shell :: SymbolFile/DWARF/debug_aranges-empty-section.s (1127 of 2145)
PASS: lldb-shell :: BuildScript/modes.test (1128 of 2145)
PASS: lldb-unit :: Utility/./UtilityTests/StringExtractorTest.InitMisc (1129 of 2145)
UNSUPPORTED: lldb-api :: functionalities/darwin_log/source/debug/TestDarwinLogSourceDebug.py (1130 of 2145)
PASS: lldb-api :: functionalities/gdb_remote_client/TestNestedRegDefinitions.py (1131 of 2145)
PASS: lldb-shell :: Quit/TestQuitExitCodeTooManyArgs.test (1132 of 2145)
PASS: lldb-shell :: BuildScript/toolchain-clang.test (1133 of 2145)
PASS: lldb-unit :: Symbol/./SymbolTests/TestTypeSystemClang.TestGetEnumIntegerTypeBasicTypes (1134 of 2145)
PASS: lldb-unit :: ScriptInterpreter/Python/./ScriptInterpreterPythonTests/PythonDataObjectsTest.TestExceptions (1135 of 2145)
PASS: lldb-unit :: Utility/./UtilityTests/StringExtractorTest.GetHexBytes_FullString (1136 of 2145)
PASS: lldb-unit :: Utility/./UtilityTests/GeneratorTest.Get (1137 of 2145)
PASS: lldb-api :: functionalities/abbreviation/TestCommonShortSpellings.py (1138 of 2145)
PASS: lldb-unit :: Host/./HostTests/FileSystemTest.MakeAbsolute (1139 of 2145)
PASS: lldb-unit :: Process/minidump/./LLDBMinidumpTests/MinidumpParserTest.MinidumpDuplicateModuleMinAddress (1140 of 2145)
PASS: lldb-shell :: SymbolFile/Breakpad/unwind-via-stack-win.test (1141 of 2145)
PASS: lldb-api :: commands/expression/persist_objc_pointeetype/TestPersistObjCPointeeType.py (1142 of 2145)
PASS: lldb-unit :: Utility/./UtilityTests/TimeoutTest.Format (1143 of 2145)
UNSUPPORTED: lldb-api :: benchmarks/startup/TestStartupDelays.py (1144 of 2145)
PASS: lldb-api :: commands/expression/import-std-module/weak_ptr/TestWeakPtrFromStdModule.py (1145 of 2145)
PASS: lldb-api :: functionalities/plugins/command_plugin/TestPluginCommands.py (1146 of 2145)
PASS: lldb-unit :: Utility/./UtilityTests/DataExtractorTest.PeekData (1147 of 2145)
PASS: lldb-unit :: Utility/./UtilityTests/StringLexerTest.GetUnlexed (1148 of 2145)
PASS: lldb-unit :: Symbol/./SymbolTests/TestTypeSystemClang.TestRecordHasFields (1149 of 2145)
PASS: lldb-api :: lang/cpp/global_operators/TestCppGlobalOperators.py (1150 of 2145)
PASS: lldb-api :: python_api/target/TestTargetAPI.py (1151 of 2145)
PASS: lldb-api :: functionalities/data-formatter/cstring-utf8-summary/TestCstringUnicode.py (1152 of 2145)
PASS: lldb-unit :: API/./APITests/SBCommandInterpreterTest.MultiWordCommand (1153 of 2145)
PASS: lldb-unit :: Utility/./UtilityTests/FileSpecTest.Equal (1154 of 2145)
PASS: lldb-api :: functionalities/postmortem/mach-core/TestMachCore.py (1155 of 2145)
PASS: lldb-api :: functionalities/tail_call_frames/ambiguous_tail_call_seq1/TestAmbiguousTailCallSeq1.py (1156 of 2145)
PASS: lldb-unit :: Language/Highlighting/./HighlighterTests/HighlighterTest.ClangScalarLiterals (1157 of 2145)
PASS: lldb-unit :: debugserver/./debugserverTests/RNBSocket.LoopBackConnectIPv6 (1158 of 2145)
PASS: lldb-api :: commands/expression/import-std-module/vector-bool/TestVectorBoolFromStdModule.py (1159 of 2145)
PASS: lldb-unit :: Host/./HostTests/NativeProcessProtocolTest.ReadMemoryWithoutTrap (1160 of 2145)
PASS: lldb-api :: commands/expression/call-function/TestCallUserDefinedFunction.py (1161 of 2145)
PASS: lldb-unit :: Utility/./UtilityTests/TildeExpressionResolver.ResolveFullPath (1162 of 2145)
PASS: lldb-unit :: Utility/./UtilityTests/BinaryStreamTest.PutULEB128One (1163 of 2145)
PASS: lldb-unit :: Core/./LLDBCoreTests/SourceFileCache.FindSourceFileFound (1164 of 2145)
PASS: lldb-api :: lang/objc/objc-dyn-sbtype/TestObjCDynamicSBType.py (1165 of 2145)
PASS: lldb-api :: functionalities/thread/concurrent_events/TestConcurrentDelayedCrashWithBreakpointWatchpoint.py (1166 of 2145)
PASS: lldb-unit :: Symbol/./SymbolTests/Type.CompilerContextPattern (1167 of 2145)
UNSUPPORTED: lldb-api :: functionalities/data-formatter/data-formatter-stl/libstdcpp/vector/TestDataFormatterStdVector.py (1168 of 2145)
PASS: lldb-api :: functionalities/unwind/noreturn/module-end/TestNoReturnModuleEnd.py (1169 of 2145)
PASS: lldb-unit :: Process/minidump/./LLDBMinidumpTests/MinidumpParserTest.GetMiscInfo_no_stream (1170 of 2145)
PASS: lldb-api :: functionalities/step_scripted/TestStepScripted.py (1171 of 2145)
PASS: lldb-unit :: Symbol/./SymbolTests/PostfixExpression.ToDWARF (1172 of 2145)
PASS: lldb-shell :: Heap/heap-cstr.test (1173 of 2145)
PASS: lldb-unit :: Utility/./UtilityTests/RegularExpression.Match (1174 of 2145)
PASS: lldb-api :: lang/objc/objc-builtin-types/TestObjCBuiltinTypes.py (1175 of 2145)
PASS: lldb-shell :: SymbolFile/DWARF/deterministic-build.cpp (1176 of 2145)
PASS: lldb-unit :: Utility/./UtilityTests/StatusTest.ErrorConstructor (1177 of 2145)
PASS: lldb-shell :: ObjectFile/PECOFF/uuid.yaml (1178 of 2145)
PASS: lldb-unit :: Utility/./UtilityTests/CompletionRequest.DuplicateFilteringWithComments (1179 of 2145)
PASS: lldb-unit :: UnwindAssembly/x86/./UnwindAssemblyx86Tests/Testx86AssemblyInspectionEngine.TestPopEDI (1180 of 2145)
UNSUPPORTED: lldb-shell :: ScriptInterpreter/Lua/convenience_variables.test (1181 of 2145)
PASS: lldb-api :: functionalities/data-formatter/data-formatter-synthtype/TestDataFormatterSynthType.py (1182 of 2145)
PASS: lldb-unit :: ObjectFile/Breakpad/./ObjectFileBreakpadTests/FuncRecord.parse (1183 of 2145)
PASS: lldb-unit :: Utility/./UtilityTests/FileSpecTest.GetPath (1184 of 2145)
PASS: lldb-api :: lang/cpp/limit-debug-info/TestWithLimitDebugInfo.py (1185 of 2145)
PASS: lldb-shell :: SymbolFile/DWARF/win-i386-line-table.s (1186 of 2145)
PASS: lldb-api :: lang/cpp/class-template-parameter-pack/TestClassTemplateParameterPack.py (1187 of 2145)
PASS: lldb-api :: functionalities/data-formatter/data-formatter-python-synth/TestDataFormatterPythonSynth.py (1188 of 2145)
PASS: lldb-api :: functionalities/data-formatter/compactvectors/TestCompactVectors.py (1189 of 2145)
PASS: lldb-unit :: UnwindAssembly/PPC64/./PPC64InstEmulationTests/TestPPC64InstEmulation.TestMediumFunction (1190 of 2145)
UNSUPPORTED: lldb-shell :: SymbolFile/PDB/vbases.test (1191 of 2145)
PASS: lldb-api :: lang/c/shared_lib_stripped_symbols/TestSharedLibStrippedSymbols.py (1192 of 2145)
PASS: lldb-api :: python_api/thread/TestThreadAPI.py (1193 of 2145)
PASS: lldb-unit :: ScriptInterpreter/Python/./ScriptInterpreterPythonTests/PythonDataObjectsTest.TestPythonCallableInvoke (1194 of 2145)
PASS: lldb-unit :: Process/gdb-remote/./ProcessGdbRemoteTests/GDBRemoteCommunicationClientTest.GetMemoryRegionInfo (1195 of 2145)
PASS: lldb-unit :: Utility/./UtilityTests/CompletionRequest.TestCompletionOwnership (1196 of 2145)
PASS: lldb-unit :: Utility/./UtilityTests/StreamTest.PutStringAsRawHex8 (1197 of 2145)
PASS: lldb-api :: functionalities/data-formatter/data-formatter-stl/libcxx/bitset/TestDataFormatterLibcxxBitset.py (1198 of 2145)
PASS: lldb-unit :: Utility/./UtilityTests/TimerTest.CategoryTimesStats (1199 of 2145)
PASS: lldb-shell :: SymbolFile/DWARF/module-ownership.mm (1200 of 2145)
PASS: lldb-unit :: Process/gdb-remote/./ProcessGdbRemoteTests/GDBRemoteCommunicationClientTest.GetQOffsets (1201 of 2145)
PASS: lldb-unit :: Utility/./UtilityTests/StringListTest.JoinThree (1202 of 2145)
PASS: lldb-unit :: Expression/./ExpressionTests/ClangHostTest.MacOSX (1203 of 2145)
PASS: lldb-unit :: ScriptInterpreter/Python/./ScriptInterpreterPythonTests/PythonDataObjectsTest.TestOwnedReferences (1204 of 2145)
PASS: lldb-api :: functionalities/breakpoint/global_constructor/TestBreakpointInGlobalConstructor.py (1205 of 2145)
PASS: lldb-unit :: debugserver/./debugserverTests/RNBSocket.AnyListen (1206 of 2145)
PASS: lldb-shell :: SymbolFile/NativePDB/s_constant.cpp (1207 of 2145)
UNSUPPORTED: lldb-api :: lang/objc/objc-dynamic-value/TestObjCDynamicValue.py (1208 of 2145)
UNSUPPORTED: lldb-shell :: SymbolFile/PDB/function-nested-block.test (1209 of 2145)
PASS: lldb-api :: functionalities/data-formatter/data-formatter-objc/TestDataFormatterObjCNSError.py (1210 of 2145)
PASS: lldb-unit :: Utility/./UtilityTests/StreamTeeTest.Constructor2Streams (1211 of 2145)
PASS: lldb-unit :: Language/Highlighting/./HighlighterTests/HighlighterTest.ClangEmptyInput (1212 of 2145)
PASS: lldb-unit :: Utility/./UtilityTests/StreamTest.PutMaxHex64ByteOrderLittle (1213 of 2145)
PASS: lldb-shell :: Reproducer/TestCrash.test (1214 of 2145)
PASS: lldb-unit :: Language/Highlighting/./HighlighterTests/HighlighterTest.ClangSquareBrackets (1215 of 2145)
PASS: lldb-shell :: SymbolFile/Breakpad/stack-cfi-parsing.test (1216 of 2145)
PASS: lldb-api :: functionalities/plugins/python_os_plugin/TestPythonOSPlugin.py (1217 of 2145)
PASS: lldb-unit :: Utility/./UtilityTests/UriParserTest.Empty (1218 of 2145)
PASS: lldb-unit :: Language/Highlighting/./HighlighterTests/HighlighterTest.ClangStringLiterals (1219 of 2145)
PASS: lldb-api :: types/TestDoubleTypesExpr.py (1220 of 2145)
PASS: lldb-unit :: Utility/./UtilityTests/FileSpecTest.FileAndDirectoryComponents (1221 of 2145)
PASS: lldb-shell :: ObjectFile/Breakpad/discontiguous-sections.test (1222 of 2145)
PASS: lldb-api :: commands/command/invalid-args/TestInvalidArgsCommand.py (1223 of 2145)
PASS: lldb-unit :: Host/./HostTests/SocketTest.DomainListenConnectAccept (1224 of 2145)
PASS: lldb-unit :: Thread/./ThreadTests/ThreadTest.GetPrivateStopInfo (1225 of 2145)
PASS: lldb-unit :: Utility/./UtilityTests/StringListTest.CopyListEmpty (1226 of 2145)
PASS: lldb-api :: functionalities/gdb_remote_client/TestPlatformClient.py (1227 of 2145)
PASS: lldb-unit :: Utility/./UtilityTests/DataExtractorTest.GetMaxS64 (1228 of 2145)
PASS: lldb-unit :: Host/./HostTests/SocketTest.UDPConnect (1229 of 2145)
UNSUPPORTED: lldb-api :: functionalities/data-formatter/data-formatter-stl/libstdcpp/smart_ptr/TestDataFormatterStdSmartPtr.py (1230 of 2145)
PASS: lldb-shell :: SymbolFile/DWARF/debug_line-tombstone.s (1231 of 2145)
PASS: lldb-unit :: Utility/./UtilityTests/StringListTest.ForRange (1232 of 2145)
PASS: lldb-unit :: Utility/./UtilityTests/OptionsWithRawTest.ArgsButNoDelimiter (1233 of 2145)
PASS: lldb-shell :: SymbolFile/DWARF/debug_rnglists-dwo.s (1234 of 2145)
UNSUPPORTED: lldb-api :: linux/mix-dwo-and-regular-objects/TestMixedDwarfBinary.py (1235 of 2145)
PASS: lldb-unit :: Symbol/./SymbolTests/TestTypeSystemClang.TestGetTypeClassNested (1236 of 2145)
PASS: lldb-unit :: ScriptInterpreter/Python/./ScriptInterpreterPythonTests/PythonDataObjectsTest.TestPythonDictionaryManipulation (1237 of 2145)
PASS: lldb-unit :: Utility/./UtilityTests/StringExtractorTest.GetHexU8_InvalidHex_NoEof (1238 of 2145)
PASS: lldb-api :: commands/target/stop-hooks/TestStopHooks.py (1239 of 2145)
UNSUPPORTED: lldb-shell :: Register/x86-gp-write.test (1240 of 2145)
PASS: lldb-unit :: Host/./HostTests/NativeProcessProtocolTest.ReadCStringFromMemory_CrossPageBoundary (1241 of 2145)
PASS: lldb-api :: python_api/sbdata/TestSBData.py (1242 of 2145)
PASS: lldb-api :: functionalities/memory/cache/TestMemoryCache.py (1243 of 2145)
PASS: lldb-api :: commands/command/nested_alias/TestNestedAlias.py (1244 of 2145)
PASS: lldb-unit :: Expression/./ExpressionTests/DiagnosticManagerTest.GetStringSeverityLabels (1245 of 2145)
PASS: lldb-unit :: ScriptInterpreter/Python/./ScriptInterpreterPythonTests/PythonDataObjectsTest.TestGlobalNameResolutionNoDot (1246 of 2145)
PASS: lldb-shell :: Unwind/eh-frame-dwarf-unwind.test (1247 of 2145)
PASS: lldb-api :: commands/source/info/TestSourceInfo.py (1248 of 2145)
PASS: lldb-unit :: SymbolFile/DWARF/./SymbolFileDWARFTests/SymbolFileDWARFTests.TestAbbrevOrder1Start5 (1249 of 2145)
PASS: lldb-api :: commands/target/modules/search-paths/insert/TestTargetModulesSearchpathsInsert.py (1250 of 2145)
PASS: lldb-api :: python_api/watchpoint/TestWatchpointIgnoreCount.py (1251 of 2145)
PASS: lldb-shell :: ScriptInterpreter/None/none.test (1252 of 2145)
PASS: lldb-api :: iohandler/resize/TestIOHandlerResize.py (1253 of 2145)
PASS: lldb-unit :: Utility/./UtilityTests/LogChannelTest.Enable (1254 of 2145)
PASS: lldb-unit :: Symbol/./SymbolTests/PostfixExpression.ParseFPOProgram (1255 of 2145)
PASS: lldb-unit :: Language/CLanguages/./LanguageCLanguagesTests/CLanguages.LookupCLanguagesByLanguageType (1256 of 2145)
PASS: lldb-unit :: Utility/./UtilityTests/PassiveReplayTest.InstrumentedBar (1257 of 2145)
PASS: lldb-unit :: Interpreter/./InterpreterTests/OptionArgParserTest.toBoolean (1258 of 2145)
PASS: lldb-unit :: Utility/./UtilityTests/GeneratorTest.YamlMultiProvider (1259 of 2145)
PASS: lldb-shell :: Settings/TestSettingsWrite.test (1260 of 2145)
PASS: lldb-api :: python_api/lldbutil/TestSwigVersion.py (1261 of 2145)
PASS: lldb-api :: macosx/order/TestOrderFile.py (1262 of 2145)
PASS: lldb-shell :: Minidump/Windows/arm-fp-unwind.test (1263 of 2145)
PASS: lldb-unit :: DataFormatter/./LLDBFormatterTests/TypeMatcherTests.ExactName (1264 of 2145)
PASS: lldb-unit :: Utility/./UtilityTests/DataExtractorTest.GetDouble (1265 of 2145)
PASS: lldb-api :: python_api/lldbutil/frame/TestFrameUtils.py (1266 of 2145)
PASS: lldb-unit :: Process/minidump/./LLDBMinidumpTests/MinidumpParserTest.GetMemoryRegionInfo (1267 of 2145)
PASS: lldb-unit :: Process/minidump/./LLDBMinidumpTests/MinidumpParserTest.GetMemoryRegionInfoLinuxMaps (1268 of 2145)
PASS: lldb-api :: functionalities/data-formatter/data-formatter-objc/nsstring/TestDataFormatterNSString.py (1269 of 2145)
UNSUPPORTED: lldb-api :: android/platform/TestDefaultCacheLineSize.py (1270 of 2145)
PASS: lldb-shell :: SymbolFile/DWARF/array-sizes.s (1271 of 2145)
PASS: lldb-unit :: Host/./HostTests/NativeProcessProtocolTest.SetBreakpointFailWrite (1272 of 2145)
PASS: lldb-api :: commands/expression/argument_passing_restrictions/TestArgumentPassingRestrictions.py (1273 of 2145)
PASS: lldb-unit :: ObjectFile/Breakpad/./ObjectFileBreakpadTests/Record.classify (1274 of 2145)
PASS: lldb-api :: commands/session/save/TestSessionSave.py (1275 of 2145)
PASS: lldb-api :: functionalities/thread/concurrent_events/TestConcurrentBreakpointDelayBreakpointOneSignal.py (1276 of 2145)
PASS: lldb-shell :: SymbolFile/NativePDB/locate-pdb.cpp (1277 of 2145)
PASS: lldb-unit :: Utility/./UtilityTests/ScalarTest.CastOperations (1278 of 2145)
PASS: lldb-api :: lang/cpp/covariant-return-types/TestCovariantReturnTypes.py (1279 of 2145)
PASS: lldb-api :: python_api/disassemble-raw-data/TestDisassembleRawData.py (1280 of 2145)
PASS: lldb-shell :: SymbolFile/NativePDB/globals-bss.cpp (1281 of 2145)
PASS: lldb-unit :: Expression/./ExpressionTests/DiagnosticManagerTest.AppendMessageNoDiag (1282 of 2145)
PASS: lldb-unit :: Target/./TargetTests/ModuleCacheTest.GetAndPutStrangeHostname (1283 of 2145)
PASS: lldb-unit :: Utility/./UtilityTests/RangeTest.SizeTypes (1284 of 2145)
PASS: lldb-unit :: Core/./LLDBCoreTests/CommunicationTest.SynchronizeWhileClosing (1285 of 2145)
PASS: lldb-unit :: Host/./HostTests/SocketTest.UDPGetConnectURI (1286 of 2145)
PASS: lldb-unit :: UnwindAssembly/x86/./UnwindAssemblyx86Tests/Testx86AssemblyInspectionEngine.TestPush0 (1287 of 2145)
PASS: lldb-api :: tools/lldb-vscode/breakpoint-events/TestVSCode_breakpointEvents.py (1288 of 2145)
UNSUPPORTED: lldb-api :: tools/lldb-server/TestGdbRemoteCompletion.py (1289 of 2145)
PASS: lldb-api :: functionalities/thread/concurrent_events/TestConcurrentSignalWatch.py (1290 of 2145)
PASS: lldb-api :: commands/target/stop-hook/disable/TestTargetStopHookDisable.py (1291 of 2145)
PASS: lldb-unit :: Utility/./UtilityTests/StringListTest.InsertStringAtIndexOutOfBounds (1292 of 2145)
PASS: lldb-api :: commands/expression/top-level/TestTopLevelExprs.py (1293 of 2145)
PASS: lldb-api :: commands/expression/namespace_local_var_same_name_obj_c/TestNamespaceLocalVarSameNameObjC.py (1294 of 2145)
UNSUPPORTED: lldb-api :: functionalities/darwin_log/filter/exact_match/message/TestDarwinLogFilterMatchMessage.py (1295 of 2145)
PASS: lldb-api :: lang/cpp/constructors/TestCppConstructors.py (1296 of 2145)
PASS: lldb-api :: lang/objc/modules-cache/TestClangModulesCache.py (1297 of 2145)
PASS: lldb-unit :: Utility/./UtilityTests/XcodeSDKTest.SDKSupportsModules (1298 of 2145)
UNSUPPORTED: lldb-api :: tools/lldb-server/TestGdbRemoteAuxvSupport.py (1299 of 2145)
UNSUPPORTED: lldb-api :: tools/lldb-server/signal-filtering/TestGdbRemote_QPassSignals.py (1300 of 2145)
PASS: lldb-api :: functionalities/set-data/TestSetData.py (1301 of 2145)
PASS: lldb-unit :: Utility/./UtilityTests/RangeVector.CombineConsecutiveRanges (1302 of 2145)
PASS: lldb-api :: functionalities/breakpoint/breakpoint_command/TestBreakpointCommandsFromPython.py (1303 of 2145)
PASS: lldb-shell :: SymbolFile/Breakpad/line-table-discontinuous-file-ids.test (1304 of 2145)
PASS: lldb-shell :: SymbolFile/DWARF/dwp-separate-debug-file.cpp (1305 of 2145)
PASS: lldb-shell :: SymbolFile/DWARF/childless-compile-unit.s (1306 of 2145)
PASS: lldb-unit :: Process/gdb-remote/./ProcessGdbRemoteTests/GDBRemoteCommunicationClientTest.SendGetMetaDataPacket (1307 of 2145)
PASS: lldb-unit :: Interpreter/./InterpreterTests/CompletionTest.FileCompletionAbsolute (1308 of 2145)
PASS: lldb-unit :: ScriptInterpreter/Python/./ScriptInterpreterPythonTests/PythonDataObjectsTest.TestPythonListValueEquality (1309 of 2145)
PASS: lldb-unit :: UnwindAssembly/x86/./UnwindAssemblyx86Tests/Testx86AssemblyInspectionEngine.TestSpillRegToStackViaMOVx86_64 (1310 of 2145)
PASS: lldb-api :: functionalities/thread/concurrent_events/TestConcurrentTwoBreakpointThreads.py (1311 of 2145)
PASS: lldb-api :: functionalities/data-formatter/data-formatter-objc/TestDataFormatterObjCNSDate.py (1312 of 2145)
PASS: lldb-api :: functionalities/unwind/noreturn/TestNoreturnUnwind.py (1313 of 2145)
PASS: lldb-shell :: SymbolFile/Breakpad/symtab.test (1314 of 2145)
UNSUPPORTED: lldb-api :: tools/lldb-server/libraries-svr4/TestGdbRemoteLibrariesSvr4Support.py (1315 of 2145)
PASS: lldb-unit :: Host/./HostTests/File.GetWaitableHandleFileno (1316 of 2145)
PASS: lldb-api :: python_api/lldbutil/iter/TestRegistersIterator.py (1317 of 2145)
PASS: lldb-api :: lang/objc/foundation/TestObjCMethodsNSError.py (1318 of 2145)
PASS: lldb-shell :: SymbolFile/NativePDB/function-types-builtins.cpp (1319 of 2145)
PASS: lldb-unit :: Language/Highlighting/./HighlighterTests/HighlighterTest.DefaultHighlighterWithCursor (1320 of 2145)
PASS: lldb-unit :: Utility/./UtilityTests/DataExtractorTest.GetFloatUnaligned (1321 of 2145)
PASS: lldb-unit :: Utility/./UtilityTests/LogChannelEnabledTest.LogGetLogThread (1322 of 2145)
PASS: lldb-shell :: ObjectFile/wasm/embedded-debug-sections.yaml (1323 of 2145)
PASS: lldb-unit :: Language/Highlighting/./HighlighterTests/HighlighterTest.ClangCursorPosBeforeOtherToken (1324 of 2145)
PASS: lldb-unit :: UnwindAssembly/x86/./UnwindAssemblyx86Tests/Testx86AssemblyInspectionEngine.TestPopRBP (1325 of 2145)
PASS: lldb-unit :: Utility/./UtilityTests/BinaryStreamTest.PutSLEB128One (1326 of 2145)
PASS: lldb-api :: lang/objc/modules-update/TestClangModulesUpdate.py (1327 of 2145)
PASS: lldb-unit :: Utility/./UtilityTests/LogChannelEnabledTest.LLDB_LOG_ERROR (1328 of 2145)
PASS: lldb-api :: macosx/add-dsym/TestAddDsymMidExecutionCommand.py (1329 of 2145)
PASS: lldb-api :: tools/lldb-vscode/coreFile/TestVSCode_coreFile.py (1330 of 2145)
PASS: lldb-unit :: Utility/./UtilityTests/VASprintfTest.BufferResize (1331 of 2145)
PASS: lldb-api :: functionalities/data-formatter/data-formatter-objc/TestDataFormatterObjCNSContainer.py (1332 of 2145)
UNSUPPORTED: lldb-shell :: Register/x86-64-ymm16-read.test (1333 of 2145)
PASS: lldb-unit :: Utility/./UtilityTests/StringExtractorTest.DecodeHexU8_InvalidHex (1334 of 2145)
PASS: lldb-unit :: Process/minidump/./LLDBMinidumpTests/MinidumpParserTest.MinidumpDuplicateModuleMappedFirst (1335 of 2145)
PASS: lldb-unit :: Symbol/./SymbolTests/DWARFCallFrameInfoTest.Basic_eh (1336 of 2145)
PASS: lldb-unit :: Process/gdb-remote/./ProcessGdbRemoteTests/GDBRemoteCommunicationServerTest.SendErrorResponse_ErrorNumber (1337 of 2145)
PASS: lldb-unit :: Symbol/./SymbolTests/TestTypeSystemClang.TestGetTypeClassTypeOfExpr (1338 of 2145)
PASS: lldb-api :: python_api/lldbutil/iter/TestLLDBIterator.py (1339 of 2145)
PASS: lldb-api :: lang/cpp/std-function-step-into-callable/TestStdFunctionStepIntoCallable.py (1340 of 2145)
PASS: lldb-api :: functionalities/history/TestHistoryRecall.py (1341 of 2145)
PASS: lldb-api :: lang/objc/conflicting-definition/TestConflictingDefinition.py (1342 of 2145)
PASS: lldb-unit :: Utility/./UtilityTests/CompletionRequest.TryCompleteCurrentArgBad (1343 of 2145)
PASS: lldb-api :: functionalities/archives/TestBSDArchives.py (1344 of 2145)
PASS: lldb-api :: lang/cpp/template-function/TestTemplateFunctions.py (1345 of 2145)
PASS: lldb-api :: lang/c/modules/TestCModules.py (1346 of 2145)
PASS: lldb-unit :: Process/gdb-remote/./ProcessGdbRemoteTests/GDBRemoteCommunicationClientTest.SendStopTracePacket (1347 of 2145)
PASS: lldb-api :: tools/lldb-server/TestAppleSimulatorOSType.py (1348 of 2145)
PASS: lldb-api :: python_api/module_section/TestModuleAndSection.py (1349 of 2145)
PASS: lldb-api :: commands/expression/import_base_class_when_class_has_derived_member/TestImportBaseClassWhenClassHasDerivedMember.py (1350 of 2145)
PASS: lldb-shell :: Settings/TestDisableColor.test (1351 of 2145)
PASS: lldb-api :: lang/cpp/global_variables/TestCPPGlobalVariables.py (1352 of 2145)
PASS: lldb-api :: tools/lldb-server/inferior-crash/TestGdbRemoteSegFault.py (1353 of 2145)
UNSUPPORTED: lldb-api :: functionalities/darwin_log/filter/regex/activity-chain/TestDarwinLogFilterRegexActivityChain.py (1354 of 2145)
PASS: lldb-api :: macosx/lc-note/kern-ver-str/TestKernVerStrLCNOTE.py (1355 of 2145)
PASS: lldb-unit :: Process/gdb-remote/./ProcessGdbRemoteTests/GDBRemoteCommunicationClientTest.SendSignalsToIgnore (1356 of 2145)
PASS: lldb-unit :: Utility/./UtilityTests/Flags.Reset (1357 of 2145)
PASS: lldb-api :: functionalities/data-formatter/data-formatter-objc/TestDataFormatterObjCNSURL.py (1358 of 2145)
PASS: lldb-unit :: Utility/./UtilityTests/StreamTest.PutCString (1359 of 2145)
PASS: lldb-unit :: Utility/./UtilityTests/Flags.GetBitSize (1360 of 2145)
PASS: lldb-unit :: Core/./LLDBCoreTests/StreamCallbackTest.Callback (1361 of 2145)
PASS: lldb-api :: commands/watchpoints/watchpoint_commands/command/TestWatchpointCommandPython.py (1362 of 2145)
PASS: lldb-shell :: ObjectFile/ELF/PT_LOAD.yaml (1363 of 2145)
PASS: lldb-api :: commands/process/attach-resume/TestAttachResume.py (1364 of 2145)
PASS: lldb-unit :: Utility/./UtilityTests/BroadcasterTest.BroadcastEvent (1365 of 2145)
PASS: lldb-api :: python_api/breakpoint/TestBreakpointAPI.py (1366 of 2145)
PASS: lldb-unit :: Expression/./ExpressionTests/CppModuleConfigurationTest.Linux (1367 of 2145)
PASS: lldb-api :: commands/expression/radar_9673664/TestExprHelpExamples.py (1368 of 2145)
UNSUPPORTED: lldb-shell :: ExecControl/StopHook/stop-hook-threads.test (1369 of 2145)
PASS: lldb-shell :: SymbolFile/DWARF/DW_TAG_basic_type_DW_ATE_UTF_nonC.ll (1370 of 2145)
PASS: lldb-unit :: Utility/./UtilityTests/StructuredDataTest.StringDump (1371 of 2145)
PASS: lldb-api :: functionalities/data-formatter/ostypeformatting/TestFormattersOsType.py (1372 of 2145)
PASS: lldb-shell :: Driver/TestPositionalArgs.test (1373 of 2145)
PASS: lldb-api :: lang/objc/foundation/TestObjectDescriptionAPI.py (1374 of 2145)
PASS: lldb-shell :: SymbolFile/DWARF/clang-ast-from-dwarf-unamed-and-anon-structs.cpp (1375 of 2145)
UNSUPPORTED: lldb-api :: functionalities/data-formatter/data-formatter-stl/libstdcpp/tuple/TestDataFormatterStdTuple.py (1376 of 2145)
PASS: lldb-api :: lang/c/strings/TestCStrings.py (1377 of 2145)
PASS: lldb-shell :: SymbolFile/DWARF/dwarf5-partial-index.cpp (1378 of 2145)
PASS: lldb-unit :: UnwindAssembly/x86/./UnwindAssemblyx86Tests/Testx86AssemblyInspectionEngine.TestPopEBX (1379 of 2145)
PASS: lldb-unit :: Utility/./UtilityTests/RangeTest.LessThan (1380 of 2145)
PASS: lldb-shell :: Quit/TestQuitExitCodeNonInt.test (1381 of 2145)
PASS: lldb-api :: commands/expression/persistent_ptr_update/TestPersistentPtrUpdate.py (1382 of 2145)
PASS: lldb-shell :: SymbolFile/Breakpad/line-table-mixed-path-styles.test (1383 of 2145)
PASS: lldb-shell :: Breakpoint/split-dwarf-5-addrbase.test (1384 of 2145)
PASS: lldb-unit :: Utility/./UtilityTests/StringExtractorTest.GetHexU8_Underflow_NoEof (1385 of 2145)
PASS: lldb-api :: python_api/signals/TestSignalsAPI.py (1386 of 2145)
PASS: lldb-unit :: SymbolFile/NativePDB/./SymbolFileNativePDBTests/PDBFPOProgramToDWARFExpressionTests.InvalidAssignmentMultiple (1387 of 2145)
PASS: lldb-unit :: Process/./ProcessEventDataTests/ProcessEventDataTest.DoOnRemoval (1388 of 2145)
PASS: lldb-unit :: UnwindAssembly/x86/./UnwindAssemblyx86Tests/Testx86AssemblyInspectionEngine.TestPushRBP (1389 of 2145)
PASS: lldb-unit :: Language/Highlighting/./HighlighterTests/HighlighterTest.ClangCursorPosEndOfLine (1390 of 2145)
PASS: lldb-api :: lang/objc/bitfield_ivars/TestBitfieldIvars.py (1391 of 2145)
UNSUPPORTED: lldb-api :: functionalities/darwin_log/filter/regex/category/TestDarwinLogFilterRegexCategory.py (1392 of 2145)
PASS: lldb-unit :: SymbolFile/NativePDB/./SymbolFileNativePDBTests/PDBFPOProgramToDWARFExpressionTests.InvalidOpBinary (1393 of 2145)
PASS: lldb-api :: python_api/class_members/TestSBTypeClassMembers.py (1394 of 2145)
UNSUPPORTED: lldb-shell :: ScriptInterpreter/Lua/persistent_state.test (1395 of 2145)
PASS: lldb-api :: commands/expression/import-std-module/stack/TestStackFromStdModule.py (1396 of 2145)
PASS: lldb-api :: macosx/thread-names/TestInterruptThreadNames.py (1397 of 2145)
PASS: lldb-api :: lang/cpp/stl/TestStdCXXDisassembly.py (1398 of 2145)
PASS: lldb-unit :: Utility/./UtilityTests/StringListTest.AppendListCStringArray (1399 of 2145)
PASS: lldb-api :: functionalities/breakpoint/dummy_target_breakpoints/TestBreakpointsWithNoTargets.py (1400 of 2145)
PASS: lldb-shell :: Minidump/Windows/broken-unwind.test (1401 of 2145)
PASS: lldb-api :: lang/objc/objc-struct-argument/TestObjCStructArgument.py (1402 of 2145)
PASS: lldb-shell :: SymbolFile/DWARF/debug_loc.s (1403 of 2145)
PASS: lldb-unit :: SymbolFile/DWARF/./SymbolFileDWARFTests/SymbolFileDWARFTests.TestAbbrevValidAttrNullForm (1404 of 2145)
PASS: lldb-shell :: Reproducer/TestDebugSymbols.test (1405 of 2145)
PASS: lldb-api :: tools/lldb-server/TestGdbRemote_vCont.py (1406 of 2145)
PASS: lldb-api :: lang/c/enum_types/TestEnumTypes.py (1407 of 2145)
PASS: lldb-unit :: Language/Highlighting/./HighlighterTests/HighlighterTest.ClangTrailingBackslashWithWhitespace (1408 of 2145)
PASS: lldb-unit :: Host/./HostTests/SocketTest.TCPGetConnectURI (1409 of 2145)
UNSUPPORTED: lldb-api :: functionalities/data-formatter/data-formatter-stl/libstdcpp/vbool/TestDataFormatterStdVBool.py (1410 of 2145)
PASS: lldb-api :: commands/expression/import-std-module/deque-basic/TestDequeFromStdModule.py (1411 of 2145)
PASS: lldb-api :: tools/lldb-vscode/console/TestVSCode_console.py (1412 of 2145)
PASS: lldb-shell :: SymbolFile/DWARF/debug-types-missing-signature.test (1413 of 2145)
UNSUPPORTED: lldb-shell :: BuildScript/toolchain-clang-cl.test (1414 of 2145)
PASS: lldb-api :: lang/c/global_variables/TestGlobalVariables.py (1415 of 2145)
UNSUPPORTED: lldb-api :: functionalities/darwin_log/basic/TestDarwinLogBasic.py (1416 of 2145)
PASS: lldb-api :: functionalities/data-formatter/data-formatter-objc/TestDataFormatterObjCCF.py (1417 of 2145)
PASS: lldb-unit :: ObjectFile/Breakpad/./ObjectFileBreakpadTests/ModuleRecord.parse (1418 of 2145)
UNSUPPORTED: lldb-shell :: SymbolFile/PDB/enums-layout.test (1419 of 2145)
PASS: lldb-unit :: Utility/./UtilityTests/ArgsTest.TestSingleQuotedArgWithSpace (1420 of 2145)
UNSUPPORTED: lldb-api :: functionalities/darwin_log/filter/exact_match/activity-chain/TestDarwinLogFilterMatchActivityChain.py (1421 of 2145)
PASS: lldb-unit :: tools/lldb-server/tests/./LLDBServerTests/TestBase.LaunchModePreservesEnvironment (1422 of 2145)
PASS: lldb-api :: lang/objc/global_ptrs/TestGlobalObjects.py (1423 of 2145)
PASS: lldb-unit :: Symbol/./SymbolTests/DWARFCallFrameInfoTest.Basic_dwarf4 (1424 of 2145)
PASS: lldb-shell :: Minidump/fb-dump.test (1425 of 2145)
PASS: lldb-api :: functionalities/thread/concurrent_events/TestConcurrentDelaySignalBreak.py (1426 of 2145)
PASS: lldb-unit :: Utility/./UtilityTests/ArchSpecTest.TestParseMachCPUDashSubtypeTripleExtra (1427 of 2145)
PASS: lldb-unit :: Utility/./UtilityTests/FileSpecTest.EqualSeparator (1428 of 2145)
PASS: lldb-api :: lang/mixed/TestMixedLanguages.py (1429 of 2145)
PASS: lldb-api :: lang/cpp/bitfields/TestCppBitfields.py (1430 of 2145)
PASS: lldb-api :: functionalities/gdb_remote_client/TestRestartBug.py (1431 of 2145)
PASS: lldb-unit :: UnwindAssembly/x86/./UnwindAssemblyx86Tests/Testx86AssemblyInspectionEngine.Test64bitFramelessBigStackFrame (1432 of 2145)
PASS: lldb-unit :: SymbolFile/NativePDB/./SymbolFileNativePDBTests/PDBFPOProgramToDWARFExpressionTests.MultipleIndependentAssignments (1433 of 2145)
PASS: lldb-unit :: Utility/./UtilityTests/StringLexerTest.Next (1434 of 2145)
PASS: lldb-api :: functionalities/thread/concurrent_events/TestConcurrentDelaySignalWatch.py (1435 of 2145)
PASS: lldb-api :: functionalities/data-formatter/language_category_updates/TestDataFormatterLanguageCategoryUpdates.py (1436 of 2145)
PASS: lldb-api :: functionalities/thread_plan/TestThreadPlanCommands.py (1437 of 2145)
PASS: lldb-unit :: SymbolFile/NativePDB/./SymbolFileNativePDBTests/PDBFPOProgramToDWARFExpressionTests.InvalidOpUnary (1438 of 2145)
PASS: lldb-unit :: UnwindAssembly/x86/./UnwindAssemblyx86Tests/Testx86AssemblyInspectionEngine.TestPushESI (1439 of 2145)
PASS: lldb-unit :: Utility/./UtilityTests/StreamTest.PutCharWhitespace (1440 of 2145)
PASS: lldb-unit :: Symbol/./SymbolTests/TestTypeSystemClang.TestOwningModule (1441 of 2145)
PASS: lldb-unit :: API/./APITests/SBCommandInterpreterTest.SingleWordCommand (1442 of 2145)
PASS: lldb-api :: commands/expression/test/TestExprs2.py (1443 of 2145)
PASS: lldb-api :: functionalities/gdb_remote_client/TestqOffsets.py (1444 of 2145)
PASS: lldb-api :: functionalities/tail_call_frames/disambiguate_call_site/TestDisambiguateCallSite.py (1445 of 2145)
PASS: lldb-unit :: ScriptInterpreter/Python/./ScriptInterpreterPythonTests/PythonDataObjectsTest.TestPythonTupleValues (1446 of 2145)
PASS: lldb-shell :: SymbolFile/DWARF/dwarf5-debug_line.s (1447 of 2145)
PASS: lldb-unit :: Utility/./UtilityTests/VMRange.Reset (1448 of 2145)
PASS: lldb-unit :: Utility/./UtilityTests/FileSpecTest.FormatFileSpec (1449 of 2145)
PASS: lldb-api :: commands/platform/basic/TestPlatformPython.py (1450 of 2145)
UNSUPPORTED: lldb-shell :: SymbolFile/NativePDB/typedefs.cpp (1451 of 2145)
PASS: lldb-unit :: Process/minidump/./LLDBMinidumpTests/MinidumpParserTest.MinidumpDuplicateModuleMappedSecond (1452 of 2145)
PASS: lldb-unit :: Utility/./UtilityTests/ScalarTest.Equality (1453 of 2145)
PASS: lldb-unit :: Utility/./UtilityTests/XcodeSDKTest.GetCanonicalNameAndConstruct (1454 of 2145)
PASS: lldb-api :: commands/register/register/register_command/TestRegisters.py (1455 of 2145)
PASS: lldb-unit :: ScriptInterpreter/Python/./ScriptInterpreterPythonTests/PythonDataObjectsTest.TestPythonDictionaryToStructuredDictionary (1456 of 2145)
PASS: lldb-unit :: Utility/./UtilityTests/StringExtractorTest.GetHexBytesAvail_Partial (1457 of 2145)
PASS: lldb-unit :: DataFormatter/./LLDBFormatterTests/TypeMatcherTests.GetMatchStringExactName (1458 of 2145)
PASS: lldb-api :: commands/expression/weak_symbols/TestWeakSymbols.py (1459 of 2145)
PASS: lldb-unit :: Expression/./ExpressionTests/DiagnosticManagerTest.PutStringMultiple (1460 of 2145)
PASS: lldb-unit :: Host/./HostTests/MainLoopTest.UnmonitoredSignal (1461 of 2145)
PASS: lldb-unit :: Core/./LLDBCoreTests/MangledTest.NameIndexes_FindFunctionSymbols (1462 of 2145)
PASS: lldb-shell :: Settings/TestLineMarkerColor.test (1463 of 2145)
PASS: lldb-unit :: Utility/./UtilityTests/UriParserTest.Minimal (1464 of 2145)
PASS: lldb-api :: commands/platform/process/list/TestProcessList.py (1465 of 2145)
PASS: lldb-api :: functionalities/data-formatter/data-formatter-stl/libcxx/unordered/TestDataFormatterUnordered.py (1466 of 2145)
PASS: lldb-unit :: Utility/./UtilityTests/StringListTest.AppendStringCString (1467 of 2145)
PASS: lldb-unit :: Utility/./UtilityTests/DataExtractorTest.GetCStrUnterminated (1468 of 2145)
PASS: lldb-unit :: Target/./TargetTests/ModuleCacheTest.GetAndPutUuidExists (1469 of 2145)
PASS: lldb-unit :: Utility/./UtilityTests/PassiveReplayTest.InstrumentedBarRef (1470 of 2145)
PASS: lldb-api :: commands/expression/radar_8638051/Test8638051.py (1471 of 2145)
PASS: lldb-api :: functionalities/thread/concurrent_events/TestConcurrentWatchBreakDelay.py (1472 of 2145)
PASS: lldb-unit :: Interpreter/./InterpreterTests/CompletionTest.DirCompletionUsername (1473 of 2145)
PASS: lldb-shell :: Commands/command-regex-delete.test (1474 of 2145)
PASS: lldb-unit :: Utility/./UtilityTests/StreamTest.PutHex64ByteOrderLittle (1475 of 2145)
PASS: lldb-unit :: ScriptInterpreter/Python/./ScriptInterpreterPythonTests/PythonDataObjectsTest.TestPythonListManipulation (1476 of 2145)
PASS: lldb-unit :: Utility/./UtilityTests/Flags.IsClear (1477 of 2145)
PASS: lldb-unit :: Signals/./SignalsTests/UnixSignalsTest.VersionChange (1478 of 2145)
PASS: lldb-api :: lang/c/bitfields/TestBitfields.py (1479 of 2145)
PASS: lldb-unit :: Utility/./UtilityTests/ProcessInstanceInfo.DumpTable_invalidUID (1480 of 2145)
PASS: lldb-api :: functionalities/gdb_remote_client/TestGDBRemoteDiskFileCompletion.py (1481 of 2145)
PASS: lldb-api :: commands/expression/import-std-module/list-dbg-info-content/TestDbgInfoContentListFromStdModule.py (1482 of 2145)
PASS: lldb-unit :: Utility/./UtilityTests/UriParserTest.TypicalPortPathIPv6 (1483 of 2145)
PASS: lldb-unit :: Utility/./UtilityTests/StringLexerTest.AdvanceIf (1484 of 2145)
PASS: lldb-api :: functionalities/inferior-crashing/TestInferiorCrashingStep.py (1485 of 2145)
PASS: lldb-unit :: Expression/./ExpressionTests/DiagnosticManagerTest.AppendMessageSubsequentDiags (1486 of 2145)
PASS: lldb-unit :: Utility/./UtilityTests/RangeTest.DoesAdjoinOrIntersect (1487 of 2145)
PASS: lldb-api :: functionalities/data-formatter/nsdictionarysynth/TestNSDictionarySynthetic.py (1488 of 2145)
PASS: lldb-api :: functionalities/data-formatter/refpointer-recursion/TestDataFormatterRefPtrRecursion.py (1489 of 2145)
PASS: lldb-shell :: Settings/TestFrameFormatNoColor.test (1490 of 2145)
PASS: lldb-api :: python_api/section/TestSectionAPI.py (1491 of 2145)
PASS: lldb-unit :: Utility/./UtilityTests/VMRange.ContainsAddr (1492 of 2145)
PASS: lldb-unit :: Utility/./UtilityTests/OptionsWithRawTest.EmptySuffix (1493 of 2145)
PASS: lldb-api :: tools/lldb-server/TestGdbRemoteThreadsInStopReply.py (1494 of 2145)
PASS: lldb-api :: api/command-return-object/TestSBCommandReturnObject.py (1495 of 2145)
PASS: lldb-unit :: Utility/./UtilityTests/LogTest.Unregister (1496 of 2145)
PASS: lldb-shell :: Settings/TestStopCommandSourceOnError.test (1497 of 2145)
PASS: lldb-unit :: Utility/./UtilityTests/ScalarTest.Promotion (1498 of 2145)
PASS: lldb-unit :: Host/./HostTests/File.GetStreamFromDescriptor (1499 of 2145)
PASS: lldb-shell :: Driver/TestCore.test (1500 of 2145)
PASS: lldb-unit :: Utility/./UtilityTests/BinaryStreamTest.PutSLEB128SixBytes (1501 of 2145)
PASS: lldb-api :: tools/lldb-server/commandline/TestStubSetSID.py (1502 of 2145)
PASS: lldb-unit :: Target/./TargetTests/MemoryRegionInfoTest.Formatv (1503 of 2145)
PASS: lldb-unit :: Utility/./UtilityTests/FileSpecTest.EqualDotsPosix (1504 of 2145)
UNSUPPORTED: lldb-api :: arm/breakpoint-it/TestBreakpointIt.py (1505 of 2145)
PASS: lldb-unit :: Utility/./UtilityTests/StreamTest.AddressEmptyPrefix (1506 of 2145)
PASS: lldb-api :: macosx/load-kext/TestLoadKext.py (1507 of 2145)
PASS: lldb-unit :: UnwindAssembly/x86/./UnwindAssemblyx86Tests/Testx86AssemblyInspectionEngine.TestAddRSP (1508 of 2145)
UNSUPPORTED: lldb-shell :: Register/x86-zmm-write.test (1509 of 2145)
PASS: lldb-unit :: Host/./HostTests/HostInfoTest.GetHostname (1510 of 2145)
PASS: lldb-unit :: Host/./HostTests/SocketAddressTest.Set (1511 of 2145)
PASS: lldb-api :: types/TestCharTypeExpr.py (1512 of 2145)
PASS: lldb-unit :: Symbol/./SymbolTests/TestTypeSystemClang.TestIsClangType (1513 of 2145)
PASS: lldb-api :: terminal/TestEditline.py (1514 of 2145)
PASS: lldb-shell :: Process/UnsupportedLanguage.test (1515 of 2145)
PASS: lldb-unit :: Utility/./UtilityTests/LogTest.LLDB_LOG_nullptr (1516 of 2145)
PASS: lldb-api :: python_api/type/TestTypeList.py (1517 of 2145)
PASS: lldb-api :: python_api/sbenvironment/TestSBEnvironment.py (1518 of 2145)
PASS: lldb-unit :: Process/minidump/./LLDBMinidumpTests/MinidumpParserTest.InvalidMinidump (1519 of 2145)
PASS: lldb-unit :: Breakpoint/./LLDBBreakpointTests/BreakpointIDTest.StringIsBreakpointName (1520 of 2145)
PASS: lldb-shell :: Reproducer/Functionalities/TestImageList.test (1521 of 2145)
PASS: lldb-api :: functionalities/data-formatter/data-formatter-stl/libcxx/forward_list/TestDataFormatterLibcxxForwardList.py (1522 of 2145)
PASS: lldb-unit :: Symbol/./SymbolTests/DWARFCallFrameInfoTest.Basic_dwarf3 (1523 of 2145)
PASS: lldb-unit :: Utility/./UtilityTests/NameMatchesTest.RegularExpression (1524 of 2145)
PASS: lldb-api :: commands/watchpoints/watchpoint_set_command/TestWatchLocationWithWatchSet.py (1525 of 2145)
UNSUPPORTED: lldb-api :: tools/lldb-server/registers-target-xml-reading/TestGdbRemoteTargetXmlPacket.py (1526 of 2145)
PASS: lldb-unit :: Utility/./UtilityTests/ScalarTest.SetValueFromData (1527 of 2145)
PASS: lldb-unit :: Process/minidump/./LLDBMinidumpTests/MinidumpParserTest.GetLinuxProcStatus (1528 of 2145)
PASS: lldb-api :: tools/lldb-server/TestGdbRemoteSingleStep.py (1529 of 2145)
PASS: lldb-shell :: Commands/command-source.test (1530 of 2145)
PASS: lldb-unit :: Utility/./UtilityTests/UriParserTest.SchemeHostSeparator2 (1531 of 2145)
PASS: lldb-unit :: UnwindAssembly/x86/./UnwindAssemblyx86Tests/Testx86AssemblyInspectionEngine.TestPushEBX (1532 of 2145)
PASS: lldb-unit :: Symbol/./SymbolTests/TestTypeSystemClang.TestDisplayNameEmpty (1533 of 2145)
PASS: lldb-unit :: Host/./HostTests/NativeProcessProtocolTest.ReadCStringFromMemory (1534 of 2145)
PASS: lldb-unit :: Utility/./UtilityTests/StringLexerTest.HasAtLeast (1535 of 2145)
PASS: lldb-api :: python_api/file_handle/TestFileHandle.py (1536 of 2145)
PASS: lldb-api :: lang/objc/objc-new-syntax/TestObjCNewSyntaxLiteral.py (1537 of 2145)
PASS: lldb-api :: types/TestShortType.py (1538 of 2145)
PASS: lldb-unit :: Core/./LLDBCoreTests/MangledTest.ResultForBlockInvocation (1539 of 2145)
PASS: lldb-api :: lang/objc/exceptions/TestObjCExceptions.py (1540 of 2145)
PASS: lldb-unit :: Utility/./UtilityTests/StringExtractorTest.GetHexBytes (1541 of 2145)
PASS: lldb-shell :: SymbolFile/DWARF/static_scope.s (1542 of 2145)
PASS: lldb-unit :: Utility/./UtilityTests/ArchSpecTest.TestSetTriple (1543 of 2145)
PASS: lldb-unit :: DataFormatter/./LLDBFormatterTests/StringPrinterTests.SwiftUTF8 (1544 of 2145)
PASS: lldb-api :: lang/cpp/scope/TestCppScope.py (1545 of 2145)
PASS: lldb-api :: lang/cpp/type_lookup/TestCppTypeLookup.py (1546 of 2145)
PASS: lldb-shell :: SymbolFile/Breakpad/unwind-via-stack-win-no-memory-info.yaml (1547 of 2145)
PASS: lldb-api :: lang/cpp/unicode-literals/TestUnicodeLiterals.py (1548 of 2145)
PASS: lldb-shell :: Reproducer/TestSynchronous.test (1549 of 2145)
PASS: lldb-api :: commands/expression/unwind_expression/TestUnwindExpression.py (1550 of 2145)
PASS: lldb-api :: functionalities/tsan/thread_leak/TestTsanThreadLeak.py (1551 of 2145)
PASS: lldb-unit :: Symbol/./SymbolTests/TestClangASTImporter.MetadataPropagation (1552 of 2145)
PASS: lldb-api :: lang/cpp/unique-types/TestUniqueTypes.py (1553 of 2145)
PASS: lldb-shell :: Reproducer/Modules/TestModuleCXX.test (1554 of 2145)
PASS: lldb-api :: functionalities/object-file/TestImageListMultiArchitecture.py (1555 of 2145)
PASS: lldb-unit :: Utility/./UtilityTests/RangeTest.Equal (1556 of 2145)
PASS: lldb-unit :: Utility/./UtilityTests/AnsiTerminal.Basic (1557 of 2145)
PASS: lldb-unit :: Utility/./UtilityTests/StringLexerTest.NextIfList (1558 of 2145)
PASS: lldb-unit :: ScriptInterpreter/Python/./ScriptInterpreterPythonTests/PythonDataObjectsTest.TestRun (1559 of 2145)
PASS: lldb-unit :: Utility/./UtilityTests/StringListTest.JoinSingle (1560 of 2145)
UNSUPPORTED: lldb-api :: arm/breakpoint-thumb-codesection/TestBreakpointThumbCodesection.py (1561 of 2145)
PASS: lldb-api :: functionalities/data-formatter/boolreference/TestFormattersBoolRefPtr.py (1562 of 2145)
PASS: lldb-shell :: Reproducer/Functionalities/TestDataFormatter.test (1563 of 2145)
PASS: lldb-unit :: Utility/./UtilityTests/StringListTest.LongestCommonPrefixEmpty (1564 of 2145)
PASS: lldb-unit :: Symbol/./SymbolTests/TestClangASTImporter.CopyDeclTagDecl (1565 of 2145)
PASS: lldb-api :: functionalities/limit-debug-info/TestLimitDebugInfo.py (1566 of 2145)
PASS: lldb-api :: commands/expression/issue_11588/Test11588.py (1567 of 2145)
PASS: lldb-api :: commands/expression/call-function/TestCallBuiltinFunction.py (1568 of 2145)
PASS: lldb-unit :: ScriptInterpreter/Python/./ScriptInterpreterPythonTests/PythonDataObjectsTest.TestExtractingUInt64ThroughStructuredData (1569 of 2145)
PASS: lldb-api :: lang/c/forward/TestForwardDeclaration.py (1570 of 2145)
PASS: lldb-shell :: Unwind/trap_frame_sym_ctx.test (1571 of 2145)
PASS: lldb-shell :: Driver/LocalLLDBInit.test (1572 of 2145)
PASS: lldb-api :: python_api/watchpoint/watchlocation/TestTargetWatchAddress.py (1573 of 2145)
PASS: lldb-api :: python_api/sblaunchinfo/TestSBLaunchInfo.py (1574 of 2145)
PASS: lldb-api :: lang/c/tls_globals/TestTlsGlobals.py (1575 of 2145)
PASS: lldb-unit :: Utility/./UtilityTests/UriParserTest.BracketedHostname (1576 of 2145)
PASS: lldb-api :: lang/cpp/inlines/TestInlines.py (1577 of 2145)
PASS: lldb-api :: lang/cpp/subst_template_type_param/TestSubstTemplateTypeParam.py (1578 of 2145)
PASS: lldb-unit :: Utility/./UtilityTests/BinaryStreamTest.PutULEB128FiveBytes (1579 of 2145)
PASS: lldb-api :: commands/settings/use_source_cache/TestUseSourceCache.py (1580 of 2145)
PASS: lldb-shell :: ObjectFile/ELF/section-addresses.yaml (1581 of 2145)
PASS: lldb-api :: functionalities/postmortem/minidump-new/TestMiniDumpNew.py (1582 of 2145)
PASS: lldb-api :: macosx/save_crashlog/TestSaveCrashlog.py (1583 of 2145)
UNSUPPORTED: lldb-api :: lang/cpp/function-template-parameter-pack/TestFunctionTemplateParameterPack.py (1584 of 2145)
PASS: lldb-api :: commands/frame/diagnose/local-variable/TestLocalVariable.py (1585 of 2145)
PASS: lldb-api :: python_api/value/change_values/TestChangeValueAPI.py (1586 of 2145)
UNSUPPORTED: lldb-shell :: Register/aarch64-gp-read.test (1587 of 2145)
PASS: lldb-unit :: Language/Highlighting/./HighlighterTests/HighlighterTest.FallbackHighlighter (1588 of 2145)
PASS: lldb-api :: lang/cpp/multiple-inheritance/TestCppMultipleInheritance.py (1589 of 2145)
PASS: lldb-unit :: Utility/./UtilityTests/StringListTest.AppendList (1590 of 2145)
PASS: lldb-api :: commands/expression/no-deadlock/TestExprDoesntBlock.py (1591 of 2145)
PASS: lldb-api :: functionalities/tail_call_frames/ambiguous_tail_call_seq2/TestAmbiguousTailCallSeq2.py (1592 of 2145)
PASS: lldb-unit :: Process/gdb-remote/./ProcessGdbRemoteTests/GDBRemoteCommunicationClientTest.SendGetTraceConfigPacket (1593 of 2145)
PASS: lldb-shell :: Settings/TestEchoCommands.test (1594 of 2145)
PASS: lldb-api :: lang/cpp/wchar_t/TestCxxWCharT.py (1595 of 2145)
PASS: lldb-shell :: SymbolFile/Breakpad/unwind-via-stack-cfi.test (1596 of 2145)
PASS: lldb-unit :: ObjectFile/MachO/./ObjectFileMachOTests/ObjectFileMachOTest.ModuleFromSharedCacheInfo (1597 of 2145)
PASS: lldb-unit :: Host/./HostTests/SocketTest.TCPListen0ConnectAccept (1598 of 2145)
PASS: lldb-unit :: Process/minidump/./LLDBMinidumpTests/MinidumpParserTest.GetExceptionStream (1599 of 2145)
PASS: lldb-api :: lang/objc/objc-static-method/TestObjCStaticMethod.py (1600 of 2145)
PASS: lldb-unit :: Utility/./UtilityTests/ConstStringTest.NullAndEmptyStates (1601 of 2145)
PASS: lldb-unit :: Utility/./UtilityTests/AnsiTerminal.Empty (1602 of 2145)
PASS: lldb-unit :: Utility/./UtilityTests/GeneratorTest.GetOrCreate (1603 of 2145)
PASS: lldb-unit :: Utility/./UtilityTests/BinaryStreamTest.PutSLEB128FiveBytes (1604 of 2145)
PASS: lldb-api :: commands/watchpoints/watchpoint_commands/command/TestWatchpointCommandLLDB.py (1605 of 2145)
PASS: lldb-api :: functionalities/data-formatter/data-formatter-proper-plurals/TestFormattersOneIsSingular.py (1606 of 2145)
PASS: lldb-unit :: Utility/./UtilityTests/UriParserTest.MinimalPath (1607 of 2145)
UNSUPPORTED: lldb-api :: commands/register/register/intel_xtended_registers/mpx_bound_violation/TestBoundViolation.py (1608 of 2145)
PASS: lldb-unit :: Expression/./ExpressionTests/DiagnosticManagerTest.GetStringNoDiags (1609 of 2145)
PASS: lldb-unit :: Utility/./UtilityTests/FileSpecTest.PrependPathComponent (1610 of 2145)
PASS: lldb-api :: python_api/formatters/TestFormattersSBAPI.py (1611 of 2145)
PASS: lldb-unit :: Host/./HostTests/FileSystemTest.GetByteSize (1612 of 2145)
PASS: lldb-api :: functionalities/unwind/zeroth_frame/TestZerothFrame.py (1613 of 2145)
PASS: lldb-shell :: ObjectFile/wasm/basic.yaml (1614 of 2145)
PASS: lldb-api :: commands/expression/regression-access-function-template-in-record/TestRegressionAccessFunctionTemplateInRecord.py (1615 of 2145)
PASS: lldb-unit :: Expression/./ExpressionTests/DiagnosticManagerTest.AppendMessageAttachToLastDiag (1616 of 2145)
PASS: lldb-shell :: SymbolFile/DWARF/find-inline-method.s (1617 of 2145)
PASS: lldb-unit :: Utility/./UtilityTests/TimerTest.CategoryTimesNested (1618 of 2145)
PASS: lldb-api :: lang/c/stepping/TestThreadStepping.py (1619 of 2145)
PASS: lldb-unit :: Expression/./ExpressionTests/CppModuleConfigurationTest.Xcode (1620 of 2145)
PASS: lldb-unit :: Expression/./ExpressionTests/DWARFExpression.DW_OP_convert (1621 of 2145)
PASS: lldb-api :: functionalities/step-avoids-no-debug/TestStepNoDebug.py (1622 of 2145)
PASS: lldb-api :: functionalities/data-formatter/type_summary_list_script/TestTypeSummaryListScript.py (1623 of 2145)
PASS: lldb-shell :: Commands/command-thread-select.test (1624 of 2145)
PASS: lldb-unit :: Signals/./SignalsTests/UnixSignalsTest.GetInfo (1625 of 2145)
PASS: lldb-unit :: ScriptInterpreter/Python/./ScriptInterpreterPythonTests/PythonDataObjectsTest.TestPythonBytes (1626 of 2145)
PASS: lldb-api :: commands/expression/options/TestExprOptions.py (1627 of 2145)
PASS: lldb-unit :: Expression/./ExpressionTests/CppModuleConfigurationTest.IgnoreLibStdCpp (1628 of 2145)
PASS: lldb-api :: commands/platform/file/read/TestPlatformFileRead.py (1629 of 2145)
UNSUPPORTED: lldb-shell :: ScriptInterpreter/Lua/independent_state.test (1630 of 2145)
PASS: lldb-unit :: UnwindAssembly/x86/./UnwindAssemblyx86Tests/Testx86AssemblyInspectionEngine.TestPushECX (1631 of 2145)
PASS: lldb-unit :: Utility/./UtilityTests/ArgsTest.AppendArguments (1632 of 2145)
PASS: lldb-api :: functionalities/thread/exit_during_step/TestExitDuringStep.py (1633 of 2145)
PASS: lldb-unit :: Expression/./ExpressionTests/DWARFExpression.DW_OP_piece (1634 of 2145)
PASS: lldb-api :: functionalities/rerun/TestRerun.py (1635 of 2145)
PASS: lldb-unit :: Process/minidump/./LLDBMinidumpTests/MinidumpParserTest.GetPidWow64 (1636 of 2145)
UNSUPPORTED: lldb-shell :: SymbolFile/target-symbols-add-unwind.test (1637 of 2145)
PASS: lldb-unit :: Utility/./UtilityTests/RangeDataVector.FindEntryIndexesThatContain_Overlap (1638 of 2145)
PASS: lldb-unit :: Host/./HostTests/SocketAddressTest.GetAddressInfo (1639 of 2145)
PASS: lldb-api :: functionalities/wrong_commands/TestWrongCommands.py (1640 of 2145)
PASS: lldb-shell :: ObjectFile/PECOFF/export-dllfunc.yaml (1641 of 2145)
PASS: lldb-unit :: Expression/./ExpressionTests/DiagnosticManagerTest.GetStringMultipleDiags (1642 of 2145)
PASS: lldb-unit :: Expression/./ExpressionTests/DWARFExpression.DW_OP_stack_value (1643 of 2145)
PASS: lldb-api :: python_api/symbol-context/TestSymbolContext.py (1644 of 2145)
PASS: lldb-api :: lang/objc/rdar-10967107/TestRdar10967107.py (1645 of 2145)
PASS: lldb-unit :: Core/./LLDBCoreTests/RichManglingContextTest.Basic (1646 of 2145)
PASS: lldb-api :: commands/expression/class_template_specialization_empty_pack/TestClassTemplateSpecializationParametersHandling.py (1647 of 2145)
PASS: lldb-unit :: ScriptInterpreter/Python/./ScriptInterpreterPythonTests/PythonDataObjectsTest.TestGlobalNameResolutionWithDot (1648 of 2145)
PASS: lldb-api :: commands/expression/completion/TestExprCompletion.py (1649 of 2145)
PASS: lldb-shell :: SymbolFile/DWARF/debug_ranges-missing-section.s (1650 of 2145)
PASS: lldb-unit :: Process/minidump/./LLDBMinidumpTests/MinidumpParserTest.GetLinuxProcStatus_no_stream (1651 of 2145)
PASS: lldb-api :: commands/expression/import-std-module/weak_ptr-dbg-info-content/TestDbgInfoContentWeakPtrFromStdModule.py (1652 of 2145)
PASS: lldb-api :: iohandler/resize/TestIOHandlerResizeNoEditline.py (1653 of 2145)
PASS: lldb-unit :: Utility/./UtilityTests/UriParserTest.TypicalPortPathIPv4 (1654 of 2145)
PASS: lldb-unit :: Symbol/./SymbolTests/TestTypeSystemClang.TestGetEnumIntegerTypeUnexpectedType (1655 of 2145)
PASS: lldb-unit :: Utility/./UtilityTests/NameMatchesTest.Equals (1656 of 2145)
PASS: lldb-api :: commands/expression/import-std-module/shared_ptr-dbg-info-content/TestSharedPtrDbgInfoContentFromStdModule.py (1657 of 2145)
PASS: lldb-unit :: Expression/./ExpressionTests/CppModuleConfigurationTest.UnrelatedLibrary (1658 of 2145)
UNSUPPORTED: lldb-shell :: SymbolFile/PDB/function-level-linking.test (1659 of 2145)
PASS: lldb-unit :: Utility/./UtilityTests/StringExtractorTest.GetHexU8_Exact (1660 of 2145)
UNSUPPORTED: lldb-shell :: Register/x86-64-zmm-read.test (1661 of 2145)
PASS: lldb-unit :: Language/CPlusPlus/./LanguageCPlusPlusTests/CPlusPlusLanguage.FindAlternateFunctionManglings (1662 of 2145)
PASS: lldb-api :: types/TestIntegerTypeExpr.py (1663 of 2145)
PASS: lldb-api :: lang/cpp/this_class_type_mixing/TestThisClassTypeMixing.py (1664 of 2145)
PASS: lldb-api :: lang/c/complex_int/TestComplexInt.py (1665 of 2145)
UNSUPPORTED: lldb-api :: functionalities/data-formatter/data-formatter-stl/libstdcpp/iterator/TestDataFormatterStdIterator.py (1666 of 2145)
PASS: lldb-shell :: SymbolFile/DWARF/debug-types-address-ranges.s (1667 of 2145)
PASS: lldb-shell :: ObjectFile/ELF/build-id-case.yaml (1668 of 2145)
PASS: lldb-unit :: Utility/./UtilityTests/RangeTest.Constructor (1669 of 2145)
PASS: lldb-api :: commands/frame/diagnose/dereference-argument/TestDiagnoseDereferenceArgument.py (1670 of 2145)
PASS: lldb-unit :: Utility/./UtilityTests/ScalarTest.Getters (1671 of 2145)
PASS: lldb-shell :: ObjectFile/ELF/PT_LOAD-overlap-PT_TLS.yaml (1672 of 2145)
PASS: lldb-shell :: SymbolFile/DWARF/DW_TAG_variable-invalid_location.s (1673 of 2145)
PASS: lldb-api :: tools/lldb-vscode/launch/TestVSCode_launch.py (1674 of 2145)
PASS: lldb-shell :: SymbolFile/Breakpad/line-table-missing-file.test (1675 of 2145)
PASS: lldb-unit :: Utility/./UtilityTests/DataExtractorTest.GetCStrAtEnd (1676 of 2145)
PASS: lldb-shell :: ObjectFile/PECOFF/sections-names.yaml (1677 of 2145)
PASS: lldb-unit :: Utility/./UtilityTests/StringListTest.AppendStringStdString (1678 of 2145)
PASS: lldb-shell :: SymbolFile/NativePDB/bitfields.cpp (1679 of 2145)
PASS: lldb-shell :: Minidump/memory-region.yaml (1680 of 2145)
PASS: lldb-shell :: BuildScript/script-args.test (1681 of 2145)
PASS: lldb-api :: iohandler/completion/TestIOHandlerCompletion.py (1682 of 2145)
PASS: lldb-api :: tools/lldb-server/inferior-crash/TestGdbRemoteAbort.py (1683 of 2145)
PASS: lldb-api :: lang/c/set_values/TestSetValues.py (1684 of 2145)
PASS: lldb-api :: functionalities/thread/concurrent_events/TestConcurrentTwoBreakpointsOneDelaySignal.py (1685 of 2145)
PASS: lldb-api :: commands/expression/xvalue/TestXValuePrinting.py (1686 of 2145)
PASS: lldb-unit :: Process/gdb-remote/./ProcessGdbRemoteTests/GDBRemoteCommunicationClientTest.GetModulesInfoInvalidResponse (1687 of 2145)
PASS: lldb-unit :: SymbolFile/DWARF/./SymbolFileDWARFTests/SymbolFileDWARFTests.ParseArangesNonzeroSegmentSize (1688 of 2145)
PASS: lldb-unit :: Process/gdb-remote/./ProcessGdbRemoteTests/GDBRemoteClientBaseTest.SendContinueDelegateStructuredDataReceipt (1689 of 2145)
PASS: lldb-unit :: Expression/./ExpressionTests/CppModuleConfigurationTest.Sysroot (1690 of 2145)
PASS: lldb-unit :: Utility/./UtilityTests/StructuredDataTest.ParseJSONFromFile (1691 of 2145)
PASS: lldb-api :: python_api/function_symbol/TestSymbolAPI.py (1692 of 2145)
PASS: lldb-api :: lang/cpp/namespace/TestNamespaceLookup.py (1693 of 2145)
PASS: lldb-api :: macosx/universal/TestUniversal.py (1694 of 2145)
PASS: lldb-api :: linux/builtin_trap/TestBuiltinTrap.py (1695 of 2145)
PASS: lldb-unit :: Utility/./UtilityTests/StringExtractorTest.GetHexBytesAvail_FullString (1696 of 2145)
PASS: lldb-unit :: Symbol/./SymbolTests/TestClangASTImporter.RecordLayout (1697 of 2145)
PASS: lldb-shell :: ObjectFile/PECOFF/sections.yaml (1698 of 2145)
PASS: lldb-unit :: Host/./HostTests/MainLoopTest.DetectsEOF (1699 of 2145)
PASS: lldb-api :: functionalities/data-formatter/data-formatter-stl/libcxx/unique_ptr/TestDataFormatterLibcxxUniquePtr.py (1700 of 2145)
PASS: lldb-unit :: Utility/./UtilityTests/EnvironmentTest.EnvpConversion (1701 of 2145)
PASS: lldb-api :: functionalities/thread/concurrent_events/TestConcurrentSignalBreak.py (1702 of 2145)
PASS: lldb-api :: functionalities/data-formatter/data-formatter-stl/libcxx/set/TestDataFormatterLibcxxSet.py (1703 of 2145)
PASS: lldb-api :: types/TestFloatTypesExpr.py (1704 of 2145)
PASS: lldb-api :: tools/lldb-server/TestGdbRemoteExitCode.py (1705 of 2145)
PASS: lldb-unit :: Utility/./UtilityTests/ScalarTest.ComparisonFloat (1706 of 2145)
PASS: lldb-api :: lang/cpp/signed_types/TestSignedTypes.py (1707 of 2145)
PASS: lldb-unit :: Symbol/./SymbolTests/TestTypeSystemClang.TestGetBasicTypeFromName (1708 of 2145)
PASS: lldb-api :: commands/frame/select/TestFrameSelect.py (1709 of 2145)
PASS: lldb-unit :: Utility/./UtilityTests/VASprintfTest.NoBufferResize (1710 of 2145)
PASS: lldb-api :: commands/expression/import-std-module/list/TestListFromStdModule.py (1711 of 2145)
PASS: lldb-unit :: Utility/./UtilityTests/ArgsTest.ReplaceArgumentAtIndexShort (1712 of 2145)
PASS: lldb-api :: lang/objc/objc-struct-return/TestObjCStructReturn.py (1713 of 2145)
PASS: lldb-unit :: Process/minidump/./LLDBMinidumpTests/MinidumpParserTest.GetThreadContext_x86_32 (1714 of 2145)
UNSUPPORTED: lldb-shell :: Register/x86-ymm-read.test (1715 of 2145)
PASS: lldb-unit :: Utility/./UtilityTests/VMRange.SetEndAddress (1716 of 2145)
PASS: lldb-api :: lang/cpp/typeof/TestTypeOfDeclTypeExpr.py (1717 of 2145)
PASS: lldb-api :: lang/cpp/incomplete-types/TestCppIncompleteTypes.py (1718 of 2145)
PASS: lldb-api :: tools/lldb-vscode/breakpoint/TestVSCode_setBreakpoints.py (1719 of 2145)
PASS: lldb-unit :: Process/gdb-remote/./ProcessGdbRemoteTests/GDBRemoteCommunicationClientTest.TestPacketSpeedJSON (1720 of 2145)
PASS: lldb-api :: lang/objc/orderedset/TestOrderedSet.py (1721 of 2145)
PASS: lldb-shell :: ObjectFile/PECOFF/basic-info-arm.yaml (1722 of 2145)
PASS: lldb-api :: commands/add-dsym/uuid/TestAddDsymCommand.py (1723 of 2145)
UNSUPPORTED: lldb-shell :: SymbolFile/PDB/func-symbols.test (1724 of 2145)
PASS: lldb-unit :: Utility/./UtilityTests/XcodeSDKTest.MergeTest (1725 of 2145)
PASS: lldb-shell :: SymbolFile/DWARF/find-basic-function.cpp (1726 of 2145)
UNSUPPORTED: lldb-shell :: Process/Windows/exception_access_violation.cpp (1727 of 2145)
PASS: lldb-api :: api/multithreaded/TestMultithreaded.py (1728 of 2145)
PASS: lldb-unit :: Utility/./UtilityTests/UriParserTest.BracketedHostnameWithColon (1729 of 2145)
PASS: lldb-unit :: DataFormatter/./LLDBFormatterTests/TypeMatcherTests.CreatedBySameMatchStringExactNamePrefixes (1730 of 2145)
PASS: lldb-unit :: tools/lldb-server/tests/./LLDBServerTests/TestBase.DebugserverEnv (1731 of 2145)
UNSUPPORTED: lldb-api :: linux/thread/create_during_instruction_step/TestCreateDuringInstructionStep.py (1732 of 2145)
PASS: lldb-unit :: Utility/./UtilityTests/FileSpecTest.IsRelative (1733 of 2145)
PASS: lldb-api :: functionalities/thread/concurrent_events/TestConcurrentCrashWithWatchpointBreakpointSignal.py (1734 of 2145)
PASS: lldb-api :: functionalities/data-formatter/data-formatter-caching/TestDataFormatterCaching.py (1735 of 2145)
UNSUPPORTED: lldb-shell :: ScriptInterpreter/Lua/quit.test (1736 of 2145)
PASS: lldb-api :: functionalities/data-formatter/data-formatter-stl/libcxx/multiset/TestDataFormatterLibcxxMultiSet.py (1737 of 2145)
PASS: lldb-unit :: Utility/./UtilityTests/AnsiTerminal.AtStart (1738 of 2145)
PASS: lldb-unit :: Language/Highlighting/./HighlighterTests/HighlighterTest.HighlighterSelectionPath (1739 of 2145)
PASS: lldb-api :: lang/c/conflicting-symbol/TestConflictingSymbol.py (1740 of 2145)
PASS: lldb-unit :: ScriptInterpreter/Python/./ScriptInterpreterPythonTests/PythonDataObjectsTest.TestCallable (1741 of 2145)
PASS: lldb-api :: functionalities/gdb_remote_client/TestWasm.py (1742 of 2145)
PASS: lldb-api :: api/listeners/TestListener.py (1743 of 2145)
PASS: lldb-unit :: Utility/./UtilityTests/VMRange.Comparison (1744 of 2145)
PASS: lldb-unit :: SymbolFile/DWARF/./SymbolFileDWARFTests/SymbolFileDWARFTests.TestAbbrevInvalidNULLTag (1745 of 2145)
UNSUPPORTED: lldb-api :: functionalities/thread/state/TestThreadStates.py (1746 of 2145)
PASS: lldb-unit :: Utility/./UtilityTests/RangeTest.DefaultConstructor (1747 of 2145)
PASS: lldb-unit :: Utility/./UtilityTests/ScalarTest.Division (1748 of 2145)
PASS: lldb-shell :: Driver/TestRepl.test (1749 of 2145)
PASS: lldb-unit :: Utility/./UtilityTests/ScalarTest.GetValue (1750 of 2145)
PASS: lldb-shell :: SymbolFile/NativePDB/global-classes.cpp (1751 of 2145)
PASS: lldb-unit :: ScriptInterpreter/Python/./ScriptInterpreterPythonTests/PythonDataObjectsTest.TestModuleNameResolutionNoDot (1752 of 2145)
PASS: lldb-unit :: Utility/./UtilityTests/RangeTest.ContainsRangeStartingFromZero (1753 of 2145)
PASS: lldb-unit :: Utility/./UtilityTests/DataExtractorTest.GetDoubleUnaligned (1754 of 2145)
PASS: lldb-unit :: SymbolFile/NativePDB/./SymbolFileNativePDBTests/PDBFPOProgramToDWARFExpressionTests.UnresolvedRegisterAssignmentReference (1755 of 2145)
PASS: lldb-unit :: Utility/./UtilityTests/BinaryStreamTest.PutULEB128Zero (1756 of 2145)
PASS: lldb-unit :: Utility/./UtilityTests/StringExtractorTest.DecodeHexU8_InvalidHex2 (1757 of 2145)
UNSUPPORTED: lldb-shell :: Register/x86-64-gp-write.test (1758 of 2145)
UNSUPPORTED: lldb-shell :: Reproducer/TestLuaImport.test (1759 of 2145)
PASS: lldb-unit :: UnwindAssembly/x86/./UnwindAssemblyx86Tests/Testx86AssemblyInspectionEngine.TestPushEAX (1760 of 2145)
PASS: lldb-unit :: Expression/./ExpressionTests/DWARFExpression.DW_OP_unknown (1761 of 2145)
PASS: lldb-api :: commands/expression/import-std-module/no-std-module/TestMissingStdModule.py (1762 of 2145)
PASS: lldb-unit :: Utility/./UtilityTests/StringListTest.GetMaxStringLengthDecreasingSize (1763 of 2145)
PASS: lldb-api :: functionalities/tail_call_frames/disambiguate_tail_call_seq/TestDisambiguateTailCallSeq.py (1764 of 2145)
PASS: lldb-api :: functionalities/tail_call_frames/cross_object/TestCrossObjectTailCalls.py (1765 of 2145)
PASS: lldb-api :: python_api/watchpoint/condition/TestWatchpointConditionAPI.py (1766 of 2145)
PASS: lldb-shell :: ObjectFile/PECOFF/basic-info.yaml (1767 of 2145)
PASS: lldb-api :: tools/lldb-server/TestGdbRemoteProcessInfo.py (1768 of 2145)
PASS: lldb-unit :: Utility/./UtilityTests/StreamTeeTest.SetStreamAtIndexOutOfBounds (1769 of 2145)
PASS: lldb-api :: functionalities/thread/concurrent_events/TestConcurrentSignalDelayBreak.py (1770 of 2145)
PASS: lldb-api :: macosx/thread_suspend/TestInternalThreadSuspension.py (1771 of 2145)
PASS: lldb-unit :: Utility/./UtilityTests/RangeTest.Clear (1772 of 2145)
PASS: lldb-shell :: ObjectFile/PECOFF/invalid-export-table.yaml (1773 of 2145)
UNSUPPORTED: lldb-shell :: SymbolFile/DWARF/DW_TAG_GNU_call_site-DW_AT_low_pc.s (1774 of 2145)
PASS: lldb-shell :: Breakpoint/split-dwarf5-debug-stroffsets.test (1775 of 2145)
PASS: lldb-api :: python_api/frame/get-variables/TestGetVariables.py (1776 of 2145)
PASS: lldb-api :: lang/objc/modules-compile-error/TestModulesCompileError.py (1777 of 2145)
UNSUPPORTED: lldb-api :: functionalities/signal/handle-segv/TestHandleSegv.py (1778 of 2145)
PASS: lldb-unit :: Utility/./UtilityTests/UriParserTest.BracketedHostnamePort (1779 of 2145)
PASS: lldb-api :: functionalities/data-formatter/type_summary_list_arg/TestTypeSummaryListArg.py (1780 of 2145)
PASS: lldb-api :: functionalities/ptr_refs/TestPtrRefs.py (1781 of 2145)
PASS: lldb-unit :: Utility/./UtilityTests/BinaryStreamTest.PutSLEB128OneByte (1782 of 2145)
UNSUPPORTED: lldb-shell :: SymbolFile/PDB/type-quals.test (1783 of 2145)
PASS: lldb-api :: commands/expression/codegen-crash-typedefdecl-not-in_declcontext/TestCodegenCrashTypedefDeclNotInDeclContext.py (1784 of 2145)
PASS: lldb-unit :: Platform/Android/./AdbClientTests/AdbClientTest.CreateByDeviceId_ByEnvVar (1785 of 2145)
PASS: lldb-unit :: UnwindAssembly/x86/./UnwindAssemblyx86Tests/Testx86AssemblyInspectionEngine.TestPopEBP (1786 of 2145)
PASS: lldb-unit :: Utility/./UtilityTests/BinaryStreamTest.PutULEB128TwoBytes (1787 of 2145)
PASS: lldb-shell :: SymbolFile/DWARF/debug_line-relative_path.s (1788 of 2145)
PASS: lldb-api :: commands/watchpoints/multiple_hits/TestMultipleHits.py (1789 of 2145)
PASS: lldb-unit :: ObjectFile/Breakpad/./ObjectFileBreakpadTests/FileRecord.parse (1790 of 2145)
PASS: lldb-unit :: Utility/./UtilityTests/StringListTest.SplitIntoLinesSingleTrailingCR (1791 of 2145)
PASS: lldb-api :: commands/expression/persistent_types/TestNestedPersistentTypes.py (1792 of 2145)
PASS: lldb-api :: functionalities/breakpoint/address_breakpoints/TestBadAddressBreakpoints.py (1793 of 2145)
UNSUPPORTED: lldb-api :: commands/target/auto-install-main-executable/TestAutoInstallMainExecutable.py (1794 of 2145)
PASS: lldb-unit :: Interpreter/./InterpreterTests/OptionArgParserTest.toScriptLanguage (1795 of 2145)
PASS: lldb-api :: lang/objc/foundation/TestObjCMethodsNSArray.py (1796 of 2145)
UNSUPPORTED: lldb-shell :: Register/x86-ymm-write.test (1797 of 2145)
PASS: lldb-api :: types/TestDoubleTypes.py (1798 of 2145)
PASS: lldb-api :: python_api/watchpoint/watchlocation/TestSetWatchlocation.py (1799 of 2145)
PASS: lldb-shell :: Reproducer/TestCaptureEnvOverride.test (1800 of 2145)
PASS: lldb-api :: commands/statistics/basic/TestStats.py (1801 of 2145)
PASS: lldb-api :: commands/watchpoints/step_over_watchpoint/TestStepOverWatchpoint.py (1802 of 2145)
PASS: lldb-unit :: Utility/./UtilityTests/StreamTest.PutHex32ByteOrderLittle (1803 of 2145)
PASS: lldb-unit :: Signals/./SignalsTests/UnixSignalsTest.GetFilteredSignals (1804 of 2145)
PASS: lldb-api :: commands/command/source/TestCommandSource.py (1805 of 2145)
PASS: lldb-api :: commands/watchpoints/watchpoint_commands/TestWatchpointCommands.py (1806 of 2145)
PASS: lldb-unit :: Process/minidump/./LLDBMinidumpTests/MinidumpParserTest.FindMemoryRangeWithFullMemoryMinidump (1807 of 2145)
PASS: lldb-unit :: debugserver/./debugserverTests/RNBSocket.LoopBackListenIPv6 (1808 of 2145)
PASS: lldb-api :: functionalities/exec/TestExec.py (1809 of 2145)
PASS: lldb-unit :: Utility/./UtilityTests/RegisterValueTest.GetSet8 (1810 of 2145)
PASS: lldb-api :: lang/cpp/diamond/TestDiamond.py (1811 of 2145)
PASS: lldb-unit :: Symbol/./SymbolTests/TestTypeSystemClang.TestGetTypeClassDeclType (1812 of 2145)
UNSUPPORTED: lldb-shell :: SymbolFile/PDB/variables-locations.test (1813 of 2145)
PASS: lldb-api :: lang/cpp/dynamic-value-same-basename/TestDynamicValueSameBase.py (1814 of 2145)
PASS: lldb-unit :: Utility/./UtilityTests/Flags.AllSet (1815 of 2145)
PASS: lldb-unit :: Target/./TargetTests/RemoteAwarePlatformTest.TestResolveExecutabelOnClientByPlatform (1816 of 2145)
PASS: lldb-api :: lang/cpp/symbols/TestSymbols.py (1817 of 2145)
PASS: lldb-api :: functionalities/postmortem/elf-core/TestLinuxCore.py (1818 of 2145)
PASS: lldb-api :: functionalities/gdb_remote_client/TestRecognizeBreakpoint.py (1819 of 2145)
PASS: lldb-unit :: Symbol/./SymbolTests/TestClangASTImporter.CompleteFwdDeclWithOtherOrigin (1820 of 2145)
PASS: lldb-unit :: Utility/./UtilityTests/XcodeSDKTest.SDKSupportsSwift (1821 of 2145)
PASS: lldb-shell :: SymbolFile/DWARF/find-basic-namespace.cpp (1822 of 2145)
PASS: lldb-shell :: Commands/CommandScriptImmediateOutput/CommandScriptImmediateOutputFile.test (1823 of 2145)
PASS: lldb-shell :: SymbolFile/NativePDB/ast-functions.cpp (1824 of 2145)
PASS: lldb-api :: functionalities/data-formatter/data-formatter-objc/TestDataFormatterObjCPlain.py (1825 of 2145)
PASS: lldb-api :: lang/objc/variadic_methods/TestVariadicMethods.py (1826 of 2145)
PASS: lldb-api :: functionalities/thread/backtrace_limit/TestBacktraceLimit.py (1827 of 2145)
PASS: lldb-unit :: UnwindAssembly/x86/./UnwindAssemblyx86Tests/Testx86AssemblyInspectionEngine.TestDisassemblyJunkBytes (1828 of 2145)
PASS: lldb-api :: commands/frame/language/TestGuessLanguage.py (1829 of 2145)
PASS: lldb-shell :: SymbolFile/DWARF/DW_OP_piece-smaller-than-struct.s (1830 of 2145)
PASS: lldb-api :: commands/expression/pr35310/TestExprsBug35310.py (1831 of 2145)
PASS: lldb-unit :: Utility/./UtilityTests/ArgsTest.TestTrailingBackslash (1832 of 2145)
PASS: lldb-api :: lang/c/step-target/TestStepTarget.py (1833 of 2145)
PASS: lldb-unit :: Interpreter/./InterpreterTests/OptionArgParserTest.toChar (1834 of 2145)
PASS: lldb-unit :: Target/./TargetTests/StackFrameRecognizerTest.NullModuleRegex (1835 of 2145)
PASS: lldb-unit :: Utility/./UtilityTests/StringListTest.GetMaxStringLengthIncreasingSize (1836 of 2145)
PASS: lldb-shell :: Quit/TestQuitExitCode30.test (1837 of 2145)
PASS: lldb-unit :: Utility/./UtilityTests/StringListTest.Join (1838 of 2145)
UNSUPPORTED: lldb-api :: linux/sepdebugsymlink/TestTargetSymbolsSepDebugSymlink.py (1839 of 2145)
PASS: lldb-api :: lang/objc/unicode-string/TestUnicodeString.py (1840 of 2145)
PASS: lldb-api :: commands/target/stop-hook/delete/TestTargetStopHookDelete.py (1841 of 2145)
PASS: lldb-shell :: VSCode/TestOptions.test (1842 of 2145)
PASS: lldb-api :: functionalities/gdb_remote_client/TestNoGPacketSupported.py (1843 of 2145)
PASS: lldb-api :: functionalities/data-formatter/pyobjsynthprovider/TestPyObjSynthProvider.py (1844 of 2145)
PASS: lldb-shell :: SymbolFile/DWARF/split-dwarf-multiple-cu.ll (1845 of 2145)
PASS: lldb-api :: functionalities/thread/step_until/TestStepUntil.py (1846 of 2145)
UNSUPPORTED: lldb-api :: tools/lldb-server/TestGdbRemote_vContThreads.py (1847 of 2145)
PASS: lldb-shell :: Watchpoint/SetErrorCases.test (1848 of 2145)
PASS: lldb-shell :: SymbolFile/DWARF/apple-index-is-used.cpp (1849 of 2145)
PASS: lldb-unit :: Utility/./UtilityTests/ScalarTest.APIntConstructor (1850 of 2145)
PASS: lldb-unit :: Utility/./UtilityTests/FileSpecTest.CopyByAppendingPathComponent (1851 of 2145)
PASS: lldb-api :: lang/c/unicode/TestUnicodeSymbols.py (1852 of 2145)
PASS: lldb-api :: functionalities/gdb_remote_client/TestThreadSelectionBug.py (1853 of 2145)
UNSUPPORTED: lldb-api :: tools/lldb-vscode/completions/TestVSCode_completions.py (1854 of 2145)
PASS: lldb-unit :: Utility/./UtilityTests/StringListTest.GetSize (1855 of 2145)
PASS: lldb-api :: lang/cpp/breakpoint_in_member_func_w_non_primitive_params/TestBreakpointInMemberFuncWNonPrimitiveParams.py (1856 of 2145)
PASS: lldb-unit :: Utility/./UtilityTests/CompletionRequest.ShiftArguments (1857 of 2145)
PASS: lldb-api :: tools/lldb-server/TestGdbRemoteAttach.py (1858 of 2145)
PASS: lldb-unit :: ScriptInterpreter/Python/./ScriptInterpreterPythonTests/PythonDataObjectsTest.TestPythonByteArray (1859 of 2145)
PASS: lldb-unit :: Utility/./UtilityTests/StreamTest.QuotedCString (1860 of 2145)
PASS: lldb-unit :: Utility/./UtilityTests/StreamTeeTest.Write (1861 of 2145)
PASS: lldb-api :: python_api/frame/inlines/TestInlinedFrame.py (1862 of 2145)
PASS: lldb-api :: commands/expression/context-object/TestContextObject.py (1863 of 2145)
PASS: lldb-shell :: SymbolFile/Breakpad/stack-cfi-arm.yaml (1864 of 2145)
PASS: lldb-api :: functionalities/signal/TestSendSignal.py (1865 of 2145)
PASS: lldb-unit :: Utility/./UtilityTests/GeneratorTest.Create (1866 of 2145)
PASS: lldb-unit :: ScriptInterpreter/Python/./ScriptInterpreterPythonTests/PythonDataObjectsTest.TestInstanceNameResolutionNoDot (1867 of 2145)
PASS: lldb-api :: types/TestFloatTypes.py (1868 of 2145)
PASS: lldb-unit :: Utility/./UtilityTests/CompletionRequest.DuplicateFiltering (1869 of 2145)
UNSUPPORTED: lldb-api :: python_api/event/TestEvents.py (1870 of 2145)
PASS: lldb-unit :: Utility/./UtilityTests/StreamTest.ChangingByteOrder (1871 of 2145)
PASS: lldb-api :: functionalities/data-formatter/data-formatter-synth/TestDataFormatterSynth.py (1872 of 2145)
PASS: lldb-unit :: UnwindAssembly/x86/./UnwindAssemblyx86Tests/Testx86AssemblyInspectionEngine.Test64bitFramelessSmallStackFrame (1873 of 2145)
PASS: lldb-api :: lang/cpp/accelerator-table/TestCPPAccelerator.py (1874 of 2145)
PASS: lldb-api :: lang/c/array_types/TestArrayTypes.py (1875 of 2145)
PASS: lldb-api :: functionalities/tsan/multiple/TestTsanMultiple.py (1876 of 2145)
PASS: lldb-api :: lang/cpp/dynamic-value/TestDynamicValue.py (1877 of 2145)
PASS: lldb-api :: functionalities/thread/concurrent_events/TestConcurrentManyWatchpoints.py (1878 of 2145)
PASS: lldb-api :: functionalities/data-formatter/data-formatter-stl/libcxx/map/TestDataFormatterLibccMap.py (1879 of 2145)
PASS: lldb-unit :: Utility/./UtilityTests/RangeTest.ContainsRange (1880 of 2145)
PASS: lldb-unit :: Utility/./UtilityTests/AnsiTerminal.Twice (1881 of 2145)
PASS: lldb-api :: python_api/disassemble-raw-data/TestDisassemble_VST1_64.py (1882 of 2145)
PASS: lldb-shell :: SymbolFile/DWARF/dwo-type-in-main-file.s (1883 of 2145)
PASS: lldb-api :: commands/expression/import-std-module/pair/TestPairFromStdModule.py (1884 of 2145)
PASS: lldb-api :: lang/cpp/dynamic-value/TestCppValueCast.py (1885 of 2145)
PASS: lldb-shell :: Breakpoint/implicit_const_form_support.test (1886 of 2145)
PASS: lldb-api :: macosx/dyld-trie-symbols/TestDyldTrieSymbols.py (1887 of 2145)
PASS: lldb-unit :: Host/./HostTests/FileSystemTest.Readable (1888 of 2145)
PASS: lldb-unit :: debugserver/./debugserverTests/RNBSocket.LoopBackListenIPv4 (1889 of 2145)
PASS: lldb-unit :: Utility/./UtilityTests/UserIDResolver.GetUserName (1890 of 2145)
PASS: lldb-api :: functionalities/data-formatter/vector-types/TestVectorTypesFormatting.py (1891 of 2145)
PASS: lldb-api :: python_api/symbol-context/two-files/TestSymbolContextTwoFiles.py (1892 of 2145)
PASS: lldb-api :: functionalities/postmortem/minidump/TestMiniDump.py (1893 of 2145)
PASS: lldb-shell :: Register/x86-64-gp-read.test (1894 of 2145)
PASS: lldb-unit :: Instruction/./EmulatorTests/TestAArch64Emulator.TestOverflow (1895 of 2145)
PASS: lldb-unit :: Process/minidump/./LLDBMinidumpTests/MinidumpParserTest.GetPidWindows (1896 of 2145)
UNSUPPORTED: lldb-shell :: ScriptInterpreter/Lua/lua-python.test (1897 of 2145)
PASS: lldb-unit :: Utility/./UtilityTests/StreamTest.PutBytesAsRawHex8ToMixedEndian (1898 of 2145)
PASS: lldb-unit :: Utility/./UtilityTests/OptionsWithRawTest.EmptySuffixSingleWhitespace (1899 of 2145)
PASS: lldb-api :: api/check_public_api_headers/TestPublicAPIHeaders.py (1900 of 2145)
PASS: lldb-unit :: Utility/./UtilityTests/StringListTest.LongestCommonPrefixSingleElement (1901 of 2145)
PASS: lldb-api :: functionalities/thread/step_out/TestThreadStepOut.py (1902 of 2145)
PASS: lldb-api :: functionalities/breakpoint/breakpoint_by_file_colon_line/TestBreakpointByFileColonLine.py (1903 of 2145)
PASS: lldb-unit :: Utility/./UtilityTests/ProcessInstanceInfoMatch.Name (1904 of 2145)
PASS: lldb-unit :: Language/Highlighting/./HighlighterTests/HighlighterTest.ClangPPDirectives (1905 of 2145)
PASS: lldb-api :: commands/target/select/TestTargetSelect.py (1906 of 2145)
UNSUPPORTED: lldb-shell :: Unwind/unwind-plan-dwarf-dump.test (1907 of 2145)
PASS: lldb-api :: commands/watchpoints/watchpoint_on_vectors/TestValueOfVectorVariable.py (1908 of 2145)
PASS: lldb-unit :: Language/Highlighting/./HighlighterTests/HighlighterTest.ClangOperators (1909 of 2145)
PASS: lldb-api :: functionalities/signal/handle-abrt/TestHandleAbort.py (1910 of 2145)
PASS: lldb-api :: commands/settings/quoting/TestQuoting.py (1911 of 2145)
PASS: lldb-shell :: Unwind/thread-step-out-ret-addr-check.test (1912 of 2145)
PASS: lldb-api :: functionalities/data-formatter/synthcapping/TestSyntheticCapping.py (1913 of 2145)
PASS: lldb-unit :: Disassembler/./DisassemblerTests/TestArmv7Disassembly.TestCortexFPDisass (1914 of 2145)
PASS: lldb-unit :: Utility/./UtilityTests/StatusTest.ErrorConversion (1915 of 2145)
PASS: lldb-unit :: Utility/./UtilityTests/DataExtractorTest.GetCStrEmpty (1916 of 2145)
PASS: lldb-unit :: Utility/./UtilityTests/StreamTest.Indent (1917 of 2145)
PASS: lldb-unit :: UnwindAssembly/x86/./UnwindAssemblyx86Tests/Testx86AssemblyInspectionEngine.TestSimplei386ugmented (1918 of 2145)
PASS: lldb-unit :: Utility/./UtilityTests/StringListTest.ShiftMove (1919 of 2145)
PASS: lldb-unit :: Utility/./UtilityTests/RangeTest.Copy (1920 of 2145)
PASS: lldb-api :: functionalities/breakpoint/comp_dir_symlink/TestCompDirSymLink.py (1921 of 2145)
PASS: lldb-api :: lang/objc/print-obj/TestPrintObj.py (1922 of 2145)
PASS: lldb-api :: functionalities/thread/concurrent_events/TestConcurrentTwoBreakpointsOneSignal.py (1923 of 2145)
PASS: lldb-unit :: Utility/./UtilityTests/ReproducerTest.SetReplay (1924 of 2145)
PASS: lldb-api :: commands/frame/diagnose/inheritance/TestDiagnoseInheritance.py (1925 of 2145)
PASS: lldb-unit :: Utility/./UtilityTests/ArchSpecTest.Compatibility (1926 of 2145)
PASS: lldb-shell :: ObjectFile/MachO/lc_build_version_notools.yaml (1927 of 2145)
PASS: lldb-unit :: Utility/./UtilityTests/PassiveReplayTest.InstrumentedFoo (1928 of 2145)
PASS: lldb-unit :: Symbol/./SymbolTests/TestClangASTImporter.ImportInvalidType (1929 of 2145)
PASS: lldb-shell :: SymbolFile/DWARF/DW_AT_const_value.s (1930 of 2145)
PASS: lldb-unit :: Utility/./UtilityTests/StringExtractorTest.GetU32LittleEndian (1931 of 2145)
PASS: lldb-api :: lang/cpp/stl/TestSTL.py (1932 of 2145)
PASS: lldb-api :: commands/expression/ir-interpreter-phi-nodes/TestIRInterpreterPHINodes.py (1933 of 2145)
PASS: lldb-api :: commands/frame/var-scope/TestFrameVariableScope.py (1934 of 2145)
PASS: lldb-api :: functionalities/data-formatter/data-formatter-advanced/TestDataFormatterAdv.py (1935 of 2145)
PASS: lldb-api :: lang/objc/objc-foundation-dictionary-empty/TestNSDictionary0.py (1936 of 2145)
PASS: lldb-unit :: Utility/./UtilityTests/StringListTest.AppendListCStringArrayEmpty (1937 of 2145)
PASS: lldb-shell :: Commands/command-backtrace.test (1938 of 2145)
FAIL: lldb-api :: commands/gui/basicdebug/TestGuiBasicDebug.py (1939 of 2145)
******************** TEST 'lldb-api :: commands/gui/basicdebug/TestGuiBasicDebug.py' FAILED ********************
Script:
--
/usr/local/Frameworks/Python.framework/Versions/3.7/bin/python3.7 /Users/buildslave/jenkins/workspace/lldb-cmake/llvm-project/lldb/test/API/dotest.py -s /Users/buildslave/jenkins/workspace/lldb-cmake/lldb-build/lldb-test-traces -S nm -u CXXFLAGS -u CFLAGS --codesign-identity - --server /Users/buildslave/jenkins/workspace/lldb-cmake/lldb-build/./bin/debugserver --arch x86_64 --build-dir /Users/buildslave/jenkins/workspace/lldb-cmake/lldb-build/lldb-test-build.noindex -s=/Users/buildslave/jenkins/workspace/lldb-cmake/test/logs -t --env TERM=vt100 --env LLVM_LIBS_DIR=/Users/buildslave/jenkins/workspace/lldb-cmake/lldb-build/./lib --arch x86_64 --build-dir /Users/buildslave/jenkins/workspace/lldb-cmake/lldb-build/lldb-test-build.noindex --lldb-module-cache-dir /Users/buildslave/jenkins/workspace/lldb-cmake/lldb-build/lldb-test-build.noindex/module-cache-lldb/lldb-api --clang-module-cache-dir /Users/buildslave/jenkins/workspace/lldb-cmake/lldb-build/lldb-test-build.noindex/module-cache-clang/lldb-api --executable /Users/buildslave/jenkins/workspace/lldb-cmake/lldb-build/./bin/lldb --compiler /Users/buildslave/jenkins/workspace/lldb-cmake/lldb-build/./bin/clang --dsymutil /Users/buildslave/jenkins/workspace/lldb-cmake/lldb-build/./bin/dsymutil --filecheck /Users/buildslave/jenkins/workspace/lldb-cmake/lldb-build/./bin/FileCheck --yaml2obj /Users/buildslave/jenkins/workspace/lldb-cmake/lldb-build/./bin/yaml2obj --lldb-libs-dir /Users/buildslave/jenkins/workspace/lldb-cmake/lldb-build/./lib /Users/buildslave/jenkins/workspace/lldb-cmake/llvm-project/lldb/test/API/commands/gui/basicdebug -p TestGuiBasicDebug.py
--
Exit Code: 1

Hide Details

Command Output (stdout): -- lldb version 12.0.99 clang revision deb00cf0b5abd45e160f1e0ff3e3dcce97b071e5 llvm revision deb00cf0b5abd45e160f1e0ff3e3dcce97b071e5 (lldb) settings clear -all (lldb) settings set symbols.enable-external-lookup false (lldb) settings set target.inherit-tcc true (lldb) settings set target.auto-apply-fixits false (lldb) settings set plugin.process.gdb-remote.packet-timeout 60 (lldb) settings set symbols.clang-modules-cache-path "/Users/buildslave/jenkins/workspace/lldb-cmake/lldb-build/lldb-test-build.noindex/module-cache-lldb/lldb-api" (lldb) settings set use-color false (lldb) setting set target.prefer-dynamic-value no-dynamic-values (lldb) target create "/Users/buildslave/jenkins/workspace/lldb-cmake/lldb-build/lldb-test-build.noindex/commands/gui/basicdebug/TestGuiBasicDebug.test_gui/a.out" Current executable set to '/Users/buildslave/jenkins/workspace/lldb-cmake/lldb-build/lldb-test-build.noindex/commands/gui/basicdebug/TestGuiBasicDebug.test_gui/a.out' (x86_64). (lldb) br set -f main.c -p "// Break here" br set -f main.c -p "// Break here" Breakpoint 1: where = a.out`main + 22 at main.c:4:3, address = 0x0000000100000f76 (lldb) run run Process 61517 launched: '/Users/buildslave/jenkins/workspace/lldb-cmake/lldb-build/lldb-test-build.noindex/commands/gui/basicdebug/TestGuiBasicDebug.test_gui/a.out' (x86_64) Process 61517 stopped * thread #1, queue = 'com.apple.main-thread', stop reason = breakpoint 1.1 frame #0: 0x0000000100000f76 a.out`main(argc=1, argv=0x00007ffeefbff8b0) at main.c:4:3 1 extern int func(); 2 3 int main(int argc, char **argv) { -> 4 func(); // Break here ^ 5 func(); // Second 6 return 0; 7 } (lldb) gui sgui (B)0[?7h[?1h=| LLDB (F1) | Target (F2) | Process (F3) | Thread (F4) | View (F5) | Help (F6) | lqq<Sources>qqqqqqqqqqqqqqqqqqqqqqqqqqqqqqqqqqqqqqqqqqqqqqqqqqqqqqqqqqqqqqqqqqqqqqqqqqqqqqqqqqqqqqqqqqqqqqqqqqqqqqqqqqqqqqqqqqqqqqqqqqqqqqqqqqqqqqqqqqqqqqqqqqqqqqqqqqqqqqqqqqqqqqqqqqqqqqqqqqqqqqqqqqqqqqqqqqqqqqqqqqqqqqqqqqqqqqqqqqqqqqqqqqqqqqqqqqqqqqqqqqqqqqqqqqqqqqqqqqqqqqqqqqqqqqqqqqqqqqqqqqqqqqqqqqqqqqqqqqqqqqqqqqqqqqqqqqqqqqqqqqqqqqqqqqqqqqqqqqqqqqqqqqqqqqqqqqqqqqqqqqqqqqqqqqqqqqqqqqqqqqqqqqqklqq<Threads>qqqqqqqqqqqqqqqqqqqqqqqqqqqqqqqqqqqqqqqqqqqqqqqqqqqqqqqqqqqqqqqqqqqqqqqqqqqqqqqqqqqqqqqkx a.out`main xx `qprocess 61517xx 1 x extern int func();xxxx 2 xxxxx 3 x int main(int argc, char **argv) {xxxx 4 x` func(); // Break here <<< Thread 1: breakpoint 1.1xxxx 5 x func(); // Secondxxxx 6 x return 0;xxxx 7 x }xxxx 8 xxxxxxxxxxxxxxxxxxxxxxxxxxxxxxxxxxxxxxxxxxxxxxxxxxxxxxxxxxxxxxxxxxxxxxxxxxxxxxxxxxxxxxxxxxxxxxxxxxxxxxxxxxxxxxxxxxxxxxxxxxxxxlqq<Help>qqqqqqqqqqqqqqqqqqqqqqqqqqqqqqqqqqqqqqqqqqqqqqqqqqqqqqqqqqqqqqqqqqqqqqqqqqqqqqqkxxxxx Welcome to the LLDB curses GUI.xxxxxxxxxxxx Press the TAB key to change the selected view.xxxxxx Each view has its own keyboard shortcuts, press 'h' to open a dialog to display them. xxxxxxxxxxxx Common key bindings for all views:xxxxxxxxxxxxtab - Select next viewxxxxxx back-tab key - Select previous viewxxxxxxh - Show help dialog with view specific key bindingsxxxxxx, - Page upxxxxxx. - Page downxxxxxxup - Select previousxxxxxxdown - Select nextxxxxxxleft - Unexpand or select parentxxxxxxright - Expandxxxxxx page-up - Page upxxxxxx page-down - Page downxxxxxmqqqqqqqqqqqqqqqqqqqqqqqqqqqqqqqqqqqqqqqqqqqqqqqqqqqqqqqqqqqqqq[Press any key to exit]qqjxxxxxxxxxxxxxxxxxxxxxxxxxxxxxxxmqqqqqqqqqqqqqqqqqqqqqqqqqqqqqqqqqqqqqqqqqqqqqqqqqqqqqqqqqqqqqqqqqqqqqqqqqqqqqqqqqqqqqqqqqqqqqqqqqqqqqqqqqqqqqqqqqqqqqqqqqqqqqqqqqqqqqqqqqqqqqqqqqqqqqqqqqqqqqqqqqqqqqqqqqqqqqqqqqqqqqqqqqqqqqqqqqqqqqqqqqqqqqqqqqqqqqqqqqqqqqqqqqqqqqqqqqqqqqqqqqqqqqqqqqqqqqqqqqqqqqqqqqqqqqqqqqqqqqqqqqqqqqqqqqqqqqqqqqqqqqqqqqqqqqqqqqqqqqqqqqqqqqqqqqqqqqqqqqqqqqqqqqqqqqqqqqqqqqqqqqqqqqqqqqqqqqqqqqqqqqqqqqqqqqqqqqqqqqqjxxlqq<Variables>qqqqqqqqqqqqqqqqqqqqqqqqqqqqqqqqqqqqqqqqqqqqqqqqqqqqqqqqqqqqqqqqqqqqqqqqqqqqqqqqqqqqqqqqqqqqqqqqqqqqqqqqqqqqqqqqqqqqqqqqqqqqqqqqqqqqqqqqqqqqqqqqqqqqqqqqqqqqqqqqqqqqqqqqqqqqqqqqqqqqqqqqqqqqqqqqqqqqqqqqqqqqqqqqqqqqqqqqqqqqqqqqqqqqqqqqqqqqqqqqqqqqqqqqqqqqqqqqqqqqqqqqqqqqqqqqqqqqqqqqqqqqqqqqqqqqqqqqqqqqqqqqqqqqqqqqqqqqqqqqqqqqqqqqqqqqqqqqqqqqqqqqqqqqqqqqqqqqqqqqqqqqqqqqqqqqqqqqqqqqqqqqqkxxx (int) argc = 1xxxx `q(char **) argv = 0x00007ffeefbff8b0xxxxxxxxxxxxxxxxxxxxxxxxxxxxxxxxxxxxxxxxxxxxxxxxxxxxxxxxxxxxxxxxxxxxxxxxxxxxxxxxxxxxxxxxxxxxxxxxxxxxxxxxxxxmqqqqqqqqqqqqqqqqqqqqqqqqqqqqqqqqqqqqqqqqqqqqqqqqqqqqqqqqqqqqqqqqqqqqqqqqqqqqqqqqqqqqqqqqqqqqqqqqqqqqqqqqqqqqqqqqqqqqqqqqqqqqqqqqqqqqqqqqqqqqqqqqqqqqqqqqqqqqqqqqqqqqqqqqqqqqqqqqqqqqqqqqqqqqqqqqqqqqqqqqqqqqqqqqqqqqqqqqqqqqqqqqqqqqqqqqqqqqqqqqqqqqqqqqqqqqqqqqqqqqqqqqqqqqqqqqqqqqqqqqqqqqqqqqqqqqqqqqqqqqqqqqqqqqqqqqqqqqqqqqqqqqqqqqqqqqqqqqqqqqqqqqqqqqqqqqqqqqqqqqqqqqqqqqqqqqqqqqqqqqqqqqqqqqqqqqqqqqqqjmqqqqqqqqqqqqqqqqqqqqqqqqqqqqqqqqqqqqqqqqqqqqqqqqqqqqqqqqqqqqqqqqqqqqqqqqqqqqqqqqqqqqqqqqqqqqqqqqqqjProcess: 61517 stopped Thread: 0xc29fd7 Frame: 0 PC = 0x0000000100000f76 lqq<Sources>qqqqqqqqqqqqqqqqqqqqqqqqqqqqqqqqqqqqqqqqqqqqqqqqqqqqqqqqqqqqqqqqqqqqqqqqqqqqqqqqqqqqqqqqqqqqqqqqqqqqqqqqqqqqqqqqqqqqqqqqqqqqqqqqqqqqqqqqqqqqqqqqqqqqqqqqqqqqqqqqqqqqqqqqqqqqqqqqqqqqqqqqqqqqqqqqqqqqqqqqqqqqqqqqqqqqqqqqqqqqqqqqqqqqqqqqqqqqqqqqqqqqqqqqqqqqqqqqqqqqqqqqqqqqqqqqqqqqqqqqqqqqqqqqqqqqqqqqqqqqqqqqqqqqqqqqqqqqqqqqqqqqqqqqqqqqqqqqqqqqqqqqqqqqqqqqqqqqqqqqqqqqqqqqqqqqqqqqqqqqqqqqqqqk xx xx xx xx xx xx xx xx xx xx xx xx xx xx xx xx xx xx xx xx xx xx xx xx xx xx xx xx xx xx xx xx xx xx xx xx xx xx xx x x x  x x  x x  x x x x  x x  x x  x x   x x  x x   x x   x x   x x   x x   x x   x x   x x  x x  x x x xx xx xx xx xx xx xx mqqqqqqqqqqqqqqqqqqqqqqqqqqqqqqqqqqqqqqqqqqqqqqqqqqqqqqqqqqqqqqqqqqqqqqqqqqqqqqqqqqqqqqqqqqqqqqqqqqqqqqqqqqqqqqqqqqqqqqqqqqqqqqqqqqqqqqqqqqqqqqqqqqqqqqqqqqqqqqqqqqqqqqqqqqqqqqqqqqqqqqqqqqqqqqqqqqqqqqqqqqqqqqqqqqqqqqqqqqqqqqqqqqqqqqqqqqqqqqqqqqqqqqqqqqqqqqqqqqqqqqqqqqqqqqqqqqqqqqqqqqqqqqqqqqqqqqqqqqqqqqqqqqqqqqqqqqqqqqqqqqqqqqqqqqqqqqqqqqqqqqqqqqqqqqqqqqqqqqqqqqqqqqqqqqqqqqqqqqqqqqqqqqqqqqqqqqqqqqj runningfunc int func() { ` return 1; // In function <<< Thread 1: step in }  4 x       stoppedThread: 0xc29fd7 Frame: 0 PC = 0x0000000100000fa4umain extern int func();  int main(int argc, char **argv) {  4 x` func(); // Break here 5 x func(); // Second 6 x return 0; 7 x } 8 x(int) argc = 1 `q(char **) argv = 0x00007ffeefbff8b017ddfunc int func() { ` return 1; // In function <<< Thread 1: step in }  4 x       0a4f runningmain extern int func();  int main(int argc, char **argv) {  4 x` func(); // Break here <<< Thread 1: step out 5 x func(); // Second 6 x return 0; 7 x } 8 x(int) argc = 1 `q(char **) argv = 0x00007ffeefbff8b0stoppedThread: 0xc29fd7 Frame: 0 PC = 0x0000000100000f7ds running func(); // Break here ` func(); // Second <<< Thread 1: step instoppedThread: 0xc29fd7 Frame: 0 PC = 0x0000000100000f80n running func(); // Second ` return 0; <<< Thread 1: step overstoppedThread: 0xc29fd7 Frame: 0 PC = 0x0000000100000f8c [?1l>(lldb) libstdcxx tests will not be run because: Don't know how to build with libstdcxx on macosx Skipping following debug info categories: ['dwo']

Hide Details

-- Command Output (stderr): --

Hide Details

Session logs for test failures/errors/unexpected successes will go into directory '/Users/buildslave/jenkins/workspace/lldb-cmake/test/logs' Change dir to: /Users/buildslave/jenkins/workspace/lldb-cmake/llvm-project/lldb/test/API/commands/gui/basicdebug runCmd: settings clear -all output:

Hide Details

runCmd: settings set symbols.enable-external-lookup false output:

Hide Details

runCmd: settings set target.inherit-tcc true output:

Hide Details

runCmd: settings set target.auto-apply-fixits false output:

Hide Details

runCmd: settings set plugin.process.gdb-remote.packet-timeout 60 output:

Hide Details

runCmd: settings set symbols.clang-modules-cache-path "/Users/buildslave/jenkins/workspace/lldb-cmake/lldb-build/lldb-test-build.noindex/module-cache-lldb/lldb-api" output:

Hide Details

runCmd: settings set use-color false output:

Hide Details

runCmd: setting set target.prefer-dynamic-value no-dynamic-values output:

Hide Details

FAIL: LLDB (/Users/buildslave/jenkins/workspace/lldb-cmake/lldb-build/bin/clang-x86_64) :: test_gui (TestGuiBasicDebug.TestGuiBasicDebugCommandTest) Restore dir to: /Users/buildslave/jenkins/workspace/lldb-cmake/lldb-build/tools/lldb/test ====================================================================== ERROR: test_gui (TestGuiBasicDebug.TestGuiBasicDebugCommandTest) ---------------------------------------------------------------------- Traceback (most recent call last): File "/Users/buildslave/jenkins/workspace/lldb-cmake/llvm-project/lldb/third_party/Python/module/pexpect-4.6/pexpect/pty_spawn.py", line 23, in _wrap_ptyprocess_err yield File "/Users/buildslave/jenkins/workspace/lldb-cmake/llvm-project/lldb/third_party/Python/module/pexpect-4.6/pexpect/pty_spawn.py", line 327, in close self.ptyproc.close(force=force) File "/Users/buildslave/jenkins/workspace/lldb-cmake/llvm-project/lldb/third_party/Python/module/ptyprocess-0.6.0/ptyprocess/ptyprocess.py", line 400, in close raise PtyProcessError('Could not terminate the child.') ptyprocess.util.PtyProcessError: Could not terminate the child.

Hide Details

During handling of the above exception, another exception occurred:

Hide Details

Traceback (most recent call last): File "/Users/buildslave/jenkins/workspace/lldb-cmake/llvm-project/lldb/packages/Python/lldbsuite/test/decorators.py", line 134, in wrapper return func(*args, **kwargs) File "/Users/buildslave/jenkins/workspace/lldb-cmake/llvm-project/lldb/packages/Python/lldbsuite/test/decorators.py", line 104, in wrapper func(*args, **kwargs) File "/Users/buildslave/jenkins/workspace/lldb-cmake/llvm-project/lldb/test/API/commands/gui/basicdebug/TestGuiBasicDebug.py", line 50, in test_gui self.quit() File "/Users/buildslave/jenkins/workspace/lldb-cmake/llvm-project/lldb/packages/Python/lldbsuite/test/lldbpexpect.py", line 64, in quit self.child.close(force=not gracefully) File "/Users/buildslave/jenkins/workspace/lldb-cmake/llvm-project/lldb/third_party/Python/module/pexpect-4.6/pexpect/pty_spawn.py", line 327, in close self.ptyproc.close(force=force) File "/usr/local/Cellar/python/3.7.1/Frameworks/Python.framework/Versions/3.7/lib/python3.7/contextlib.py", line 130, in __exit__ self.gen.throw(type, value, traceback) File "/Users/buildslave/jenkins/workspace/lldb-cmake/llvm-project/lldb/third_party/Python/module/pexpect-4.6/pexpect/pty_spawn.py", line 25, in _wrap_ptyprocess_err raise ExceptionPexpect(*e.args) pexpect.exceptions.ExceptionPexpect: Could not terminate the child. Config=x86_64-/Users/buildslave/jenkins/workspace/lldb-cmake/lldb-build/bin/clang ---------------------------------------------------------------------- Ran 1 test in 8.057s

Hide Details

RESULT: FAILED (0 passes, 0 failures, 1 errors, 0 skipped, 0 expected failures, 0 unexpected successes)

Hide Details

--

Hide Details

******************** PASS: lldb-api :: lang/objc/objc-ivar-stripped/TestObjCIvarStripped.py (1940 of 2145) PASS: lldb-unit :: Utility/./UtilityTests/ArgsTest.GetQuotedCommandString (1941 of 2145) PASS: lldb-shell :: Commands/command-breakpoint-col.test (1942 of 2145) PASS: lldb-unit :: Utility/./UtilityTests/OptionsWithRawTest.MultiWordSuffix (1943 of 2145) UNSUPPORTED: lldb-api :: commands/watchpoints/hello_watchlocation/TestWatchLocation.py (1944 of 2145) PASS: lldb-unit :: Symbol/./SymbolTests/TestTypeSystemClang.TestGetTypeClassTypeOf (1945 of 2145) PASS: lldb-api :: commands/apropos/basic/TestApropos.py (1946 of 2145) PASS: lldb-api :: functionalities/backticks/TestBackticksWithoutATarget.py (1947 of 2145) PASS: lldb-unit :: Host/./HostTests/FileSystemTest.FileAndDirectoryComponents (1948 of 2145) PASS: lldb-api :: lang/c/offsetof/TestOffsetof.py (1949 of 2145) PASS: lldb-api :: functionalities/breakpoint/breakpoint_hit_count/TestBreakpointHitCount.py (1950 of 2145) PASS: lldb-unit :: SymbolFile/DWARF/./SymbolFileDWARFTests/SymbolFileDWARFTests.TestAbbrevOutOfOrder (1951 of 2145) PASS: lldb-api :: python_api/value/empty_class/TestValueAPIEmptyClass.py (1952 of 2145) UNSUPPORTED: lldb-shell :: ScriptInterpreter/Lua/watchpoint_callback.test (1953 of 2145) PASS: lldb-api :: macosx/simulator/TestSimulatorPlatform.py (1954 of 2145) PASS: lldb-unit :: Utility/./UtilityTests/RegularExpression.CopyAssignment (1955 of 2145) PASS: lldb-unit :: Platform/Android/./AdbClientTests/AdbClientTest.CreateByDeviceId (1956 of 2145) PASS: lldb-unit :: Utility/./UtilityTests/StreamTest.PutRawBytesToLittleEndian (1957 of 2145) PASS: lldb-unit :: Process/gdb-remote/./ProcessGdbRemoteTests/GDBRemoteClientBaseTest.SendContinueAndWait (1958 of 2145) PASS: lldb-unit :: Utility/./UtilityTests/FileSpecTest.GuessPathStyle (1959 of 2145) UNSUPPORTED: lldb-shell :: Register/x86-64-xmm16-write.test (1960 of 2145) PASS: lldb-unit :: ScriptInterpreter/Python/./ScriptInterpreterPythonTests/PythonDataObjectsTest.TestPythonTupleInitializerList2 (1961 of 2145) UNSUPPORTED: lldb-shell :: SymbolFile/PDB/ast-restore.test (1962 of 2145) PASS: lldb-unit :: Expression/./ExpressionTests/DiagnosticManagerTest.GetStringPreserveOrder (1963 of 2145) PASS: lldb-api :: commands/expression/import-std-module/basic/TestImportStdModule.py (1964 of 2145) PASS: lldb-api :: functionalities/breakpoint/breakpoint_callback_command_source/TestBreakpointCallbackCommandSource.py (1965 of 2145) PASS: lldb-api :: lang/objc/modules-app-update/TestClangModulesAppUpdate.py (1966 of 2145) PASS: lldb-unit :: ScriptInterpreter/Python/./ScriptInterpreterPythonTests/PythonDataObjectsTest.TestPythonTupleToStructuredList (1967 of 2145) PASS: lldb-unit :: SymbolFile/NativePDB/./SymbolFileNativePDBTests/PDBFPOProgramToDWARFExpressionTests.DependencyChain (1968 of 2145) PASS: lldb-unit :: ScriptInterpreter/Python/./ScriptInterpreterPythonTests/PythonDataObjectsTest.TestPythonStringToStr (1969 of 2145) PASS: lldb-unit :: Utility/./UtilityTests/ArgsTest.GetArgumentArrayRef (1970 of 2145) PASS: lldb-unit :: UnwindAssembly/x86/./UnwindAssemblyx86Tests/Testx86AssemblyInspectionEngine.TestDisassemblyMidFunctionEpilogues (1971 of 2145) PASS: lldb-unit :: Utility/./UtilityTests/StringExtractorTest.DecodeHexU8_Underflow (1972 of 2145) PASS: lldb-api :: python_api/findvalue_duplist/TestSBFrameFindValue.py (1973 of 2145) PASS: lldb-api :: functionalities/tail_call_frames/thread_step_out_message/TestArtificialFrameStepOutMessage.py (1974 of 2145) UNSUPPORTED: lldb-shell :: ObjectFile/ELF/minidebuginfo-no-lzma.yaml (1975 of 2145) PASS: lldb-unit :: Utility/./UtilityTests/SerializationRountripTest.SerializeDeserializeCStringNull (1976 of 2145) PASS: lldb-unit :: ScriptInterpreter/Python/./ScriptInterpreterPythonTests/PythonDataObjectsTest.TestPythonIntegerToStructuredInteger (1977 of 2145) PASS: lldb-unit :: Expression/./ExpressionTests/CppModuleConfigurationTest.LibCppV2 (1978 of 2145) PASS: lldb-api :: commands/expression/import-std-module/forward_decl_from_module/TestForwardDeclFromStdModule.py (1979 of 2145) PASS: lldb-api :: functionalities/dlopen_other_executable/TestDlopenOtherExecutable.py (1980 of 2145) PASS: lldb-api :: commands/process/launch-with-shellexpand/TestLaunchWithShellExpand.py (1981 of 2145) PASS: lldb-api :: lang/cpp/auto/TestCPPAuto.py (1982 of 2145) PASS: lldb-api :: lang/cpp/namespace/TestNamespace.py (1983 of 2145) PASS: lldb-unit :: Expression/./ExpressionTests/ClangExpressionDeclMapTest.TestUnknownIdentifierLookup (1984 of 2145) PASS: lldb-unit :: Utility/./UtilityTests/RangeTest.Slide (1985 of 2145) PASS: lldb-api :: lang/objc/foundation/TestObjCMethods2.py (1986 of 2145) PASS: lldb-unit :: Host/./HostTests/HostInfoTest.GetAugmentedArchSpec (1987 of 2145) PASS: lldb-unit :: Expression/./ExpressionTests/DiagnosticManagerTest.HasFixits (1988 of 2145) PASS: lldb-api :: lang/objc/objc++/TestObjCXX.py (1989 of 2145) UNSUPPORTED: lldb-api :: lang/objc/rdar-12408181/TestRdar12408181.py (1990 of 2145) PASS: lldb-unit :: Target/./TargetTests/ExecutionContextTest.GetByteOrderTarget (1991 of 2145) PASS: lldb-api :: lang/objc/modules-inline-functions/TestModulesInlineFunctions.py (1992 of 2145) PASS: lldb-unit :: Symbol/./SymbolTests/SymbolsTest.LocateExecutableSymbolFileForUnknownExecutableAndMissingSymbolFile (1993 of 2145) PASS: lldb-unit :: Utility/./UtilityTests/StreamTest.PutHex16ByteOrderLittle (1994 of 2145) PASS: lldb-shell :: Settings/TestFrameFormatMangling.test (1995 of 2145) PASS: lldb-api :: lang/cpp/class_types/TestClassTypesDisassembly.py (1996 of 2145) PASS: lldb-api :: python_api/interpreter/TestRunCommandInterpreterAPI.py (1997 of 2145) PASS: lldb-unit :: ScriptInterpreter/Python/./ScriptInterpreterPythonTests/PythonDataObjectsTest.TestPythonFile (1998 of 2145) PASS: lldb-unit :: ScriptInterpreter/Python/./ScriptInterpreterPythonTests/PythonDataObjectsTest.TestPythonString (1999 of 2145) PASS: lldb-api :: macosx/DBGSourcePathRemapping/TestDSYMSourcePathRemapping.py (2000 of 2145) PASS: lldb-api :: types/TestLongTypes.py (2001 of 2145) PASS: lldb-shell :: Quit/TestQuitExitCodeImplicit0.test (2002 of 2145) PASS: lldb-api :: lang/objc/objc-new-syntax/TestObjCNewSyntaxArray.py (2003 of 2145) PASS: lldb-unit :: Utility/./UtilityTests/OptionsWithRawTest.WhitespaceInput (2004 of 2145) UNSUPPORTED: lldb-api :: commands/watchpoints/variable_out_of_scope/TestWatchedVarHitWhenInScope.py (2005 of 2145) PASS: lldb-unit :: Utility/./UtilityTests/DataExtractorTest.GetCStrAtNullOffset (2006 of 2145) PASS: lldb-unit :: Utility/./UtilityTests/ConstStringTest.UpdateMangledCounterpart (2007 of 2145) PASS: lldb-api :: functionalities/breakpoint/objc/TestObjCBreakpoints.py (2008 of 2145) UNSUPPORTED: lldb-api :: benchmarks/expression/TestExpressionCmd.py (2009 of 2145) UNSUPPORTED: lldb-api :: linux/add-symbols/TestTargetSymbolsAddCommand.py (2010 of 2145) PASS: lldb-unit :: Process/gdb-remote/./ProcessGdbRemoteTests/GDBRemoteCommunicationServerTest.SendErrorResponse_StringError (2011 of 2145) PASS: lldb-unit :: Utility/./UtilityTests/RangeTest.Union (2012 of 2145) PASS: lldb-api :: lang/objc/objc-super/TestObjCSuper.py (2013 of 2145) PASS: lldb-unit :: ScriptInterpreter/Python/./ScriptInterpreterPythonTests/PythonDataObjectsTest.TestPythonIntegerToStr (2014 of 2145) PASS: lldb-unit :: Symbol/./SymbolTests/TestTypeSystemClang.TestFunctionTemplateConstruction (2015 of 2145) PASS: lldb-unit :: Utility/./UtilityTests/ArgsTest.Yaml (2016 of 2145) PASS: lldb-api :: commands/frame/diagnose/bad-reference/TestBadReference.py (2017 of 2145) PASS: lldb-api :: functionalities/data-formatter/data-formatter-stl/libcxx/initializerlist/TestInitializerList.py (2018 of 2145) PASS: lldb-unit :: Utility/./UtilityTests/LogChannelTest.List (2019 of 2145) PASS: lldb-unit :: Utility/./UtilityTests/AnsiTerminal.Unknown (2020 of 2145) PASS: lldb-api :: lang/objc/foundation/TestFoundationDisassembly.py (2021 of 2145) PASS: lldb-shell :: ObjectFile/ELF/base-address.yaml (2022 of 2145) UNSUPPORTED: lldb-shell :: Breakpoint/case-insensitive.test (2023 of 2145) PASS: lldb-api :: commands/expression/dont_allow_jit/TestAllowJIT.py (2024 of 2145) PASS: lldb-api :: commands/process/launch/TestProcessLaunch.py (2025 of 2145) PASS: lldb-shell :: SymbolFile/DWARF/dwp-debug-types.s (2026 of 2145) PASS: lldb-api :: lang/cpp/offsetof/TestOffsetofCpp.py (2027 of 2145) UNSUPPORTED: lldb-api :: macosx/macCatalystAppMacOSFramework/TestMacCatalystAppWithMacOSFramework.py (2028 of 2145) PASS: lldb-unit :: Utility/./UtilityTests/RangeTest.ContainsEndInclusiveInvalid (2029 of 2145) PASS: lldb-api :: functionalities/data-formatter/data-formatter-globals/TestDataFormatterGlobals.py (2030 of 2145) PASS: lldb-unit :: Utility/./UtilityTests/RegularExpression.Empty (2031 of 2145) UNSUPPORTED: lldb-shell :: ScriptInterpreter/Lua/bindings.test (2032 of 2145) PASS: lldb-unit :: Process/gdb-remote/./ProcessGdbRemoteTests/GDBRemoteClientBaseTest.SendContinueAndInterrupt (2033 of 2145) PASS: lldb-shell :: ObjectFile/Breakpad/sections.test (2034 of 2145) PASS: lldb-api :: commands/session/history/TestSessionHistory.py (2035 of 2145) PASS: lldb-unit :: Expression/./ExpressionTests/CppModuleConfigurationTest.AmbiguousLibCpp (2036 of 2145) PASS: lldb-unit :: ScriptInterpreter/Python/./ScriptInterpreterPythonTests/PythonDataObjectsTest.TestPythonCallableCheck (2037 of 2145) PASS: lldb-api :: functionalities/breakpoint/scripted_bkpt/TestScriptedResolver.py (2038 of 2145) XFAIL: lldb-shell :: Register/x86-mm-xmm-write.test (2039 of 2145) PASS: lldb-unit :: Process/minidump/./LLDBMinidumpTests/RegisterContextMinidump.ConvertMinidumpContext_x86_32 (2040 of 2145) PASS: lldb-api :: lang/c/const_variables/TestConstVariables.py (2041 of 2145) PASS: lldb-unit :: Utility/./UtilityTests/StreamTest.PutULEB128 (2042 of 2145) PASS: lldb-shell :: SymbolFile/DWARF/debug-names-compressed.cpp (2043 of 2145) PASS: lldb-unit :: Utility/./UtilityTests/StringListTest.InsertStringAtIndexMove (2044 of 2145) PASS: lldb-unit :: Process/minidump/./LLDBMinidumpTests/MinidumpParserTest.GetThreadContext_x86_32_wow64 (2045 of 2145) PASS: lldb-api :: commands/target/create-no-such-arch/TestNoSuchArch.py (2046 of 2145) PASS: lldb-shell :: ObjectFile/ELF/PT_LOAD-overlap-PT_INTERP.yaml (2047 of 2145) PASS: lldb-unit :: ObjectFile/ELF/./ObjectFileELFTests/ObjectFileELFTest.SectionsResolveConsistently (2048 of 2145) PASS: lldb-unit :: Utility/./UtilityTests/StringListTest.SplitIntoLines (2049 of 2145) PASS: lldb-shell :: ObjectFile/ELF/duplicate-section.yaml (2050 of 2145) PASS: lldb-unit :: Language/CPlusPlus/./LanguageCPlusPlusTests/CPlusPlusLanguage.MethodNameParsing (2051 of 2145) PASS: lldb-unit :: debugserver/./debugserverTests/RNBSocket.LoopBackConnectIPv4 (2052 of 2145) PASS: lldb-api :: commands/expression/namespace_local_var_same_name_cpp_and_c/TestNamespaceLocalVarSameNameCppAndC.py (2053 of 2145) PASS: lldb-api :: lang/cpp/exceptions/TestCPPExceptionBreakpoints.py (2054 of 2145) PASS: lldb-api :: python_api/process/TestProcessAPI.py (2055 of 2145) PASS: lldb-api :: commands/expression/import-std-module/empty-module/TestEmptyStdModule.py (2056 of 2145) PASS: lldb-shell :: ObjectFile/ELF/short-build-id.yaml (2057 of 2145) PASS: lldb-api :: python_api/watchpoint/TestWatchpointIter.py (2058 of 2145) PASS: lldb-unit :: Expression/./ExpressionTests/CppModuleConfigurationTest.UnknownLibCppFile (2059 of 2145) UNSUPPORTED: lldb-api :: functionalities/darwin_log/filter/regex/activity/TestDarwinLogFilterRegexActivity.py (2060 of 2145) PASS: lldb-unit :: Utility/./UtilityTests/StringListTest.SetSize (2061 of 2145) PASS: lldb-api :: types/TestCharType.py (2062 of 2145) PASS: lldb-api :: lang/objc/objc-ivar-offsets/TestObjCIvarOffsets.py (2063 of 2145) PASS: lldb-api :: types/TestShortTypeExpr.py (2064 of 2145) PASS: lldb-unit :: Utility/./UtilityTests/XcodeSDKTest.GetSDKTypeForTriple (2065 of 2145) UNSUPPORTED: lldb-api :: functionalities/darwin_log/filter/exact_match/category/TestDarwinLogFilterMatchCategory.py (2066 of 2145) UNSUPPORTED: lldb-shell :: Register/arm-fp-read.test (2067 of 2145) PASS: lldb-unit :: Utility/./UtilityTests/LogChannelTest.EnableOptions (2068 of 2145) PASS: lldb-api :: functionalities/thread/concurrent_events/TestConcurrentBreakpointOneDelayBreakpointThreads.py (2069 of 2145) PASS: lldb-api :: tools/lldb-server/register-reading/TestGdbRemoteGPacket.py (2070 of 2145) PASS: lldb-api :: lang/objc/objc-checker/TestObjCCheckers.py (2071 of 2145) PASS: lldb-api :: functionalities/data-formatter/data-formatter-stl/libcxx/queue/TestDataFormatterLibcxxQueue.py (2072 of 2145) PASS: lldb-api :: lang/cpp/modules-import/TestCXXModulesImport.py (2073 of 2145) PASS: lldb-api :: commands/breakpoint/set/func-regex/TestBreakpointRegexError.py (2074 of 2145) PASS: lldb-shell :: ObjectFile/PECOFF/symbol.yaml (2075 of 2145) PASS: lldb-unit :: Utility/./UtilityTests/StreamTest.PutRawBytesToMixedEndian (2076 of 2145) PASS: lldb-api :: commands/watchpoints/watchpoint_size/TestWatchpointSizes.py (2077 of 2145) PASS: lldb-unit :: Core/./LLDBCoreTests/RichManglingContextTest.FromCxxMethodName (2078 of 2145) UNSUPPORTED: lldb-shell :: Register/arm-gp-read.test (2079 of 2145) PASS: lldb-unit :: Process/gdb-remote/./ProcessGdbRemoteTests/GDBRemoteClientBaseTest.SendPacketAndReceiveResponseWithOutputSupport (2080 of 2145) PASS: lldb-unit :: Utility/./UtilityTests/StringLexerTest.Peek (2081 of 2145) PASS: lldb-unit :: Process/gdb-remote/./ProcessGdbRemoteTests/GDBRemoteCommunicationClientTest.SaveRestoreRegistersNoSuffix (2082 of 2145) PASS: lldb-api :: functionalities/data-formatter/nsarraysynth/TestNSArraySynthetic.py (2083 of 2145) PASS: lldb-unit :: Utility/./UtilityTests/StreamTeeTest.AppendStream (2084 of 2145) PASS: lldb-api :: functionalities/data-formatter/nssetsynth/TestNSSetSynthetic.py (2085 of 2145) PASS: lldb-api :: functionalities/fat_archives/TestFatArchives.py (2086 of 2145) PASS: lldb-shell :: SymbolFile/DWARF/debug-line-basic.s (2087 of 2145) PASS: lldb-unit :: Utility/./UtilityTests/Flags.AnyClear (2088 of 2145) PASS: lldb-unit :: Symbol/./SymbolTests/TestTypeSystemClang.TestNotDeletingUserCopyCstrDueToMoveCStr (2089 of 2145) PASS: lldb-unit :: Process/minidump/./LLDBMinidumpTests/MinidumpParserTest.GetThreadsAndGetThreadContext (2090 of 2145) PASS: lldb-unit :: Utility/./UtilityTests/RecordReplayTest.InstrumentedBar (2091 of 2145) PASS: lldb-unit :: DataFormatter/./LLDBFormatterTests/StringPrinterTests.CxxASCII (2092 of 2145) UNSUPPORTED: lldb-api :: commands/register/register/intel_xtended_registers/mpx_offset_intersection/TestMPXOffsetIntersection.py (2093 of 2145) PASS: lldb-api :: driver/batch_mode/TestBatchMode.py (2094 of 2145) PASS: lldb-unit :: Utility/./UtilityTests/RecordReplayTest.InstrumentedFooSameThis (2095 of 2145) PASS: lldb-unit :: Utility/./UtilityTests/OptionsWithRawTest.EmptyInput (2096 of 2145) PASS: lldb-api :: commands/command/script_alias/TestCommandScriptAlias.py (2097 of 2145) PASS: lldb-unit :: Utility/./UtilityTests/StringExtractorTest.GetHexU8_Underflow2_NoEof (2098 of 2145) PASS: lldb-unit :: Utility/./UtilityTests/RangeDataVector.FindEntryThatContains (2099 of 2145) PASS: lldb-api :: lang/cpp/function-qualifiers/TestCppFunctionQualifiers.py (2100 of 2145) PASS: lldb-unit :: Utility/./UtilityTests/BinaryStreamTest.PutULEB128ThreeBytes (2101 of 2145) PASS: lldb-api :: functionalities/thread/ignore_suspended/TestIgnoreSuspendedThread.py (2102 of 2145) PASS: lldb-api :: commands/expression/multiline-navigation/TestMultilineNavigation.py (2103 of 2145) PASS: lldb-api :: macosx/profile_vrs_detach/TestDetachVrsProfile.py (2104 of 2145) PASS: lldb-api :: functionalities/lazy-loading/TestLazyLoading.py (2105 of 2145) PASS: lldb-api :: lang/cpp/breakpoint-commands/TestCPPBreakpointCommands.py (2106 of 2145) PASS: lldb-unit :: Utility/./UtilityTests/ArgsTest.EscapeLLDBCommandArgument (2107 of 2145) PASS: lldb-shell :: ObjectFile/ELF/PT_LOAD-overlap.yaml (2108 of 2145) PASS: lldb-shell :: ObjectFile/wasm/stripped-debug-sections.yaml (2109 of 2145) PASS: lldb-api :: functionalities/mtc/simple/TestMTCSimple.py (2110 of 2145) PASS: lldb-api :: lang/cpp/class_static/TestStaticVariables.py (2111 of 2145) PASS: lldb-unit :: Utility/./UtilityTests/UriParserTest.BadPort2 (2112 of 2145) PASS: lldb-api :: functionalities/memory/read/TestMemoryRead.py (2113 of 2145) PASS: lldb-shell :: SymbolFile/DWARF/dir-separator-no-comp-dir-relative-name.s (2114 of 2145) PASS: lldb-unit :: Process/gdb-remote/./ProcessGdbRemoteTests/GDBRemoteCommunicationClientTest.GetMemoryRegionInfoInvalidResponse (2115 of 2145) PASS: lldb-unit :: Host/./HostTests/HostInfoTest.GetXcodeSDK (2116 of 2145) UNSUPPORTED: lldb-api :: lang/cpp/static_members/TestCPPStaticMembers.py (2117 of 2145) PASS: lldb-api :: commands/frame/recognizer/TestFrameRecognizer.py (2118 of 2145) PASS: lldb-api :: functionalities/thread/concurrent_events/TestConcurrentBreakpointsDelayedBreakpointOneWatchpoint.py (2119 of 2145) PASS: lldb-api :: commands/expression/cast_int_to_anonymous_enum/TestCastIntToAnonymousEnum.py (2120 of 2145) PASS: lldb-api :: lang/c/vla/TestVLA.py (2121 of 2145) PASS: lldb-api :: functionalities/data-formatter/data-formatter-objc/TestDataFormatterObjCNSData.py (2122 of 2145) PASS: lldb-api :: functionalities/dead-strip/TestDeadStrip.py (2123 of 2145) PASS: lldb-api :: lang/objc/self/TestObjCSelf.py (2124 of 2145) PASS: lldb-api :: functionalities/data-formatter/data-formatter-script/TestDataFormatterScript.py (2125 of 2145) PASS: lldb-api :: macosx/function-starts/TestFunctionStarts.py (2126 of 2145) PASS: lldb-api :: commands/command/script/TestCommandScript.py (2127 of 2145) PASS: lldb-unit :: SymbolFile/NativePDB/./SymbolFileNativePDBTests/PDBFPOProgramToDWARFExpressionTests.MultipleDependentAssignments (2128 of 2145) UNSUPPORTED: lldb-api :: benchmarks/turnaround/TestCompileRunToBreakpointTurnaround.py (2129 of 2145) PASS: lldb-unit :: Utility/./UtilityTests/StreamTest.PutSLEB128 (2130 of 2145) PASS: lldb-api :: lang/cpp/nested-class-other-compilation-unit/TestNestedClassWithParentInAnotherCU.py (2131 of 2145) UNSUPPORTED: lldb-shell :: ScriptInterpreter/Lua/nested_sessions.test (2132 of 2145) PASS: lldb-unit :: Utility/./UtilityTests/ArgsTest.TestAppendArg (2133 of 2145) PASS: lldb-unit :: Language/Highlighting/./HighlighterTests/HighlighterTest.HighlighterSelectionType (2134 of 2145) PASS: lldb-api :: functionalities/data-formatter/ptr_ref_typedef/TestPtrRef2Typedef.py (2135 of 2145) UNSUPPORTED: lldb-api :: functionalities/darwin_log/source/info/TestDarwinLogSourceInfo.py (2136 of 2145) PASS: lldb-api :: commands/version/TestVersion.py (2137 of 2145) PASS: lldb-unit :: Utility/./UtilityTests/LogChannelEnabledTest.LogVerboseThread (2138 of 2145) PASS: lldb-api :: functionalities/tail_call_frames/inlining_and_tail_calls/TestInliningAndTailCalls.py (2139 of 2145) PASS: lldb-api :: macosx/queues/TestQueues.py (2140 of 2145) PASS: lldb-api :: lang/c/stepping/TestStepAndBreakpoints.py (2141 of 2145) PASS: lldb-shell :: Reproducer/TestGDBRemoteRepro.test (2142 of 2145) PASS: lldb-shell :: ObjectFile/PECOFF/disassemble-thumb.yaml (2143 of 2145) PASS: lldb-api :: types/TestLongTypesExpr.py (2144 of 2145) PASS: lldb-api :: tools/lldb-server/TestLldbGdbServer.py (2145 of 2145) Slowest Tests: -------------------------------------------------------------------------- 259.38s: lldb-api :: macosx/simulator/TestSimulatorPlatform.py 97.82s: lldb-api :: tools/lldb-server/TestLldbGdbServer.py 97.57s: lldb-api :: commands/expression/import-std-module/basic/TestImportStdModule.py 93.55s: lldb-api :: lang/objc/modules-app-update/TestClangModulesAppUpdate.py 57.47s: lldb-api :: python_api/value/empty_class/TestValueAPIEmptyClass.py 53.16s: lldb-api :: lang/objc/hidden-ivars/TestHiddenIvars.py 50.68s: lldb-api :: lang/objc/exceptions/TestObjCExceptions.py 50.58s: lldb-api :: lang/objc/foundation/TestObjCMethods.py 50.03s: lldb-api :: lang/objc/foundation/TestFoundationDisassembly.py 48.64s: lldb-api :: api/multithreaded/TestMultithreaded.py 43.52s: lldb-api :: python_api/target/TestTargetAPI.py 43.35s: lldb-api :: types/TestLongTypesExpr.py 41.58s: lldb-api :: lang/cpp/namespace/TestNamespaceLookup.py 38.97s: lldb-api :: functionalities/tail_call_frames/thread_step_out_message/TestArtificialFrameStepOutMessage.py 37.59s: lldb-api :: functionalities/tsan/multiple/TestTsanMultiple.py 36.69s: lldb-api :: functionalities/completion/TestCompletion.py 36.28s: lldb-api :: commands/expression/import-std-module/pair/TestPairFromStdModule.py 35.91s: lldb-api :: lang/objc/objc-new-syntax/TestObjCNewSyntaxLiteral.py 33.09s: lldb-api :: lang/objc/forward-decl/TestForwardDecl.py 31.46s: lldb-api :: lang/objc/real-definition/TestRealDefinition.py

Hide Details

Tests Times: -------------------------------------------------------------------------- [ Range ] :: [ Percentage ] :: [ Count ] -------------------------------------------------------------------------- [240s,260s) :: [ ] :: [ 1/2145] [220s,240s) :: [ ] :: [ 0/2145] [200s,220s) :: [ ] :: [ 0/2145] [180s,200s) :: [ ] :: [ 0/2145] [160s,180s) :: [ ] :: [ 0/2145] [140s,160s) :: [ ] :: [ 0/2145] [120s,140s) :: [ ] :: [ 0/2145] [100s,120s) :: [ ] :: [ 0/2145] [ 80s,100s) :: [ ] :: [ 3/2145] [ 60s, 80s) :: [ ] :: [ 0/2145] [ 40s, 60s) :: [ ] :: [ 9/2145] [ 20s, 40s) :: [ ] :: [ 29/2145] [ 0s, 20s) :: [*************************************** ] :: [2103/2145] -------------------------------------------------------------------------- ******************** Failed Tests (1): lldb-api :: commands/gui/basicdebug/TestGuiBasicDebug.py

Hide Details

Hide Details

Testing Time: 1635.32s Unsupported : 151 Passed : 1987 Expectedly Failed: 6 Failed : 1 FAILED: tools/lldb/test/CMakeFiles/check-lldb-lit cd /Users/buildslave/jenkins/workspace/lldb-cmake/lldb-build/tools/lldb/test && /usr/local/Frameworks/Python.framework/Versions/3.7/bin/python3.7 /Users/buildslave/jenkins/workspace/lldb-cmake/lldb-build/./bin/llvm-lit -v --time-tests --shuffle --xunit-xml-output=/Users/buildslave/jenkins/workspace/lldb-cmake/test/results.xml -v -j 4 /Users/buildslave/jenkins/workspace/lldb-cmake/lldb-build/tools/lldb/test ninja: build stopped: subcommand failed. Command failed: Command '['/usr/bin/env', 'TERM=vt100', '/usr/local/bin/ninja', '-v', 'check-lldb']' returned non-zero exit status 1 Command: ['/usr/bin/env', 'TERM=vt100', '/usr/local/bin/ninja', '-v', 'check-lldb'] [Pipeline] } [Pipeline] // timeout [Pipeline] } [Pipeline] // stage [Pipeline] stage [Pipeline] { (Declarative: Post Actions) [Pipeline] scanForIssues [Clang (LLVM based)] Sleeping for 5 seconds due to JENKINS-32191... [Clang (LLVM based)] Parsing console log (workspace: '/Users/buildslave/jenkins/workspace/lldb-cmake') [Clang (LLVM based)] Successfully parsed console log [Clang (LLVM based)] -> found 4 issues (skipped 4 duplicates) [Clang (LLVM based)] Post processing issues on 'green-dragon-10' with source code encoding 'UTF-8' [Clang (LLVM based)] Creating SCM blamer to obtain author and commit information for affected files [Clang (LLVM based)] Creating SCM miner to obtain statistics for affected repository files [Clang (LLVM based)] Resolving file names for all issues in source directory '/Users/buildslave/jenkins/workspace/lldb-cmake' [Clang (LLVM based)] -> resolved paths in source directory (2 found, 0 not found) [Clang (LLVM based)] Resolving module names from module definitions (build.xml, pom.xml, or Manifest.mf files) [Clang (LLVM based)] -> resolved module names for 4 issues [Clang (LLVM based)] Resolving package names (or namespaces) by parsing the affected files [Clang (LLVM based)] -> resolved package names of 2 affected files [Clang (LLVM based)] No filter has been set, publishing all 4 issues [Clang (LLVM based)] Creating fingerprints for all affected code blocks to track issues over different builds [Clang (LLVM based)] -> created fingerprints for 4 issues (skipped 0 issues) [Clang (LLVM based)] Copying affected files to Jenkins' build folder '/Users/Shared/Jenkins/Home/jobs/lldb-cmake/builds/23909/files-with-issues' [Clang (LLVM based)] -> 2 copied, 0 not in workspace, 0 not-found, 0 with I/O error [Pipeline] junit Recording test results [Pipeline] emailext Warning: pzheng@quicinc.com is not a recognized user, but sending mail anyway Warning: i@maskray.me is not a recognized user, but sending mail anyway Warning: pzheng@quicinc.com is not a recognized user, but sending mail anyway Warning: i@maskray.me is not a recognized user, but sending mail anyway

Hide Details

Begin Pre-Send Script... Sending email to: mschifer@apple.com pzheng@quicinc.com i@maskray.me Florian Hahn <florian_hahn@apple.com> Azhar Mohammed <azhar@apple.com>
[Pipeline] } [Pipeline] // stage [Pipeline] } [Pipeline] // withEnv [Pipeline] } [Pipeline] // node [Pipeline] End of Pipeline ERROR: script returned exit code 1 Finished: FAILURE