FailedConsole Output

Skipping 16,426 KB.. Full Log
00000000000000000000000000000000000000000000000000000000000000000000000000000000000000000000000000000000000000000000000000000000000000000000000000000000000000000000000000000000000000000000000000000000000000000000000000000000000000000000000000000000000000000000000000000000000000000000000000000000000000000000000000000000000000000000000000000000000000000000000000000000000000000000000000000000000000000000000000000000000000000000000000000000000000000000#80
 <   5> send packet: $k#6b
 <   4> read packet: $#00
 <   1> send packet: +
 history[1] tid=0x0307 <   1> send packet: +
 <  19> send packet: $QStartNoAckMode#b0
 <   1> read packet: +
 <   6> read packet: $OK#9a
 <   1> send packet: +
 <  45> send packet: $qSupported:xmlRegisters=i386,arm,mips,arc#74
 <  57> read packet: $qXfer:features:read+;PacketSize=3fff;QStartNoAckMode+#86
 <  26> send packet: $QThreadSuffixSupported#e4
 <   4> read packet: $#00
 <  27> send packet: $QListThreadsInStopReply#21
 <   4> read packet: $#00
 <  13> send packet: $qHostInfo#9b
 <  28> read packet: $ptrsize:8;endian:little;#30
 <  10> send packet: $vCont?#49
 <   4> read packet: $#00
 <  27> send packet: $qVAttachOrWaitSupported#38
 <   4> read packet: $#00
 <  23> send packet: $QEnableErrorStrings#8c
 <   6> read packet: $OK#9a
 <  16> send packet: $qProcessInfo#dc
 <   4> read packet: $#00
 <   6> send packet: $qC#b4
 <   7> read packet: $QC0#c4
 <  16> send packet: $qfThreadInfo#bb
 <   5> read packet: $l#6c
 <   5> send packet: $?#3f
 <   7> read packet: $S02#b5
 <  16> send packet: $qProcessInfo#dc
 <   4> read packet: $#00
 <  41> send packet: $qXfer:features:read:target.xml:0,3ffe#af
 <   4> read packet: $#00
 <  18> send packet: $qRegisterInfo0#72
 <   4> read packet: $#00
 <  16> send packet: $qfThreadInfo#bb
 <   5> read packet: $l#6c
 <   7> send packet: $Hg1#e0
 <   6> read packet: $OK#9a
 <   6> send packet: $p0#a0
 <  12> read packet: $00000000#80
 <  16> send packet: $qProcessInfo#dc
 <   4> read packet: $#00
 <  12> send packet: $qOffsets#4b
 <   4> read packet: $#00
 <  26> send packet: $qStructuredDataPlugins#02
 <   4> read packet: $#00
 <  13> send packet: $qSymbol::#5b
 <   6> read packet: $OK#9a
 <  16> send packet: $qfThreadInfo#bb
 <   5> read packet: $l#6c
 <  16> send packet: $qfThreadInfo#bb
 <   5> read packet: $l#6c
 <   6> send packet: $pf#d6
 <  12> read packet: $00000000#80
 <   6> send packet: $pd#d4
 <  12> read packet: $00000000#80
 <   6> send packet: $p0#a0
 <  12> read packet: $00000000#80
 <   6> send packet: $p1#a1
 <  12> read packet: $00000000#80
 <   6> send packet: $p2#a2
 <  12> read packet: $00000000#80
 <   6> send packet: $p3#a3
 <  12> read packet: $00000000#80
 <   6> send packet: $p4#a4
 <  12> read packet: $00000000#80
 <   6> send packet: $p5#a5
 <  12> read packet: $00000000#80
 <   6> send packet: $p6#a6
 <  12> read packet: $00000000#80
 <   6> send packet: $p7#a7
 <  12> read packet: $00000000#80
 <   6> send packet: $p8#a8
 <  12> read packet: $00000000#80
 <   6> send packet: $p9#a9
 <  12> read packet: $00000000#80
 <   6> send packet: $pa#d1
 <  12> read packet: $00000000#80
 <   6> send packet: $pb#d2
 <  12> read packet: $00000000#80
 <   6> send packet: $pc#d3
 <  12> read packet: $00000000#80
 <   6> send packet: $pe#d5
 <  12> read packet: $00000000#80
 <   7> send packet: $p19#da
 <  12> read packet: $00000000#80
 <   5> send packet: $k#6b
 <   4> read packet: $#00
 <   1> send packet: +
 history[1] tid=0x0307 <   1> send packet: +
 <  19> send packet: $QStartNoAckMode#b0
 <   1> read packet: +
 <   6> read packet: $OK#9a
 <   1> send packet: +
 <  45> send packet: $qSupported:xmlRegisters=i386,arm,mips,arc#74
 <  57> read packet: $qXfer:features:read+;PacketSize=3fff;QStartNoAckMode+#86
 <  26> send packet: $QThreadSuffixSupported#e4
 <   4> read packet: $#00
 <  27> send packet: $QListThreadsInStopReply#21
 <   4> read packet: $#00
 <  13> send packet: $qHostInfo#9b
 <  28> read packet: $ptrsize:8;endian:little;#30
 <  10> send packet: $vCont?#49
 <   4> read packet: $#00
 <  27> send packet: $qVAttachOrWaitSupported#38
 <   4> read packet: $#00
 <  23> send packet: $QEnableErrorStrings#8c
 <   6> read packet: $OK#9a
 <  16> send packet: $qProcessInfo#dc
 <   4> read packet: $#00
 <   6> send packet: $qC#b4
 <   7> read packet: $QC0#c4
 <  16> send packet: $qfThreadInfo#bb
 <   5> read packet: $l#6c
 <   5> send packet: $?#3f
 <   7> read packet: $S02#b5
 <  16> send packet: $qProcessInfo#dc
 <   4> read packet: $#00
 <  41> send packet: $qXfer:features:read:target.xml:0,3ffe#af
 <   4> read packet: $#00
 <  18> send packet: $qRegisterInfo0#72
 <   4> read packet: $#00
 <  16> send packet: $qfThreadInfo#bb
 <   5> read packet: $l#6c
 <   7> send packet: $Hg1#e0
 <   6> read packet: $OK#9a
 <   6> send packet: $p0#a0
 <   4> read packet: $#00
 <  16> send packet: $qProcessInfo#dc
 <   4> read packet: $#00
 <  12> send packet: $qOffsets#4b
 <   4> read packet: $#00
 <  26> send packet: $qStructuredDataPlugins#02
 <   4> read packet: $#00
 <  13> send packet: $qSymbol::#5b
 <   6> read packet: $OK#9a
 <  16> send packet: $qfThreadInfo#bb
 <   5> read packet: $l#6c
 <  16> send packet: $qfThreadInfo#bb
 <   5> read packet: $l#6c
 <   5> send packet: $g#67
 < 860> read packet: $0000000000000000000000000000000000000000000000000000000000000000000000000000000000000000000000000000000000000000000000000000000000000000000000000000000000000000000000000000000000000000000000000000000000000000000000000000000000000000000000000000000000000000000000000000000000000000000000000000000000000000000000000000000000000000000000000000000000000000000000000000000000000000000000000000000000000000000000000000000000000000000000000000000000000000000000000000000000000000000000000000000000000000000000000000000000000000000000000000000000000000000000000000000000000000000000000000000000000000000000000000000000000000000000000000000000000000000000000000000000000000000000000000000000000000000000000000000000000000000000000000000000000000000000000000000000000000000000000000000000000000000000000000000000000000000000000000000000000000000000000000000000000000#80
 < 861> send packet: $G0000000000000000000000000000000000000000000000000000000000000000000000000000000000000000000000000000000000000000000000000000000000000000000000000000000000000000000000000000000000000000000000000000000000000000000000000000000000000000000000000000000000000000000000000000000000000000000000000000000000000000000000000000000000000000000000000000000000000000000000000000000000000000000000000000000000000000000000000000000000000000000000000000000000000000000000000000000000000000000000000000000000000000000000000000000000000000000000000000000000000000000000000000000000000000000000000000000000000000000000000000000000000000000000000000000000000000000000000000000000000000000000000000000000000000000000000000000000000000000000000000000000000000000000000000000000000000000000000000000000000000000000000000000000000000000000000000000000000000000000000000000000000000#c7
 <   6> read packet: $OK#9a
 < 861> send packet: $G0000000000000000000000000000000000000000000000000000000000000000000000000000000000000000000000000000000000000000000000000000000000000000000000000000000000000000000000000000000000000000000000000000000000000000000000000000000000000000000000000000000000000000000000000000000000000000000000000000000000000000000000000000000000000000000000000000000000000000000000000000000000000000000000000000000000000000000000000000000000000000000000000000000000000000000000000000000000000000000000000000000000000000000000000000000000000000000000000000000000000000000000000000000000000000000000000000000000000000000000000000000000000000000000000000000000000000000000000000000000000000000000000000000000000000000000000000000000000000000000000000000000000000000000000000000000000000000000000000000000000000000000000000000000000000000000000000000000000000000000000000000000000000#c7
 <   6> read packet: $OK#9a
 < 861> send packet: $G0000000000000000000000000000000000000000000000000000000000000000000000000000000000000000000000000000000000000000000000000000000000000000000000000000000000000000000000000000000000000000000000000000000000000000000000000000000000000000000000000000000000000000000000000000000000000000000000000000000000000000000000000000000000000000000000000000000000000000000000000000000000000000000000000000000000000000000000000000000000000000000000000000000000000000000000000000000000000000000000000000000000000000000000000000000000000000000000000000000000000000000000000000000000000000000000000000000000000000000000000000000000000000000000000000000000000000000000000000000000000000000000000000000000000000000000000000000000000000000000000000000000000000000000000000000000000000000000000000000000000000000000000000000000000000000000000000000000000000000000000000000000000000#c7
 <   6> read packet: $OK#9a
 < 861> send packet: $G0000000000000000000000000000000000000000000000000000000000000000000000000000000000000000000000000000000000000000000000000000000000000000000000000000000000000000000000000000000000000000000000000000000000000000000000000000000000000000000000000000000000000000000000000000000000000000000000000000000000000000000000000000000000000000000000000000000000000000000000000000000000000000000000000000000000000000000000000000000000000000000000000000000000000000000000000000000000000000000000000000000000000000000000000000000000000000000000000000000000000000000000000000000000000000000000000000000000000000000000000000000000000000000000000000000000000000000000000000000000000000000000000000000000000000000000000000000000000000000000000000000000000000000000000000000000000000000000000000000000000000000000000000000000000000000000000000000000000000000000000000000000000000#c7
 <   6> read packet: $OK#9a
 < 861> send packet: $G0000000000000000000000000000000000000000000000000000000000000000000000000000000000000000000000000000000000000000000000000000000000000000000000000000000000000000000000000000000000000000000000000000000000000000000000000000000000000000000000000000000000000000000000000000000000000000000000000000000000000000000000000000000000000000000000000000000000000000000000000000000000000000000000000000000000000000000000000000000000000000000000000000000000000000000000000000000000000000000000000000000000000000000000000000000000000000000000000000000000000000000000000000000000000000000000000000000000000000000000000000000000000000000000000000000000000000000000000000000000000000000000000000000000000000000000000000000000000000000000000000000000000000000000000000000000000000000000000000000000000000000000000000000000000000000000000000000000000000000000000000000000000000#c7
 <   6> read packet: $OK#9a
 < 861> send packet: $G0000000000000000000000000000000000000000000000000000000000000000000000000000000000000000000000000000000000000000000000000000000000000000000000000000000000000000000000000000000000000000000000000000000000000000000000000000000000000000000000000000000000000000000000000000000000000000000000000000000000000000000000000000000000000000000000000000000000000000000000000000000000000000000000000000000000000000000000000000000000000000000000000000000000000000000000000000000000000000000000000000000000000000000000000000000000000000000000000000000000000000000000000000000000000000000000000000000000000000000000000000000000000000000000000000000000000000000000000000000000000000000000000000000000000000000000000000000000000000000000000000000000000000000000000000000000000000000000000000000000000000000000000000000000000000000000000000000000000000000000000000000000000000#c7
 <   6> read packet: $OK#9a
 < 861> send packet: $G0000000000000000000000000000000000000000000000000000000000000000000000000000000000000000000000000000000000000000000000000000000000000000000000000000000000000000000000000000000000000000000000000000000000000000000000000000000000000000000000000000000000000000000000000000000000000000000000000000000000000000000000000000000000000000000000000000000000000000000000000000000000000000000000000000000000000000000000000000000000000000000000000000000000000000000000000000000000000000000000000000000000000000000000000000000000000000000000000000000000000000000000000000000000000000000000000000000000000000000000000000000000000000000000000000000000000000000000000000000000000000000000000000000000000000000000000000000000000000000000000000000000000000000000000000000000000000000000000000000000000000000000000000000000000000000000000000000000000000000000000000000000000000#c7
 <   6> read packet: $OK#9a
 < 861> send packet: $G0000000000000000000000000000000000000000000000000000000000000000000000000000000000000000000000000000000000000000000000000000000000000000000000000000000000000000000000000000000000000000000000000000000000000000000000000000000000000000000000000000000000000000000000000000000000000000000000000000000000000000000000000000000000000000000000000000000000000000000000000000000000000000000000000000000000000000000000000000000000000000000000000000000000000000000000000000000000000000000000000000000000000000000000000000000000000000000000000000000000000000000000000000000000000000000000000000000000000000000000000000000000000000000000000000000000000000000000000000000000000000000000000000000000000000000000000000000000000000000000000000000000000000000000000000000000000000000000000000000000000000000000000000000000000000000000000000000000000000000000000000000000000000#c7
 <   6> read packet: $OK#9a
 < 861> send packet: $G0000000000000000000000000000000000000000000000000000000000000000000000000000000000000000000000000000000000000000000000000000000000000000000000000000000000000000000000000000000000000000000000000000000000000000000000000000000000000000000000000000000000000000000000000000000000000000000000000000000000000000000000000000000000000000000000000000000000000000000000000000000000000000000000000000000000000000000000000000000000000000000000000000000000000000000000000000000000000000000000000000000000000000000000000000000000000000000000000000000000000000000000000000000000000000000000000000000000000000000000000000000000000000000000000000000000000000000000000000000000000000000000000000000000000000000000000000000000000000000000000000000000000000000000000000000000000000000000000000000000000000000000000000000000000000000000000000000000000000000000000000000000000000#c7
 <   6> read packet: $OK#9a
 < 861> send packet: $G0000000000000000000000000000000000000000000000000000000000000000000000000000000000000000000000000000000000000000000000000000000000000000000000000000000000000000000000000000000000000000000000000000000000000000000000000000000000000000000000000000000000000000000000000000000000000000000000000000000000000000000000000000000000000000000000000000000000000000000000000000000000000000000000000000000000000000000000000000000000000000000000000000000000000000000000000000000000000000000000000000000000000000000000000000000000000000000000000000000000000000000000000000000000000000000000000000000000000000000000000000000000000000000000000000000000000000000000000000000000000000000000000000000000000000000000000000000000000000000000000000000000000000000000000000000000000000000000000000000000000000000000000000000000000000000000000000000000000000000000000000000000000000#c7
 <   6> read packet: $OK#9a
 < 861> send packet: $G0000000000000000000000000000000000000000000000000000000000000000000000000000000000000000000000000000000000000000000000000000000000000000000000000000000000000000000000000000000000000000000000000000000000000000000000000000000000000000000000000000000000000000000000000000000000000000000000000000000000000000000000000000000000000000000000000000000000000000000000000000000000000000000000000000000000000000000000000000000000000000000000000000000000000000000000000000000000000000000000000000000000000000000000000000000000000000000000000000000000000000000000000000000000000000000000000000000000000000000000000000000000000000000000000000000000000000000000000000000000000000000000000000000000000000000000000000000000000000000000000000000000000000000000000000000000000000000000000000000000000000000000000000000000000000000000000000000000000000000000000000000000000000#c7
 <   6> read packet: $OK#9a
 < 861> send packet: $G0000000000000000000000000000000000000000000000000000000000000000000000000000000000000000000000000000000000000000000000000000000000000000000000000000000000000000000000000000000000000000000000000000000000000000000000000000000000000000000000000000000000000000000000000000000000000000000000000000000000000000000000000000000000000000000000000000000000000000000000000000000000000000000000000000000000000000000000000000000000000000000000000000000000000000000000000000000000000000000000000000000000000000000000000000000000000000000000000000000000000000000000000000000000000000000000000000000000000000000000000000000000000000000000000000000000000000000000000000000000000000000000000000000000000000000000000000000000000000000000000000000000000000000000000000000000000000000000000000000000000000000000000000000000000000000000000000000000000000000000000000000000000000#c7
 <   6> read packet: $OK#9a
 < 861> send packet: $G0000000000000000000000000000000000000000000000000000000000000000000000000000000000000000000000000000000000000000000000000000000000000000000000000000000000000000000000000000000000000000000000000000000000000000000000000000000000000000000000000000000000000000000000000000000000000000000000000000000000000000000000000000000000000000000000000000000000000000000000000000000000000000000000000000000000000000000000000000000000000000000000000000000000000000000000000000000000000000000000000000000000000000000000000000000000000000000000000000000000000000000000000000000000000000000000000000000000000000000000000000000000000000000000000000000000000000000000000000000000000000000000000000000000000000000000000000000000000000000000000000000000000000000000000000000000000000000000000000000000000000000000000000000000000000000000000000000000000000000000000000000000000000#c7
 <   6> read packet: $OK#9a
 < 861> send packet: $G0000000000000000000000000000000000000000000000000000000000000000000000000000000000000000000000000000000000000000000000000000000000000000000000000000000000000000000000000000000000000000000000000000000000000000000000000000000000000000000000000000000000000000000000000000000000000000000000000000000000000000000000000000000000000000000000000000000000000000000000000000000000000000000000000000000000000000000000000000000000000000000000000000000000000000000000000000000000000000000000000000000000000000000000000000000000000000000000000000000000000000000000000000000000000000000000000000000000000000000000000000000000000000000000000000000000000000000000000000000000000000000000000000000000000000000000000000000000000000000000000000000000000000000000000000000000000000000000000000000000000000000000000000000000000000000000000000000000000000000000000000000000000000#c7
 <   6> read packet: $OK#9a
 < 861> send packet: $G0000000000000000000000000000000000000000000000000000000000000000000000000000000000000000000000000000000000000000000000000000000000000000000000000000000000000000000000000000000000000000000000000000000000000000000000000000000000000000000000000000000000000000000000000000000000000000000000000000000000000000000000000000000000000000000000000000000000000000000000000000000000000000000000000000000000000000000000000000000000000000000000000000000000000000000000000000000000000000000000000000000000000000000000000000000000000000000000000000000000000000000000000000000000000000000000000000000000000000000000000000000000000000000000000000000000000000000000000000000000000000000000000000000000000000000000000000000000000000000000000000000000000000000000000000000000000000000000000000000000000000000000000000000000000000000000000000000000000000000000000000000000000000#c7
 <   6> read packet: $OK#9a
 < 861> send packet: $G0000000000000000000000000000000000000000000000000000000000000000000000000000000000000000000000000000000000000000000000000000000000000000000000000000000000000000000000000000000000000000000000000000000000000000000000000000000000000000000000000000000000000000000000000000000000000000000000000000000000000000000000000000000000000000000000000000000000000000000000000000000000000000000000000000000000000000000000000000000000000000000000000000000000000000000000000000000000000000000000000000000000000000000000000000000000000000000000000000000000000000000000000000000000000000000000000000000000000000000000000000000000000000000000000000000000000000000000000000000000000000000000000000000000000000000000000000000000000000000000000000000000000000000000000000000000000000000000000000000000000000000000000000000000000000000000000000000000000000000000000000000000000000#c7
 <   6> read packet: $OK#9a
 < 861> send packet: $G0000000000000000000000000000000000000000000000000000000000000000000000000000000000000000000000000000000000000000000000000000000000000000000000000000000000000000000000000000000000000000000000000000000000000000000000000000000000000000000000000000000000000000000000000000000000000000000000000000000000000000000000000000000000000000000000000000000000000000000000000000000000000000000000000000000000000000000000000000000000000000000000000000000000000000000000000000000000000000000000000000000000000000000000000000000000000000000000000000000000000000000000000000000000000000000000000000000000000000000000000000000000000000000000000000000000000000000000000000000000000000000000000000000000000000000000000000000000000000000000000000000000000000000000000000000000000000000000000000000000000000000000000000000000000000000000000000000000000000000000000000000000000000#c7
 <   6> read packet: $OK#9a
 <   5> send packet: $k#6b
 <   4> read packet: $#00
 <   1> send packet: +
 history[1] tid=0x0307 <   1> send packet: +
 <  19> send packet: $QStartNoAckMode#b0
 <   1> read packet: +
 <   6> read packet: $OK#9a
 <   1> send packet: +
 <  45> send packet: $qSupported:xmlRegisters=i386,arm,mips,arc#74
 <  57> read packet: $qXfer:features:read+;PacketSize=3fff;QStartNoAckMode+#86
 <  26> send packet: $QThreadSuffixSupported#e4
 <   4> read packet: $#00
 <  27> send packet: $QListThreadsInStopReply#21
 <   4> read packet: $#00
 <  13> send packet: $qHostInfo#9b
 <  28> read packet: $ptrsize:8;endian:little;#30
 <  10> send packet: $vCont?#49
 <   4> read packet: $#00
 <  27> send packet: $qVAttachOrWaitSupported#38
 <   4> read packet: $#00
 <  23> send packet: $QEnableErrorStrings#8c
 <   6> read packet: $OK#9a
 <  16> send packet: $qProcessInfo#dc
 <   4> read packet: $#00
 <   6> send packet: $qC#b4
 <   7> read packet: $QC0#c4
 <  16> send packet: $qfThreadInfo#bb
 <   5> read packet: $l#6c
 <   5> send packet: $?#3f
 <   7> read packet: $S02#b5
 <  16> send packet: $qProcessInfo#dc
 <   4> read packet: $#00
 <  41> send packet: $qXfer:features:read:target.xml:0,3ffe#af
 <   4> read packet: $#00
 <  18> send packet: $qRegisterInfo0#72
 <   4> read packet: $#00
 <  16> send packet: $qfThreadInfo#bb
 <   5> read packet: $l#6c
 <   7> send packet: $Hg1#e0
 <   6> read packet: $OK#9a
 <   6> send packet: $p0#a0
 <  12> read packet: $00000000#80
 <  16> send packet: $qProcessInfo#dc
 <   4> read packet: $#00
 <  12> send packet: $qOffsets#4b
 <   4> read packet: $#00
 <  26> send packet: $qStructuredDataPlugins#02
 <   4> read packet: $#00
 <  13> send packet: $qSymbol::#5b
 <   6> read packet: $OK#9a
 <  16> send packet: $qfThreadInfo#bb
 <   5> read packet: $l#6c
 <  16> send packet: $qfThreadInfo#bb
 <   5> read packet: $l#6c
 <   6> send packet: $pf#d6
 <  12> read packet: $00000000#80
 <   6> send packet: $pd#d4
 <  12> read packet: $00000000#80
 <  15> send packet: $P0=00000000#3d
 <   6> read packet: $OK#9a
 <  15> send packet: $P1=00000000#3e
 <   6> read packet: $OK#9a
 <  15> send packet: $P2=00000000#3f
 <   6> read packet: $OK#9a
 <  15> send packet: $P3=00000000#40
 <   6> read packet: $OK#9a
 <  15> send packet: $P4=00000000#41
 <   6> read packet: $OK#9a
 <  15> send packet: $P5=00000000#42
 <   6> read packet: $OK#9a
 <  15> send packet: $P6=00000000#43
 <   6> read packet: $OK#9a
 <  15> send packet: $P7=00000000#44
 <   6> read packet: $OK#9a
 <  15> send packet: $P8=00000000#45
 <   6> read packet: $OK#9a
 <  15> send packet: $P9=00000000#46
 <   6> read packet: $OK#9a
 <  15> send packet: $Pa=00000000#6e
 <   6> read packet: $OK#9a
 <  15> send packet: $Pb=00000000#6f
 <   6> read packet: $OK#9a
 <  15> send packet: $Pc=00000000#70
 <   6> read packet: $OK#9a
 <  15> send packet: $Pd=00000000#71
 <   6> read packet: $OK#9a
 <  15> send packet: $Pe=00000000#72
 <   6> read packet: $OK#9a
 <  15> send packet: $Pf=00000000#73
 <   6> read packet: $OK#9a
 <  16> send packet: $P19=00000000#77
 <   6> read packet: $OK#9a
 <   5> send packet: $k#6b
 <   4> read packet: $#00
libstdcxx tests will not be run because: Don't know how to build with libstdcxx on macosx
Skipping following debug info categories: ['dwo']

Hide Details

-- Command Output (stderr): --

Hide Details

Session logs for test failures/errors/unexpected successes will go into directory '/Users/buildslave/jenkins/workspace/lldb-cmake/lldb-build/lldb-test-traces' Change dir to: /Users/buildslave/jenkins/workspace/lldb-cmake/llvm-project/lldb/test/API/functionalities/gdb_remote_client runCmd: settings clear -all output:

Hide Details

runCmd: settings set symbols.enable-external-lookup false output:

Hide Details

runCmd: settings set target.inherit-tcc true output:

Hide Details

runCmd: settings set target.auto-apply-fixits false output:

Hide Details

runCmd: settings set plugin.process.gdb-remote.packet-timeout 60 output:

Hide Details

runCmd: settings set symbols.clang-modules-cache-path "/Users/buildslave/jenkins/workspace/lldb-cmake/lldb-build/lldb-test-build.noindex/module-cache-lldb/lldb-api" output:

Hide Details

runCmd: settings set use-color false output:

Hide Details

runCmd: setting set target.prefer-dynamic-value no-dynamic-values output:

Hide Details

<bound method SBProcess.Kill of <lldb.SBProcess; proxy of <Swig Object of type 'lldb::SBProcess *' at 0x11459e5d0> >>: success

Hide Details

PASS: LLDB (/Users/buildslave/jenkins/workspace/lldb-cmake/lldb-build/bin/clang-x86_64) :: test_attach_fail (TestGDBRemoteClient.TestGDBRemoteClient) runCmd: settings clear -all output:

Hide Details

runCmd: settings set symbols.enable-external-lookup false output:

Hide Details

runCmd: settings set target.inherit-tcc true output:

Hide Details

runCmd: settings set target.auto-apply-fixits false output:

Hide Details

runCmd: settings set plugin.process.gdb-remote.packet-timeout 60 output:

Hide Details

runCmd: settings set symbols.clang-modules-cache-path "/Users/buildslave/jenkins/workspace/lldb-cmake/lldb-build/lldb-test-build.noindex/module-cache-lldb/lldb-api" output:

Hide Details

runCmd: settings set use-color false output:

Hide Details

runCmd: setting set target.prefer-dynamic-value no-dynamic-values output:

Hide Details

FAIL: LLDB (/Users/buildslave/jenkins/workspace/lldb-cmake/lldb-build/bin/clang-x86_64) :: test_connect (TestGDBRemoteClient.TestGDBRemoteClient) <bound method SBProcess.Kill of <lldb.SBProcess; proxy of <Swig Object of type 'lldb::SBProcess *' at 0x10d017690> >>: success

Hide Details

runCmd: settings clear -all output:

Hide Details

runCmd: settings set symbols.enable-external-lookup false output:

Hide Details

runCmd: settings set target.inherit-tcc true output:

Hide Details

runCmd: settings set target.auto-apply-fixits false output:

Hide Details

runCmd: settings set plugin.process.gdb-remote.packet-timeout 60 output:

Hide Details

runCmd: settings set symbols.clang-modules-cache-path "/Users/buildslave/jenkins/workspace/lldb-cmake/lldb-build/lldb-test-build.noindex/module-cache-lldb/lldb-api" output:

Hide Details

runCmd: settings set use-color false output:

Hide Details

runCmd: setting set target.prefer-dynamic-value no-dynamic-values output:

Hide Details

runCmd: log enable gdb-remote packets output:

Hide Details

<bound method SBProcess.Kill of <lldb.SBProcess; proxy of <Swig Object of type 'lldb::SBProcess *' at 0x11459e720> >>: success

Hide Details

PASS: LLDB (/Users/buildslave/jenkins/workspace/lldb-cmake/lldb-build/bin/clang-x86_64) :: test_launch_fail (TestGDBRemoteClient.TestGDBRemoteClient) runCmd: settings clear -all output:

Hide Details

runCmd: settings set symbols.enable-external-lookup false output:

Hide Details

runCmd: settings set target.inherit-tcc true output:

Hide Details

runCmd: settings set target.auto-apply-fixits false output:

Hide Details

runCmd: settings set plugin.process.gdb-remote.packet-timeout 60 output:

Hide Details

runCmd: settings set symbols.clang-modules-cache-path "/Users/buildslave/jenkins/workspace/lldb-cmake/lldb-build/lldb-test-build.noindex/module-cache-lldb/lldb-api" output:

Hide Details

runCmd: settings set use-color false output:

Hide Details

runCmd: setting set target.prefer-dynamic-value no-dynamic-values output:

Hide Details

Adding tearDown hook: self.addTearDownHook(lambda: self.runCmd("settings set plugin.process.gdb-remote.use-g-packet-for-reading false"))

Hide Details

Hide Details

<bound method SBProcess.Kill of <lldb.SBProcess; proxy of <Swig Object of type 'lldb::SBProcess *' at 0x10d017660> >>: success

Hide Details

Executing tearDown hook: self.addTearDownHook(lambda: self.runCmd("settings set plugin.process.gdb-remote.use-g-packet-for-reading false"))

Hide Details

Hide Details

runCmd: settings set plugin.process.gdb-remote.use-g-packet-for-reading false output:

Hide Details

PASS: LLDB (/Users/buildslave/jenkins/workspace/lldb-cmake/lldb-build/bin/clang-x86_64) :: test_read_registers_using_g_packets (TestGDBRemoteClient.TestGDBRemoteClient) runCmd: settings clear -all output:

Hide Details

runCmd: settings set symbols.enable-external-lookup false output:

Hide Details

runCmd: settings set target.inherit-tcc true output:

Hide Details

runCmd: settings set target.auto-apply-fixits false output:

Hide Details

runCmd: settings set plugin.process.gdb-remote.packet-timeout 60 output:

Hide Details

runCmd: settings set symbols.clang-modules-cache-path "/Users/buildslave/jenkins/workspace/lldb-cmake/lldb-build/lldb-test-build.noindex/module-cache-lldb/lldb-api" output:

Hide Details

runCmd: settings set use-color false output:

Hide Details

runCmd: setting set target.prefer-dynamic-value no-dynamic-values output:

Hide Details

<bound method SBProcess.Kill of <lldb.SBProcess; proxy of <Swig Object of type 'lldb::SBProcess *' at 0x11459e720> >>: success

Hide Details

PASS: LLDB (/Users/buildslave/jenkins/workspace/lldb-cmake/lldb-build/bin/clang-x86_64) :: test_read_registers_using_p_packets (TestGDBRemoteClient.TestGDBRemoteClient) runCmd: settings clear -all output:

Hide Details

runCmd: settings set symbols.enable-external-lookup false output:

Hide Details

runCmd: settings set target.inherit-tcc true output:

Hide Details

runCmd: settings set target.auto-apply-fixits false output:

Hide Details

runCmd: settings set plugin.process.gdb-remote.packet-timeout 60 output:

Hide Details

runCmd: settings set symbols.clang-modules-cache-path "/Users/buildslave/jenkins/workspace/lldb-cmake/lldb-build/lldb-test-build.noindex/module-cache-lldb/lldb-api" output:

Hide Details

runCmd: settings set use-color false output:

Hide Details

runCmd: setting set target.prefer-dynamic-value no-dynamic-values output:

Hide Details

<bound method SBProcess.Kill of <lldb.SBProcess; proxy of <Swig Object of type 'lldb::SBProcess *' at 0x10d017660> >>: success

Hide Details

PASS: LLDB (/Users/buildslave/jenkins/workspace/lldb-cmake/lldb-build/bin/clang-x86_64) :: test_write_registers_using_G_packets (TestGDBRemoteClient.TestGDBRemoteClient) runCmd: settings clear -all output:

Hide Details

runCmd: settings set symbols.enable-external-lookup false output:

Hide Details

runCmd: settings set target.inherit-tcc true output:

Hide Details

runCmd: settings set target.auto-apply-fixits false output:

Hide Details

runCmd: settings set plugin.process.gdb-remote.packet-timeout 60 output:

Hide Details

runCmd: settings set symbols.clang-modules-cache-path "/Users/buildslave/jenkins/workspace/lldb-cmake/lldb-build/lldb-test-build.noindex/module-cache-lldb/lldb-api" output:

Hide Details

runCmd: settings set use-color false output:

Hide Details

runCmd: setting set target.prefer-dynamic-value no-dynamic-values output:

Hide Details

<bound method SBProcess.Kill of <lldb.SBProcess; proxy of <Swig Object of type 'lldb::SBProcess *' at 0x11459e720> >>: success

Hide Details

PASS: LLDB (/Users/buildslave/jenkins/workspace/lldb-cmake/lldb-build/bin/clang-x86_64) :: test_write_registers_using_P_packets (TestGDBRemoteClient.TestGDBRemoteClient) Restore dir to: /Users/buildslave/jenkins/workspace/lldb-cmake/lldb-build/tools/lldb/test ====================================================================== FAIL: test_connect (TestGDBRemoteClient.TestGDBRemoteClient) Test connecting to a remote gdb server ---------------------------------------------------------------------- Traceback (most recent call last): File "/Users/buildslave/jenkins/workspace/lldb-cmake/llvm-project/lldb/test/API/functionalities/gdb_remote_client/TestGDBRemoteClient.py", line 18, in test_connect process = self.connect(target) File "/Users/buildslave/jenkins/workspace/lldb-cmake/llvm-project/lldb/test/API/functionalities/gdb_remote_client/gdbclientutils.py", line 524, in connect self.assertTrue(error.Success(), error.description) AssertionError: False is not True : failed to get reply to handshake packet Config=x86_64-/Users/buildslave/jenkins/workspace/lldb-cmake/lldb-build/bin/clang ---------------------------------------------------------------------- Ran 7 tests in 106.268s

Hide Details

RESULT: FAILED (6 passes, 1 failures, 0 errors, 0 skipped, 0 expected failures, 0 unexpected successes)

Hide Details

--

Hide Details

******************** PASS: lldb-unit :: SymbolFile/NativePDB/./SymbolFileNativePDBTests/PDBFPOProgramToDWARFExpressionTests.UnresolvedDependentCyclicRegisterAssignmentReference (998 of 2154) PASS: lldb-shell :: Reproducer/TestWorkingDir.test (999 of 2154) PASS: lldb-unit :: Utility/./UtilityTests/Flags.AnyClear (1000 of 2154) PASS: lldb-api :: lang/cpp/template-function/TestTemplateFunctions.py (1001 of 2154) PASS: lldb-unit :: Utility/./UtilityTests/FileSpecTest.Yaml (1002 of 2154) PASS: lldb-unit :: Utility/./UtilityTests/ArgsTest.TestAppendArg (1003 of 2154) PASS: lldb-unit :: UnwindAssembly/x86/./UnwindAssemblyx86Tests/Testx86AssemblyInspectionEngine.TestSpillRegToStackViaMOVi386 (1004 of 2154) PASS: lldb-unit :: tools/lldb-server/tests/./LLDBServerTests/TestBase.LaunchModePreservesEnvironment (1005 of 2154) PASS: lldb-shell :: BuildScript/script-args.test (1006 of 2154) PASS: lldb-unit :: Breakpoint/./LLDBBreakpointTests/BreakpointIDTest.StringIsBreakpointName (1007 of 2154) PASS: lldb-unit :: Utility/./UtilityTests/RecordReplayTest.InstrumentedBar (1008 of 2154) PASS: lldb-api :: functionalities/type_lookup/TestTypeLookup.py (1009 of 2154) PASS: lldb-api :: functionalities/thread/concurrent_events/TestConcurrentSignalWatch.py (1010 of 2154) PASS: lldb-api :: python_api/value/change_values/TestChangeValueAPI.py (1011 of 2154) PASS: lldb-unit :: Utility/./UtilityTests/StringLexerTest.NextIf (1012 of 2154) PASS: lldb-shell :: SymbolFile/Breakpad/unwind-via-stack-win-no-memory-info.yaml (1013 of 2154) PASS: lldb-unit :: Utility/./UtilityTests/StreamTest.PutCString (1014 of 2154) UNSUPPORTED: lldb-api :: functionalities/breakpoint/breakpoint_in_delayslot/TestAvoidBreakpointInDelaySlot.py (1015 of 2154) PASS: lldb-api :: commands/expression/inline-namespace/TestInlineNamespace.py (1016 of 2154) PASS: lldb-api :: lang/objcxx/cxx-bridged-po/TestObjCXXBridgedPO.py (1017 of 2154) PASS: lldb-api :: functionalities/breakpoint/comp_dir_symlink/TestCompDirSymLink.py (1018 of 2154) PASS: lldb-unit :: Core/./LLDBCoreTests/MangledTest.ResultForBlockInvocation (1019 of 2154) UNSUPPORTED: lldb-shell :: Register/x86-64-gp-write.test (1020 of 2154) PASS: lldb-shell :: SymbolFile/DWARF/debug-types-address-ranges.s (1021 of 2154) PASS: lldb-unit :: API/./APITests/SBCommandInterpreterTest.MultiWordCommand (1022 of 2154) UNSUPPORTED: lldb-shell :: SymbolFile/PDB/ast-restore.test (1023 of 2154) PASS: lldb-api :: lang/objc/exceptions/TestObjCExceptions.py (1024 of 2154) PASS: lldb-api :: functionalities/memory/cache/TestMemoryCache.py (1025 of 2154) PASS: lldb-unit :: Utility/./UtilityTests/BinaryStreamTest.PutULEB128OneByte (1026 of 2154) PASS: lldb-api :: macosx/DBGSourcePathRemapping/TestDSYMSourcePathRemapping.py (1027 of 2154) PASS: lldb-api :: api/multithreaded/TestMultithreaded.py (1028 of 2154) PASS: lldb-unit :: Utility/./UtilityTests/StringExtractorTest.GetU32LittleEndian (1029 of 2154) PASS: lldb-api :: lang/cpp/inlines/TestInlines.py (1030 of 2154) PASS: lldb-api :: lang/objc/objc-dyn-sbtype/TestObjCDynamicSBType.py (1031 of 2154) PASS: lldb-unit :: Utility/./UtilityTests/OptionsWithRawTest.WhitespaceSuffix (1032 of 2154) PASS: lldb-unit :: ObjectFile/Breakpad/./ObjectFileBreakpadTests/FuncRecord.parse (1033 of 2154) PASS: lldb-api :: functionalities/data-formatter/data-formatter-objc/TestDataFormatterObjCNSDate.py (1034 of 2154) UNSUPPORTED: lldb-api :: functionalities/unwind/standard/TestStandardUnwind.py (1035 of 2154) PASS: lldb-unit :: Utility/./UtilityTests/StringListTest.SplitIntoLines (1036 of 2154) PASS: lldb-api :: macosx/dyld-trie-symbols/TestDyldTrieSymbols.py (1037 of 2154) PASS: lldb-api :: tools/lldb-server/TestGdbRemote_vCont.py (1038 of 2154) PASS: lldb-api :: python_api/function_symbol/TestSymbolAPI.py (1039 of 2154) UNSUPPORTED: lldb-shell :: SymbolFile/DWARF/debug-types-expressions.test (1040 of 2154) UNSUPPORTED: lldb-shell :: Unwind/eh-frame-small-fde.test (1041 of 2154) PASS: lldb-api :: commands/frame/var/TestFrameVar.py (1042 of 2154) PASS: lldb-unit :: Utility/./UtilityTests/FileSpecTest.Equal (1043 of 2154) PASS: lldb-api :: commands/command/invalid-args/TestInvalidArgsCommand.py (1044 of 2154) PASS: lldb-unit :: Host/./HostTests/SocketAddressTest.Set (1045 of 2154) PASS: lldb-api :: functionalities/conditional_break/TestConditionalBreak.py (1046 of 2154) PASS: lldb-unit :: Process/minidump/./LLDBMinidumpTests/MinidumpParserTest.MinidumpDuplicateModuleSeparateCode (1047 of 2154) PASS: lldb-shell :: Breakpoint/debug_rnglistx_rlex.test (1048 of 2154) PASS: lldb-api :: commands/source/info/TestSourceInfo.py (1049 of 2154) PASS: lldb-unit :: Utility/./UtilityTests/StringExtractorTest.InitEmpty (1050 of 2154) PASS: lldb-api :: lang/cpp/signed_types/TestSignedTypes.py (1051 of 2154) PASS: lldb-unit :: Utility/./UtilityTests/RangeTest.NotEqualInvalid (1052 of 2154) PASS: lldb-unit :: Core/./LLDBCoreTests/ModuleSpecTest.TestELFFile (1053 of 2154) PASS: lldb-shell :: ObjectFile/PECOFF/symbol.yaml (1054 of 2154) PASS: lldb-unit :: Utility/./UtilityTests/DataExtractorTest.GetFloat (1055 of 2154) PASS: lldb-shell :: Minidump/fb-dump.test (1056 of 2154) PASS: lldb-unit :: SymbolFile/NativePDB/./SymbolFileNativePDBTests/PDBFPOProgramToDWARFExpressionTests.UnresolvedRegisterAssignmentReference (1057 of 2154) PASS: lldb-unit :: Symbol/./SymbolTests/TestClangASTImporter.CanImportInvalidType (1058 of 2154) PASS: lldb-unit :: Symbol/./SymbolTests/TestTypeSystemClang.TestDeletingImplicitCopyCstrDueToMoveCStr (1059 of 2154) PASS: lldb-shell :: ScriptInterpreter/Python/sb_address_exception.test (1060 of 2154) PASS: lldb-shell :: SymbolFile/DWARF/DW_AT_low_pc-addrx.s (1061 of 2154) PASS: lldb-unit :: Utility/./UtilityTests/VMRange.SetEndAddress (1062 of 2154) PASS: lldb-shell :: Commands/command-thread-select.test (1063 of 2154) PASS: lldb-unit :: UnwindAssembly/x86/./UnwindAssemblyx86Tests/Testx86AssemblyInspectionEngine.TestPopR13 (1064 of 2154) PASS: lldb-shell :: Reproducer/TestSynchronous.test (1065 of 2154) UNSUPPORTED: lldb-api :: functionalities/thread/concurrent_events/TestConcurrentManySignals.py (1066 of 2154) PASS: lldb-unit :: Symbol/./SymbolTests/TestClangASTImporter.MetadataPropagationAfterCopying (1067 of 2154) PASS: lldb-unit :: Utility/./UtilityTests/ScalarTest.Scalar_512 (1068 of 2154) PASS: lldb-unit :: Utility/./UtilityTests/StringListTest.JoinThree (1069 of 2154) PASS: lldb-unit :: Interpreter/./InterpreterTests/OptionValueFileColonLine.setFromString (1070 of 2154) PASS: lldb-unit :: Utility/./UtilityTests/ArgsTest.TestTrailingBackslash (1071 of 2154) PASS: lldb-shell :: SymbolFile/DWARF/find-variable-dwo.cpp (1072 of 2154) PASS: lldb-unit :: UnwindAssembly/x86/./UnwindAssemblyx86Tests/Testx86AssemblyInspectionEngine.TestDisassemblyMidFunctionEpilogues (1073 of 2154) PASS: lldb-unit :: Utility/./UtilityTests/RangeDataVector.FindEntryIndexesThatContain_Overlap (1074 of 2154) PASS: lldb-unit :: Expression/./ExpressionTests/ClangHostTest.ComputeClangResourceDirectory (1075 of 2154) PASS: lldb-api :: macosx/simulator/TestSimulatorPlatform.py (1076 of 2154) PASS: lldb-unit :: Utility/./UtilityTests/StringListTest.GetMaxStringLengthMixed (1077 of 2154) PASS: lldb-api :: commands/expression/import-std-module/basic/TestImportStdModule.py (1078 of 2154) PASS: lldb-unit :: Utility/./UtilityTests/DataExtractorTest.GetDoubleUnaligned (1079 of 2154) PASS: lldb-api :: functionalities/thread/concurrent_events/TestConcurrentSignalWatchBreak.py (1080 of 2154) PASS: lldb-api :: lang/c/record_decl_in_expr/TestRecordDeclInExpr.py (1081 of 2154) PASS: lldb-api :: commands/target/dump-symtab-demangle/TestDumpSymtabDemangle.py (1082 of 2154) PASS: lldb-shell :: SymbolFile/NativePDB/function-types-builtins.cpp (1083 of 2154) PASS: lldb-unit :: Utility/./UtilityTests/StringListTest.JoinSingle (1084 of 2154) PASS: lldb-api :: functionalities/breakpoint/breakpoint_locations/TestBreakpointLocations.py (1085 of 2154) PASS: lldb-unit :: Utility/./UtilityTests/RangeTest.ContainsEndInclusiveInvalid (1086 of 2154) PASS: lldb-shell :: Reproducer/TestHomeDir.test (1087 of 2154) PASS: lldb-api :: functionalities/tail_call_frames/thread_step_out_message/TestArtificialFrameStepOutMessage.py (1088 of 2154) PASS: lldb-unit :: Host/./HostTests/MainLoopTest.TerminatesImmediately (1089 of 2154) PASS: lldb-shell :: SymbolFile/Breakpad/line-table-edgecases.test (1090 of 2154) PASS: lldb-unit :: Language/Highlighting/./HighlighterTests/HighlighterTest.HighlighterSelectionPath (1091 of 2154) PASS: lldb-api :: tools/lldb-server/TestGdbRemote_qThreadStopInfo.py (1092 of 2154) PASS: lldb-unit :: Expression/./ExpressionTests/CppModuleConfigurationTest.MissingUsrInclude (1093 of 2154) PASS: lldb-shell :: Quit/TestQuitExitCodeHexA.test (1094 of 2154) PASS: lldb-shell :: ScriptInterpreter/Python/scripted_breakpoint.test (1095 of 2154) UNSUPPORTED: lldb-api :: macosx/macCatalystAppMacOSFramework/TestMacCatalystAppWithMacOSFramework.py (1096 of 2154) PASS: lldb-unit :: Utility/./UtilityTests/StringListTest.GetMaxStringLengthEmpty (1097 of 2154) PASS: lldb-unit :: Utility/./UtilityTests/StringExtractorTest.InitMisc (1098 of 2154) PASS: lldb-unit :: Utility/./UtilityTests/SubsystemRAIITest.NormalSubsystem (1099 of 2154) PASS: lldb-unit :: Platform/./LLDBPlatformTests/PlatformDarwinTest.TestParseVersionBuildDir (1100 of 2154) PASS: lldb-unit :: Utility/./UtilityTests/StringListTest.SplitIntoLinesEmpty (1101 of 2154) PASS: lldb-api :: functionalities/gdb_remote_client/TestRegDefinitionInParts.py (1102 of 2154) PASS: lldb-unit :: Host/./HostTests/NativeProcessProtocolTest.ReadCStringFromMemory_MaxSize (1103 of 2154) PASS: lldb-api :: commands/expression/import-std-module/queue/TestQueueFromStdModule.py (1104 of 2154) PASS: lldb-api :: lang/cpp/gmodules-templates/TestGModules.py (1105 of 2154) PASS: lldb-api :: lang/cpp/this/TestCPPThis.py (1106 of 2154) PASS: lldb-unit :: SymbolFile/DWARF/./SymbolFileDWARFTests/SymbolFileDWARFTests.ParseAranges (1107 of 2154) PASS: lldb-unit :: Expression/./ExpressionTests/CppModuleConfigurationTest.Sysroot (1108 of 2154) PASS: lldb-api :: functionalities/breakpoint/auto_continue/TestBreakpointAutoContinue.py (1109 of 2154) PASS: lldb-unit :: Utility/./UtilityTests/SerializationRountripTest.SerializeDeserializePodReferences (1110 of 2154) PASS: lldb-api :: lang/cpp/unsigned_types/TestUnsignedTypes.py (1111 of 2154) PASS: lldb-api :: functionalities/breakpoint/address_breakpoints/TestAddressBreakpoints.py (1112 of 2154) PASS: lldb-shell :: SymbolFile/DWARF/debug-line-basic.s (1113 of 2154) PASS: lldb-unit :: Utility/./UtilityTests/ConstStringTest.UpdateMangledCounterpart (1114 of 2154) PASS: lldb-api :: lang/cpp/typedef/TestCppTypedef.py (1115 of 2154) PASS: lldb-unit :: Utility/./UtilityTests/StringExtractorTest.GetHexBytes_OddPair2 (1116 of 2154) PASS: lldb-unit :: Utility/./UtilityTests/ScalarTest.SetValueFromData (1117 of 2154) PASS: lldb-shell :: Breakpoint/debug_rnglist_offset_pair.test (1118 of 2154) UNSUPPORTED: lldb-shell :: Register/x86-zmm-write.test (1119 of 2154) PASS: lldb-unit :: UnwindAssembly/x86/./UnwindAssemblyx86Tests/Testx86AssemblyInspectionEngine.TestPopEDI (1120 of 2154) PASS: lldb-unit :: Utility/./UtilityTests/StreamTest.PutCharNull (1121 of 2154) PASS: lldb-api :: lang/c/vla/TestVLA.py (1122 of 2154) PASS: lldb-api :: terminal/TestEditline.py (1123 of 2154) PASS: lldb-api :: commands/process/signal/TestProcessSignal.py (1124 of 2154) PASS: lldb-shell :: Driver/TestNoUseColor.test (1125 of 2154) PASS: lldb-shell :: SymbolFile/Breakpad/symtab-macho.test (1126 of 2154) PASS: lldb-unit :: Process/gdb-remote/./ProcessGdbRemoteTests/GDBRemoteCommunicationClientTest.SendGetDataPacket (1127 of 2154) PASS: lldb-unit :: tools/lldb-server/tests/./LLDBServerTests/TestBase.DebugserverEnv (1128 of 2154) PASS: lldb-unit :: Utility/./UtilityTests/DataExtractorTest.GetCStr (1129 of 2154) PASS: lldb-unit :: ObjectFile/Breakpad/./ObjectFileBreakpadTests/StackWinRecord.parse (1130 of 2154) PASS: lldb-unit :: Utility/./UtilityTests/RecordReplayTest.InstrumentedFooSameThis (1131 of 2154) PASS: lldb-api :: lang/cpp/symbols/TestSymbols.py (1132 of 2154) UNSUPPORTED: lldb-shell :: SymbolFile/PDB/variables.test (1133 of 2154) PASS: lldb-api :: functionalities/tsan/basic/TestTsanBasic.py (1134 of 2154) PASS: lldb-shell :: Reproducer/TestDiscard.test (1135 of 2154) PASS: lldb-api :: commands/expression/anonymous-struct/TestCallUserAnonTypedef.py (1136 of 2154) PASS: lldb-api :: commands/watchpoints/step_over_watchpoint/TestStepOverWatchpoint.py (1137 of 2154) PASS: lldb-unit :: Language/Highlighting/./HighlighterTests/HighlighterTest.HighlighterSelectionType (1138 of 2154) PASS: lldb-unit :: Utility/./UtilityTests/Flags.GetBitSize (1139 of 2154) PASS: lldb-api :: functionalities/breakpoint/address_breakpoints/TestBadAddressBreakpoints.py (1140 of 2154) PASS: lldb-unit :: Language/CPlusPlus/./LanguageCPlusPlusTests/CPlusPlusLanguage.MethodNameParsing (1141 of 2154) PASS: lldb-api :: lang/cpp/namespace/TestNamespaceLookup.py (1142 of 2154) PASS: lldb-api :: functionalities/inferior-assert/TestInferiorAssert.py (1143 of 2154) PASS: lldb-api :: functionalities/postmortem/elf-core/TestLinuxCore.py (1144 of 2154) PASS: lldb-unit :: Target/./TargetTests/RemoteAwarePlatformTest.TestResolveExecutabelOnClientByPlatform (1145 of 2154) PASS: lldb-unit :: Interpreter/./InterpreterTests/OptionArgParserTest.toBoolean (1146 of 2154) PASS: lldb-unit :: ObjectFile/Breakpad/./ObjectFileBreakpadTests/StackCFIRecord.parse (1147 of 2154) PASS: lldb-unit :: Utility/./UtilityTests/ScalarTest.GetBytes (1148 of 2154) PASS: lldb-unit :: Utility/./UtilityTests/LogTest.LLDB_LOG_nullptr (1149 of 2154) PASS: lldb-unit :: Process/minidump/./LLDBMinidumpTests/MinidumpParserTest.FindMemoryRangeWithFullMemoryMinidump (1150 of 2154) PASS: lldb-unit :: Utility/./UtilityTests/StreamTest.PutHex16ByteOrderBig (1151 of 2154) PASS: lldb-unit :: Host/./HostTests/FileSystemTest.FileAndDirectoryComponents (1152 of 2154) PASS: lldb-unit :: Symbol/./SymbolTests/TestTypeSystemClang.TestIsClangType (1153 of 2154) PASS: lldb-unit :: Utility/./UtilityTests/StreamTeeTest.Flush (1154 of 2154) PASS: lldb-unit :: Utility/./UtilityTests/StateTest.Formatv (1155 of 2154) PASS: lldb-unit :: Utility/./UtilityTests/StreamTest.AddressRangeSize (1156 of 2154) PASS: lldb-api :: commands/settings/quoting/TestQuoting.py (1157 of 2154) PASS: lldb-unit :: debugserver/./debugserverTests/RNBSocket.LoopBackConnectIPv6 (1158 of 2154) PASS: lldb-unit :: Signals/./SignalsTests/UnixSignalsTest.VersionChange (1159 of 2154) PASS: lldb-unit :: Utility/./UtilityTests/LogChannelTest.List (1160 of 2154) PASS: lldb-shell :: SymbolFile/DWARF/debug_line-relative_path.s (1161 of 2154) PASS: lldb-api :: commands/expression/function_template_specialization_temp_args/TestFunctionTemplateSpecializationTempArgs.py (1162 of 2154) PASS: lldb-api :: lang/cpp/breakpoint_in_member_func_w_non_primitive_params/TestBreakpointInMemberFuncWNonPrimitiveParams.py (1163 of 2154) PASS: lldb-shell :: Reproducer/TestDSYM.test (1164 of 2154) PASS: lldb-unit :: Utility/./UtilityTests/UriParserTest.LongPath (1165 of 2154) PASS: lldb-unit :: UnwindAssembly/x86/./UnwindAssemblyx86Tests/Testx86AssemblyInspectionEngine.TestPushImm (1166 of 2154) PASS: lldb-api :: commands/platform/file/read/TestPlatformFileRead.py (1167 of 2154) UNSUPPORTED: lldb-api :: functionalities/darwin_log/source/debug/TestDarwinLogSourceDebug.py (1168 of 2154) PASS: lldb-api :: functionalities/thread/exit_during_break/TestExitDuringBreak.py (1169 of 2154) PASS: lldb-shell :: SymbolFile/DWARF/dir-separator-posix.s (1170 of 2154) PASS: lldb-api :: commands/frame/diagnose/dereference-function-return/TestDiagnoseDereferenceFunctionReturn.py (1171 of 2154) PASS: lldb-api :: functionalities/thread/create_after_attach/TestCreateAfterAttach.py (1172 of 2154) PASS: lldb-api :: python_api/interpreter/TestCommandInterpreterAPI.py (1173 of 2154) PASS: lldb-unit :: Symbol/./SymbolTests/Type.CompilerContextPattern (1174 of 2154) UNSUPPORTED: lldb-api :: functionalities/data-formatter/data-formatter-stl/libstdcpp/tuple/TestDataFormatterStdTuple.py (1175 of 2154) PASS: lldb-shell :: Breakpoint/single-file-split-dwarf.test (1176 of 2154) PASS: lldb-api :: functionalities/gdb_remote_client/TestWasm.py (1177 of 2154) PASS: lldb-unit :: Target/./TargetTests/ModuleCacheTest.GetAndPutStrangeHostname (1178 of 2154) PASS: lldb-shell :: ScriptInterpreter/None/none.test (1179 of 2154) PASS: lldb-unit :: Symbol/./SymbolTests/TestClangASTImporter.MetadataPropagation (1180 of 2154) PASS: lldb-api :: commands/expression/vector_of_enums/TestVectorOfEnums.py (1181 of 2154) PASS: lldb-api :: functionalities/data-formatter/data-formatter-python-synth/TestDataFormatterPythonSynth.py (1182 of 2154) PASS: lldb-api :: functionalities/thread/jump/TestThreadJump.py (1183 of 2154) PASS: lldb-unit :: ObjectFile/Breakpad/./ObjectFileBreakpadTests/ModuleRecord.parse (1184 of 2154) PASS: lldb-api :: functionalities/data-formatter/data-formatter-stl/libcxx/iterator/TestDataFormatterLibccIterator.py (1185 of 2154) PASS: lldb-api :: functionalities/thread/concurrent_events/TestConcurrentSignalDelayWatch.py (1186 of 2154) PASS: lldb-unit :: Host/./HostTests/NativeProcessProtocolTest.SetBreakpointFailWrite (1187 of 2154) PASS: lldb-unit :: Symbol/./SymbolTests/TestClangASTImporter.ImportInvalidType (1188 of 2154) PASS: lldb-unit :: ScriptInterpreter/Python/./ScriptInterpreterPythonTests/PythonDataObjectsTest.TestScript (1189 of 2154) PASS: lldb-unit :: Utility/./UtilityTests/ArchSpecTest.TestSetTriple (1190 of 2154) PASS: lldb-unit :: Utility/./UtilityTests/BinaryStreamTest.PutSLEB128TwoBytes (1191 of 2154) PASS: lldb-shell :: SymbolFile/NativePDB/break-by-line.cpp (1192 of 2154) PASS: lldb-unit :: Utility/./UtilityTests/RangeTest.EqualInvalid (1193 of 2154) PASS: lldb-api :: functionalities/breakpoint/move_nearest/TestMoveNearest.py (1194 of 2154) UNSUPPORTED: lldb-api :: functionalities/longjmp/TestLongjmp.py (1195 of 2154) XFAIL: lldb-shell :: Register/x86-64-ymm-write.test (1196 of 2154) UNSUPPORTED: lldb-shell :: ScriptInterpreter/Lua/watchpoint_callback.test (1197 of 2154) PASS: lldb-api :: functionalities/limit-debug-info/TestLimitDebugInfo.py (1198 of 2154) PASS: lldb-unit :: Utility/./UtilityTests/StringListTest.JoinEmpty (1199 of 2154) PASS: lldb-api :: functionalities/value_md5_crash/TestValueMD5Crash.py (1200 of 2154) PASS: lldb-unit :: Utility/./UtilityTests/RegularExpression.Empty (1201 of 2154) PASS: lldb-unit :: Utility/./UtilityTests/ListenerTest.GetEventWait (1202 of 2154) PASS: lldb-unit :: Process/gdb-remote/./ProcessGdbRemoteTests/GDBRemoteClientBaseTest.SendPacketAndReceiveResponseWithOutputSupport (1203 of 2154) PASS: lldb-api :: commands/expression/expr-in-syscall/TestExpressionInSyscall.py (1204 of 2154) PASS: lldb-unit :: UnwindAssembly/x86/./UnwindAssemblyx86Tests/Testx86AssemblyInspectionEngine.TestSimplex86_64Augmented (1205 of 2154) PASS: lldb-api :: lang/c/function_types/TestFunctionTypes.py (1206 of 2154) PASS: lldb-unit :: Process/minidump/./LLDBMinidumpTests/MinidumpParserTest.GetFilteredModuleList (1207 of 2154) PASS: lldb-unit :: Host/./HostTests/Host.WaitStatusFormat (1208 of 2154) PASS: lldb-api :: functionalities/breakpoint/breakpoint_by_line_and_column/TestBreakpointByLineAndColumn.py (1209 of 2154) PASS: lldb-unit :: Host/./HostTests/SocketTest.TCPListen0ConnectAccept (1210 of 2154) PASS: lldb-api :: functionalities/gdb_remote_client/TestNoGPacketSupported.py (1211 of 2154) PASS: lldb-unit :: Host/./HostTests/FileSystemTest.OpenErrno (1212 of 2154) PASS: lldb-unit :: ObjectFile/ELF/./ObjectFileELFTests/ObjectFileELFTest.GetModuleSpecifications_EarlySectionHeaders (1213 of 2154) PASS: lldb-unit :: Symbol/./SymbolTests/TestTypeSystemClang.TestGetTypeClassDeclType (1214 of 2154) PASS: lldb-unit :: Utility/./UtilityTests/StringExtractorTest.GetHexU8_Exact (1215 of 2154) PASS: lldb-shell :: SymbolFile/DWARF/DW_AT_declaration-with-children.s (1216 of 2154) PASS: lldb-api :: functionalities/data-formatter/data-formatter-stl/libcxx/bitset/TestDataFormatterLibcxxBitset.py (1217 of 2154) PASS: lldb-api :: functionalities/postmortem/minidump/TestMiniDump.py (1218 of 2154) PASS: lldb-unit :: Host/./HostTests/HostInfoTest.GetHostname (1219 of 2154) UNSUPPORTED: lldb-api :: functionalities/tty/TestTerminal.py (1220 of 2154) PASS: lldb-unit :: Utility/./UtilityTests/CompletionRequest.TryCompleteCurrentArgMode (1221 of 2154) PASS: lldb-api :: lang/objc/objc-static-method-stripped/TestObjCStaticMethodStripped.py (1222 of 2154) PASS: lldb-api :: commands/target/stop-hook/disable/TestTargetStopHookDisable.py (1223 of 2154) PASS: lldb-api :: functionalities/data-formatter/data-formatter-stl/libcxx/optional/TestDataFormatterLibcxxOptional.py (1224 of 2154) PASS: lldb-unit :: Utility/./UtilityTests/OptionsWithRawTest.ArgsButNoDelimiter (1225 of 2154) PASS: lldb-unit :: Utility/./UtilityTests/ArchSpecTest.TestParseMachCPUDashSubtypeTripleSimple (1226 of 2154) PASS: lldb-api :: functionalities/gdb_remote_client/TestqOffsets.py (1227 of 2154) PASS: lldb-api :: commands/expression/persistent_types/TestPersistentTypes.py (1228 of 2154) PASS: lldb-api :: lang/cpp/auto/TestCPPAuto.py (1229 of 2154) UNSUPPORTED: lldb-shell :: ScriptInterpreter/Lua/lua-python.test (1230 of 2154) UNSUPPORTED: lldb-api :: tools/lldb-vscode/completions/TestVSCode_completions.py (1231 of 2154) PASS: lldb-unit :: Utility/./UtilityTests/LogChannelEnabledTest.LogVerboseThread (1232 of 2154) PASS: lldb-api :: commands/frame/select/TestFrameSelect.py (1233 of 2154) PASS: lldb-api :: functionalities/breakpoint/breakpoint_language/TestBreakpointLanguage.py (1234 of 2154) PASS: lldb-api :: commands/watchpoints/watchpoint_events/TestWatchpointEvents.py (1235 of 2154) PASS: lldb-unit :: Utility/./UtilityTests/ScalarTest.ExtractBitfield (1236 of 2154) PASS: lldb-unit :: ScriptInterpreter/Python/./ScriptInterpreterPythonTests/PythonDataObjectsTest.TestPythonTupleSize (1237 of 2154) PASS: lldb-api :: functionalities/data-formatter/refpointer-recursion/TestDataFormatterRefPtrRecursion.py (1238 of 2154) UNSUPPORTED: lldb-api :: commands/register/register/intel_xtended_registers/mpx_offset_intersection/TestMPXOffsetIntersection.py (1239 of 2154) PASS: lldb-api :: lang/c/conflicting-symbol/TestConflictingSymbol.py (1240 of 2154) PASS: lldb-unit :: Expression/./ExpressionTests/DWARFExpression.DW_OP_stack_value (1241 of 2154) PASS: lldb-unit :: UnwindAssembly/x86/./UnwindAssemblyx86Tests/Testx86AssemblyInspectionEngine.Test32BitOnlyInstruction (1242 of 2154) PASS: lldb-api :: functionalities/data-formatter/data-formatter-script/TestDataFormatterScript.py (1243 of 2154) PASS: lldb-unit :: Utility/./UtilityTests/CompletionRequest.DuplicateFiltering (1244 of 2154) PASS: lldb-unit :: Host/./HostTests/ProcessLaunchInfoTest.Constructor (1245 of 2154) PASS: lldb-unit :: SymbolFile/NativePDB/./SymbolFileNativePDBTests/PDBFPOProgramToDWARFExpressionTests.DependencyChain (1246 of 2154) PASS: lldb-shell :: Driver/TestSingleQuote.test (1247 of 2154) PASS: lldb-unit :: Process/gdb-remote/./ProcessGdbRemoteTests/GDBRemoteCommunicationServerTest.SendErrorResponse_ErrorList (1248 of 2154) PASS: lldb-unit :: Process/minidump/./LLDBMinidumpTests/MinidumpParserTest.GetMiscInfoWindows (1249 of 2154) PASS: lldb-api :: functionalities/breakpoint/breakpoint_ignore_count/TestBreakpointIgnoreCount.py (1250 of 2154) PASS: lldb-api :: functionalities/breakpoint/breakpoint_names/TestBreakpointNames.py (1251 of 2154) PASS: lldb-api :: commands/watchpoints/watchpoint_count/TestWatchpointCount.py (1252 of 2154) PASS: lldb-api :: lang/cpp/elaborated-types/TestElaboratedTypes.py (1253 of 2154) PASS: lldb-unit :: SymbolFile/DWARF/./SymbolFileDWARFTests/DWARFASTParserClangTests.EnsureAllDIEsInDeclContextHaveBeenParsedParsesOnlyMatchingEntries (1254 of 2154) PASS: lldb-unit :: Signals/./SignalsTests/UnixSignalsTest.GetFilteredSignals (1255 of 2154) PASS: lldb-api :: functionalities/data-formatter/nssetsynth/TestNSSetSynthetic.py (1256 of 2154) PASS: lldb-shell :: SymbolFile/DWARF/debug_loclists-dwo.s (1257 of 2154) PASS: lldb-api :: functionalities/inferior-crashing/TestInferiorCrashing.py (1258 of 2154) PASS: lldb-shell :: SymbolFile/NativePDB/nested-types.cpp (1259 of 2154) PASS: lldb-unit :: Utility/./UtilityTests/StreamTest.PutHex64ByteOrderBig (1260 of 2154) PASS: lldb-shell :: ObjectFile/PECOFF/dep-modules.yaml (1261 of 2154) PASS: lldb-unit :: ScriptInterpreter/Python/./ScriptInterpreterPythonTests/PythonDataObjectsTest.TestPythonByteArray (1262 of 2154) PASS: lldb-api :: functionalities/thread/concurrent_events/TestConcurrentTwoBreakpointThreads.py (1263 of 2154) PASS: lldb-shell :: Settings/TestModuleCacheSanity.test (1264 of 2154) PASS: lldb-unit :: ScriptInterpreter/Python/./ScriptInterpreterPythonTests/PythonDataObjectsTest.TestCallable (1265 of 2154) PASS: lldb-unit :: Utility/./UtilityTests/Predicate.WaitForValueNotEqualTo (1266 of 2154) PASS: lldb-unit :: Utility/./UtilityTests/ScalarTest.Division (1267 of 2154) PASS: lldb-shell :: SymbolFile/DWARF/split-dwarf-multiple-cu.ll (1268 of 2154) UNSUPPORTED: lldb-shell :: SymbolFile/NativePDB/ast-functions-msvc.cpp (1269 of 2154) PASS: lldb-api :: commands/disassemble/basic/TestDisassembleBreakpoint.py (1270 of 2154) XFAIL: lldb-shell :: Register/x86-mm-xmm-write.test (1271 of 2154) UNSUPPORTED: lldb-shell :: Register/x86-zmm-read.test (1272 of 2154) UNSUPPORTED: lldb-shell :: SymbolFile/PDB/typedefs.test (1273 of 2154) PASS: lldb-unit :: Process/gdb-remote/./ProcessGdbRemoteTests/GDBRemoteCommunicationClientTest.GetModulesInfoInvalidResponse (1274 of 2154) PASS: lldb-unit :: Utility/./UtilityTests/RangeTest.ContainsAddrInvalid (1275 of 2154) PASS: lldb-api :: functionalities/pointer_num_children/TestPointerNumChildren.py (1276 of 2154) PASS: lldb-shell :: SymbolFile/dissassemble-entry-point.s (1277 of 2154) PASS: lldb-unit :: Utility/./UtilityTests/StreamTest.AddressNoSuffix (1278 of 2154) PASS: lldb-api :: functionalities/data-formatter/varscript_formatting/TestDataFormatterVarScriptFormatting.py (1279 of 2154) PASS: lldb-shell :: ObjectFile/wasm/basic.yaml (1280 of 2154) PASS: lldb-api :: commands/frame/diagnose/dereference-argument/TestDiagnoseDereferenceArgument.py (1281 of 2154) PASS: lldb-unit :: Utility/./UtilityTests/RangeTest.SlideZero (1282 of 2154) PASS: lldb-api :: commands/expression/import-std-module/sysroot/TestStdModuleSysroot.py (1283 of 2154) PASS: lldb-api :: lang/objc/modules/TestObjCModules.py (1284 of 2154) PASS: lldb-unit :: Language/Highlighting/./HighlighterTests/HighlighterTest.ClangCursorPosInOtherToken (1285 of 2154) PASS: lldb-unit :: Process/gdb-remote/./ProcessGdbRemoteTests/GDBRemoteCommunicationClientTest.GetModulesInfo_UUID20 (1286 of 2154) PASS: lldb-unit :: Utility/./UtilityTests/BinaryStreamTest.PutSLEB128MaxValue (1287 of 2154) PASS: lldb-api :: tools/lldb-vscode/step/TestVSCode_step.py (1288 of 2154) PASS: lldb-api :: functionalities/breakpoint/scripted_bkpt/TestScriptedResolver.py (1289 of 2154) PASS: lldb-unit :: Utility/./UtilityTests/BinaryStreamTest.PutSLEB128FiveBytes (1290 of 2154) PASS: lldb-unit :: Utility/./UtilityTests/StreamTest.AddressEmptyPrefix (1291 of 2154) PASS: lldb-unit :: Utility/./UtilityTests/FileSpecTest.CopyByAppendingPathComponent (1292 of 2154) PASS: lldb-shell :: Driver/TestTarget.test (1293 of 2154) PASS: lldb-api :: functionalities/tail_call_frames/thread_step_out_or_return/TestSteppingOutWithArtificialFrames.py (1294 of 2154) PASS: lldb-shell :: SymbolFile/DWARF/debug-types-missing-signature.test (1295 of 2154) PASS: lldb-unit :: Utility/./UtilityTests/EnvironmentTest.EnvpConstruction (1296 of 2154) PASS: lldb-api :: commands/expression/context-object/TestContextObject.py (1297 of 2154) PASS: lldb-api :: python_api/debugger/TestDebuggerAPI.py (1298 of 2154) PASS: lldb-shell :: Settings/TestFrameFormatMangling.test (1299 of 2154) PASS: lldb-api :: functionalities/data-formatter/data-formatter-objc/TestDataFormatterObjCPlain.py (1300 of 2154) PASS: lldb-api :: macosx/find-dsym/bundle-with-dot-in-filename/TestBundleWithDotInFilename.py (1301 of 2154) PASS: lldb-unit :: Utility/./UtilityTests/BinaryStreamTest.PutSLEB128Zero (1302 of 2154) PASS: lldb-api :: lang/cpp/class_types/TestClassTypesDisassembly.py (1303 of 2154) PASS: lldb-unit :: Utility/./UtilityTests/StreamTest.PutHex8 (1304 of 2154) PASS: lldb-unit :: Utility/./UtilityTests/SerializationRountripTest.SerializeDeserializeCString (1305 of 2154) PASS: lldb-api :: functionalities/data-formatter/setvaluefromcstring/TestSetValueFromCString.py (1306 of 2154) UNSUPPORTED: lldb-api :: functionalities/data-formatter/data-formatter-stl/libstdcpp/map/TestDataFormatterStdMap.py (1307 of 2154) PASS: lldb-unit :: ScriptInterpreter/Python/./ScriptInterpreterPythonTests/PythonDataObjectsTest.TestDictionaryResolutionWithDot (1308 of 2154) PASS: lldb-unit :: UnwindAssembly/x86/./UnwindAssemblyx86Tests/Testx86AssemblyInspectionEngine.TestPushECX (1309 of 2154) PASS: lldb-shell :: SymbolFile/DWARF/debug_loc.s (1310 of 2154) PASS: lldb-unit :: Process/minidump/./LLDBMinidumpTests/MinidumpParserTest.GetThreadContext_x86_64 (1311 of 2154) PASS: lldb-unit :: Language/Highlighting/./HighlighterTests/HighlighterTest.ClangOperators (1312 of 2154) PASS: lldb-unit :: Utility/./UtilityTests/ArgsTest.EscapeLLDBCommandArgument (1313 of 2154) PASS: lldb-unit :: Utility/./UtilityTests/ProcessInfoTest.Constructor (1314 of 2154) PASS: lldb-unit :: Utility/./UtilityTests/PassiveReplayTest.InstrumentedBar (1315 of 2154) UNSUPPORTED: lldb-shell :: Register/x86-gp-read.test (1316 of 2154) PASS: lldb-unit :: ScriptInterpreter/Python/./ScriptInterpreterPythonTests/PythonDataObjectsTest.TestGlobalNameResolutionNoDot (1317 of 2154) PASS: lldb-unit :: Core/./LLDBCoreTests/StreamCallbackTest.Callback (1318 of 2154) PASS: lldb-unit :: Utility/./UtilityTests/StringListTest.CopyListSingle (1319 of 2154) PASS: lldb-unit :: Signals/./SignalsTests/UnixSignalsTest.GetInfo (1320 of 2154) PASS: lldb-unit :: UnwindAssembly/x86/./UnwindAssemblyx86Tests/Testx86AssemblyInspectionEngine.TestPopR15 (1321 of 2154) PASS: lldb-api :: functionalities/signal/handle-abrt/TestHandleAbort.py (1322 of 2154) PASS: lldb-api :: tools/lldb-vscode/console/TestVSCode_console.py (1323 of 2154) PASS: lldb-api :: python_api/value/TestValueAPI.py (1324 of 2154) UNSUPPORTED: lldb-api :: commands/expression/completion-crash-invalid-iterator/TestInvalidIteratorCompletionCrash.py (1325 of 2154) PASS: lldb-unit :: ObjectFile/Breakpad/./ObjectFileBreakpadTests/Record.classify (1326 of 2154) PASS: lldb-api :: functionalities/data-formatter/data-formatter-objc/nsstring/TestDataFormatterNSString.py (1327 of 2154) PASS: lldb-api :: python_api/default-constructor/TestDefaultConstructorForAPIObjects.py (1328 of 2154) PASS: lldb-unit :: Utility/./UtilityTests/StringExtractorTest.GetHexBytesAvail_Partial (1329 of 2154) PASS: lldb-api :: lang/objc/objc-static-method/TestObjCStaticMethod.py (1330 of 2154) PASS: lldb-shell :: ObjectFile/PECOFF/sections.yaml (1331 of 2154) UNSUPPORTED: lldb-shell :: Register/aarch64-fp-read.test (1332 of 2154) PASS: lldb-unit :: Utility/./UtilityTests/StringListTest.LongestCommonPrefixDuplicateElement (1333 of 2154) PASS: lldb-unit :: Utility/./UtilityTests/UriParserTest.BadPort (1334 of 2154) PASS: lldb-api :: lang/c/shared_lib/TestSharedLib.py (1335 of 2154) PASS: lldb-unit :: Utility/./UtilityTests/StringListTest.Clear (1336 of 2154) UNSUPPORTED: lldb-shell :: SymbolFile/PDB/type-quals.test (1337 of 2154) PASS: lldb-unit :: UnwindAssembly/x86/./UnwindAssemblyx86Tests/Testx86AssemblyInspectionEngine.TestPushEAX (1338 of 2154) PASS: lldb-shell :: ObjectFile/ELF/base-address.yaml (1339 of 2154) PASS: lldb-unit :: UnwindAssembly/x86/./UnwindAssemblyx86Tests/Testx86AssemblyInspectionEngine.TestPopR14 (1340 of 2154) PASS: lldb-unit :: Editline/./EditlineTests/EditlineTestFixture.EditlineReceivesSingleLineText (1341 of 2154) UNSUPPORTED: lldb-api :: commands/register/register/intel_xtended_registers/TestMPXRegisters.py (1342 of 2154) PASS: lldb-unit :: Utility/./UtilityTests/UriParserTest.BadPort2 (1343 of 2154) PASS: lldb-shell :: ObjectFile/MachO/lc_build_version_notools.yaml (1344 of 2154) PASS: lldb-unit :: Utility/./UtilityTests/SubsystemRAIITest.SubsystemWithErrorFailure (1345 of 2154) PASS: lldb-api :: python_api/sbvalue_const_addrof/TestSBValueConstAddrOf.py (1346 of 2154) PASS: lldb-shell :: Reproducer/TestRelativePath.test (1347 of 2154) PASS: lldb-shell :: SymbolFile/DWARF/split-dwarf-inlining.cpp (1348 of 2154) PASS: lldb-unit :: ObjectFile/ELF/./ObjectFileELFTests/ObjectFileELFTest.SectionsResolveConsistently (1349 of 2154) PASS: lldb-unit :: Language/Highlighting/./HighlighterTests/HighlighterTest.ClangBraces (1350 of 2154) PASS: lldb-unit :: Utility/./UtilityTests/ArgsTest.TestUnknownEscape (1351 of 2154) PASS: lldb-unit :: Utility/./UtilityTests/ScalarTest.Getters (1352 of 2154) UNSUPPORTED: lldb-api :: commands/trace/TestTraceSchema.py (1353 of 2154) PASS: lldb-shell :: BuildScript/toolchain-clang.test (1354 of 2154) PASS: lldb-unit :: Utility/./UtilityTests/ProcessInstanceInfo.Dump (1355 of 2154) PASS: lldb-shell :: Quit/TestQuitExitCodeNonInt.test (1356 of 2154) PASS: lldb-shell :: Breakpoint/debug_addrx.test (1357 of 2154) PASS: lldb-api :: functionalities/data-formatter/compactvectors/TestCompactVectors.py (1358 of 2154) PASS: lldb-unit :: Symbol/./SymbolTests/SymbolsTest.LocateExecutableSymbolFileForUnknownExecutableAndMissingSymbolFile (1359 of 2154) PASS: lldb-unit :: Editline/./EditlineTests/EditlineTestFixture.EditlineReceivesMultiLineText (1360 of 2154) PASS: lldb-unit :: Utility/./UtilityTests/OptionsWithRawTest.EmptySuffixSingleWhitespace (1361 of 2154) PASS: lldb-unit :: Host/./HostTests/SocketTest.TCPGetAddress (1362 of 2154) PASS: lldb-unit :: Utility/./UtilityTests/StreamTeeTest.SetStreamAtIndexOutOfBounds (1363 of 2154) PASS: lldb-api :: functionalities/gdb_remote_client/TestThreadSelectionBug.py (1364 of 2154) UNSUPPORTED: lldb-api :: tools/lldb-server/registers-target-xml-reading/TestGdbRemoteTargetXmlPacket.py (1365 of 2154) PASS: lldb-unit :: Utility/./UtilityTests/StringListTest.InsertStringAtIndexEnd (1366 of 2154) PASS: lldb-unit :: Utility/./UtilityTests/AnsiTerminal.KnownPrefix (1367 of 2154) PASS: lldb-api :: functionalities/gdb_remote_client/TestGDBRemoteDiskFileCompletion.py (1368 of 2154) PASS: lldb-api :: functionalities/non-overlapping-index-variable-i/TestIndexVariable.py (1369 of 2154) PASS: lldb-shell :: SymbolFile/Breakpad/line-table-missing-file.test (1370 of 2154) PASS: lldb-unit :: Utility/./UtilityTests/DataExtractorTest.GetFloatUnaligned (1371 of 2154) PASS: lldb-unit :: Utility/./UtilityTests/StreamTest.PutBytesAsRawHex8ToMixedEndian (1372 of 2154) PASS: lldb-api :: commands/expression/multiline-navigation/TestMultilineNavigation.py (1373 of 2154) PASS: lldb-unit :: ScriptInterpreter/Python/./ScriptInterpreterPythonTests/PythonDataObjectsTest.TestPythonTupleToStructuredList (1374 of 2154) PASS: lldb-api :: lang/objc/objc-property/TestObjCProperty.py (1375 of 2154) PASS: lldb-unit :: Utility/./UtilityTests/StringExtractorTest.DecodeHexU8_Underflow2 (1376 of 2154) PASS: lldb-api :: lang/objc/modules-update/TestClangModulesUpdate.py (1377 of 2154) PASS: lldb-shell :: SymbolFile/DWARF/array-sizes.s (1378 of 2154) PASS: lldb-unit :: Utility/./UtilityTests/RangeDataVector.CustomSort (1379 of 2154) UNSUPPORTED: lldb-api :: functionalities/darwin_log/format/TestDarwinLogMessageFormat.py (1380 of 2154) PASS: lldb-unit :: SymbolFile/NativePDB/./SymbolFileNativePDBTests/PDBFPOProgramToDWARFExpressionTests.InvalidAssignmentMultiple (1381 of 2154) PASS: lldb-api :: functionalities/optimized_code/TestNoASanExceptionAfterEvalOP_piece.py (1382 of 2154) PASS: lldb-shell :: ObjectFile/PECOFF/disassemble-thumb.yaml (1383 of 2154) PASS: lldb-unit :: ScriptInterpreter/Python/./ScriptInterpreterPythonTests/PythonDataObjectsTest.TestPythonTupleInitializerList2 (1384 of 2154) PASS: lldb-unit :: Utility/./UtilityTests/NameMatchesTest.Contains (1385 of 2154) PASS: lldb-unit :: Utility/./UtilityTests/ProcessInstanceInfoMatch.Name (1386 of 2154) PASS: lldb-unit :: Process/minidump/./LLDBMinidumpTests/MinidumpParserTest.MinidumpDuplicateModuleMappedSecond (1387 of 2154) PASS: lldb-unit :: Expression/./ExpressionTests/CppModuleConfigurationTest.LinuxLocalLibCpp (1388 of 2154) PASS: lldb-api :: functionalities/thread/thread_exit/TestThreadExit.py (1389 of 2154) PASS: lldb-api :: commands/expression/import_builtin_fileid/TestImportBuiltinFileID.py (1390 of 2154) PASS: lldb-api :: functionalities/target_var/no_vars/TestTargetVarNoVars.py (1391 of 2154) PASS: lldb-unit :: Host/./HostTests/SocketAddressTest.GetAddressInfo (1392 of 2154) PASS: lldb-shell :: Process/Optimization.test (1393 of 2154) PASS: lldb-shell :: Driver/TestError.test (1394 of 2154) UNSUPPORTED: lldb-api :: benchmarks/expression/TestExpressionCmd.py (1395 of 2154) PASS: lldb-api :: tools/lldb-server/TestGdbRemoteProcessInfo.py (1396 of 2154) PASS: lldb-api :: functionalities/thread/exit_during_step/TestExitDuringStep.py (1397 of 2154) PASS: lldb-unit :: Utility/./UtilityTests/AnsiTerminal.Basic (1398 of 2154) PASS: lldb-api :: commands/expression/regression-access-function-template-in-record/TestRegressionAccessFunctionTemplateInRecord.py (1399 of 2154) PASS: lldb-unit :: Utility/./UtilityTests/OptionsWithRawTest.SingleWordSuffix (1400 of 2154) PASS: lldb-api :: commands/statistics/basic/TestStats.py (1401 of 2154) UNSUPPORTED: lldb-api :: functionalities/process_save_core/TestProcessSaveCore.py (1402 of 2154) PASS: lldb-unit :: UnwindAssembly/x86/./UnwindAssemblyx86Tests/Testx86AssemblyInspectionEngine.TestPushR13 (1403 of 2154) PASS: lldb-unit :: Process/gdb-remote/./ProcessGdbRemoteTests/GDBRemoteClientBaseTest.SendContinueDelegateStructuredDataReceipt (1404 of 2154) PASS: lldb-api :: commands/expression/import-std-module/pair/TestPairFromStdModule.py (1405 of 2154) PASS: lldb-api :: lang/objcxx/objcxx-ivar-vector/TestIvarVector.py (1406 of 2154) PASS: lldb-api :: functionalities/gdb_remote_client/TestTargetXMLArch.py (1407 of 2154) PASS: lldb-api :: types/TestDoubleTypes.py (1408 of 2154) PASS: lldb-unit :: UnwindAssembly/x86/./UnwindAssemblyx86Tests/Testx86AssemblyInspectionEngine.TestPushESI (1409 of 2154) PASS: lldb-api :: functionalities/breakpoint/breakpoint_options/TestBreakpointOptions.py (1410 of 2154) PASS: lldb-unit :: DataFormatter/./LLDBFormatterTests/StringPrinterTests.SwiftUTF8 (1411 of 2154) PASS: lldb-api :: functionalities/unwind/noreturn/TestNoreturnUnwind.py (1412 of 2154) UNSUPPORTED: lldb-api :: commands/watchpoints/variable_out_of_scope/TestWatchedVarHitWhenInScope.py (1413 of 2154) PASS: lldb-unit :: Disassembler/./DisassemblerTests/TestArm64Disassembly.TestArmv81Instruction (1414 of 2154) UNSUPPORTED: lldb-shell :: Register/arm-gp-read.test (1415 of 2154) PASS: lldb-api :: python_api/sbtype_typeclass/TestSBTypeTypeClass.py (1416 of 2154) PASS: lldb-api :: functionalities/rerun/TestRerun.py (1417 of 2154) PASS: lldb-api :: lang/cpp/scope/TestCppScope.py (1418 of 2154) PASS: lldb-api :: functionalities/thread/concurrent_events/TestConcurrentManyBreakpoints.py (1419 of 2154) PASS: lldb-api :: lang/objc/foundation/TestObjCMethods.py (1420 of 2154) PASS: lldb-unit :: UnwindAssembly/x86/./UnwindAssemblyx86Tests/Testx86AssemblyInspectionEngine.TestSpillRegToStackViaMOVx86_64 (1421 of 2154) PASS: lldb-api :: commands/platform/basic/TestPlatformCommand.py (1422 of 2154) PASS: lldb-unit :: Utility/./UtilityTests/CompletionRequest.TestCompletionOwnership (1423 of 2154) PASS: lldb-api :: functionalities/data-formatter/data-formatter-disabling/TestDataFormatterDisabling.py (1424 of 2154) UNSUPPORTED: lldb-shell :: Reproducer/TestLuaImport.test (1425 of 2154) PASS: lldb-api :: lang/objc/forward-decl/TestForwardDecl.py (1426 of 2154) PASS: lldb-shell :: ObjectFile/ELF/PT_TLS-overlap-PT_LOAD.yaml (1427 of 2154) PASS: lldb-api :: functionalities/step_scripted/TestStepScripted.py (1428 of 2154) PASS: lldb-api :: lang/objc/modules-incomplete/TestIncompleteModules.py (1429 of 2154) PASS: lldb-api :: lang/c/array_types/TestArrayTypes.py (1430 of 2154) PASS: lldb-unit :: Utility/./UtilityTests/StringListTest.AppendStringMove (1431 of 2154) PASS: lldb-unit :: ObjectFile/Breakpad/./ObjectFileBreakpadTests/PublicRecord.parse (1432 of 2154) PASS: lldb-shell :: ObjectFile/wasm/embedded-debug-sections.yaml (1433 of 2154) PASS: lldb-unit :: Utility/./UtilityTests/StringExtractorTest.GetHexBytes (1434 of 2154) PASS: lldb-unit :: Symbol/./SymbolTests/TestTypeSystemClang.TestGetEnumIntegerTypeUnexpectedType (1435 of 2154) PASS: lldb-shell :: Breakpoint/case-sensitive.test (1436 of 2154) PASS: lldb-unit :: Utility/./UtilityTests/BroadcasterTest.BroadcastEvent (1437 of 2154) PASS: lldb-unit :: Utility/./UtilityTests/RecordReplayTest.InstrumentedBarRef (1438 of 2154) PASS: lldb-api :: lang/objc/objc-new-syntax/TestObjCNewSyntaxDictionary.py (1439 of 2154) PASS: lldb-api :: commands/expression/rdar44436068/Test128BitsInteger.py (1440 of 2154) PASS: lldb-unit :: Expression/./ExpressionTests/DWARFExpression.DW_OP_pick (1441 of 2154) PASS: lldb-api :: functionalities/data-formatter/data-formatter-skip-summary/TestDataFormatterSkipSummary.py (1442 of 2154) PASS: lldb-unit :: Language/Highlighting/./HighlighterTests/HighlighterTest.ClangTrailingBackslashMissingNewLine (1443 of 2154) PASS: lldb-api :: functionalities/breakpoint/consecutive_breakpoints/TestConsecutiveBreakpoints.py (1444 of 2154) PASS: lldb-api :: functionalities/thread/concurrent_events/TestConcurrentSignalDelayBreak.py (1445 of 2154) PASS: lldb-shell :: Expr/TestMultilineExpr.test (1446 of 2154) PASS: lldb-unit :: Process/minidump/./LLDBMinidumpTests/MinidumpParserTest.GetLinuxProcStatus (1447 of 2154) PASS: lldb-api :: functionalities/dead-strip/TestDeadStrip.py (1448 of 2154) PASS: lldb-unit :: Symbol/./SymbolTests/TestTypeSystemClang.TestGetEnumIntegerTypeInvalid (1449 of 2154) PASS: lldb-unit :: Utility/./UtilityTests/OptionsWithRawTest.TerminatedQuote (1450 of 2154) PASS: lldb-unit :: UnwindAssembly/x86/./UnwindAssemblyx86Tests/Testx86AssemblyInspectionEngine.TestPopEBX (1451 of 2154) PASS: lldb-api :: commands/expression/test/TestExprs2.py (1452 of 2154) PASS: lldb-unit :: Language/CPlusPlus/./LanguageCPlusPlusTests/CPlusPlusLanguage.FindAlternateFunctionManglings (1453 of 2154) PASS: lldb-unit :: Utility/./UtilityTests/StructuredDataTest.StringDump (1454 of 2154) PASS: lldb-shell :: ObjectFile/ELF/minidebuginfo-corrupt-xz.yaml (1455 of 2154) PASS: lldb-shell :: ObjectFile/ELF/section-permissions.yaml (1456 of 2154) PASS: lldb-shell :: ObjectFile/MachO/symtab.yaml (1457 of 2154) PASS: lldb-api :: lang/c/complex_int/TestComplexInt.py (1458 of 2154) PASS: lldb-unit :: Utility/./UtilityTests/StringListTest.GetMaxStringLengthDecreasingSize (1459 of 2154) UNSUPPORTED: lldb-shell :: Register/x86-ymm-read.test (1460 of 2154) PASS: lldb-unit :: Symbol/./SymbolTests/TestTypeSystemClang.TestUnifyAccessSpecifiers (1461 of 2154) PASS: lldb-unit :: Process/gdb-remote/./ProcessGdbRemoteTests/GDBRemoteCommunicationClientTest.ReadRegister (1462 of 2154) PASS: lldb-unit :: Expression/./ExpressionTests/DiagnosticManagerTest.GetStringBasic (1463 of 2154) PASS: lldb-api :: functionalities/lazy-loading/TestLazyLoading.py (1464 of 2154) PASS: lldb-api :: python_api/file_handle/TestFileHandle.py (1465 of 2154) UNSUPPORTED: lldb-shell :: ObjectFile/ELF/minidebuginfo-no-lzma.yaml (1466 of 2154) PASS: lldb-unit :: Language/Highlighting/./HighlighterTests/HighlighterTest.ClangComments (1467 of 2154) PASS: lldb-api :: commands/platform/file/close/TestPlatformFileClose.py (1468 of 2154) PASS: lldb-api :: tools/lldb-server/TestGdbRemoteExpeditedRegisters.py (1469 of 2154) PASS: lldb-api :: python_api/watchpoint/TestWatchpointIter.py (1470 of 2154) PASS: lldb-api :: lang/cpp/namespace_conflicts/TestNamespaceConflicts.py (1471 of 2154) UNSUPPORTED: lldb-api :: benchmarks/stepping/TestSteppingSpeed.py (1472 of 2154) PASS: lldb-unit :: Utility/./UtilityTests/IndexToObjectTest.ObjectForIndex (1473 of 2154) PASS: lldb-api :: python_api/watchpoint/watchlocation/TestSetWatchlocation.py (1474 of 2154) PASS: lldb-unit :: Utility/./UtilityTests/UriParserTest.SchemeHostSeparator3 (1475 of 2154) PASS: lldb-shell :: Settings/TestLineMarkerColor.test (1476 of 2154) PASS: lldb-api :: functionalities/data-formatter/data-formatter-stl/libcxx/list/TestDataFormatterLibcxxList.py (1477 of 2154) PASS: lldb-unit :: Utility/./UtilityTests/CompletionRequest.TryCompleteCurrentArgBad (1478 of 2154) PASS: lldb-unit :: Expression/./ExpressionTests/DWARFExpression.DW_OP_unknown (1479 of 2154) PASS: lldb-shell :: Driver/TestFile.test (1480 of 2154) PASS: lldb-api :: lang/cpp/stl/TestSTL.py (1481 of 2154) PASS: lldb-unit :: Utility/./UtilityTests/FileSpecTest.EqualDotsWindows (1482 of 2154) PASS: lldb-api :: commands/session/save/TestSessionSave.py (1483 of 2154) PASS: lldb-api :: lang/cpp/operator-overload/TestOperatorOverload.py (1484 of 2154) PASS: lldb-api :: commands/expression/save_jit_objects/TestSaveJITObjects.py (1485 of 2154) PASS: lldb-api :: iohandler/completion/TestIOHandlerCompletion.py (1486 of 2154) PASS: lldb-api :: commands/gui/invalid-args/TestInvalidArgsGui.py (1487 of 2154) PASS: lldb-shell :: SymbolFile/DWARF/debug_ranges-missing-section.s (1488 of 2154) PASS: lldb-api :: commands/target/create-deps/TestTargetCreateDeps.py (1489 of 2154) PASS: lldb-unit :: Utility/./UtilityTests/StringExtractorTest.GetHexU8_InvalidHex (1490 of 2154) UNSUPPORTED: lldb-api :: functionalities/darwin_log/filter/regex/subsystem/TestDarwinLogFilterRegexSubsystem.py (1491 of 2154) PASS: lldb-api :: commands/expression/import-std-module/no-std-module/TestMissingStdModule.py (1492 of 2154) PASS: lldb-unit :: API/./APITests/SBCommandInterpreterTest.SingleWordCommand (1493 of 2154) UNSUPPORTED: lldb-shell :: SymbolFile/PDB/expressions.test (1494 of 2154) PASS: lldb-unit :: UnwindAssembly/x86/./UnwindAssemblyx86Tests/Testx86AssemblyInspectionEngine.TestPopRBX (1495 of 2154) PASS: lldb-shell :: Reproducer/Functionalities/TestStepping.test (1496 of 2154) PASS: lldb-api :: commands/expression/import-std-module/weak_ptr-dbg-info-content/TestDbgInfoContentWeakPtrFromStdModule.py (1497 of 2154) PASS: lldb-unit :: Utility/./UtilityTests/StreamTest.PutStringAsRawHex8 (1498 of 2154) PASS: lldb-unit :: Symbol/./SymbolTests/TestTypeSystemClang.TestGetEnumIntegerTypeBasicTypes (1499 of 2154) PASS: lldb-shell :: Settings/TestDisassemblyFormat.test (1500 of 2154) PASS: lldb-api :: functionalities/data-formatter/dump_dynamic/TestDumpDynamic.py (1501 of 2154) PASS: lldb-api :: python_api/lldbutil/iter/TestRegistersIterator.py (1502 of 2154) PASS: lldb-api :: functionalities/data-formatter/poarray/TestPrintObjectArray.py (1503 of 2154) PASS: lldb-api :: functionalities/data-formatter/cstring-utf8-summary/TestCstringUnicode.py (1504 of 2154) PASS: lldb-unit :: DataFormatter/./LLDBFormatterTests/StringPrinterTests.CxxUTF8 (1505 of 2154) PASS: lldb-unit :: Process/gdb-remote/./ProcessGdbRemoteTests/GDBRemoteCommunicationClientTest.SyncThreadState (1506 of 2154) PASS: lldb-shell :: Driver/TestCommands.test (1507 of 2154) PASS: lldb-api :: functionalities/plugins/command_plugin/TestPluginCommands.py (1508 of 2154) PASS: lldb-api :: functionalities/data-formatter/data-formatter-stl/libcxx/list/loop/TestDataFormatterLibcxxListLoop.py (1509 of 2154) PASS: lldb-api :: commands/frame/diagnose/bad-reference/TestBadReference.py (1510 of 2154) UNSUPPORTED: lldb-shell :: SymbolFile/DWARF/split-dwarf-expression-eval-bug.cpp (1511 of 2154) PASS: lldb-shell :: SymbolFile/DWARF/DW_OP_piece-smaller-than-struct.s (1512 of 2154) PASS: lldb-api :: commands/expression/call-throws/TestCallThatThrows.py (1513 of 2154) PASS: lldb-unit :: Utility/./UtilityTests/StatusTest.ErrorConstructor (1514 of 2154) PASS: lldb-unit :: Utility/./UtilityTests/RegisterValueTest.GetSet8 (1515 of 2154) PASS: lldb-unit :: ScriptInterpreter/Python/./ScriptInterpreterPythonTests/PythonDataObjectsTest.TestExceptions (1516 of 2154) UNSUPPORTED: lldb-shell :: Register/x86-64-xmm16-read.test (1517 of 2154) PASS: lldb-shell :: SymbolFile/DWARF/debug_loc_and_loclists.s (1518 of 2154) PASS: lldb-unit :: SymbolFile/NativePDB/./SymbolFileNativePDBTests/PDBFPOProgramToDWARFExpressionTests.InvalidOpUnary (1519 of 2154) PASS: lldb-shell :: Minidump/Windows/find-module.test (1520 of 2154) PASS: lldb-api :: functionalities/data-formatter/data-formatter-stl/libcxx/unordered/TestDataFormatterUnordered.py (1521 of 2154) PASS: lldb-unit :: UnwindAssembly/x86/./UnwindAssemblyx86Tests/Testx86AssemblyInspectionEngine.TestPushRBPWithREX (1522 of 2154) PASS: lldb-shell :: SymbolFile/Breakpad/stack-cfi-parsing.test (1523 of 2154) PASS: lldb-unit :: Host/./HostTests/MainLoopTest.Signal (1524 of 2154) PASS: lldb-unit :: Symbol/./SymbolTests/TestClangASTImporter.CopyDeclTagDecl (1525 of 2154) PASS: lldb-api :: functionalities/data-formatter/data-formatter-stl/libcxx/function/TestLibCxxFunction.py (1526 of 2154) PASS: lldb-unit :: Utility/./UtilityTests/StreamTest.PutRawBytesToBigEndian (1527 of 2154) PASS: lldb-api :: functionalities/thread/backtrace_all/TestBacktraceAll.py (1528 of 2154) PASS: lldb-api :: commands/expression/import-std-module/forward_list-dbg-info-content/TestDbgInfoContentForwardListFromStdModule.py (1529 of 2154) PASS: lldb-api :: functionalities/signal/raise/TestRaise.py (1530 of 2154) PASS: lldb-unit :: Utility/./UtilityTests/RangeDataVector.FindEntryThatContains (1531 of 2154) UNSUPPORTED: lldb-shell :: SymbolFile/PDB/func-symbols.test (1532 of 2154) PASS: lldb-api :: functionalities/gdb_remote_client/TestNestedRegDefinitions.py (1533 of 2154) UNSUPPORTED: lldb-api :: functionalities/data-formatter/data-formatter-stl/libstdcpp/unique_ptr/TestDataFormatterStdUniquePtr.py (1534 of 2154) PASS: lldb-unit :: Expression/./ExpressionTests/CppModuleConfigurationTest.AmbiguousCLib (1535 of 2154) PASS: lldb-api :: tools/lldb-vscode/launch/TestVSCode_launch.py (1536 of 2154) PASS: lldb-shell :: ObjectFile/ELF/PT_LOAD.yaml (1537 of 2154) PASS: lldb-api :: macosx/find-app-in-bundle/TestFindAppInBundle.py (1538 of 2154) PASS: lldb-unit :: Host/./HostTests/NativeProcessProtocolTest.ReadMemoryWithoutTrap (1539 of 2154) PASS: lldb-api :: macosx/profile_vrs_detach/TestDetachVrsProfile.py (1540 of 2154) PASS: lldb-api :: commands/command/delete/TestCommandDelete.py (1541 of 2154) PASS: lldb-unit :: Language/Highlighting/./HighlighterTests/HighlighterTest.ClangIdentifiers (1542 of 2154) PASS: lldb-api :: functionalities/thread/step_until/TestStepUntil.py (1543 of 2154) PASS: lldb-api :: functionalities/data-formatter/data-formatter-objc/TestDataFormatterObjCNSBundle.py (1544 of 2154) PASS: lldb-api :: linux/builtin_trap/TestBuiltinTrap.py (1545 of 2154) PASS: lldb-shell :: SymbolFile/DWARF/find-variable-file.cpp (1546 of 2154) PASS: lldb-shell :: SymbolFile/DWARF/DW_AT_const_value-bitfields.s (1547 of 2154) PASS: lldb-api :: functionalities/data-formatter/boolreference/TestFormattersBoolRefPtr.py (1548 of 2154) UNSUPPORTED: lldb-api :: functionalities/darwin_log/filter/exact_match/activity-chain/TestDarwinLogFilterMatchActivityChain.py (1549 of 2154) PASS: lldb-unit :: Utility/./UtilityTests/LogChannelTest.EnableOptions (1550 of 2154) PASS: lldb-shell :: Expr/TestIRMemoryMap.test (1551 of 2154) PASS: lldb-shell :: Minidump/Windows/Sigsegv/sigsegv.test (1552 of 2154) PASS: lldb-unit :: Language/CPlusPlus/./LanguageCPlusPlusTests/CPlusPlusLanguage.CPlusPlusNameParser (1553 of 2154) PASS: lldb-unit :: Utility/./UtilityTests/RecordReplayTest.InstrumentedBarPtr (1554 of 2154) PASS: lldb-api :: macosx/order/TestOrderFile.py (1555 of 2154) PASS: lldb-unit :: Symbol/./SymbolTests/PostfixExpression.ParseOneExpression (1556 of 2154) PASS: lldb-api :: macosx/indirect_symbol/TestIndirectSymbols.py (1557 of 2154) PASS: lldb-unit :: Utility/./UtilityTests/Flags.IsClear (1558 of 2154) PASS: lldb-unit :: Utility/./UtilityTests/AnsiTerminal.Twice (1559 of 2154) PASS: lldb-api :: functionalities/thread/concurrent_events/TestConcurrentCrashWithSignal.py (1560 of 2154) UNSUPPORTED: lldb-shell :: BuildScript/toolchain-msvc.test (1561 of 2154) PASS: lldb-unit :: UnwindAssembly/x86/./UnwindAssemblyx86Tests/Testx86AssemblyInspectionEngine.TestPopEBP (1562 of 2154) PASS: lldb-api :: functionalities/thread/concurrent_events/TestConcurrentBreakpointDelayBreakpointOneSignal.py (1563 of 2154) PASS: lldb-shell :: Reproducer/TestFileRepro.test (1564 of 2154) PASS: lldb-api :: python_api/findvalue_duplist/TestSBFrameFindValue.py (1565 of 2154) XFAIL: lldb-shell :: SymbolFile/DWARF/find-type-in-function.cpp (1566 of 2154) PASS: lldb-shell :: ObjectFile/PECOFF/basic-info-arm.yaml (1567 of 2154) PASS: lldb-shell :: Commands/command-target-modules-dump-sections.yaml (1568 of 2154) PASS: lldb-api :: tools/lldb-server/inferior-crash/TestGdbRemoteAbort.py (1569 of 2154) PASS: lldb-api :: commands/target/modules/search-paths/insert/TestTargetModulesSearchpathsInsert.py (1570 of 2154) PASS: lldb-unit :: UnwindAssembly/PPC64/./PPC64InstEmulationTests/TestPPC64InstEmulation.TestSimpleFunction (1571 of 2154) PASS: lldb-unit :: Utility/./UtilityTests/StringExtractorTest.DecodeHexU8_InvalidHex2 (1572 of 2154) PASS: lldb-unit :: UnwindAssembly/x86/./UnwindAssemblyx86Tests/Testx86AssemblyInspectionEngine.TestAddESP (1573 of 2154) PASS: lldb-unit :: Utility/./UtilityTests/DataExtractorTest.GetBitfield (1574 of 2154) PASS: lldb-shell :: Commands/command-regex-unalias.test (1575 of 2154) PASS: lldb-api :: macosx/version_zero/TestGetVersionZeroVersion.py (1576 of 2154) PASS: lldb-unit :: Utility/./UtilityTests/StringListTest.CopyList (1577 of 2154) PASS: lldb-api :: python_api/lldbutil/iter/TestLLDBIterator.py (1578 of 2154) PASS: lldb-api :: functionalities/memory-region/TestMemoryRegion.py (1579 of 2154) PASS: lldb-unit :: Utility/./UtilityTests/ArchSpecTest.OperatorBool (1580 of 2154) PASS: lldb-api :: lang/objc/objc-ivar-offsets/TestObjCIvarOffsets.py (1581 of 2154) PASS: lldb-unit :: Utility/./UtilityTests/SerializationRountripTest.SerializeDeserializeObjectPointer (1582 of 2154) PASS: lldb-shell :: SymbolFile/DWARF/find-method-local-struct.cpp (1583 of 2154) PASS: lldb-api :: functionalities/tsan/multiple/TestTsanMultiple.py (1584 of 2154) PASS: lldb-unit :: Platform/./LLDBPlatformTests/PlatformDarwinTest.FindComponentInPath (1585 of 2154) PASS: lldb-unit :: Process/gdb-remote/./ProcessGdbRemoteTests/GDBRemoteClientBaseTest.SendContinueAndAsyncPacket (1586 of 2154) UNSUPPORTED: lldb-api :: functionalities/thread/create_during_step/TestCreateDuringStep.py (1587 of 2154) PASS: lldb-unit :: Utility/./UtilityTests/DataExtractorTest.GetMaxS64 (1588 of 2154) PASS: lldb-api :: lang/c/stepping/TestStepAndBreakpoints.py (1589 of 2154) PASS: lldb-api :: lang/cpp/breakpoint-commands/TestCPPBreakpointCommands.py (1590 of 2154) PASS: lldb-unit :: Utility/./UtilityTests/StreamTeeTest.GetStreamAtIndexOutOfBoundsEmpty (1591 of 2154) PASS: lldb-api :: functionalities/paths/TestPaths.py (1592 of 2154) PASS: lldb-shell :: Process/TestEnvironment.test (1593 of 2154) PASS: lldb-api :: commands/gui/breakpoints/TestGuiBreakpoints.py (1594 of 2154) PASS: lldb-unit :: Expression/./ExpressionTests/ClangExpressionDeclMapTest.TestPersistentDeclLookup (1595 of 2154) PASS: lldb-unit :: SymbolFile/NativePDB/./SymbolFileNativePDBTests/PDBFPOProgramToDWARFExpressionTests.UnsupportedRASearch (1596 of 2154) PASS: lldb-api :: commands/expression/import-std-module/empty-module/TestEmptyStdModule.py (1597 of 2154) PASS: lldb-api :: types/TestShortTypeExpr.py (1598 of 2154) PASS: lldb-api :: functionalities/thread/state_after_expression/TestStateAfterExpression.py (1599 of 2154) PASS: lldb-unit :: Utility/./UtilityTests/CompletionRequest.FakeLastArg (1600 of 2154) PASS: lldb-unit :: Utility/./UtilityTests/FileSpecTest.PrependPathComponent (1601 of 2154) PASS: lldb-unit :: Utility/./UtilityTests/ScalarTest.Equality (1602 of 2154) PASS: lldb-unit :: Process/minidump/./LLDBMinidumpTests/MinidumpParserTest.GetMemoryRegionInfoFromMemory64List (1603 of 2154) PASS: lldb-unit :: Utility/./UtilityTests/PassiveReplayTest.InstrumentedFoo (1604 of 2154) UNSUPPORTED: lldb-api :: linux/add-symbols/TestTargetSymbolsAddCommand.py (1605 of 2154) UNSUPPORTED: lldb-shell :: SymbolFile/PDB/variables-locations.test (1606 of 2154) PASS: lldb-unit :: Utility/./UtilityTests/Flags.Clear (1607 of 2154) PASS: lldb-shell :: ObjectFile/ELF/compressed-sections.yaml (1608 of 2154) PASS: lldb-api :: commands/expression/cast_int_to_anonymous_enum/TestCastIntToAnonymousEnum.py (1609 of 2154) PASS: lldb-shell :: SymbolFile/NativePDB/globals-bss.cpp (1610 of 2154) PASS: lldb-unit :: UnwindAssembly/x86/./UnwindAssemblyx86Tests/Testx86AssemblyInspectionEngine.TestCALLNextInsn (1611 of 2154) PASS: lldb-unit :: Utility/./UtilityTests/StreamTest.PutHex16ByteOrderLittle (1612 of 2154) PASS: lldb-unit :: Expression/./ExpressionTests/ClangHostTest.MacOSX (1613 of 2154) PASS: lldb-unit :: Utility/./UtilityTests/DataExtractorTest.GetULEB128_bit63 (1614 of 2154) PASS: lldb-unit :: ScriptInterpreter/Python/./ScriptInterpreterPythonTests/PythonDataObjectsTest.TestPythonCallableCheck (1615 of 2154) PASS: lldb-unit :: Utility/./UtilityTests/StringExtractorTest.GetHexU8_Exact_NoEof (1616 of 2154) PASS: lldb-unit :: ScriptInterpreter/Python/./ScriptInterpreterPythonTests/PythonDataObjectsTest.TestModuleNameResolutionNoDot (1617 of 2154) PASS: lldb-unit :: Utility/./UtilityTests/XcodeSDKTest.SDKSupportsModules (1618 of 2154) PASS: lldb-api :: commands/target/stop-hook/delete/TestTargetStopHookDelete.py (1619 of 2154) PASS: lldb-unit :: Utility/./UtilityTests/ArgsTest.ReplaceArgumentAtIndexLonger (1620 of 2154) PASS: lldb-unit :: Utility/./UtilityTests/BinaryStreamTest.PutSLEB128SevenBytes (1621 of 2154) PASS: lldb-api :: commands/expression/namespace_local_var_same_name_obj_c/TestNamespaceLocalVarSameNameObjC.py (1622 of 2154) PASS: lldb-api :: commands/expression/import-std-module/conflicts/TestStdModuleWithConflicts.py (1623 of 2154) PASS: lldb-api :: commands/expression/completion-in-lambda-and-unnamed-class/TestCompletionInLambdaAndUnnamedClass.py (1624 of 2154) PASS: lldb-unit :: Utility/./UtilityTests/StringExtractorTest.GetU32BigEndian (1625 of 2154) PASS: lldb-unit :: Process/gdb-remote/./ProcessGdbRemoteTests/GDBRemoteClientBaseTest.SendContinueAndLateInterrupt (1626 of 2154) PASS: lldb-api :: functionalities/data-formatter/data-formatter-stl/libcxx/initializerlist/TestInitializerList.py (1627 of 2154) PASS: lldb-unit :: Utility/./UtilityTests/PassiveReplayTest.InstrumentedBarRef (1628 of 2154) PASS: lldb-shell :: SymbolFile/DWARF/debug-types-signature-loop.s (1629 of 2154) PASS: lldb-unit :: Utility/./UtilityTests/RangeTest.ContainsRange (1630 of 2154) PASS: lldb-unit :: Process/minidump/./LLDBMinidumpTests/RegisterContextMinidump.ConvertMinidumpContext_x86_64 (1631 of 2154) PASS: lldb-unit :: Utility/./UtilityTests/UserIDResolver.GetUserName (1632 of 2154) PASS: lldb-api :: commands/command/nested_alias/TestNestedAlias.py (1633 of 2154) PASS: lldb-api :: commands/expression/import-std-module/stack/TestStackFromStdModule.py (1634 of 2154) PASS: lldb-unit :: ScriptInterpreter/Python/./ScriptInterpreterPythonTests/PythonDataObjectsTest.TestPythonDictionaryValueEquality (1635 of 2154) PASS: lldb-unit :: Utility/./UtilityTests/Flags.AllClear (1636 of 2154) PASS: lldb-unit :: Interpreter/./InterpreterTests/CompletionTest.DirCompletionAbsolute (1637 of 2154) PASS: lldb-api :: python_api/watchpoint/condition/TestWatchpointConditionAPI.py (1638 of 2154) PASS: lldb-unit :: ScriptInterpreter/Python/./ScriptInterpreterPythonTests/PythonDataObjectsTest.TestOwnedReferences (1639 of 2154) PASS: lldb-api :: lang/objc/blocks/TestObjCIvarsInBlocks.py (1640 of 2154) PASS: lldb-unit :: Utility/./UtilityTests/StreamTest.PutULEB128 (1641 of 2154) PASS: lldb-api :: functionalities/data-formatter/type_summary_list_arg/TestTypeSummaryListArg.py (1642 of 2154) PASS: lldb-api :: lang/cpp/function-qualifiers/TestCppFunctionQualifiers.py (1643 of 2154) PASS: lldb-unit :: ObjectFile/ELF/./ObjectFileELFTests/ObjectFileELFTest.GetSymtab_NoSymEntryPointArmThumbAddressClass (1644 of 2154) PASS: lldb-shell :: Unwind/trap_frame_sym_ctx.test (1645 of 2154) PASS: lldb-api :: functionalities/source-map/TestTargetSourceMap.py (1646 of 2154) PASS: lldb-unit :: Utility/./UtilityTests/StringLexerTest.PutBack (1647 of 2154) PASS: lldb-unit :: Host/./HostTests/SocketTest.TCPListen0GetPort (1648 of 2154) PASS: lldb-api :: functionalities/tail_call_frames/cross_object/TestCrossObjectTailCalls.py (1649 of 2154) PASS: lldb-api :: lang/cpp/nsimport/TestCppNsImport.py (1650 of 2154) PASS: lldb-shell :: Minidump/disassemble-no-module.yaml (1651 of 2154) PASS: lldb-unit :: Host/./HostTests/FileSystemTest.Exists (1652 of 2154) PASS: lldb-api :: commands/expression/class_template_specialization_empty_pack/TestClassTemplateSpecializationParametersHandling.py (1653 of 2154) PASS: lldb-api :: lang/c/find_struct_type/TestFindStructTypes.py (1654 of 2154) PASS: lldb-unit :: Utility/./UtilityTests/StreamTeeTest.DefaultConstructor (1655 of 2154) PASS: lldb-unit :: Process/gdb-remote/./ProcessGdbRemoteTests/GDBRemoteCommunicationServerTest.SendErrorResponse_ErrorNumber (1656 of 2154) PASS: lldb-unit :: Symbol/./SymbolTests/TestTypeSystemClang.TestNotDeletingUserCopyCstrDueToMoveCStr (1657 of 2154) PASS: lldb-api :: python_api/symbol-context/two-files/TestSymbolContextTwoFiles.py (1658 of 2154) PASS: lldb-api :: tools/lldb-server/TestGdbRemoteExitCode.py (1659 of 2154) PASS: lldb-api :: lang/cpp/global_variables/TestCPPGlobalVariables.py (1660 of 2154) PASS: lldb-unit :: Target/./TargetTests/MemoryRegionInfoTest.Formatv (1661 of 2154) PASS: lldb-unit :: Utility/./UtilityTests/FileSpecTest.IsRelative (1662 of 2154) PASS: lldb-shell :: SymbolFile/DWARF/gnu-style-compression.cpp (1663 of 2154) UNSUPPORTED: lldb-shell :: SymbolFile/PDB/class-layout.test (1664 of 2154) PASS: lldb-unit :: Process/minidump/./LLDBMinidumpTests/MinidumpParserTest.GetPidWindows (1665 of 2154) PASS: lldb-unit :: Host/./HostTests/HostInfoTest.GetAugmentedArchSpec (1666 of 2154) PASS: lldb-api :: commands/session/history/TestSessionHistory.py (1667 of 2154) PASS: lldb-unit :: Symbol/./SymbolTests/TestTypeSystemClang.TestConvertAccessTypeToAccessSpecifier (1668 of 2154) PASS: lldb-unit :: Utility/./UtilityTests/BinaryStreamTest.PutSLEB128EightBytes (1669 of 2154) PASS: lldb-unit :: Language/Highlighting/./HighlighterTests/HighlighterTest.Colons (1670 of 2154) PASS: lldb-api :: functionalities/data-formatter/data-formatter-stl/libcxx/set/TestDataFormatterLibcxxSet.py (1671 of 2154) PASS: lldb-unit :: Utility/./UtilityTests/RangeTest.Equal (1672 of 2154) PASS: lldb-unit :: Symbol/./SymbolTests/TestTypeSystemClang.TestRecordHasFields (1673 of 2154) PASS: lldb-shell :: ObjectFile/ELF/duplicate-section.yaml (1674 of 2154) PASS: lldb-unit :: Interpreter/./InterpreterTests/CompletionTest.DirCompletionUsername (1675 of 2154) PASS: lldb-unit :: Utility/./UtilityTests/ArgsTest.BareSingleQuote (1676 of 2154) PASS: lldb-shell :: Minidump/breakpad-symbols.test (1677 of 2154) PASS: lldb-unit :: Utility/./UtilityTests/RangeTest.SizeTypes (1678 of 2154) PASS: lldb-api :: tools/lldb-vscode/breakpoint/TestVSCode_setFunctionBreakpoints.py (1679 of 2154) PASS: lldb-api :: functionalities/data-formatter/type_summary_list_script/TestTypeSummaryListScript.py (1680 of 2154) PASS: lldb-unit :: Utility/./UtilityTests/StringExtractorTest.GetHexBytesAvail (1681 of 2154) PASS: lldb-shell :: Breakpoint/split-dwarf-5-addrbase.test (1682 of 2154) PASS: lldb-api :: functionalities/data-formatter/data-formatter-objc/cmtime/TestDataFormatterCMTime.py (1683 of 2154) PASS: lldb-shell :: SymbolFile/DWARF/module-ownership.mm (1684 of 2154) PASS: lldb-shell :: ObjectFile/ELF/minidebuginfo-find-symbols.yaml (1685 of 2154) PASS: lldb-api :: python_api/lldbutil/process/TestPrintStackTraces.py (1686 of 2154) PASS: lldb-unit :: Utility/./UtilityTests/LogChannelEnabledTest.LLDB_LOG_ERROR (1687 of 2154) PASS: lldb-unit :: Utility/./UtilityTests/ProcessInstanceInfo.DumpTable (1688 of 2154) PASS: lldb-unit :: Process/minidump/./LLDBMinidumpTests/MinidumpParserTest.MinidumpDuplicateModuleMappedFirst (1689 of 2154) PASS: lldb-unit :: Process/minidump/./LLDBMinidumpTests/MinidumpParserTest.GetExceptionStream (1690 of 2154) PASS: lldb-api :: lang/cpp/operators/TestCppOperators.py (1691 of 2154) PASS: lldb-unit :: Expression/./ExpressionTests/CppModuleConfigurationTest.LibCppV2 (1692 of 2154) PASS: lldb-unit :: Host/./HostTests/FileSystemTest.GetPermissions (1693 of 2154) PASS: lldb-api :: lang/cpp/template/TestTemplateArgs.py (1694 of 2154) PASS: lldb-shell :: SymbolFile/DWARF/debug_ranges.s (1695 of 2154) PASS: lldb-api :: python_api/watchpoint/TestSetWatchpoint.py (1696 of 2154) PASS: lldb-unit :: Utility/./UtilityTests/NameMatchesTest.Equals (1697 of 2154) PASS: lldb-unit :: Target/./TargetTests/PathMappingListTest.RemapRoot (1698 of 2154) UNSUPPORTED: lldb-api :: benchmarks/libcxxmap/TestBenchmarkLibcxxMap.py (1699 of 2154) PASS: lldb-api :: lang/c/forward/TestForwardDeclaration.py (1700 of 2154) PASS: lldb-unit :: Utility/./UtilityTests/StreamTest.ShiftOperatorPtr (1701 of 2154) PASS: lldb-api :: python_api/process/TestProcessAPI.py (1702 of 2154) PASS: lldb-api :: functionalities/testid/TestTestId.py (1703 of 2154) PASS: lldb-shell :: Commands/command-source.test (1704 of 2154) UNSUPPORTED: lldb-shell :: Register/x86-64-zmm-write.test (1705 of 2154) PASS: lldb-unit :: Language/Highlighting/./HighlighterTests/HighlighterTest.ClangCursorPosEndOfLine (1706 of 2154) PASS: lldb-api :: functionalities/process_group/TestChangeProcessGroup.py (1707 of 2154) PASS: lldb-api :: functionalities/thread/ignore_suspended/TestIgnoreSuspendedThread.py (1708 of 2154) PASS: lldb-shell :: SymbolFile/DWARF/clang-ast-from-dwarf-objc-property.m (1709 of 2154) UNSUPPORTED: lldb-shell :: Expr/TestIRMemoryMapWindows.test (1710 of 2154) PASS: lldb-api :: functionalities/data-formatter/data-formatter-stl/libcxx/vbool/TestDataFormatterLibcxxVBool.py (1711 of 2154) PASS: lldb-unit :: Disassembler/./DisassemblerTests/TestArmv7Disassembly.TestCortexFPDisass (1712 of 2154) PASS: lldb-shell :: SymbolFile/DWARF/static_scope.s (1713 of 2154) PASS: lldb-unit :: UnwindAssembly/x86/./UnwindAssemblyx86Tests/Testx86AssemblyInspectionEngine.Test64bitFramelessBigStackFrame (1714 of 2154) PASS: lldb-shell :: SymbolFile/DWARF/debug_loc-aslr.s (1715 of 2154) PASS: lldb-unit :: Utility/./UtilityTests/RecordReplayTest.InstrumentedFoo (1716 of 2154) PASS: lldb-unit :: Utility/./UtilityTests/StreamTeeTest.Constructor1Stream (1717 of 2154) PASS: lldb-unit :: Utility/./UtilityTests/DeserializerTest.HasData (1718 of 2154) PASS: lldb-unit :: DataFormatter/./LLDBFormatterTests/StringPrinterTests.CxxASCII (1719 of 2154) PASS: lldb-unit :: Process/minidump/./LLDBMinidumpTests/MinidumpParserTest.GetPidWow64 (1720 of 2154) PASS: lldb-unit :: UnwindAssembly/x86/./UnwindAssemblyx86Tests/Testx86AssemblyInspectionEngine.TestPopRBP (1721 of 2154) UNSUPPORTED: lldb-shell :: Breakpoint/case-insensitive.test (1722 of 2154) PASS: lldb-unit :: Utility/./UtilityTests/XcodeSDKTest.MergeTest (1723 of 2154) PASS: lldb-unit :: UnwindAssembly/x86/./UnwindAssemblyx86Tests/Testx86AssemblyInspectionEngine.TestLEAVE (1724 of 2154) PASS: lldb-api :: functionalities/thread/concurrent_events/TestConcurrentWatchBreak.py (1725 of 2154) PASS: lldb-api :: functionalities/type_completion/TestTypeCompletion.py (1726 of 2154) PASS: lldb-unit :: Utility/./UtilityTests/StreamTest.PutBytesAsRawHex8ToLittleEndian (1727 of 2154) PASS: lldb-shell :: SymbolFile/Breakpad/unwind-via-stack-cfi.test (1728 of 2154) PASS: lldb-unit :: Platform/./LLDBPlatformTests/PlatformAppleSimulatorTest.TestSimHasSimEnvionament (1729 of 2154) PASS: lldb-unit :: Utility/./UtilityTests/FileSpecTest.FormatFileSpec (1730 of 2154) UNSUPPORTED: lldb-api :: functionalities/darwin_log/filter/exact_match/category/TestDarwinLogFilterMatchCategory.py (1731 of 2154) PASS: lldb-api :: commands/watchpoints/watchpoint_size/TestWatchpointSizes.py (1732 of 2154) PASS: lldb-shell :: SymbolFile/DWARF/limit-debug-info.s (1733 of 2154) PASS: lldb-unit :: Symbol/./SymbolTests/TestClangASTImporter.DeportTypeTagDecl (1734 of 2154) PASS: lldb-unit :: Core/./LLDBCoreTests/RichManglingContextTest.IPDRealloc (1735 of 2154) PASS: lldb-shell :: SymbolFile/DWARF/DW_AT_loclists_base.s (1736 of 2154) PASS: lldb-api :: lang/objc/modules-hash-mismatch/TestClangModulesHashMismatch.py (1737 of 2154) PASS: lldb-unit :: Process/minidump/./LLDBMinidumpTests/RegisterContextMinidump.CheckRegisterContextMinidump_ARM (1738 of 2154) PASS: lldb-api :: commands/expression/codegen-crash-import-def-arraytype-element/TestImportDefinitionArrayType.py (1739 of 2154) PASS: lldb-unit :: Utility/./UtilityTests/SerializationRountripTest.SerializeDeserializePod (1740 of 2154) PASS: lldb-api :: lang/objc/variadic_methods/TestVariadicMethods.py (1741 of 2154) PASS: lldb-api :: lang/mixed/TestMixedLanguages.py (1742 of 2154) PASS: lldb-unit :: Utility/./UtilityTests/StreamTest.PutRawBytesToLittleEndian (1743 of 2154) PASS: lldb-api :: lang/cpp/virtual-overload/TestVirtualOverload.py (1744 of 2154) PASS: lldb-api :: api/check_public_api_headers/TestPublicAPIHeaders.py (1745 of 2154) PASS: lldb-api :: commands/expression/call-function/TestCallStopAndContinue.py (1746 of 2154) PASS: lldb-api :: commands/expression/result_numbering/TestResultNumbering.py (1747 of 2154) PASS: lldb-api :: functionalities/deleted-executable/TestDeletedExecutable.py (1748 of 2154) PASS: lldb-api :: lang/cpp/covariant-return-types/TestCovariantReturnTypes.py (1749 of 2154) PASS: lldb-unit :: Utility/./UtilityTests/StreamTeeTest.Write (1750 of 2154) PASS: lldb-unit :: Utility/./UtilityTests/SubsystemRAIITest.SubsystemWithErrorSuccess (1751 of 2154) PASS: lldb-api :: commands/process/launch/TestProcessLaunch.py (1752 of 2154) PASS: lldb-api :: lang/objc/modules-auto-import/TestModulesAutoImport.py (1753 of 2154) PASS: lldb-unit :: Expression/./ExpressionTests/DiagnosticManagerTest.GetStringNoDiags (1754 of 2154) PASS: lldb-unit :: Utility/./UtilityTests/ArgsTest.TestSingleArg (1755 of 2154) PASS: lldb-shell :: Driver/TestProcessAttach.test (1756 of 2154) PASS: lldb-shell :: Reproducer/Modules/TestModuleCXX.test (1757 of 2154) PASS: lldb-unit :: Utility/./UtilityTests/StringExtractorTest.GetHexBytesAvail_OddPair (1758 of 2154) PASS: lldb-unit :: debugserver/./debugserverTests/RNBSocket.LoopBackListenIPv4 (1759 of 2154) PASS: lldb-unit :: SymbolFile/NativePDB/./SymbolFileNativePDBTests/PDBFPOProgramToDWARFExpressionTests.MultipleDependentAssignments (1760 of 2154) UNSUPPORTED: lldb-api :: functionalities/darwin_log/filter/regex/message/TestDarwinLogFilterRegexMessage.py (1761 of 2154) PASS: lldb-unit :: Utility/./UtilityTests/StringListTest.Assignment (1762 of 2154) PASS: lldb-unit :: Utility/./UtilityTests/FileSpecTest.OperatorBool (1763 of 2154) PASS: lldb-api :: commands/version/TestVersion.py (1764 of 2154) PASS: lldb-api :: python_api/sbenvironment/TestSBEnvironment.py (1765 of 2154) UNSUPPORTED: lldb-shell :: SymbolFile/PDB/function-nested-block.test (1766 of 2154) PASS: lldb-unit :: Core/./LLDBCoreTests/ModuleSpecTest.TestCOFFFile (1767 of 2154) PASS: lldb-api :: lang/objc/modules-compile-error/TestModulesCompileError.py (1768 of 2154) PASS: lldb-unit :: Utility/./UtilityTests/StringExtractorTest.GetHexBytes_Underflow (1769 of 2154) PASS: lldb-api :: commands/platform/process/list/TestProcessList.py (1770 of 2154) PASS: lldb-unit :: Utility/./UtilityTests/FileSpecTest.GetPath (1771 of 2154) PASS: lldb-unit :: Utility/./UtilityTests/ArgsTest.TestOverwriteArgs (1772 of 2154) PASS: lldb-api :: lang/cpp/modules-import/TestCXXModulesImport.py (1773 of 2154) PASS: lldb-unit :: Symbol/./SymbolTests/TestTypeSystemClang.TestGetTypeClassNested (1774 of 2154) PASS: lldb-unit :: Utility/./UtilityTests/BinaryStreamTest.PutULEB128NineBytes (1775 of 2154) PASS: lldb-api :: functionalities/reproducers/attach/TestReproducerAttach.py (1776 of 2154) PASS: lldb-shell :: SymbolFile/Breakpad/line-table.test (1777 of 2154) PASS: lldb-shell :: Quit/TestQuitExitCodeTooManyArgs.test (1778 of 2154) PASS: lldb-unit :: Utility/./UtilityTests/ConstStringTest.NullAndEmptyStates (1779 of 2154) PASS: lldb-api :: lang/objc/objc-builtin-types/TestObjCBuiltinTypes.py (1780 of 2154) UNSUPPORTED: lldb-api :: functionalities/darwin_log/filter/regex/activity/TestDarwinLogFilterRegexActivity.py (1781 of 2154) PASS: lldb-api :: functionalities/memory/read/TestMemoryRead.py (1782 of 2154) PASS: lldb-unit :: Utility/./UtilityTests/StreamTest.PutMaxHex64ByteOrderBig (1783 of 2154) PASS: lldb-unit :: ScriptInterpreter/Python/./ScriptInterpreterPythonTests/PythonDataObjectsTest.TestPythonInteger (1784 of 2154) UNSUPPORTED: lldb-shell :: ScriptInterpreter/Lua/breakpoint_callback.test (1785 of 2154) PASS: lldb-api :: lang/cpp/bitfields/TestCppBitfields.py (1786 of 2154) PASS: lldb-unit :: Host/./HostTests/MainLoopTest.DetectsEOF (1787 of 2154) PASS: lldb-api :: lang/c/stepping/TestThreadStepping.py (1788 of 2154) PASS: lldb-api :: functionalities/ubsan/user-expression/TestUbsanUserExpression.py (1789 of 2154) PASS: lldb-api :: commands/frame/recognizer/TestFrameRecognizer.py (1790 of 2154) PASS: lldb-unit :: Utility/./UtilityTests/RangeTest.SetRangeBase (1791 of 2154) PASS: lldb-shell :: Breakpoint/ppc64-localentry.test (1792 of 2154) PASS: lldb-unit :: Utility/./UtilityTests/DataExtractorTest.GetCStrUnterminated (1793 of 2154) PASS: lldb-shell :: SymbolFile/DWARF/parallel-indexing-stress.s (1794 of 2154) PASS: lldb-api :: commands/expression/context-object-objc/TestContextObjectObjc.py (1795 of 2154) PASS: lldb-api :: commands/expression/formatters/TestFormatters.py (1796 of 2154) PASS: lldb-shell :: Commands/command-script-import.test (1797 of 2154) PASS: lldb-unit :: SymbolFile/NativePDB/./SymbolFileNativePDBTests/PDBFPOProgramToDWARFExpressionTests.UnknownOp (1798 of 2154) PASS: lldb-unit :: Utility/./UtilityTests/RangeTest.LessThan (1799 of 2154) PASS: lldb-shell :: Driver/TestConvenienceVariables.test (1800 of 2154) PASS: lldb-unit :: Utility/./UtilityTests/StreamTeeTest.Assignment (1801 of 2154) PASS: lldb-unit :: Platform/Android/./AdbClientTests/AdbClientTest.CreateByDeviceId_ByEnvVar (1802 of 2154) PASS: lldb-unit :: Utility/./UtilityTests/SharedCluster.ClusterManager (1803 of 2154) PASS: lldb-api :: commands/register/register/register_command/TestRegisters.py (1804 of 2154) PASS: lldb-unit :: Symbol/./SymbolTests/TestClangASTImporter.CompleteFwdDeclWithOtherOrigin (1805 of 2154) PASS: lldb-api :: functionalities/thread/concurrent_events/TestConcurrentDelayedCrashWithBreakpointSignal.py (1806 of 2154) PASS: lldb-api :: python_api/get-value-32bit-int/TestGetValue32BitInt.py (1807 of 2154) PASS: lldb-api :: functionalities/thread/concurrent_events/TestConcurrentSignalBreak.py (1808 of 2154) PASS: lldb-api :: iohandler/resize/TestIOHandlerResize.py (1809 of 2154) PASS: lldb-api :: functionalities/thread_plan/TestThreadPlanCommands.py (1810 of 2154) PASS: lldb-unit :: UnwindAssembly/x86/./UnwindAssemblyx86Tests/Testx86AssemblyInspectionEngine.TestAddRSP (1811 of 2154) PASS: lldb-api :: functionalities/data-formatter/data-formatter-globals/TestDataFormatterGlobals.py (1812 of 2154) PASS: lldb-api :: functionalities/data-formatter/nsdictionarysynth/TestNSDictionarySynthetic.py (1813 of 2154) PASS: lldb-api :: commands/watchpoints/watchpoint_on_vectors/TestValueOfVectorVariable.py (1814 of 2154) PASS: lldb-api :: api/log/TestAPILog.py (1815 of 2154) PASS: lldb-unit :: Language/CLanguages/./LanguageCLanguagesTests/CLanguages.LookupCLanguagesByLanguageType (1816 of 2154) PASS: lldb-unit :: Utility/./UtilityTests/DataExtractorTest.PeekData (1817 of 2154) PASS: lldb-api :: python_api/sbvalue_persist/TestSBValuePersist.py (1818 of 2154) PASS: lldb-api :: types/TestDoubleTypesExpr.py (1819 of 2154) PASS: lldb-unit :: Utility/./UtilityTests/LogTest.Register (1820 of 2154) PASS: lldb-unit :: Utility/./UtilityTests/FileSpecTest.RemoveLastPathComponent (1821 of 2154) PASS: lldb-api :: functionalities/inferior-changed/TestInferiorChanged.py (1822 of 2154) PASS: lldb-shell :: ObjectFile/MachO/lc_build_version.yaml (1823 of 2154) PASS: lldb-api :: commands/disassemble/basic/TestFrameDisassemble.py (1824 of 2154) PASS: lldb-api :: lang/cpp/typeof/TestTypeOfDeclTypeExpr.py (1825 of 2154) PASS: lldb-api :: commands/command/script_alias/TestCommandScriptAlias.py (1826 of 2154) PASS: lldb-api :: sanity/TestSettingSkipping.py (1827 of 2154) UNSUPPORTED: lldb-shell :: ScriptInterpreter/Lua/lua.test (1828 of 2154) PASS: lldb-api :: functionalities/tail_call_frames/cross_dso/TestCrossDSOTailCalls.py (1829 of 2154) PASS: lldb-api :: commands/expression/dollar-in-variable/TestDollarInVariable.py (1830 of 2154) PASS: lldb-api :: lang/objc/rdar-11355592/TestRdar11355592.py (1831 of 2154) PASS: lldb-api :: python_api/breakpoint/TestBreakpointAPI.py (1832 of 2154) PASS: lldb-api :: commands/command/script/import/TestImport.py (1833 of 2154) PASS: lldb-unit :: Utility/./UtilityTests/NameMatchesTest.RegularExpression (1834 of 2154) PASS: lldb-api :: commands/expression/xvalue/TestXValuePrinting.py (1835 of 2154) PASS: lldb-unit :: SymbolFile/NativePDB/./SymbolFileNativePDBTests/PDBFPOProgramToDWARFExpressionTests.InvalidAssignmentSingle (1836 of 2154) PASS: lldb-unit :: Utility/./UtilityTests/UriParserTest.TypicalPortPathIPv6 (1837 of 2154) PASS: lldb-unit :: Process/gdb-remote/./ProcessGdbRemoteTests/GDBRemoteCommunicationClientTest.SendSignalsToIgnore (1838 of 2154) PASS: lldb-unit :: Target/./TargetTests/ModuleCacheTest.GetAndPutUuidExists (1839 of 2154) PASS: lldb-shell :: SymbolFile/DWARF/find-method.cpp (1840 of 2154) PASS: lldb-unit :: Utility/./UtilityTests/StringListTest.InsertStringAtIndexStdString (1841 of 2154) PASS: lldb-unit :: Utility/./UtilityTests/RangeTest.DefaultConstructor (1842 of 2154) PASS: lldb-api :: functionalities/recursion/TestValueObjectRecursion.py (1843 of 2154) PASS: lldb-unit :: Utility/./UtilityTests/UriParserTest.SchemeHostSeparator4 (1844 of 2154) PASS: lldb-unit :: UnwindAssembly/ARM64/./Arm64InstEmulationTests/TestArm64InstEmulation.TestRegisterSavedTwice (1845 of 2154) PASS: lldb-api :: commands/expression/persistent_ptr_update/TestPersistentPtrUpdate.py (1846 of 2154) PASS: lldb-api :: tools/lldb-server/commandline/TestStubReverseConnect.py (1847 of 2154) PASS: lldb-unit :: Utility/./UtilityTests/ArgsTest.ReplaceArgumentAtIndexEqual (1848 of 2154) UNSUPPORTED: lldb-shell :: Process/Windows/exception_access_violation.cpp (1849 of 2154) PASS: lldb-unit :: Symbol/./SymbolTests/TestTypeSystemClang.TestGetBasicTypeFromEnum (1850 of 2154) PASS: lldb-shell :: ObjectFile/PECOFF/basic-info.yaml (1851 of 2154) PASS: lldb-api :: commands/watchpoints/watchpoint_set_command/TestWatchLocationWithWatchSet.py (1852 of 2154) PASS: lldb-shell :: Breakpoint/debug_rnglist_rlestartend.test (1853 of 2154) PASS: lldb-api :: lang/objc/objc_direct-methods/TestObjCDirectMethods.py (1854 of 2154) PASS: lldb-api :: lang/cpp/namespace_definitions/TestNamespaceDefinitions.py (1855 of 2154) PASS: lldb-unit :: UnwindAssembly/x86/./UnwindAssemblyx86Tests/Testx86AssemblyInspectionEngine.TestSimplei386ugmented (1856 of 2154) PASS: lldb-shell :: VSCode/TestOptions.test (1857 of 2154) PASS: lldb-shell :: Settings/TestStopCommandSourceOnError.test (1858 of 2154) PASS: lldb-shell :: SymbolFile/DWARF/dwp.s (1859 of 2154) PASS: lldb-api :: commands/frame/diagnose/complicated-expression/TestComplicatedExpression.py (1860 of 2154) PASS: lldb-api :: functionalities/data-formatter/data-formatter-stl/libcxx/atomic/TestLibCxxAtomic.py (1861 of 2154) PASS: lldb-unit :: Utility/./UtilityTests/StringExtractorTest.GetHexU8_Extra_NoEof (1862 of 2154) PASS: lldb-unit :: Utility/./UtilityTests/BinaryStreamTest.PutULEB128ThreeBytes (1863 of 2154) PASS: lldb-api :: lang/objc/rdar-10967107/TestRdar10967107.py (1864 of 2154) PASS: lldb-api :: lang/objc/objc-optimized/TestObjcOptimized.py (1865 of 2154) PASS: lldb-api :: functionalities/tsan/thread_numbers/TestTsanThreadNumbers.py (1866 of 2154) UNSUPPORTED: lldb-shell :: SymbolFile/NativePDB/typedefs.cpp (1867 of 2154) PASS: lldb-api :: functionalities/archives/TestBSDArchives.py (1868 of 2154) PASS: lldb-unit :: Utility/./UtilityTests/UriParserTest.SchemeHostSeparator2 (1869 of 2154) PASS: lldb-unit :: Utility/./UtilityTests/StreamTest.PutMaxHex64ByteOrderLittle (1870 of 2154) PASS: lldb-unit :: Utility/./UtilityTests/UserIDResolver.GetGroupName (1871 of 2154) PASS: lldb-api :: lang/cpp/dynamic-value/TestCppValueCast.py (1872 of 2154) PASS: lldb-shell :: Settings/TestSettingsWrite.test (1873 of 2154) PASS: lldb-api :: lang/cpp/const_this/TestConstThis.py (1874 of 2154) PASS: lldb-unit :: Utility/./UtilityTests/StringListTest.SetSize (1875 of 2154) PASS: lldb-unit :: Utility/./UtilityTests/SerializationRountripTest.SerializeDeserializeCStringArrayNullptr (1876 of 2154) PASS: lldb-api :: commands/settings/TestSettings.py (1877 of 2154) PASS: lldb-api :: lang/cpp/rvalue-references/TestRvalueReferences.py (1878 of 2154) PASS: lldb-api :: driver/batch_mode/TestBatchMode.py (1879 of 2154) PASS: lldb-unit :: Symbol/./SymbolTests/PostfixExpression.ParseFPOProgram (1880 of 2154) PASS: lldb-api :: lang/objc/objc-foundation-dictionary-empty/TestNSDictionary0.py (1881 of 2154) PASS: lldb-shell :: Commands/command-stop-hook-output.test (1882 of 2154) PASS: lldb-unit :: Utility/./UtilityTests/StreamTest.PutCStringWithStringRef (1883 of 2154) PASS: lldb-unit :: Utility/./UtilityTests/UriParserTest.PortOverflow (1884 of 2154) PASS: lldb-api :: commands/expression/namespace_local_var_same_name_cpp_and_c/TestNamespaceLocalVarSameNameCppAndC.py (1885 of 2154) PASS: lldb-shell :: Reproducer/TestVerify.test (1886 of 2154) PASS: lldb-api :: commands/expression/import_base_class_when_class_has_derived_member/TestImportBaseClassWhenClassHasDerivedMember.py (1887 of 2154) PASS: lldb-unit :: Symbol/./SymbolTests/TestClangASTImporter.DeportDeclTagDecl (1888 of 2154) PASS: lldb-api :: commands/expression/no-deadlock/TestExprDoesntBlock.py (1889 of 2154) PASS: lldb-shell :: SymbolFile/DWARF/find-qualified-variable.cpp (1890 of 2154) UNSUPPORTED: lldb-api :: tools/lldb-server/libraries-svr4/TestGdbRemoteLibrariesSvr4Support.py (1891 of 2154) PASS: lldb-api :: commands/reproducer/invalid-args/TestInvalidArgsReproducer.py (1892 of 2154) PASS: lldb-unit :: Utility/./UtilityTests/StreamTest.PutRawBytesToMixedEndian (1893 of 2154) PASS: lldb-api :: functionalities/tail_call_frames/inlining_and_tail_calls/TestInliningAndTailCalls.py (1894 of 2154) PASS: lldb-unit :: ObjectFile/ELF/./ObjectFileELFTests/ObjectFileELFTest.GetSymtab_NoSymEntryPointArmAddressClass (1895 of 2154) PASS: lldb-api :: python_api/objc_type/TestObjCType.py (1896 of 2154) PASS: lldb-unit :: ScriptInterpreter/Python/./ScriptInterpreterPythonTests/PythonDataObjectsTest.TestPythonCallableInvoke (1897 of 2154) PASS: lldb-api :: functionalities/thread/concurrent_events/TestConcurrentDelayWatchBreak.py (1898 of 2154) PASS: lldb-api :: lang/cpp/accelerator-table/TestCPPAccelerator.py (1899 of 2154) PASS: lldb-api :: commands/expression/import-std-module/unique_ptr/TestUniquePtrFromStdModule.py (1900 of 2154) PASS: lldb-api :: functionalities/data-formatter/data-formatter-stl/libcxx/multimap/TestDataFormatterLibccMultiMap.py (1901 of 2154) PASS: lldb-api :: lang/objcxx/class-name-clash/TestNameClash.py (1902 of 2154) UNSUPPORTED: lldb-api :: linux/sepdebugsymlink/TestTargetSymbolsSepDebugSymlink.py (1903 of 2154) PASS: lldb-unit :: Utility/./UtilityTests/RangeDataVector.FindEntryThatContains_Overlap (1904 of 2154) PASS: lldb-unit :: Utility/./UtilityTests/StringExtractorTest.GetNameColonValueContainsColon (1905 of 2154) PASS: lldb-shell :: ObjectFile/ELF/many-sections.s (1906 of 2154) PASS: lldb-unit :: Utility/./UtilityTests/Predicate.WaitForValueEqualTo (1907 of 2154) PASS: lldb-unit :: Utility/./UtilityTests/XcodeSDKTest.SDKSupportsSwift (1908 of 2154) PASS: lldb-unit :: UnwindAssembly/PPC64/./PPC64InstEmulationTests/TestPPC64InstEmulation.TestMediumFunction (1909 of 2154) PASS: lldb-unit :: Target/./TargetTests/PathMappingListTest.AbsoluteTests (1910 of 2154) UNSUPPORTED: lldb-api :: functionalities/darwin_log/filter/regex/category/TestDarwinLogFilterRegexCategory.py (1911 of 2154) PASS: lldb-api :: lang/cpp/virtual-functions/TestCppVirtualFunctions.py (1912 of 2154) PASS: lldb-unit :: Host/./HostTests/SocketTest.UDPConnect (1913 of 2154) PASS: lldb-api :: functionalities/wrong_commands/TestWrongCommands.py (1914 of 2154) PASS: lldb-unit :: Expression/./ExpressionTests/CppModuleConfigurationTest.MissingLibCpp (1915 of 2154) PASS: lldb-unit :: Utility/./UtilityTests/StringLexerTest.Peek (1916 of 2154) PASS: lldb-shell :: ObjectFile/ELF/PT_LOAD-empty.yaml (1917 of 2154) PASS: lldb-unit :: ScriptInterpreter/Python/./ScriptInterpreterPythonTests/PythonDataObjectsTest.TestPythonIntegerToStr (1918 of 2154) PASS: lldb-api :: commands/expression/argument_passing_restrictions/TestArgumentPassingRestrictions.py (1919 of 2154) PASS: lldb-shell :: SymbolFile/DWARF/dwo-type-in-main-file.s (1920 of 2154) PASS: lldb-unit :: Expression/./ExpressionTests/DiagnosticManagerTest.GetStringPreserveOrder (1921 of 2154) PASS: lldb-unit :: Utility/./UtilityTests/SerializationRountripTest.SerializeDeserializePodPointers (1922 of 2154) PASS: lldb-shell :: Minidump/no-process-id.yaml (1923 of 2154) PASS: lldb-unit :: Utility/./UtilityTests/BroadcasterTest.EventTypeHasListeners (1924 of 2154) PASS: lldb-api :: commands/process/attach/TestProcessAttach.py (1925 of 2154) PASS: lldb-unit :: Utility/./UtilityTests/TildeExpressionResolver.ResolveFullPath (1926 of 2154) PASS: lldb-api :: api/listeners/TestListener.py (1927 of 2154) PASS: lldb-api :: commands/expression/test/TestExprs.py (1928 of 2154) PASS: lldb-unit :: Utility/./UtilityTests/ArgsTest.TestSingleQuotedArgWithSpace (1929 of 2154) PASS: lldb-api :: functionalities/data-formatter/data-formatter-stl/libcxx/forward_list/TestDataFormatterLibcxxForwardList.py (1930 of 2154) PASS: lldb-unit :: ScriptInterpreter/Python/./ScriptInterpreterPythonTests/PythonDataObjectsTest.TestPythonTupleInitializerList (1931 of 2154) PASS: lldb-unit :: Utility/./UtilityTests/StringListTest.AppendStringStdString (1932 of 2154) PASS: lldb-api :: functionalities/tsan/thread_leak/TestTsanThreadLeak.py (1933 of 2154) PASS: lldb-unit :: Utility/./UtilityTests/PassiveReplayTest.InstrumentedFooInvalid (1934 of 2154) PASS: lldb-unit :: Utility/./UtilityTests/RangeTest.LessThanInvalid (1935 of 2154) PASS: lldb-unit :: Process/gdb-remote/./ProcessGdbRemoteTests/GDBRemoteCommunicationClientTest.SendGetTraceConfigPacket (1936 of 2154) PASS: lldb-unit :: Expression/./ExpressionTests/CppModuleConfigurationTest.Xcode (1937 of 2154) PASS: lldb-unit :: Utility/./UtilityTests/BinaryStreamTest.PutSLEB128ThreeBytes (1938 of 2154) PASS: lldb-unit :: Utility/./UtilityTests/StreamTest.AddressPrefix (1939 of 2154) PASS: lldb-unit :: SymbolFile/NativePDB/./SymbolFileNativePDBTests/PDBFPOProgramToDWARFExpressionTests.InvalidOpBinary (1940 of 2154) PASS: lldb-shell :: Register/x86-64-gp-read.test (1941 of 2154) PASS: lldb-api :: lang/cpp/char1632_t/TestChar1632T.py (1942 of 2154) UNSUPPORTED: lldb-api :: benchmarks/libcxxlist/TestBenchmarkLibcxxList.py (1943 of 2154) PASS: lldb-unit :: Process/gdb-remote/./ProcessGdbRemoteTests/GDBRemoteCommunicationClientTest.SendStopTracePacket (1944 of 2154) PASS: lldb-unit :: Utility/./UtilityTests/LogChannelTest.Enable (1945 of 2154) PASS: lldb-unit :: Utility/./UtilityTests/OptionsWithRawTest.EmptyInput (1946 of 2154) PASS: lldb-unit :: Symbol/./SymbolTests/TestTypeSystemClang.TestGetTypeClassTypeOfExpr (1947 of 2154) PASS: lldb-api :: functionalities/stats_api/TestStatisticsAPI.py (1948 of 2154) UNSUPPORTED: lldb-api :: tools/lldb-server/TestGdbRemoteAuxvSupport.py (1949 of 2154) PASS: lldb-api :: functionalities/data-formatter/parray/TestPrintArray.py (1950 of 2154) PASS: lldb-shell :: Process/UnsupportedLanguage.test (1951 of 2154) PASS: lldb-unit :: Process/minidump/./LLDBMinidumpTests/MinidumpParserTest.MinidumpModuleOrder (1952 of 2154) PASS: lldb-api :: functionalities/dynamic_value_child_count/TestDynamicValueChildCount.py (1953 of 2154) PASS: lldb-api :: iohandler/resize/TestIOHandlerResizeNoEditline.py (1954 of 2154) PASS: lldb-unit :: ObjectFile/PECOFF/./ObjectFilePECOFFTests/PECallFrameInfoTest.Frame_reg_eh (1955 of 2154) PASS: lldb-shell :: SymbolFile/DWARF/debug_rnglists.s (1956 of 2154) PASS: lldb-shell :: SymbolFile/DWARF/dwp-debug-types.s (1957 of 2154) PASS: lldb-api :: functionalities/breakpoint/breakpoint_conditions/TestBreakpointConditions.py (1958 of 2154) PASS: lldb-api :: tools/lldb-vscode/stackTrace/TestVSCode_stackTrace.py (1959 of 2154) PASS: lldb-unit :: Utility/./UtilityTests/StringListTest.ShiftStdString (1960 of 2154) PASS: lldb-shell :: SymbolFile/DWARF/dwarf5-debug_line.s (1961 of 2154) PASS: lldb-unit :: SymbolFile/NativePDB/./SymbolFileNativePDBTests/PDBFPOProgramToDWARFExpressionTests.UnresolvedCyclicRegisterAssignmentReference (1962 of 2154) PASS: lldb-unit :: ScriptInterpreter/Python/./ScriptInterpreterPythonTests/PythonDataObjectsTest.TestObjectAttributes (1963 of 2154) PASS: lldb-unit :: Utility/./UtilityTests/StringExtractorTest.GetNameColonValueSuccess (1964 of 2154) PASS: lldb-unit :: UnwindAssembly/x86/./UnwindAssemblyx86Tests/Testx86AssemblyInspectionEngine.TestPush0 (1965 of 2154) PASS: lldb-api :: functionalities/thread/concurrent_events/TestConcurrentNWatchNBreak.py (1966 of 2154) PASS: lldb-api :: functionalities/object-file/TestImageListMultiArchitecture.py (1967 of 2154) PASS: lldb-unit :: Target/./TargetTests/PathMappingListTest.RelativeTests (1968 of 2154) PASS: lldb-unit :: Utility/./UtilityTests/SerializationRountripTest.SerializeDeserializeCStringNull (1969 of 2154) UNSUPPORTED: lldb-api :: functionalities/data-formatter/data-formatter-stl/libstdcpp/smart_ptr/TestDataFormatterStdSmartPtr.py (1970 of 2154) PASS: lldb-unit :: Utility/./UtilityTests/AnsiTerminal.Empty (1971 of 2154) PASS: lldb-unit :: debugserver/./debugserverTests/RNBSocket.AnyListen (1972 of 2154) PASS: lldb-api :: commands/frame/language/TestGuessLanguage.py (1973 of 2154) PASS: lldb-shell :: SymbolFile/NativePDB/tag-types.cpp (1974 of 2154) PASS: lldb-unit :: Utility/./UtilityTests/DataExtractorTest.GetMaxU64 (1975 of 2154) PASS: lldb-api :: commands/process/launch-with-shellexpand/TestLaunchWithShellExpand.py (1976 of 2154) PASS: lldb-unit :: Language/Highlighting/./HighlighterTests/HighlighterTest.ClangEmptyInput (1977 of 2154) UNSUPPORTED: lldb-api :: lang/cpp/printf/TestPrintf.py (1978 of 2154) PASS: lldb-api :: lang/objc/foundation/TestObjCMethodsNSError.py (1979 of 2154) UNSUPPORTED: lldb-api :: tools/lldb-server/thread-name/TestGdbRemoteThreadName.py (1980 of 2154) UNSUPPORTED: lldb-api :: functionalities/thread/break_after_join/TestBreakAfterJoin.py (1981 of 2154) PASS: lldb-unit :: Symbol/./SymbolTests/LineEntryTest.GetSameLineContiguousAddressRangeNoInlines (1982 of 2154) PASS: lldb-api :: commands/settings/use_source_cache/TestUseSourceCache.py (1983 of 2154) PASS: lldb-api :: functionalities/target_var/TestTargetVar.py (1984 of 2154) PASS: lldb-unit :: Utility/./UtilityTests/ArchSpecTest.TestParseMachCPUDashSubtypeTripleExtra (1985 of 2154) PASS: lldb-api :: functionalities/thread/concurrent_events/TestConcurrentDelaySignalWatch.py (1986 of 2154) PASS: lldb-api :: lang/cpp/nested-class-other-compilation-unit/TestNestedClassWithParentInAnotherCU.py (1987 of 2154) PASS: lldb-api :: commands/expression/import-std-module/list-dbg-info-content/TestDbgInfoContentListFromStdModule.py (1988 of 2154) PASS: lldb-shell :: SymbolFile/DWARF/debug_line-tombstone.s (1989 of 2154) PASS: lldb-unit :: Utility/./UtilityTests/StringExtractorTest.GetHexBytes_OddPair (1990 of 2154) UNSUPPORTED: lldb-shell :: Register/x86-64-ymm16-write.test (1991 of 2154) PASS: lldb-unit :: UnwindAssembly/x86/./UnwindAssemblyx86Tests/Testx86AssemblyInspectionEngine.TestSubESP (1992 of 2154) PASS: lldb-api :: lang/cpp/dynamic-value-same-basename/TestDynamicValueSameBase.py (1993 of 2154) PASS: lldb-unit :: Symbol/./SymbolTests/SymbolsTest.TerminateLocateExecutableSymbolFileForUnknownExecutableAndUnknownSymbolFile (1994 of 2154) PASS: lldb-api :: lang/cpp/thread_local/TestThreadLocal.py (1995 of 2154) PASS: lldb-shell :: Driver/TestPositionalArgs.test (1996 of 2154) PASS: lldb-unit :: Utility/./UtilityTests/TimeoutTest.Construction (1997 of 2154) PASS: lldb-unit :: UnwindAssembly/x86/./UnwindAssemblyx86Tests/Testx86AssemblyInspectionEngine.TestPushEDX (1998 of 2154) PASS: lldb-api :: functionalities/gdb_remote_client/TestStopPCs.py (1999 of 2154) PASS: lldb-shell :: Reproducer/TestReuseDirectory.test (2000 of 2154) PASS: lldb-api :: lang/cpp/function_refs/TestFunctionRefs.py (2001 of 2154) PASS: lldb-api :: lang/cpp/template-specialization-type/TestTemplateSpecializationType.py (2002 of 2154) PASS: lldb-api :: functionalities/tail_call_frames/ambiguous_tail_call_seq1/TestAmbiguousTailCallSeq1.py (2003 of 2154) PASS: lldb-api :: functionalities/signal/TestSendSignal.py (2004 of 2154) PASS: lldb-shell :: ObjectFile/ELF/netbsd-core-amd64.test (2005 of 2154) PASS: lldb-api :: functionalities/load_using_paths/TestLoadUsingPaths.py (2006 of 2154) UNSUPPORTED: lldb-shell :: ScriptInterpreter/Lua/io.test (2007 of 2154) PASS: lldb-unit :: Utility/./UtilityTests/ConstStringTest.YAML (2008 of 2154) PASS: lldb-api :: lang/objc/objc-new-syntax/TestObjCNewSyntaxLiteral.py (2009 of 2154) PASS: lldb-unit :: Utility/./UtilityTests/AnsiTerminal.Incomplete (2010 of 2154) PASS: lldb-api :: functionalities/data-formatter/data-formatter-stl/libcxx/variant/TestDataFormatterLibcxxVariant.py (2011 of 2154) PASS: lldb-api :: functionalities/data-formatter/data-formatter-stl/libcxx/multiset/TestDataFormatterLibcxxMultiSet.py (2012 of 2154) PASS: lldb-api :: lang/c/inlines/TestRedefinitionsInInlines.py (2013 of 2154) PASS: lldb-shell :: Commands/command-disassemble-process.yaml (2014 of 2154) PASS: lldb-unit :: Utility/./UtilityTests/DataExtractorTest.GetMaxU64_unchecked (2015 of 2154) PASS: lldb-unit :: Utility/./UtilityTests/XcodeSDKTest.GetCanonicalNameAndConstruct (2016 of 2154) PASS: lldb-api :: commands/command/script/TestCommandScript.py (2017 of 2154) PASS: lldb-unit :: Core/./LLDBCoreTests/RichManglingContextTest.Basic (2018 of 2154) PASS: lldb-shell :: Reproducer/TestDump.test (2019 of 2154) UNSUPPORTED: lldb-api :: commands/expression/call-restarts/TestCallThatRestarts.py (2020 of 2154) PASS: lldb-unit :: Utility/./UtilityTests/AnsiTerminal.AtStart (2021 of 2154) PASS: lldb-api :: tools/lldb-server/TestGdbRemoteSingleStep.py (2022 of 2154) PASS: lldb-api :: lang/objc/single-entry-dictionary/TestObjCSingleEntryDictionary.py (2023 of 2154) PASS: lldb-api :: commands/expression/call-function/TestCallUserDefinedFunction.py (2024 of 2154) PASS: lldb-api :: tools/lldb-server/TestGdbRemoteRegisterState.py (2025 of 2154) PASS: lldb-unit :: Language/Highlighting/./HighlighterTests/HighlighterTest.ClangCursorOutOfBounds (2026 of 2154) PASS: lldb-unit :: Host/./HostTests/NativeProcessProtocolTest.ReadCStringFromMemory_CrossPageBoundary (2027 of 2154) PASS: lldb-shell :: Minidump/memory-region.yaml (2028 of 2154) PASS: lldb-unit :: ScriptInterpreter/Python/./ScriptInterpreterPythonTests/PythonDataObjectsTest.TestPythonListValueEquality (2029 of 2154) PASS: lldb-api :: commands/watchpoints/hello_watchpoint/TestMyFirstWatchpoint.py (2030 of 2154) PASS: lldb-unit :: Utility/./UtilityTests/RangeTest.ContainsRangeStartingFromZero (2031 of 2154) PASS: lldb-api :: functionalities/avoids-fd-leak/TestFdLeak.py (2032 of 2154) PASS: lldb-unit :: Utility/./UtilityTests/StatusTest.ErrorConversion (2033 of 2154) PASS: lldb-unit :: Utility/./UtilityTests/Flags.Reset (2034 of 2154) UNSUPPORTED: lldb-api :: tools/lldb-server/TestGdbRemote_vContThreads.py (2035 of 2154) PASS: lldb-unit :: Utility/./UtilityTests/StringExtractorTest.DecodeHexU8_InvalidHex (2036 of 2154) PASS: lldb-api :: commands/expression/ir-interpreter-phi-nodes/TestIRInterpreterPHINodes.py (2037 of 2154) PASS: lldb-api :: functionalities/thread/concurrent_events/TestConcurrentManyCrash.py (2038 of 2154) PASS: lldb-api :: functionalities/data-formatter/data-formatter-objc/TestDataFormatterObjCNSData.py (2039 of 2154) PASS: lldb-unit :: SymbolFile/DWARF/./SymbolFileDWARFTests/SymbolFileDWARFTests.TestAbbrevOrder1Start5 (2040 of 2154) PASS: lldb-api :: api/command-return-object/TestSBCommandReturnObject.py (2041 of 2154) PASS: lldb-shell :: ObjectFile/PECOFF/sections-names.yaml (2042 of 2154) PASS: lldb-shell :: Commands/CommandScriptImmediateOutput/CommandScriptImmediateOutputFile.test (2043 of 2154) PASS: lldb-unit :: Utility/./UtilityTests/ReproducerTest.SetReplay (2044 of 2154) PASS: lldb-shell :: SymbolFile/DWARF/find-basic-function.cpp (2045 of 2154) PASS: lldb-unit :: Utility/./UtilityTests/StreamTest.PutHex32ByteOrderLittle (2046 of 2154) PASS: lldb-unit :: ScriptInterpreter/Python/./ScriptInterpreterPythonTests/PythonDataObjectsTest.TestPythonDictionaryToStructuredDictionary (2047 of 2154) PASS: lldb-unit :: Process/minidump/./LLDBMinidumpTests/MinidumpParserTest.GetThreadContext_x86_32_wow64 (2048 of 2154) PASS: lldb-api :: functionalities/thread/concurrent_events/TestConcurrentCrashWithWatchpointBreakpointSignal.py (2049 of 2154) PASS: lldb-api :: lang/cpp/class_static/TestStaticVariables.py (2050 of 2154) UNSUPPORTED: lldb-api :: commands/watchpoints/hello_watchlocation/TestWatchLocation.py (2051 of 2154) PASS: lldb-shell :: Driver/LocalLLDBInit.test (2052 of 2154) PASS: lldb-shell :: BuildScript/modes.test (2053 of 2154) PASS: lldb-api :: commands/expression/import-std-module/deque-dbg-info-content/TestDbgInfoContentDequeFromStdModule.py (2054 of 2154) PASS: lldb-api :: functionalities/data-formatter/data-formatter-synthtype/TestDataFormatterSynthType.py (2055 of 2154) PASS: lldb-api :: functionalities/data-formatter/data-formatter-stl/libcxx/unique_ptr/TestDataFormatterLibcxxUniquePtr.py (2056 of 2154) PASS: lldb-unit :: Utility/./UtilityTests/StringExtractorTest.GetHexBytesAvail_FullString (2057 of 2154) PASS: lldb-unit :: Utility/./UtilityTests/StringExtractorTest.GetHexBytes_Partial (2058 of 2154) PASS: lldb-api :: commands/apropos/basic/TestApropos.py (2059 of 2154) PASS: lldb-unit :: Utility/./UtilityTests/ScalarTest.Promotion (2060 of 2154) PASS: lldb-unit :: Utility/./UtilityTests/StringListTest.SplitIntoLinesSingleTrailingCR (2061 of 2154) PASS: lldb-unit :: ScriptInterpreter/Python/./ScriptInterpreterPythonTests/PythonDataObjectsTest.TestPythonStringToStr (2062 of 2154) PASS: lldb-shell :: SymbolFile/DWARF/DW_TAG_basic_type_DW_ATE_UTF_nonC.ll (2063 of 2154) PASS: lldb-api :: functionalities/breakpoint/debugbreak/TestDebugBreak.py (2064 of 2154) PASS: lldb-unit :: Utility/./UtilityTests/BinaryStreamTest.PutSLEB128One (2065 of 2154) PASS: lldb-unit :: Utility/./UtilityTests/StreamTeeTest.SetStreamAtIndexOverwrite (2066 of 2154) PASS: lldb-unit :: Utility/./UtilityTests/ArgsTest.GetQuotedCommandString (2067 of 2154) PASS: lldb-api :: lang/objc/self/TestObjCSelf.py (2068 of 2154) PASS: lldb-api :: commands/process/attach/attach_denied/TestAttachDenied.py (2069 of 2154) PASS: lldb-api :: functionalities/thread/concurrent_events/TestConcurrentCrashWithBreak.py (2070 of 2154) PASS: lldb-unit :: Symbol/./SymbolTests/TestTypeSystemClang.TestOwningModule (2071 of 2154) PASS: lldb-unit :: Utility/./UtilityTests/XcodeSDKTest.FindXcodeContentsDirectoryInPath (2072 of 2154) PASS: lldb-unit :: ScriptInterpreter/Python/./ScriptInterpreterPythonTests/PythonDataObjectsTest.TestInstanceNameResolutionNoDot (2073 of 2154) PASS: lldb-api :: source-manager/TestSourceManager.py (2074 of 2154) PASS: lldb-unit :: ScriptInterpreter/Python/./ScriptInterpreterPythonTests/PythonDataObjectsTest.TestPythonIntegerToStructuredInteger (2075 of 2154) PASS: lldb-shell :: SymbolFile/NativePDB/disassembly.cpp (2076 of 2154) PASS: lldb-shell :: ObjectFile/ELF/basic-info.yaml (2077 of 2154) PASS: lldb-shell :: SymbolFile/DWARF/dir-separator-no-comp-dir-relative-name.s (2078 of 2154) PASS: lldb-unit :: Utility/./UtilityTests/StringExtractorTest.GetU64BigEndian (2079 of 2154) PASS: lldb-api :: commands/command/script/import/rdar-12586188/TestRdar12586188.py (2080 of 2154) PASS: lldb-unit :: Utility/./UtilityTests/StreamTest.PutCharWhitespace (2081 of 2154) PASS: lldb-unit :: Thread/./ThreadTests/ThreadTest.SetStopInfo (2082 of 2154) PASS: lldb-unit :: Utility/./UtilityTests/OptionsWithRawTest.LeadingSpaceArgs (2083 of 2154) PASS: lldb-api :: lang/cpp/constructors/TestCppConstructors.py (2084 of 2154) PASS: lldb-api :: functionalities/data-formatter/synthcapping/TestSyntheticCapping.py (2085 of 2154) PASS: lldb-api :: lang/cpp/this_class_type_mixing/TestThisClassTypeMixing.py (2086 of 2154) PASS: lldb-unit :: Utility/./UtilityTests/ScalarTest.TruncOrExtendTo (2087 of 2154) PASS: lldb-unit :: Core/./LLDBCoreTests/MangledTest.EmptyForInvalidName (2088 of 2154) PASS: lldb-unit :: Target/./TargetTests/ExecutionContextTest.GetByteOrderProcess (2089 of 2154) PASS: lldb-unit :: Process/gdb-remote/./ProcessGdbRemoteTests/GDBRemoteCommunicationClientTest.GetMemoryRegionInfo (2090 of 2154) PASS: lldb-unit :: UnwindAssembly/x86/./UnwindAssemblyx86Tests/Testx86AssemblyInspectionEngine.TestPushEBP (2091 of 2154) PASS: lldb-api :: functionalities/target-new-solib-notifications/TestModuleLoadedNotifys.py (2092 of 2154) PASS: lldb-api :: python_api/section/TestSectionAPI.py (2093 of 2154) PASS: lldb-api :: functionalities/plugins/python_os_plugin/stepping_plugin_threads/TestOSPluginStepping.py (2094 of 2154) PASS: lldb-unit :: Utility/./UtilityTests/StreamTest.PutSLEB128 (2095 of 2154) PASS: lldb-unit :: Utility/./UtilityTests/StringListTest.InsertStringAtIndexMove (2096 of 2154) PASS: lldb-api :: functionalities/data-formatter/data-formatter-synthval/TestDataFormatterSynthVal.py (2097 of 2154) PASS: lldb-api :: commands/expression/radar_9673664/TestExprHelpExamples.py (2098 of 2154) PASS: lldb-unit :: ObjectFile/Breakpad/./ObjectFileBreakpadTests/FileRecord.parse (2099 of 2154) PASS: lldb-unit :: Utility/./UtilityTests/RegularExpression.Valid (2100 of 2154) PASS: lldb-api :: lang/c/global_variables/TestGlobalVariables.py (2101 of 2154) PASS: lldb-api :: python_api/target/TestTargetAPI.py (2102 of 2154) PASS: lldb-unit :: Utility/./UtilityTests/StringExtractorTest.GetHexU8_Underflow2_NoEof (2103 of 2154) PASS: lldb-shell :: Minidump/Windows/broken-unwind.test (2104 of 2154) PASS: lldb-shell :: ObjectFile/ELF/short-build-id.yaml (2105 of 2154) PASS: lldb-api :: commands/watchpoints/multiple_hits/TestMultipleHits.py (2106 of 2154) PASS: lldb-unit :: SymbolFile/NativePDB/./SymbolFileNativePDBTests/PDBFPOProgramToDWARFExpressionTests.MissingTargetRegister (2107 of 2154) PASS: lldb-api :: lang/objc/hidden-ivars/TestHiddenIvars.py (2108 of 2154) PASS: lldb-unit :: Interpreter/./InterpreterTests/OptionArgParserTest.toScriptLanguage (2109 of 2154) PASS: lldb-api :: functionalities/thread/concurrent_events/TestConcurrentBreakpointOneDelayBreakpointThreads.py (2110 of 2154) PASS: lldb-shell :: SymbolFile/DWARF/find-basic-variable.cpp (2111 of 2154) UNSUPPORTED: lldb-api :: functionalities/data-formatter/data-formatter-stl/libstdcpp/vbool/TestDataFormatterStdVBool.py (2112 of 2154) PASS: lldb-api :: python_api/value/empty_class/TestValueAPIEmptyClass.py (2113 of 2154) PASS: lldb-api :: tools/lldb-vscode/module/TestVSCode_module.py (2114 of 2154) PASS: lldb-api :: commands/command/source/TestCommandSource.py (2115 of 2154) PASS: lldb-unit :: Symbol/./SymbolTests/TestClangASTImporter.CopyTypeTagDecl (2116 of 2154) PASS: lldb-api :: functionalities/tail_call_frames/unambiguous_sequence/TestUnambiguousTailCalls.py (2117 of 2154) PASS: lldb-unit :: Utility/./UtilityTests/BinaryStreamTest.PutSLEB128FourBytes (2118 of 2154) PASS: lldb-shell :: ObjectFile/Breakpad/uuid-matching-mac.test (2119 of 2154) PASS: lldb-unit :: Process/gdb-remote/./ProcessGdbRemoteTests/GDBRemoteCommunicationServerTest.SendErrorResponse_Status (2120 of 2154) PASS: lldb-api :: tools/lldb-server/register-reading/TestGdbRemoteGPacket.py (2121 of 2154) PASS: lldb-api :: python_api/sbplatform/TestSBPlatform.py (2122 of 2154) PASS: lldb-unit :: Symbol/./SymbolTests/TestTypeSystemClang.TestFunctionTemplateInRecordConstruction (2123 of 2154) PASS: lldb-api :: lang/cpp/overloaded-functions/TestOverloadedFunctions.py (2124 of 2154) UNSUPPORTED: lldb-shell :: Register/aarch64-gp-read.test (2125 of 2154) PASS: lldb-unit :: Utility/./UtilityTests/UUIDTest.Validity (2126 of 2154) PASS: lldb-unit :: Utility/./UtilityTests/CompletionRequest.Constructor (2127 of 2154) PASS: lldb-unit :: DataFormatter/./LLDBFormatterTests/TypeMatcherTests.RegexMatchPart (2128 of 2154) PASS: lldb-api :: python_api/symbol-context/TestSymbolContext.py (2129 of 2154) PASS: lldb-unit :: Utility/./UtilityTests/StringExtractorTest.GetHexBytesAvail_OddPair2 (2130 of 2154) PASS: lldb-unit :: Utility/./UtilityTests/ConstStringTest.MangledCounterpart (2131 of 2154) PASS: lldb-unit :: Symbol/./SymbolTests/TestTypeSystemClang.TestGetTypeClassTypeOf (2132 of 2154) PASS: lldb-shell :: Reproducer/TestPythonImport.test (2133 of 2154) PASS: lldb-unit :: Core/./LLDBCoreTests/UniqueCStringMap.NoDefaultConstructor (2134 of 2154) PASS: lldb-unit :: Utility/./UtilityTests/ArgsTest.ReplaceArgumentAtIndexFarOutOfRange (2135 of 2154) PASS: lldb-api :: functionalities/tsan/cpp_global_location/TestTsanCPPGlobalLocation.py (2136 of 2154) PASS: lldb-unit :: Utility/./UtilityTests/VMRange.Reset (2137 of 2154) PASS: lldb-unit :: Expression/./ExpressionTests/CppModuleConfigurationTest.AmbiguousLibCpp (2138 of 2154) PASS: lldb-unit :: Utility/./UtilityTests/StringListTest.RemoveBlankLines (2139 of 2154) PASS: lldb-api :: commands/target/create-no-such-arch/TestNoSuchArch.py (2140 of 2154) PASS: lldb-unit :: Core/./LLDBCoreTests/ModuleSpecTest.InvalidInMemoryBuffer (2141 of 2154) PASS: lldb-api :: macosx/lc-note/kern-ver-str/TestKernVerStrLCNOTE.py (2142 of 2154) PASS: lldb-shell :: ObjectFile/PECOFF/invalid-export-table.yaml (2143 of 2154) PASS: lldb-unit :: Utility/./UtilityTests/StringExtractorTest.GetNameColonValueNoSemicolon (2144 of 2154) PASS: lldb-api :: lang/objc/objc-ivar-protocols/TestIvarProtocols.py (2145 of 2154) PASS: lldb-unit :: Utility/./UtilityTests/StringExtractorTest.GetHexU8_Underflow_NoEof (2146 of 2154) PASS: lldb-api :: commands/frame/diagnose/inheritance/TestDiagnoseInheritance.py (2147 of 2154) PASS: lldb-shell :: ObjectFile/ELF/section-types.yaml (2148 of 2154) PASS: lldb-api :: functionalities/breakpoint/breakpoint_callback_command_source/TestBreakpointCallbackCommandSource.py (2149 of 2154) PASS: lldb-api :: assert_messages_test/TestAssertMessages.py (2150 of 2154) PASS: lldb-api :: functionalities/thread/step_out/TestThreadStepOut.py (2151 of 2154) PASS: lldb-api :: functionalities/thread/concurrent_events/TestConcurrentDelaySignalBreak.py (2152 of 2154) PASS: lldb-api :: lang/objc/orderedset/TestOrderedSet.py (2153 of 2154) PASS: lldb-api :: types/TestLongTypes.py (2154 of 2154) Slowest Tests: -------------------------------------------------------------------------- 384.85s: lldb-api :: macosx/simulator/TestSimulatorPlatform.py 285.55s: lldb-api :: lang/objc/exceptions/TestObjCExceptions.py 123.16s: lldb-api :: commands/expression/inline-namespace/TestInlineNamespace.py 106.78s: lldb-api :: functionalities/gdb_remote_client/TestGDBRemoteClient.py 103.48s: lldb-api :: tools/lldb-server/TestLldbGdbServer.py 101.52s: lldb-api :: functionalities/gdb_remote_client/TestQemuAArch64TargetXml.py 93.85s: lldb-api :: api/multithreaded/TestMultithreaded.py 72.19s: lldb-api :: lang/objc/objc-new-syntax/TestObjCNewSyntaxArray.py 61.40s: lldb-api :: lang/objc/foundation/TestFoundationDisassembly.py 56.53s: lldb-api :: functionalities/postmortem/mach-core/TestMachCore.py 55.48s: lldb-api :: types/TestLongTypesExpr.py 55.23s: lldb-api :: lang/objc/hidden-ivars/TestHiddenIvars.py 55.21s: lldb-shell :: SymbolFile/Breakpad/unwind-via-stack-win-no-memory-info.yaml 51.94s: lldb-api :: functionalities/inline-stepping/TestInlineStepping.py 51.83s: lldb-api :: lang/objc/foundation/TestObjCMethods.py 50.71s: lldb-api :: functionalities/mtc/simple/TestMTCSimple.py 50.12s: lldb-api :: commands/expression/import-std-module/shared_ptr-dbg-info-content/TestSharedPtrDbgInfoContentFromStdModule.py 47.96s: lldb-api :: lang/objc/foundation/TestObjCMethodsString.py 47.21s: lldb-api :: functionalities/postmortem/netbsd-core/TestNetBSDCore.py 41.77s: lldb-api :: lang/objcxx/cxx-bridged-po/TestObjCXXBridgedPO.py

Hide Details

Tests Times: -------------------------------------------------------------------------- [ Range ] :: [ Percentage ] :: [ Count ] -------------------------------------------------------------------------- [380s,400s) :: [ ] :: [ 1/2154] [360s,380s) :: [ ] :: [ 0/2154] [340s,360s) :: [ ] :: [ 0/2154] [320s,340s) :: [ ] :: [ 0/2154] [300s,320s) :: [ ] :: [ 0/2154] [280s,300s) :: [ ] :: [ 1/2154] [260s,280s) :: [ ] :: [ 0/2154] [240s,260s) :: [ ] :: [ 0/2154] [220s,240s) :: [ ] :: [ 0/2154] [200s,220s) :: [ ] :: [ 0/2154] [180s,200s) :: [ ] :: [ 0/2154] [160s,180s) :: [ ] :: [ 0/2154] [140s,160s) :: [ ] :: [ 0/2154] [120s,140s) :: [ ] :: [ 1/2154] [100s,120s) :: [ ] :: [ 3/2154] [ 80s,100s) :: [ ] :: [ 1/2154] [ 60s, 80s) :: [ ] :: [ 2/2154] [ 40s, 60s) :: [ ] :: [ 19/2154] [ 20s, 40s) :: [ ] :: [ 40/2154] [ 0s, 20s) :: [************************************** ] :: [2086/2154] -------------------------------------------------------------------------- ******************** Failed Tests (5): lldb-api :: functionalities/mtc/simple/TestMTCSimple.py lldb-api :: functionalities/inline-stepping/TestInlineStepping.py lldb-api :: functionalities/data-formatter/stringprinter/TestStringPrinter.py lldb-api :: functionalities/gdb_remote_client/TestQemuAArch64TargetXml.py lldb-api :: functionalities/gdb_remote_client/TestGDBRemoteClient.py

Hide Details

Hide Details

Testing Time: 1995.38s Unsupported : 153 Passed : 1990 Expectedly Failed: 6 Failed : 5 FAILED: tools/lldb/test/CMakeFiles/check-lldb-lit cd /Users/buildslave/jenkins/workspace/lldb-cmake/lldb-build/tools/lldb/test && /usr/local/Frameworks/Python.framework/Versions/3.7/bin/python3.7 /Users/buildslave/jenkins/workspace/lldb-cmake/lldb-build/./bin/llvm-lit -v --time-tests --shuffle --xunit-xml-output=/Users/buildslave/jenkins/workspace/lldb-cmake/test/results.xml -v -j 4 /Users/buildslave/jenkins/workspace/lldb-cmake/lldb-build/tools/lldb/test ninja: build stopped: subcommand failed. Command failed: Command '['/usr/bin/env', 'TERM=vt100', '/usr/local/bin/ninja', '-v', 'check-lldb']' returned non-zero exit status 1 Command: ['/usr/bin/env', 'TERM=vt100', '/usr/local/bin/ninja', '-v', 'check-lldb'] [Pipeline] } [Pipeline] // timeout [Pipeline] } [Pipeline] // stage [Pipeline] stage [Pipeline] { (Declarative: Post Actions) [Pipeline] scanForIssues [Clang (LLVM based)] Sleeping for 5 seconds due to JENKINS-32191... [Clang (LLVM based)] Parsing console log (workspace: '/Users/buildslave/jenkins/workspace/lldb-cmake') [Clang (LLVM based)] Successfully parsed console log [Clang (LLVM based)] -> found 8 issues (skipped 12 duplicates) [Clang (LLVM based)] Post processing issues on 'green-dragon-10' with source code encoding 'UTF-8' [Clang (LLVM based)] Creating SCM blamer to obtain author and commit information for affected files [Clang (LLVM based)] Creating SCM miner to obtain statistics for affected repository files [Clang (LLVM based)] Resolving file names for all issues in source directory '/Users/buildslave/jenkins/workspace/lldb-cmake' [Clang (LLVM based)] -> resolved paths in source directory (6 found, 0 not found) [Clang (LLVM based)] Resolving module names from module definitions (build.xml, pom.xml, or Manifest.mf files) [Clang (LLVM based)] -> resolved module names for 8 issues [Clang (LLVM based)] Resolving package names (or namespaces) by parsing the affected files [Clang (LLVM based)] -> resolved package names of 6 affected files [Clang (LLVM based)] No filter has been set, publishing all 8 issues [Clang (LLVM based)] Creating fingerprints for all affected code blocks to track issues over different builds [Clang (LLVM based)] -> created fingerprints for 8 issues (skipped 0 issues) [Clang (LLVM based)] Copying affected files to Jenkins' build folder '/Users/Shared/Jenkins/Home/jobs/lldb-cmake/builds/24023/files-with-issues' [Clang (LLVM based)] -> 4 copied, 2 not in workspace, 0 not-found, 0 with I/O error [Pipeline] junit Recording test results [Pipeline] emailext Warning: llvmgnsyncbot@gmail.com is not a recognized user, but sending mail anyway Warning: georgemitenk0v@gmail.com is not a recognized user, but sending mail anyway Warning: sam.parker@arm.com is not a recognized user, but sending mail anyway Warning: paulsson@linux.vnet.ibm.com is not a recognized user, but sending mail anyway Warning: llvm-dev@redking.me.uk is not a recognized user, but sending mail anyway Warning: limo@google.com is not a recognized user, but sending mail anyway Warning: flo@fhahn.com is not a recognized user, but sending mail anyway Warning: xiang1.zhang@intel.com is not a recognized user, but sending mail anyway Warning: llvmgnsyncbot@gmail.com is not a recognized user, but sending mail anyway Warning: georgemitenk0v@gmail.com is not a recognized user, but sending mail anyway Warning: sam.parker@arm.com is not a recognized user, but sending mail anyway Warning: paulsson@linux.vnet.ibm.com is not a recognized user, but sending mail anyway Warning: llvm-dev@redking.me.uk is not a recognized user, but sending mail anyway Warning: limo@google.com is not a recognized user, but sending mail anyway Warning: flo@fhahn.com is not a recognized user, but sending mail anyway Warning: xiang1.zhang@intel.com is not a recognized user, but sending mail anyway

Hide Details

Begin Pre-Send Script... Sending email to: mschifer@apple.com llvmgnsyncbot@gmail.com georgemitenk0v@gmail.com sam.parker@arm.com paulsson@linux.vnet.ibm.com llvm-dev@redking.me.uk limo@google.com flo@fhahn.com xiang1.zhang@intel.com "vsapsai@apple.com" <vsapsai@apple.com> Azhar Mohammed <azhar@apple.com>
[Pipeline] } [Pipeline] // stage [Pipeline] } [Pipeline] // withEnv [Pipeline] } [Pipeline] // node [Pipeline] End of Pipeline ERROR: script returned exit code 1 Finished: FAILURE