FailedConsole Output

Skipping 9,155 KB.. Full Log
n/./ScriptInterpreterPythonTests/PythonDataObjectsTest.TestGlobalNameResolutionNoDot (914 of 2154)
PASS: lldb-unit :: Utility/./UtilityTests/RegularExpression.Match (915 of 2154)
PASS: lldb-unit :: Utility/./UtilityTests/Flags.AllClear (916 of 2154)
PASS: lldb-api :: commands/expression/import-std-module/no-std-module/TestMissingStdModule.py (917 of 2154)
UNSUPPORTED: lldb-api :: benchmarks/turnaround/TestCompileRunToBreakpointTurnaround.py (918 of 2154)
PASS: lldb-api :: lang/cpp/unicode-literals/TestUnicodeLiterals.py (919 of 2154)
PASS: lldb-api :: lang/objc/self/TestObjCSelf.py (920 of 2154)
PASS: lldb-unit :: ObjectFile/ELF/./ObjectFileELFTests/ObjectFileELFTest.GetSymtab_NoSymEntryPointArmThumbAddressClass (921 of 2154)
PASS: lldb-api :: lang/objc/objc_direct-methods/TestObjCDirectMethods.py (922 of 2154)
PASS: lldb-unit :: Utility/./UtilityTests/DataExtractorTest.GetMaxU64_unchecked (923 of 2154)
PASS: lldb-api :: commands/expression/persist_objc_pointeetype/TestPersistObjCPointeeType.py (924 of 2154)
PASS: lldb-api :: functionalities/thread/crash_during_step/TestCrashDuringStep.py (925 of 2154)
PASS: lldb-api :: tools/lldb-vscode/launch/TestVSCode_launch.py (926 of 2154)
PASS: lldb-api :: functionalities/breakpoint/step_over_breakpoint/TestStepOverBreakpoint.py (927 of 2154)
PASS: lldb-unit :: Process/gdb-remote/./ProcessGdbRemoteTests/GDBRemoteClientBaseTest.InterruptNoResponse (928 of 2154)
PASS: lldb-unit :: Utility/./UtilityTests/DataExtractorTest.GetCStr (929 of 2154)
UNSUPPORTED: lldb-shell :: ObjectFile/ELF/minidebuginfo-set-and-hit-breakpoint.test (930 of 2154)
PASS: lldb-unit :: Utility/./UtilityTests/EnvironmentTest.EnvpConstruction (931 of 2154)
PASS: lldb-shell :: SymbolFile/DWARF/dwarf5_locations.s (932 of 2154)
PASS: lldb-unit :: Language/Highlighting/./HighlighterTests/HighlighterTest.Keywords (933 of 2154)
PASS: lldb-api :: functionalities/avoids-fd-leak/TestFdLeak.py (934 of 2154)
PASS: lldb-unit :: Process/gdb-remote/./ProcessGdbRemoteTests/GDBRemoteCommunicationClientTest.WriteRegisterNoSuffix (935 of 2154)
PASS: lldb-unit :: Utility/./UtilityTests/StreamTest.PutHex16ByteOrderBig (936 of 2154)
PASS: lldb-unit :: ScriptInterpreter/Python/./ScriptInterpreterPythonTests/PythonDataObjectsTest.TestScript (937 of 2154)
PASS: lldb-unit :: Utility/./UtilityTests/ArgsTest.GetQuotedCommandString (938 of 2154)
PASS: lldb-api :: commands/reproducer/invalid-args/TestInvalidArgsReproducer.py (939 of 2154)
PASS: lldb-unit :: Utility/./UtilityTests/BinaryStreamTest.PutULEB128ThreeBytes (940 of 2154)
XFAIL: lldb-shell :: Register/x86-64-ymm-write.test (941 of 2154)
PASS: lldb-api :: functionalities/non-overlapping-index-variable-i/TestIndexVariable.py (942 of 2154)
PASS: lldb-unit :: Utility/./UtilityTests/ProcessInstanceInfo.DumpTable (943 of 2154)
PASS: lldb-unit :: Expression/./ExpressionTests/DiagnosticManagerTest.GetStringMultipleDiags (944 of 2154)
PASS: lldb-unit :: Utility/./UtilityTests/StringListTest.InsertStringAtIndexEnd (945 of 2154)
PASS: lldb-api :: commands/frame/diagnose/array/TestArray.py (946 of 2154)
PASS: lldb-unit :: Language/Highlighting/./HighlighterTests/HighlighterTest.ClangCursorPosBeforeOtherToken (947 of 2154)
PASS: lldb-api :: lang/c/forward/TestForwardDeclaration.py (948 of 2154)
PASS: lldb-api :: python_api/watchpoint/TestWatchpointIter.py (949 of 2154)
PASS: lldb-unit :: ObjectFile/Breakpad/./ObjectFileBreakpadTests/StackCFIRecord.parse (950 of 2154)
PASS: lldb-api :: functionalities/postmortem/minidump-new/TestMiniDumpNew.py (951 of 2154)
UNSUPPORTED: lldb-api :: linux/thread/create_during_instruction_step/TestCreateDuringInstructionStep.py (952 of 2154)
PASS: lldb-unit :: ScriptInterpreter/Python/./ScriptInterpreterPythonTests/PythonDataObjectsTest.TestGlobalNameResolutionWithDot (953 of 2154)
PASS: lldb-shell :: SymbolFile/DWARF/DW_AT_loclists_base.s (954 of 2154)
UNSUPPORTED: lldb-api :: benchmarks/expression/TestExpressionCmd.py (955 of 2154)
PASS: lldb-shell :: Driver/TestConvenienceVariables.test (956 of 2154)
PASS: lldb-shell :: SymbolFile/DWARF/find-method.cpp (957 of 2154)
PASS: lldb-unit :: Utility/./UtilityTests/StringExtractorTest.GetU32LittleEndian (958 of 2154)
PASS: lldb-unit :: Symbol/./SymbolTests/DWARFCallFrameInfoTest.Basic_dwarf4 (959 of 2154)
PASS: lldb-unit :: Utility/./UtilityTests/XcodeSDKTest.FindXcodeContentsDirectoryInPath (960 of 2154)
PASS: lldb-unit :: Utility/./UtilityTests/ListenerTest.GetEventImmediate (961 of 2154)
PASS: lldb-api :: functionalities/gdb_remote_client/TestWriteMemory.py (962 of 2154)
PASS: lldb-api :: lang/cpp/diamond/TestDiamond.py (963 of 2154)
PASS: lldb-unit :: Utility/./UtilityTests/DataExtractorTest.GetMaxU64 (964 of 2154)
PASS: lldb-unit :: ScriptInterpreter/Python/./ScriptInterpreterPythonTests/PythonDataObjectsTest.TestPythonStringToStructuredString (965 of 2154)
PASS: lldb-unit :: Host/./HostTests/MainLoopTest.DetectsEOF (966 of 2154)
PASS: lldb-api :: functionalities/data-formatter/data-formatter-stl/libcxx/vbool/TestDataFormatterLibcxxVBool.py (967 of 2154)
PASS: lldb-shell :: SymbolFile/DWARF/dir-separator-no-comp-dir-relative-name.s (968 of 2154)
PASS: lldb-api :: functionalities/limit-debug-info/TestLimitDebugInfo.py (969 of 2154)
PASS: lldb-api :: commands/frame/diagnose/bad-reference/TestBadReference.py (970 of 2154)
PASS: lldb-api :: lang/objc/objc-new-syntax/TestObjCNewSyntaxArray.py (971 of 2154)
PASS: lldb-unit :: Host/./HostTests/Host.WaitStatusFormat (972 of 2154)
PASS: lldb-api :: commands/expression/unicode-in-variable/TestUnicodeInVariable.py (973 of 2154)
PASS: lldb-api :: lang/cpp/template-specialization-type/TestTemplateSpecializationType.py (974 of 2154)
PASS: lldb-unit :: SymbolFile/NativePDB/./SymbolFileNativePDBTests/PDBFPOProgramToDWARFExpressionTests.InvalidOpBinary (975 of 2154)
PASS: lldb-unit :: ObjectFile/Breakpad/./ObjectFileBreakpadTests/ModuleRecord.parse (976 of 2154)
PASS: lldb-unit :: Utility/./UtilityTests/StreamTest.PutRawBytesToMixedEndian (977 of 2154)
PASS: lldb-unit :: Utility/./UtilityTests/ScalarTest.RightShiftOperator (978 of 2154)
PASS: lldb-shell :: Reproducer/TestDebugSymbols.test (979 of 2154)
PASS: lldb-shell :: Reproducer/TestSynchronous.test (980 of 2154)
PASS: lldb-shell :: Reproducer/TestDiscard.test (981 of 2154)
PASS: lldb-api :: lang/objc/modules-inline-functions/TestModulesInlineFunctions.py (982 of 2154)
PASS: lldb-unit :: Utility/./UtilityTests/TildeExpressionResolver.ResolveFullPath (983 of 2154)
PASS: lldb-api :: functionalities/data-formatter/data-formatter-objc/TestDataFormatterObjCNSData.py (984 of 2154)
PASS: lldb-unit :: Utility/./UtilityTests/GeneratorTest.GetOrCreate (985 of 2154)
PASS: lldb-unit :: ScriptInterpreter/Python/./ScriptInterpreterPythonTests/PythonDataObjectsTest.TestResetting (986 of 2154)
PASS: lldb-api :: functionalities/thread/concurrent_events/TestConcurrentWatchpointDelayWatchpointOneBreakpoint.py (987 of 2154)
PASS: lldb-unit :: Target/./TargetTests/MemoryRegionInfoTest.Formatv (988 of 2154)
PASS: lldb-unit :: Utility/./UtilityTests/OptionsWithRawTest.WhitespaceInput (989 of 2154)
PASS: lldb-unit :: Process/gdb-remote/./ProcessGdbRemoteTests/GDBRemoteCommunicationClientTest.TestPacketSpeedJSON (990 of 2154)
PASS: lldb-unit :: Expression/./ExpressionTests/CppModuleConfigurationTest.Linux (991 of 2154)
PASS: lldb-unit :: SymbolFile/NativePDB/./SymbolFileNativePDBTests/PDBFPOProgramToDWARFExpressionTests.UnresolvedCyclicRegisterAssignmentReference (992 of 2154)
PASS: lldb-api :: commands/expression/import-std-module/forward_list-dbg-info-content/TestDbgInfoContentForwardListFromStdModule.py (993 of 2154)
PASS: lldb-unit :: UnwindAssembly/x86/./UnwindAssemblyx86Tests/Testx86AssemblyInspectionEngine.TestPopEBX (994 of 2154)
PASS: lldb-shell :: ObjectFile/wasm/basic.yaml (995 of 2154)
PASS: lldb-unit :: Utility/./UtilityTests/StringExtractorTest.GetHexBytesAvail (996 of 2154)
PASS: lldb-unit :: Expression/./ExpressionTests/CppModuleConfigurationTest.IgnoreLibStdCpp (997 of 2154)
PASS: lldb-api :: functionalities/data-formatter/data-formatter-stl/libcxx/multiset/TestDataFormatterLibcxxMultiSet.py (998 of 2154)
PASS: lldb-unit :: Process/gdb-remote/./ProcessGdbRemoteTests/GDBRemoteCommunicationServerTest.SendErrorResponse_Status (999 of 2154)
PASS: lldb-unit :: Expression/./ExpressionTests/ClangHostTest.MacOSX (1000 of 2154)
PASS: lldb-api :: lang/objc/objc-static-method-stripped/TestObjCStaticMethodStripped.py (1001 of 2154)
PASS: lldb-unit :: DataFormatter/./LLDBFormatterTests/TypeMatcherTests.CreatedBySameMatchStringExactNamePrefixes (1002 of 2154)
PASS: lldb-unit :: Process/gdb-remote/./ProcessGdbRemoteTests/GDBRemoteCommunicationClientTest.SendGetTraceConfigPacket (1003 of 2154)
PASS: lldb-shell :: Minidump/memory-region.yaml (1004 of 2154)
PASS: lldb-api :: api/multithreaded/TestMultithreaded.py (1005 of 2154)
PASS: lldb-unit :: ScriptInterpreter/Python/./ScriptInterpreterPythonTests/PythonDataObjectsTest.TestPythonIntegerToStructuredInteger (1006 of 2154)
PASS: lldb-unit :: Utility/./UtilityTests/ScalarTest.Promotion (1007 of 2154)
UNSUPPORTED: lldb-shell :: SymbolFile/PDB/vbases.test (1008 of 2154)
UNSUPPORTED: lldb-api :: arm/breakpoint-it/TestBreakpointIt.py (1009 of 2154)
UNSUPPORTED: lldb-shell :: Register/x86-gp-write.test (1010 of 2154)
PASS: lldb-api :: functionalities/breakpoint/comp_dir_symlink/TestCompDirSymLink.py (1011 of 2154)
UNSUPPORTED: lldb-shell :: Unwind/unwind-plan-dwarf-dump.test (1012 of 2154)
PASS: lldb-shell :: SymbolFile/DWARF/debug-types-dwarf5.s (1013 of 2154)
PASS: lldb-shell :: Minidump/memory-region-from-module.yaml (1014 of 2154)
PASS: lldb-unit :: Process/minidump/./LLDBMinidumpTests/MinidumpParserTest.FindMemoryRangeWithFullMemoryMinidump (1015 of 2154)
PASS: lldb-unit :: Utility/./UtilityTests/RegularExpression.Empty (1016 of 2154)
PASS: lldb-unit :: SymbolFile/DWARF/./SymbolFileDWARFTests/XcodeSDKModuleTests.TestModuleGetXcodeSDK (1017 of 2154)
PASS: lldb-unit :: Core/./LLDBCoreTests/RichManglingContextTest.FromCxxMethodName (1018 of 2154)
PASS: lldb-api :: functionalities/thread/thread_specific_break/TestThreadSpecificBreakpoint.py (1019 of 2154)
PASS: lldb-shell :: SymbolFile/DWARF/debug_line-tombstone.s (1020 of 2154)
PASS: lldb-unit :: Utility/./UtilityTests/DataExtractorTest.GetFloatUnaligned (1021 of 2154)
PASS: lldb-api :: functionalities/data-formatter/data-formatter-stl/libcxx/vector/TestDataFormatterLibcxxVector.py (1022 of 2154)
PASS: lldb-unit :: Utility/./UtilityTests/OptionsWithRawTest.WhitespaceSuffix (1023 of 2154)
PASS: lldb-unit :: Host/./HostTests/HostInfoTest.GetXcodeSDK (1024 of 2154)
PASS: lldb-unit :: Utility/./UtilityTests/StringExtractorTest.GetNameColonValueNoColon (1025 of 2154)
PASS: lldb-unit :: UnwindAssembly/ARM64/./Arm64InstEmulationTests/TestArm64InstEmulation.TestCFARegisterTrackedAcrossJumps (1026 of 2154)
PASS: lldb-shell :: SymbolFile/DWARF/DW_OP_piece-smaller-than-struct.s (1027 of 2154)
PASS: lldb-api :: python_api/frame/TestFrames.py (1028 of 2154)
PASS: lldb-unit :: Utility/./UtilityTests/AnsiTerminal.KnownPrefix (1029 of 2154)
PASS: lldb-unit :: debugserver/./debugserverTests/RNBSocket.LoopBackListenIPv6 (1030 of 2154)
PASS: lldb-unit :: Utility/./UtilityTests/ConstStringTest.UpdateMangledCounterpart (1031 of 2154)
PASS: lldb-unit :: Utility/./UtilityTests/ConstStringTest.MangledCounterpart (1032 of 2154)
PASS: lldb-unit :: Utility/./UtilityTests/FileSpecTest.FormatFileSpec (1033 of 2154)
PASS: lldb-api :: functionalities/data-formatter/synthupdate/TestSyntheticFilterRecompute.py (1034 of 2154)
PASS: lldb-unit :: Process/minidump/./LLDBMinidumpTests/MinidumpParserTest.GetExceptionStream (1035 of 2154)
UNSUPPORTED: lldb-api :: functionalities/data-formatter/data-formatter-stl/libstdcpp/map/TestDataFormatterStdMap.py (1036 of 2154)
PASS: lldb-shell :: Quit/TestQuitExitCode0.test (1037 of 2154)
PASS: lldb-api :: commands/expression/class_template_specialization_empty_pack/TestClassTemplateSpecializationParametersHandling.py (1038 of 2154)
PASS: lldb-unit :: UnwindAssembly/x86/./UnwindAssemblyx86Tests/Testx86AssemblyInspectionEngine.TestSubRSP (1039 of 2154)
PASS: lldb-unit :: Utility/./UtilityTests/AnsiTerminal.Basic (1040 of 2154)
PASS: lldb-api :: commands/target/create-deps/TestTargetCreateDeps.py (1041 of 2154)
PASS: lldb-unit :: Utility/./UtilityTests/StreamTest.AddressRangeEmptyRange (1042 of 2154)
PASS: lldb-api :: functionalities/data-formatter/data-formatter-stl/libcxx/tuple/TestDataFormatterLibcxxTuple.py (1043 of 2154)
PASS: lldb-api :: commands/expression/import-std-module/shared_ptr/TestSharedPtrFromStdModule.py (1044 of 2154)
PASS: lldb-api :: lang/cpp/alignas_base_class/TestAlignAsBaseClass.py (1045 of 2154)
PASS: lldb-api :: lang/cpp/virtual-overload/TestVirtualOverload.py (1046 of 2154)
PASS: lldb-unit :: Host/./HostTests/NativeProcessProtocolTest.SetBreakpointFailRead (1047 of 2154)
PASS: lldb-api :: commands/target/stop-hooks/TestStopHooks.py (1048 of 2154)
PASS: lldb-unit :: Language/CPlusPlus/./LanguageCPlusPlusTests/CPlusPlusLanguage.FindAlternateFunctionManglings (1049 of 2154)
PASS: lldb-unit :: Utility/./UtilityTests/ArgsTest.TestSingleArgWithQuotedSpace (1050 of 2154)
PASS: lldb-unit :: Utility/./UtilityTests/Flags.Clear (1051 of 2154)
PASS: lldb-shell :: Breakpoint/single-file-split-dwarf.test (1052 of 2154)
PASS: lldb-unit :: Utility/./UtilityTests/VMRange.ContainsAddr (1053 of 2154)
PASS: lldb-unit :: debugserver/./debugserverTests/RNBSocket.LoopBackListenIPv4 (1054 of 2154)
PASS: lldb-api :: lang/objc/foundation/TestFoundationDisassembly.py (1055 of 2154)
PASS: lldb-shell :: SymbolFile/DWARF/debug_ranges-missing-section.s (1056 of 2154)
PASS: lldb-unit :: Utility/./UtilityTests/UriParserTest.BracketedHostnameWithColon (1057 of 2154)
PASS: lldb-shell :: BuildScript/modes.test (1058 of 2154)
PASS: lldb-shell :: ObjectFile/wasm/embedded-debug-sections.yaml (1059 of 2154)
PASS: lldb-shell :: Reproducer/TestDump.test (1060 of 2154)
PASS: lldb-unit :: Utility/./UtilityTests/ArgsTest.ReplaceArgumentAtIndexLonger (1061 of 2154)
PASS: lldb-unit :: Utility/./UtilityTests/RecordReplayTest.InstrumentedFoo (1062 of 2154)
PASS: lldb-shell :: SymbolFile/DWARF/dwarf5-atomic.s (1063 of 2154)
PASS: lldb-unit :: Utility/./UtilityTests/DataExtractorTest.GetMaxS64 (1064 of 2154)
PASS: lldb-unit :: Utility/./UtilityTests/DataExtractorTest.GetULEB128_bit63 (1065 of 2154)
PASS: lldb-shell :: SymbolFile/DWARF/find-basic-variable.cpp (1066 of 2154)
PASS: lldb-unit :: Host/./HostTests/File.GetStreamFromDescriptor (1067 of 2154)
PASS: lldb-shell :: Recognizer/assert.test (1068 of 2154)
PASS: lldb-api :: python_api/debugger/TestDebuggerAPI.py (1069 of 2154)
PASS: lldb-shell :: Settings/TestDisableColor.test (1070 of 2154)
PASS: lldb-shell :: ObjectFile/wasm/unified-debug-sections.yaml (1071 of 2154)
PASS: lldb-unit :: Utility/./UtilityTests/DataExtractorTest.GetSLEB128_bit63 (1072 of 2154)
PASS: lldb-unit :: Utility/./UtilityTests/RangeTest.ContainsEndInclusiveInvalid (1073 of 2154)
PASS: lldb-api :: lang/cpp/const_this/TestConstThis.py (1074 of 2154)
PASS: lldb-shell :: Settings/TestEchoCommands.test (1075 of 2154)
PASS: lldb-shell :: ScriptInterpreter/Python/eof.test (1076 of 2154)
PASS: lldb-unit :: Utility/./UtilityTests/StringExtractorTest.GetHexU8_Underflow (1077 of 2154)
PASS: lldb-unit :: Utility/./UtilityTests/ArgsTest.DoubleQuotedItem (1078 of 2154)
PASS: lldb-unit :: Disassembler/./DisassemblerTests/TestArm64Disassembly.TestArmv81Instruction (1079 of 2154)
UNSUPPORTED: lldb-shell :: SymbolFile/PDB/variables.test (1080 of 2154)
PASS: lldb-unit :: Utility/./UtilityTests/ArgsTest.Yaml (1081 of 2154)
PASS: lldb-api :: functionalities/data-formatter/data-formatter-synth/TestDataFormatterSynth.py (1082 of 2154)
PASS: lldb-api :: functionalities/data-formatter/hexcaps/TestDataFormatterHexCaps.py (1083 of 2154)
PASS: lldb-api :: python_api/frame/inlines/TestInlinedFrame.py (1084 of 2154)
PASS: lldb-api :: lang/cpp/function-qualifiers/TestCppFunctionQualifiers.py (1085 of 2154)
PASS: lldb-unit :: Language/CPlusPlus/./LanguageCPlusPlusTests/CPlusPlusLanguage.CPlusPlusNameParser (1086 of 2154)
PASS: lldb-unit :: Utility/./UtilityTests/StringLexerTest.GetUnlexed (1087 of 2154)
PASS: lldb-unit :: Utility/./UtilityTests/ArgsTest.TestTrailingBackslash (1088 of 2154)
UNSUPPORTED: lldb-api :: commands/trace/TestTraceLoad.py (1089 of 2154)
PASS: lldb-api :: commands/process/attach/TestProcessAttach.py (1090 of 2154)
PASS: lldb-unit :: UnwindAssembly/x86/./UnwindAssemblyx86Tests/Testx86AssemblyInspectionEngine.TestPopR14 (1091 of 2154)
PASS: lldb-unit :: Process/gdb-remote/./ProcessGdbRemoteTests/GDBRemoteCommunicationClientTest.SendStopTracePacket (1092 of 2154)
PASS: lldb-shell :: SymbolFile/DWARF/dwp-separate-debug-file.cpp (1093 of 2154)
PASS: lldb-shell :: Commands/command-thread-select.test (1094 of 2154)
PASS: lldb-api :: commands/expression/ir-interpreter/TestIRInterpreter.py (1095 of 2154)
PASS: lldb-shell :: Reproducer/TestFileRepro.test (1096 of 2154)
PASS: lldb-api :: functionalities/history/TestHistoryRecall.py (1097 of 2154)
PASS: lldb-api :: lang/cpp/exceptions/TestCPPExceptionBreakpoints.py (1098 of 2154)
PASS: lldb-shell :: Unwind/eh-frame-dwarf-unwind.test (1099 of 2154)
PASS: lldb-api :: macosx/profile_vrs_detach/TestDetachVrsProfile.py (1100 of 2154)
PASS: lldb-api :: commands/expression/namespace_local_var_same_name_cpp_and_c/TestNamespaceLocalVarSameNameCppAndC.py (1101 of 2154)
PASS: lldb-api :: functionalities/thread/concurrent_events/TestConcurrentTwoWatchpointsOneBreakpoint.py (1102 of 2154)
PASS: lldb-api :: functionalities/dead-strip/TestDeadStrip.py (1103 of 2154)
UNSUPPORTED: lldb-shell :: SymbolFile/PDB/type-quals.test (1104 of 2154)
PASS: lldb-unit :: Utility/./UtilityTests/StreamTest.QuotedCString (1105 of 2154)
PASS: lldb-unit :: UnwindAssembly/x86/./UnwindAssemblyx86Tests/Testx86AssemblyInspectionEngine.Test32bitFramelessBigStackFrame (1106 of 2154)
UNSUPPORTED: lldb-shell :: Register/x86-64-zmm-write.test (1107 of 2154)
PASS: lldb-api :: functionalities/param_entry_vals/basic_entry_values/TestBasicEntryValues.py (1108 of 2154)
PASS: lldb-shell :: ObjectFile/PECOFF/section-types.yaml (1109 of 2154)
PASS: lldb-api :: functionalities/data-formatter/data-formatter-cpp/TestDataFormatterCpp.py (1110 of 2154)
PASS: lldb-unit :: Utility/./UtilityTests/SerializationRountripTest.SerializeDeserializeCStringArray (1111 of 2154)
UNSUPPORTED: lldb-api :: benchmarks/frame_variable/TestFrameVariableResponse.py (1112 of 2154)
PASS: lldb-unit :: Symbol/./SymbolTests/TestTypeSystemClang.TestFunctionTemplateInRecordConstruction (1113 of 2154)
PASS: lldb-unit :: Utility/./UtilityTests/UriParserTest.PortOverflow (1114 of 2154)
PASS: lldb-unit :: Utility/./UtilityTests/SerializationRountripTest.SerializeDeserializePodReferences (1115 of 2154)
PASS: lldb-api :: tools/lldb-server/TestGdbRemoteProcessInfo.py (1116 of 2154)
PASS: lldb-api :: lang/c/modules/TestCModules.py (1117 of 2154)
PASS: lldb-unit :: UnwindAssembly/PPC64/./PPC64InstEmulationTests/TestPPC64InstEmulation.TestSimpleFunction (1118 of 2154)
PASS: lldb-unit :: UnwindAssembly/x86/./UnwindAssemblyx86Tests/Testx86AssemblyInspectionEngine.Test32bitFramelessSmallStackFrame (1119 of 2154)
UNSUPPORTED: lldb-api :: commands/expression/call-restarts/TestCallThatRestarts.py (1120 of 2154)
PASS: lldb-unit :: UnwindAssembly/x86/./UnwindAssemblyx86Tests/Testx86AssemblyInspectionEngine.TestSpillRegToStackViaMOVi386 (1121 of 2154)
PASS: lldb-unit :: Utility/./UtilityTests/LogTest.Register (1122 of 2154)
UNSUPPORTED: lldb-shell :: SymbolFile/NativePDB/local-variables.cpp (1123 of 2154)
PASS: lldb-api :: commands/target/modules/search-paths/insert/TestTargetModulesSearchpathsInsert.py (1124 of 2154)
PASS: lldb-unit :: Utility/./UtilityTests/CompletionRequest.DuplicateFilteringWithComments (1125 of 2154)
PASS: lldb-api :: commands/watchpoints/watchpoint_events/TestWatchpointEvents.py (1126 of 2154)
PASS: lldb-unit :: Editline/./EditlineTests/EditlineTestFixture.EditlineReceivesMultiLineText (1127 of 2154)
PASS: lldb-shell :: ObjectFile/ELF/PT_LOAD-overlap-section.yaml (1128 of 2154)
PASS: lldb-api :: functionalities/data-formatter/parray/TestPrintArray.py (1129 of 2154)
PASS: lldb-shell :: Commands/command-backtrace.test (1130 of 2154)
PASS: lldb-unit :: Core/./LLDBCoreTests/UniqueCStringMap.NoDefaultConstructor (1131 of 2154)
PASS: lldb-api :: functionalities/gdb_remote_client/TestqOffsets.py (1132 of 2154)
PASS: lldb-api :: functionalities/breakpoint/cpp_exception/TestCPPExceptionBreakpoint.py (1133 of 2154)
PASS: lldb-shell :: Breakpoint/case-sensitive.test (1134 of 2154)
PASS: lldb-api :: functionalities/data-formatter/data-formatter-stl/libcxx/set/TestDataFormatterLibcxxSet.py (1135 of 2154)
PASS: lldb-api :: python_api/value_var_update/TestValueVarUpdate.py (1136 of 2154)
UNSUPPORTED: lldb-api :: functionalities/darwin_log/filter/regex/category/TestDarwinLogFilterRegexCategory.py (1137 of 2154)
PASS: lldb-shell :: Minidump/Windows/find-module.test (1138 of 2154)
PASS: lldb-shell :: SymbolFile/Breakpad/stack-cfi-arm.yaml (1139 of 2154)
PASS: lldb-unit :: Utility/./UtilityTests/StringListTest.ForRange (1140 of 2154)
PASS: lldb-unit :: Utility/./UtilityTests/PassiveReplayTest.InstrumentedBar (1141 of 2154)
PASS: lldb-api :: macosx/order/TestOrderFile.py (1142 of 2154)
PASS: lldb-api :: commands/disassemble/basic/TestFrameDisassemble.py (1143 of 2154)
PASS: lldb-unit :: UnwindAssembly/ARM64/./Arm64InstEmulationTests/TestArm64InstEmulation.TestRegisterDoubleSpills (1144 of 2154)
PASS: lldb-unit :: Utility/./UtilityTests/BinaryStreamTest.PutULEB128EightBytes (1145 of 2154)
PASS: lldb-api :: sanity/TestModuleCacheSanity.py (1146 of 2154)
PASS: lldb-api :: macosx/save_crashlog/TestSaveCrashlog.py (1147 of 2154)
PASS: lldb-api :: lang/objc/objc-ivar-stripped/TestObjCIvarStripped.py (1148 of 2154)
PASS: lldb-unit :: Process/minidump/./LLDBMinidumpTests/RegisterContextMinidump.ConvertMinidumpContext_x86_32 (1149 of 2154)
PASS: lldb-api :: functionalities/unwind/zeroth_frame/TestZerothFrame.py (1150 of 2154)
PASS: lldb-api :: tools/lldb-vscode/coreFile/TestVSCode_coreFile.py (1151 of 2154)
PASS: lldb-unit :: Utility/./UtilityTests/StreamTest.AddressPrefixAndSuffix (1152 of 2154)
PASS: lldb-unit :: Utility/./UtilityTests/FileSpecTest.EqualSeparator (1153 of 2154)
PASS: lldb-api :: commands/watchpoints/multiple_hits/TestMultipleHits.py (1154 of 2154)
UNSUPPORTED: lldb-shell :: ScriptInterpreter/Lua/independent_state.test (1155 of 2154)
UNSUPPORTED: lldb-api :: linux/add-symbols/TestTargetSymbolsAddCommand.py (1156 of 2154)
PASS: lldb-api :: lang/cpp/thread_local/TestThreadLocal.py (1157 of 2154)
PASS: lldb-unit :: Utility/./UtilityTests/ScalarTest.TruncOrExtendTo (1158 of 2154)
PASS: lldb-shell :: SymbolFile/DWARF/debug-names-compressed.cpp (1159 of 2154)
PASS: lldb-unit :: Utility/./UtilityTests/StreamTeeTest.DefaultConstructor (1160 of 2154)
PASS: lldb-unit :: Utility/./UtilityTests/StringExtractorTest.DecodeHexU8_Underflow (1161 of 2154)
PASS: lldb-unit :: Utility/./UtilityTests/ScalarTest.ComparisonFloat (1162 of 2154)
PASS: lldb-api :: lang/objcxx/hide-runtime-values/TestObjCXXHideRuntimeValues.py (1163 of 2154)
PASS: lldb-api :: functionalities/data-formatter/nsdictionarysynth/TestNSDictionarySynthetic.py (1164 of 2154)
PASS: lldb-shell :: Unwind/thread-step-out-ret-addr-check.test (1165 of 2154)
PASS: lldb-api :: commands/target/stop-hook/disable/TestTargetStopHookDisable.py (1166 of 2154)
PASS: lldb-unit :: SymbolFile/DWARF/./SymbolFileDWARFTests/SymbolFileDWARFTests.TestAbbrevMissingTerminator (1167 of 2154)
PASS: lldb-api :: commands/expression/import-std-module/vector/TestVectorFromStdModule.py (1168 of 2154)
PASS: lldb-shell :: Breakpoint/debug_rnglist_rlestartend.test (1169 of 2154)
PASS: lldb-unit :: Utility/./UtilityTests/ArgsTest.StringListConstructor (1170 of 2154)
PASS: lldb-shell :: ObjectFile/ELF/PT_LOAD-empty.yaml (1171 of 2154)
PASS: lldb-shell :: Breakpoint/ppc64-localentry.test (1172 of 2154)
PASS: lldb-api :: lang/c/blocks/TestBlocks.py (1173 of 2154)
PASS: lldb-api :: commands/platform/file/close/TestPlatformFileClose.py (1174 of 2154)
PASS: lldb-unit :: UnwindAssembly/x86/./UnwindAssemblyx86Tests/Testx86AssemblyInspectionEngine.TestPopEBP (1175 of 2154)
PASS: lldb-unit :: Host/./HostTests/NativeProcessProtocolTest.ReadCStringFromMemory (1176 of 2154)
PASS: lldb-api :: functionalities/reproducers/attach/TestReproducerAttach.py (1177 of 2154)
PASS: lldb-shell :: SymbolFile/DWARF/dwp-debug-types.s (1178 of 2154)
PASS: lldb-api :: python_api/formatters/TestFormattersSBAPI.py (1179 of 2154)
UNSUPPORTED: lldb-shell :: Watchpoint/netbsd-nouserdbregs.test (1180 of 2154)
PASS: lldb-unit :: Utility/./UtilityTests/ScalarTest.CastOperations (1181 of 2154)
PASS: lldb-unit :: Process/gdb-remote/./ProcessGdbRemoteTests/GDBRemoteCommunicationClientTest.SaveRestoreRegistersNoSuffix (1182 of 2154)
UNSUPPORTED: lldb-api :: lang/cpp/printf/TestPrintf.py (1183 of 2154)
PASS: lldb-unit :: Utility/./UtilityTests/VMRange.IsValid (1184 of 2154)
PASS: lldb-unit :: Utility/./UtilityTests/StringExtractorTest.GetHexBytesAvail_Underflow (1185 of 2154)
PASS: lldb-unit :: Symbol/./SymbolTests/Type.GetTypeScopeAndBasename (1186 of 2154)
PASS: lldb-api :: api/listeners/TestListener.py (1187 of 2154)
PASS: lldb-unit :: DataFormatter/./LLDBFormatterTests/StringPrinterTests.SwiftUTF8 (1188 of 2154)
PASS: lldb-unit :: Utility/./UtilityTests/StringExtractorTest.GetU64BigEndian (1189 of 2154)
PASS: lldb-unit :: Utility/./UtilityTests/XcodeSDKTest.GetSDKTypeForTriple (1190 of 2154)
PASS: lldb-unit :: Utility/./UtilityTests/OptionsWithRawTest.ArgsButNoDelimiter (1191 of 2154)
PASS: lldb-unit :: Utility/./UtilityTests/StreamTest.ShiftOperatorStrings (1192 of 2154)
PASS: lldb-unit :: Editline/./EditlineTests/EditlineTestFixture.EditlineReceivesSingleLineText (1193 of 2154)
PASS: lldb-unit :: Utility/./UtilityTests/AnsiTerminal.Empty (1194 of 2154)
PASS: lldb-unit :: UnwindAssembly/x86/./UnwindAssemblyx86Tests/Testx86AssemblyInspectionEngine.TestSimplex86_64Augmented (1195 of 2154)
PASS: lldb-unit :: Language/Highlighting/./HighlighterTests/HighlighterTest.ClangCursorOutOfBounds (1196 of 2154)
UNSUPPORTED: lldb-api :: commands/expression/macros/TestMacros.py (1197 of 2154)
PASS: lldb-unit :: ScriptInterpreter/Python/./ScriptInterpreterPythonTests/PythonDataObjectsTest.TestModuleNameResolutionNoDot (1198 of 2154)
PASS: lldb-unit :: Target/./TargetTests/MCBasedABI.MapRegisterName (1199 of 2154)
PASS: lldb-api :: functionalities/gdb_remote_client/TestStopPCs.py (1200 of 2154)
PASS: lldb-api :: functionalities/tsan/global_location/TestTsanGlobalLocation.py (1201 of 2154)
PASS: lldb-unit :: Utility/./UtilityTests/StringExtractorTest.GetHexU8_Exact_NoEof (1202 of 2154)
PASS: lldb-api :: commands/expression/po_verbosity/TestPoVerbosity.py (1203 of 2154)
PASS: lldb-api :: lang/objc/orderedset/TestOrderedSet.py (1204 of 2154)
PASS: lldb-unit :: Utility/./UtilityTests/CompletionRequest.ShiftArguments (1205 of 2154)
PASS: lldb-api :: types/TestLongTypes.py (1206 of 2154)
PASS: lldb-unit :: Utility/./UtilityTests/BinaryStreamTest.PutULEB128OneByte (1207 of 2154)
PASS: lldb-api :: macosx/simulator/TestSimulatorPlatform.py (1208 of 2154)
PASS: lldb-api :: lang/objc/modules-app-update/TestClangModulesAppUpdate.py (1209 of 2154)
PASS: lldb-api :: commands/watchpoints/watchpoint_disable/TestWatchpointDisable.py (1210 of 2154)
PASS: lldb-shell :: Minidump/fb-dump.test (1211 of 2154)
UNSUPPORTED: lldb-shell :: ScriptInterpreter/Lua/persistent_state.test (1212 of 2154)
PASS: lldb-api :: lang/objc/variadic_methods/TestVariadicMethods.py (1213 of 2154)
PASS: lldb-shell :: ObjectFile/ELF/PT_LOAD-overlap-PT_TLS.yaml (1214 of 2154)
PASS: lldb-shell :: Minidump/Windows/arm-fp-unwind.test (1215 of 2154)
PASS: lldb-api :: python_api/disassemble-raw-data/TestDisassembleRawData.py (1216 of 2154)
PASS: lldb-api :: python_api/sbvalue_persist/TestSBValuePersist.py (1217 of 2154)
PASS: lldb-unit :: Utility/./UtilityTests/EnvironmentTest.EnvpConversion (1218 of 2154)
PASS: lldb-unit :: SymbolFile/NativePDB/./SymbolFileNativePDBTests/PDBFPOProgramToDWARFExpressionTests.UnresolvedDependentCyclicRegisterAssignmentReference (1219 of 2154)
PASS: lldb-shell :: SymbolFile/DWARF/dwarf5-debug_line.s (1220 of 2154)
PASS: lldb-unit :: Utility/./UtilityTests/FileSpecTest.GetPath (1221 of 2154)
PASS: lldb-api :: commands/command/script/import/TestImport.py (1222 of 2154)
PASS: lldb-api :: functionalities/load_unload/TestLoadUnload.py (1223 of 2154)
PASS: lldb-api :: lang/cpp/incomplete-types/TestCppIncompleteTypes.py (1224 of 2154)
PASS: lldb-api :: lang/c/local_types/TestUseClosestType.py (1225 of 2154)
PASS: lldb-unit :: Utility/./UtilityTests/SharedCluster.ClusterManager (1226 of 2154)
PASS: lldb-api :: functionalities/postmortem/minidump/TestMiniDump.py (1227 of 2154)
PASS: lldb-api :: functionalities/data-formatter/compactvectors/TestCompactVectors.py (1228 of 2154)
PASS: lldb-api :: types/TestShortType.py (1229 of 2154)
PASS: lldb-unit :: Utility/./UtilityTests/ReproducerTest.SetReplay (1230 of 2154)
PASS: lldb-api :: linux/builtin_trap/TestBuiltinTrap.py (1231 of 2154)
PASS: lldb-unit :: Expression/./ExpressionTests/CppModuleConfigurationTest.MissingLibCpp (1232 of 2154)
PASS: lldb-api :: tools/lldb-server/TestGdbRemoteThreadsInStopReply.py (1233 of 2154)
PASS: lldb-api :: functionalities/mtc/simple/TestMTCSimple.py (1234 of 2154)
PASS: lldb-shell :: SymbolFile/DWARF/debug-types-basic.test (1235 of 2154)
PASS: lldb-api :: functionalities/thread/num_threads/TestNumThreads.py (1236 of 2154)
PASS: lldb-shell :: SymbolFile/DWARF/find-inline-method.s (1237 of 2154)
PASS: lldb-api :: lang/mixed/TestMixedLanguages.py (1238 of 2154)
PASS: lldb-api :: python_api/watchpoint/TestWatchpointIgnoreCount.py (1239 of 2154)
PASS: lldb-unit :: Utility/./UtilityTests/RangeDataVector.FindEntryIndexesThatContain_Overlap (1240 of 2154)
PASS: lldb-api :: tools/lldb-server/commandline/TestStubReverseConnect.py (1241 of 2154)
PASS: lldb-api :: functionalities/thread/concurrent_events/TestConcurrentManyBreakpoints.py (1242 of 2154)
PASS: lldb-api :: functionalities/abbreviation/TestCommonShortSpellings.py (1243 of 2154)
PASS: lldb-shell :: ObjectFile/MachO/symtab.yaml (1244 of 2154)
PASS: lldb-api :: lang/c/unicode/TestUnicodeSymbols.py (1245 of 2154)
PASS: lldb-unit :: Utility/./UtilityTests/StringListTest.ShiftCString (1246 of 2154)
PASS: lldb-shell :: SymbolFile/DWARF/clang-ast-from-dwarf-unamed-and-anon-structs.cpp (1247 of 2154)
PASS: lldb-api :: commands/version/TestVersion.py (1248 of 2154)
PASS: lldb-unit :: Interpreter/./InterpreterTests/CompletionTest.DirCompletionUsername (1249 of 2154)
PASS: lldb-unit :: Process/gdb-remote/./ProcessGdbRemoteTests/GDBRemoteClientBaseTest.SendContinueAndWait (1250 of 2154)
PASS: lldb-unit :: Symbol/./SymbolTests/TestTypeSystemClang.TemplateArguments (1251 of 2154)
PASS: lldb-api :: functionalities/pointer_num_children/TestPointerNumChildren.py (1252 of 2154)
PASS: lldb-unit :: ObjectFile/PECOFF/./ObjectFilePECOFFTests/PECallFrameInfoTest.Frame_reg_eh (1253 of 2154)
PASS: lldb-api :: functionalities/thread/exit_during_expression/TestExitDuringExpression.py (1254 of 2154)
PASS: lldb-unit :: Symbol/./SymbolTests/TestTypeSystemClang.TestConvertAccessTypeToAccessSpecifier (1255 of 2154)
PASS: lldb-api :: functionalities/breakpoint/breakpoint_by_file_colon_line/TestBreakpointByFileColonLine.py (1256 of 2154)
PASS: lldb-unit :: Utility/./UtilityTests/StreamTeeTest.Constructor2Streams (1257 of 2154)
PASS: lldb-api :: functionalities/data-formatter/data-formatter-stl/libcxx/forward_list/TestDataFormatterLibcxxForwardList.py (1258 of 2154)
PASS: lldb-api :: lang/objcxx/objcxx-ivar-vector/TestIvarVector.py (1259 of 2154)
PASS: lldb-api :: lang/objc/forward-decl/TestForwardDecl.py (1260 of 2154)
PASS: lldb-api :: api/check_public_api_headers/TestPublicAPIHeaders.py (1261 of 2154)
PASS: lldb-unit :: Utility/./UtilityTests/StringListTest.SetSize (1262 of 2154)
PASS: lldb-unit :: Symbol/./SymbolTests/TestTypeSystemClang.TestGetTypeClassNested (1263 of 2154)
PASS: lldb-shell :: ObjectFile/PECOFF/basic-info-arm64.yaml (1264 of 2154)
PASS: lldb-api :: lang/objc/objc-optimized/TestObjcOptimized.py (1265 of 2154)
PASS: lldb-unit :: Process/minidump/./LLDBMinidumpTests/MinidumpParserTest.GetMemory (1266 of 2154)
PASS: lldb-api :: commands/expression/import-std-module/deque-basic/TestDequeFromStdModule.py (1267 of 2154)
PASS: lldb-unit :: Utility/./UtilityTests/ArgsTest.TestOverwriteArgs (1268 of 2154)
PASS: lldb-unit :: Process/minidump/./LLDBMinidumpTests/MinidumpParserTest.GetPidWow64 (1269 of 2154)
PASS: lldb-api :: lang/c/shared_lib/TestSharedLib.py (1270 of 2154)
PASS: lldb-api :: commands/expression/import-std-module/forward_decl_from_module/TestForwardDeclFromStdModule.py (1271 of 2154)
PASS: lldb-api :: lang/cpp/auto/TestCPPAuto.py (1272 of 2154)
PASS: lldb-api :: functionalities/data-formatter/data-formatter-stl/libcxx/unordered/TestDataFormatterUnordered.py (1273 of 2154)
PASS: lldb-shell :: Settings/TestLineMarkerColor.test (1274 of 2154)
PASS: lldb-unit :: Process/minidump/./LLDBMinidumpTests/MinidumpParserTest.GetLinuxProcStatus_no_stream (1275 of 2154)
PASS: lldb-api :: commands/platform/basic/TestPlatformCommand.py (1276 of 2154)
PASS: lldb-unit :: Process/minidump/./LLDBMinidumpTests/MinidumpParserTest.GetPid (1277 of 2154)
PASS: lldb-shell :: Driver/TestPositionalArgs.test (1278 of 2154)
PASS: lldb-api :: functionalities/multiword-commands/TestMultiWordCommands.py (1279 of 2154)
PASS: lldb-api :: lang/c/enum_types/TestEnumTypes.py (1280 of 2154)
PASS: lldb-shell :: ObjectFile/ELF/PT_TLS-overlap-PT_LOAD.yaml (1281 of 2154)
PASS: lldb-unit :: Utility/./UtilityTests/ArgsTest.TestMultipleArgs (1282 of 2154)
PASS: lldb-api :: functionalities/gdb_remote_client/TestIOSSimulator.py (1283 of 2154)
PASS: lldb-unit :: Symbol/./SymbolTests/TestClangASTImporter.MetadataPropagation (1284 of 2154)
PASS: lldb-unit :: UnwindAssembly/x86/./UnwindAssemblyx86Tests/Testx86AssemblyInspectionEngine.TestPushRBP (1285 of 2154)
UNSUPPORTED: lldb-api :: lang/c/typedef/Testtypedef.py (1286 of 2154)
UNSUPPORTED: lldb-api :: functionalities/darwin_log/filter/regex/activity/TestDarwinLogFilterRegexActivity.py (1287 of 2154)
PASS: lldb-api :: lang/cpp/enum_types/TestCPP11EnumTypes.py (1288 of 2154)
PASS: lldb-shell :: SymbolFile/DWARF/debug_aranges-empty-section.s (1289 of 2154)
PASS: lldb-unit :: Host/./HostTests/MainLoopTest.ReadObject (1290 of 2154)
PASS: lldb-unit :: SymbolFile/DWARF/./SymbolFileDWARFTests/SymbolFileDWARFTests.TestAbbrevOrder1Start5 (1291 of 2154)
PASS: lldb-api :: functionalities/breakpoint/move_nearest/TestMoveNearest.py (1292 of 2154)
PASS: lldb-unit :: Utility/./UtilityTests/StringExtractorTest.GetHexBytesAvail_OddPair2 (1293 of 2154)
PASS: lldb-shell :: Commands/CommandScriptImmediateOutput/CommandScriptImmediateOutputFile.test (1294 of 2154)
PASS: lldb-api :: functionalities/unwind/noreturn/module-end/TestNoReturnModuleEnd.py (1295 of 2154)
PASS: lldb-shell :: SymbolFile/DWARF/win-i386-line-table.s (1296 of 2154)
PASS: lldb-unit :: Utility/./UtilityTests/UUIDTest.RelationalOperators (1297 of 2154)
PASS: lldb-shell :: SymbolFile/NativePDB/ast-types.cpp (1298 of 2154)
PASS: lldb-unit :: ScriptInterpreter/Python/./ScriptInterpreterPythonTests/PythonDataObjectsTest.TestPythonDictionaryValueEquality (1299 of 2154)
PASS: lldb-unit :: Utility/./UtilityTests/GeneratorTest.YamlMultiProvider (1300 of 2154)
PASS: lldb-unit :: Utility/./UtilityTests/StringExtractorTest.GetHexU8_Underflow2 (1301 of 2154)
PASS: lldb-unit :: Utility/./UtilityTests/BinaryStreamTest.PutSLEB128OneByte (1302 of 2154)
PASS: lldb-api :: functionalities/process_group/TestChangeProcessGroup.py (1303 of 2154)
PASS: lldb-api :: driver/batch_mode/TestBatchMode.py (1304 of 2154)
PASS: lldb-api :: functionalities/data-formatter/data-formatter-stl/libcxx/map/TestDataFormatterLibccMap.py (1305 of 2154)
PASS: lldb-unit :: Process/gdb-remote/./ProcessGdbRemoteTests/GDBRemoteCommunicationClientTest.GetMemoryRegionInfoInvalidResponse (1306 of 2154)
PASS: lldb-api :: functionalities/breakpoint/address_breakpoints/TestAddressBreakpoints.py (1307 of 2154)
PASS: lldb-unit :: Utility/./UtilityTests/StringListTest.SplitIntoLinesEmpty (1308 of 2154)
PASS: lldb-api :: functionalities/breakpoint/auto_continue/TestBreakpointAutoContinue.py (1309 of 2154)
PASS: lldb-api :: commands/log/invalid-args/TestInvalidArgsLog.py (1310 of 2154)
PASS: lldb-unit :: Symbol/./SymbolTests/SymbolsTest.LocateExecutableSymbolFileForUnknownExecutableAndMissingSymbolFile (1311 of 2154)
PASS: lldb-unit :: Utility/./UtilityTests/StreamTest.AddressEmptyPrefix (1312 of 2154)
PASS: lldb-unit :: Utility/./UtilityTests/CompletionRequest.Constructor (1313 of 2154)
PASS: lldb-unit :: Utility/./UtilityTests/RangeTest.ClearWithStarAddress (1314 of 2154)
PASS: lldb-api :: functionalities/thread/concurrent_events/TestConcurrentBreakpointOneDelayBreakpointThreads.py (1315 of 2154)
PASS: lldb-shell :: SymbolFile/Breakpad/unwind-via-stack-win-no-memory-info.yaml (1316 of 2154)
PASS: lldb-unit :: Utility/./UtilityTests/StructuredDataTest.ParseJSONFromFile (1317 of 2154)
PASS: lldb-api :: functionalities/conditional_break/TestConditionalBreak.py (1318 of 2154)
PASS: lldb-unit :: Utility/./UtilityTests/VASprintfTest.EncodingError (1319 of 2154)
PASS: lldb-api :: functionalities/breakpoint/breakpoint_language/TestBreakpointLanguage.py (1320 of 2154)
PASS: lldb-unit :: Utility/./UtilityTests/SerializationRountripTest.SerializeDeserializeCStringNull (1321 of 2154)
PASS: lldb-unit :: Utility/./UtilityTests/StringLexerTest.Peek (1322 of 2154)
PASS: lldb-unit :: Expression/./ExpressionTests/DiagnosticManagerTest.GetStringPreserveOrder (1323 of 2154)
PASS: lldb-unit :: Host/./HostTests/FileSystemTest.Exists (1324 of 2154)
PASS: lldb-shell :: Reproducer/TestDriverOptions.test (1325 of 2154)
PASS: lldb-unit :: Process/gdb-remote/./ProcessGdbRemoteTests/GDBRemoteCommunicationServerTest.SendErrorResponse_ErrorNumber (1326 of 2154)
PASS: lldb-unit :: Process/gdb-remote/./ProcessGdbRemoteTests/GDBRemoteClientBaseTest.SendPacketAndReceiveResponseWithOutputSupport (1327 of 2154)
PASS: lldb-unit :: Utility/./UtilityTests/LogChannelTest.Disable (1328 of 2154)
PASS: lldb-shell :: Driver/TestCore.test (1329 of 2154)
PASS: lldb-shell :: Reproducer/Functionalities/TestStepping.test (1330 of 2154)
PASS: lldb-shell :: Reproducer/TestReuseDirectory.test (1331 of 2154)
PASS: lldb-unit :: Utility/./UtilityTests/RangeVector.CombineConsecutiveRanges (1332 of 2154)
PASS: lldb-api :: lang/cpp/typedef/TestCppTypedef.py (1333 of 2154)
PASS: lldb-api :: functionalities/thread/concurrent_events/TestConcurrentSignalWatch.py (1334 of 2154)
PASS: lldb-api :: python_api/watchpoint/TestSetWatchpoint.py (1335 of 2154)
PASS: lldb-api :: commands/gui/invalid-args/TestInvalidArgsGui.py (1336 of 2154)
PASS: lldb-unit :: Utility/./UtilityTests/StreamTest.PutChar (1337 of 2154)
PASS: lldb-unit :: UnwindAssembly/ARM64/./Arm64InstEmulationTests/TestArm64InstEmulation.TestFramelessThreeEpilogueFunction (1338 of 2154)
PASS: lldb-api :: functionalities/tail_call_frames/disambiguate_paths_to_common_sink/TestDisambiguatePathsToCommonSink.py (1339 of 2154)
PASS: lldb-api :: macosx/nslog/TestDarwinNSLogOutput.py (1340 of 2154)
PASS: lldb-unit :: Utility/./UtilityTests/StringListTest.GetMaxStringLengthMixed (1341 of 2154)
PASS: lldb-shell :: SymbolFile/DWARF/childless-compile-unit.s (1342 of 2154)
PASS: lldb-api :: api/multiple-targets/TestMultipleTargets.py (1343 of 2154)
PASS: lldb-api :: commands/process/attach-resume/TestAttachResume.py (1344 of 2154)
PASS: lldb-api :: functionalities/data-formatter/data-formatter-synthval/TestDataFormatterSynthVal.py (1345 of 2154)
PASS: lldb-unit :: Utility/./UtilityTests/NameMatchesTest.RegularExpression (1346 of 2154)
PASS: lldb-shell :: SymbolFile/NativePDB/source-list.cpp (1347 of 2154)
PASS: lldb-unit :: Utility/./UtilityTests/VASprintfTest.NoBufferResize (1348 of 2154)
PASS: lldb-api :: commands/expression/import-std-module/empty-module/TestEmptyStdModule.py (1349 of 2154)
PASS: lldb-unit :: Utility/./UtilityTests/OptionsWithRawTest.MultiWordSuffix (1350 of 2154)
PASS: lldb-api :: functionalities/data-formatter/data-formatter-smart-array/TestDataFormatterSmartArray.py (1351 of 2154)
PASS: lldb-unit :: Expression/./ExpressionTests/DiagnosticManagerTest.GetStringSeverityLabels (1352 of 2154)
PASS: lldb-api :: python_api/section/TestSectionAPI.py (1353 of 2154)
UNSUPPORTED: lldb-shell :: BuildScript/toolchain-msvc.test (1354 of 2154)
PASS: lldb-shell :: SymbolFile/DWARF/inline-function-address.ll (1355 of 2154)
PASS: lldb-api :: functionalities/data-formatter/data-formatter-objc/TestDataFormatterObjCCF.py (1356 of 2154)
PASS: lldb-unit :: Expression/./ExpressionTests/DiagnosticManagerTest.AddDiagnostic (1357 of 2154)
PASS: lldb-unit :: ScriptInterpreter/Python/./ScriptInterpreterPythonTests/PythonDataObjectsTest.TestPythonBoolean (1358 of 2154)
PASS: lldb-api :: functionalities/data-formatter/nssetsynth/TestNSSetSynthetic.py (1359 of 2154)
PASS: lldb-unit :: Utility/./UtilityTests/SerializationRountripTest.SerializeDeserializeCStringArrayNullptrElem (1360 of 2154)
PASS: lldb-shell :: Driver/TestCommands.test (1361 of 2154)
PASS: lldb-api :: functionalities/gdb_remote_client/TestProcessConnect.py (1362 of 2154)
PASS: lldb-api :: functionalities/thread/concurrent_events/TestConcurrentTwoWatchpointThreads.py (1363 of 2154)
PASS: lldb-api :: functionalities/inferior-crashing/recursive-inferior/TestRecursiveInferior.py (1364 of 2154)
PASS: lldb-unit :: Core/./LLDBCoreTests/ModuleSpecTest.TestCOFFFile (1365 of 2154)
PASS: lldb-api :: commands/target/stop-hooks/TestStopHookScripted.py (1366 of 2154)
PASS: lldb-unit :: Expression/./ExpressionTests/DWARFExpression.DW_OP_piece (1367 of 2154)
PASS: lldb-api :: commands/expression/persistent_ptr_update/TestPersistentPtrUpdate.py (1368 of 2154)
PASS: lldb-api :: tools/lldb-server/TestGdbRemoteRegisterState.py (1369 of 2154)
PASS: lldb-shell :: Settings/TestFrameFormatMangling.test (1370 of 2154)
PASS: lldb-unit :: Utility/./UtilityTests/LogTest.LLDB_LOG_nullptr (1371 of 2154)
PASS: lldb-api :: commands/expression/calculator_mode/TestCalculatorMode.py (1372 of 2154)
PASS: lldb-unit :: Utility/./UtilityTests/VMRange.Reset (1373 of 2154)
PASS: lldb-api :: commands/gui/breakpoints/TestGuiBreakpoints.py (1374 of 2154)
PASS: lldb-unit :: Host/./HostTests/FileSystemTest.FileAndDirectoryComponents (1375 of 2154)
PASS: lldb-api :: lang/cpp/template-function/TestTemplateFunctions.py (1376 of 2154)
PASS: lldb-api :: functionalities/thread/ignore_suspended/TestIgnoreSuspendedThread.py (1377 of 2154)
UNSUPPORTED: lldb-api :: functionalities/thread/break_after_join/TestBreakAfterJoin.py (1378 of 2154)
UNSUPPORTED: lldb-shell :: Register/x86-64-gp-write.test (1379 of 2154)
PASS: lldb-api :: functionalities/thread/concurrent_events/TestConcurrentDelaySignalBreak.py (1380 of 2154)
PASS: lldb-shell :: Driver/TestUseColor.test (1381 of 2154)
PASS: lldb-unit :: Language/Highlighting/./HighlighterTests/HighlighterTest.ClangPreserveNewLine (1382 of 2154)
UNSUPPORTED: lldb-api :: functionalities/darwin_log/source/info/TestDarwinLogSourceInfo.py (1383 of 2154)
PASS: lldb-api :: functionalities/thread/step_until/TestStepUntil.py (1384 of 2154)
PASS: lldb-shell :: ObjectFile/ELF/minidebuginfo-corrupt-xz.yaml (1385 of 2154)
PASS: lldb-api :: python_api/symbol-context/two-files/TestSymbolContextTwoFiles.py (1386 of 2154)
PASS: lldb-unit :: debugserver/./debugserverTests/JSON.Parse (1387 of 2154)
PASS: lldb-unit :: Host/./HostTests/FileSystemTest.OpenErrno (1388 of 2154)
PASS: lldb-api :: lang/c/struct_types/TestStructTypes.py (1389 of 2154)
PASS: lldb-api :: commands/session/history/TestSessionHistory.py (1390 of 2154)
PASS: lldb-api :: functionalities/data-formatter/data-formatter-objc/TestDataFormatterObjCPlain.py (1391 of 2154)
PASS: lldb-api :: lang/objc/objc-ivar-offsets/TestObjCIvarOffsets.py (1392 of 2154)
PASS: lldb-api :: commands/expression/completion/TestExprCompletion.py (1393 of 2154)
PASS: lldb-api :: functionalities/gdb_remote_client/TestGDBRemoteLoad.py (1394 of 2154)
PASS: lldb-unit :: Utility/./UtilityTests/ArgsTest.TestQuotedUnknownEscape (1395 of 2154)
PASS: lldb-unit :: Utility/./UtilityTests/StreamTeeTest.SetStreamAtIndexOverwrite (1396 of 2154)
UNSUPPORTED: lldb-shell :: SymbolFile/PDB/class-layout.test (1397 of 2154)
PASS: lldb-unit :: Core/./LLDBCoreTests/MangledTest.EmptyForInvalidName (1398 of 2154)
PASS: lldb-unit :: UnwindAssembly/ARM64/./Arm64InstEmulationTests/TestArm64InstEmulation.TestMediumDarwinFunction (1399 of 2154)
PASS: lldb-api :: functionalities/thread/concurrent_events/TestConcurrentTwoBreakpointsOneDelaySignal.py (1400 of 2154)
UNSUPPORTED: lldb-api :: linux/mix-dwo-and-regular-objects/TestMixedDwarfBinary.py (1401 of 2154)
PASS: lldb-shell :: ObjectFile/ELF/aarch64-relocations.yaml (1402 of 2154)
PASS: lldb-api :: functionalities/gdb_remote_client/TestQemuAArch64TargetXml.py (1403 of 2154)
PASS: lldb-api :: python_api/findvalue_duplist/TestSBFrameFindValue.py (1404 of 2154)
PASS: lldb-unit :: Utility/./UtilityTests/LogTest.Unregister (1405 of 2154)
PASS: lldb-unit :: Utility/./UtilityTests/StringListTest.GetSize (1406 of 2154)
PASS: lldb-shell :: Quit/TestQuitExitCodeTooManyArgs.test (1407 of 2154)
PASS: lldb-unit :: Symbol/./SymbolTests/TestClangASTImporter.ImportInvalidType (1408 of 2154)
PASS: lldb-unit :: Target/./TargetTests/ModuleCacheTest.GetAndPutUuidExists (1409 of 2154)
PASS: lldb-api :: functionalities/tail_call_frames/inlining_and_tail_calls/TestInliningAndTailCalls.py (1410 of 2154)
PASS: lldb-unit :: Utility/./UtilityTests/FileSpecTest.CopyByAppendingPathComponent (1411 of 2154)
PASS: lldb-api :: types/TestCharType.py (1412 of 2154)
PASS: lldb-unit :: Utility/./UtilityTests/ArchSpecTest.YAML (1413 of 2154)
UNSUPPORTED: lldb-api :: tools/lldb-server/TestGdbRemote_vContThreads.py (1414 of 2154)
PASS: lldb-unit :: SymbolFile/DWARF/./SymbolFileDWARFTests/SymbolFileDWARFTests.TestAbbrevValidAttrNullForm (1415 of 2154)
PASS: lldb-api :: functionalities/gdb_remote_client/TestRegDefinitionInParts.py (1416 of 2154)
PASS: lldb-unit :: Utility/./UtilityTests/StringLexerTest.PutBack (1417 of 2154)
PASS: lldb-api :: python_api/disassemble-raw-data/TestDisassemble_VST1_64.py (1418 of 2154)
PASS: lldb-unit :: Symbol/./SymbolTests/DWARFCallFrameInfoTest.Basic_eh (1419 of 2154)
PASS: lldb-api :: functionalities/tail_call_frames/ambiguous_tail_call_seq1/TestAmbiguousTailCallSeq1.py (1420 of 2154)
PASS: lldb-unit :: Instruction/./EmulatorTests/TestAArch64Emulator.TestOverflow (1421 of 2154)
PASS: lldb-api :: functionalities/asan/TestMemoryHistory.py (1422 of 2154)
PASS: lldb-api :: commands/platform/file/read/TestPlatformFileRead.py (1423 of 2154)
PASS: lldb-api :: tools/lldb-vscode/module/TestVSCode_module.py (1424 of 2154)
PASS: lldb-api :: lang/cpp/namespace_definitions/TestNamespaceDefinitions.py (1425 of 2154)
PASS: lldb-unit :: Utility/./UtilityTests/RegularExpression.CopyAssignment (1426 of 2154)
PASS: lldb-unit :: Utility/./UtilityTests/IndexToObjectTest.ObjectForIndex (1427 of 2154)
PASS: lldb-api :: lang/cpp/namespace_conflicts/TestNamespaceConflicts.py (1428 of 2154)
PASS: lldb-api :: lang/objc/objc++/TestObjCXX.py (1429 of 2154)
PASS: lldb-api :: python_api/value/TestValueAPI.py (1430 of 2154)
PASS: lldb-unit :: Utility/./UtilityTests/DataExtractorTest.GetCStrUnterminated (1431 of 2154)
PASS: lldb-shell :: SymbolFile/NativePDB/globals-bss.cpp (1432 of 2154)
PASS: lldb-api :: commands/expression/codegen-crash-import-def-arraytype-element/TestImportDefinitionArrayType.py (1433 of 2154)
PASS: lldb-unit :: Process/gdb-remote/./ProcessGdbRemoteTests/GDBRemoteCommunicationClientTest.SendGetDataPacket (1434 of 2154)
PASS: lldb-api :: commands/gui/viewlarge/TestGuiViewLarge.py (1435 of 2154)
UNSUPPORTED: lldb-shell :: BuildScript/toolchain-clang-cl.test (1436 of 2154)
PASS: lldb-api :: functionalities/ptr_refs/TestPtrRefs.py (1437 of 2154)
PASS: lldb-unit :: Language/Highlighting/./HighlighterTests/HighlighterTest.ClangTrailingBackslashMissingNewLine (1438 of 2154)
PASS: lldb-api :: python_api/sbtype_typeclass/TestSBTypeTypeClass.py (1439 of 2154)
PASS: lldb-unit :: Utility/./UtilityTests/NameMatchesTest.Equals (1440 of 2154)
PASS: lldb-api :: functionalities/data-formatter/data-formatter-objc/TestDataFormatterObjCNSContainer.py (1441 of 2154)
PASS: lldb-api :: lang/cpp/namespace/TestNamespace.py (1442 of 2154)
PASS: lldb-shell :: ObjectFile/PECOFF/invalid-export-table.yaml (1443 of 2154)
PASS: lldb-unit :: UnwindAssembly/x86/./UnwindAssemblyx86Tests/Testx86AssemblyInspectionEngine.TestSimple64bitFrameFunction (1444 of 2154)
PASS: lldb-api :: functionalities/data-formatter/frameformat_smallstruct/TestFrameFormatSmallStruct.py (1445 of 2154)
PASS: lldb-unit :: Utility/./UtilityTests/TimeoutTest.Format (1446 of 2154)
PASS: lldb-api :: functionalities/breakpoint/debugbreak/TestDebugBreak.py (1447 of 2154)
PASS: lldb-api :: lang/cpp/offsetof/TestOffsetofCpp.py (1448 of 2154)
PASS: lldb-api :: tools/lldb-server/TestLldbGdbServer.py (1449 of 2154)
PASS: lldb-unit :: UnwindAssembly/x86/./UnwindAssemblyx86Tests/Testx86AssemblyInspectionEngine.TestPopR12 (1450 of 2154)
PASS: lldb-unit :: Utility/./UtilityTests/StringListTest.LongestCommonPrefixNoPrefix (1451 of 2154)
PASS: lldb-api :: types/TestCharTypeExpr.py (1452 of 2154)
PASS: lldb-unit :: Utility/./UtilityTests/StringListTest.LongestCommonPrefixEmpty (1453 of 2154)
UNSUPPORTED: lldb-api :: benchmarks/libcxxmap/TestBenchmarkLibcxxMap.py (1454 of 2154)
PASS: lldb-unit :: Utility/./UtilityTests/UriParserTest.BadPort (1455 of 2154)
UNSUPPORTED: lldb-shell :: ScriptInterpreter/Lua/lua-python.test (1456 of 2154)
PASS: lldb-api :: commands/expression/import-std-module/list/TestListFromStdModule.py (1457 of 2154)
PASS: lldb-api :: functionalities/data-formatter/stringprinter/TestStringPrinter.py (1458 of 2154)
PASS: lldb-unit :: Host/./HostTests/NativeProcessProtocolTest.SetBreakpoint (1459 of 2154)
PASS: lldb-unit :: Symbol/./SymbolTests/PostfixExpression.ParseOneExpression (1460 of 2154)
PASS: lldb-unit :: DataFormatter/./LLDBFormatterTests/TypeMatcherTests.RegexMatchPart (1461 of 2154)
PASS: lldb-unit :: Utility/./UtilityTests/FileSpecTest.EqualDotsPosixRoot (1462 of 2154)
PASS: lldb-unit :: Utility/./UtilityTests/RangeTest.ContainsAddr (1463 of 2154)
PASS: lldb-unit :: Utility/./UtilityTests/DataExtractorTest.GetDoubleUnaligned (1464 of 2154)
PASS: lldb-shell :: SymbolFile/NativePDB/locate-pdb.cpp (1465 of 2154)
PASS: lldb-api :: lang/cpp/dynamic-value-same-basename/TestDynamicValueSameBase.py (1466 of 2154)
PASS: lldb-api :: lang/objc/foundation/TestObjCMethods.py (1467 of 2154)
PASS: lldb-shell :: SymbolFile/DWARF/debug-types-address-ranges.s (1468 of 2154)
PASS: lldb-unit :: Utility/./UtilityTests/ArchSpecTest.OperatorBool (1469 of 2154)
PASS: lldb-unit :: Symbol/./SymbolTests/TestClangASTImporter.CopyDeclTagDecl (1470 of 2154)
PASS: lldb-unit :: Utility/./UtilityTests/StreamTeeTest.GetStreamAtIndexOutOfBoundsEmpty (1471 of 2154)
PASS: lldb-api :: iohandler/autosuggestion/TestAutosuggestion.py (1472 of 2154)
UNSUPPORTED: lldb-shell :: Register/x86-64-ymm16-read.test (1473 of 2154)
PASS: lldb-shell :: ObjectFile/PECOFF/dep-modules.yaml (1474 of 2154)
PASS: lldb-shell :: Process/Optimization.test (1475 of 2154)
PASS: lldb-unit :: Symbol/./SymbolTests/DWARFCallFrameInfoTest.Basic_dwarf3 (1476 of 2154)
PASS: lldb-unit :: Utility/./UtilityTests/ArchSpecTest.TripleComponentsWereSpecified (1477 of 2154)
UNSUPPORTED: lldb-shell :: ScriptInterpreter/Lua/bindings.test (1478 of 2154)
PASS: lldb-api :: lang/objc/bitfield_ivars/TestBitfieldIvars.py (1479 of 2154)
PASS: lldb-shell :: SymbolFile/DWARF/DW_TAG_basic_type_DW_ATE_UTF_nonC.ll (1480 of 2154)
PASS: lldb-shell :: SymbolFile/DWARF/DW_AT_const_value-bitfields.s (1481 of 2154)
PASS: lldb-api :: python_api/process/TestProcessAPI.py (1482 of 2154)
PASS: lldb-unit :: Expression/./ExpressionTests/ClangExpressionDeclMapTest.TestPersistentDeclLookup (1483 of 2154)
PASS: lldb-unit :: Language/Highlighting/./HighlighterTests/HighlighterTest.ClangOperators (1484 of 2154)
PASS: lldb-api :: commands/help/TestHelp.py (1485 of 2154)
PASS: lldb-unit :: Utility/./UtilityTests/StreamTest.PutStringAsRawHex8 (1486 of 2154)
PASS: lldb-unit :: Target/./TargetTests/StackFrameRecognizerTest.NullModuleRegex (1487 of 2154)
UNSUPPORTED: lldb-api :: functionalities/signal/handle-segv/TestHandleSegv.py (1488 of 2154)
PASS: lldb-api :: functionalities/thread/concurrent_events/TestConcurrentDelayWatchBreak.py (1489 of 2154)
PASS: lldb-api :: python_api/value/empty_class/TestValueAPIEmptyClass.py (1490 of 2154)
UNSUPPORTED: lldb-shell :: SymbolFile/PDB/pointers.test (1491 of 2154)
PASS: lldb-unit :: Utility/./UtilityTests/BinaryStreamTest.PutSLEB128Zero (1492 of 2154)
PASS: lldb-api :: functionalities/gdb_remote_client/TestPlatformClient.py (1493 of 2154)
PASS: lldb-shell :: Reproducer/TestRelativePath.test (1494 of 2154)
PASS: lldb-shell :: Commands/command-regex-unalias.test (1495 of 2154)
PASS: lldb-shell :: ObjectFile/ELF/section-overlap.yaml (1496 of 2154)
PASS: lldb-api :: functionalities/thread/backtrace_all/TestBacktraceAll.py (1497 of 2154)
PASS: lldb-api :: commands/expression/call-throws/TestCallThatThrows.py (1498 of 2154)
PASS: lldb-api :: tools/lldb-server/TestGdbRemote_qThreadStopInfo.py (1499 of 2154)
PASS: lldb-unit :: Utility/./UtilityTests/VMRange.Comparison (1500 of 2154)
PASS: lldb-shell :: Process/TestEnvironment.test (1501 of 2154)
PASS: lldb-unit :: Expression/./ExpressionTests/CppModuleConfigurationTest.AmbiguousLibCpp (1502 of 2154)
PASS: lldb-api :: lang/cpp/typeof/TestTypeOfDeclTypeExpr.py (1503 of 2154)
PASS: lldb-shell :: SymbolFile/DWARF/array-sizes.s (1504 of 2154)
PASS: lldb-unit :: Process/gdb-remote/./ProcessGdbRemoteTests/GDBRemoteCommunicationTest.ReadPacket_checksum (1505 of 2154)
PASS: lldb-shell :: ObjectFile/MachO/lc_build_version.yaml (1506 of 2154)
PASS: lldb-unit :: Process/gdb-remote/./ProcessGdbRemoteTests/GDBRemoteCommunicationClientTest.WriteRegister (1507 of 2154)
PASS: lldb-unit :: Utility/./UtilityTests/ProcessInstanceInfo.Dump (1508 of 2154)
PASS: lldb-api :: commands/expression/dont_allow_jit/TestAllowJIT.py (1509 of 2154)
PASS: lldb-api :: python_api/class_members/TestSBTypeClassMembers.py (1510 of 2154)
PASS: lldb-api :: commands/expression/ir-interpreter-phi-nodes/TestIRInterpreterPHINodes.py (1511 of 2154)
PASS: lldb-unit :: Utility/./UtilityTests/NameMatchesTest.EndsWith (1512 of 2154)
PASS: lldb-unit :: Utility/./UtilityTests/UriParserTest.SchemeHostSeparator (1513 of 2154)
PASS: lldb-shell :: Expr/TestIRMemoryMap.test (1514 of 2154)
PASS: lldb-unit :: Utility/./UtilityTests/VMRange.Clear (1515 of 2154)
PASS: lldb-unit :: Host/./HostTests/HostInfoTest.GetAugmentedArchSpec (1516 of 2154)
PASS: lldb-shell :: SymbolFile/DWARF/debug_loc.s (1517 of 2154)
PASS: lldb-api :: lang/objc/modules-incomplete/TestIncompleteModules.py (1518 of 2154)
PASS: lldb-api :: commands/frame/select/TestFrameSelect.py (1519 of 2154)
PASS: lldb-api :: macosx/lc-note/kern-ver-str/TestKernVerStrLCNOTE.py (1520 of 2154)
PASS: lldb-api :: macosx/version_zero/TestGetVersionZeroVersion.py (1521 of 2154)
PASS: lldb-api :: lang/cpp/frame-var-anon-unions/TestFrameVariableAnonymousUnions.py (1522 of 2154)
PASS: lldb-api :: lang/objc/objc-ivar-protocols/TestIvarProtocols.py (1523 of 2154)
PASS: lldb-shell :: SymbolFile/symbol-binding.test (1524 of 2154)
PASS: lldb-api :: functionalities/data-formatter/data-formatter-stl/libcxx/multimap/TestDataFormatterLibccMultiMap.py (1525 of 2154)
PASS: lldb-unit :: Utility/./UtilityTests/StreamTest.PutHex32ByteOrderBig (1526 of 2154)
PASS: lldb-api :: lang/c/set_values/TestSetValues.py (1527 of 2154)
PASS: lldb-api :: tools/lldb-vscode/breakpoint/TestVSCode_setBreakpoints.py (1528 of 2154)
PASS: lldb-api :: lang/cpp/static_methods/TestCPPStaticMethods.py (1529 of 2154)
PASS: lldb-shell :: SymbolFile/DWARF/anon_class_w_and_wo_export_symbols.ll (1530 of 2154)
UNSUPPORTED: lldb-api :: benchmarks/startup/TestStartupDelays.py (1531 of 2154)
PASS: lldb-unit :: Interpreter/./InterpreterTests/CompletionTest.DirCompletionAbsolute (1532 of 2154)
PASS: lldb-api :: commands/expression/import-std-module/weak_ptr-dbg-info-content/TestDbgInfoContentWeakPtrFromStdModule.py (1533 of 2154)
PASS: lldb-unit :: Utility/./UtilityTests/StatusTest.ErrorConstructor (1534 of 2154)
UNSUPPORTED: lldb-api :: functionalities/data-formatter/data-formatter-stl/libstdcpp/string/TestDataFormatterStdString.py (1535 of 2154)
PASS: lldb-shell :: Register/x86-64-gp-read.test (1536 of 2154)
UNSUPPORTED: lldb-api :: functionalities/darwin_log/filter/exact_match/activity/TestDarwinLogFilterMatchActivity.py (1537 of 2154)
PASS: lldb-api :: python_api/interpreter/TestCommandInterpreterAPI.py (1538 of 2154)
PASS: lldb-unit :: Utility/./UtilityTests/SubsystemRAIITest.SubsystemWithErrorFailure (1539 of 2154)
PASS: lldb-unit :: Utility/./UtilityTests/PassiveReplayTest.InstrumentedFoo (1540 of 2154)
PASS: lldb-api :: lang/cpp/bitfields/TestCppBitfields.py (1541 of 2154)
PASS: lldb-unit :: Utility/./UtilityTests/GeneratorTest.Get (1542 of 2154)
PASS: lldb-unit :: Platform/./LLDBPlatformTests/PlatformDarwinTest.TestParseVersionBuildDir (1543 of 2154)
PASS: lldb-api :: commands/expression/save_jit_objects/TestSaveJITObjects.py (1544 of 2154)
PASS: lldb-unit :: Platform/./LLDBPlatformTests/PlatformAppleSimulatorTest.TestHostPlatformToSim (1545 of 2154)
PASS: lldb-unit :: Utility/./UtilityTests/StreamTest.Indent (1546 of 2154)
PASS: lldb-api :: functionalities/data-formatter/data-formatter-disabling/TestDataFormatterDisabling.py (1547 of 2154)
UNSUPPORTED: lldb-api :: functionalities/darwin_log/filter/regex/activity-chain/TestDarwinLogFilterRegexActivityChain.py (1548 of 2154)
UNSUPPORTED: lldb-shell :: ScriptInterpreter/Lua/lua.test (1549 of 2154)
PASS: lldb-unit :: DataFormatter/./LLDBFormatterTests/TypeMatcherTests.GetMatchStringRegex (1550 of 2154)
PASS: lldb-unit :: Utility/./UtilityTests/StringListTest.AppendStringMove (1551 of 2154)
PASS: lldb-unit :: Core/./LLDBCoreTests/ModuleSpecTest.InvalidInMemoryBuffer (1552 of 2154)
PASS: lldb-unit :: Utility/./UtilityTests/StringExtractorTest.GetHexBytesAvail_Partial (1553 of 2154)
PASS: lldb-unit :: Process/minidump/./LLDBMinidumpTests/RegisterContextMinidump.CheckRegisterContextMinidump_ARM (1554 of 2154)
PASS: lldb-api :: functionalities/gdb_remote_client/TestGDBRemoteDiskFileCompletion.py (1555 of 2154)
PASS: lldb-shell :: Reproducer/TestHomeDir.test (1556 of 2154)
PASS: lldb-api :: lang/objc/conflicting-definition/TestConflictingDefinition.py (1557 of 2154)
PASS: lldb-unit :: Target/./TargetTests/ModuleCacheTest.GetAndPut (1558 of 2154)
PASS: lldb-api :: commands/watchpoints/watchpoint_set_command/TestWatchLocationWithWatchSet.py (1559 of 2154)
PASS: lldb-unit :: Utility/./UtilityTests/Flags.AnySet (1560 of 2154)
PASS: lldb-unit :: Utility/./UtilityTests/BroadcasterTest.EventTypeHasListeners (1561 of 2154)
PASS: lldb-unit :: DataFormatter/./LLDBFormatterTests/TypeMatcherTests.CreatedBySameMatchString (1562 of 2154)
UNSUPPORTED: lldb-api :: tools/lldb-server/platform-process-connect/TestPlatformProcessConnect.py (1563 of 2154)
PASS: lldb-shell :: SymbolFile/DWARF/find-basic-namespace.cpp (1564 of 2154)
PASS: lldb-unit :: Utility/./UtilityTests/StringListTest.InsertStringAtIndexStdString (1565 of 2154)
UNSUPPORTED: lldb-api :: lang/objc/objc-dynamic-value/TestObjCDynamicValue.py (1566 of 2154)
PASS: lldb-unit :: Utility/./UtilityTests/VMRange.Ordering (1567 of 2154)
PASS: lldb-unit :: Utility/./UtilityTests/ScalarTest.Equality (1568 of 2154)
PASS: lldb-api :: commands/expression/import-std-module/unique_ptr/TestUniquePtrFromStdModule.py (1569 of 2154)
PASS: lldb-unit :: ScriptInterpreter/Python/./ScriptInterpreterPythonTests/PythonDataObjectsTest.TestExceptions (1570 of 2154)
PASS: lldb-unit :: Target/./TargetTests/PathMappingListTest.AbsoluteTests (1571 of 2154)
PASS: lldb-shell :: ScriptInterpreter/Python/sb_address_exception.test (1572 of 2154)
PASS: lldb-shell :: SymbolFile/DWARF/find-basic-function.cpp (1573 of 2154)
PASS: lldb-api :: commands/expression/import_builtin_fileid/TestImportBuiltinFileID.py (1574 of 2154)
PASS: lldb-api :: arm/emulation/TestEmulations.py (1575 of 2154)
PASS: lldb-unit :: Utility/./UtilityTests/UriParserTest.MinimalPortPath (1576 of 2154)
PASS: lldb-api :: functionalities/abbreviation/TestAbbreviations.py (1577 of 2154)
PASS: lldb-api :: types/TestIntegerType.py (1578 of 2154)
PASS: lldb-api :: lang/cpp/inlines/TestInlines.py (1579 of 2154)
PASS: lldb-api :: functionalities/wrong_commands/TestWrongCommands.py (1580 of 2154)
PASS: lldb-api :: lang/objc/modules/TestObjCModules.py (1581 of 2154)
PASS: lldb-api :: commands/source/info/TestSourceInfo.py (1582 of 2154)
PASS: lldb-api :: functionalities/data-formatter/data-formatter-stl/libcxx/queue/TestDataFormatterLibcxxQueue.py (1583 of 2154)
PASS: lldb-api :: functionalities/ubsan/basic/TestUbsanBasic.py (1584 of 2154)
PASS: lldb-api :: commands/watchpoints/watchpoint_commands/TestWatchpointCommands.py (1585 of 2154)
PASS: lldb-api :: functionalities/thread/concurrent_events/TestConcurrentSignalDelayWatch.py (1586 of 2154)
PASS: lldb-unit :: UnwindAssembly/x86/./UnwindAssemblyx86Tests/Testx86AssemblyInspectionEngine.TestPush0 (1587 of 2154)
PASS: lldb-shell :: SymbolFile/Breakpad/unwind-via-raSearch.test (1588 of 2154)
PASS: lldb-unit :: DataFormatter/./LLDBFormatterTests/TypeMatcherTests.GetMatchStringExactName (1589 of 2154)
PASS: lldb-unit :: SymbolFile/NativePDB/./SymbolFileNativePDBTests/PDBFPOProgramToDWARFExpressionTests.InvalidOpUnary (1590 of 2154)
PASS: lldb-unit :: Target/./TargetTests/ModuleCacheTest.GetAndPutStrangeHostname (1591 of 2154)
PASS: lldb-unit :: Utility/./UtilityTests/UriParserTest.BadPort2 (1592 of 2154)
PASS: lldb-api :: commands/expression/two-files/TestObjCTypeQueryFromOtherCompileUnit.py (1593 of 2154)
PASS: lldb-unit :: Utility/./UtilityTests/StreamTest.PutHex64ByteOrderLittle (1594 of 2154)
PASS: lldb-api :: commands/expression/scoped_enums/TestScopedEnumType.py (1595 of 2154)
PASS: lldb-unit :: Utility/./UtilityTests/RangeTest.DefaultConstructor (1596 of 2154)
PASS: lldb-unit :: Expression/./ExpressionTests/CppModuleConfigurationTest.LibCppV2 (1597 of 2154)
PASS: lldb-api :: functionalities/data-formatter/data-formatter-objc/cmtime/TestDataFormatterCMTime.py (1598 of 2154)
PASS: lldb-unit :: Language/Highlighting/./HighlighterTests/HighlighterTest.HighlighterSelectionPath (1599 of 2154)
PASS: lldb-api :: python_api/lldbutil/TestSwigVersion.py (1600 of 2154)
PASS: lldb-unit :: ScriptInterpreter/Python/./ScriptInterpreterPythonTests/PythonDataObjectsTest.TestCallable (1601 of 2154)
PASS: lldb-shell :: Commands/command-disassemble.s (1602 of 2154)
PASS: lldb-api :: lang/c/complex/TestComplexC99.py (1603 of 2154)
PASS: lldb-shell :: Minidump/dump-all.test (1604 of 2154)
PASS: lldb-api :: functionalities/data-formatter/var-in-aggregate-misuse/TestVarInAggregateMisuse.py (1605 of 2154)
PASS: lldb-unit :: Language/Highlighting/./HighlighterTests/HighlighterTest.ClangEmptyInput (1606 of 2154)
PASS: lldb-unit :: Core/./LLDBCoreTests/MangledTest.ResultForBlockInvocation (1607 of 2154)
XFAIL: lldb-shell :: Unwind/prefer-debug-over-eh-frame.test (1608 of 2154)
PASS: lldb-shell :: ObjectFile/ELF/section-types.yaml (1609 of 2154)
PASS: lldb-api :: commands/expression/invalid-args/TestInvalidArgsExpression.py (1610 of 2154)
PASS: lldb-api :: functionalities/thread/create_after_attach/TestCreateAfterAttach.py (1611 of 2154)
PASS: lldb-unit :: UnwindAssembly/x86/./UnwindAssemblyx86Tests/Testx86AssemblyInspectionEngine.TestPopRBPWithREX (1612 of 2154)
PASS: lldb-api :: functionalities/tail_call_frames/cross_object/TestCrossObjectTailCalls.py (1613 of 2154)
PASS: lldb-unit :: Signals/./SignalsTests/UnixSignalsTest.Iteration (1614 of 2154)
PASS: lldb-api :: functionalities/set-data/TestSetData.py (1615 of 2154)
PASS: lldb-api :: functionalities/thread/concurrent_events/TestConcurrentNWatchNBreak.py (1616 of 2154)
PASS: lldb-unit :: Utility/./UtilityTests/BinaryStreamTest.PutULEB128SixBytes (1617 of 2154)
PASS: lldb-api :: functionalities/inline-stepping/TestInlineStepping.py (1618 of 2154)
PASS: lldb-api :: tools/lldb-vscode/breakpoint-events/TestVSCode_breakpointEvents.py (1619 of 2154)
PASS: lldb-unit :: Utility/./UtilityTests/StringExtractorTest.InitEmpty (1620 of 2154)
PASS: lldb-unit :: Utility/./UtilityTests/ReproducerTest.SetCapture (1621 of 2154)
PASS: lldb-unit :: Process/./ProcessEventDataTests/ProcessEventDataTest.ShouldStop (1622 of 2154)
PASS: lldb-unit :: Utility/./UtilityTests/OptionsWithRawTest.SingleWordSuffix (1623 of 2154)
PASS: lldb-unit :: Utility/./UtilityTests/StreamTest.ChangingByteOrder (1624 of 2154)
UNSUPPORTED: lldb-api :: tools/intel-features/intel-pt/test/TestIntelPTSimpleBinary.py (1625 of 2154)
PASS: lldb-shell :: Reproducer/Modules/TestModuleCXX.test (1626 of 2154)
PASS: lldb-unit :: UnwindAssembly/x86/./UnwindAssemblyx86Tests/Testx86AssemblyInspectionEngine.TestPushEAX (1627 of 2154)
PASS: lldb-api :: lang/c/complex_int/TestComplexInt.py (1628 of 2154)
PASS: lldb-unit :: Utility/./UtilityTests/FileSpecTest.FileAndDirectoryComponents (1629 of 2154)
PASS: lldb-unit :: Utility/./UtilityTests/XcodeSDKTest.SDKSupportsSwift (1630 of 2154)
PASS: lldb-api :: commands/expression/import-std-module/vector-bool/TestVectorBoolFromStdModule.py (1631 of 2154)
PASS: lldb-unit :: Utility/./UtilityTests/RangeTest.DoesAdjoinOrIntersect (1632 of 2154)
PASS: lldb-unit :: Utility/./UtilityTests/StreamTest.SetIndentLevel (1633 of 2154)
PASS: lldb-unit :: Symbol/./SymbolTests/TestClangASTImporter.DeportDeclTagDecl (1634 of 2154)
UNSUPPORTED: lldb-api :: tools/lldb-server/TestGdbRemoteModuleInfo.py (1635 of 2154)
PASS: lldb-unit :: SymbolFile/DWARF/./SymbolFileDWARFTests/DWARFASTParserClangTests.EnsureAllDIEsInDeclContextHaveBeenParsedParsesOnlyMatchingEntries (1636 of 2154)
PASS: lldb-shell :: SymbolFile/DWARF/deterministic-build.cpp (1637 of 2154)
UNSUPPORTED: lldb-api :: functionalities/process_save_core/TestProcessSaveCore.py (1638 of 2154)
PASS: lldb-unit :: Utility/./UtilityTests/StringExtractorTest.GetHexBytes_OddPair2 (1639 of 2154)
UNSUPPORTED: lldb-api :: lang/cpp/static_members/TestCPPStaticMembers.py (1640 of 2154)
PASS: lldb-api :: commands/apropos/basic/TestApropos.py (1641 of 2154)
PASS: lldb-unit :: Utility/./UtilityTests/StreamTest.PutNHex8 (1642 of 2154)
PASS: lldb-unit :: Utility/./UtilityTests/StreamTeeTest.GetStreamAtIndexOutOfBounds (1643 of 2154)
PASS: lldb-unit :: Utility/./UtilityTests/StreamTest.AddressPrefix (1644 of 2154)
PASS: lldb-unit :: Utility/./UtilityTests/ArchSpecTest.TestSetTriple (1645 of 2154)
UNSUPPORTED: lldb-api :: commands/expression/completion-crash-invalid-iterator/TestInvalidIteratorCompletionCrash.py (1646 of 2154)
PASS: lldb-api :: macosx/find-dsym/bundle-with-dot-in-filename/TestBundleWithDotInFilename.py (1647 of 2154)
PASS: lldb-unit :: Utility/./UtilityTests/StringExtractorTest.GetHexBytes (1648 of 2154)
UNSUPPORTED: lldb-api :: functionalities/breakpoint/hardware_breakpoints/hardware_breakpoint_on_multiple_threads/TestHWBreakMultiThread.py (1649 of 2154)
PASS: lldb-api :: tools/lldb-server/TestGdbRemoteExitCode.py (1650 of 2154)
PASS: lldb-shell :: Reproducer/TestMultipleTargets.test (1651 of 2154)
PASS: lldb-shell :: Commands/command-target-modules-dump-sections.yaml (1652 of 2154)
PASS: lldb-api :: functionalities/data-formatter/data-formatter-stl/libcxx/unique_ptr/TestDataFormatterLibcxxUniquePtr.py (1653 of 2154)
PASS: lldb-unit :: Utility/./UtilityTests/StringExtractorTest.GetHexBytes_OddPair (1654 of 2154)
PASS: lldb-shell :: SymbolFile/Breakpad/line-table-missing-file.test (1655 of 2154)
PASS: lldb-api :: functionalities/inferior-crashing/recursive-inferior/TestRecursiveInferiorStep.py (1656 of 2154)
PASS: lldb-api :: python_api/get-value-32bit-int/TestGetValue32BitInt.py (1657 of 2154)
PASS: lldb-api :: lang/objc/objc-dyn-sbtype/TestObjCDynamicSBType.py (1658 of 2154)
PASS: lldb-shell :: SymbolFile/NativePDB/function-types-calling-conv.cpp (1659 of 2154)
PASS: lldb-shell :: Reproducer/TestVersionCheck.test (1660 of 2154)
PASS: lldb-api :: lang/objc/objc-new-syntax/TestObjCNewSyntaxLiteral.py (1661 of 2154)
PASS: lldb-api :: functionalities/data-formatter/ptr_ref_typedef/TestPtrRef2Typedef.py (1662 of 2154)
PASS: lldb-unit :: Utility/./UtilityTests/StreamTest.PutCStringWithStringRef (1663 of 2154)
UNSUPPORTED: lldb-shell :: ObjectFile/ELF/minidebuginfo-no-lzma.yaml (1664 of 2154)
PASS: lldb-unit :: Expression/./ExpressionTests/DiagnosticManagerTest.PutString (1665 of 2154)
PASS: lldb-shell :: SymbolFile/Breakpad/symtab-macho.test (1666 of 2154)
PASS: lldb-unit :: Utility/./UtilityTests/StringListTest.Join (1667 of 2154)
PASS: lldb-api :: functionalities/thread/concurrent_events/TestConcurrentDelayedCrashWithBreakpointWatchpoint.py (1668 of 2154)
PASS: lldb-shell :: Quit/TestQuitExitCode-30.test (1669 of 2154)
PASS: lldb-api :: lang/c/anonymous/TestAnonymous.py (1670 of 2154)
PASS: lldb-api :: functionalities/thread/concurrent_events/TestConcurrentTwoBreakpointThreads.py (1671 of 2154)
PASS: lldb-api :: functionalities/breakpoint/breakpoint_command/TestBreakpointCommandsFromPython.py (1672 of 2154)
PASS: lldb-unit :: Utility/./UtilityTests/ScalarTest.APIntConstructor (1673 of 2154)
PASS: lldb-api :: lang/c/step_over_no_deadlock/TestStepOverDoesntBlock.py (1674 of 2154)
PASS: lldb-unit :: Utility/./UtilityTests/StringExtractorTest.GetHexBytes_Underflow (1675 of 2154)
PASS: lldb-unit :: Utility/./UtilityTests/StreamTest.PutBytesAsRawHex8ToMixedEndian (1676 of 2154)
PASS: lldb-unit :: Utility/./UtilityTests/ArchSpecTest.TestParseMachCPUDashSubtypeTripleSimple (1677 of 2154)
PASS: lldb-api :: types/TestIntegerTypeExpr.py (1678 of 2154)
PASS: lldb-api :: lang/c/strings/TestCStrings.py (1679 of 2154)
PASS: lldb-api :: commands/watchpoints/watchpoint_count/TestWatchpointCount.py (1680 of 2154)
PASS: lldb-api :: functionalities/thread/concurrent_events/TestConcurrentCrashWithWatchpointBreakpointSignal.py (1681 of 2154)
PASS: lldb-api :: lang/c/step-target/TestStepTarget.py (1682 of 2154)
PASS: lldb-unit :: Utility/./UtilityTests/OptionsWithRawTest.TerminatedQuote (1683 of 2154)
PASS: lldb-unit :: ScriptInterpreter/Python/./ScriptInterpreterPythonTests/PythonDataObjectsTest.TestInstanceNameResolutionNoDot (1684 of 2154)
PASS: lldb-unit :: DataFormatter/./LLDBFormatterTests/TypeMatcherTests.RegexName (1685 of 2154)
PASS: lldb-unit :: Utility/./UtilityTests/StringExtractorTest.GetHexU8_InvalidHex (1686 of 2154)
PASS: lldb-unit :: UnwindAssembly/x86/./UnwindAssemblyx86Tests/Testx86AssemblyInspectionEngine.TestPushEDX (1687 of 2154)
PASS: lldb-shell :: Register/x86-64-read.test (1688 of 2154)
PASS: lldb-api :: tools/lldb-vscode/step/TestVSCode_step.py (1689 of 2154)
PASS: lldb-unit :: UnwindAssembly/x86/./UnwindAssemblyx86Tests/Testx86AssemblyInspectionEngine.TestSimple32bitFrameFunction (1690 of 2154)
PASS: lldb-unit :: UnwindAssembly/x86/./UnwindAssemblyx86Tests/Testx86AssemblyInspectionEngine.TestPopRBX (1691 of 2154)
PASS: lldb-unit :: SymbolFile/NativePDB/./SymbolFileNativePDBTests/PDBFPOProgramToDWARFExpressionTests.MultipleIndependentAssignments (1692 of 2154)
PASS: lldb-unit :: ScriptInterpreter/Python/./ScriptInterpreterPythonTests/PythonDataObjectsTest.TestPythonString (1693 of 2154)
PASS: lldb-api :: lang/c/bitfields/TestBitfields.py (1694 of 2154)
PASS: lldb-unit :: Host/./HostTests/SocketTest.TCPGetConnectURI (1695 of 2154)
PASS: lldb-api :: commands/watchpoints/watchpoint_commands/command/TestWatchpointCommandLLDB.py (1696 of 2154)
PASS: lldb-api :: functionalities/optimized_code/TestNoASanExceptionAfterEvalOP_piece.py (1697 of 2154)
PASS: lldb-unit :: Symbol/./SymbolTests/PostfixExpression.ToDWARF (1698 of 2154)
PASS: lldb-api :: lang/cpp/rvalue-references/TestRvalueReferences.py (1699 of 2154)
PASS: lldb-shell :: SymbolFile/dissassemble-entry-point.s (1700 of 2154)
PASS: lldb-api :: assert_messages_test/TestAssertMessages.py (1701 of 2154)
PASS: lldb-api :: types/TestFloatTypes.py (1702 of 2154)
PASS: lldb-unit :: Utility/./UtilityTests/OptionsWithRawTest.EmptySuffix (1703 of 2154)
UNSUPPORTED: lldb-api :: functionalities/data-formatter/data-formatter-stl/libstdcpp/vector/TestDataFormatterStdVector.py (1704 of 2154)
PASS: lldb-unit :: Utility/./UtilityTests/FileSpecTest.GuessPathStyle (1705 of 2154)
PASS: lldb-unit :: Utility/./UtilityTests/UriParserTest.Empty (1706 of 2154)
PASS: lldb-unit :: API/./APITests/SBCommandInterpreterTest.MultiWordCommand (1707 of 2154)
PASS: lldb-api :: functionalities/breakpoint/global_constructor/TestBreakpointInGlobalConstructor.py (1708 of 2154)
PASS: lldb-api :: commands/frame/diagnose/local-variable/TestLocalVariable.py (1709 of 2154)
PASS: lldb-api :: python_api/lldbutil/iter/TestRegistersIterator.py (1710 of 2154)
PASS: lldb-api :: macosx/thread-names/TestInterruptThreadNames.py (1711 of 2154)
UNSUPPORTED: lldb-api :: tools/lldb-server/thread-name/TestGdbRemoteThreadName.py (1712 of 2154)
PASS: lldb-shell :: Driver/TestProcessAttach.test (1713 of 2154)
PASS: lldb-api :: functionalities/thread/concurrent_events/TestConcurrentSignalNWatchNBreak.py (1714 of 2154)
PASS: lldb-unit :: Process/minidump/./LLDBMinidumpTests/MinidumpParserTest.GetThreadsAndGetThreadContext (1715 of 2154)
PASS: lldb-shell :: Quit/TestQuitExitCodeHexA.test (1716 of 2154)
PASS: lldb-shell :: ObjectFile/ELF/avr-basic-info.yaml (1717 of 2154)
PASS: lldb-unit :: Utility/./UtilityTests/RecordReplayTest.InstrumentedFooSameThis (1718 of 2154)
PASS: lldb-api :: functionalities/inferior-assert/TestInferiorAssert.py (1719 of 2154)
PASS: lldb-unit :: Utility/./UtilityTests/FileSpecTest.IsRelative (1720 of 2154)
PASS: lldb-unit :: Process/gdb-remote/./ProcessGdbRemoteTests/GDBRemoteCommunicationClientTest.GetQOffsets (1721 of 2154)
PASS: lldb-unit :: Utility/./UtilityTests/StringListTest.LongestCommonPrefix (1722 of 2154)
PASS: lldb-api :: lang/cpp/dynamic-value/TestCppValueCast.py (1723 of 2154)
PASS: lldb-api :: lang/cpp/unsigned_types/TestUnsignedTypes.py (1724 of 2154)
PASS: lldb-api :: functionalities/breakpoint/breakpoint_hit_count/TestBreakpointHitCount.py (1725 of 2154)
PASS: lldb-shell :: Driver/TestError.test (1726 of 2154)
PASS: lldb-api :: commands/expression/completion-crash-incomplete-record/TestCompletionCrashIncompleteRecord.py (1727 of 2154)
PASS: lldb-api :: types/TestFloatTypesExpr.py (1728 of 2154)
PASS: lldb-api :: lang/objc/direct-dispatch-step/TestObjCDirectDispatchStepping.py (1729 of 2154)
PASS: lldb-shell :: ObjectFile/ELF/compressed-sections.yaml (1730 of 2154)
PASS: lldb-shell :: Unwind/trap_frame_sym_ctx.test (1731 of 2154)
PASS: lldb-unit :: Symbol/./SymbolTests/LineEntryTest.GetSameLineContiguousAddressRangeNestedInline (1732 of 2154)
PASS: lldb-unit :: Symbol/./SymbolTests/TestTypeSystemClang.TestUnifyAccessSpecifiers (1733 of 2154)
PASS: lldb-unit :: Utility/./UtilityTests/StreamTest.ShiftOperatorChars (1734 of 2154)
PASS: lldb-api :: sample_test/TestSampleTest.py (1735 of 2154)
PASS: lldb-api :: functionalities/thread/concurrent_events/TestConcurrentTwoWatchpointsOneSignal.py (1736 of 2154)
PASS: lldb-unit :: ScriptInterpreter/Python/./ScriptInterpreterPythonTests/PythonDataObjectsTest.TestPythonListManipulation (1737 of 2154)
UNSUPPORTED: lldb-shell :: SymbolFile/PDB/calling-conventions.test (1738 of 2154)
PASS: lldb-unit :: Symbol/./SymbolTests/LineEntryTest.GetSameLineContiguousAddressRangeOneInline (1739 of 2154)
PASS: lldb-api :: commands/expression/result_numbering/TestResultNumbering.py (1740 of 2154)
PASS: lldb-api :: functionalities/thread/exit_during_break/TestExitDuringBreak.py (1741 of 2154)
UNSUPPORTED: lldb-shell :: ScriptInterpreter/Lua/command_script_import.test (1742 of 2154)
UNSUPPORTED: lldb-api :: tools/lldb-vscode/disconnect/TestVSCode_disconnect.py (1743 of 2154)
PASS: lldb-api :: functionalities/breakpoint/inlined_breakpoints/TestInlinedBreakpoints.py (1744 of 2154)
PASS: lldb-api :: functionalities/data-formatter/format-propagation/TestFormatPropagation.py (1745 of 2154)
PASS: lldb-unit :: Host/./HostTests/SocketTest.DomainListenConnectAccept (1746 of 2154)
PASS: lldb-unit :: Process/./ProcessEventDataTests/ProcessEventDataTest.DoOnRemoval (1747 of 2154)
PASS: lldb-unit :: Core/./LLDBCoreTests/ModuleSpecTest.TestELFFile (1748 of 2154)
PASS: lldb-unit :: Utility/./UtilityTests/StringExtractorTest.GetHexBytesAvail_OddPair (1749 of 2154)
PASS: lldb-api :: functionalities/data-formatter/data-formatter-stl/libcxx/iterator/TestDataFormatterLibccIterator.py (1750 of 2154)
PASS: lldb-unit :: Utility/./UtilityTests/StringLexerTest.Next (1751 of 2154)
PASS: lldb-api :: commands/expression/expr-in-syscall/TestExpressionInSyscall.py (1752 of 2154)
PASS: lldb-unit :: Utility/./UtilityTests/RegisterValueTest.GetSet8 (1753 of 2154)
PASS: lldb-api :: functionalities/thread/concurrent_events/TestConcurrentSignalWatchBreak.py (1754 of 2154)
UNSUPPORTED: lldb-api :: functionalities/darwin_log/filter/exact_match/activity-chain/TestDarwinLogFilterMatchActivityChain.py (1755 of 2154)
PASS: lldb-api :: python_api/module_section/TestModuleAndSection.py (1756 of 2154)
PASS: lldb-api :: commands/expression/multiline-navigation/TestMultilineNavigation.py (1757 of 2154)
PASS: lldb-unit :: API/./APITests/SBCommandInterpreterTest.SingleWordCommand (1758 of 2154)
PASS: lldb-unit :: UnwindAssembly/x86/./UnwindAssemblyx86Tests/Testx86AssemblyInspectionEngine.TestPushRBX (1759 of 2154)
PASS: lldb-api :: lang/cpp/breakpoint-commands/TestCPPBreakpointCommands.py (1760 of 2154)
PASS: lldb-unit :: Thread/./ThreadTests/ThreadTest.SetStopInfo (1761 of 2154)
PASS: lldb-api :: functionalities/thread/concurrent_events/TestConcurrentManyWatchpoints.py (1762 of 2154)
PASS: lldb-shell :: SymbolFile/DWARF/DW_TAG_variable-DW_AT_const_value.s (1763 of 2154)
PASS: lldb-unit :: Utility/./UtilityTests/StringLexerTest.AdvanceIf (1764 of 2154)
PASS: lldb-api :: functionalities/deleted-executable/TestDeletedExecutable.py (1765 of 2154)
PASS: lldb-unit :: Utility/./UtilityTests/TimerTest.CategoryTimesNested (1766 of 2154)
PASS: lldb-api :: functionalities/gdb_remote_client/TestWasm.py (1767 of 2154)
PASS: lldb-unit :: Utility/./UtilityTests/TimerTest.CategoryTimesStats (1768 of 2154)
PASS: lldb-api :: python_api/process/read-mem-cstring/TestReadMemCString.py (1769 of 2154)
PASS: lldb-unit :: Language/Highlighting/./HighlighterTests/HighlighterTest.ClangCursorPos (1770 of 2154)
PASS: lldb-unit :: ScriptInterpreter/Python/./ScriptInterpreterPythonTests/PythonDataObjectsTest.TestBorrowedReferences (1771 of 2154)
PASS: lldb-unit :: SymbolFile/NativePDB/./SymbolFileNativePDBTests/PDBFPOProgramToDWARFExpressionTests.InvalidAssignmentSingle (1772 of 2154)
PASS: lldb-unit :: DataFormatter/./LLDBFormatterTests/StringPrinterTests.CxxASCII (1773 of 2154)
PASS: lldb-unit :: Utility/./UtilityTests/ProcessInstanceInfo.Yaml (1774 of 2154)
PASS: lldb-shell :: Breakpoint/debug_rnglist_offset_pair.test (1775 of 2154)
PASS: lldb-api :: functionalities/breakpoint/objc/TestObjCBreakpoints.py (1776 of 2154)
PASS: lldb-shell :: Driver/TestSingleQuote.test (1777 of 2154)
PASS: lldb-unit :: Target/./TargetTests/PathMappingListTest.RemapRoot (1778 of 2154)
UNSUPPORTED: lldb-shell :: ScriptInterpreter/Lua/watchpoint_callback.test (1779 of 2154)
PASS: lldb-unit :: Process/gdb-remote/./ProcessGdbRemoteTests/GDBRemoteCommunicationClientTest.SendGetMetaDataPacket (1780 of 2154)
PASS: lldb-unit :: Utility/./UtilityTests/StringExtractorTest.GetU64LittleEndian (1781 of 2154)
PASS: lldb-unit :: Utility/./UtilityTests/UriParserTest.Minimal (1782 of 2154)
PASS: lldb-unit :: Utility/./UtilityTests/StringListTest.GetMaxStringLengthDecreasingSize (1783 of 2154)
PASS: lldb-api :: iohandler/resize/TestIOHandlerResizeNoEditline.py (1784 of 2154)
PASS: lldb-unit :: Utility/./UtilityTests/FileSpecTest.EqualDotsWindows (1785 of 2154)
PASS: lldb-unit :: Utility/./UtilityTests/Flags.Reset (1786 of 2154)
PASS: lldb-unit :: Utility/./UtilityTests/AnsiTerminal.Incomplete (1787 of 2154)
PASS: lldb-unit :: Process/minidump/./LLDBMinidumpTests/MinidumpParserTest.MinidumpDuplicateModuleSeparateCode (1788 of 2154)
PASS: lldb-api :: functionalities/data-formatter/data-formatter-categories/TestDataFormatterCategories.py (1789 of 2154)
PASS: lldb-shell :: SymbolFile/DWARF/DW_OP_piece-struct.s (1790 of 2154)
PASS: lldb-api :: lang/c/shared_lib_stripped_symbols/TestSharedLibStrippedSymbols.py (1791 of 2154)
PASS: lldb-shell :: Reproducer/TestProcessList.test (1792 of 2154)
PASS: lldb-api :: functionalities/backticks/TestBackticksWithoutATarget.py (1793 of 2154)
PASS: lldb-unit :: Utility/./UtilityTests/ProcessInstanceInfo.DumpTable_invalidUID (1794 of 2154)
PASS: lldb-api :: lang/objc/objc-super/TestObjCSuper.py (1795 of 2154)
UNSUPPORTED: lldb-api :: commands/register/register/intel_xtended_registers/mpx_offset_intersection/TestMPXOffsetIntersection.py (1796 of 2154)
PASS: lldb-api :: commands/watchpoints/watchpoint_size/TestWatchpointSizes.py (1797 of 2154)
FAIL: lldb-api :: commands/gui/basicdebug/TestGuiBasicDebug.py (1798 of 2154)
******************** TEST 'lldb-api :: commands/gui/basicdebug/TestGuiBasicDebug.py' FAILED ********************
Script:
--
/usr/local/Frameworks/Python.framework/Versions/3.7/bin/python3.7 /Users/buildslave/jenkins/workspace/lldb-cmake/llvm-project/lldb/test/API/dotest.py -S nm -u CXXFLAGS -u CFLAGS --codesign-identity - --arch x86_64 --build-dir /Users/buildslave/jenkins/workspace/lldb-cmake/lldb-build/lldb-test-build.noindex -s=/Users/buildslave/jenkins/workspace/lldb-cmake/test/logs -t --env TERM=vt100 --env LLVM_LIBS_DIR=/Users/buildslave/jenkins/workspace/lldb-cmake/lldb-build/./lib --arch x86_64 --build-dir /Users/buildslave/jenkins/workspace/lldb-cmake/lldb-build/lldb-test-build.noindex -s /Users/buildslave/jenkins/workspace/lldb-cmake/lldb-build/lldb-test-traces --lldb-module-cache-dir /Users/buildslave/jenkins/workspace/lldb-cmake/lldb-build/lldb-test-build.noindex/module-cache-lldb/lldb-api --clang-module-cache-dir /Users/buildslave/jenkins/workspace/lldb-cmake/lldb-build/lldb-test-build.noindex/module-cache-clang/lldb-api --executable /Users/buildslave/jenkins/workspace/lldb-cmake/lldb-build/./bin/lldb --compiler /Users/buildslave/jenkins/workspace/lldb-cmake/lldb-build/./bin/clang --dsymutil /Users/buildslave/jenkins/workspace/lldb-cmake/lldb-build/./bin/dsymutil --filecheck /Users/buildslave/jenkins/workspace/lldb-cmake/lldb-build/./bin/FileCheck --yaml2obj /Users/buildslave/jenkins/workspace/lldb-cmake/lldb-build/./bin/yaml2obj --server /Users/buildslave/jenkins/workspace/lldb-cmake/lldb-build/./bin/debugserver --lldb-libs-dir /Users/buildslave/jenkins/workspace/lldb-cmake/lldb-build/./lib /Users/buildslave/jenkins/workspace/lldb-cmake/llvm-project/lldb/test/API/commands/gui/basicdebug -p TestGuiBasicDebug.py
--
Exit Code: 1

Hide Details

Command Output (stdout): -- lldb version 12.0.99 clang revision 2ef73025afda6481625b74eb99cdbc2eb1cfef95 llvm revision 2ef73025afda6481625b74eb99cdbc2eb1cfef95 (lldb) settings clear -all (lldb) settings set symbols.enable-external-lookup false (lldb) settings set target.inherit-tcc true (lldb) settings set target.auto-apply-fixits false (lldb) settings set plugin.process.gdb-remote.packet-timeout 60 (lldb) settings set symbols.clang-modules-cache-path "/Users/buildslave/jenkins/workspace/lldb-cmake/lldb-build/lldb-test-build.noindex/module-cache-lldb/lldb-api" (lldb) settings set use-color false (lldb) setting set target.prefer-dynamic-value no-dynamic-values (lldb) target create "/Users/buildslave/jenkins/workspace/lldb-cmake/lldb-build/lldb-test-build.noindex/commands/gui/basicdebug/TestGuiBasicDebug.test_gui/a.out" Current executable set to '/Users/buildslave/jenkins/workspace/lldb-cmake/lldb-build/lldb-test-build.noindex/commands/gui/basicdebug/TestGuiBasicDebug.test_gui/a.out' (x86_64). (lldb) br set -f main.c -p "// Break here" br set -f main.c -p "// Break here" Breakpoint 1: where = a.out`main + 22 at main.c:4:3, address = 0x0000000100000f86 (lldb) run run Process 88280 launched: '/Users/buildslave/jenkins/workspace/lldb-cmake/lldb-build/lldb-test-build.noindex/commands/gui/basicdebug/TestGuiBasicDebug.test_gui/a.out' (x86_64) Process 88280 stopped * thread #1, queue = 'com.apple.main-thread', stop reason = breakpoint 1.1 frame #0: 0x0000000100000f86 a.out`main(argc=1, argv=0x00007ffeefbff898) at main.c:4:3 1 extern int func(); 2 3 int main(int argc, char **argv) { -> 4 func(); // Break here ^ 5 func(); // Second 6 return 0; 7 } (lldb) gui sgui (B)0[?7h[?1h=| LLDB (F1) | Target (F2) | Process (F3) | Thread (F4) | View (F5) | Help (F6) | lqq<Sources>qqqqqqqqqqqqqqqqqqqqqqqqqqqqqqqqqqqqqqqqqqqqqqqqqqqqqqqqqqqqqqqqqqqqqqqqqqqqqqqqqqqqqqqqqqqqqqqqqqqqqqqqqqqqqqqqqqqqqqqqqqqqqqqqqqqqqqqqqqqqqqqqqqqqqqqqqqqqqqqqqqqqqqqqqqqqqqqqqqqqqqqqqqqqqqqqqqqqqqqqqqqqqqqqqqqqqqqqqqqqqqqqqqqqqqqqqqqqqqqqqqqqqqqqqqqqqqqqqqqqqqqqqqqqqqqqqqqqqqqqqqqqqqqqqqqqqqqqqqqqqqqqqqqqqqqqqqqqqqqqqqqqqqqqqqqqqqqqqqqqqqqqqqqqqqqqqqqqqqqqqqqqqqqqqqqqqqqqqqqqqqqqqqqklqq<Threads>qqqqqqqqqqqqqqqqqqqqqqqqqqqqqqqqqqqqqqqqqqqqqqqqqqqqqqqqqqqqqqqqqqqqqqqqqqqqqqqqqqqqqqqkx a.out`main xx `qprocess 88280xx 1 x extern int func();xxxx 2 xxxxx 3 x int main(int argc, char **argv) {xxxx 4 x` func(); // Break here <<< Thread 1: breakpoint 1.1xxxx 5 x func(); // Secondxxxx 6 x return 0;xxxx 7 x }xxxx 8 xxxxxxxxxxxxxxxxxxxxxxxxxxxxxxxxxxxxxxxxxxxxxxxxxxxxxxxxxxxxxxxxxxxxxxxxxxxxxxxxxxxxxxxxxxxxxxxxxxxxxxxxxxxxxxxxxxxxxxxxxxxxxlqq<Help>qqqqqqqqqqqqqqqqqqqqqqqqqqqqqqqqqqqqqqqqqqqqqqqqqqqqqqqqqqqqqqqqqqqqqqqqqqqqqqqkxxxxx Welcome to the LLDB curses GUI.xxxxxxxxxxxx Press the TAB key to change the selected view.xxxxxx Each view has its own keyboard shortcuts, press 'h' to open a dialog to display them. xxxxxxxxxxxx Common key bindings for all views:xxxxxxxxxxxxtab - Select next viewxxxxxx back-tab key - Select previous viewxxxxxxh - Show help dialog with view specific key bindingsxxxxxx, - Page upxxxxxx. - Page downxxxxxxup - Select previousxxxxxxdown - Select nextxxxxxxleft - Unexpand or select parentxxxxxxright - Expandxxxxxx page-up - Page upxxxxxx page-down - Page downxxxxxmqqqqqqqqqqqqqqqqqqqqqqqqqqqqqqqqqqqqqqqqqqqqqqqqqqqqqqqqqqqqqq[Press any key to exit]qqjxxxxxxxxxxxxxxxxxxxxxxxxxxxxxxxmqqqqqqqqqqqqqqqqqqqqqqqqqqqqqqqqqqqqqqqqqqqqqqqqqqqqqqqqqqqqqqqqqqqqqqqqqqqqqqqqqqqqqqqqqqqqqqqqqqqqqqqqqqqqqqqqqqqqqqqqqqqqqqqqqqqqqqqqqqqqqqqqqqqqqqqqqqqqqqqqqqqqqqqqqqqqqqqqqqqqqqqqqqqqqqqqqqqqqqqqqqqqqqqqqqqqqqqqqqqqqqqqqqqqqqqqqqqqqqqqqqqqqqqqqqqqqqqqqqqqqqqqqqqqqqqqqqqqqqqqqqqqqqqqqqqqqqqqqqqqqqqqqqqqqqqqqqqqqqqqqqqqqqqqqqqqqqqqqqqqqqqqqqqqqqqqqqqqqqqqqqqqqqqqqqqqqqqqqqqqqqqqqqqqqqqqqqqqqqjxxlqq<Variables>qqqqqqqqqqqqqqqqqqqqqqqqqqqqqqqqqqqqqqqqqqqqqqqqqqqqqqqqqqqqqqqqqqqqqqqqqqqqqqqqqqqqqqqqqqqqqqqqqqqqqqqqqqqqqqqqqqqqqqqqqqqqqqqqqqqqqqqqqqqqqqqqqqqqqqqqqqqqqqqqqqqqqqqqqqqqqqqqqqqqqqqqqqqqqqqqqqqqqqqqqqqqqqqqqqqqqqqqqqqqqqqqqqqqqqqqqqqqqqqqqqqqqqqqqqqqqqqqqqqqqqqqqqqqqqqqqqqqqqqqqqqqqqqqqqqqqqqqqqqqqqqqqqqqqqqqqqqqqqqqqqqqqqqqqqqqqqqqqqqqqqqqqqqqqqqqqqqqqqqqqqqqqqqqqqqqqqqqqqqqqqqqqkxxx (int) argc = 1xxxx `q(char **) argv = 0x00007ffeefbff898xxxxxxxxxxxxxxxxxxxxxxxxxxxxxxxxxxxxxxxxxxxxxxxxxxxxxxxxxxxxxxxxxxxxxxxxxxxxxxxxxxxxxxxxxxxxxxxxxxxxxxxxxxxmqqqqqqqqqqqqqqqqqqqqqqqqqqqqqqqqqqqqqqqqqqqqqqqqqqqqqqqqqqqqqqqqqqqqqqqqqqqqqqqqqqqqqqqqqqqqqqqqqqqqqqqqqqqqqqqqqqqqqqqqqqqqqqqqqqqqqqqqqqqqqqqqqqqqqqqqqqqqqqqqqqqqqqqqqqqqqqqqqqqqqqqqqqqqqqqqqqqqqqqqqqqqqqqqqqqqqqqqqqqqqqqqqqqqqqqqqqqqqqqqqqqqqqqqqqqqqqqqqqqqqqqqqqqqqqqqqqqqqqqqqqqqqqqqqqqqqqqqqqqqqqqqqqqqqqqqqqqqqqqqqqqqqqqqqqqqqqqqqqqqqqqqqqqqqqqqqqqqqqqqqqqqqqqqqqqqqqqqqqqqqqqqqqqqqqqqqqqqqqjmqqqqqqqqqqqqqqqqqqqqqqqqqqqqqqqqqqqqqqqqqqqqqqqqqqqqqqqqqqqqqqqqqqqqqqqqqqqqqqqqqqqqqqqqqqqqqqqqqqjProcess: 88280 stopped Thread: 0x684a4d Frame: 0 PC = 0x0000000100000f86 lqq<Sources>qqqqqqqqqqqqqqqqqqqqqqqqqqqqqqqqqqqqqqqqqqqqqqqqqqqqqqqqqqqqqqqqqqqqqqqqqqqqqqqqqqqqqqqqqqqqqqqqqqqqqqqqqqqqqqqqqqqqqqqqqqqqqqqqqqqqqqqqqqqqqqqqqqqqqqqqqqqqqqqqqqqqqqqqqqqqqqqqqqqqqqqqqqqqqqqqqqqqqqqqqqqqqqqqqqqqqqqqqqqqqqqqqqqqqqqqqqqqqqqqqqqqqqqqqqqqqqqqqqqqqqqqqqqqqqqqqqqqqqqqqqqqqqqqqqqqqqqqqqqqqqqqqqqqqqqqqqqqqqqqqqqqqqqqqqqqqqqqqqqqqqqqqqqqqqqqqqqqqqqqqqqqqqqqqqqqqqqqqqqqqqqqqqqk xx xx xx xx xx xx xx xx xx xx xx xx xx xx xx xx xx xx xx xx xx xx xx xx xx xx xx xx xx xx xx xx xx xx xx xx xx xx xx x x x  x x  x x  x x x x  x x  x x  x x   x x  x x   x x   x x   x x   x x   x x   x x   x x  x x  x x x xx xx xx xx xx xx xx mqqqqqqqqqqqqqqqqqqqqqqqqqqqqqqqqqqqqqqqqqqqqqqqqqqqqqqqqqqqqqqqqqqqqqqqqqqqqqqqqqqqqqqqqqqqqqqqqqqqqqqqqqqqqqqqqqqqqqqqqqqqqqqqqqqqqqqqqqqqqqqqqqqqqqqqqqqqqqqqqqqqqqqqqqqqqqqqqqqqqqqqqqqqqqqqqqqqqqqqqqqqqqqqqqqqqqqqqqqqqqqqqqqqqqqqqqqqqqqqqqqqqqqqqqqqqqqqqqqqqqqqqqqqqqqqqqqqqqqqqqqqqqqqqqqqqqqqqqqqqqqqqqqqqqqqqqqqqqqqqqqqqqqqqqqqqqqqqqqqqqqqqqqqqqqqqqqqqqqqqqqqqqqqqqqqqqqqqqqqqqqqqqqqqqqqqqqqqqqj runningfunc int func() { ` return 1; // In function <<< Thread 1: step in }  4 x       stoppedThread: 0x684a4d Frame: 0 PC = 0x0000000100000fa4umain extern int func();  int main(int argc, char **argv) {  4 x` func(); // Break here 5 x func(); // Second 6 x return 0; 7 x } 8 x(int) argc = 1 `q(char **) argv = 0x00007ffeefbff89818ddfunc int func() { ` return 1; // In function <<< Thread 1: step in }  4 x       0a4f runningmain extern int func();  int main(int argc, char **argv) {  4 x func(); // Break here 5 x` func(); // Second <<< Thread 1: step out 6 x return 0; 7 x } 8 x(int) argc = 1 `q(char **) argv = 0x00007ffeefbff898stoppedThread: 0x684a4d Frame: 0 PC = 0x0000000100000f8dsettings set interpreter.prompt-on-quit false quit  running

Hide Details

Hide Details

extern int func();

Hide Details

Hide Details

Hide Details

 func(); // Secondfunc int func() { ` return 1; // In function <<< Thread 1: step in }  4 x       stoppedThread: 0x684a4d Frame: 0 PC = 0x0000000100000fa4

Hide Details

Hide Details

Hide Details

 2  running  exited with status = 0libstdcxx tests will not be run because: Don't know how to build with libstdcxx on macosx Skipping following debug info categories: ['dwo']

Hide Details

-- Command Output (stderr): --

Hide Details

Session logs for test failures/errors/unexpected successes will go into directory '/Users/buildslave/jenkins/workspace/lldb-cmake/lldb-build/lldb-test-traces' Change dir to: /Users/buildslave/jenkins/workspace/lldb-cmake/llvm-project/lldb/test/API/commands/gui/basicdebug runCmd: settings clear -all output:

Hide Details

runCmd: settings set symbols.enable-external-lookup false output:

Hide Details

runCmd: settings set target.inherit-tcc true output:

Hide Details

runCmd: settings set target.auto-apply-fixits false output:

Hide Details

runCmd: settings set plugin.process.gdb-remote.packet-timeout 60 output:

Hide Details

runCmd: settings set symbols.clang-modules-cache-path "/Users/buildslave/jenkins/workspace/lldb-cmake/lldb-build/lldb-test-build.noindex/module-cache-lldb/lldb-api" output:

Hide Details

runCmd: settings set use-color false output:

Hide Details

runCmd: setting set target.prefer-dynamic-value no-dynamic-values output:

Hide Details

FAIL: LLDB (/Users/buildslave/jenkins/workspace/lldb-cmake/lldb-build/bin/clang-x86_64) :: test_gui (TestGuiBasicDebug.TestGuiBasicDebugCommandTest) tearing down the child process....

Hide Details

Restore dir to: /Users/buildslave/jenkins/workspace/lldb-cmake/lldb-build/tools/lldb/test ====================================================================== ERROR: test_gui (TestGuiBasicDebug.TestGuiBasicDebugCommandTest) ---------------------------------------------------------------------- Traceback (most recent call last): File "/Users/buildslave/jenkins/workspace/lldb-cmake/llvm-project/lldb/third_party/Python/module/pexpect-4.6/pexpect/expect.py", line 111, in expect_loop incoming = spawn.read_nonblocking(spawn.maxread, timeout) File "/Users/buildslave/jenkins/workspace/lldb-cmake/llvm-project/lldb/third_party/Python/module/pexpect-4.6/pexpect/pty_spawn.py", line 482, in read_nonblocking raise TIMEOUT('Timeout exceeded.') pexpect.exceptions.TIMEOUT: Timeout exceeded.

Hide Details

During handling of the above exception, another exception occurred:

Hide Details

Traceback (most recent call last): File "/Users/buildslave/jenkins/workspace/lldb-cmake/llvm-project/lldb/packages/Python/lldbsuite/test/decorators.py", line 134, in wrapper return func(*args, **kwargs) File "/Users/buildslave/jenkins/workspace/lldb-cmake/llvm-project/lldb/packages/Python/lldbsuite/test/decorators.py", line 104, in wrapper func(*args, **kwargs) File "/Users/buildslave/jenkins/workspace/lldb-cmake/llvm-project/lldb/test/API/commands/gui/basicdebug/TestGuiBasicDebug.py", line 40, in test_gui self.child.expect("func\(\); // Break here[^\r\n]+<<< Thread 1: step out") File "/Users/buildslave/jenkins/workspace/lldb-cmake/llvm-project/lldb/third_party/Python/module/pexpect-4.6/pexpect/spawnbase.py", line 341, in expect timeout, searchwindowsize, async_) File "/Users/buildslave/jenkins/workspace/lldb-cmake/llvm-project/lldb/third_party/Python/module/pexpect-4.6/pexpect/spawnbase.py", line 369, in expect_list return exp.expect_loop(timeout) File "/Users/buildslave/jenkins/workspace/lldb-cmake/llvm-project/lldb/third_party/Python/module/pexpect-4.6/pexpect/expect.py", line 119, in expect_loop return self.timeout(e) File "/Users/buildslave/jenkins/workspace/lldb-cmake/llvm-project/lldb/third_party/Python/module/pexpect-4.6/pexpect/expect.py", line 82, in timeout raise TIMEOUT(msg) pexpect.exceptions.TIMEOUT: Timeout exceeded. <pexpect.pty_spawn.spawn object at 0x10b05dcf8> command: /Users/buildslave/jenkins/workspace/lldb-cmake/lldb-build/bin/lldb args: ['/Users/buildslave/jenkins/workspace/lldb-cmake/lldb-build/bin/lldb', '--no-lldbinit', '--no-use-colors', '-O', 'settings clear -all', '-O', 'settings set symbols.enable-external-lookup false', '-O', 'settings set target.inherit-tcc true', '-O', 'settings set target.auto-apply-fixits false', '-O', 'settings set plugin.process.gdb-remote.packet-timeout 60', '-O', 'settings set symbols.clang-modules-cache-path "/Users/buildslave/jenkins/workspace/lldb-cmake/lldb-build/lldb-test-build.noindex/module-cache-lldb/lldb-api"', '-O', 'settings set use-color false', '-O', 'setting set target.prefer-dynamic-value no-dynamic-values', '--file', '/Users/buildslave/jenkins/workspace/lldb-cmake/lldb-build/lldb-test-build.noindex/commands/gui/basicdebug/TestGuiBasicDebug.test_gui/a.out'] buffer (last 100 chars): b'07ffeefbff898\x1b[100;19Hstopped\x1b[100;41HThread: 0x684a4d Frame: 0 PC = 0x0000000100000f8d\x1b[m\x0f\x1b[H' before (last 100 chars): b'07ffeefbff898\x1b[100;19Hstopped\x1b[100;41HThread: 0x684a4d Frame: 0 PC = 0x0000000100000f8d\x1b[m\x0f\x1b[H' after: <class 'pexpect.exceptions.TIMEOUT'> match: None match_index: None exitstatus: None flag_eof: False pid: 88273 child_fd: 6 closed: False timeout: 30 delimiter: <class 'pexpect.exceptions.EOF'> logfile: <_io.BufferedWriter name='<stdout>'> logfile_read: None logfile_send: None maxread: 2000 ignorecase: False searchwindowsize: None delaybeforesend: 0.05 delayafterclose: 0.1 delayafterterminate: 0.1 searcher: searcher_re: 0: re.compile(b'func\\(\\); // Break here[^\r\n]+<<< Thread 1: step out') Config=x86_64-/Users/buildslave/jenkins/workspace/lldb-cmake/lldb-build/bin/clang ---------------------------------------------------------------------- Ran 1 test in 61.809s

Hide Details

RESULT: FAILED (0 passes, 0 failures, 1 errors, 0 skipped, 0 expected failures, 0 unexpected successes)

Hide Details

--

Hide Details

******************** PASS: lldb-unit :: Language/Highlighting/./HighlighterTests/HighlighterTest.ClangStringLiterals (1799 of 2154) PASS: lldb-unit :: Language/Highlighting/./HighlighterTests/HighlighterTest.ClangComments (1800 of 2154) PASS: lldb-unit :: Utility/./UtilityTests/SerializationRountripTest.SerializeDeserializeCStringArrayNullptr (1801 of 2154) PASS: lldb-unit :: Host/./HostTests/SocketAddressTest.GetAddressInfo (1802 of 2154) PASS: lldb-api :: functionalities/data-formatter/setvaluefromcstring/TestSetValueFromCString.py (1803 of 2154) PASS: lldb-shell :: SymbolFile/NativePDB/ast-functions.cpp (1804 of 2154) PASS: lldb-shell :: SymbolFile/NativePDB/global-classes.cpp (1805 of 2154) PASS: lldb-shell :: ObjectFile/ELF/section-permissions.yaml (1806 of 2154) PASS: lldb-shell :: SymbolFile/DWARF/DW_AT_data_bit_offset-DW_OP_stack_value.s (1807 of 2154) PASS: lldb-api :: python_api/function_symbol/TestDisasmAPI.py (1808 of 2154) PASS: lldb-api :: commands/expression/issue_11588/Test11588.py (1809 of 2154) PASS: lldb-unit :: ScriptInterpreter/Python/./ScriptInterpreterPythonTests/PythonDataObjectsTest.TestPythonTupleValues (1810 of 2154) PASS: lldb-api :: types/TestDoubleTypesExpr.py (1811 of 2154) PASS: lldb-unit :: Symbol/./SymbolTests/TestTypeSystemClang.TestDeletingImplicitCopyCstrDueToMoveCStr (1812 of 2154) PASS: lldb-unit :: Core/./LLDBCoreTests/RichManglingContextTest.IPDRealloc (1813 of 2154) UNSUPPORTED: lldb-api :: tools/lldb-server/TestGdbRemoteCompletion.py (1814 of 2154) UNSUPPORTED: lldb-api :: functionalities/data-formatter/data-formatter-stl/libstdcpp/tuple/TestDataFormatterStdTuple.py (1815 of 2154) UNSUPPORTED: lldb-api :: linux/sepdebugsymlink/TestTargetSymbolsSepDebugSymlink.py (1816 of 2154) PASS: lldb-unit :: Language/Highlighting/./HighlighterTests/HighlighterTest.DefaultHighlighter (1817 of 2154) PASS: lldb-unit :: Utility/./UtilityTests/StringExtractorTest.GetHexU8_Underflow2_NoEof (1818 of 2154) PASS: lldb-api :: functionalities/data-formatter/data-formatter-stl/libcxx/list/TestDataFormatterLibcxxList.py (1819 of 2154) PASS: lldb-shell :: SymbolFile/NativePDB/globals-fundamental.cpp (1820 of 2154) PASS: lldb-shell :: ObjectFile/Breakpad/sections-trailing-func.test (1821 of 2154) PASS: lldb-api :: commands/breakpoint/set/func-regex/TestBreakpointRegexError.py (1822 of 2154) PASS: lldb-api :: functionalities/data-formatter/data-formatter-stl/libcxx/variant/TestDataFormatterLibcxxVariant.py (1823 of 2154) PASS: lldb-shell :: Reproducer/TestPythonImport.test (1824 of 2154) PASS: lldb-unit :: Utility/./UtilityTests/LogChannelEnabledTest.log_options (1825 of 2154) PASS: lldb-unit :: UnwindAssembly/x86/./UnwindAssemblyx86Tests/Testx86AssemblyInspectionEngine.TestPushExtended (1826 of 2154) PASS: lldb-unit :: Breakpoint/./LLDBBreakpointTests/BreakpointIDTest.StringIsBreakpointName (1827 of 2154) PASS: lldb-api :: tools/lldb-server/TestGdbRemoteHostInfo.py (1828 of 2154) PASS: lldb-shell :: SymbolFile/DWARF/find-function-regex.cpp (1829 of 2154) PASS: lldb-unit :: Utility/./UtilityTests/UriParserTest.MinimalPath (1830 of 2154) PASS: lldb-api :: lang/objc/objc-baseclass-sbtype/TestObjCBaseClassSBType.py (1831 of 2154) PASS: lldb-unit :: Utility/./UtilityTests/BinaryStreamTest.PutULEB128SevenBytes (1832 of 2154) PASS: lldb-unit :: Symbol/./SymbolTests/TestTypeSystemClang.TestFunctionTemplateConstruction (1833 of 2154) UNSUPPORTED: lldb-api :: commands/register/register/aarch64_sve_registers/rw_access_static_config/TestSVERegisters.py (1834 of 2154) PASS: lldb-api :: python_api/function_symbol/TestSymbolAPI.py (1835 of 2154) PASS: lldb-unit :: ObjectFile/Breakpad/./ObjectFileBreakpadTests/FileRecord.parse (1836 of 2154) PASS: lldb-unit :: Utility/./UtilityTests/RangeTest.Copy (1837 of 2154) UNSUPPORTED: lldb-shell :: Register/x86-gp-read.test (1838 of 2154) PASS: lldb-api :: commands/command/source/TestCommandSource.py (1839 of 2154) PASS: lldb-unit :: Utility/./UtilityTests/StringListTest.LongestCommonPrefixDuplicateElement (1840 of 2154) PASS: lldb-api :: functionalities/type_completion/TestTypeCompletion.py (1841 of 2154) PASS: lldb-unit :: ScriptInterpreter/Python/./ScriptInterpreterPythonTests/PythonDataObjectsTest.TestPythonIntegerToStr (1842 of 2154) PASS: lldb-shell :: SymbolFile/DWARF/dwp.s (1843 of 2154) PASS: lldb-api :: lang/c/offsetof/TestOffsetof.py (1844 of 2154) PASS: lldb-api :: functionalities/data-formatter/vector-types/TestVectorTypesFormatting.py (1845 of 2154) PASS: lldb-unit :: Utility/./UtilityTests/StringListTest.DefaultConstructor (1846 of 2154) UNSUPPORTED: lldb-shell :: Reproducer/TestLuaImport.test (1847 of 2154) PASS: lldb-api :: functionalities/gdb_remote_client/TestGDBRemoteClient.py (1848 of 2154) PASS: lldb-unit :: Process/gdb-remote/./ProcessGdbRemoteTests/GDBRemoteCommunicationServerTest.SendErrorResponse_UnimplementedError (1849 of 2154) PASS: lldb-api :: lang/c/inlines/TestRedefinitionsInInlines.py (1850 of 2154) PASS: lldb-unit :: UnwindAssembly/x86/./UnwindAssemblyx86Tests/Testx86AssemblyInspectionEngine.TestPushEBP (1851 of 2154) PASS: lldb-api :: lang/cpp/extern_c/TestExternCSymbols.py (1852 of 2154) PASS: lldb-api :: functionalities/data-formatter/dump_dynamic/TestDumpDynamic.py (1853 of 2154) PASS: lldb-unit :: ScriptInterpreter/Python/./ScriptInterpreterPythonTests/PythonDataObjectsTest.TestPythonTupleInitializerList2 (1854 of 2154) PASS: lldb-shell :: SymbolFile/NativePDB/disassembly.cpp (1855 of 2154) PASS: lldb-unit :: Expression/./ExpressionTests/CppModuleConfigurationTest.MissingUsrInclude (1856 of 2154) PASS: lldb-api :: commands/expression/import-std-module/unique_ptr-dbg-info-content/TestUniquePtrDbgInfoContent.py (1857 of 2154) PASS: lldb-unit :: Utility/./UtilityTests/ScalarTest.Comparison (1858 of 2154) PASS: lldb-unit :: Utility/./UtilityTests/VMRange.ContainsRange (1859 of 2154) PASS: lldb-unit :: Utility/./UtilityTests/StreamTeeTest.Write (1860 of 2154) PASS: lldb-unit :: Utility/./UtilityTests/FileSpecTest.Match (1861 of 2154) UNSUPPORTED: lldb-api :: tools/lldb-server/registers-target-xml-reading/TestGdbRemoteTargetXmlPacket.py (1862 of 2154) PASS: lldb-unit :: Host/./HostTests/ProcessLaunchInfoTest.Constructor (1863 of 2154) PASS: lldb-unit :: Utility/./UtilityTests/StringLexerTest.HasAtLeast (1864 of 2154) PASS: lldb-api :: lang/objc/modules-cache/TestClangModulesCache.py (1865 of 2154) PASS: lldb-shell :: ObjectFile/ELF/duplicate-section.yaml (1866 of 2154) PASS: lldb-api :: lang/cpp/std-function-step-into-callable/TestStdFunctionStepIntoCallable.py (1867 of 2154) PASS: lldb-api :: lang/objc/objc-struct-argument/TestObjCStructArgument.py (1868 of 2154) PASS: lldb-api :: lang/objc/objc-new-syntax/TestObjCNewSyntaxDictionary.py (1869 of 2154) PASS: lldb-unit :: UnwindAssembly/x86/./UnwindAssemblyx86Tests/Testx86AssemblyInspectionEngine.TestPushEDI (1870 of 2154) PASS: lldb-unit :: Utility/./UtilityTests/CompletionRequest.DuplicateFiltering (1871 of 2154) PASS: lldb-unit :: Utility/./UtilityTests/LogChannelTest.Enable (1872 of 2154) PASS: lldb-unit :: Utility/./UtilityTests/StringListTest.SplitIntoLinesSingleTrailingCR (1873 of 2154) PASS: lldb-unit :: Utility/./UtilityTests/RangeDataVector.FindEntryThatContains (1874 of 2154) PASS: lldb-api :: lang/cpp/nested-class-other-compilation-unit/TestNestedClassWithParentInAnotherCU.py (1875 of 2154) PASS: lldb-unit :: SymbolFile/DWARF/./SymbolFileDWARFTests/SymbolFileDWARFTests.TestAbbrevInvalidNULLTag (1876 of 2154) PASS: lldb-unit :: Utility/./UtilityTests/StateTest.Formatv (1877 of 2154) PASS: lldb-api :: functionalities/inferior-changed/TestInferiorChanged.py (1878 of 2154) PASS: lldb-api :: python_api/watchpoint/watchlocation/TestSetWatchlocation.py (1879 of 2154) PASS: lldb-unit :: UnwindAssembly/x86/./UnwindAssemblyx86Tests/Testx86AssemblyInspectionEngine.TestMovRSPtoRBP (1880 of 2154) PASS: lldb-api :: lang/cpp/class_static/TestStaticVariables.py (1881 of 2154) PASS: lldb-api :: commands/expression/call-function/TestCallUserDefinedFunction.py (1882 of 2154) PASS: lldb-unit :: SymbolFile/NativePDB/./SymbolFileNativePDBTests/PDBFPOProgramToDWARFExpressionTests.InvalidAssignmentMultiple (1883 of 2154) PASS: lldb-api :: python_api/symbol-context/TestSymbolContext.py (1884 of 2154) UNSUPPORTED: lldb-shell :: SymbolFile/PDB/function-nested-block.test (1885 of 2154) PASS: lldb-unit :: Process/minidump/./LLDBMinidumpTests/MinidumpParserTest.MinidumpDuplicateModuleMinAddress (1886 of 2154) PASS: lldb-api :: types/TestLongTypesExpr.py (1887 of 2154) PASS: lldb-api :: python_api/objc_type/TestObjCType.py (1888 of 2154) PASS: lldb-shell :: Commands/command-script-import.test (1889 of 2154) PASS: lldb-api :: lang/cpp/signed_types/TestSignedTypes.py (1890 of 2154) PASS: lldb-api :: lang/cpp/bool/TestCPPBool.py (1891 of 2154) PASS: lldb-unit :: ScriptInterpreter/Python/./ScriptInterpreterPythonTests/PythonDataObjectsTest.TestPythonInteger (1892 of 2154) PASS: lldb-api :: functionalities/pre_run_dylibs/TestPreRunDylibs.py (1893 of 2154) PASS: lldb-unit :: Utility/./UtilityTests/ArchSpecTest.MergeFrom (1894 of 2154) PASS: lldb-unit :: SymbolFile/NativePDB/./SymbolFileNativePDBTests/PDBFPOProgramToDWARFExpressionTests.UnresolvedRegisterAssignmentReference (1895 of 2154) PASS: lldb-shell :: Driver/TestNoUseColor.test (1896 of 2154) PASS: lldb-unit :: Process/minidump/./LLDBMinidumpTests/MinidumpParserTest.MinidumpDuplicateModuleMappedSecond (1897 of 2154) PASS: lldb-shell :: SymbolFile/DWARF/module-ownership.mm (1898 of 2154) PASS: lldb-unit :: Utility/./UtilityTests/AnsiTerminal.Unknown (1899 of 2154) PASS: lldb-api :: functionalities/data-formatter/boolreference/TestFormattersBoolRefPtr.py (1900 of 2154) PASS: lldb-unit :: Utility/./UtilityTests/ArgsTest.GetArgumentArrayRef (1901 of 2154) PASS: lldb-api :: tools/lldb-server/TestGdbRemoteKill.py (1902 of 2154) PASS: lldb-unit :: Utility/./UtilityTests/StringListTest.PopBack (1903 of 2154) PASS: lldb-api :: functionalities/testid/TestTestId.py (1904 of 2154) PASS: lldb-unit :: Utility/./UtilityTests/StatusTest.ErrorConversion (1905 of 2154) PASS: lldb-shell :: SymbolFile/DWARF/DW_AT_location-DW_AT_const_value.s (1906 of 2154) PASS: lldb-api :: commands/expression/vector_of_enums/TestVectorOfEnums.py (1907 of 2154) PASS: lldb-unit :: Utility/./UtilityTests/FileSpecTest.AppendPathComponent (1908 of 2154) PASS: lldb-unit :: Process/minidump/./LLDBMinidumpTests/MinidumpParserTest.GetThreadContext_x86_32 (1909 of 2154) PASS: lldb-api :: commands/quit/TestQuit.py (1910 of 2154) UNSUPPORTED: lldb-shell :: SymbolFile/PDB/typedefs.test (1911 of 2154) PASS: lldb-unit :: Core/./LLDBCoreTests/MangledTest.NameIndexes_FindFunctionSymbols (1912 of 2154) UNSUPPORTED: lldb-shell :: Register/x86-zmm-write.test (1913 of 2154) PASS: lldb-api :: commands/target/stop-hook/enable/TestTargetStopHookEnable.py (1914 of 2154) PASS: lldb-api :: commands/disassemble/basic/TestDisassembleBreakpoint.py (1915 of 2154) PASS: lldb-api :: functionalities/thread_plan/TestThreadPlanCommands.py (1916 of 2154) PASS: lldb-unit :: Expression/./ExpressionTests/CppModuleConfigurationTest.Xcode (1917 of 2154) PASS: lldb-unit :: Utility/./UtilityTests/RecordReplayTest.InstrumentedBarRef (1918 of 2154) PASS: lldb-shell :: Commands/command-source.test (1919 of 2154) PASS: lldb-unit :: Utility/./UtilityTests/UUIDTest.StringConverion (1920 of 2154) PASS: lldb-unit :: Utility/./UtilityTests/ProcessInfoTest.Constructor (1921 of 2154) PASS: lldb-api :: commands/expression/inline-namespace/TestInlineNamespace.py (1922 of 2154) PASS: lldb-unit :: SymbolFile/DWARF/./SymbolFileDWARFTests/SymbolFileDWARFTests.TestAbbrevOrder1Start1 (1923 of 2154) PASS: lldb-unit :: Utility/./UtilityTests/UserIDResolver.GetGroupName (1924 of 2154) PASS: lldb-unit :: Utility/./UtilityTests/RangeTest.Constructor (1925 of 2154) PASS: lldb-unit :: Language/Highlighting/./HighlighterTests/HighlighterTest.ClangCommas (1926 of 2154) PASS: lldb-unit :: Utility/./UtilityTests/UriParserTest.MinimalPort (1927 of 2154) PASS: lldb-shell :: ObjectFile/MachO/lc_version_min.yaml (1928 of 2154) PASS: lldb-api :: functionalities/data-formatter/data-formatter-caching/TestDataFormatterCaching.py (1929 of 2154) PASS: lldb-unit :: Core/./LLDBCoreTests/RichManglingContextTest.SwitchProvider (1930 of 2154) PASS: lldb-shell :: SymbolFile/NativePDB/function-types-builtins.cpp (1931 of 2154) PASS: lldb-api :: commands/expression/rdar42038760/TestScalarURem.py (1932 of 2154) UNSUPPORTED: lldb-api :: benchmarks/expression/TestRepeatedExprs.py (1933 of 2154) PASS: lldb-unit :: Utility/./UtilityTests/StringExtractorTest.GetHexU8_InvalidHex_NoEof (1934 of 2154) UNSUPPORTED: lldb-api :: functionalities/data-formatter/data-formatter-stl/libstdcpp/iterator/TestDataFormatterStdIterator.py (1935 of 2154) PASS: lldb-shell :: ScriptInterpreter/Python/python.test (1936 of 2154) PASS: lldb-api :: lang/cpp/breakpoint_in_member_func_w_non_primitive_params/TestBreakpointInMemberFuncWNonPrimitiveParams.py (1937 of 2154) PASS: lldb-unit :: Utility/./UtilityTests/StringListTest.AppendStringCString (1938 of 2154) UNSUPPORTED: lldb-api :: tools/lldb-vscode/completions/TestVSCode_completions.py (1939 of 2154) PASS: lldb-api :: python_api/frame/get-variables/TestGetVariables.py (1940 of 2154) PASS: lldb-unit :: Utility/./UtilityTests/RecordReplayTest.InstrumentedBar (1941 of 2154) PASS: lldb-api :: functionalities/tsan/basic/TestTsanBasic.py (1942 of 2154) PASS: lldb-api :: commands/expression/options/TestExprOptions.py (1943 of 2154) PASS: lldb-api :: python_api/lldbutil/iter/TestLLDBIterator.py (1944 of 2154) PASS: lldb-unit :: Utility/./UtilityTests/RangeTest.SizeTypes (1945 of 2154) PASS: lldb-api :: tools/lldb-server/TestGdbRemoteAttach.py (1946 of 2154) PASS: lldb-unit :: Interpreter/./InterpreterTests/OptionArgParserTest.toScriptLanguage (1947 of 2154) PASS: lldb-unit :: Utility/./UtilityTests/StreamTest.PutMaxHex64ByteOrderLittle (1948 of 2154) PASS: lldb-unit :: Utility/./UtilityTests/StringExtractorTest.GetHexU8_Extra_NoEof (1949 of 2154) PASS: lldb-unit :: Expression/./ExpressionTests/DWARFExpression.DW_OP_convert (1950 of 2154) PASS: lldb-unit :: ScriptInterpreter/Python/./ScriptInterpreterPythonTests/PythonDataObjectsTest.TestPythonTupleToStructuredList (1951 of 2154) PASS: lldb-api :: lang/objcxx/class-name-clash/TestNameClash.py (1952 of 2154) UNSUPPORTED: lldb-api :: functionalities/thread/multi_break/TestMultipleBreakpoints.py (1953 of 2154) PASS: lldb-api :: python_api/exprpath_synthetic/TestExprPathSynthetic.py (1954 of 2154) PASS: lldb-api :: macosx/add-dsym/TestAddDsymMidExecutionCommand.py (1955 of 2154) PASS: lldb-unit :: UnwindAssembly/x86/./UnwindAssemblyx86Tests/Testx86AssemblyInspectionEngine.TestPopRBP (1956 of 2154) PASS: lldb-unit :: Utility/./UtilityTests/RangeTest.ContainsEndInclusive (1957 of 2154) PASS: lldb-unit :: Utility/./UtilityTests/ConstStringTest.YAML (1958 of 2154) PASS: lldb-api :: functionalities/thread/concurrent_events/TestConcurrentWatchpointWithDelayWatchpointThreads.py (1959 of 2154) PASS: lldb-api :: lang/cpp/constructors/TestCppConstructors.py (1960 of 2154) PASS: lldb-api :: commands/expression/import-std-module/forward_list/TestForwardListFromStdModule.py (1961 of 2154) PASS: lldb-unit :: Utility/./UtilityTests/BinaryStreamTest.PutSLEB128FiveBytes (1962 of 2154) PASS: lldb-shell :: ObjectFile/PECOFF/sections.yaml (1963 of 2154) PASS: lldb-api :: functionalities/data-formatter/summary-string-onfail/Test-rdar-9974002.py (1964 of 2154) PASS: lldb-unit :: Host/./HostTests/HostInfoTest.GetHostname (1965 of 2154) PASS: lldb-api :: lang/c/register_variables/TestRegisterVariables.py (1966 of 2154) PASS: lldb-api :: functionalities/tsan/thread_leak/TestTsanThreadLeak.py (1967 of 2154) PASS: lldb-api :: functionalities/data-formatter/poarray/TestPrintObjectArray.py (1968 of 2154) PASS: lldb-api :: functionalities/step-avoids-no-debug/TestStepNoDebug.py (1969 of 2154) PASS: lldb-shell :: ObjectFile/Breakpad/uuid-matching-mac.test (1970 of 2154) PASS: lldb-api :: commands/expression/test/TestExprs.py (1971 of 2154) PASS: lldb-api :: commands/frame/diagnose/complicated-expression/TestComplicatedExpression.py (1972 of 2154) PASS: lldb-shell :: SymbolFile/NativePDB/ast-methods.cpp (1973 of 2154) PASS: lldb-unit :: Host/./HostTests/SocketTest.TCPGetAddress (1974 of 2154) PASS: lldb-api :: commands/breakpoint/command/list/TestBreakpointCommandList.py (1975 of 2154) PASS: lldb-unit :: Utility/./UtilityTests/StreamTest.PutRawBytesToBigEndian (1976 of 2154) PASS: lldb-shell :: SymbolFile/NativePDB/nested-types.cpp (1977 of 2154) PASS: lldb-unit :: Utility/./UtilityTests/ArgsTest.ReplaceArgumentAtIndexShort (1978 of 2154) PASS: lldb-api :: python_api/lldbutil/frame/TestFrameUtils.py (1979 of 2154) PASS: lldb-shell :: SymbolFile/DWARF/apple-index-is-used.cpp (1980 of 2154) PASS: lldb-api :: functionalities/fat_archives/TestFatArchives.py (1981 of 2154) PASS: lldb-unit :: Utility/./UtilityTests/PassiveReplayTest.InstrumentedFooInvalid (1982 of 2154) PASS: lldb-unit :: Host/./HostTests/ConnectionFileDescriptorTest.TCPGetURIv6 (1983 of 2154) PASS: lldb-shell :: Commands/command-stop-hook-output.test (1984 of 2154) PASS: lldb-unit :: Host/./HostTests/SocketTest.UDPGetConnectURI (1985 of 2154) PASS: lldb-unit :: Utility/./UtilityTests/StreamTest.AddressNoSuffix (1986 of 2154) PASS: lldb-api :: tools/lldb-vscode/attach/TestVSCode_attach.py (1987 of 2154) PASS: lldb-api :: functionalities/data-formatter/data-formatter-stl/libcxx/optional/TestDataFormatterLibcxxOptional.py (1988 of 2154) PASS: lldb-unit :: Utility/./UtilityTests/UriParserTest.TypicalPortPathIPv6 (1989 of 2154) PASS: lldb-shell :: Driver/TestRepl.test (1990 of 2154) PASS: lldb-unit :: Utility/./UtilityTests/UriParserTest.SchemeHostSeparator2 (1991 of 2154) XFAIL: lldb-shell :: Register/x86-mm-xmm-write.test (1992 of 2154) PASS: lldb-api :: functionalities/show_location/TestShowLocationDwarf5.py (1993 of 2154) PASS: lldb-shell :: Driver/TestTarget.test (1994 of 2154) UNSUPPORTED: lldb-api :: functionalities/thread/state/TestThreadStates.py (1995 of 2154) PASS: lldb-shell :: SymbolFile/NativePDB/bitfields.cpp (1996 of 2154) PASS: lldb-unit :: Language/Highlighting/./HighlighterTests/HighlighterTest.ClangPPDirectives (1997 of 2154) PASS: lldb-api :: functionalities/multidebugger_commands/TestMultipleDebuggersCommands.py (1998 of 2154) PASS: lldb-unit :: Utility/./UtilityTests/BinaryStreamTest.PutSLEB128FourBytes (1999 of 2154) PASS: lldb-shell :: ObjectFile/ELF/PT_LOAD.yaml (2000 of 2154) PASS: lldb-unit :: Utility/./UtilityTests/XcodeSDKTest.SDKSupportsModules (2001 of 2154) PASS: lldb-api :: functionalities/data-formatter/data-formatter-objc/TestDataFormatterObjCNSDate.py (2002 of 2154) PASS: lldb-unit :: Utility/./UtilityTests/StreamTest.PutHex32ByteOrderLittle (2003 of 2154) PASS: lldb-api :: functionalities/archives/TestBSDArchives.py (2004 of 2154) PASS: lldb-unit :: Utility/./UtilityTests/AnsiTerminal.Twice (2005 of 2154) PASS: lldb-api :: functionalities/tail_call_frames/sbapi_support/TestTailCallFrameSBAPI.py (2006 of 2154) PASS: lldb-api :: lang/objc/real-definition/TestRealDefinition.py (2007 of 2154) PASS: lldb-shell :: Driver/TestHelp.test (2008 of 2154) PASS: lldb-unit :: Utility/./UtilityTests/StringListTest.InsertStringAtIndexMove (2009 of 2154) PASS: lldb-unit :: Utility/./UtilityTests/BinaryStreamTest.PutULEB128One (2010 of 2154) PASS: lldb-unit :: UnwindAssembly/x86/./UnwindAssemblyx86Tests/Testx86AssemblyInspectionEngine.TestDisassemblyMidFunctionEpilogues (2011 of 2154) PASS: lldb-api :: commands/frame/var-scope/TestFrameVariableScope.py (2012 of 2154) PASS: lldb-unit :: Utility/./UtilityTests/RangeTest.SlideZero (2013 of 2154) PASS: lldb-api :: commands/watchpoints/multiple_threads/TestWatchpointMultipleThreads.py (2014 of 2154) PASS: lldb-unit :: UnwindAssembly/x86/./UnwindAssemblyx86Tests/Testx86AssemblyInspectionEngine.TestPushECX (2015 of 2154) PASS: lldb-api :: lang/cpp/class-template-parameter-pack/TestClassTemplateParameterPack.py (2016 of 2154) PASS: lldb-unit :: Process/gdb-remote/./ProcessGdbRemoteTests/GDBRemoteClientBaseTest.SendContinueDelegateStructuredDataReceipt (2017 of 2154) PASS: lldb-api :: commands/expression/multiline-completion/TestMultilineCompletion.py (2018 of 2154) PASS: lldb-unit :: Expression/./ExpressionTests/ClangHostTest.ComputeClangResourceDirectory (2019 of 2154) PASS: lldb-unit :: ScriptInterpreter/Python/./ScriptInterpreterPythonTests/PythonDataObjectsTest.TestObjectAttributes (2020 of 2154) PASS: lldb-api :: macosx/load-kext/TestLoadKext.py (2021 of 2154) PASS: lldb-api :: macosx/thread_suspend/TestInternalThreadSuspension.py (2022 of 2154) PASS: lldb-unit :: Language/Highlighting/./HighlighterTests/HighlighterTest.DefaultHighlighterWithCursor (2023 of 2154) PASS: lldb-shell :: SymbolFile/DWARF/debug-types-dwo-cross-reference.cpp (2024 of 2154) PASS: lldb-unit :: Target/./TargetTests/RemoteAwarePlatformTest.TestResolveExecutabelOnClientByPlatform (2025 of 2154) PASS: lldb-unit :: UnwindAssembly/x86/./UnwindAssemblyx86Tests/Testx86AssemblyInspectionEngine.TestLEAVE (2026 of 2154) PASS: lldb-unit :: SymbolFile/NativePDB/./SymbolFileNativePDBTests/PDBFPOProgramToDWARFExpressionTests.UnsupportedRASearch (2027 of 2154) PASS: lldb-unit :: Target/./TargetTests/ExecutionContextTest.GetByteOrder (2028 of 2154) PASS: lldb-api :: tools/lldb-vscode/runInTerminal/TestVSCode_runInTerminal.py (2029 of 2154) PASS: lldb-api :: commands/expression/unwind_expression/TestUnwindExpression.py (2030 of 2154) PASS: lldb-unit :: Utility/./UtilityTests/UriParserTest.BracketedHostnameWithPortIPv6 (2031 of 2154) PASS: lldb-api :: functionalities/inferior-crashing/TestInferiorCrashingStep.py (2032 of 2154) PASS: lldb-api :: commands/expression/namespace_local_var_same_name_obj_c/TestNamespaceLocalVarSameNameObjC.py (2033 of 2154) PASS: lldb-api :: commands/target/basic/TestTargetCommand.py (2034 of 2154) PASS: lldb-api :: functionalities/unwind/noreturn/TestNoreturnUnwind.py (2035 of 2154) PASS: lldb-api :: commands/frame/var/TestFrameVar.py (2036 of 2154) PASS: lldb-api :: macosx/safe-to-func-call/TestSafeFuncCalls.py (2037 of 2154) PASS: lldb-unit :: Utility/./UtilityTests/StreamTest.PutULEB128 (2038 of 2154) PASS: lldb-unit :: Expression/./ExpressionTests/DiagnosticManagerTest.AppendMessageSubsequentDiags (2039 of 2154) PASS: lldb-api :: commands/expression/regression-access-function-template-in-record/TestRegressionAccessFunctionTemplateInRecord.py (2040 of 2154) UNSUPPORTED: lldb-shell :: Register/arm-fp-read.test (2041 of 2154) UNSUPPORTED: lldb-api :: functionalities/data-formatter/data-formatter-stl/libstdcpp/vbool/TestDataFormatterStdVBool.py (2042 of 2154) PASS: lldb-api :: commands/expression/completion-in-lambda-and-unnamed-class/TestCompletionInLambdaAndUnnamedClass.py (2043 of 2154) PASS: lldb-unit :: UnwindAssembly/x86/./UnwindAssemblyx86Tests/Testx86AssemblyInspectionEngine.Test64bitFramelessBigStackFrame (2044 of 2154) PASS: lldb-unit :: Expression/./ExpressionTests/CppModuleConfigurationTest.AmbiguousCLib (2045 of 2154) PASS: lldb-unit :: Utility/./UtilityTests/StringLexerTest.NextIf (2046 of 2154) PASS: lldb-unit :: Symbol/./SymbolTests/SymbolsTest.TerminateLocateExecutableSymbolFileForUnknownExecutableAndUnknownSymbolFile (2047 of 2154) PASS: lldb-unit :: Language/CLanguages/./LanguageCLanguagesTests/CLanguages.LookupCLanguagesByLanguageType (2048 of 2154) PASS: lldb-api :: lang/cpp/unique-types/TestUniqueTypes.py (2049 of 2154) UNSUPPORTED: lldb-shell :: Register/x86-64-ymm16-write.test (2050 of 2154) PASS: lldb-shell :: Reproducer/Functionalities/TestDataFormatter.test (2051 of 2154) PASS: lldb-unit :: ObjectFile/PECOFF/./ObjectFilePECOFFTests/PECallFrameInfoTest.Chained_eh (2052 of 2154) UNSUPPORTED: lldb-shell :: SymbolFile/NativePDB/ast-functions-msvc.cpp (2053 of 2154) PASS: lldb-unit :: Utility/./UtilityTests/StatusTest.Formatv (2054 of 2154) PASS: lldb-api :: commands/register/register/register_command/TestRegisters.py (2055 of 2154) PASS: lldb-api :: lang/cpp/accelerator-table/TestCPPAccelerator.py (2056 of 2154) PASS: lldb-unit :: Utility/./UtilityTests/StringExtractorTest.GetHexU8_Exact (2057 of 2154) PASS: lldb-unit :: Expression/./ExpressionTests/DiagnosticManagerTest.FixedExpression (2058 of 2154) PASS: lldb-shell :: SymbolFile/DWARF/debug_rnglists-dwo.s (2059 of 2154) PASS: lldb-unit :: Process/gdb-remote/./ProcessGdbRemoteTests/GDBRemoteCommunicationClientTest.SyncThreadState (2060 of 2154) PASS: lldb-unit :: Utility/./UtilityTests/Flags.GetBitSize (2061 of 2154) PASS: lldb-unit :: Utility/./UtilityTests/OptionsWithRawTest.EmptySuffixSingleWhitespace (2062 of 2154) PASS: lldb-unit :: Process/minidump/./LLDBMinidumpTests/RegisterContextMinidump.ConvertMinidumpContext_x86_64 (2063 of 2154) PASS: lldb-unit :: ObjectFile/PECOFF/./ObjectFilePECOFFTests/PECallFrameInfoTest.Basic_eh (2064 of 2154) PASS: lldb-unit :: Expression/./ExpressionTests/CppModuleConfigurationTest.LinuxLocalLibCpp (2065 of 2154) PASS: lldb-api :: api/log/TestAPILog.py (2066 of 2154) PASS: lldb-unit :: Process/gdb-remote/./ProcessGdbRemoteTests/GDBRemoteCommunicationClientTest.SendSignalsToIgnore (2067 of 2154) UNSUPPORTED: lldb-api :: functionalities/darwin_log/filter/exact_match/message/TestDarwinLogFilterMatchMessage.py (2068 of 2154) PASS: lldb-unit :: Host/./HostTests/MainLoopTest.Signal (2069 of 2154) PASS: lldb-unit :: Expression/./ExpressionTests/DiagnosticManagerTest.GetStringNoDiags (2070 of 2154) PASS: lldb-unit :: Host/./HostTests/FileSystemTest.GetPermissions (2071 of 2154) PASS: lldb-unit :: Symbol/./SymbolTests/TestTypeSystemClang.TestGetEnumIntegerTypeInvalid (2072 of 2154) PASS: lldb-shell :: ObjectFile/PECOFF/basic-info-arm.yaml (2073 of 2154) PASS: lldb-unit :: Utility/./UtilityTests/CompletionRequest.FakeLastArg (2074 of 2154) PASS: lldb-unit :: Utility/./UtilityTests/StatusTest.ErrorCodeConstructor (2075 of 2154) PASS: lldb-api :: functionalities/gdb_remote_client/TestJLink6Armv7RegisterDefinition.py (2076 of 2154) PASS: lldb-unit :: debugserver/./debugserverTests/RNBSocket.LoopBackConnectIPv6 (2077 of 2154) PASS: lldb-unit :: Utility/./UtilityTests/StringListTest.LongestCommonPrefixSingleElement (2078 of 2154) PASS: lldb-shell :: SymbolFile/Breakpad/symtab.test (2079 of 2154) PASS: lldb-shell :: ObjectFile/PECOFF/disassemble-thumb.yaml (2080 of 2154) PASS: lldb-unit :: Target/./TargetTests/ExecutionContextTest.GetByteOrderProcess (2081 of 2154) PASS: lldb-api :: macosx/dyld-trie-symbols/TestDyldTrieSymbols.py (2082 of 2154) PASS: lldb-api :: sample_test/TestSampleInlineTest.py (2083 of 2154) PASS: lldb-unit :: Utility/./UtilityTests/StreamTest.PutCharWhitespace (2084 of 2154) UNSUPPORTED: lldb-shell :: Unwind/eh-frame-small-fde.test (2085 of 2154) PASS: lldb-unit :: Utility/./UtilityTests/Flags.AnyClear (2086 of 2154) PASS: lldb-unit :: Core/./LLDBCoreTests/SourceFileCache.FindSourceFileFound (2087 of 2154) PASS: lldb-unit :: Utility/./UtilityTests/StringListTest.AppendList (2088 of 2154) PASS: lldb-shell :: SymbolFile/Breakpad/line-table-discontinuous-file-ids.test (2089 of 2154) PASS: lldb-unit :: Language/Highlighting/./HighlighterTests/HighlighterTest.ClangUnterminatedString (2090 of 2154) PASS: lldb-unit :: ScriptInterpreter/Python/./ScriptInterpreterPythonTests/PythonDataObjectsTest.TestOwnedReferences (2091 of 2154) PASS: lldb-api :: tools/lldb-server/inferior-crash/TestGdbRemoteSegFault.py (2092 of 2154) PASS: lldb-shell :: Settings/TestFrameFormatNoColor.test (2093 of 2154) PASS: lldb-unit :: Utility/./UtilityTests/UriParserTest.BracketedHostnamePort (2094 of 2154) PASS: lldb-unit :: Utility/./UtilityTests/VMRange.CollectionContains (2095 of 2154) PASS: lldb-api :: python_api/process/io/TestProcessIO.py (2096 of 2154) PASS: lldb-shell :: Breakpoint/split-dwarf5-debug-stroffsets.test (2097 of 2154) PASS: lldb-shell :: SymbolFile/Breakpad/stack-cfi-parsing.test (2098 of 2154) PASS: lldb-unit :: Utility/./UtilityTests/BinaryStreamTest.PutSLEB128SixBytes (2099 of 2154) PASS: lldb-api :: lang/cpp/gmodules/TestWithModuleDebugging.py (2100 of 2154) PASS: lldb-unit :: Utility/./UtilityTests/ScalarTest.Scalar_512 (2101 of 2154) PASS: lldb-unit :: Utility/./UtilityTests/ArgsTest.AppendArguments (2102 of 2154) PASS: lldb-unit :: ObjectFile/ELF/./ObjectFileELFTests/ObjectFileELFTest.SectionsResolveConsistently (2103 of 2154) UNSUPPORTED: lldb-api :: arm/breakpoint-thumb-codesection/TestBreakpointThumbCodesection.py (2104 of 2154) PASS: lldb-shell :: Register/x86-64-ymm-read.test (2105 of 2154) PASS: lldb-api :: commands/expression/top-level/TestTopLevelExprs.py (2106 of 2154) PASS: lldb-unit :: Utility/./UtilityTests/StringListTest.AppendListCStringArray (2107 of 2154) PASS: lldb-unit :: Core/./LLDBCoreTests/MangledTest.ResultForValidName (2108 of 2154) PASS: lldb-shell :: SymbolFile/Breakpad/line-table-mixed-path-styles.test (2109 of 2154) PASS: lldb-unit :: Process/minidump/./LLDBMinidumpTests/MinidumpParserTest.GetFilteredModuleList (2110 of 2154) PASS: lldb-unit :: Process/minidump/./LLDBMinidumpTests/MinidumpParserTest.GetMemoryRegionInfoLinuxMaps (2111 of 2154) PASS: lldb-unit :: Core/./LLDBCoreTests/ModuleSpecTest.TestMachOFile (2112 of 2154) PASS: lldb-api :: python_api/name_lookup/TestNameLookup.py (2113 of 2154) UNSUPPORTED: lldb-shell :: Register/x86-ymm-read.test (2114 of 2154) PASS: lldb-unit :: DataFormatter/./LLDBFormatterTests/StringPrinterTests.CxxUTF8 (2115 of 2154) PASS: lldb-unit :: Utility/./UtilityTests/ConstStringTest.FromMidOfBufferStringRef (2116 of 2154) PASS: lldb-unit :: Utility/./UtilityTests/DeserializerTest.HasData (2117 of 2154) PASS: lldb-api :: functionalities/data-formatter/varscript_formatting/TestDataFormatterVarScriptFormatting.py (2118 of 2154) PASS: lldb-api :: functionalities/dlopen_other_executable/TestDlopenOtherExecutable.py (2119 of 2154) PASS: lldb-api :: python_api/watchpoint/condition/TestWatchpointConditionAPI.py (2120 of 2154) PASS: lldb-unit :: Process/gdb-remote/./ProcessGdbRemoteTests/GDBRemoteCommunicationServerTest.SendErrorResponse_StringError (2121 of 2154) PASS: lldb-api :: lang/cpp/gmodules-templates/TestGModules.py (2122 of 2154) PASS: lldb-unit :: Host/./HostTests/SocketTest.DomainGetConnectURI (2123 of 2154) PASS: lldb-unit :: Expression/./ExpressionTests/DiagnosticManagerTest.PutStringSeverities (2124 of 2154) PASS: lldb-shell :: SymbolFile/DWARF/find-variable-file.cpp (2125 of 2154) PASS: lldb-unit :: Symbol/./SymbolTests/TestTypeSystemClang.TestGetTypeClassTypeOfExpr (2126 of 2154) PASS: lldb-unit :: Utility/./UtilityTests/BroadcasterTest.BroadcastEvent (2127 of 2154) PASS: lldb-unit :: Expression/./ExpressionTests/CppModuleConfigurationTest.UnrelatedLibrary (2128 of 2154) PASS: lldb-unit :: Utility/./UtilityTests/RangeTest.NotEqualInvalid (2129 of 2154) PASS: lldb-shell :: ObjectFile/ELF/section-addresses.yaml (2130 of 2154) PASS: lldb-api :: lang/objc/hidden-ivars/TestHiddenIvars.py (2131 of 2154) UNSUPPORTED: lldb-api :: functionalities/unwind/ehframe/TestEhFrameUnwind.py (2132 of 2154) PASS: lldb-unit :: Utility/./UtilityTests/FileSpecTest.Equal (2133 of 2154) PASS: lldb-unit :: Utility/./UtilityTests/ScalarTest.SetValueFromCString (2134 of 2154) PASS: lldb-unit :: Utility/./UtilityTests/UriParserTest.BracketedHostnameWithPortIPv4 (2135 of 2154) PASS: lldb-api :: commands/expression/import-std-module/shared_ptr-dbg-info-content/TestSharedPtrDbgInfoContentFromStdModule.py (2136 of 2154) PASS: lldb-unit :: Expression/./ExpressionTests/DiagnosticManagerTest.AppendMessageAttachToLastDiag (2137 of 2154) PASS: lldb-api :: functionalities/dynamic_value_child_count/TestDynamicValueChildCount.py (2138 of 2154) PASS: lldb-unit :: Utility/./UtilityTests/StringExtractorTest.GetNameColonValueContainsColon (2139 of 2154) PASS: lldb-api :: python_api/thread/TestThreadAPI.py (2140 of 2154) PASS: lldb-unit :: Utility/./UtilityTests/RangeTest.LessThan (2141 of 2154) PASS: lldb-api :: functionalities/memory/find/TestMemoryFind.py (2142 of 2154) PASS: lldb-api :: commands/expression/entry-bp/TestExprEntryBP.py (2143 of 2154) PASS: lldb-unit :: UnwindAssembly/x86/./UnwindAssemblyx86Tests/Testx86AssemblyInspectionEngine.TestPushRBPWithREX (2144 of 2154) PASS: lldb-api :: terminal/TestEditline.py (2145 of 2154) PASS: lldb-shell :: Driver/TestFile.test (2146 of 2154) PASS: lldb-api :: commands/expression/import_base_class_when_class_has_derived_member/TestImportBaseClassWhenClassHasDerivedMember.py (2147 of 2154) PASS: lldb-api :: functionalities/thread/concurrent_events/TestConcurrentWatchBreakDelay.py (2148 of 2154) PASS: lldb-shell :: SymbolFile/DWARF/dir-separator-windows.s (2149 of 2154) XFAIL: lldb-shell :: Register/x86-mm-xmm-read.test (2150 of 2154) PASS: lldb-unit :: debugserver/./debugserverTests/RNBSocket.LoopBackConnectIPv4 (2151 of 2154) PASS: lldb-api :: functionalities/thread/concurrent_events/TestConcurrentSignalDelayBreak.py (2152 of 2154) PASS: lldb-api :: lang/cpp/virtual-functions/TestCppVirtualFunctions.py (2153 of 2154) PASS: lldb-api :: functionalities/data-formatter/data-formatter-objc/TestDataFormatterObjCExpr.py (2154 of 2154) Slowest Tests: -------------------------------------------------------------------------- 381.61s: lldb-api :: macosx/simulator/TestSimulatorPlatform.py 185.15s: lldb-api :: lang/objc/variadic_methods/TestVariadicMethods.py 167.82s: lldb-api :: functionalities/load_unload/TestLoadUnload.py 137.87s: lldb-api :: lang/objc/modules-app-update/TestClangModulesAppUpdate.py 132.53s: lldb-api :: types/TestLongTypes.py 101.61s: lldb-api :: tools/lldb-server/TestLldbGdbServer.py 83.01s: lldb-api :: lang/objc/exceptions/TestObjCExceptions.py 62.22s: lldb-api :: commands/gui/basicdebug/TestGuiBasicDebug.py 56.64s: lldb-api :: commands/expression/po_verbosity/TestPoVerbosity.py 54.87s: lldb-api :: lang/objc/hidden-ivars/TestHiddenIvars.py 53.17s: lldb-api :: lang/objc/foundation/TestObjCMethods.py 52.41s: lldb-api :: functionalities/completion/TestCompletion.py 52.29s: lldb-api :: lang/c/blocks/TestBlocks.py 50.32s: lldb-api :: lang/objc/foundation/TestFoundationDisassembly.py 50.03s: lldb-api :: api/multithreaded/TestMultithreaded.py 49.57s: lldb-api :: functionalities/tsan/multiple/TestTsanMultiple.py 49.42s: lldb-api :: functionalities/tsan/global_location/TestTsanGlobalLocation.py 48.91s: lldb-api :: lang/objc/foundation/TestObjCMethodsString.py 46.82s: lldb-api :: lang/objc/orderedset/TestOrderedSet.py 46.35s: lldb-shell :: Breakpoint/ppc64-localentry.test

Hide Details

Tests Times: -------------------------------------------------------------------------- [ Range ] :: [ Percentage ] :: [ Count ] -------------------------------------------------------------------------- [380s,400s) :: [ ] :: [ 1/2154] [360s,380s) :: [ ] :: [ 0/2154] [340s,360s) :: [ ] :: [ 0/2154] [320s,340s) :: [ ] :: [ 0/2154] [300s,320s) :: [ ] :: [ 0/2154] [280s,300s) :: [ ] :: [ 0/2154] [260s,280s) :: [ ] :: [ 0/2154] [240s,260s) :: [ ] :: [ 0/2154] [220s,240s) :: [ ] :: [ 0/2154] [200s,220s) :: [ ] :: [ 0/2154] [180s,200s) :: [ ] :: [ 1/2154] [160s,180s) :: [ ] :: [ 1/2154] [140s,160s) :: [ ] :: [ 1/2154] [120s,140s) :: [ ] :: [ 1/2154] [100s,120s) :: [ ] :: [ 1/2154] [ 80s,100s) :: [ ] :: [ 1/2154] [ 60s, 80s) :: [ ] :: [ 1/2154] [ 40s, 60s) :: [ ] :: [ 18/2154] [ 20s, 40s) :: [ ] :: [ 34/2154] [ 0s, 20s) :: [************************************** ] :: [2094/2154] -------------------------------------------------------------------------- ******************** Failed Tests (1): lldb-api :: commands/gui/basicdebug/TestGuiBasicDebug.py

Hide Details

Hide Details

Testing Time: 1917.34s Unsupported : 153 Passed : 1994 Expectedly Failed: 6 Failed : 1 FAILED: tools/lldb/test/CMakeFiles/check-lldb-lit cd /Users/buildslave/jenkins/workspace/lldb-cmake/lldb-build/tools/lldb/test && /usr/local/Frameworks/Python.framework/Versions/3.7/bin/python3.7 /Users/buildslave/jenkins/workspace/lldb-cmake/lldb-build/./bin/llvm-lit -v --time-tests --shuffle --xunit-xml-output=/Users/buildslave/jenkins/workspace/lldb-cmake/test/results.xml -v -j 4 /Users/buildslave/jenkins/workspace/lldb-cmake/lldb-build/tools/lldb/test ninja: build stopped: subcommand failed. Command failed: Command '['/usr/bin/env', 'TERM=vt100', '/usr/local/bin/ninja', '-v', 'check-lldb']' returned non-zero exit status 1 Command: ['/usr/bin/env', 'TERM=vt100', '/usr/local/bin/ninja', '-v', 'check-lldb'] [Pipeline] } [Pipeline] // timeout [Pipeline] } [Pipeline] // stage [Pipeline] stage [Pipeline] { (Declarative: Post Actions) [Pipeline] scanForIssues [Clang (LLVM based)] Sleeping for 5 seconds due to JENKINS-32191... [Clang (LLVM based)] Parsing console log (workspace: '/Users/buildslave/jenkins/workspace/lldb-cmake') [Clang (LLVM based)] Successfully parsed console log [Clang (LLVM based)] -> found 9 issues (skipped 12 duplicates) [Clang (LLVM based)] Post processing issues on 'green-dragon-10' with source code encoding 'UTF-8' [Clang (LLVM based)] Creating SCM blamer to obtain author and commit information for affected files [Clang (LLVM based)] Creating SCM miner to obtain statistics for affected repository files [Clang (LLVM based)] Resolving file names for all issues in source directory '/Users/buildslave/jenkins/workspace/lldb-cmake' [Clang (LLVM based)] -> resolved paths in source directory (7 found, 0 not found) [Clang (LLVM based)] Resolving module names from module definitions (build.xml, pom.xml, or Manifest.mf files) [Clang (LLVM based)] -> resolved module names for 9 issues [Clang (LLVM based)] Resolving package names (or namespaces) by parsing the affected files [Clang (LLVM based)] -> resolved package names of 7 affected files [Clang (LLVM based)] No filter has been set, publishing all 9 issues [Clang (LLVM based)] Creating fingerprints for all affected code blocks to track issues over different builds [Clang (LLVM based)] -> created fingerprints for 9 issues (skipped 0 issues) [Clang (LLVM based)] Copying affected files to Jenkins' build folder '/Users/Shared/Jenkins/Home/jobs/lldb-cmake/builds/24024/files-with-issues' [Clang (LLVM based)] -> 5 copied, 2 not in workspace, 0 not-found, 0 with I/O error [Pipeline] junit Recording test results [Pipeline] } [Pipeline] // stage [Pipeline] } [Pipeline] // withEnv [Pipeline] } [Pipeline] // node [Pipeline] End of Pipeline ERROR: script returned exit code 1 Finished: FAILURE