FailedConsole Output

Skipping 9,111 KB.. Full Log

Hide Details

int main(int argc, char **argv) {  4 x` func(); // Break here 5 x func(); // Second 6 x return 0; 7 x } 8 x(int) argc = 1 `q(char **) argv = 0x00007ffeefbff89818ddfunc int func() { ` return 1; // In function <<< Thread 1: step in }  4 x       0a4f runningmain extern int func();  int main(int argc, char **argv) {  4 x func(); // Break here 5 x` func(); // Second <<< Thread 1: step out 6 x return 0; 7 x } 8 x(int) argc = 1 `q(char **) argv = 0x00007ffeefbff898stoppedThread: 0x6ba026 Frame: 0 PC = 0x0000000100000f8dsettings set interpreter.prompt-on-quit false quit  running

Hide Details

Hide Details

extern int func();

Hide Details

Hide Details

Hide Details

 func(); // Secondfunc int func() { ` return 1; // In function <<< Thread 1: step in }  4 x       stoppedThread: 0x6ba026 Frame: 0 PC = 0x0000000100000fa4

Hide Details

Hide Details

Hide Details

 2  running  exited with status = 0libstdcxx tests will not be run because: Don't know how to build with libstdcxx on macosx Skipping following debug info categories: ['dwo']

Hide Details

-- Command Output (stderr): --

Hide Details

Session logs for test failures/errors/unexpected successes will go into directory '/Users/buildslave/jenkins/workspace/lldb-cmake/lldb-build/lldb-test-traces' Change dir to: /Users/buildslave/jenkins/workspace/lldb-cmake/llvm-project/lldb/test/API/commands/gui/basicdebug runCmd: settings clear -all output:

Hide Details

runCmd: settings set symbols.enable-external-lookup false output:

Hide Details

runCmd: settings set target.inherit-tcc true output:

Hide Details

runCmd: settings set target.auto-apply-fixits false output:

Hide Details

runCmd: settings set plugin.process.gdb-remote.packet-timeout 60 output:

Hide Details

runCmd: settings set symbols.clang-modules-cache-path "/Users/buildslave/jenkins/workspace/lldb-cmake/lldb-build/lldb-test-build.noindex/module-cache-lldb/lldb-api" output:

Hide Details

runCmd: settings set use-color false output:

Hide Details

runCmd: setting set target.prefer-dynamic-value no-dynamic-values output:

Hide Details

FAIL: LLDB (/Users/buildslave/jenkins/workspace/lldb-cmake/lldb-build/bin/clang-x86_64) :: test_gui (TestGuiBasicDebug.TestGuiBasicDebugCommandTest) tearing down the child process....

Hide Details

Restore dir to: /Users/buildslave/jenkins/workspace/lldb-cmake/lldb-build/tools/lldb/test ====================================================================== ERROR: test_gui (TestGuiBasicDebug.TestGuiBasicDebugCommandTest) ---------------------------------------------------------------------- Traceback (most recent call last): File "/Users/buildslave/jenkins/workspace/lldb-cmake/llvm-project/lldb/third_party/Python/module/pexpect-4.6/pexpect/expect.py", line 111, in expect_loop incoming = spawn.read_nonblocking(spawn.maxread, timeout) File "/Users/buildslave/jenkins/workspace/lldb-cmake/llvm-project/lldb/third_party/Python/module/pexpect-4.6/pexpect/pty_spawn.py", line 482, in read_nonblocking raise TIMEOUT('Timeout exceeded.') pexpect.exceptions.TIMEOUT: Timeout exceeded.

Hide Details

During handling of the above exception, another exception occurred:

Hide Details

Traceback (most recent call last): File "/Users/buildslave/jenkins/workspace/lldb-cmake/llvm-project/lldb/packages/Python/lldbsuite/test/decorators.py", line 134, in wrapper return func(*args, **kwargs) File "/Users/buildslave/jenkins/workspace/lldb-cmake/llvm-project/lldb/packages/Python/lldbsuite/test/decorators.py", line 104, in wrapper func(*args, **kwargs) File "/Users/buildslave/jenkins/workspace/lldb-cmake/llvm-project/lldb/test/API/commands/gui/basicdebug/TestGuiBasicDebug.py", line 40, in test_gui self.child.expect("func\(\); // Break here[^\r\n]+<<< Thread 1: step out") File "/Users/buildslave/jenkins/workspace/lldb-cmake/llvm-project/lldb/third_party/Python/module/pexpect-4.6/pexpect/spawnbase.py", line 341, in expect timeout, searchwindowsize, async_) File "/Users/buildslave/jenkins/workspace/lldb-cmake/llvm-project/lldb/third_party/Python/module/pexpect-4.6/pexpect/spawnbase.py", line 369, in expect_list return exp.expect_loop(timeout) File "/Users/buildslave/jenkins/workspace/lldb-cmake/llvm-project/lldb/third_party/Python/module/pexpect-4.6/pexpect/expect.py", line 119, in expect_loop return self.timeout(e) File "/Users/buildslave/jenkins/workspace/lldb-cmake/llvm-project/lldb/third_party/Python/module/pexpect-4.6/pexpect/expect.py", line 82, in timeout raise TIMEOUT(msg) pexpect.exceptions.TIMEOUT: Timeout exceeded. <pexpect.pty_spawn.spawn object at 0x1109ecda0> command: /Users/buildslave/jenkins/workspace/lldb-cmake/lldb-build/bin/lldb args: ['/Users/buildslave/jenkins/workspace/lldb-cmake/lldb-build/bin/lldb', '--no-lldbinit', '--no-use-colors', '-O', 'settings clear -all', '-O', 'settings set symbols.enable-external-lookup false', '-O', 'settings set target.inherit-tcc true', '-O', 'settings set target.auto-apply-fixits false', '-O', 'settings set plugin.process.gdb-remote.packet-timeout 60', '-O', 'settings set symbols.clang-modules-cache-path "/Users/buildslave/jenkins/workspace/lldb-cmake/lldb-build/lldb-test-build.noindex/module-cache-lldb/lldb-api"', '-O', 'settings set use-color false', '-O', 'setting set target.prefer-dynamic-value no-dynamic-values', '--file', '/Users/buildslave/jenkins/workspace/lldb-cmake/lldb-build/lldb-test-build.noindex/commands/gui/basicdebug/TestGuiBasicDebug.test_gui/a.out'] buffer (last 100 chars): b'07ffeefbff898\x1b[100;19Hstopped\x1b[100;41HThread: 0x6ba026 Frame: 0 PC = 0x0000000100000f8d\x1b[m\x0f\x1b[H' before (last 100 chars): b'07ffeefbff898\x1b[100;19Hstopped\x1b[100;41HThread: 0x6ba026 Frame: 0 PC = 0x0000000100000f8d\x1b[m\x0f\x1b[H' after: <class 'pexpect.exceptions.TIMEOUT'> match: None match_index: None exitstatus: None flag_eof: False pid: 74484 child_fd: 6 closed: False timeout: 30 delimiter: <class 'pexpect.exceptions.EOF'> logfile: <_io.BufferedWriter name='<stdout>'> logfile_read: None logfile_send: None maxread: 2000 ignorecase: False searchwindowsize: None delaybeforesend: 0.05 delayafterclose: 0.1 delayafterterminate: 0.1 searcher: searcher_re: 0: re.compile(b'func\\(\\); // Break here[^\r\n]+<<< Thread 1: step out') Config=x86_64-/Users/buildslave/jenkins/workspace/lldb-cmake/lldb-build/bin/clang ---------------------------------------------------------------------- Ran 1 test in 62.068s

Hide Details

RESULT: FAILED (0 passes, 0 failures, 1 errors, 0 skipped, 0 expected failures, 0 unexpected successes)

Hide Details

--

Hide Details

******************** PASS: lldb-api :: functionalities/data-formatter/data-formatter-objc/TestDataFormatterObjCNSData.py (697 of 2154) PASS: lldb-unit :: ScriptInterpreter/Python/./ScriptInterpreterPythonTests/PythonDataObjectsTest.TestObjectAttributes (698 of 2154) UNSUPPORTED: lldb-shell :: SymbolFile/NativePDB/stack_unwinding01.cpp (699 of 2154) PASS: lldb-api :: functionalities/dlopen_other_executable/TestDlopenOtherExecutable.py (700 of 2154) PASS: lldb-api :: commands/log/basic/TestLogging.py (701 of 2154) PASS: lldb-api :: python_api/signals/TestSignalsAPI.py (702 of 2154) PASS: lldb-unit :: Utility/./UtilityTests/DataExtractorTest.GetCStrAtNullOffset (703 of 2154) PASS: lldb-api :: functionalities/var_path/TestVarPath.py (704 of 2154) UNSUPPORTED: lldb-api :: android/platform/TestDefaultCacheLineSize.py (705 of 2154) PASS: lldb-unit :: Utility/./UtilityTests/UriParserTest.SchemeHostSeparator4 (706 of 2154) PASS: lldb-unit :: Utility/./UtilityTests/StreamTest.PutBytesAsRawHex8ToBigEndian (707 of 2154) PASS: lldb-unit :: Utility/./UtilityTests/UUIDTest.SetFromStringRef (708 of 2154) PASS: lldb-api :: commands/expression/persistent_types/TestNestedPersistentTypes.py (709 of 2154) PASS: lldb-shell :: Commands/command-thread-select.test (710 of 2154) PASS: lldb-unit :: Language/Highlighting/./HighlighterTests/HighlighterTest.ClangPPDirectives (711 of 2154) PASS: lldb-shell :: ScriptInterpreter/None/import_module.test (712 of 2154) PASS: lldb-unit :: Process/minidump/./LLDBMinidumpTests/MinidumpParserTest.GetPidWow64 (713 of 2154) PASS: lldb-unit :: Instruction/./EmulatorTests/TestAArch64Emulator.TestOverflow (714 of 2154) PASS: lldb-unit :: Utility/./UtilityTests/StreamTest.PutCharNull (715 of 2154) PASS: lldb-api :: tools/lldb-server/commandline/TestStubSetSID.py (716 of 2154) PASS: lldb-unit :: Utility/./UtilityTests/StringExtractorTest.GetHexU8_Exact_NoEof (717 of 2154) PASS: lldb-unit :: Utility/./UtilityTests/DataExtractorTest.GetMaxS64 (718 of 2154) UNSUPPORTED: lldb-shell :: SymbolFile/PDB/type-quals.test (719 of 2154) PASS: lldb-shell :: SymbolFile/DWARF/dwp.s (720 of 2154) PASS: lldb-unit :: Target/./TargetTests/PathMappingListTest.AbsoluteTests (721 of 2154) PASS: lldb-unit :: Process/gdb-remote/./ProcessGdbRemoteTests/GDBRemoteCommunicationClientTest.SendGetTraceConfigPacket (722 of 2154) PASS: lldb-unit :: Utility/./UtilityTests/RangeTest.ClearWithStarAddress (723 of 2154) UNSUPPORTED: lldb-api :: tools/intel-features/intel-pt/test/TestIntelPTSimpleBinary.py (724 of 2154) PASS: lldb-api :: lang/cpp/extern_c/TestExternCSymbols.py (725 of 2154) UNSUPPORTED: lldb-api :: benchmarks/continue/TestBenchmarkContinue.py (726 of 2154) PASS: lldb-api :: python_api/value/TestValueAPI.py (727 of 2154) PASS: lldb-api :: functionalities/breakpoint/source_regexp/TestSourceRegexBreakpoints.py (728 of 2154) PASS: lldb-unit :: Utility/./UtilityTests/OptionsWithRawTest.EmptyArgsOnlySuffix (729 of 2154) PASS: lldb-unit :: Expression/./ExpressionTests/ClangHostTest.ComputeClangResourceDirectory (730 of 2154) PASS: lldb-unit :: Utility/./UtilityTests/RangeTest.Clear (731 of 2154) PASS: lldb-unit :: Process/minidump/./LLDBMinidumpTests/MinidumpParserTest.GetMemoryRegionInfoLinuxMaps (732 of 2154) PASS: lldb-api :: functionalities/breakpoint/breakpoint_options/TestBreakpointOptions.py (733 of 2154) PASS: lldb-shell :: ObjectFile/ELF/PT_LOAD-empty.yaml (734 of 2154) PASS: lldb-api :: functionalities/gdb_remote_client/TestRegDefinitionInParts.py (735 of 2154) PASS: lldb-unit :: ScriptInterpreter/Python/./ScriptInterpreterPythonTests/PythonDataObjectsTest.TestDictionaryResolutionWithDot (736 of 2154) PASS: lldb-unit :: ScriptInterpreter/Python/./ScriptInterpreterPythonTests/PythonDataObjectsTest.TestPythonString (737 of 2154) PASS: lldb-api :: functionalities/data-formatter/data-formatter-stl/libcxx/string/TestDataFormatterLibcxxString.py (738 of 2154) PASS: lldb-api :: functionalities/thread/step_until/TestStepUntil.py (739 of 2154) UNSUPPORTED: lldb-api :: functionalities/breakpoint/hardware_breakpoints/write_memory_with_hw_breakpoint/TestWriteMemoryWithHWBreakpoint.py (740 of 2154) PASS: lldb-unit :: Utility/./UtilityTests/SubsystemRAIITest.SubsystemWithErrorFailure (741 of 2154) UNSUPPORTED: lldb-api :: benchmarks/libcxxlist/TestBenchmarkLibcxxList.py (742 of 2154) UNSUPPORTED: lldb-api :: functionalities/data-formatter/data-formatter-stl/libstdcpp/map/TestDataFormatterStdMap.py (743 of 2154) PASS: lldb-shell :: Quit/TestQuitExitCodeHexA.test (744 of 2154) PASS: lldb-api :: commands/breakpoint/command/list/TestBreakpointCommandList.py (745 of 2154) PASS: lldb-api :: functionalities/thread/concurrent_events/TestConcurrentBreakpointDelayBreakpointOneSignal.py (746 of 2154) PASS: lldb-api :: functionalities/data-formatter/ostypeformatting/TestFormattersOsType.py (747 of 2154) PASS: lldb-unit :: SymbolFile/DWARF/./SymbolFileDWARFTests/XcodeSDKModuleTests.TestModuleGetXcodeSDK (748 of 2154) UNSUPPORTED: lldb-api :: linux/thread/create_during_instruction_step/TestCreateDuringInstructionStep.py (749 of 2154) PASS: lldb-shell :: SymbolFile/DWARF/debug_loc_and_loclists.s (750 of 2154) PASS: lldb-unit :: Utility/./UtilityTests/StringListTest.AppendStringStdString (751 of 2154) PASS: lldb-api :: functionalities/thread/num_threads/TestNumThreads.py (752 of 2154) PASS: lldb-unit :: Process/gdb-remote/./ProcessGdbRemoteTests/GDBRemoteCommunicationClientTest.ReadRegister (753 of 2154) PASS: lldb-shell :: Driver/TestError.test (754 of 2154) PASS: lldb-api :: commands/target/select/TestTargetSelect.py (755 of 2154) PASS: lldb-shell :: SymbolFile/NativePDB/break-by-line.cpp (756 of 2154) PASS: lldb-unit :: Utility/./UtilityTests/StreamTest.PutBytesAsRawHex8ToLittleEndian (757 of 2154) PASS: lldb-api :: lang/objcxx/class-name-clash/TestNameClash.py (758 of 2154) PASS: lldb-api :: lang/c/step-target/TestStepTarget.py (759 of 2154) UNSUPPORTED: lldb-api :: functionalities/thread/break_after_join/TestBreakAfterJoin.py (760 of 2154) PASS: lldb-shell :: Driver/TestRepl.test (761 of 2154) PASS: lldb-unit :: Utility/./UtilityTests/XcodeSDKTest.SDKSupportsSwift (762 of 2154) UNSUPPORTED: lldb-shell :: ScriptInterpreter/Lua/lua-python.test (763 of 2154) UNSUPPORTED: lldb-api :: linux/add-symbols/TestTargetSymbolsAddCommand.py (764 of 2154) PASS: lldb-api :: functionalities/conditional_break/TestConditionalBreak.py (765 of 2154) PASS: lldb-shell :: SymbolFile/DWARF/debug-line-basic.s (766 of 2154) PASS: lldb-api :: macosx/thread_suspend/TestInternalThreadSuspension.py (767 of 2154) PASS: lldb-unit :: Utility/./UtilityTests/ProcessInstanceInfo.Dump (768 of 2154) PASS: lldb-api :: lang/cpp/unique-types/TestUniqueTypes.py (769 of 2154) PASS: lldb-unit :: Symbol/./SymbolTests/SymbolsTest.TerminateLocateExecutableSymbolFileForUnknownExecutableAndUnknownSymbolFile (770 of 2154) PASS: lldb-shell :: SymbolFile/DWARF/find-inline-method.s (771 of 2154) PASS: lldb-unit :: Utility/./UtilityTests/ArgsTest.StringListConstructor (772 of 2154) PASS: lldb-unit :: Target/./TargetTests/ExecutionContextTest.GetByteOrder (773 of 2154) PASS: lldb-api :: functionalities/data-formatter/data-formatter-stl/libcxx/unordered/TestDataFormatterUnordered.py (774 of 2154) PASS: lldb-unit :: Utility/./UtilityTests/RangeTest.SlideZero (775 of 2154) PASS: lldb-shell :: Commands/command-disassemble-process.yaml (776 of 2154) PASS: lldb-api :: lang/objc/unicode-string/TestUnicodeString.py (777 of 2154) PASS: lldb-api :: functionalities/data-formatter/ptr_ref_typedef/TestPtrRef2Typedef.py (778 of 2154) PASS: lldb-api :: types/TestIntegerTypeExpr.py (779 of 2154) PASS: lldb-shell :: ObjectFile/ELF/base-address.yaml (780 of 2154) PASS: lldb-unit :: Host/./HostTests/FileSystemTest.Resolve (781 of 2154) PASS: lldb-unit :: Utility/./UtilityTests/StringListTest.SplitIntoLinesEmpty (782 of 2154) PASS: lldb-api :: lang/c/conflicting-symbol/TestConflictingSymbol.py (783 of 2154) PASS: lldb-unit :: Utility/./UtilityTests/ArchSpecTest.Compatibility (784 of 2154) PASS: lldb-api :: functionalities/ptr_refs/TestPtrRefs.py (785 of 2154) PASS: lldb-unit :: Utility/./UtilityTests/BinaryStreamTest.PutSLEB128Zero (786 of 2154) PASS: lldb-unit :: Language/Highlighting/./HighlighterTests/HighlighterTest.ClangTrailingBackslashBeforeNewline (787 of 2154) PASS: lldb-api :: commands/watchpoints/watchpoint_commands/condition/TestWatchpointConditionCmd.py (788 of 2154) PASS: lldb-api :: functionalities/thread/concurrent_events/TestConcurrentTwoBreakpointsOneSignal.py (789 of 2154) PASS: lldb-unit :: ScriptInterpreter/Python/./ScriptInterpreterPythonTests/PythonDataObjectsTest.TestInstanceNameResolutionNoDot (790 of 2154) PASS: lldb-api :: functionalities/value_md5_crash/TestValueMD5Crash.py (791 of 2154) PASS: lldb-shell :: SymbolFile/DWARF/DW_AT_location-DW_AT_const_value.s (792 of 2154) PASS: lldb-shell :: Driver/TestCommands.test (793 of 2154) PASS: lldb-unit :: debugserver/./debugserverTests/JSON.Parse (794 of 2154) PASS: lldb-unit :: Utility/./UtilityTests/StringListTest.JoinNonSpace (795 of 2154) PASS: lldb-api :: lang/c/forward/TestForwardDeclaration.py (796 of 2154) PASS: lldb-unit :: Symbol/./SymbolTests/LineEntryTest.GetSameLineContiguousAddressRangeNestedInline (797 of 2154) PASS: lldb-shell :: ObjectFile/MachO/lc_version_min.yaml (798 of 2154) PASS: lldb-unit :: ScriptInterpreter/Python/./ScriptInterpreterPythonTests/PythonDataObjectsTest.TestPythonTupleInitializerList2 (799 of 2154) PASS: lldb-unit :: Language/Highlighting/./HighlighterTests/HighlighterTest.DefaultHighlighter (800 of 2154) PASS: lldb-api :: lang/cpp/type_lookup/TestCppTypeLookup.py (801 of 2154) PASS: lldb-unit :: Utility/./UtilityTests/StreamTest.PutRawBytesToBigEndian (802 of 2154) PASS: lldb-unit :: Utility/./UtilityTests/RangeTest.EqualInvalid (803 of 2154) PASS: lldb-api :: commands/target/stop-hook/disable/TestTargetStopHookDisable.py (804 of 2154) PASS: lldb-api :: functionalities/unwind/noreturn/module-end/TestNoReturnModuleEnd.py (805 of 2154) PASS: lldb-api :: python_api/value/linked_list/TestValueAPILinkedList.py (806 of 2154) PASS: lldb-api :: commands/frame/diagnose/dereference-argument/TestDiagnoseDereferenceArgument.py (807 of 2154) PASS: lldb-api :: terminal/TestEditline.py (808 of 2154) PASS: lldb-api :: lang/cpp/subst_template_type_param/TestSubstTemplateTypeParam.py (809 of 2154) PASS: lldb-api :: macosx/thread-names/TestInterruptThreadNames.py (810 of 2154) UNSUPPORTED: lldb-shell :: SymbolFile/PDB/enums-layout.test (811 of 2154) PASS: lldb-unit :: Utility/./UtilityTests/ArchSpecTest.TestParseMachCPUDashSubtypeTripleExtra (812 of 2154) PASS: lldb-unit :: ObjectFile/ELF/./ObjectFileELFTests/ObjectFileELFTest.GetSymtab_NoSymEntryPointArmThumbAddressClass (813 of 2154) PASS: lldb-api :: functionalities/data-formatter/data-formatter-stl/libcxx/atomic/TestLibCxxAtomic.py (814 of 2154) PASS: lldb-api :: lang/objc/foundation/TestObjCMethods.py (815 of 2154) PASS: lldb-unit :: Utility/./UtilityTests/StringExtractorTest.GetHexU8_Extra_NoEof (816 of 2154) PASS: lldb-api :: commands/watchpoints/watchpoint_size/TestWatchpointSizes.py (817 of 2154) PASS: lldb-unit :: Utility/./UtilityTests/StringListTest.JoinEmpty (818 of 2154) PASS: lldb-shell :: SymbolFile/NativePDB/bitfields.cpp (819 of 2154) PASS: lldb-api :: commands/expression/multiline-navigation/TestMultilineNavigation.py (820 of 2154) PASS: lldb-unit :: Utility/./UtilityTests/BinaryStreamTest.PutSLEB128FourBytes (821 of 2154) PASS: lldb-api :: lang/cpp/stl/TestStdCXXDisassembly.py (822 of 2154) PASS: lldb-api :: tools/lldb-server/TestGdbRemoteExpeditedRegisters.py (823 of 2154) UNSUPPORTED: lldb-shell :: SymbolFile/PDB/variables.test (824 of 2154) PASS: lldb-unit :: Symbol/./SymbolTests/TestTypeSystemClang.TestGetTypeClassTypeOfExpr (825 of 2154) PASS: lldb-shell :: Watchpoint/SetErrorCases.test (826 of 2154) PASS: lldb-shell :: ScriptInterpreter/Python/python.test (827 of 2154) PASS: lldb-api :: commands/source/info/TestSourceInfo.py (828 of 2154) PASS: lldb-unit :: Symbol/./SymbolTests/SymbolsTest.LocateExecutableSymbolFileForUnknownExecutableAndMissingSymbolFile (829 of 2154) UNSUPPORTED: lldb-api :: commands/trace/TestTraceLoad.py (830 of 2154) PASS: lldb-api :: python_api/formatters/TestFormattersSBAPI.py (831 of 2154) UNSUPPORTED: lldb-shell :: Register/x86-ymm-read.test (832 of 2154) PASS: lldb-api :: lang/c/array_types/TestArrayTypes.py (833 of 2154) PASS: lldb-unit :: Utility/./UtilityTests/StreamTest.QuotedCString (834 of 2154) PASS: lldb-api :: functionalities/thread/concurrent_events/TestConcurrentTwoWatchpointsOneSignal.py (835 of 2154) PASS: lldb-unit :: Expression/./ExpressionTests/ClangExpressionDeclMapTest.TestUnknownIdentifierLookup (836 of 2154) PASS: lldb-unit :: Symbol/./SymbolTests/DWARFCallFrameInfoTest.Basic_dwarf4 (837 of 2154) PASS: lldb-unit :: Target/./TargetTests/PathMappingListTest.RemapRoot (838 of 2154) UNSUPPORTED: lldb-shell :: ScriptInterpreter/Lua/convenience_variables.test (839 of 2154) PASS: lldb-api :: functionalities/gdb_remote_client/TestRestartBug.py (840 of 2154) UNSUPPORTED: lldb-shell :: ScriptInterpreter/Lua/bindings.test (841 of 2154) PASS: lldb-unit :: ScriptInterpreter/Python/./ScriptInterpreterPythonTests/PythonDataObjectsTest.TestBorrowedReferences (842 of 2154) PASS: lldb-shell :: SymbolFile/DWARF/dwarf5_locations.s (843 of 2154) PASS: lldb-api :: functionalities/reproducers/attach/TestReproducerAttach.py (844 of 2154) PASS: lldb-unit :: Utility/./UtilityTests/StringListTest.Join (845 of 2154) PASS: lldb-unit :: DataFormatter/./LLDBFormatterTests/FormatManagerTests.CompatibleLangs (846 of 2154) PASS: lldb-api :: commands/frame/diagnose/dereference-function-return/TestDiagnoseDereferenceFunctionReturn.py (847 of 2154) PASS: lldb-unit :: Utility/./UtilityTests/RangeDataVector.FindEntryIndexesThatContain (848 of 2154) PASS: lldb-api :: lang/cpp/enum_types/TestCPP11EnumTypes.py (849 of 2154) PASS: lldb-api :: functionalities/data-formatter/var-in-aggregate-misuse/TestVarInAggregateMisuse.py (850 of 2154) UNSUPPORTED: lldb-api :: commands/expression/call-restarts/TestCallThatRestarts.py (851 of 2154) PASS: lldb-unit :: Utility/./UtilityTests/StringLexerTest.PutBack (852 of 2154) PASS: lldb-unit :: Utility/./UtilityTests/StreamTest.PutPtr (853 of 2154) PASS: lldb-unit :: UnwindAssembly/ARM64/./Arm64InstEmulationTests/TestArm64InstEmulation.TestMediumDarwinFunction (854 of 2154) PASS: lldb-unit :: Utility/./UtilityTests/StreamTest.PutHex32ByteOrderBig (855 of 2154) PASS: lldb-unit :: Symbol/./SymbolTests/DWARFCallFrameInfoTest.Basic_eh (856 of 2154) PASS: lldb-shell :: Driver/TestConvenienceVariables.test (857 of 2154) PASS: lldb-unit :: Utility/./UtilityTests/CompletionRequest.ShiftArguments (858 of 2154) UNSUPPORTED: lldb-api :: benchmarks/stepping/TestSteppingSpeed.py (859 of 2154) PASS: lldb-unit :: SymbolFile/DWARF/./SymbolFileDWARFTests/SymbolFileDWARFTests.TestAbbrevMissingTerminator (860 of 2154) PASS: lldb-unit :: Symbol/./SymbolTests/LineEntryTest.GetSameLineContiguousAddressRangeOneInline (861 of 2154) PASS: lldb-unit :: tools/lldb-server/tests/./LLDBServerTests/TestBase.LaunchModePreservesEnvironment (862 of 2154) PASS: lldb-api :: functionalities/data-formatter/data-formatter-objc/TestDataFormatterObjCKVO.py (863 of 2154) PASS: lldb-api :: lang/cpp/dynamic-value-same-basename/TestDynamicValueSameBase.py (864 of 2154) PASS: lldb-api :: types/TestDoubleTypesExpr.py (865 of 2154) PASS: lldb-unit :: Utility/./UtilityTests/BinaryStreamTest.PutULEB128NineBytes (866 of 2154) PASS: lldb-unit :: Utility/./UtilityTests/StringExtractorTest.GetNameColonValueSuccess (867 of 2154) PASS: lldb-api :: python_api/class_members/TestSBTypeClassMembers.py (868 of 2154) PASS: lldb-unit :: Utility/./UtilityTests/FileSpecTest.PrependPathComponent (869 of 2154) PASS: lldb-shell :: ObjectFile/MachO/lc_build_version_notools.yaml (870 of 2154) PASS: lldb-api :: lang/cpp/constructors/TestCppConstructors.py (871 of 2154) PASS: lldb-unit :: Expression/./ExpressionTests/DiagnosticManagerTest.AddDiagnostic (872 of 2154) PASS: lldb-unit :: Utility/./UtilityTests/NameMatchesTest.Ignore (873 of 2154) PASS: lldb-api :: lang/c/unicode/TestUnicodeSymbols.py (874 of 2154) PASS: lldb-api :: commands/expression/vector_of_enums/TestVectorOfEnums.py (875 of 2154) PASS: lldb-api :: functionalities/inferior-crashing/recursive-inferior/TestRecursiveInferiorStep.py (876 of 2154) PASS: lldb-unit :: Symbol/./SymbolTests/TestClangASTImporter.DeportDeclTagDecl (877 of 2154) PASS: lldb-shell :: SymbolFile/DWARF/module-ownership.mm (878 of 2154) PASS: lldb-api :: commands/command/delete/TestCommandDelete.py (879 of 2154) PASS: lldb-api :: lang/cpp/unicode-literals/TestUnicodeLiterals.py (880 of 2154) PASS: lldb-shell :: Breakpoint/jitbp_elf.test (881 of 2154) PASS: lldb-unit :: Utility/./UtilityTests/ArgsTest.EscapeLLDBCommandArgument (882 of 2154) UNSUPPORTED: lldb-api :: functionalities/darwin_log/filter/exact_match/activity/TestDarwinLogFilterMatchActivity.py (883 of 2154) PASS: lldb-api :: functionalities/inline-stepping/TestInlineStepping.py (884 of 2154) PASS: lldb-api :: types/TestIntegerType.py (885 of 2154) PASS: lldb-unit :: Utility/./UtilityTests/RecordReplayTest.InstrumentedFoo (886 of 2154) PASS: lldb-unit :: UnwindAssembly/x86/./UnwindAssemblyx86Tests/Testx86AssemblyInspectionEngine.TestPushR14 (887 of 2154) PASS: lldb-api :: commands/expression/inline-namespace/TestInlineNamespace.py (888 of 2154) PASS: lldb-unit :: SymbolFile/NativePDB/./SymbolFileNativePDBTests/PDBFPOProgramToDWARFExpressionTests.UnresolvedRegisterAssignmentReference (889 of 2154) PASS: lldb-unit :: Utility/./UtilityTests/DataExtractorTest.GetDoubleUnaligned (890 of 2154) PASS: lldb-shell :: Breakpoint/debug_rnglist_rlestartend.test (891 of 2154) UNSUPPORTED: lldb-api :: commands/watchpoints/variable_out_of_scope/TestWatchedVarHitWhenInScope.py (892 of 2154) PASS: lldb-unit :: Host/./HostTests/FileSystemTest.Readable (893 of 2154) PASS: lldb-unit :: Utility/./UtilityTests/ScalarTest.Equality (894 of 2154) PASS: lldb-unit :: SymbolFile/DWARF/./SymbolFileDWARFTests/SymbolFileDWARFTests.TestAbbrevOrder1Start1 (895 of 2154) PASS: lldb-unit :: Utility/./UtilityTests/StreamTeeTest.Constructor1Stream (896 of 2154) PASS: lldb-unit :: Utility/./UtilityTests/RangeTest.ContainsAddrInvalid (897 of 2154) PASS: lldb-unit :: Host/./HostTests/MainLoopTest.Signal (898 of 2154) PASS: lldb-unit :: SymbolFile/DWARF/./SymbolFileDWARFTests/SymbolFileDWARFTests.TestAbbrevValidAttrNullForm (899 of 2154) PASS: lldb-api :: functionalities/data-formatter/data-formatter-stl/libcxx/optional/TestDataFormatterLibcxxOptional.py (900 of 2154) PASS: lldb-unit :: ScriptInterpreter/Python/./ScriptInterpreterPythonTests/PythonDataObjectsTest.TestPythonIntegerToStructuredInteger (901 of 2154) PASS: lldb-api :: functionalities/unwind/sigtramp/TestSigtrampUnwind.py (902 of 2154) PASS: lldb-unit :: UnwindAssembly/x86/./UnwindAssemblyx86Tests/Testx86AssemblyInspectionEngine.TestSimple32bitFrameFunction (903 of 2154) PASS: lldb-shell :: ObjectFile/Breakpad/discontiguous-sections.test (904 of 2154) PASS: lldb-unit :: UnwindAssembly/x86/./UnwindAssemblyx86Tests/Testx86AssemblyInspectionEngine.TestSimplex86_64Augmented (905 of 2154) PASS: lldb-api :: lang/objc/bitfield_ivars/TestBitfieldIvars.py (906 of 2154) PASS: lldb-api :: python_api/get-value-32bit-int/TestGetValue32BitInt.py (907 of 2154) PASS: lldb-unit :: Signals/./SignalsTests/UnixSignalsTest.VersionChange (908 of 2154) PASS: lldb-unit :: Utility/./UtilityTests/StringListTest.InsertStringAtIndexOutOfBounds (909 of 2154) PASS: lldb-api :: lang/objc/foundation/TestRuntimeTypes.py (910 of 2154) PASS: lldb-shell :: Minidump/breakpad-symbols.test (911 of 2154) PASS: lldb-unit :: Utility/./UtilityTests/TimerTest.CategoryTimes2 (912 of 2154) PASS: lldb-unit :: SymbolFile/NativePDB/./SymbolFileNativePDBTests/PDBFPOProgramToDWARFExpressionTests.UnresolvedCyclicRegisterAssignmentReference (913 of 2154) PASS: lldb-api :: commands/expression/rdar44436068/Test128BitsInteger.py (914 of 2154) XFAIL: lldb-shell :: Register/x86-64-write.test (915 of 2154) PASS: lldb-unit :: Utility/./UtilityTests/ArgsTest.DoubleQuotedItem (916 of 2154) PASS: lldb-api :: functionalities/type_lookup/TestTypeLookup.py (917 of 2154) PASS: lldb-unit :: Utility/./UtilityTests/StringListTest.AppendListCStringArray (918 of 2154) UNSUPPORTED: lldb-shell :: SymbolFile/PDB/ast-restore.test (919 of 2154) PASS: lldb-unit :: Interpreter/./InterpreterTests/OptionValueFileColonLine.setFromString (920 of 2154) PASS: lldb-unit :: Process/minidump/./LLDBMinidumpTests/MinidumpParserTest.GetPid (921 of 2154) UNSUPPORTED: lldb-shell :: Register/x86-64-zmm-read.test (922 of 2154) PASS: lldb-unit :: Utility/./UtilityTests/DataExtractorTest.GetMaxU64_unchecked (923 of 2154) UNSUPPORTED: lldb-api :: functionalities/unwind/ehframe/TestEhFrameUnwind.py (924 of 2154) PASS: lldb-api :: functionalities/plugins/python_os_plugin/stepping_plugin_threads/TestOSPluginStepping.py (925 of 2154) PASS: lldb-shell :: Driver/TestSingleQuote.test (926 of 2154) PASS: lldb-api :: functionalities/non-overlapping-index-variable-i/TestIndexVariable.py (927 of 2154) PASS: lldb-api :: functionalities/data-formatter/refpointer-recursion/TestDataFormatterRefPtrRecursion.py (928 of 2154) PASS: lldb-unit :: Utility/./UtilityTests/Flags.Clear (929 of 2154) PASS: lldb-unit :: Utility/./UtilityTests/VMRange.ContainsRange (930 of 2154) PASS: lldb-api :: functionalities/tail_call_frames/disambiguate_paths_to_common_sink/TestDisambiguatePathsToCommonSink.py (931 of 2154) PASS: lldb-api :: commands/watchpoints/watchpoint_on_vectors/TestValueOfVectorVariable.py (932 of 2154) PASS: lldb-api :: functionalities/tsan/basic/TestTsanBasic.py (933 of 2154) PASS: lldb-api :: commands/command/nested_alias/TestNestedAlias.py (934 of 2154) PASS: lldb-unit :: Expression/./ExpressionTests/CppModuleConfigurationTest.Sysroot (935 of 2154) PASS: lldb-unit :: Utility/./UtilityTests/VMRange.Comparison (936 of 2154) PASS: lldb-shell :: SymbolFile/Breakpad/unwind-via-stack-win-no-memory-info.yaml (937 of 2154) UNSUPPORTED: lldb-shell :: SymbolFile/PDB/calling-conventions.test (938 of 2154) PASS: lldb-api :: functionalities/data-formatter/data-formatter-skip-summary/TestDataFormatterSkipSummary.py (939 of 2154) PASS: lldb-shell :: SymbolFile/DWARF/debug-types-dwarf5.s (940 of 2154) UNSUPPORTED: lldb-api :: benchmarks/expression/TestRepeatedExprs.py (941 of 2154) PASS: lldb-unit :: Utility/./UtilityTests/FileSpecTest.GetPath (942 of 2154) PASS: lldb-unit :: Language/Highlighting/./HighlighterTests/HighlighterTest.ClangIdentifiers (943 of 2154) PASS: lldb-unit :: Utility/./UtilityTests/Predicate.WaitForValueNotEqualTo (944 of 2154) PASS: lldb-shell :: Reproducer/TestDSYM.test (945 of 2154) PASS: lldb-unit :: ScriptInterpreter/Python/./ScriptInterpreterPythonTests/PythonDataObjectsTest.TestTypeNameResolutionNoDot (946 of 2154) PASS: lldb-unit :: Process/gdb-remote/./ProcessGdbRemoteTests/GDBRemoteClientBaseTest.SendContinueAndWait (947 of 2154) PASS: lldb-unit :: Utility/./UtilityTests/ScalarTest.Scalar_512 (948 of 2154) PASS: lldb-api :: lang/objc/conflicting-definition/TestConflictingDefinition.py (949 of 2154) PASS: lldb-unit :: Interpreter/./InterpreterTests/OptionArgParserTest.toScriptLanguage (950 of 2154) UNSUPPORTED: lldb-api :: tools/lldb-server/platform-process-connect/TestPlatformProcessConnect.py (951 of 2154) PASS: lldb-api :: api/command-return-object/TestSBCommandReturnObject.py (952 of 2154) PASS: lldb-unit :: Utility/./UtilityTests/RangeDataVector.CustomSort (953 of 2154) PASS: lldb-unit :: Utility/./UtilityTests/TimerTest.CategoryTimesNested (954 of 2154) PASS: lldb-unit :: Utility/./UtilityTests/StreamTeeTest.Flush (955 of 2154) UNSUPPORTED: lldb-api :: functionalities/darwin_log/filter/exact_match/message/TestDarwinLogFilterMatchMessage.py (956 of 2154) PASS: lldb-unit :: Utility/./UtilityTests/FileSpecTest.AppendPathComponent (957 of 2154) PASS: lldb-api :: functionalities/thread/concurrent_events/TestConcurrentDelayedCrashWithBreakpointWatchpoint.py (958 of 2154) PASS: lldb-api :: lang/cpp/this_class_type_mixing/TestThisClassTypeMixing.py (959 of 2154) PASS: lldb-shell :: ObjectFile/PECOFF/sections.yaml (960 of 2154) PASS: lldb-api :: lang/objc/foundation/TestObjCMethodsNSArray.py (961 of 2154) PASS: lldb-shell :: Reproducer/TestHomeDir.test (962 of 2154) PASS: lldb-api :: lang/cpp/auto/TestCPPAuto.py (963 of 2154) PASS: lldb-unit :: UnwindAssembly/PPC64/./PPC64InstEmulationTests/TestPPC64InstEmulation.TestSimpleFunction (964 of 2154) PASS: lldb-unit :: Utility/./UtilityTests/StreamTest.Indent (965 of 2154) PASS: lldb-api :: lang/cpp/template/TestTemplateArgs.py (966 of 2154) PASS: lldb-unit :: UnwindAssembly/ARM64/./Arm64InstEmulationTests/TestArm64InstEmulation.TestRegisterDoubleSpills (967 of 2154) PASS: lldb-unit :: Symbol/./SymbolTests/TestTypeSystemClang.TestIsClangType (968 of 2154) UNSUPPORTED: lldb-api :: functionalities/thread/concurrent_events/TestConcurrentManySignals.py (969 of 2154) XFAIL: lldb-shell :: SymbolFile/DWARF/find-type-in-function.cpp (970 of 2154) PASS: lldb-unit :: Utility/./UtilityTests/XcodeSDKTest.SDKSupportsModules (971 of 2154) PASS: lldb-unit :: Utility/./UtilityTests/StringListTest.CopyListEmpty (972 of 2154) PASS: lldb-unit :: Utility/./UtilityTests/StringExtractorTest.DecodeHexU8_Extra (973 of 2154) PASS: lldb-unit :: ScriptInterpreter/Python/./ScriptInterpreterPythonTests/PythonDataObjectsTest.TestPythonBytes (974 of 2154) PASS: lldb-unit :: Host/./HostTests/MainLoopTest.TerminatesImmediately (975 of 2154) PASS: lldb-api :: macosx/version_zero/TestGetVersionZeroVersion.py (976 of 2154) PASS: lldb-api :: lang/objc/objc-dyn-sbtype/TestObjCDynamicSBType.py (977 of 2154) PASS: lldb-api :: sanity/TestModuleCacheSanity.py (978 of 2154) PASS: lldb-api :: functionalities/data-formatter/data-formatter-stl/libcxx/iterator/TestDataFormatterLibccIterator.py (979 of 2154) PASS: lldb-api :: functionalities/postmortem/elf-core/TestLinuxCore.py (980 of 2154) PASS: lldb-unit :: Utility/./UtilityTests/StreamTest.PutRawBytesToMixedEndian (981 of 2154) PASS: lldb-unit :: Utility/./UtilityTests/StringListTest.Clear (982 of 2154) PASS: lldb-unit :: Utility/./UtilityTests/RangeTest.LessThanInvalid (983 of 2154) PASS: lldb-unit :: SymbolFile/DWARF/./SymbolFileDWARFTests/SymbolFileDWARFTests.TestAbbrevInvalidNULLTag (984 of 2154) PASS: lldb-unit :: Host/./HostTests/FileSystemTest.Exists (985 of 2154) PASS: lldb-api :: functionalities/history/TestHistoryRecall.py (986 of 2154) PASS: lldb-api :: python_api/function_symbol/TestSymbolAPI.py (987 of 2154) PASS: lldb-unit :: ObjectFile/ELF/./ObjectFileELFTests/ObjectFileELFTest.SectionsResolveConsistently (988 of 2154) PASS: lldb-unit :: debugserver/./debugserverTests/RNBSocket.LoopBackListenIPv6 (989 of 2154) PASS: lldb-shell :: ObjectFile/PECOFF/symbol.yaml (990 of 2154) PASS: lldb-api :: functionalities/data-formatter/format-propagation/TestFormatPropagation.py (991 of 2154) PASS: lldb-unit :: Utility/./UtilityTests/UriParserTest.MinimalPath (992 of 2154) PASS: lldb-unit :: Symbol/./SymbolTests/TestTypeSystemClang.TestNotDeletingUserCopyCstrDueToMoveCStr (993 of 2154) PASS: lldb-unit :: Thread/./ThreadTests/ThreadTest.SetStopInfo (994 of 2154) PASS: lldb-unit :: Utility/./UtilityTests/Flags.Test (995 of 2154) PASS: lldb-unit :: Process/gdb-remote/./ProcessGdbRemoteTests/GDBRemoteCommunicationClientTest.SyncThreadState (996 of 2154) PASS: lldb-shell :: SymbolFile/DWARF/split-dwarf-multiple-cu.ll (997 of 2154) PASS: lldb-shell :: SymbolFile/NativePDB/source-list.cpp (998 of 2154) PASS: lldb-api :: commands/expression/save_jit_objects/TestSaveJITObjects.py (999 of 2154) PASS: lldb-unit :: UnwindAssembly/x86/./UnwindAssemblyx86Tests/Testx86AssemblyInspectionEngine.TestSubESP (1000 of 2154) PASS: lldb-unit :: Utility/./UtilityTests/DataExtractorTest.GetFloat (1001 of 2154) PASS: lldb-unit :: Utility/./UtilityTests/CompletionRequest.FakeLastArg (1002 of 2154) PASS: lldb-unit :: Utility/./UtilityTests/ScalarTest.RightShiftOperator (1003 of 2154) PASS: lldb-shell :: Minidump/Windows/broken-unwind.test (1004 of 2154) PASS: lldb-api :: sanity/TestSettingSkipping.py (1005 of 2154) PASS: lldb-unit :: ObjectFile/Breakpad/./ObjectFileBreakpadTests/StackWinRecord.parse (1006 of 2154) PASS: lldb-api :: commands/expression/ignore-artificial-constructors/TestIgnoreArtificialConstructors.py (1007 of 2154) PASS: lldb-api :: commands/target/create-no-such-arch/TestNoSuchArch.py (1008 of 2154) UNSUPPORTED: lldb-shell :: SymbolFile/PDB/function-nested-block.test (1009 of 2154) PASS: lldb-api :: functionalities/thread/concurrent_events/TestConcurrentSignalDelayBreak.py (1010 of 2154) PASS: lldb-unit :: Core/./LLDBCoreTests/RichManglingContextTest.IPDRealloc (1011 of 2154) PASS: lldb-api :: lang/cpp/this/TestCPPThis.py (1012 of 2154) PASS: lldb-shell :: Driver/TestPositionalArgs.test (1013 of 2154) PASS: lldb-unit :: Language/CPlusPlus/./LanguageCPlusPlusTests/CPlusPlusLanguage.MethodNameParsing (1014 of 2154) PASS: lldb-api :: lang/c/local_variables/TestLocalVariables.py (1015 of 2154) PASS: lldb-unit :: Utility/./UtilityTests/StringExtractorTest.DecodeHexU8_Underflow2 (1016 of 2154) PASS: lldb-unit :: Utility/./UtilityTests/VMRange.Reset (1017 of 2154) PASS: lldb-api :: lang/cpp/static_methods/TestCPPStaticMethods.py (1018 of 2154) PASS: lldb-api :: functionalities/breakpoint/address_breakpoints/TestBadAddressBreakpoints.py (1019 of 2154) PASS: lldb-api :: functionalities/data-formatter/data-formatter-stl/libcxx/vector/TestDataFormatterLibcxxVector.py (1020 of 2154) PASS: lldb-unit :: ObjectFile/Breakpad/./ObjectFileBreakpadTests/PublicRecord.parse (1021 of 2154) PASS: lldb-unit :: Symbol/./SymbolTests/TestClangASTImporter.MetadataPropagation (1022 of 2154) PASS: lldb-api :: functionalities/gdb_remote_client/TestWriteMemory.py (1023 of 2154) PASS: lldb-unit :: Utility/./UtilityTests/RangeTest.SizeTypes (1024 of 2154) PASS: lldb-unit :: Host/./HostTests/NativeProcessProtocolTest.ReadCStringFromMemory (1025 of 2154) PASS: lldb-unit :: Utility/./UtilityTests/StringListTest.SplitIntoLines (1026 of 2154) PASS: lldb-shell :: ObjectFile/ELF/basic-info.yaml (1027 of 2154) PASS: lldb-unit :: Utility/./UtilityTests/PassiveReplayTest.InstrumentedBarRef (1028 of 2154) PASS: lldb-unit :: Host/./HostTests/SocketTest.TCPGetAddress (1029 of 2154) PASS: lldb-unit :: Process/gdb-remote/./ProcessGdbRemoteTests/GDBRemoteClientBaseTest.InterruptNoResponse (1030 of 2154) PASS: lldb-shell :: Quit/TestQuitExitCodeTooManyArgs.test (1031 of 2154) PASS: lldb-api :: macosx/duplicate-archive-members/TestDuplicateMembers.py (1032 of 2154) PASS: lldb-api :: commands/expression/regression-access-function-template-in-record/TestRegressionAccessFunctionTemplateInRecord.py (1033 of 2154) PASS: lldb-unit :: Utility/./UtilityTests/StringListTest.LongestCommonPrefixNoPrefix (1034 of 2154) PASS: lldb-api :: lang/c/record_decl_in_expr/TestRecordDeclInExpr.py (1035 of 2154) PASS: lldb-shell :: Breakpoint/implicit_const_form_support.test (1036 of 2154) PASS: lldb-api :: functionalities/signal/handle-abrt/TestHandleAbort.py (1037 of 2154) PASS: lldb-unit :: Process/minidump/./LLDBMinidumpTests/MinidumpParserTest.GetLinuxProcStatus_no_stream (1038 of 2154) PASS: lldb-unit :: Utility/./UtilityTests/FileSpecTest.Match (1039 of 2154) PASS: lldb-shell :: SymbolFile/DWARF/dir-separator-posix.s (1040 of 2154) PASS: lldb-api :: commands/command/invalid-args/TestInvalidArgsCommand.py (1041 of 2154) UNSUPPORTED: lldb-shell :: BuildScript/toolchain-msvc.test (1042 of 2154) PASS: lldb-api :: commands/target/dump-symtab-demangle/TestDumpSymtabDemangle.py (1043 of 2154) PASS: lldb-shell :: Driver/TestNoUseColor.test (1044 of 2154) PASS: lldb-unit :: Utility/./UtilityTests/XcodeSDKTest.FindXcodeContentsDirectoryInPath (1045 of 2154) PASS: lldb-shell :: Reproducer/TestFileRepro.test (1046 of 2154) PASS: lldb-unit :: Language/Highlighting/./HighlighterTests/HighlighterTest.ClangComments (1047 of 2154) UNSUPPORTED: lldb-api :: functionalities/thread/thread_specific_break_plus_condition/TestThreadSpecificBpPlusCondition.py (1048 of 2154) PASS: lldb-api :: functionalities/deleted-executable/TestDeletedExecutable.py (1049 of 2154) PASS: lldb-unit :: ScriptInterpreter/Python/./ScriptInterpreterPythonTests/PythonDataObjectsTest.TestExceptions (1050 of 2154) UNSUPPORTED: lldb-api :: functionalities/thread/multi_break/TestMultipleBreakpoints.py (1051 of 2154) PASS: lldb-api :: lang/c/global_variables/TestGlobalVariables.py (1052 of 2154) PASS: lldb-unit :: Process/gdb-remote/./ProcessGdbRemoteTests/GDBRemoteClientBaseTest.SendContinueDelegateInterface (1053 of 2154) PASS: lldb-api :: commands/statistics/basic/TestStats.py (1054 of 2154) PASS: lldb-shell :: Settings/TestModuleCacheSanity.test (1055 of 2154) PASS: lldb-api :: lang/cpp/call-function/TestCallCPPFunction.py (1056 of 2154) PASS: lldb-api :: tools/lldb-server/inferior-crash/TestGdbRemoteAbort.py (1057 of 2154) PASS: lldb-shell :: Settings/TestSettingsWrite.test (1058 of 2154) PASS: lldb-shell :: Reproducer/Modules/TestModuleCXX.test (1059 of 2154) PASS: lldb-api :: commands/process/launch-with-shellexpand/TestLaunchWithShellExpand.py (1060 of 2154) PASS: lldb-api :: functionalities/data-formatter/data-formatter-objc/TestDataFormatterObjNSException.py (1061 of 2154) PASS: lldb-shell :: Breakpoint/single-file-split-dwarf.test (1062 of 2154) PASS: lldb-unit :: Utility/./UtilityTests/SerializationRountripTest.SerializeDeserializeObjectPointer (1063 of 2154) PASS: lldb-unit :: Expression/./ExpressionTests/CppModuleConfigurationTest.IgnoreLibStdCpp (1064 of 2154) PASS: lldb-api :: functionalities/paths/TestPaths.py (1065 of 2154) PASS: lldb-unit :: Utility/./UtilityTests/BinaryStreamTest.PutSLEB128FiveBytes (1066 of 2154) PASS: lldb-unit :: UnwindAssembly/x86/./UnwindAssemblyx86Tests/Testx86AssemblyInspectionEngine.TestSimple64bitFrameFunction (1067 of 2154) PASS: lldb-shell :: SymbolFile/NativePDB/global-classes.cpp (1068 of 2154) PASS: lldb-api :: python_api/sbvalue_const_addrof/TestSBValueConstAddrOf.py (1069 of 2154) PASS: lldb-shell :: SymbolFile/DWARF/childless-compile-unit.s (1070 of 2154) PASS: lldb-unit :: ScriptInterpreter/Python/./ScriptInterpreterPythonTests/PythonDataObjectsTest.TestPythonInteger (1071 of 2154) PASS: lldb-unit :: Utility/./UtilityTests/StreamTest.PutStringAsRawHex8 (1072 of 2154) PASS: lldb-unit :: Utility/./UtilityTests/StringLexerTest.HasAtLeast (1073 of 2154) PASS: lldb-unit :: UnwindAssembly/x86/./UnwindAssemblyx86Tests/Testx86AssemblyInspectionEngine.TestPushESI (1074 of 2154) PASS: lldb-api :: python_api/watchpoint/watchlocation/TestTargetWatchAddress.py (1075 of 2154) PASS: lldb-unit :: Host/./HostTests/SocketTest.TCPListen0GetPort (1076 of 2154) PASS: lldb-unit :: Symbol/./SymbolTests/TestClangASTImporter.CopyDeclTagDecl (1077 of 2154) PASS: lldb-unit :: ObjectFile/PECOFF/./ObjectFilePECOFFTests/PECallFrameInfoTest.Frame_reg_eh (1078 of 2154) PASS: lldb-shell :: Quit/TestQuitExitCodeNonInt.test (1079 of 2154) PASS: lldb-unit :: Utility/./UtilityTests/UriParserTest.MinimalPortPath (1080 of 2154) PASS: lldb-unit :: Utility/./UtilityTests/GeneratorTest.Get (1081 of 2154) PASS: lldb-api :: functionalities/thread/ignore_suspended/TestIgnoreSuspendedThread.py (1082 of 2154) PASS: lldb-api :: python_api/exprpath_synthetic/TestExprPathSynthetic.py (1083 of 2154) PASS: lldb-unit :: Utility/./UtilityTests/StreamTest.AddressSuffix (1084 of 2154) PASS: lldb-unit :: Platform/./LLDBPlatformTests/PlatformAppleSimulatorTest.TestHostPlatformToSim (1085 of 2154) PASS: lldb-unit :: Utility/./UtilityTests/StreamTest.AddressPrefixAndSuffix (1086 of 2154) PASS: lldb-api :: functionalities/data-formatter/data-formatter-objc/TestDataFormatterObjCPlain.py (1087 of 2154) PASS: lldb-api :: functionalities/data-formatter/synthupdate/TestSyntheticFilterRecompute.py (1088 of 2154) PASS: lldb-unit :: Utility/./UtilityTests/IndexToObjectTest.ObjectForIndex (1089 of 2154) UNSUPPORTED: lldb-api :: benchmarks/libcxxmap/TestBenchmarkLibcxxMap.py (1090 of 2154) PASS: lldb-api :: functionalities/load_unload/TestLoadUnload.py (1091 of 2154) PASS: lldb-unit :: Utility/./UtilityTests/StringExtractorTest.GetHexU8_Underflow_NoEof (1092 of 2154) PASS: lldb-unit :: Process/minidump/./LLDBMinidumpTests/MinidumpParserTest.FindMemoryRange (1093 of 2154) PASS: lldb-unit :: Utility/./UtilityTests/StringListTest.LongestCommonPrefix (1094 of 2154) PASS: lldb-api :: python_api/name_lookup/TestNameLookup.py (1095 of 2154) PASS: lldb-api :: functionalities/data-formatter/data-formatter-objc/TestDataFormatterObjCNSBundle.py (1096 of 2154) PASS: lldb-api :: commands/expression/ir-interpreter/TestIRInterpreter.py (1097 of 2154) PASS: lldb-unit :: Expression/./ExpressionTests/ClangExpressionDeclMapTest.TestPersistentDeclLookup (1098 of 2154) PASS: lldb-unit :: Utility/./UtilityTests/RangeDataVector.FindEntryThatContains_Overlap (1099 of 2154) PASS: lldb-api :: functionalities/data-formatter/stringprinter/TestStringPrinter.py (1100 of 2154) PASS: lldb-api :: functionalities/optimized_code/TestNoASanExceptionAfterEvalOP_piece.py (1101 of 2154) PASS: lldb-api :: functionalities/thread/concurrent_events/TestConcurrentCrashWithWatchpointBreakpointSignal.py (1102 of 2154) PASS: lldb-unit :: Utility/./UtilityTests/ArchSpecTest.OperatorBool (1103 of 2154) PASS: lldb-api :: commands/expression/context-object/TestContextObject.py (1104 of 2154) PASS: lldb-shell :: Minidump/Windows/find-module.test (1105 of 2154) PASS: lldb-api :: functionalities/data-formatter/synthcapping/TestSyntheticCapping.py (1106 of 2154) UNSUPPORTED: lldb-shell :: Register/x86-64-xmm16-write.test (1107 of 2154) UNSUPPORTED: lldb-api :: macosx/macCatalystAppMacOSFramework/TestMacCatalystAppWithMacOSFramework.py (1108 of 2154) PASS: lldb-unit :: Utility/./UtilityTests/Flags.AllSet (1109 of 2154) PASS: lldb-shell :: ObjectFile/ELF/duplicate-section.yaml (1110 of 2154) PASS: lldb-unit :: Utility/./UtilityTests/GeneratorTest.Create (1111 of 2154) PASS: lldb-unit :: Utility/./UtilityTests/SerializationRountripTest.SerializeDeserializeCStringArrayNullptr (1112 of 2154) PASS: lldb-unit :: Process/minidump/./LLDBMinidumpTests/RegisterContextMinidump.CheckRegisterContextMinidump_ARM (1113 of 2154) PASS: lldb-unit :: Utility/./UtilityTests/StreamTest.AddressRangeEmptyRange (1114 of 2154) PASS: lldb-unit :: Utility/./UtilityTests/BinaryStreamTest.PutULEB128One (1115 of 2154) PASS: lldb-unit :: Utility/./UtilityTests/XcodeSDKTest.GetCanonicalNameAndConstruct (1116 of 2154) PASS: lldb-unit :: UnwindAssembly/x86/./UnwindAssemblyx86Tests/Testx86AssemblyInspectionEngine.TestPopRBPWithREX (1117 of 2154) PASS: lldb-shell :: ObjectFile/wasm/embedded-debug-sections.yaml (1118 of 2154) PASS: lldb-api :: commands/expression/radar_9673664/TestExprHelpExamples.py (1119 of 2154) PASS: lldb-unit :: Disassembler/./DisassemblerTests/TestArm64Disassembly.TestArmv81Instruction (1120 of 2154) PASS: lldb-unit :: Utility/./UtilityTests/PassiveReplayTest.InstrumentedFoo (1121 of 2154) PASS: lldb-unit :: Utility/./UtilityTests/ArgsTest.TestSingleQuotedArgWithSpace (1122 of 2154) PASS: lldb-unit :: Process/minidump/./LLDBMinidumpTests/MinidumpParserTest.MinidumpDuplicateModuleSeparateCode (1123 of 2154) PASS: lldb-shell :: ScriptInterpreter/Python/sb_address_exception.test (1124 of 2154) PASS: lldb-unit :: Utility/./UtilityTests/UriParserTest.Empty (1125 of 2154) PASS: lldb-shell :: ObjectFile/ELF/aarch64-relocations.yaml (1126 of 2154) PASS: lldb-unit :: Utility/./UtilityTests/EnvironmentTest.EnvpConversion (1127 of 2154) PASS: lldb-api :: commands/expression/diagnostics/TestExprDiagnostics.py (1128 of 2154) PASS: lldb-unit :: Utility/./UtilityTests/FileSpecTest.FileAndDirectoryComponents (1129 of 2154) PASS: lldb-unit :: Utility/./UtilityTests/LogChannelEnabledTest.LogGetLogThread (1130 of 2154) PASS: lldb-api :: functionalities/tail_call_frames/sbapi_support/TestTailCallFrameSBAPI.py (1131 of 2154) PASS: lldb-unit :: UnwindAssembly/x86/./UnwindAssemblyx86Tests/Testx86AssemblyInspectionEngine.TestPush0 (1132 of 2154) PASS: lldb-shell :: SymbolFile/DWARF/debug-types-dwo-cross-reference.cpp (1133 of 2154) PASS: lldb-api :: functionalities/data-formatter/pyobjsynthprovider/TestPyObjSynthProvider.py (1134 of 2154) UNSUPPORTED: lldb-api :: linux/mix-dwo-and-regular-objects/TestMixedDwarfBinary.py (1135 of 2154) PASS: lldb-api :: commands/session/history/TestSessionHistory.py (1136 of 2154) PASS: lldb-api :: tools/lldb-vscode/console/TestVSCode_console.py (1137 of 2154) PASS: lldb-api :: functionalities/thread/exit_during_break/TestExitDuringBreak.py (1138 of 2154) PASS: lldb-unit :: Utility/./UtilityTests/StreamTest.PutHex32ByteOrderLittle (1139 of 2154) PASS: lldb-unit :: Host/./HostTests/Host.GetEnvironment (1140 of 2154) XFAIL: lldb-shell :: Unwind/prefer-debug-over-eh-frame.test (1141 of 2154) PASS: lldb-api :: commands/frame/diagnose/local-variable/TestLocalVariable.py (1142 of 2154) PASS: lldb-shell :: SymbolFile/dissassemble-entry-point.s (1143 of 2154) PASS: lldb-unit :: Utility/./UtilityTests/ProcessInfoTest.Constructor (1144 of 2154) PASS: lldb-unit :: Process/minidump/./LLDBMinidumpTests/MinidumpParserTest.GetMemory (1145 of 2154) PASS: lldb-api :: iohandler/resize/TestIOHandlerResizeNoEditline.py (1146 of 2154) PASS: lldb-unit :: DataFormatter/./LLDBFormatterTests/TypeMatcherTests.RegexName (1147 of 2154) PASS: lldb-shell :: ObjectFile/ELF/section-overlap.yaml (1148 of 2154) PASS: lldb-shell :: Expr/TestMultilineExpr.test (1149 of 2154) PASS: lldb-unit :: Core/./LLDBCoreTests/RichManglingContextTest.FromCxxMethodName (1150 of 2154) PASS: lldb-unit :: Utility/./UtilityTests/UUIDTest.RelationalOperators (1151 of 2154) PASS: lldb-shell :: ObjectFile/ELF/many-sections.s (1152 of 2154) PASS: lldb-unit :: Utility/./UtilityTests/StreamTest.AddressRange (1153 of 2154) PASS: lldb-shell :: Reproducer/TestMultipleTargets.test (1154 of 2154) PASS: lldb-unit :: Utility/./UtilityTests/ConstStringTest.YAML (1155 of 2154) PASS: lldb-api :: lang/cpp/unsigned_types/TestUnsignedTypes.py (1156 of 2154) PASS: lldb-shell :: Quit/TestQuitExitCode30.test (1157 of 2154) PASS: lldb-api :: commands/expression/scoped_enums/TestScopedEnumType.py (1158 of 2154) PASS: lldb-unit :: ObjectFile/PECOFF/./ObjectFilePECOFFTests/PECallFrameInfoTest.Chained_eh (1159 of 2154) PASS: lldb-unit :: Target/./TargetTests/RemoteAwarePlatformTest.TestResolveExecutabelOnClientByPlatform (1160 of 2154) PASS: lldb-shell :: ObjectFile/MachO/symtab.yaml (1161 of 2154) PASS: lldb-unit :: Language/Highlighting/./HighlighterTests/HighlighterTest.ClangCommas (1162 of 2154) PASS: lldb-api :: lang/objc/objc-baseclass-sbtype/TestObjCBaseClassSBType.py (1163 of 2154) PASS: lldb-api :: commands/expression/weak_symbols/TestWeakSymbols.py (1164 of 2154) PASS: lldb-unit :: Process/minidump/./LLDBMinidumpTests/RegisterContextMinidump.ConvertMinidumpContext_x86_32 (1165 of 2154) PASS: lldb-api :: functionalities/avoids-fd-leak/TestFdLeak.py (1166 of 2154) PASS: lldb-unit :: Utility/./UtilityTests/StreamTest.PutULEB128 (1167 of 2154) PASS: lldb-unit :: Symbol/./SymbolTests/TestTypeSystemClang.TestGetEnumIntegerTypeUnexpectedType (1168 of 2154) PASS: lldb-api :: terminal/TestSTTYBeforeAndAfter.py (1169 of 2154) PASS: lldb-api :: python_api/findvalue_duplist/TestSBFrameFindValue.py (1170 of 2154) PASS: lldb-unit :: Utility/./UtilityTests/LogTest.Register (1171 of 2154) PASS: lldb-shell :: Reproducer/TestProcessList.test (1172 of 2154) PASS: lldb-api :: commands/process/attach-resume/TestAttachResume.py (1173 of 2154) UNSUPPORTED: lldb-api :: functionalities/darwin_log/filter/exact_match/category/TestDarwinLogFilterMatchCategory.py (1174 of 2154) PASS: lldb-api :: iohandler/unicode/TestUnicode.py (1175 of 2154) PASS: lldb-api :: commands/expression/timeout/TestCallWithTimeout.py (1176 of 2154) PASS: lldb-unit :: Utility/./UtilityTests/OptionsWithRawTest.WhitespaceInput (1177 of 2154) PASS: lldb-unit :: Utility/./UtilityTests/StreamTest.PutCStringWithStringRef (1178 of 2154) PASS: lldb-api :: functionalities/show_location/TestShowLocationDwarf5.py (1179 of 2154) PASS: lldb-api :: api/multiple-targets/TestMultipleTargets.py (1180 of 2154) PASS: lldb-api :: lang/objcxx/cxx-bridged-po/TestObjCXXBridgedPO.py (1181 of 2154) PASS: lldb-api :: tools/lldb-server/TestGdbRemoteSingleStep.py (1182 of 2154) PASS: lldb-api :: commands/expression/call-function/TestCallStopAndContinue.py (1183 of 2154) PASS: lldb-api :: functionalities/tsan/global_location/TestTsanGlobalLocation.py (1184 of 2154) PASS: lldb-unit :: Process/minidump/./LLDBMinidumpTests/MinidumpParserTest.MinidumpDuplicateModuleMappedFirst (1185 of 2154) PASS: lldb-api :: functionalities/float-display/TestFloatDisplay.py (1186 of 2154) PASS: lldb-unit :: Utility/./UtilityTests/UriParserTest.SchemeHostSeparator (1187 of 2154) PASS: lldb-unit :: Language/Highlighting/./HighlighterTests/HighlighterTest.ClangScalarLiterals (1188 of 2154) PASS: lldb-shell :: SymbolFile/DWARF/DW_AT_loclists_base.s (1189 of 2154) PASS: lldb-unit :: Utility/./UtilityTests/FileSpecTest.RemoveLastPathComponent (1190 of 2154) PASS: lldb-api :: commands/expression/completion-crash-incomplete-record/TestCompletionCrashIncompleteRecord.py (1191 of 2154) PASS: lldb-unit :: UnwindAssembly/x86/./UnwindAssemblyx86Tests/Testx86AssemblyInspectionEngine.TestPushR13 (1192 of 2154) PASS: lldb-shell :: SymbolFile/DWARF/debug_ranges.s (1193 of 2154) PASS: lldb-unit :: Utility/./UtilityTests/StringListTest.GetMaxStringLengthEqualSize (1194 of 2154) PASS: lldb-api :: functionalities/postmortem/elf-core/thread_crash/TestLinuxCoreThreads.py (1195 of 2154) UNSUPPORTED: lldb-shell :: SymbolFile/PDB/compilands.test (1196 of 2154) UNSUPPORTED: lldb-api :: benchmarks/frame_variable/TestFrameVariableResponse.py (1197 of 2154) PASS: lldb-unit :: Expression/./ExpressionTests/DWARFExpression.DW_OP_pick (1198 of 2154) PASS: lldb-unit :: Utility/./UtilityTests/SerializationRountripTest.SerializeDeserializeCStringArray (1199 of 2154) PASS: lldb-api :: lang/cpp/template-specialization-type/TestTemplateSpecializationType.py (1200 of 2154) PASS: lldb-shell :: SymbolFile/NativePDB/function-types-calling-conv.cpp (1201 of 2154) PASS: lldb-unit :: UnwindAssembly/x86/./UnwindAssemblyx86Tests/Testx86AssemblyInspectionEngine.TestPopESI (1202 of 2154) PASS: lldb-api :: functionalities/type_completion/TestTypeCompletion.py (1203 of 2154) UNSUPPORTED: lldb-api :: lang/cpp/function-template-parameter-pack/TestFunctionTemplateParameterPack.py (1204 of 2154) PASS: lldb-unit :: UnwindAssembly/x86/./UnwindAssemblyx86Tests/Testx86AssemblyInspectionEngine.TestStackRealign8BitDisp_i386 (1205 of 2154) PASS: lldb-api :: functionalities/backticks/TestBackticksWithoutATarget.py (1206 of 2154) PASS: lldb-api :: functionalities/data-formatter/parray/TestPrintArray.py (1207 of 2154) PASS: lldb-api :: macosx/simulator/TestSimulatorPlatform.py (1208 of 2154) PASS: lldb-unit :: Utility/./UtilityTests/AnsiTerminal.Basic (1209 of 2154) PASS: lldb-api :: functionalities/data-formatter/data-formatter-stl/libcxx/multimap/TestDataFormatterLibccMultiMap.py (1210 of 2154) PASS: lldb-unit :: Process/minidump/./LLDBMinidumpTests/MinidumpParserTest.GetMemoryRegionInfoFromMemory64List (1211 of 2154) PASS: lldb-unit :: Process/gdb-remote/./ProcessGdbRemoteTests/GDBRemoteClientBaseTest.SendContinueAndAsyncPacket (1212 of 2154) PASS: lldb-shell :: Breakpoint/split-dwarf-5-addrbase.test (1213 of 2154) PASS: lldb-unit :: Symbol/./SymbolTests/TestClangASTImporter.ImportInvalidType (1214 of 2154) PASS: lldb-shell :: ObjectFile/Breakpad/sections.test (1215 of 2154) PASS: lldb-unit :: Utility/./UtilityTests/UriParserTest.BracketedHostnamePort (1216 of 2154) PASS: lldb-unit :: Core/./LLDBCoreTests/UniqueCStringMap.NoDefaultConstructor (1217 of 2154) PASS: lldb-unit :: Process/gdb-remote/./ProcessGdbRemoteTests/GDBRemoteCommunicationClientTest.GetModulesInfoInvalidResponse (1218 of 2154) PASS: lldb-api :: tools/lldb-vscode/breakpoint-events/TestVSCode_breakpointEvents.py (1219 of 2154) PASS: lldb-unit :: Utility/./UtilityTests/StringListTest.DefaultConstructor (1220 of 2154) PASS: lldb-shell :: BuildScript/compiler-full-path.test (1221 of 2154) PASS: lldb-shell :: ObjectFile/ELF/PT_LOAD-overlap-PT_INTERP.yaml (1222 of 2154) PASS: lldb-unit :: Language/Highlighting/./HighlighterTests/HighlighterTest.ClangTrailingBackslashWithWhitespace (1223 of 2154) PASS: lldb-shell :: Reproducer/TestRelativePath.test (1224 of 2154) PASS: lldb-api :: lang/c/struct_types/TestStructTypes.py (1225 of 2154) PASS: lldb-unit :: Utility/./UtilityTests/BinaryStreamTest.PutULEB128SixBytes (1226 of 2154) PASS: lldb-api :: lang/objc/objc-static-method/TestObjCStaticMethod.py (1227 of 2154) PASS: lldb-api :: commands/expression/rdar42038760/TestScalarURem.py (1228 of 2154) PASS: lldb-api :: functionalities/tsan/multiple/TestTsanMultiple.py (1229 of 2154) PASS: lldb-shell :: SymbolFile/DWARF/find-variable-file.cpp (1230 of 2154) UNSUPPORTED: lldb-api :: functionalities/darwin_log/filter/regex/message/TestDarwinLogFilterRegexMessage.py (1231 of 2154) PASS: lldb-unit :: Symbol/./SymbolTests/TestTypeSystemClang.TestBuiltinTypeForEncodingAndBitSize (1232 of 2154) PASS: lldb-shell :: Settings/TestStopCommandSourceOnError.test (1233 of 2154) UNSUPPORTED: lldb-shell :: SymbolFile/PDB/func-symbols.test (1234 of 2154) PASS: lldb-unit :: Utility/./UtilityTests/StringListTest.ShiftMove (1235 of 2154) PASS: lldb-shell :: SymbolFile/DWARF/debug-types-basic.test (1236 of 2154) PASS: lldb-api :: python_api/symbol-context/TestSymbolContext.py (1237 of 2154) PASS: lldb-api :: python_api/symbol-context/two-files/TestSymbolContextTwoFiles.py (1238 of 2154) PASS: lldb-shell :: SymbolFile/DWARF/DW_TAG_variable-invalid_location.s (1239 of 2154) PASS: lldb-unit :: Utility/./UtilityTests/DataExtractorTest.UncommonAddressSize (1240 of 2154) UNSUPPORTED: lldb-api :: tools/lldb-server/thread-name/TestGdbRemoteThreadName.py (1241 of 2154) PASS: lldb-unit :: Core/./LLDBCoreTests/MangledTest.EmptyForInvalidName (1242 of 2154) PASS: lldb-shell :: SymbolFile/NativePDB/globals-bss.cpp (1243 of 2154) PASS: lldb-unit :: Utility/./UtilityTests/Flags.AnyClear (1244 of 2154) PASS: lldb-unit :: Target/./TargetTests/ExecutionContextTest.GetByteOrderTarget (1245 of 2154) PASS: lldb-unit :: Utility/./UtilityTests/BinaryStreamTest.PutSLEB128NineBytes (1246 of 2154) PASS: lldb-unit :: Utility/./UtilityTests/ConstStringTest.NullAndEmptyStates (1247 of 2154) PASS: lldb-unit :: Utility/./UtilityTests/UriParserTest.BracketedHostnameWithColon (1248 of 2154) PASS: lldb-api :: commands/watchpoints/multiple_threads/TestWatchpointMultipleThreads.py (1249 of 2154) PASS: lldb-api :: lang/objc/objc-struct-argument/TestObjCStructArgument.py (1250 of 2154) PASS: lldb-api :: tools/lldb-server/TestGdbRemote_qThreadStopInfo.py (1251 of 2154) PASS: lldb-api :: lang/objc/ivar-IMP/TestObjCiVarIMP.py (1252 of 2154) PASS: lldb-shell :: ObjectFile/PECOFF/basic-info.yaml (1253 of 2154) PASS: lldb-unit :: Utility/./UtilityTests/RegisterValueTest.GetSet8 (1254 of 2154) PASS: lldb-api :: python_api/sbenvironment/TestSBEnvironment.py (1255 of 2154) UNSUPPORTED: lldb-api :: commands/register/register/intel_xtended_registers/mpx_offset_intersection/TestMPXOffsetIntersection.py (1256 of 2154) PASS: lldb-shell :: Process/TestEnvironment.test (1257 of 2154) PASS: lldb-api :: functionalities/thread/concurrent_events/TestConcurrentCrashWithSignal.py (1258 of 2154) PASS: lldb-unit :: SymbolFile/NativePDB/./SymbolFileNativePDBTests/PDBFPOProgramToDWARFExpressionTests.DependencyChain (1259 of 2154) PASS: lldb-shell :: SymbolFile/DWARF/DW_TAG_variable-DW_AT_const_value.s (1260 of 2154) PASS: lldb-unit :: Utility/./UtilityTests/StringExtractorTest.DecodeHexU8_InvalidHex (1261 of 2154) PASS: lldb-api :: functionalities/data-formatter/data-formatter-stl/libcxx/list/TestDataFormatterLibcxxList.py (1262 of 2154) PASS: lldb-unit :: Interpreter/./InterpreterTests/CompletionTest.DirCompletionAbsolute (1263 of 2154) PASS: lldb-unit :: DataFormatter/./LLDBFormatterTests/TypeMatcherTests.CreatedBySameMatchString (1264 of 2154) PASS: lldb-unit :: Utility/./UtilityTests/NameMatchesTest.RegularExpression (1265 of 2154) PASS: lldb-shell :: SymbolFile/DWARF/dwp-debug-types.s (1266 of 2154) PASS: lldb-api :: functionalities/thread/concurrent_events/TestConcurrentTwoWatchpointThreads.py (1267 of 2154) PASS: lldb-api :: commands/expression/unicode-in-variable/TestUnicodeInVariable.py (1268 of 2154) PASS: lldb-unit :: Language/Highlighting/./HighlighterTests/HighlighterTest.ClangCursorPosAfterOtherToken (1269 of 2154) PASS: lldb-api :: functionalities/data-formatter/data-formatter-proper-plurals/TestFormattersOneIsSingular.py (1270 of 2154) PASS: lldb-unit :: Utility/./UtilityTests/ConstStringTest.MangledCounterpart (1271 of 2154) PASS: lldb-unit :: Utility/./UtilityTests/ScalarTest.LongLongAssigmentOperator (1272 of 2154) PASS: lldb-api :: lang/cpp/wchar_t/TestCxxWCharT.py (1273 of 2154) PASS: lldb-shell :: SymbolFile/NativePDB/globals-fundamental.cpp (1274 of 2154) UNSUPPORTED: lldb-api :: tools/lldb-server/registers-target-xml-reading/TestGdbRemoteTargetXmlPacket.py (1275 of 2154) PASS: lldb-api :: lang/c/enum_types/TestEnumTypes.py (1276 of 2154) PASS: lldb-api :: commands/expression/formatters/TestFormatters.py (1277 of 2154) PASS: lldb-unit :: Utility/./UtilityTests/OptionsWithRawTest.ArgsButNoLeadingDash (1278 of 2154) PASS: lldb-api :: functionalities/param_entry_vals/basic_entry_values/TestBasicEntryValues.py (1279 of 2154) PASS: lldb-unit :: Utility/./UtilityTests/BinaryStreamTest.PutULEB128MaxValue (1280 of 2154) PASS: lldb-unit :: Symbol/./SymbolTests/PostfixExpression.ParseFPOProgram (1281 of 2154) PASS: lldb-unit :: UnwindAssembly/ARM64/./Arm64InstEmulationTests/TestArm64InstEmulation.TestRegisterSavedTwice (1282 of 2154) PASS: lldb-api :: lang/objc/modules-update/TestClangModulesUpdate.py (1283 of 2154) PASS: lldb-api :: lang/cpp/namespace_definitions/TestNamespaceDefinitions.py (1284 of 2154) PASS: lldb-unit :: Disassembler/./DisassemblerTests/TestArmv7Disassembly.TestCortexFPDisass (1285 of 2154) PASS: lldb-shell :: Process/TestAbortExitCode.test (1286 of 2154) PASS: lldb-api :: tools/lldb-server/TestGdbRemoteKill.py (1287 of 2154) PASS: lldb-api :: lang/objc/objc-optimized/TestObjcOptimized.py (1288 of 2154) PASS: lldb-unit :: UnwindAssembly/x86/./UnwindAssemblyx86Tests/Testx86AssemblyInspectionEngine.TestSimplei386ugmented (1289 of 2154) PASS: lldb-api :: functionalities/inferior-changed/TestInferiorChanged.py (1290 of 2154) PASS: lldb-unit :: Utility/./UtilityTests/StringListTest.JoinThree (1291 of 2154) PASS: lldb-unit :: Utility/./UtilityTests/ScalarTest.ExtractBitfield (1292 of 2154) PASS: lldb-unit :: ObjectFile/Breakpad/./ObjectFileBreakpadTests/FileRecord.parse (1293 of 2154) PASS: lldb-unit :: Utility/./UtilityTests/SharedCluster.ClusterManager (1294 of 2154) PASS: lldb-api :: commands/expression/import_builtin_fileid/TestImportBuiltinFileID.py (1295 of 2154) PASS: lldb-unit :: Utility/./UtilityTests/BinaryStreamTest.PutSLEB128EightBytes (1296 of 2154) PASS: lldb-api :: functionalities/thread/step_out/TestThreadStepOut.py (1297 of 2154) PASS: lldb-unit :: Host/./HostTests/NativeProcessProtocolTest.SetBreakpointFailVerify (1298 of 2154) PASS: lldb-unit :: UnwindAssembly/x86/./UnwindAssemblyx86Tests/Testx86AssemblyInspectionEngine.TestPopEBP (1299 of 2154) PASS: lldb-api :: commands/frame/diagnose/complicated-expression/TestComplicatedExpression.py (1300 of 2154) PASS: lldb-unit :: Utility/./UtilityTests/BinaryStreamTest.PutSLEB128MaxValue (1301 of 2154) UNSUPPORTED: lldb-shell :: Unwind/eh-frame-augment-noop.test (1302 of 2154) PASS: lldb-api :: commands/expression/char/TestExprsChar.py (1303 of 2154) PASS: lldb-unit :: Utility/./UtilityTests/FileSpecTest.OperatorBool (1304 of 2154) PASS: lldb-api :: commands/settings/use_source_cache/TestUseSourceCache.py (1305 of 2154) PASS: lldb-api :: commands/expression/import-std-module/unique_ptr-dbg-info-content/TestUniquePtrDbgInfoContent.py (1306 of 2154) PASS: lldb-api :: python_api/lldbutil/frame/TestFrameUtils.py (1307 of 2154) PASS: lldb-unit :: Utility/./UtilityTests/XcodeSDKTest.GetSDKTypeForTriple (1308 of 2154) UNSUPPORTED: lldb-api :: functionalities/data-formatter/data-formatter-stl/libstdcpp/vbool/TestDataFormatterStdVBool.py (1309 of 2154) PASS: lldb-shell :: Reproducer/Functionalities/TestExpressionEvaluation.test (1310 of 2154) PASS: lldb-api :: commands/target/stop-hook/enable/TestTargetStopHookEnable.py (1311 of 2154) PASS: lldb-api :: tools/lldb-vscode/step/TestVSCode_step.py (1312 of 2154) PASS: lldb-api :: functionalities/postmortem/minidump/TestMiniDump.py (1313 of 2154) PASS: lldb-unit :: debugserver/./debugserverTests/RNBSocket.LoopBackListenIPv4 (1314 of 2154) PASS: lldb-api :: functionalities/postmortem/elf-core/gcore/TestGCore.py (1315 of 2154) PASS: lldb-api :: types/TestRecursiveTypes.py (1316 of 2154) PASS: lldb-unit :: UnwindAssembly/x86/./UnwindAssemblyx86Tests/Testx86AssemblyInspectionEngine.TestPopEDI (1317 of 2154) PASS: lldb-api :: python_api/function_symbol/TestDisasmAPI.py (1318 of 2154) PASS: lldb-api :: lang/c/offsetof/TestOffsetof.py (1319 of 2154) PASS: lldb-unit :: Utility/./UtilityTests/OptionsWithRawTest.SingleWordSuffix (1320 of 2154) PASS: lldb-api :: functionalities/breakpoint/scripted_bkpt/TestScriptedResolver.py (1321 of 2154) PASS: lldb-api :: sample_test/TestSampleTest.py (1322 of 2154) PASS: lldb-api :: python_api/sbtype_typeclass/TestSBTypeTypeClass.py (1323 of 2154) PASS: lldb-unit :: UnwindAssembly/x86/./UnwindAssemblyx86Tests/Testx86AssemblyInspectionEngine.TestMovRSPtoRBP (1324 of 2154) PASS: lldb-unit :: Process/minidump/./LLDBMinidumpTests/MinidumpParserTest.GetMemoryRegionInfoFromMemoryList (1325 of 2154) PASS: lldb-api :: functionalities/dead-strip/TestDeadStrip.py (1326 of 2154) PASS: lldb-unit :: Symbol/./SymbolTests/TestTypeSystemClang.TestDisplayNameEmpty (1327 of 2154) PASS: lldb-api :: python_api/lldbutil/iter/TestLLDBIterator.py (1328 of 2154) PASS: lldb-shell :: Commands/command-source.test (1329 of 2154) PASS: lldb-shell :: Settings/TestFrameFormatNoColor.test (1330 of 2154) PASS: lldb-api :: functionalities/data-formatter/data-formatter-stl/libstdcpp/unique_ptr/invalid/TestDataFormatterInvalidStdUniquePtr.py (1331 of 2154) PASS: lldb-shell :: ObjectFile/ELF/minidebuginfo-corrupt-xz.yaml (1332 of 2154) PASS: lldb-api :: tools/lldb-server/commandline/TestStubReverseConnect.py (1333 of 2154) PASS: lldb-api :: lang/objc/orderedset/TestOrderedSet.py (1334 of 2154) PASS: lldb-unit :: Utility/./UtilityTests/VMRange.ContainsAddr (1335 of 2154) PASS: lldb-api :: lang/cpp/typedef/TestCppTypedef.py (1336 of 2154) PASS: lldb-unit :: Expression/./ExpressionTests/DWARFExpression.DW_OP_convert (1337 of 2154) PASS: lldb-api :: functionalities/thread/thread_exit/TestThreadExit.py (1338 of 2154) PASS: lldb-unit :: Utility/./UtilityTests/StreamTeeTest.AppendStream (1339 of 2154) PASS: lldb-unit :: Utility/./UtilityTests/ListenerTest.GetEventImmediate (1340 of 2154) PASS: lldb-api :: functionalities/data-formatter/data-formatter-smart-array/TestDataFormatterSmartArray.py (1341 of 2154) PASS: lldb-unit :: UnwindAssembly/x86/./UnwindAssemblyx86Tests/Testx86AssemblyInspectionEngine.TestSpArithx86_64Augmented (1342 of 2154) PASS: lldb-shell :: SymbolFile/DWARF/find-function-regex.cpp (1343 of 2154) PASS: lldb-api :: api/multithreaded/TestMultithreaded.py (1344 of 2154) PASS: lldb-shell :: Commands/command-script-import.test (1345 of 2154) PASS: lldb-api :: commands/expression/namespace_local_var_same_name_cpp_and_c/TestNamespaceLocalVarSameNameCppAndC.py (1346 of 2154) PASS: lldb-api :: lang/cpp/class_static/TestStaticVariables.py (1347 of 2154) PASS: lldb-shell :: SymbolFile/DWARF/dwarf5-index-is-used.cpp (1348 of 2154) PASS: lldb-api :: lang/objc/blocks/TestObjCIvarsInBlocks.py (1349 of 2154) PASS: lldb-shell :: SymbolFile/DWARF/parallel-indexing-stress.s (1350 of 2154) PASS: lldb-api :: functionalities/data-formatter/data-formatter-stl/libcxx/function/TestLibCxxFunction.py (1351 of 2154) PASS: lldb-unit :: Utility/./UtilityTests/ArgsTest.AppendArguments (1352 of 2154) PASS: lldb-unit :: Utility/./UtilityTests/DataExtractorTest.GetCStrUnterminated (1353 of 2154) PASS: lldb-api :: python_api/process/read-mem-cstring/TestReadMemCString.py (1354 of 2154) UNSUPPORTED: lldb-api :: lang/objc/objc-dynamic-value/TestObjCDynamicValue.py (1355 of 2154) PASS: lldb-api :: python_api/file_handle/TestFileHandle.py (1356 of 2154) PASS: lldb-api :: lang/objc/modules-app-update/TestClangModulesAppUpdate.py (1357 of 2154) PASS: lldb-api :: functionalities/tail_call_frames/inlining_and_tail_calls/TestInliningAndTailCalls.py (1358 of 2154) PASS: lldb-unit :: Language/Highlighting/./HighlighterTests/HighlighterTest.ClangPreserveNewLine (1359 of 2154) PASS: lldb-unit :: Utility/./UtilityTests/ProcessInstanceInfo.DumpTable (1360 of 2154) PASS: lldb-unit :: Utility/./UtilityTests/ProcessInstanceInfo.Yaml (1361 of 2154) PASS: lldb-api :: types/TestFloatTypes.py (1362 of 2154) UNSUPPORTED: lldb-shell :: Register/arm-gp-read.test (1363 of 2154) PASS: lldb-api :: python_api/objc_type/TestObjCType.py (1364 of 2154) PASS: lldb-unit :: UnwindAssembly/x86/./UnwindAssemblyx86Tests/Testx86AssemblyInspectionEngine.TestPopEBX (1365 of 2154) PASS: lldb-api :: functionalities/data-formatter/type_summary_list_script/TestTypeSummaryListScript.py (1366 of 2154) PASS: lldb-shell :: ObjectFile/ELF/section-addresses.yaml (1367 of 2154) PASS: lldb-unit :: Utility/./UtilityTests/StatusTest.Formatv (1368 of 2154) PASS: lldb-shell :: SymbolFile/DWARF/split-dwarf-inlining.cpp (1369 of 2154) PASS: lldb-unit :: ObjectFile/Breakpad/./ObjectFileBreakpadTests/FuncRecord.parse (1370 of 2154) PASS: lldb-unit :: Utility/./UtilityTests/StringListTest.ShiftCString (1371 of 2154) PASS: lldb-unit :: Utility/./UtilityTests/PassiveReplayTest.InstrumentedBarPtr (1372 of 2154) PASS: lldb-unit :: Utility/./UtilityTests/OptionsWithRawTest.QuotedSuffix (1373 of 2154) PASS: lldb-api :: functionalities/ubsan/basic/TestUbsanBasic.py (1374 of 2154) PASS: lldb-unit :: Utility/./UtilityTests/RecordReplayTest.InstrumentedFooSameThis (1375 of 2154) PASS: lldb-unit :: Utility/./UtilityTests/DataExtractorTest.PeekData (1376 of 2154) PASS: lldb-unit :: Utility/./UtilityTests/NameMatchesTest.Equals (1377 of 2154) PASS: lldb-api :: commands/frame/recognizer/TestFrameRecognizer.py (1378 of 2154) PASS: lldb-api :: functionalities/data-formatter/typedef_array/TestTypedefArray.py (1379 of 2154) PASS: lldb-shell :: SymbolFile/Breakpad/stack-cfi-parsing.test (1380 of 2154) PASS: lldb-api :: commands/expression/argument_passing_restrictions/TestArgumentPassingRestrictions.py (1381 of 2154) UNSUPPORTED: lldb-shell :: ScriptInterpreter/Lua/nested_sessions.test (1382 of 2154) PASS: lldb-unit :: Utility/./UtilityTests/RangeTest.Equal (1383 of 2154) PASS: lldb-api :: commands/watchpoints/multiple_hits/TestMultipleHits.py (1384 of 2154) PASS: lldb-api :: functionalities/recursion/TestValueObjectRecursion.py (1385 of 2154) PASS: lldb-api :: arm/emulation/TestEmulations.py (1386 of 2154) PASS: lldb-unit :: Utility/./UtilityTests/StringExtractorTest.GetHexBytes_Partial (1387 of 2154) PASS: lldb-unit :: Utility/./UtilityTests/StreamTest.PutChar (1388 of 2154) PASS: lldb-unit :: ScriptInterpreter/Python/./ScriptInterpreterPythonTests/PythonDataObjectsTest.TestExtractingUInt64ThroughStructuredData (1389 of 2154) PASS: lldb-unit :: ScriptInterpreter/Python/./ScriptInterpreterPythonTests/PythonDataObjectsTest.TestModuleNameResolutionNoDot (1390 of 2154) PASS: lldb-unit :: Utility/./UtilityTests/UriParserTest.TypicalPortPathIPv6 (1391 of 2154) PASS: lldb-api :: commands/apropos/with-process/TestAproposWithProcess.py (1392 of 2154) PASS: lldb-unit :: Target/./TargetTests/ModuleCacheTest.GetAndPutStrangeHostname (1393 of 2154) PASS: lldb-api :: functionalities/data-formatter/data-formatter-caching/TestDataFormatterCaching.py (1394 of 2154) PASS: lldb-unit :: ObjectFile/Breakpad/./ObjectFileBreakpadTests/StackCFIRecord.parse (1395 of 2154) PASS: lldb-unit :: Utility/./UtilityTests/DataExtractorTest.GetCStr (1396 of 2154) PASS: lldb-unit :: ScriptInterpreter/Python/./ScriptInterpreterPythonTests/PythonDataObjectsTest.TestResetting (1397 of 2154) PASS: lldb-api :: commands/target/stop-hooks/TestStopHooks.py (1398 of 2154) PASS: lldb-shell :: SymbolFile/DWARF/debug_ranges-missing-section.s (1399 of 2154) PASS: lldb-api :: functionalities/breakpoint/auto_continue/TestBreakpointAutoContinue.py (1400 of 2154) PASS: lldb-shell :: Minidump/memory-region.yaml (1401 of 2154) PASS: lldb-unit :: Language/CLanguages/./LanguageCLanguagesTests/CLanguages.LookupCLanguagesByLanguageType (1402 of 2154) PASS: lldb-api :: tools/lldb-server/TestGdbRemoteThreadsInStopReply.py (1403 of 2154) PASS: lldb-shell :: ObjectFile/PECOFF/invalid-export-table.yaml (1404 of 2154) PASS: lldb-api :: commands/expression/call-throws/TestCallThatThrows.py (1405 of 2154) PASS: lldb-api :: functionalities/thread/concurrent_events/TestConcurrentSignalWatch.py (1406 of 2154) PASS: lldb-unit :: Utility/./UtilityTests/ArchSpecTest.TripleComponentsWereSpecified (1407 of 2154) UNSUPPORTED: lldb-api :: commands/watchpoints/hello_watchlocation/TestWatchLocation.py (1408 of 2154) PASS: lldb-unit :: Language/Highlighting/./HighlighterTests/HighlighterTest.ClangCursorPosEndOfLine (1409 of 2154) PASS: lldb-shell :: SymbolFile/DWARF/clang-ast-from-dwarf-unamed-and-anon-structs.cpp (1410 of 2154) PASS: lldb-api :: functionalities/data-formatter/data-formatter-stl/libcxx/vbool/TestDataFormatterLibcxxVBool.py (1411 of 2154) PASS: lldb-shell :: SymbolFile/DWARF/inline-function-address.ll (1412 of 2154) PASS: lldb-unit :: UnwindAssembly/x86/./UnwindAssemblyx86Tests/Testx86AssemblyInspectionEngine.TestPopR15 (1413 of 2154) PASS: lldb-unit :: Expression/./ExpressionTests/DWARFExpression.DW_OP_stack_value (1414 of 2154) PASS: lldb-api :: python_api/frame/get-variables/TestGetVariables.py (1415 of 2154) PASS: lldb-api :: python_api/frame/inlines/TestInlinedFrame.py (1416 of 2154) PASS: lldb-shell :: Settings/TestFrameFormatMangling.test (1417 of 2154) PASS: lldb-api :: functionalities/data-formatter/data-formatter-disabling/TestDataFormatterDisabling.py (1418 of 2154) PASS: lldb-unit :: ScriptInterpreter/Python/./ScriptInterpreterPythonTests/PythonDataObjectsTest.TestGlobalNameResolutionWithDot (1419 of 2154) PASS: lldb-api :: commands/expression/cast_int_to_anonymous_enum/TestCastIntToAnonymousEnum.py (1420 of 2154) UNSUPPORTED: lldb-shell :: Expr/TestIRMemoryMapWindows.test (1421 of 2154) PASS: lldb-unit :: Host/./HostTests/NativeProcessProtocolTest.SetBreakpointFailRead (1422 of 2154) UNSUPPORTED: lldb-shell :: SymbolFile/PDB/udt-layout.test (1423 of 2154) PASS: lldb-shell :: Minidump/dump-all.test (1424 of 2154) UNSUPPORTED: lldb-shell :: SymbolFile/NativePDB/ast-functions-msvc.cpp (1425 of 2154) PASS: lldb-api :: macosx/queues/TestQueues.py (1426 of 2154) PASS: lldb-api :: lang/cpp/thread_local/TestThreadLocal.py (1427 of 2154) PASS: lldb-api :: commands/expression/static-initializers/TestStaticInitializers.py (1428 of 2154) PASS: lldb-api :: lang/cpp/bool/TestCPPBool.py (1429 of 2154) PASS: lldb-unit :: Symbol/./SymbolTests/TestTypeSystemClang.TestGetBasicTypeFromEnum (1430 of 2154) UNSUPPORTED: lldb-shell :: SymbolFile/NativePDB/typedefs.cpp (1431 of 2154) PASS: lldb-api :: functionalities/gdb_remote_client/TestStopPCs.py (1432 of 2154) PASS: lldb-api :: commands/expression/top-level/TestTopLevelExprs.py (1433 of 2154) PASS: lldb-api :: tools/lldb-vscode/coreFile/TestVSCode_coreFile.py (1434 of 2154) PASS: lldb-api :: lang/c/complex_int/TestComplexInt.py (1435 of 2154) UNSUPPORTED: lldb-api :: functionalities/tty/TestTerminal.py (1436 of 2154) PASS: lldb-api :: lang/cpp/diamond/TestDiamond.py (1437 of 2154) PASS: lldb-shell :: ObjectFile/ELF/PT_TLS-overlap-PT_LOAD.yaml (1438 of 2154) PASS: lldb-api :: lang/cpp/virtual-overload/TestVirtualOverload.py (1439 of 2154) PASS: lldb-unit :: Utility/./UtilityTests/StringListTest.LongestCommonPrefixEmpty (1440 of 2154) PASS: lldb-unit :: Utility/./UtilityTests/RecordReplayTest.InstrumentedBarRef (1441 of 2154) PASS: lldb-api :: lang/cpp/gmodules/TestWithModuleDebugging.py (1442 of 2154) PASS: lldb-unit :: Utility/./UtilityTests/TimerTest.CategoryTimes (1443 of 2154) UNSUPPORTED: lldb-shell :: ExecControl/StopHook/stop-hook-threads.test (1444 of 2154) PASS: lldb-api :: types/TestShortTypeExpr.py (1445 of 2154) PASS: lldb-api :: commands/target/stop-hooks/TestStopHookScripted.py (1446 of 2154) PASS: lldb-unit :: Utility/./UtilityTests/ArgsTest.TestAppendArg (1447 of 2154) PASS: lldb-unit :: Host/./HostTests/SocketAddressTest.Set (1448 of 2154) PASS: lldb-api :: commands/target/create-deps/TestTargetCreateDeps.py (1449 of 2154) PASS: lldb-unit :: Utility/./UtilityTests/StringLexerTest.Peek (1450 of 2154) PASS: lldb-shell :: Driver/TestTarget.test (1451 of 2154) PASS: lldb-api :: macosx/load-kext/TestLoadKext.py (1452 of 2154) PASS: lldb-shell :: Commands/command-backtrace.test (1453 of 2154) PASS: lldb-unit :: debugserver/./debugserverTests/RNBSocket.LoopBackConnectIPv4 (1454 of 2154) PASS: lldb-api :: lang/cpp/char1632_t/TestChar1632T.py (1455 of 2154) PASS: lldb-unit :: Host/./HostTests/FileSystemTest.MakeAbsolute (1456 of 2154) PASS: lldb-unit :: Utility/./UtilityTests/NameMatchesTest.EndsWith (1457 of 2154) UNSUPPORTED: lldb-api :: functionalities/unwind/standard/TestStandardUnwind.py (1458 of 2154) PASS: lldb-unit :: Utility/./UtilityTests/LogChannelTest.List (1459 of 2154) XFAIL: lldb-shell :: Register/x86-mm-xmm-read.test (1460 of 2154) PASS: lldb-unit :: Utility/./UtilityTests/StatusTest.ErrorCodeConstructor (1461 of 2154) PASS: lldb-unit :: Utility/./UtilityTests/OptionsWithRawTest.ArgsButNoDelimiter (1462 of 2154) UNSUPPORTED: lldb-api :: lang/c/typedef/Testtypedef.py (1463 of 2154) PASS: lldb-unit :: Language/Highlighting/./HighlighterTests/HighlighterTest.Keywords (1464 of 2154) PASS: lldb-unit :: Utility/./UtilityTests/UUIDTest.StringConverion (1465 of 2154) PASS: lldb-shell :: Driver/TestUseColor.test (1466 of 2154) PASS: lldb-unit :: Utility/./UtilityTests/StringListTest.InsertStringAtIndexMove (1467 of 2154) PASS: lldb-unit :: DataFormatter/./LLDBFormatterTests/StringPrinterTests.CxxASCII (1468 of 2154) PASS: lldb-shell :: SymbolFile/DWARF/DW_OP_piece-struct.s (1469 of 2154) PASS: lldb-unit :: Expression/./ExpressionTests/CppModuleConfigurationTest.UnrelatedLibrary (1470 of 2154) PASS: lldb-shell :: Settings/TestDisassemblyFormat.test (1471 of 2154) PASS: lldb-unit :: Utility/./UtilityTests/ScalarTest.TruncOrExtendTo (1472 of 2154) PASS: lldb-unit :: Symbol/./SymbolTests/PostfixExpression.ToDWARF (1473 of 2154) PASS: lldb-api :: functionalities/gdb_remote_client/TestqOffsets.py (1474 of 2154) PASS: lldb-shell :: Recognizer/assert.test (1475 of 2154) PASS: lldb-unit :: UnwindAssembly/x86/./UnwindAssemblyx86Tests/Testx86AssemblyInspectionEngine.TestPushRBX (1476 of 2154) PASS: lldb-shell :: SymbolFile/DWARF/find-basic-namespace.cpp (1477 of 2154) PASS: lldb-shell :: SymbolFile/DWARF/find-method-local-struct.cpp (1478 of 2154) PASS: lldb-unit :: ObjectFile/ELF/./ObjectFileELFTests/ObjectFileELFTest.GetModuleSpecifications_EarlySectionHeaders (1479 of 2154) PASS: lldb-api :: functionalities/unwind/zeroth_frame/TestZerothFrame.py (1480 of 2154) PASS: lldb-api :: commands/expression/import-std-module/stack/TestStackFromStdModule.py (1481 of 2154) PASS: lldb-shell :: Commands/command-regex-delete.test (1482 of 2154) UNSUPPORTED: lldb-api :: functionalities/signal/handle-segv/TestHandleSegv.py (1483 of 2154) PASS: lldb-shell :: SymbolFile/DWARF/debug-types-signature-loop.s (1484 of 2154) PASS: lldb-shell :: ObjectFile/PECOFF/section-types.yaml (1485 of 2154) PASS: lldb-api :: functionalities/inferior-assert/TestInferiorAssert.py (1486 of 2154) PASS: lldb-api :: lang/cpp/llvm-style/TestLLVMStyle.py (1487 of 2154) PASS: lldb-unit :: ScriptInterpreter/Python/./ScriptInterpreterPythonTests/PythonDataObjectsTest.TestCallable (1488 of 2154) PASS: lldb-unit :: Utility/./UtilityTests/ConstStringTest.FromMidOfBufferStringRef (1489 of 2154) PASS: lldb-api :: commands/disassemble/basic/TestFrameDisassemble.py (1490 of 2154) PASS: lldb-shell :: SymbolFile/DWARF/debug_ranges_and_rnglists.test (1491 of 2154) PASS: lldb-unit :: Utility/./UtilityTests/BinaryStreamTest.PutSLEB128OneByte (1492 of 2154) PASS: lldb-unit :: Utility/./UtilityTests/StringListTest.GetMaxStringLengthMixed (1493 of 2154) PASS: lldb-shell :: SymbolFile/DWARF/deterministic-build.cpp (1494 of 2154) PASS: lldb-unit :: Utility/./UtilityTests/UriParserTest.TypicalPortPathIPv4 (1495 of 2154) PASS: lldb-unit :: Symbol/./SymbolTests/TestClangASTImporter.MetadataPropagationIndirectImport (1496 of 2154) PASS: lldb-api :: macosx/profile_vrs_detach/TestDetachVrsProfile.py (1497 of 2154) PASS: lldb-api :: functionalities/gdb_remote_client/TestGDBRemoteLoad.py (1498 of 2154) PASS: lldb-api :: functionalities/breakpoint/consecutive_breakpoints/TestConsecutiveBreakpoints.py (1499 of 2154) PASS: lldb-unit :: Utility/./UtilityTests/AnsiTerminal.Unknown (1500 of 2154) PASS: lldb-shell :: ScriptInterpreter/Python/eof.test (1501 of 2154) PASS: lldb-api :: lang/cpp/global_operators/TestCppGlobalOperators.py (1502 of 2154) UNSUPPORTED: lldb-api :: commands/expression/macros/TestMacros.py (1503 of 2154) PASS: lldb-unit :: Process/gdb-remote/./ProcessGdbRemoteTests/GDBRemoteCommunicationClientTest.SendSignalsToIgnore (1504 of 2154) PASS: lldb-unit :: Core/./LLDBCoreTests/ModuleSpecTest.TestMachOFile (1505 of 2154) PASS: lldb-unit :: Platform/Android/./AdbClientTests/AdbClientTest.CreateByDeviceId (1506 of 2154) PASS: lldb-unit :: UnwindAssembly/x86/./UnwindAssemblyx86Tests/Testx86AssemblyInspectionEngine.TestPushEAX (1507 of 2154) PASS: lldb-api :: macosx/find-app-in-bundle/TestFindAppInBundle.py (1508 of 2154) PASS: lldb-api :: functionalities/step-avoids-no-debug/TestStepNoDebug.py (1509 of 2154) PASS: lldb-api :: types/TestLongTypes.py (1510 of 2154) PASS: lldb-api :: lang/cpp/gmodules-templates/TestGModules.py (1511 of 2154) PASS: lldb-shell :: SymbolFile/Breakpad/line-table-missing-file.test (1512 of 2154) PASS: lldb-api :: functionalities/abbreviation/TestAbbreviations.py (1513 of 2154) PASS: lldb-unit :: Utility/./UtilityTests/StringLexerTest.AdvanceIf (1514 of 2154) PASS: lldb-api :: macosx/dyld-trie-symbols/TestDyldTrieSymbols.py (1515 of 2154) PASS: lldb-unit :: Utility/./UtilityTests/SerializationRountripTest.SerializeDeserializeObjectReference (1516 of 2154) PASS: lldb-unit :: Symbol/./SymbolTests/Type.CompilerContextPattern (1517 of 2154) PASS: lldb-unit :: Breakpoint/./LLDBBreakpointTests/BreakpointIDTest.StringIsBreakpointName (1518 of 2154) PASS: lldb-api :: lang/cpp/char8_t/TestCxxChar8_t.py (1519 of 2154) PASS: lldb-shell :: Reproducer/TestDiscard.test (1520 of 2154) UNSUPPORTED: lldb-shell :: ScriptInterpreter/Lua/watchpoint_callback.test (1521 of 2154) PASS: lldb-api :: functionalities/data-formatter/data-formatter-objc/TestDataFormatterObjCNSContainer.py (1522 of 2154) PASS: lldb-unit :: Utility/./UtilityTests/StringExtractorTest.GetHexBytesAvail_Partial (1523 of 2154) PASS: lldb-unit :: Process/gdb-remote/./ProcessGdbRemoteTests/GDBRemoteCommunicationServerTest.SendErrorResponse_ErrorNumber (1524 of 2154) PASS: lldb-api :: functionalities/thread/concurrent_events/TestConcurrentSignalDelayWatch.py (1525 of 2154) PASS: lldb-unit :: Language/Highlighting/./HighlighterTests/HighlighterTest.ClangUnterminatedString (1526 of 2154) PASS: lldb-api :: commands/gui/viewlarge/TestGuiViewLarge.py (1527 of 2154) PASS: lldb-unit :: Utility/./UtilityTests/BinaryStreamTest.PutULEB128FourBytes (1528 of 2154) PASS: lldb-api :: functionalities/pre_run_dylibs/TestPreRunDylibs.py (1529 of 2154) PASS: lldb-unit :: Utility/./UtilityTests/ScalarTest.Comparison (1530 of 2154) PASS: lldb-api :: lang/cpp/incomplete-types/TestCppIncompleteTypes.py (1531 of 2154) PASS: lldb-api :: functionalities/rerun/TestRerun.py (1532 of 2154) PASS: lldb-unit :: SymbolFile/NativePDB/./SymbolFileNativePDBTests/PDBFPOProgramToDWARFExpressionTests.InvalidAssignmentSingle (1533 of 2154) PASS: lldb-unit :: Platform/./LLDBPlatformTests/PlatformAppleSimulatorTest.TestSimHasSimEnvionament (1534 of 2154) PASS: lldb-unit :: ScriptInterpreter/Python/./ScriptInterpreterPythonTests/PythonDataObjectsTest.TestPythonDictionaryToStructuredDictionary (1535 of 2154) UNSUPPORTED: lldb-api :: functionalities/data-formatter/data-formatter-stl/libstdcpp/smart_ptr/TestDataFormatterStdSmartPtr.py (1536 of 2154) PASS: lldb-shell :: VSCode/TestOptions.test (1537 of 2154) PASS: lldb-unit :: Utility/./UtilityTests/StringExtractorTest.DecodeHexU8_Underflow (1538 of 2154) PASS: lldb-api :: functionalities/breakpoint/breakpoint_hit_count/TestBreakpointHitCount.py (1539 of 2154) PASS: lldb-api :: lang/cpp/virtual-functions/TestCppVirtualFunctions.py (1540 of 2154) PASS: lldb-api :: commands/expression/test/TestExprs.py (1541 of 2154) PASS: lldb-api :: tools/lldb-server/TestLldbGdbServer.py (1542 of 2154) PASS: lldb-unit :: Utility/./UtilityTests/OptionsWithRawTest.MultiWordSuffix (1543 of 2154) PASS: lldb-shell :: SymbolFile/DWARF/find-basic-function.cpp (1544 of 2154) PASS: lldb-shell :: SymbolFile/DWARF/debug_loclists-dwo.s (1545 of 2154) PASS: lldb-unit :: Utility/./UtilityTests/BinaryStreamTest.PutULEB128EightBytes (1546 of 2154) PASS: lldb-api :: functionalities/gdb_remote_client/TestRecognizeBreakpoint.py (1547 of 2154) PASS: lldb-api :: functionalities/inferior-crashing/TestInferiorCrashingStep.py (1548 of 2154) PASS: lldb-shell :: SymbolFile/DWARF/dir-separator-no-comp-dir.s (1549 of 2154) PASS: lldb-shell :: SymbolFile/NativePDB/ast-functions.cpp (1550 of 2154) PASS: lldb-unit :: Utility/./UtilityTests/OptionsWithRawTest.EmptySuffixSingleWhitespace (1551 of 2154) PASS: lldb-unit :: Utility/./UtilityTests/StringExtractorTest.GetHexU8_Extra (1552 of 2154) PASS: lldb-shell :: Reproducer/TestPythonImport.test (1553 of 2154) PASS: lldb-shell :: ObjectFile/ELF/PT_LOAD.yaml (1554 of 2154) PASS: lldb-unit :: Utility/./UtilityTests/VMRange.Ordering (1555 of 2154) PASS: lldb-api :: functionalities/gdb_remote_client/TestNoGPacketSupported.py (1556 of 2154) PASS: lldb-unit :: Process/gdb-remote/./ProcessGdbRemoteTests/GDBRemoteClientBaseTest.SendContinueAndAsyncSignal (1557 of 2154) PASS: lldb-unit :: Language/Highlighting/./HighlighterTests/HighlighterTest.HighlighterSelectionPath (1558 of 2154) PASS: lldb-api :: functionalities/stats_api/TestStatisticsAPI.py (1559 of 2154) PASS: lldb-api :: functionalities/tail_call_frames/disambiguate_call_site/TestDisambiguateCallSite.py (1560 of 2154) PASS: lldb-unit :: Utility/./UtilityTests/ScalarTest.Getters (1561 of 2154) PASS: lldb-api :: python_api/sbplatform/TestSBPlatform.py (1562 of 2154) PASS: lldb-api :: functionalities/breakpoint/global_constructor/TestBreakpointInGlobalConstructor.py (1563 of 2154) PASS: lldb-api :: lang/c/vla/TestVLA.py (1564 of 2154) PASS: lldb-unit :: Utility/./UtilityTests/DataExtractorTest.GetULEB128_bit63 (1565 of 2154) PASS: lldb-unit :: Utility/./UtilityTests/StreamTest.AddressNoSuffix (1566 of 2154) PASS: lldb-unit :: Utility/./UtilityTests/BroadcasterTest.EventTypeHasListeners (1567 of 2154) PASS: lldb-unit :: Utility/./UtilityTests/StreamTeeTest.SetStreamAtIndexOutOfBounds (1568 of 2154) PASS: lldb-unit :: Utility/./UtilityTests/StringExtractorTest.GetHexBytesAvail (1569 of 2154) PASS: lldb-unit :: Utility/./UtilityTests/BinaryStreamTest.PutULEB128OneByte (1570 of 2154) PASS: lldb-api :: functionalities/data-formatter/nsdictionarysynth/TestNSDictionarySynthetic.py (1571 of 2154) PASS: lldb-api :: functionalities/thread/concurrent_events/TestConcurrentManyBreakpoints.py (1572 of 2154) PASS: lldb-api :: functionalities/asan/TestReportData.py (1573 of 2154) PASS: lldb-shell :: ObjectFile/ELF/build-id-case.yaml (1574 of 2154) PASS: lldb-api :: commands/expression/completion/TestExprCompletion.py (1575 of 2154) PASS: lldb-unit :: Utility/./UtilityTests/ProcessInstanceInfo.DumpTable_invalidUID (1576 of 2154) PASS: lldb-unit :: Process/gdb-remote/./ProcessGdbRemoteTests/GDBRemoteCommunicationClientTest.SendStopTracePacket (1577 of 2154) PASS: lldb-unit :: Language/Highlighting/./HighlighterTests/HighlighterTest.ClangBraces (1578 of 2154) PASS: lldb-api :: functionalities/breakpoint/breakpoint_command/TestRegexpBreakCommand.py (1579 of 2154) PASS: lldb-unit :: Core/./LLDBCoreTests/RichManglingContextTest.Basic (1580 of 2154) PASS: lldb-api :: python_api/value/empty_class/TestValueAPIEmptyClass.py (1581 of 2154) UNSUPPORTED: lldb-shell :: Register/x86-ymm-write.test (1582 of 2154) UNSUPPORTED: lldb-api :: python_api/event/TestEvents.py (1583 of 2154) UNSUPPORTED: lldb-api :: functionalities/darwin_log/source/debug/TestDarwinLogSourceDebug.py (1584 of 2154) UNSUPPORTED: lldb-shell :: ScriptInterpreter/Lua/command_script_import.test (1585 of 2154) PASS: lldb-shell :: SymbolFile/DWARF/dwarf5-debug_line.s (1586 of 2154) PASS: lldb-shell :: ObjectFile/Breakpad/breakpad-identification.test (1587 of 2154) UNSUPPORTED: lldb-api :: tools/lldb-vscode/completions/TestVSCode_completions.py (1588 of 2154) PASS: lldb-api :: functionalities/jitloader_gdb/TestJITLoaderGDB.py (1589 of 2154) PASS: lldb-api :: functionalities/breakpoint/breakpoint_ignore_count/TestBreakpointIgnoreCount.py (1590 of 2154) PASS: lldb-api :: functionalities/load_using_paths/TestLoadUsingPaths.py (1591 of 2154) PASS: lldb-api :: python_api/section/TestSectionAPI.py (1592 of 2154) PASS: lldb-unit :: Utility/./UtilityTests/ArgsTest.TestOverwriteArgs (1593 of 2154) PASS: lldb-api :: functionalities/target-new-solib-notifications/TestModuleLoadedNotifys.py (1594 of 2154) PASS: lldb-api :: functionalities/thread/jump/TestThreadJump.py (1595 of 2154) PASS: lldb-unit :: Utility/./UtilityTests/ArgsTest.TestTrailingBackslash (1596 of 2154) PASS: lldb-unit :: tools/lldb-server/tests/./LLDBServerTests/StandardStartupTest.TestStopReplyContainsThreadPcs (1597 of 2154) PASS: lldb-unit :: Utility/./UtilityTests/StreamTest.AddressRangeInvalidRange (1598 of 2154) PASS: lldb-unit :: SymbolFile/DWARF/./SymbolFileDWARFTests/SymbolFileDWARFTests.ParseArangesNonzeroSegmentSize (1599 of 2154) PASS: lldb-unit :: Utility/./UtilityTests/UriParserTest.BracketedHostnameWithPortIPv4 (1600 of 2154) PASS: lldb-unit :: Utility/./UtilityTests/StringExtractorTest.InitEmpty (1601 of 2154) PASS: lldb-shell :: ObjectFile/PECOFF/basic-info-arm.yaml (1602 of 2154) PASS: lldb-unit :: Utility/./UtilityTests/RegularExpression.CopyAssignment (1603 of 2154) PASS: lldb-unit :: Utility/./UtilityTests/SerializationRountripTest.SerializeDeserializePodReferences (1604 of 2154) PASS: lldb-unit :: Process/gdb-remote/./ProcessGdbRemoteTests/GDBRemoteCommunicationClientTest.GetMemoryRegionInfoInvalidResponse (1605 of 2154) PASS: lldb-api :: tools/lldb-server/TestGdbRemoteProcessInfo.py (1606 of 2154) PASS: lldb-unit :: UnwindAssembly/x86/./UnwindAssemblyx86Tests/Testx86AssemblyInspectionEngine.TestPushECX (1607 of 2154) PASS: lldb-shell :: SymbolFile/NativePDB/nested-types.cpp (1608 of 2154) PASS: lldb-unit :: Utility/./UtilityTests/CompletionRequest.DuplicateFiltering (1609 of 2154) PASS: lldb-api :: types/TestCharTypeExpr.py (1610 of 2154) PASS: lldb-unit :: Utility/./UtilityTests/StreamTest.PutNHex8 (1611 of 2154) PASS: lldb-unit :: Symbol/./SymbolTests/TestTypeSystemClang.TestOwningModule (1612 of 2154) PASS: lldb-shell :: Driver/TestHelp.test (1613 of 2154) PASS: lldb-api :: tools/lldb-vscode/stackTrace/TestVSCode_stackTrace.py (1614 of 2154) PASS: lldb-api :: commands/expression/import_base_class_when_class_has_derived_member/TestImportBaseClassWhenClassHasDerivedMember.py (1615 of 2154) PASS: lldb-shell :: Reproducer/TestCaptureEnvOverride.test (1616 of 2154) PASS: lldb-api :: functionalities/inferior-crashing/TestInferiorCrashing.py (1617 of 2154) PASS: lldb-unit :: Process/minidump/./LLDBMinidumpTests/MinidumpParserTest.GetMiscInfo_no_stream (1618 of 2154) PASS: lldb-api :: functionalities/gdb_remote_client/TestNestedRegDefinitions.py (1619 of 2154) PASS: lldb-api :: functionalities/target_var/TestTargetVar.py (1620 of 2154) PASS: lldb-unit :: Expression/./ExpressionTests/CppModuleConfigurationTest.AmbiguousCLib (1621 of 2154) PASS: lldb-shell :: SymbolFile/Breakpad/line-table-discontinuous-file-ids.test (1622 of 2154) PASS: lldb-unit :: UnwindAssembly/x86/./UnwindAssemblyx86Tests/Testx86AssemblyInspectionEngine.Test64bitFramelessBigStackFrame (1623 of 2154) PASS: lldb-unit :: debugserver/./debugserverTests/RNBSocket.AnyListen (1624 of 2154) PASS: lldb-api :: lang/cpp/bitfields/TestCppBitfields.py (1625 of 2154) PASS: lldb-unit :: ScriptInterpreter/Python/./ScriptInterpreterPythonTests/PythonDataObjectsTest.TestPythonListValueEquality (1626 of 2154) PASS: lldb-api :: commands/expression/issue_11588/Test11588.py (1627 of 2154) PASS: lldb-unit :: ScriptInterpreter/Python/./ScriptInterpreterPythonTests/PythonDataObjectsTest.TestPythonByteArray (1628 of 2154) PASS: lldb-unit :: Process/gdb-remote/./ProcessGdbRemoteTests/GDBRemoteCommunicationClientTest.GetModulesInfo (1629 of 2154) PASS: lldb-api :: functionalities/mtc/simple/TestMTCSimple.py (1630 of 2154) PASS: lldb-shell :: Settings/TestLineMarkerColor.test (1631 of 2154) PASS: lldb-api :: functionalities/data-formatter/data-formatter-stl/libcxx/forward_list/TestDataFormatterLibcxxForwardList.py (1632 of 2154) PASS: lldb-unit :: Process/minidump/./LLDBMinidumpTests/MinidumpParserTest.InvalidMinidump (1633 of 2154) PASS: lldb-unit :: Utility/./UtilityTests/ProcessInstanceInfoMatch.Name (1634 of 2154) PASS: lldb-api :: commands/frame/diagnose/inheritance/TestDiagnoseInheritance.py (1635 of 2154) PASS: lldb-api :: functionalities/postmortem/netbsd-core/TestNetBSDCore.py (1636 of 2154) PASS: lldb-api :: functionalities/data-formatter/data-formatter-objc/TestDataFormatterObjCNSURL.py (1637 of 2154) PASS: lldb-api :: lang/objc/modules-compile-error/TestModulesCompileError.py (1638 of 2154) PASS: lldb-shell :: Register/x86-64-ymm-read.test (1639 of 2154) PASS: lldb-api :: python_api/watchpoint/TestWatchpointIgnoreCount.py (1640 of 2154) PASS: lldb-api :: lang/objc/self/TestObjCSelf.py (1641 of 2154) PASS: lldb-api :: types/TestCharType.py (1642 of 2154) PASS: lldb-api :: sample_test/TestSampleInlineTest.py (1643 of 2154) PASS: lldb-api :: functionalities/set-data/TestSetData.py (1644 of 2154) PASS: lldb-api :: commands/platform/basic/TestPlatformPython.py (1645 of 2154) PASS: lldb-unit :: Host/./HostTests/HostInfoTest.GetHostname (1646 of 2154) PASS: lldb-unit :: Core/./LLDBCoreTests/ModuleSpecTest.InvalidInMemoryBufferValidFile (1647 of 2154) PASS: lldb-api :: functionalities/breakpoint/breakpoint_ids/TestBreakpointIDs.py (1648 of 2154) PASS: lldb-unit :: Utility/./UtilityTests/RangeTest.Union (1649 of 2154) PASS: lldb-unit :: Interpreter/./InterpreterTests/OptionArgParserTest.toBoolean (1650 of 2154) PASS: lldb-shell :: SymbolFile/Breakpad/line-table-edgecases.test (1651 of 2154) PASS: lldb-api :: functionalities/pointer_num_children/TestPointerNumChildren.py (1652 of 2154) UNSUPPORTED: lldb-api :: lang/objc/rdar-12408181/TestRdar12408181.py (1653 of 2154) PASS: lldb-unit :: Utility/./UtilityTests/LogChannelTest.Enable (1654 of 2154) PASS: lldb-api :: lang/cpp/template-function/TestTemplateFunctions.py (1655 of 2154) PASS: lldb-unit :: Thread/./ThreadTests/ThreadTest.GetPrivateStopInfo (1656 of 2154) PASS: lldb-unit :: UnwindAssembly/x86/./UnwindAssemblyx86Tests/Testx86AssemblyInspectionEngine.TestStackRealignMSVC_i386 (1657 of 2154) PASS: lldb-api :: commands/expression/codegen-crash-typedefdecl-not-in_declcontext/TestCodegenCrashTypedefDeclNotInDeclContext.py (1658 of 2154) UNSUPPORTED: lldb-shell :: Register/x86-64-xmm16-read.test (1659 of 2154) PASS: lldb-unit :: UnwindAssembly/x86/./UnwindAssemblyx86Tests/Testx86AssemblyInspectionEngine.TestAddRSP (1660 of 2154) PASS: lldb-api :: functionalities/data-formatter/type_summary_list_arg/TestTypeSummaryListArg.py (1661 of 2154) PASS: lldb-api :: functionalities/data-formatter/data-formatter-objc/cmtime/TestDataFormatterCMTime.py (1662 of 2154) UNSUPPORTED: lldb-api :: tools/lldb-server/TestGdbRemoteAuxvSupport.py (1663 of 2154) PASS: lldb-unit :: Utility/./UtilityTests/ArchSpecTest.MergeFrom (1664 of 2154) PASS: lldb-unit :: Utility/./UtilityTests/StringExtractorTest.GetNameColonValueNoSemicolon (1665 of 2154) UNSUPPORTED: lldb-api :: functionalities/darwin_log/filter/regex/activity-chain/TestDarwinLogFilterRegexActivityChain.py (1666 of 2154) PASS: lldb-unit :: Utility/./UtilityTests/ConstStringTest.format_provider (1667 of 2154) UNSUPPORTED: lldb-shell :: Register/arm-fp-read.test (1668 of 2154) PASS: lldb-shell :: Minidump/no-process-id.yaml (1669 of 2154) PASS: lldb-api :: functionalities/gdb_remote_client/TestQemuAArch64TargetXml.py (1670 of 2154) PASS: lldb-shell :: Settings/TestEchoCommands.test (1671 of 2154) PASS: lldb-api :: functionalities/exec/TestExec.py (1672 of 2154) UNSUPPORTED: lldb-api :: tools/lldb-server/libraries-svr4/TestGdbRemoteLibrariesSvr4Support.py (1673 of 2154) PASS: lldb-api :: functionalities/data-formatter/hexcaps/TestDataFormatterHexCaps.py (1674 of 2154) PASS: lldb-api :: functionalities/tsan/thread_numbers/TestTsanThreadNumbers.py (1675 of 2154) PASS: lldb-unit :: Utility/./UtilityTests/CompletionRequest.TryCompleteCurrentArgMode (1676 of 2154) PASS: lldb-api :: commands/process/attach/TestProcessAttach.py (1677 of 2154) PASS: lldb-unit :: UnwindAssembly/x86/./UnwindAssemblyx86Tests/Testx86AssemblyInspectionEngine.TestPushEBP (1678 of 2154) PASS: lldb-unit :: Expression/./ExpressionTests/DiagnosticManagerTest.PutString (1679 of 2154) PASS: lldb-api :: functionalities/thread/state_after_expression/TestStateAfterExpression.py (1680 of 2154) PASS: lldb-unit :: SymbolFile/DWARF/./SymbolFileDWARFTests/SymbolFileDWARFTests.TestAbbrevOrder1Start5 (1681 of 2154) PASS: lldb-api :: functionalities/archives/TestBSDArchives.py (1682 of 2154) UNSUPPORTED: lldb-shell :: Process/Windows/exception_access_violation.cpp (1683 of 2154) PASS: lldb-unit :: Utility/./UtilityTests/StreamTest.ShiftOperatorChars (1684 of 2154) PASS: lldb-api :: commands/expression/xvalue/TestXValuePrinting.py (1685 of 2154) PASS: lldb-unit :: Utility/./UtilityTests/StringListTest.GetMaxStringLengthIncreasingSize (1686 of 2154) PASS: lldb-shell :: SymbolFile/DWARF/debug-names-compressed.cpp (1687 of 2154) PASS: lldb-unit :: Utility/./UtilityTests/LogChannelEnabledTest.LogThread (1688 of 2154) PASS: lldb-api :: driver/batch_mode/TestBatchMode.py (1689 of 2154) PASS: lldb-api :: functionalities/inferior-crashing/recursive-inferior/TestRecursiveInferior.py (1690 of 2154) PASS: lldb-unit :: Host/./HostTests/FileSystemTest.EnumerateDirectory (1691 of 2154) PASS: lldb-unit :: Core/./LLDBCoreTests/MangledTest.ResultForValidName (1692 of 2154) PASS: lldb-unit :: Process/gdb-remote/./ProcessGdbRemoteTests/GDBRemoteClientBaseTest.SendContinueAndInterrupt (1693 of 2154) PASS: lldb-api :: commands/version/TestVersion.py (1694 of 2154) PASS: lldb-api :: functionalities/breakpoint/breakpoint_callback_command_source/TestBreakpointCallbackCommandSource.py (1695 of 2154) UNSUPPORTED: lldb-shell :: Breakpoint/case-insensitive.test (1696 of 2154) PASS: lldb-api :: commands/expression/import-std-module/forward_list/TestForwardListFromStdModule.py (1697 of 2154) PASS: lldb-api :: functionalities/data-formatter/data-formatter-enum-format/TestDataFormatterEnumFormat.py (1698 of 2154) PASS: lldb-api :: python_api/watchpoint/TestSetWatchpoint.py (1699 of 2154) PASS: lldb-unit :: Utility/./UtilityTests/RangeTest.DoesIntersect (1700 of 2154) PASS: lldb-unit :: Utility/./UtilityTests/ScalarTest.GetBytes (1701 of 2154) PASS: lldb-unit :: Utility/./UtilityTests/RangeTest.DoesAdjoinOrIntersect (1702 of 2154) UNSUPPORTED: lldb-shell :: Register/x86-64-ymm16-write.test (1703 of 2154) PASS: lldb-shell :: Reproducer/Functionalities/TestImageList.test (1704 of 2154) PASS: lldb-unit :: Utility/./UtilityTests/ScalarTest.SetValueFromData (1705 of 2154) PASS: lldb-api :: functionalities/memory-region/TestMemoryRegion.py (1706 of 2154) PASS: lldb-unit :: Utility/./UtilityTests/StringListTest.ForRange (1707 of 2154) PASS: lldb-api :: commands/expression/class_template_specialization_empty_pack/TestClassTemplateSpecializationParametersHandling.py (1708 of 2154) PASS: lldb-shell :: ObjectFile/MachO/lc_build_version.yaml (1709 of 2154) PASS: lldb-api :: commands/frame/var-scope/TestFrameVariableScope.py (1710 of 2154) PASS: lldb-api :: commands/expression/persistent_ptr_update/TestPersistentPtrUpdate.py (1711 of 2154) PASS: lldb-shell :: SymbolFile/DWARF/dwo-type-in-main-file.s (1712 of 2154) PASS: lldb-unit :: ScriptInterpreter/Python/./ScriptInterpreterPythonTests/PythonDataObjectsTest.TestPythonTupleValues (1713 of 2154) PASS: lldb-unit :: Utility/./UtilityTests/ArgsTest.TestSingleArgWithQuotedSpace (1714 of 2154) PASS: lldb-api :: commands/command/script_alias/TestCommandScriptAlias.py (1715 of 2154) PASS: lldb-api :: commands/expression/import-std-module/no-std-module/TestMissingStdModule.py (1716 of 2154) PASS: lldb-api :: functionalities/gdb_remote_client/TestNoWatchpointSupportInfo.py (1717 of 2154) PASS: lldb-api :: functionalities/gdb_remote_client/TestJLink6Armv7RegisterDefinition.py (1718 of 2154) UNSUPPORTED: lldb-api :: functionalities/data-formatter/data-formatter-stl/libstdcpp/iterator/TestDataFormatterStdIterator.py (1719 of 2154) UNSUPPORTED: lldb-shell :: Register/x86-zmm-write.test (1720 of 2154) PASS: lldb-unit :: Utility/./UtilityTests/StreamTest.PutHex64ByteOrderBig (1721 of 2154) PASS: lldb-shell :: SymbolFile/DWARF/dwarf5-atomic.s (1722 of 2154) PASS: lldb-unit :: Utility/./UtilityTests/StringListTest.PopBack (1723 of 2154) PASS: lldb-shell :: Settings/TestDisableColor.test (1724 of 2154) UNSUPPORTED: lldb-api :: functionalities/data-formatter/data-formatter-stl/libstdcpp/tuple/TestDataFormatterStdTuple.py (1725 of 2154) PASS: lldb-unit :: UnwindAssembly/x86/./UnwindAssemblyx86Tests/Testx86AssemblyInspectionEngine.Test32bitFramelessBigStackFrame (1726 of 2154) PASS: lldb-unit :: DataFormatter/./LLDBFormatterTests/StringPrinterTests.CxxUTF8 (1727 of 2154) PASS: lldb-api :: lang/objc/foundation/TestObjCMethodsNSError.py (1728 of 2154) PASS: lldb-api :: commands/expression/import-std-module/vector-dbg-info-content/TestDbgInfoContentVectorFromStdModule.py (1729 of 2154) PASS: lldb-unit :: Expression/./ExpressionTests/CppModuleConfigurationTest.UnknownLibCppFile (1730 of 2154) PASS: lldb-shell :: Reproducer/TestCrash.test (1731 of 2154) PASS: lldb-shell :: SymbolFile/DWARF/array-sizes.s (1732 of 2154) PASS: lldb-unit :: Core/./LLDBCoreTests/SourceFileCache.FindSourceFileNotFound (1733 of 2154) PASS: lldb-unit :: Core/./LLDBCoreTests/CommunicationTest.SynchronizeWhileClosing (1734 of 2154) PASS: lldb-unit :: Host/./HostTests/NativeProcessProtocolTest.ReadMemoryWithoutTrap (1735 of 2154) PASS: lldb-api :: lang/cpp/signed_types/TestSignedTypes.py (1736 of 2154) PASS: lldb-unit :: API/./APITests/SBCommandInterpreterTest.SingleWordCommand (1737 of 2154) PASS: lldb-unit :: Utility/./UtilityTests/Flags.AllClear (1738 of 2154) UNSUPPORTED: lldb-shell :: Register/x86-64-zmm-write.test (1739 of 2154) PASS: lldb-shell :: ObjectFile/PECOFF/uuid.yaml (1740 of 2154) PASS: lldb-unit :: Host/./HostTests/MainLoopTest.UnmonitoredSignal (1741 of 2154) PASS: lldb-unit :: Platform/./LLDBPlatformTests/PlatformDarwinTest.TestParseVersionBuildDir (1742 of 2154) PASS: lldb-unit :: Utility/./UtilityTests/StreamTest.PutMaxHex64ByteOrderLittle (1743 of 2154) PASS: lldb-api :: tools/lldb-server/inferior-crash/TestGdbRemoteSegFault.py (1744 of 2154) PASS: lldb-unit :: Utility/./UtilityTests/StreamTest.AddressRangeSize (1745 of 2154) PASS: lldb-unit :: Utility/./UtilityTests/VMRange.Clear (1746 of 2154) PASS: lldb-shell :: Reproducer/Functionalities/TestDataFormatter.test (1747 of 2154) PASS: lldb-api :: lang/objc/forward-decl/TestForwardDecl.py (1748 of 2154) PASS: lldb-api :: tools/lldb-vscode/runInTerminal/TestVSCode_runInTerminal.py (1749 of 2154) PASS: lldb-api :: commands/frame/diagnose/bad-reference/TestBadReference.py (1750 of 2154) PASS: lldb-api :: commands/expression/calculator_mode/TestCalculatorMode.py (1751 of 2154) PASS: lldb-shell :: SymbolFile/DWARF/debug_aranges-empty-section.s (1752 of 2154) PASS: lldb-api :: lang/cpp/multiple-inheritance/TestCppMultipleInheritance.py (1753 of 2154) PASS: lldb-shell :: SymbolFile/DWARF/static_scope.s (1754 of 2154) PASS: lldb-unit :: Utility/./UtilityTests/StreamTeeTest.Assignment (1755 of 2154) PASS: lldb-unit :: Utility/./UtilityTests/StreamTest.PutMaxHex64ByteOrderBig (1756 of 2154) PASS: lldb-unit :: Core/./LLDBCoreTests/StreamCallbackTest.Callback (1757 of 2154) PASS: lldb-unit :: Host/./HostTests/NativeProcessProtocolTest.SetBreakpointFailWrite (1758 of 2154) PASS: lldb-unit :: UnwindAssembly/x86/./UnwindAssemblyx86Tests/Testx86AssemblyInspectionEngine.TestSpillRegToStackViaMOVi386 (1759 of 2154) PASS: lldb-api :: functionalities/data-formatter/data-formatter-objc/TestDataFormatterObjCNSError.py (1760 of 2154) PASS: lldb-shell :: SymbolFile/Breakpad/line-table-mixed-path-styles.test (1761 of 2154) PASS: lldb-unit :: Utility/./UtilityTests/StringExtractorTest.GetHexBytes (1762 of 2154) PASS: lldb-api :: commands/thread/select/TestThreadSelect.py (1763 of 2154) PASS: lldb-unit :: Process/gdb-remote/./ProcessGdbRemoteTests/GDBRemoteCommunicationClientTest.WriteRegisterNoSuffix (1764 of 2154) PASS: lldb-unit :: Utility/./UtilityTests/ScalarTest.APIntConstructor (1765 of 2154) PASS: lldb-api :: python_api/sblaunchinfo/TestSBLaunchInfo.py (1766 of 2154) PASS: lldb-unit :: Host/./HostTests/NativeProcessProtocolTest.ReadCStringFromMemory_MaxSize (1767 of 2154) PASS: lldb-api :: commands/platform/process/list/TestProcessList.py (1768 of 2154) PASS: lldb-api :: functionalities/lazy-loading/TestLazyLoading.py (1769 of 2154) PASS: lldb-unit :: Utility/./UtilityTests/ScalarTest.GetValue (1770 of 2154) PASS: lldb-shell :: SymbolFile/DWARF/debug_rnglists.s (1771 of 2154) PASS: lldb-unit :: Editline/./EditlineTests/EditlineTestFixture.EditlineReceivesSingleLineText (1772 of 2154) PASS: lldb-unit :: Utility/./UtilityTests/StringLexerTest.Next (1773 of 2154) PASS: lldb-api :: commands/command/script/import/TestImport.py (1774 of 2154) PASS: lldb-unit :: Utility/./UtilityTests/FileSpecTest.CopyByAppendingPathComponent (1775 of 2154) XFAIL: lldb-shell :: Register/x86-64-ymm-write.test (1776 of 2154) PASS: lldb-unit :: Utility/./UtilityTests/Flags.Reset (1777 of 2154) PASS: lldb-unit :: Process/minidump/./LLDBMinidumpTests/MinidumpParserTest.GetMiscInfoWindows (1778 of 2154) PASS: lldb-api :: functionalities/gdb_remote_client/TestPlatformClient.py (1779 of 2154) PASS: lldb-unit :: Utility/./UtilityTests/StringExtractorTest.GetHexBytes_OddPair (1780 of 2154) PASS: lldb-api :: tools/lldb-vscode/module/TestVSCode_module.py (1781 of 2154) PASS: lldb-shell :: SymbolFile/DWARF/DW_AT_const_value.s (1782 of 2154) PASS: lldb-unit :: Process/gdb-remote/./ProcessGdbRemoteTests/GDBRemoteClientBaseTest.SendPacketAndReceiveResponseWithOutputSupport (1783 of 2154) PASS: lldb-api :: functionalities/thread/concurrent_events/TestConcurrentCrashWithBreak.py (1784 of 2154) PASS: lldb-unit :: Symbol/./SymbolTests/TestTypeSystemClang.TestDisplayName (1785 of 2154) PASS: lldb-api :: lang/objc/rdar-10967107/TestRdar10967107.py (1786 of 2154) PASS: lldb-unit :: ScriptInterpreter/Python/./ScriptInterpreterPythonTests/PythonDataObjectsTest.TestPythonCallableCheck (1787 of 2154) PASS: lldb-api :: commands/watchpoints/watchpoint_events/TestWatchpointEvents.py (1788 of 2154) PASS: lldb-api :: python_api/lldbutil/process/TestPrintStackTraces.py (1789 of 2154) PASS: lldb-unit :: Utility/./UtilityTests/FileSpecTest.EqualDotsPosixRoot (1790 of 2154) PASS: lldb-api :: lang/c/unions/TestUnionMembers.py (1791 of 2154) PASS: lldb-api :: functionalities/data-formatter/data-formatter-stl/libcxx/tuple/TestDataFormatterLibcxxTuple.py (1792 of 2154) PASS: lldb-api :: lang/mixed/TestMixedLanguages.py (1793 of 2154) PASS: lldb-api :: tools/lldb-server/register-reading/TestGdbRemoteGPacket.py (1794 of 2154) PASS: lldb-api :: functionalities/thread/concurrent_events/TestConcurrentWatchBreakDelay.py (1795 of 2154) PASS: lldb-api :: macosx/universal/TestUniversal.py (1796 of 2154) PASS: lldb-api :: commands/expression/multiline-completion/TestMultilineCompletion.py (1797 of 2154) UNSUPPORTED: lldb-api :: functionalities/process_save_core/TestProcessSaveCore.py (1798 of 2154) PASS: lldb-unit :: Host/./HostTests/HostInfoTest.GetXcodeSDK (1799 of 2154) PASS: lldb-unit :: Utility/./UtilityTests/DataExtractorTest.GetBitfield (1800 of 2154) PASS: lldb-shell :: Driver/TestFile.test (1801 of 2154) PASS: lldb-unit :: Utility/./UtilityTests/RegularExpression.Match (1802 of 2154) PASS: lldb-shell :: Breakpoint/debug_rnglist_offset_pair.test (1803 of 2154) PASS: lldb-unit :: Utility/./UtilityTests/RangeTest.Slide (1804 of 2154) PASS: lldb-api :: functionalities/thread/concurrent_events/TestConcurrentWatchBreak.py (1805 of 2154) PASS: lldb-unit :: Process/minidump/./LLDBMinidumpTests/MinidumpParserTest.GetThreadContext_x86_32_wow64 (1806 of 2154) PASS: lldb-api :: python_api/module_section/TestModuleAndSection.py (1807 of 2154) PASS: lldb-api :: commands/add-dsym/uuid/TestAddDsymCommand.py (1808 of 2154) PASS: lldb-api :: functionalities/data-formatter/data-formatter-named-summaries/TestDataFormatterNamedSummaries.py (1809 of 2154) PASS: lldb-unit :: Process/gdb-remote/./ProcessGdbRemoteTests/GDBRemoteCommunicationClientTest.GetMemoryRegionInfo (1810 of 2154) PASS: lldb-api :: lang/cpp/function_refs/TestFunctionRefs.py (1811 of 2154) PASS: lldb-unit :: Expression/./ExpressionTests/DiagnosticManagerTest.PutStringSeverities (1812 of 2154) PASS: lldb-api :: functionalities/postmortem/mach-core/TestMachCore.py (1813 of 2154) PASS: lldb-unit :: Host/./HostTests/SocketTest.DecodeHostAndPort (1814 of 2154) PASS: lldb-unit :: Utility/./UtilityTests/OptionsWithRawTest.EmptySuffix (1815 of 2154) PASS: lldb-unit :: Utility/./UtilityTests/StreamTeeTest.GetStreamAtIndexOutOfBoundsEmpty (1816 of 2154) PASS: lldb-unit :: Utility/./UtilityTests/SerializationRountripTest.SerializeDeserializePodPointers (1817 of 2154) PASS: lldb-unit :: Utility/./UtilityTests/StringExtractorTest.InitMisc (1818 of 2154) PASS: lldb-api :: lang/objc/modules/TestObjCModules.py (1819 of 2154) PASS: lldb-api :: lang/objc/objc-ivar-offsets/TestObjCIvarOffsets.py (1820 of 2154) PASS: lldb-shell :: SymbolFile/Breakpad/symtab.test (1821 of 2154) PASS: lldb-api :: python_api/watchpoint/condition/TestWatchpointConditionAPI.py (1822 of 2154) PASS: lldb-shell :: Breakpoint/debug_addrx.test (1823 of 2154) PASS: lldb-unit :: Utility/./UtilityTests/VASprintfTest.BufferResize (1824 of 2154) PASS: lldb-api :: macosx/find-dsym/bundle-with-dot-in-filename/TestBundleWithDotInFilename.py (1825 of 2154) PASS: lldb-api :: lang/cpp/std-function-step-into-callable/TestStdFunctionStepIntoCallable.py (1826 of 2154) UNSUPPORTED: lldb-api :: arm/breakpoint-it/TestBreakpointIt.py (1827 of 2154) PASS: lldb-api :: functionalities/data-formatter/data-formatter-objc/nsstring/TestDataFormatterNSString.py (1828 of 2154) PASS: lldb-api :: functionalities/tsan/cpp_global_location/TestTsanCPPGlobalLocation.py (1829 of 2154) PASS: lldb-api :: python_api/disassemble-raw-data/TestDisassemble_VST1_64.py (1830 of 2154) UNSUPPORTED: lldb-shell :: SymbolFile/PDB/class-layout.test (1831 of 2154) PASS: lldb-api :: lang/cpp/namespace/TestNamespaceLookup.py (1832 of 2154) PASS: lldb-unit :: Utility/./UtilityTests/VASprintfTest.NoBufferResize (1833 of 2154) PASS: lldb-unit :: Utility/./UtilityTests/StringListTest.SplitIntoLinesSingleTrailingCR (1834 of 2154) PASS: lldb-api :: lang/cpp/limit-debug-info/TestWithLimitDebugInfo.py (1835 of 2154) PASS: lldb-shell :: SymbolFile/Breakpad/unwind-via-stack-win.test (1836 of 2154) PASS: lldb-unit :: SymbolFile/NativePDB/./SymbolFileNativePDBTests/PDBFPOProgramToDWARFExpressionTests.UnknownOp (1837 of 2154) PASS: lldb-api :: functionalities/memory/find/TestMemoryFind.py (1838 of 2154) PASS: lldb-api :: commands/register/register/register_command/TestRegisters.py (1839 of 2154) PASS: lldb-unit :: UnwindAssembly/x86/./UnwindAssemblyx86Tests/Testx86AssemblyInspectionEngine.TestStackRealign32BitDisp_x86_64 (1840 of 2154) PASS: lldb-api :: tools/lldb-server/TestGdbRemote_vCont.py (1841 of 2154) PASS: lldb-unit :: Process/gdb-remote/./ProcessGdbRemoteTests/GDBRemoteClientBaseTest.SendContinueAndLateInterrupt (1842 of 2154) PASS: lldb-unit :: Process/gdb-remote/./ProcessGdbRemoteTests/GDBRemoteCommunicationClientTest.SendGetDataPacket (1843 of 2154) PASS: lldb-unit :: UnwindAssembly/x86/./UnwindAssemblyx86Tests/Testx86AssemblyInspectionEngine.TestPopR14 (1844 of 2154) PASS: lldb-api :: functionalities/thread/concurrent_events/TestConcurrentWatchpointDelayWatchpointOneBreakpoint.py (1845 of 2154) PASS: lldb-api :: macosx/lc-note/kern-ver-str/TestKernVerStrLCNOTE.py (1846 of 2154) PASS: lldb-shell :: Quit/TestQuitExitCodeImplicit0.test (1847 of 2154) PASS: lldb-shell :: ObjectFile/PECOFF/disassemble-thumb.yaml (1848 of 2154) PASS: lldb-shell :: SymbolFile/DWARF/debug_loc-aslr.s (1849 of 2154) PASS: lldb-api :: lang/c/tls_globals/TestTlsGlobals.py (1850 of 2154) PASS: lldb-unit :: Host/./HostTests/FileSystemTest.FileAndDirectoryComponents (1851 of 2154) PASS: lldb-unit :: Utility/./UtilityTests/XcodeSDKTest.ParseTest (1852 of 2154) PASS: lldb-api :: functionalities/tail_call_frames/thread_step_out_message/TestArtificialFrameStepOutMessage.py (1853 of 2154) PASS: lldb-unit :: Utility/./UtilityTests/StringListTest.AppendListCStringArrayEmpty (1854 of 2154) PASS: lldb-api :: functionalities/data-formatter/data-formatter-synth/TestDataFormatterSynth.py (1855 of 2154) PASS: lldb-shell :: SymbolFile/DWARF/find-method.cpp (1856 of 2154) UNSUPPORTED: lldb-api :: benchmarks/startup/TestStartupDelays.py (1857 of 2154) PASS: lldb-api :: commands/expression/function_template_specialization_temp_args/TestFunctionTemplateSpecializationTempArgs.py (1858 of 2154) PASS: lldb-api :: functionalities/data-formatter/nssetsynth/TestNSSetSynthetic.py (1859 of 2154) PASS: lldb-unit :: Utility/./UtilityTests/ScalarTest.ComparisonFloat (1860 of 2154) PASS: lldb-api :: python_api/target/TestTargetAPI.py (1861 of 2154) PASS: lldb-api :: lang/c/const_variables/TestConstVariables.py (1862 of 2154) PASS: lldb-unit :: Utility/./UtilityTests/UserIDResolver.GetUserName (1863 of 2154) PASS: lldb-api :: lang/cpp/inlines/TestInlines.py (1864 of 2154) PASS: lldb-unit :: UnwindAssembly/x86/./UnwindAssemblyx86Tests/Testx86AssemblyInspectionEngine.TestSpillRegToStackViaMOVx86_64 (1865 of 2154) PASS: lldb-unit :: Utility/./UtilityTests/ListenerTest.GetEventWait (1866 of 2154) PASS: lldb-shell :: Reproducer/TestDriverOptions.test (1867 of 2154) PASS: lldb-api :: functionalities/multiword-commands/TestMultiWordCommands.py (1868 of 2154) PASS: lldb-unit :: Utility/./UtilityTests/ConstStringTest.CompareConstString (1869 of 2154) PASS: lldb-unit :: SymbolFile/DWARF/./SymbolFileDWARFTests/SymbolFileDWARFTests.ParseAranges (1870 of 2154) PASS: lldb-unit :: ScriptInterpreter/Python/./ScriptInterpreterPythonTests/PythonDataObjectsTest.TestOwnedReferences (1871 of 2154) UNSUPPORTED: lldb-shell :: Register/x86-64-gp-write.test (1872 of 2154) PASS: lldb-unit :: UnwindAssembly/x86/./UnwindAssemblyx86Tests/Testx86AssemblyInspectionEngine.Testi386IgnoredRegisters (1873 of 2154) UNSUPPORTED: lldb-api :: functionalities/thread/create_during_step/TestCreateDuringStep.py (1874 of 2154) PASS: lldb-unit :: Utility/./UtilityTests/DataExtractorTest.GetMaxU64 (1875 of 2154) PASS: lldb-api :: functionalities/data-formatter/data-formatter-stl/libcxx/unique_ptr/TestDataFormatterLibcxxUniquePtr.py (1876 of 2154) PASS: lldb-unit :: Utility/./UtilityTests/UriParserTest.BracketedHostnameWithPortIPv6 (1877 of 2154) PASS: lldb-api :: lang/objc/objc++/TestObjCXX.py (1878 of 2154) PASS: lldb-unit :: Utility/./UtilityTests/ArgsTest.ReplaceArgumentAtIndexFarOutOfRange (1879 of 2154) PASS: lldb-unit :: Interpreter/./InterpreterTests/CompletionTest.DirCompletionUsername (1880 of 2154) PASS: lldb-shell :: Quit/TestQuitExitCode-30.test (1881 of 2154) PASS: lldb-shell :: SymbolFile/DWARF/DW_AT_data_bit_offset-DW_OP_stack_value.s (1882 of 2154) PASS: lldb-api :: python_api/lldbutil/iter/TestRegistersIterator.py (1883 of 2154) PASS: lldb-api :: python_api/interpreter/TestRunCommandInterpreterAPI.py (1884 of 2154) PASS: lldb-shell :: Quit/TestQuitExitCode0.test (1885 of 2154) PASS: lldb-api :: types/TestLongTypesExpr.py (1886 of 2154) PASS: lldb-shell :: Breakpoint/case-sensitive.test (1887 of 2154) PASS: lldb-api :: lang/cpp/class_types/TestClassTypesDisassembly.py (1888 of 2154) PASS: lldb-api :: python_api/process/TestProcessAPI.py (1889 of 2154) PASS: lldb-api :: commands/watchpoints/watchpoint_commands/command/TestWatchpointCommandPython.py (1890 of 2154) PASS: lldb-unit :: SymbolFile/NativePDB/./SymbolFileNativePDBTests/PDBFPOProgramToDWARFExpressionTests.MissingTargetRegister (1891 of 2154) PASS: lldb-shell :: Settings/TestSettingsSet.test (1892 of 2154) PASS: lldb-unit :: SymbolFile/NativePDB/./SymbolFileNativePDBTests/PDBFPOProgramToDWARFExpressionTests.UnresolvedRegisterReference (1893 of 2154) PASS: lldb-unit :: Utility/./UtilityTests/Flags.GetBitSize (1894 of 2154) PASS: lldb-unit :: Utility/./UtilityTests/RangeDataVector.FindEntryThatContains (1895 of 2154) PASS: lldb-shell :: SymbolFile/Breakpad/symtab-macho.test (1896 of 2154) PASS: lldb-api :: commands/expression/entry-bp/TestExprEntryBP.py (1897 of 2154) PASS: lldb-unit :: Utility/./UtilityTests/StringExtractorTest.GetHexU8_InvalidHex_NoEof (1898 of 2154) PASS: lldb-unit :: Utility/./UtilityTests/TimeoutTest.Format (1899 of 2154) PASS: lldb-api :: lang/c/modules/TestCModules.py (1900 of 2154) PASS: lldb-unit :: Target/./TargetTests/ModuleCacheTest.GetAndPutUuidExists (1901 of 2154) PASS: lldb-api :: commands/target/stop-hook/delete/TestTargetStopHookDelete.py (1902 of 2154) PASS: lldb-unit :: Utility/./UtilityTests/EventTest.DumpEventDataBytes (1903 of 2154) PASS: lldb-unit :: Utility/./UtilityTests/TimeoutTest.Construction (1904 of 2154) PASS: lldb-unit :: Utility/./UtilityTests/ReproducerTest.SetCapture (1905 of 2154) PASS: lldb-api :: functionalities/breakpoint/address_breakpoints/TestAddressBreakpoints.py (1906 of 2154) PASS: lldb-unit :: Expression/./ExpressionTests/DiagnosticManagerTest.GetStringNoDiags (1907 of 2154) PASS: lldb-unit :: Utility/./UtilityTests/FileSpecTest.EqualDotsWindows (1908 of 2154) PASS: lldb-api :: functionalities/data-formatter/boolreference/TestFormattersBoolRefPtr.py (1909 of 2154) PASS: lldb-unit :: Utility/./UtilityTests/ArgsTest.TestMultipleArgs (1910 of 2154) PASS: lldb-api :: functionalities/thread/concurrent_events/TestConcurrentDelayWatchBreak.py (1911 of 2154) PASS: lldb-unit :: Signals/./SignalsTests/UnixSignalsTest.GetFilteredSignals (1912 of 2154) PASS: lldb-api :: commands/watchpoints/watchpoint_set_command/TestWatchLocationWithWatchSet.py (1913 of 2154) PASS: lldb-unit :: Core/./LLDBCoreTests/ModuleSpecTest.TestCOFFFile (1914 of 2154) PASS: lldb-api :: lang/cpp/typeof/TestTypeOfDeclTypeExpr.py (1915 of 2154) PASS: lldb-unit :: Utility/./UtilityTests/EnvironmentTest.EnvpConstruction (1916 of 2154) PASS: lldb-shell :: Reproducer/TestDump.test (1917 of 2154) PASS: lldb-unit :: Host/./HostTests/SocketAddressTest.GetAddressInfo (1918 of 2154) PASS: lldb-api :: functionalities/breakpoint/step_over_breakpoint/TestStepOverBreakpoint.py (1919 of 2154) PASS: lldb-unit :: Host/./HostTests/FileSystemTest.GetPermissions (1920 of 2154) PASS: lldb-unit :: Language/Highlighting/./HighlighterTests/HighlighterTest.HighlighterSelectionType (1921 of 2154) PASS: lldb-shell :: SymbolFile/DWARF/win-i386-line-table.s (1922 of 2154) PASS: lldb-api :: tools/lldb-server/TestGdbRemoteAttach.py (1923 of 2154) PASS: lldb-unit :: Utility/./UtilityTests/LogChannelTest.Disable (1924 of 2154) PASS: lldb-unit :: Process/minidump/./LLDBMinidumpTests/MinidumpParserTest.FindMemoryRangeWithFullMemoryMinidump (1925 of 2154) PASS: lldb-api :: functionalities/data-formatter/data-formatter-stl/libcxx/initializerlist/TestInitializerList.py (1926 of 2154) PASS: lldb-api :: functionalities/thread/concurrent_events/TestConcurrentBreakpointOneDelayBreakpointThreads.py (1927 of 2154) PASS: lldb-unit :: Core/./LLDBCoreTests/SourceFileCache.FindSourceFileFound (1928 of 2154) PASS: lldb-unit :: Utility/./UtilityTests/StreamTest.AddressPrefix (1929 of 2154) PASS: lldb-api :: commands/platform/file/close/TestPlatformFileClose.py (1930 of 2154) PASS: lldb-unit :: Target/./TargetTests/PathMappingListTest.RelativeTests (1931 of 2154) PASS: lldb-unit :: Host/./HostTests/FileSystemTest.OpenErrno (1932 of 2154) PASS: lldb-shell :: SymbolFile/NativePDB/ast-methods.cpp (1933 of 2154) PASS: lldb-unit :: Utility/./UtilityTests/CompletionRequest.DuplicateFilteringWithComments (1934 of 2154) PASS: lldb-api :: lang/objc/foundation/TestSymbolTable.py (1935 of 2154) PASS: lldb-api :: macosx/function-starts/TestFunctionStarts.py (1936 of 2154) PASS: lldb-api :: api/listeners/TestListener.py (1937 of 2154) PASS: lldb-api :: functionalities/unwind/noreturn/TestNoreturnUnwind.py (1938 of 2154) PASS: lldb-api :: lang/objc/objc-struct-return/TestObjCStructReturn.py (1939 of 2154) PASS: lldb-api :: commands/gui/breakpoints/TestGuiBreakpoints.py (1940 of 2154) PASS: lldb-unit :: Utility/./UtilityTests/UriParserTest.PortOverflow (1941 of 2154) PASS: lldb-api :: commands/watchpoints/watchpoint_count/TestWatchpointCount.py (1942 of 2154) PASS: lldb-unit :: UnwindAssembly/ARM64/./Arm64InstEmulationTests/TestArm64InstEmulation.TestSimpleDarwinFunction (1943 of 2154) UNSUPPORTED: lldb-api :: lang/cpp/static_members/TestCPPStaticMembers.py (1944 of 2154) PASS: lldb-api :: functionalities/data-formatter/setvaluefromcstring/TestSetValueFromCString.py (1945 of 2154) PASS: lldb-unit :: Utility/./UtilityTests/UriParserTest.BadPort2 (1946 of 2154) PASS: lldb-unit :: ScriptInterpreter/Python/./ScriptInterpreterPythonTests/PythonDataObjectsTest.TestRun (1947 of 2154) PASS: lldb-shell :: ObjectFile/Breakpad/sections-trailing-func.test (1948 of 2154) PASS: lldb-api :: functionalities/gdb_remote_client/TestArmRegisterDefinition.py (1949 of 2154) PASS: lldb-shell :: Commands/command-breakpoint-col.test (1950 of 2154) PASS: lldb-unit :: Utility/./UtilityTests/XcodeSDKTest.MergeTest (1951 of 2154) PASS: lldb-api :: functionalities/breakpoint/breakpoint_locations/TestBreakpointLocations.py (1952 of 2154) PASS: lldb-api :: commands/expression/import-std-module/shared_ptr/TestSharedPtrFromStdModule.py (1953 of 2154) PASS: lldb-unit :: Symbol/./SymbolTests/TestTypeSystemClang.TestConvertAccessTypeToAccessSpecifier (1954 of 2154) PASS: lldb-api :: commands/quit/TestQuit.py (1955 of 2154) PASS: lldb-api :: functionalities/data-formatter/dump_dynamic/TestDumpDynamic.py (1956 of 2154) PASS: lldb-unit :: Utility/./UtilityTests/UriParserTest.BracketedHostname (1957 of 2154) PASS: lldb-unit :: Symbol/./SymbolTests/PostfixExpression.ParseOneExpression (1958 of 2154) PASS: lldb-unit :: Utility/./UtilityTests/UriParserTest.BadPort (1959 of 2154) UNSUPPORTED: lldb-shell :: SymbolFile/PDB/expressions.test (1960 of 2154) PASS: lldb-shell :: SymbolFile/DWARF/debug-types-line-tables.s (1961 of 2154) PASS: lldb-unit :: Process/minidump/./LLDBMinidumpTests/MinidumpParserTest.GetArchitectureWindows (1962 of 2154) PASS: lldb-unit :: ObjectFile/ELF/./ObjectFileELFTests/ObjectFileELFTest.GetSymtab_NoSymEntryPointArmAddressClass (1963 of 2154) UNSUPPORTED: lldb-api :: commands/register/register/aarch64_sve_registers/rw_access_static_config/TestSVERegisters.py (1964 of 2154) PASS: lldb-unit :: Utility/./UtilityTests/DataExtractorTest.GetCStrEmpty (1965 of 2154) UNSUPPORTED: lldb-api :: lang/cpp/printf/TestPrintf.py (1966 of 2154) PASS: lldb-api :: lang/cpp/function-qualifiers/TestCppFunctionQualifiers.py (1967 of 2154) PASS: lldb-unit :: SymbolFile/NativePDB/./SymbolFileNativePDBTests/PDBFPOProgramToDWARFExpressionTests.UnsupportedRASearch (1968 of 2154) PASS: lldb-shell :: Breakpoint/split-dwarf5-debug-stroffsets.test (1969 of 2154) PASS: lldb-unit :: UnwindAssembly/ARM64/./Arm64InstEmulationTests/TestArm64InstEmulation.TestCFARegisterTrackedAcrossJumps (1970 of 2154) PASS: lldb-api :: lang/objc/exceptions/TestObjCExceptions.py (1971 of 2154) PASS: lldb-shell :: Driver/LocalLLDBInit.test (1972 of 2154) PASS: lldb-shell :: ObjectFile/ELF/avr-basic-info.yaml (1973 of 2154) UNSUPPORTED: lldb-shell :: ObjectFile/ELF/minidebuginfo-no-lzma.yaml (1974 of 2154) PASS: lldb-api :: functionalities/breakpoint/serialize/TestBreakpointSerialization.py (1975 of 2154) PASS: lldb-api :: functionalities/postmortem/minidump-new/TestMiniDumpNew.py (1976 of 2154) PASS: lldb-unit :: Core/./LLDBCoreTests/MangledTest.ResultForBlockInvocation (1977 of 2154) PASS: lldb-api :: functionalities/process_group/TestChangeProcessGroup.py (1978 of 2154) PASS: lldb-unit :: Expression/./ExpressionTests/DiagnosticManagerTest.GetStringPreserveOrder (1979 of 2154) PASS: lldb-unit :: Process/gdb-remote/./ProcessGdbRemoteTests/GDBRemoteCommunicationClientTest.SendStartTracePacket (1980 of 2154) PASS: lldb-shell :: Expr/TestIRMemoryMap.test (1981 of 2154) PASS: lldb-unit :: Language/Highlighting/./HighlighterTests/HighlighterTest.ClangCursorOutOfBounds (1982 of 2154) PASS: lldb-unit :: UnwindAssembly/x86/./UnwindAssemblyx86Tests/Testx86AssemblyInspectionEngine.TestCALLNextInsn (1983 of 2154) PASS: lldb-unit :: DataFormatter/./LLDBFormatterTests/TypeMatcherTests.CreatedBySameMatchStringExactNamePrefixes (1984 of 2154) PASS: lldb-unit :: UnwindAssembly/x86/./UnwindAssemblyx86Tests/Testx86AssemblyInspectionEngine.TestPushExtended (1985 of 2154) PASS: lldb-api :: api/check_public_api_headers/TestPublicAPIHeaders.py (1986 of 2154) UNSUPPORTED: lldb-shell :: SymbolFile/PDB/pointers.test (1987 of 2154) PASS: lldb-unit :: Language/Highlighting/./HighlighterTests/HighlighterTest.ClangCursorPosInOtherToken (1988 of 2154) PASS: lldb-unit :: Utility/./UtilityTests/RangeTest.ContainsRangeStartingFromZero (1989 of 2154) PASS: lldb-unit :: Symbol/./SymbolTests/TestClangASTImporter.RecordLayout (1990 of 2154) PASS: lldb-api :: lang/objc/real-definition/TestRealDefinition.py (1991 of 2154) PASS: lldb-api :: commands/gui/invalid-args/TestInvalidArgsGui.py (1992 of 2154) PASS: lldb-api :: functionalities/signal/TestSendSignal.py (1993 of 2154) PASS: lldb-unit :: UnwindAssembly/x86/./UnwindAssemblyx86Tests/Testx86AssemblyInspectionEngine.TestLEAVE (1994 of 2154) PASS: lldb-unit :: Utility/./UtilityTests/RangeTest.LessThan (1995 of 2154) PASS: lldb-unit :: Utility/./UtilityTests/ProcessInstanceInfoList.Yaml (1996 of 2154) PASS: lldb-api :: commands/expression/call-function/TestCallStdStringFunction.py (1997 of 2154) PASS: lldb-api :: functionalities/thread/concurrent_events/TestConcurrentManyWatchpoints.py (1998 of 2154) PASS: lldb-api :: api/log/TestAPILog.py (1999 of 2154) PASS: lldb-unit :: Utility/./UtilityTests/StructuredDataTest.StringDump (2000 of 2154) PASS: lldb-api :: functionalities/thread/concurrent_events/TestConcurrentTwoWatchpointsOneDelayBreakpoint.py (2001 of 2154) PASS: lldb-unit :: Utility/./UtilityTests/Flags.AnySet (2002 of 2154) PASS: lldb-api :: lang/objc/hidden-ivars/TestHiddenIvars.py (2003 of 2154) PASS: lldb-api :: lang/cpp/frame-var-anon-unions/TestFrameVariableAnonymousUnions.py (2004 of 2154) PASS: lldb-unit :: ScriptInterpreter/Python/./ScriptInterpreterPythonTests/PythonDataObjectsTest.TestPythonIntegerToStr (2005 of 2154) UNSUPPORTED: lldb-shell :: SymbolFile/PDB/function-level-linking.test (2006 of 2154) PASS: lldb-api :: lang/cpp/operator-overload/TestOperatorOverload.py (2007 of 2154) PASS: lldb-shell :: Reproducer/TestDebugSymbols.test (2008 of 2154) PASS: lldb-api :: lang/c/shared_lib/TestSharedLib.py (2009 of 2154) PASS: lldb-api :: commands/expression/deleting-implicit-copy-constructor/TestDeletingImplicitCopyConstructor.py (2010 of 2154) PASS: lldb-api :: functionalities/wrong_commands/TestWrongCommands.py (2011 of 2154) PASS: lldb-api :: commands/command/script/TestCommandScript.py (2012 of 2154) PASS: lldb-unit :: Process/minidump/./LLDBMinidumpTests/MinidumpParserTest.GetExceptionStream (2013 of 2154) PASS: lldb-api :: lang/objc/objc-runtime-ivars/TestRuntimeIvars.py (2014 of 2154) PASS: lldb-api :: commands/expression/import-std-module/shared_ptr-dbg-info-content/TestSharedPtrDbgInfoContentFromStdModule.py (2015 of 2154) UNSUPPORTED: lldb-shell :: Register/x86-gp-read.test (2016 of 2154) PASS: lldb-api :: lang/objc/objc_direct-methods/TestObjCDirectMethods.py (2017 of 2154) PASS: lldb-unit :: Utility/./UtilityTests/LogChannelEnabledTest.LogVerboseThread (2018 of 2154) PASS: lldb-unit :: Utility/./UtilityTests/VMRange.CollectionContains (2019 of 2154) UNSUPPORTED: lldb-shell :: Register/x86-gp-write.test (2020 of 2154) PASS: lldb-shell :: ObjectFile/ELF/compressed-sections.yaml (2021 of 2154) PASS: lldb-unit :: Utility/./UtilityTests/SubsystemRAIITest.NormalSubsystem (2022 of 2154) PASS: lldb-unit :: UnwindAssembly/x86/./UnwindAssemblyx86Tests/Testx86AssemblyInspectionEngine.TestPushEDI (2023 of 2154) PASS: lldb-unit :: Utility/./UtilityTests/LogChannelEnabledTest.LLDB_LOG_ERROR (2024 of 2154) PASS: lldb-unit :: Language/Highlighting/./HighlighterTests/HighlighterTest.ClangStringLiterals (2025 of 2154) PASS: lldb-unit :: Utility/./UtilityTests/ConstStringTest.CompareStringRef (2026 of 2154) PASS: lldb-api :: commands/watchpoints/watchpoint_commands/TestWatchpointCommands.py (2027 of 2154) PASS: lldb-unit :: ObjectFile/Breakpad/./ObjectFileBreakpadTests/ModuleRecord.parse (2028 of 2154) PASS: lldb-unit :: ScriptInterpreter/Python/./ScriptInterpreterPythonTests/PythonDataObjectsTest.TestPythonTupleInitializerList (2029 of 2154) PASS: lldb-api :: lang/objc/objc-super/TestObjCSuper.py (2030 of 2154) PASS: lldb-unit :: Utility/./UtilityTests/StreamTest.AddressEmptyPrefix (2031 of 2154) PASS: lldb-api :: lang/c/stepping/TestThreadStepping.py (2032 of 2154) PASS: lldb-api :: python_api/default-constructor/TestDefaultConstructorForAPIObjects.py (2033 of 2154) PASS: lldb-unit :: Language/CPlusPlus/./LanguageCPlusPlusTests/CPlusPlusLanguage.FindAlternateFunctionManglings (2034 of 2154) PASS: lldb-api :: lang/cpp/const_this/TestConstThis.py (2035 of 2154) UNSUPPORTED: lldb-shell :: SymbolFile/target-symbols-add-unwind.test (2036 of 2154) PASS: lldb-unit :: Utility/./UtilityTests/StringListTest.AppendList (2037 of 2154) PASS: lldb-api :: functionalities/thread/crash_during_step/TestCrashDuringStep.py (2038 of 2154) PASS: lldb-api :: commands/expression/unwind_expression/TestUnwindExpression.py (2039 of 2154) PASS: lldb-unit :: UnwindAssembly/x86/./UnwindAssemblyx86Tests/Testx86AssemblyInspectionEngine.Test32BitOnlyInstruction (2040 of 2154) PASS: lldb-unit :: Utility/./UtilityTests/StringExtractorTest.GetHexBytesAvail_Underflow (2041 of 2154) PASS: lldb-shell :: Unwind/thread-step-out-ret-addr-check.test (2042 of 2154) PASS: lldb-unit :: UnwindAssembly/x86/./UnwindAssemblyx86Tests/Testx86AssemblyInspectionEngine.TestPushR15 (2043 of 2154) PASS: lldb-api :: functionalities/data-formatter/vector-types/TestVectorTypesFormatting.py (2044 of 2154) PASS: lldb-api :: python_api/process/io/TestProcessIO.py (2045 of 2154) PASS: lldb-unit :: Symbol/./SymbolTests/TestTypeSystemClang.TestGetEnumIntegerTypeInvalid (2046 of 2154) PASS: lldb-unit :: Utility/./UtilityTests/ArchSpecTest.YAML (2047 of 2154) PASS: lldb-unit :: Expression/./ExpressionTests/DiagnosticManagerTest.GetStringMultiline (2048 of 2154) PASS: lldb-api :: macosx/safe-to-func-call/TestSafeFuncCalls.py (2049 of 2154) PASS: lldb-unit :: Utility/./UtilityTests/SerializationRountripTest.SerializeDeserializePod (2050 of 2154) PASS: lldb-unit :: Utility/./UtilityTests/RangeTest.ContainsEndInclusive (2051 of 2154) PASS: lldb-unit :: Utility/./UtilityTests/StringListTest.ShiftStdString (2052 of 2154) PASS: lldb-unit :: Utility/./UtilityTests/StringListTest.GetSize (2053 of 2154) PASS: lldb-api :: commands/expression/pr35310/TestExprsBug35310.py (2054 of 2154) PASS: lldb-shell :: SymbolFile/Breakpad/stack-cfi-arm.yaml (2055 of 2154) PASS: lldb-api :: commands/expression/dont_allow_jit/TestAllowJIT.py (2056 of 2154) PASS: lldb-api :: lang/objc/objc-new-syntax/TestObjCNewSyntaxArray.py (2057 of 2154) PASS: lldb-api :: macosx/save_crashlog/TestSaveCrashlog.py (2058 of 2154) PASS: lldb-unit :: Utility/./UtilityTests/LogChannelEnabledTest.log_options (2059 of 2154) PASS: lldb-api :: commands/breakpoint/set/func-regex/TestBreakpointRegexError.py (2060 of 2154) PASS: lldb-unit :: Utility/./UtilityTests/FileSpecTest.Yaml (2061 of 2154) PASS: lldb-unit :: Utility/./UtilityTests/StringListTest.LongestCommonPrefixSingleElement (2062 of 2154) PASS: lldb-api :: lang/cpp/nsimport/TestCppNsImport.py (2063 of 2154) PASS: lldb-unit :: Utility/./UtilityTests/StringExtractorTest.GetHexBytes_OddPair2 (2064 of 2154) PASS: lldb-api :: lang/objc/global_ptrs/TestGlobalObjects.py (2065 of 2154) PASS: lldb-api :: lang/objc/objc-new-syntax/TestObjCNewSyntaxDictionary.py (2066 of 2154) PASS: lldb-unit :: UnwindAssembly/x86/./UnwindAssemblyx86Tests/Testx86AssemblyInspectionEngine.TestPopRBX (2067 of 2154) UNSUPPORTED: lldb-api :: functionalities/darwin_log/filter/exact_match/subsystem/TestDarwinLogFilterMatchSubsystem.py (2068 of 2154) PASS: lldb-unit :: Utility/./UtilityTests/RangeTest.SetRangeBase (2069 of 2154) PASS: lldb-unit :: Utility/./UtilityTests/StringExtractorTest.GetU32BigEndian (2070 of 2154) PASS: lldb-unit :: Utility/./UtilityTests/AnsiTerminal.AtEnd (2071 of 2154) PASS: lldb-api :: functionalities/data-formatter/data-formatter-objc/TestDataFormatterObjCExpr.py (2072 of 2154) PASS: lldb-unit :: Host/./HostTests/FileSystemTest.GetByteSize (2073 of 2154) PASS: lldb-api :: functionalities/thread/concurrent_events/TestConcurrentTwoBreakpointsOneWatchpoint.py (2074 of 2154) PASS: lldb-unit :: UnwindAssembly/x86/./UnwindAssemblyx86Tests/Testx86AssemblyInspectionEngine.TestPushEBX (2075 of 2154) PASS: lldb-api :: macosx/order/TestOrderFile.py (2076 of 2154) PASS: lldb-unit :: Utility/./UtilityTests/LogTest.LLDB_LOG_nullptr (2077 of 2154) PASS: lldb-shell :: ObjectFile/ELF/PT_LOAD-overlap-section.yaml (2078 of 2154) PASS: lldb-unit :: Process/minidump/./LLDBMinidumpTests/MinidumpParserTest.MinidumpModuleOrder (2079 of 2154) PASS: lldb-unit :: Symbol/./SymbolTests/TestTypeSystemClang.TestGetBasicTypeFromName (2080 of 2154) PASS: lldb-unit :: Process/minidump/./LLDBMinidumpTests/MinidumpParserTest.MinidumpDuplicateModuleMappedSecond (2081 of 2154) PASS: lldb-api :: lang/objc/rdar-11355592/TestRdar11355592.py (2082 of 2154) PASS: lldb-api :: python_api/watchpoint/watchlocation/TestSetWatchlocation.py (2083 of 2154) PASS: lldb-unit :: Host/./HostTests/MainLoopTest.ReadObject (2084 of 2154) PASS: lldb-unit :: Symbol/./SymbolTests/TestTypeSystemClang.TestFunctionTemplateConstruction (2085 of 2154) PASS: lldb-unit :: Utility/./UtilityTests/StreamTest.PutHex16ByteOrderLittle (2086 of 2154) PASS: lldb-unit :: Utility/./UtilityTests/ArgsTest.GetQuotedCommandString (2087 of 2154) PASS: lldb-api :: commands/expression/persistent_variables/TestPersistentVariables.py (2088 of 2154) PASS: lldb-shell :: Commands/command-target-modules-dump-sections.yaml (2089 of 2154) PASS: lldb-unit :: Utility/./UtilityTests/StreamTeeTest.CopyConstructor (2090 of 2154) PASS: lldb-api :: lang/c/bitfields/TestBitfields.py (2091 of 2154) PASS: lldb-api :: commands/frame/select/TestFrameSelect.py (2092 of 2154) PASS: lldb-api :: lang/c/find_struct_type/TestFindStructTypes.py (2093 of 2154) PASS: lldb-api :: lang/objcxx/objcxx-ivar-vector/TestIvarVector.py (2094 of 2154) PASS: lldb-shell :: SymbolFile/DWARF/DW_OP_piece-smaller-than-struct.s (2095 of 2154) PASS: lldb-shell :: ExecControl/StopHook/stop-hook.test (2096 of 2154) PASS: lldb-api :: tools/lldb-server/TestGdbRemoteHostInfo.py (2097 of 2154) PASS: lldb-unit :: ScriptInterpreter/Python/./ScriptInterpreterPythonTests/PythonDataObjectsTest.TestPythonListManipulation (2098 of 2154) PASS: lldb-unit :: SymbolFile/NativePDB/./SymbolFileNativePDBTests/PDBFPOProgramToDWARFExpressionTests.InvalidOpUnary (2099 of 2154) PASS: lldb-unit :: Target/./TargetTests/MCBasedABI.MapRegisterName (2100 of 2154) PASS: lldb-api :: functionalities/process_crash_info/TestProcessCrashInfo.py (2101 of 2154) PASS: lldb-unit :: Expression/./ExpressionTests/DWARFExpression.DW_OP_unknown (2102 of 2154) PASS: lldb-unit :: Utility/./UtilityTests/PassiveReplayTest.InstrumentedBar (2103 of 2154) UNSUPPORTED: lldb-api :: functionalities/darwin_log/source/info/TestDarwinLogSourceInfo.py (2104 of 2154) UNSUPPORTED: lldb-api :: functionalities/darwin_log/filter/regex/activity/TestDarwinLogFilterRegexActivity.py (2105 of 2154) PASS: lldb-api :: tools/lldb-vscode/breakpoint/TestVSCode_setBreakpoints.py (2106 of 2154) PASS: lldb-shell :: Register/x86-64-read.test (2107 of 2154) PASS: lldb-shell :: ObjectFile/MachO/subsections.yaml (2108 of 2154) PASS: lldb-shell :: SymbolFile/DWARF/dwarf5-partial-index.cpp (2109 of 2154) PASS: lldb-api :: functionalities/breakpoint/breakpoint_language/TestBreakpointLanguage.py (2110 of 2154) PASS: lldb-unit :: Utility/./UtilityTests/SerializationRountripTest.SerializeDeserializeCString (2111 of 2154) PASS: lldb-api :: lang/c/local_types/TestUseClosestType.py (2112 of 2154) PASS: lldb-unit :: Utility/./UtilityTests/Predicate.WaitForValueEqualTo (2113 of 2154) PASS: lldb-api :: lang/cpp/dynamic-value/TestDynamicValue.py (2114 of 2154) PASS: lldb-api :: lang/cpp/scope/TestCppScope.py (2115 of 2154) PASS: lldb-unit :: Utility/./UtilityTests/StringExtractorTest.GetHexU8_InvalidHex (2116 of 2154) PASS: lldb-shell :: SymbolFile/symbol-binding.test (2117 of 2154) PASS: lldb-api :: functionalities/thread/concurrent_events/TestConcurrentTwoBreakpointsOneDelaySignal.py (2118 of 2154) PASS: lldb-api :: commands/expression/import-std-module/forward_decl_from_module/TestForwardDeclFromStdModule.py (2119 of 2154) PASS: lldb-api :: functionalities/data-formatter/data-formatter-objc/nsindexpath/TestDataFormatterNSIndexPath.py (2120 of 2154) PASS: lldb-unit :: Symbol/./SymbolTests/DWARFCallFrameInfoTest.Basic_dwarf3 (2121 of 2154) PASS: lldb-api :: lang/cpp/chained-calls/TestCppChainedCalls.py (2122 of 2154) UNSUPPORTED: lldb-api :: tools/lldb-vscode/disconnect/TestVSCode_disconnect.py (2123 of 2154) PASS: lldb-api :: functionalities/tsan/thread_leak/TestTsanThreadLeak.py (2124 of 2154) PASS: lldb-unit :: Utility/./UtilityTests/StringExtractorTest.GetHexBytes_Underflow (2125 of 2154) PASS: lldb-unit :: Platform/Android/./AdbClientTests/AdbClientTest.CreateByDeviceId_ByEnvVar (2126 of 2154) PASS: lldb-api :: lang/objc/modules-non-objc-target/TestObjCModulesNonObjCTarget.py (2127 of 2154) PASS: lldb-unit :: Utility/./UtilityTests/RangeTest.Copy (2128 of 2154) PASS: lldb-api :: functionalities/gdb_remote_client/TestGDBRemoteClient.py (2129 of 2154) PASS: lldb-api :: commands/command/script/import/rdar-12586188/TestRdar12586188.py (2130 of 2154) PASS: lldb-unit :: Core/./LLDBCoreTests/ModuleSpecTest.TestELFFile (2131 of 2154) PASS: lldb-api :: functionalities/data-formatter/data-formatter-cpp/TestDataFormatterCpp.py (2132 of 2154) UNSUPPORTED: lldb-shell :: Reproducer/TestLuaImport.test (2133 of 2154) PASS: lldb-unit :: Utility/./UtilityTests/StringExtractorTest.GetNameColonValueNoColon (2134 of 2154) PASS: lldb-unit :: Utility/./UtilityTests/StructuredDataTest.ParseJSONFromFile (2135 of 2154) PASS: lldb-unit :: UnwindAssembly/x86/./UnwindAssemblyx86Tests/Testx86AssemblyInspectionEngine.TestAddESP (2136 of 2154) PASS: lldb-unit :: Utility/./UtilityTests/FileSpecTest.Equal (2137 of 2154) PASS: lldb-api :: lang/objc/single-entry-dictionary/TestObjCSingleEntryDictionary.py (2138 of 2154) PASS: lldb-api :: python_api/hello_world/TestHelloWorld.py (2139 of 2154) PASS: lldb-shell :: Reproducer/TestGDBRemoteRepro.test (2140 of 2154) PASS: lldb-shell :: ObjectFile/wasm/stripped-debug-sections.yaml (2141 of 2154) PASS: lldb-shell :: Process/Optimization.test (2142 of 2154) PASS: lldb-api :: lang/c/register_variables/TestRegisterVariables.py (2143 of 2154) PASS: lldb-unit :: Utility/./UtilityTests/OptionsWithRawTest.TerminatedQuote (2144 of 2154) PASS: lldb-unit :: Target/./TargetTests/StackFrameRecognizerTest.NullModuleRegex (2145 of 2154) PASS: lldb-unit :: UnwindAssembly/x86/./UnwindAssemblyx86Tests/Testx86AssemblyInspectionEngine.TestSubRSP (2146 of 2154) PASS: lldb-api :: functionalities/postmortem/minidump-new/TestMiniDumpUUID.py (2147 of 2154) PASS: lldb-api :: tools/lldb-server/TestGdbRemoteRegisterState.py (2148 of 2154) PASS: lldb-api :: lang/cpp/offsetof/TestOffsetofCpp.py (2149 of 2154) PASS: lldb-api :: functionalities/thread/concurrent_events/TestConcurrentTwoWatchpointsOneBreakpoint.py (2150 of 2154) PASS: lldb-api :: functionalities/target_var/no_vars/TestTargetVarNoVars.py (2151 of 2154) PASS: lldb-unit :: Utility/./UtilityTests/RangeTest.NotEqual (2152 of 2154) PASS: lldb-api :: functionalities/breakpoint/breakpoint_set_restart/TestBreakpointSetRestart.py (2153 of 2154) PASS: lldb-api :: commands/expression/import-std-module/list/TestListFromStdModule.py (2154 of 2154) Slowest Tests: -------------------------------------------------------------------------- 128.71s: lldb-api :: macosx/simulator/TestSimulatorPlatform.py 101.27s: lldb-api :: tools/lldb-server/TestLldbGdbServer.py 62.48s: lldb-api :: commands/gui/basicdebug/TestGuiBasicDebug.py 59.70s: lldb-api :: lang/cpp/namespace/TestNamespaceLookup.py 54.45s: lldb-api :: lang/objc/hidden-ivars/TestHiddenIvars.py 53.53s: lldb-api :: lang/objc/foundation/TestFoundationDisassembly.py 51.42s: lldb-api :: lang/objc/exceptions/TestObjCExceptions.py 49.82s: lldb-api :: lang/objc/objc-new-syntax/TestObjCNewSyntaxDictionary.py 49.81s: lldb-api :: lang/objc/foundation/TestObjCMethods.py 49.11s: lldb-api :: lang/objc/objc-new-syntax/TestObjCNewSyntaxArray.py 48.19s: lldb-api :: api/multithreaded/TestMultithreaded.py 44.96s: lldb-api :: types/TestLongTypesExpr.py 38.82s: lldb-api :: lang/objc/objc-new-syntax/TestObjCNewSyntaxLiteral.py 36.96s: lldb-api :: functionalities/completion/TestCompletion.py 35.79s: lldb-shell :: SymbolFile/NativePDB/break-by-function.cpp 34.91s: lldb-api :: python_api/target/TestTargetAPI.py 34.07s: lldb-shell :: SymbolFile/NativePDB/function-types-calling-conv.cpp 31.99s: lldb-api :: python_api/thread/TestThreadAPI.py 31.62s: lldb-api :: functionalities/postmortem/mach-core/TestMachCore.py 31.62s: lldb-api :: lang/objc/real-definition/TestRealDefinition.py

Hide Details

Tests Times: -------------------------------------------------------------------------- [ Range ] :: [ Percentage ] :: [ Count ] -------------------------------------------------------------------------- [120s,130s) :: [ ] :: [ 1/2154] [110s,120s) :: [ ] :: [ 0/2154] [100s,110s) :: [ ] :: [ 1/2154] [ 90s,100s) :: [ ] :: [ 0/2154] [ 80s, 90s) :: [ ] :: [ 0/2154] [ 70s, 80s) :: [ ] :: [ 0/2154] [ 60s, 70s) :: [ ] :: [ 2/2154] [ 50s, 60s) :: [ ] :: [ 5/2154] [ 40s, 50s) :: [ ] :: [ 3/2154] [ 30s, 40s) :: [ ] :: [ 12/2154] [ 20s, 30s) :: [ ] :: [ 19/2154] [ 10s, 20s) :: [** ] :: [ 141/2154] [ 0s, 10s) :: [************************************ ] :: [1970/2154] -------------------------------------------------------------------------- ******************** Failed Tests (1): lldb-api :: commands/gui/basicdebug/TestGuiBasicDebug.py

Hide Details

Hide Details

Testing Time: 1576.79s Unsupported : 153 Passed : 1994 Expectedly Failed: 6 Failed : 1 FAILED: tools/lldb/test/CMakeFiles/check-lldb-lit cd /Users/buildslave/jenkins/workspace/lldb-cmake/lldb-build/tools/lldb/test && /usr/local/Frameworks/Python.framework/Versions/3.7/bin/python3.7 /Users/buildslave/jenkins/workspace/lldb-cmake/lldb-build/./bin/llvm-lit -v --time-tests --shuffle --xunit-xml-output=/Users/buildslave/jenkins/workspace/lldb-cmake/test/results.xml -v -j 4 /Users/buildslave/jenkins/workspace/lldb-cmake/lldb-build/tools/lldb/test ninja: build stopped: subcommand failed. Command failed: Command '['/usr/bin/env', 'TERM=vt100', '/usr/local/bin/ninja', '-v', 'check-lldb']' returned non-zero exit status 1 Command: ['/usr/bin/env', 'TERM=vt100', '/usr/local/bin/ninja', '-v', 'check-lldb'] [Pipeline] } [Pipeline] // timeout [Pipeline] } [Pipeline] // stage [Pipeline] stage [Pipeline] { (Declarative: Post Actions) [Pipeline] scanForIssues [Clang (LLVM based)] Sleeping for 5 seconds due to JENKINS-32191... [Clang (LLVM based)] Parsing console log (workspace: '/Users/buildslave/jenkins/workspace/lldb-cmake') [Clang (LLVM based)] Successfully parsed console log [Clang (LLVM based)] -> found 8 issues (skipped 12 duplicates) [Clang (LLVM based)] Post processing issues on 'green-dragon-10' with source code encoding 'UTF-8' [Clang (LLVM based)] Creating SCM blamer to obtain author and commit information for affected files [Clang (LLVM based)] Creating SCM miner to obtain statistics for affected repository files [Clang (LLVM based)] Resolving file names for all issues in source directory '/Users/buildslave/jenkins/workspace/lldb-cmake' [Clang (LLVM based)] -> resolved paths in source directory (6 found, 0 not found) [Clang (LLVM based)] Resolving module names from module definitions (build.xml, pom.xml, or Manifest.mf files) [Clang (LLVM based)] -> resolved module names for 8 issues [Clang (LLVM based)] Resolving package names (or namespaces) by parsing the affected files [Clang (LLVM based)] -> resolved package names of 6 affected files [Clang (LLVM based)] No filter has been set, publishing all 8 issues [Clang (LLVM based)] Creating fingerprints for all affected code blocks to track issues over different builds [Clang (LLVM based)] -> created fingerprints for 8 issues (skipped 0 issues) [Clang (LLVM based)] Copying affected files to Jenkins' build folder '/Users/Shared/Jenkins/Home/jobs/lldb-cmake/builds/24025/files-with-issues' [Clang (LLVM based)] -> 4 copied, 2 not in workspace, 0 not-found, 0 with I/O error [Pipeline] junit Recording test results [Pipeline] } [Pipeline] // stage [Pipeline] } [Pipeline] // withEnv [Pipeline] } [Pipeline] // node [Pipeline] End of Pipeline ERROR: script returned exit code 1 Finished: FAILURE