FailedConsole Output

Skipping 8,053 KB.. Full Log
ntainsEndInclusiveInvalid (929 of 2163)
PASS: lldb-api :: functionalities/thread/concurrent_events/TestConcurrentTwoBreakpointsOneWatchpoint.py (930 of 2163)
PASS: lldb-unit :: Utility/./UtilityTests/SubsystemRAIITest.SubsystemWithErrorSuccess (931 of 2163)
PASS: lldb-unit :: Target/./TargetTests/MemoryRegionInfoTest.Formatv (932 of 2163)
PASS: lldb-api :: lang/c/complex_int/TestComplexInt.py (933 of 2163)
PASS: lldb-unit :: Utility/./UtilityTests/ArgsTest.TestQuotedUnknownEscape (934 of 2163)
PASS: lldb-unit :: Utility/./UtilityTests/SerializationRountripTest.SerializeDeserializeCStringArray (935 of 2163)
PASS: lldb-api :: commands/frame/diagnose/dereference-function-return/TestDiagnoseDereferenceFunctionReturn.py (936 of 2163)
PASS: lldb-api :: commands/target/stop-hook/disable/TestTargetStopHookDisable.py (937 of 2163)
PASS: lldb-unit :: Host/./HostTests/SocketTests/SocketTest.DomainGetConnectURI/ipv4 (938 of 2163)
PASS: lldb-api :: functionalities/value_md5_crash/TestValueMD5Crash.py (939 of 2163)
PASS: lldb-api :: commands/session/history/TestSessionHistory.py (940 of 2163)
PASS: lldb-api :: tools/lldb-server/inferior-crash/TestGdbRemoteAbort.py (941 of 2163)
PASS: lldb-unit :: Utility/./UtilityTests/TimerTest.CategoryTimesStats (942 of 2163)
PASS: lldb-unit :: Utility/./UtilityTests/StringListTest.SplitIntoLinesSingleTrailingCR (943 of 2163)
PASS: lldb-api :: tools/lldb-vscode/module/TestVSCode_module.py (944 of 2163)
PASS: lldb-shell :: SymbolFile/DWARF/debug_loclists-dwo.s (945 of 2163)
PASS: lldb-shell :: Unwind/eh-frame-dwarf-unwind.test (946 of 2163)
PASS: lldb-api :: functionalities/data-formatter/data-formatter-objc/TestDataFormatterObjCNSBundle.py (947 of 2163)
PASS: lldb-shell :: Process/Optimization.test (948 of 2163)
PASS: lldb-unit :: Symbol/./SymbolTests/TestTypeSystemClang.TestConvertAccessTypeToAccessSpecifier (949 of 2163)
PASS: lldb-unit :: UnwindAssembly/x86/./UnwindAssemblyx86Tests/Testx86AssemblyInspectionEngine.TestSubRSP (950 of 2163)
PASS: lldb-unit :: SymbolFile/NativePDB/./SymbolFileNativePDBTests/PDBFPOProgramToDWARFExpressionTests.MultipleIndependentAssignments (951 of 2163)
PASS: lldb-unit :: Utility/./UtilityTests/RangeTest.Equal (952 of 2163)
PASS: lldb-unit :: Utility/./UtilityTests/BinaryStreamTest.PutSLEB128TwoBytes (953 of 2163)
PASS: lldb-unit :: Utility/./UtilityTests/FileSpecTest.EqualSeparator (954 of 2163)
PASS: lldb-api :: functionalities/data-formatter/data-formatter-enum-format/TestDataFormatterEnumFormat.py (955 of 2163)
PASS: lldb-api :: lang/objc/modules-auto-import/TestModulesAutoImport.py (956 of 2163)
PASS: lldb-api :: commands/expression/persist_objc_pointeetype/TestPersistObjCPointeeType.py (957 of 2163)
PASS: lldb-shell :: ObjectFile/ELF/many-sections.s (958 of 2163)
PASS: lldb-api :: lang/objc/modules-inline-functions/TestModulesInlineFunctions.py (959 of 2163)
PASS: lldb-api :: macosx/queues/TestQueues.py (960 of 2163)
PASS: lldb-api :: api/command-return-object/TestSBCommandReturnObject.py (961 of 2163)
PASS: lldb-api :: commands/expression/import-std-module/weak_ptr-dbg-info-content/TestDbgInfoContentWeakPtrFromStdModule.py (962 of 2163)
PASS: lldb-api :: tools/lldb-server/TestLldbGdbServer.py (963 of 2163)
PASS: lldb-api :: lang/cpp/class-template-parameter-pack/TestClassTemplateParameterPack.py (964 of 2163)
PASS: lldb-api :: commands/expression/persistent_variables/TestPersistentVariables.py (965 of 2163)
PASS: lldb-api :: lang/objc/modules-compile-error/TestModulesCompileError.py (966 of 2163)
PASS: lldb-unit :: Signals/./SignalsTests/UnixSignalsTest.GetInfo (967 of 2163)
PASS: lldb-api :: functionalities/data-formatter/data-formatter-stl/libcxx/multimap/TestDataFormatterLibccMultiMap.py (968 of 2163)
UNSUPPORTED: lldb-api :: lang/objc/objc-dynamic-value/TestObjCDynamicValue.py (969 of 2163)
PASS: lldb-unit :: Utility/./UtilityTests/GeneratorTest.Get (970 of 2163)
PASS: lldb-unit :: Utility/./UtilityTests/ArgsTest.DoubleQuotedItem (971 of 2163)
PASS: lldb-unit :: Symbol/./SymbolTests/TestTypeSystemClang.TemplateArguments (972 of 2163)
PASS: lldb-api :: commands/process/signal/TestProcessSignal.py (973 of 2163)
PASS: lldb-shell :: BuildScript/compiler-full-path.test (974 of 2163)
PASS: lldb-shell :: Quit/TestQuitExitCodeHex0.test (975 of 2163)
PASS: lldb-unit :: Process/gdb-remote/./ProcessGdbRemoteTests/GDBRemoteCommunicationServerTest.SendErrorResponse_ErrorNumber (976 of 2163)
PASS: lldb-unit :: Utility/./UtilityTests/NameMatchesTest.Equals (977 of 2163)
PASS: lldb-unit :: Utility/./UtilityTests/StreamTeeTest.Flush (978 of 2163)
PASS: lldb-unit :: Editline/./EditlineTests/EditlineTestFixture.EditlineReceivesSingleLineText (979 of 2163)
PASS: lldb-unit :: Utility/./UtilityTests/RegisterValueTest.GetSet8 (980 of 2163)
PASS: lldb-shell :: SymbolFile/Breakpad/unwind-via-stack-win.test (981 of 2163)
PASS: lldb-unit :: UnwindAssembly/x86/./UnwindAssemblyx86Tests/Testx86AssemblyInspectionEngine.TestDisassemblyMidFunctionEpilogues (982 of 2163)
PASS: lldb-api :: functionalities/tail_call_frames/thread_step_out_or_return/TestSteppingOutWithArtificialFrames.py (983 of 2163)
PASS: lldb-unit :: Expression/./ExpressionTests/CppModuleConfigurationTest.Sysroot (984 of 2163)
PASS: lldb-api :: commands/frame/var/TestFrameVar.py (985 of 2163)
PASS: lldb-api :: lang/c/stepping/TestThreadStepping.py (986 of 2163)
PASS: lldb-api :: functionalities/gdb_remote_client/TestRecognizeBreakpoint.py (987 of 2163)
PASS: lldb-api :: commands/expression/import-std-module/vector-bool/TestVectorBoolFromStdModule.py (988 of 2163)
UNSUPPORTED: lldb-shell :: Register/x86-gp-write.test (989 of 2163)
PASS: lldb-api :: functionalities/data-formatter/data-formatter-objc/TestDataFormatterObjCExpr.py (990 of 2163)
PASS: lldb-api :: lang/c/strings/TestCStrings.py (991 of 2163)
PASS: lldb-unit :: Utility/./UtilityTests/LogChannelTest.List (992 of 2163)
PASS: lldb-api :: commands/command/source/TestCommandSource.py (993 of 2163)
PASS: lldb-api :: functionalities/data-formatter/data-formatter-objc/TestDataFormatterObjCNSURL.py (994 of 2163)
PASS: lldb-api :: functionalities/breakpoint/breakpoint_callback_command_source/TestBreakpointCallbackCommandSource.py (995 of 2163)
PASS: lldb-shell :: Reproducer/TestPythonImport.test (996 of 2163)
PASS: lldb-unit :: Utility/./UtilityTests/FileSpecTest.EqualDotsPosixRoot (997 of 2163)
PASS: lldb-api :: lang/c/struct_types/TestStructTypes.py (998 of 2163)
PASS: lldb-api :: functionalities/gdb_remote_client/TestGDBRemoteClient.py (999 of 2163)
PASS: lldb-api :: commands/watchpoints/watchpoint_disable/TestWatchpointDisable.py (1000 of 2163)
PASS: lldb-api :: functionalities/thread/step_out/TestThreadStepOut.py (1001 of 2163)
PASS: lldb-api :: python_api/process/read-mem-cstring/TestReadMemCString.py (1002 of 2163)
UNSUPPORTED: lldb-api :: functionalities/darwin_log/filter/exact_match/message/TestDarwinLogFilterMatchMessage.py (1003 of 2163)
PASS: lldb-api :: commands/expression/po_verbosity/TestPoVerbosity.py (1004 of 2163)
PASS: lldb-unit :: Utility/./UtilityTests/StreamTest.PutSLEB128 (1005 of 2163)
PASS: lldb-unit :: Utility/./UtilityTests/StreamTest.ShiftOperatorStrings (1006 of 2163)
PASS: lldb-api :: lang/objc/real-definition/TestRealDefinition.py (1007 of 2163)
PASS: lldb-shell :: ScriptInterpreter/Python/python.test (1008 of 2163)
UNSUPPORTED: lldb-api :: android/platform/TestDefaultCacheLineSize.py (1009 of 2163)
PASS: lldb-api :: lang/cpp/function-qualifiers/TestCppFunctionQualifiers.py (1010 of 2163)
PASS: lldb-unit :: Host/./HostTests/HostInfoTest.GetHostname (1011 of 2163)
PASS: lldb-api :: lang/cpp/unsigned_types/TestUnsignedTypes.py (1012 of 2163)
PASS: lldb-shell :: SymbolFile/DWARF/anon_class_w_and_wo_export_symbols.ll (1013 of 2163)
PASS: lldb-unit :: Utility/./UtilityTests/SerializationRountripTest.SerializeDeserializeObjectReference (1014 of 2163)
PASS: lldb-unit :: Utility/./UtilityTests/StringListTest.Join (1015 of 2163)
UNSUPPORTED: lldb-api :: functionalities/darwin_log/filter/exact_match/activity-chain/TestDarwinLogFilterMatchActivityChain.py (1016 of 2163)
PASS: lldb-unit :: Utility/./UtilityTests/StringListTest.GetMaxStringLengthIncreasingSize (1017 of 2163)
PASS: lldb-shell :: ObjectFile/PECOFF/basic-info-arm64.yaml (1018 of 2163)
PASS: lldb-shell :: SymbolFile/DWARF/debug-types-signature-loop.s (1019 of 2163)
PASS: lldb-api :: functionalities/thread/thread_exit/TestThreadExit.py (1020 of 2163)
PASS: lldb-unit :: Utility/./UtilityTests/StringListTest.RemoveBlankLines (1021 of 2163)
PASS: lldb-api :: functionalities/data-formatter/cstring-utf8-summary/TestCstringUnicode.py (1022 of 2163)
PASS: lldb-unit :: Symbol/./SymbolTests/TestTypeSystemClang.TestGetEnumIntegerTypeUnexpectedType (1023 of 2163)
PASS: lldb-unit :: Utility/./UtilityTests/StreamTest.PutBytesAsRawHex8ToMixedEndian (1024 of 2163)
PASS: lldb-api :: macosx/dyld-trie-symbols/TestDyldTrieSymbols.py (1025 of 2163)
PASS: lldb-unit :: ScriptInterpreter/Python/./ScriptInterpreterPythonTests/PythonDataObjectsTest.TestPythonIntegerToStr (1026 of 2163)
PASS: lldb-unit :: Host/./HostTests/MainLoopTest.TerminatesImmediately (1027 of 2163)
PASS: lldb-api :: lang/objc/objc_direct-methods/TestObjCDirectMethods.py (1028 of 2163)
PASS: lldb-unit :: API/./APITests/SBCommandInterpreterTest.MultiWordCommand (1029 of 2163)
PASS: lldb-unit :: Utility/./UtilityTests/LogChannelEnabledTest.log_options (1030 of 2163)
UNSUPPORTED: lldb-shell :: SymbolFile/NativePDB/stack_unwinding01.cpp (1031 of 2163)
PASS: lldb-api :: commands/expression/top-level/TestTopLevelExprs.py (1032 of 2163)
PASS: lldb-api :: macosx/function-starts/TestFunctionStarts.py (1033 of 2163)
PASS: lldb-api :: lang/objc/foundation/TestConstStrings.py (1034 of 2163)
PASS: lldb-unit :: ScriptInterpreter/Python/./ScriptInterpreterPythonTests/PythonDataObjectsTest.TestResetting (1035 of 2163)
PASS: lldb-api :: functionalities/data-formatter/data-formatter-caching/TestDataFormatterCaching.py (1036 of 2163)
PASS: lldb-api :: functionalities/thread/concurrent_events/TestConcurrentCrashWithSignal.py (1037 of 2163)
PASS: lldb-unit :: Utility/./UtilityTests/StreamTest.AddressEmptyPrefix (1038 of 2163)
PASS: lldb-shell :: Driver/TestUseColor.test (1039 of 2163)
PASS: lldb-unit :: Expression/./ExpressionTests/DWARFExpression.DW_OP_pick (1040 of 2163)
PASS: lldb-unit :: Utility/./UtilityTests/ScalarTest.CastOperations (1041 of 2163)
PASS: lldb-unit :: SymbolFile/NativePDB/./SymbolFileNativePDBTests/PDBFPOProgramToDWARFExpressionTests.UnresolvedRegisterAssignmentReference (1042 of 2163)
PASS: lldb-unit :: Utility/./UtilityTests/StringListTest.GetMaxStringLengthMixed (1043 of 2163)
PASS: lldb-api :: functionalities/gdb_remote_client/TestStopPCs.py (1044 of 2163)
PASS: lldb-unit :: Utility/./UtilityTests/StructuredDataTest.ParseJSONFromFile (1045 of 2163)
PASS: lldb-unit :: Host/./HostTests/NativeProcessProtocolTest.SetBreakpointFailVerify (1046 of 2163)
PASS: lldb-shell :: Minidump/Windows/find-module.test (1047 of 2163)
PASS: lldb-unit :: Utility/./UtilityTests/RangeTest.SetRangeBase (1048 of 2163)
PASS: lldb-api :: functionalities/breakpoint/breakpoint_set_restart/TestBreakpointSetRestart.py (1049 of 2163)
PASS: lldb-api :: lang/c/anonymous/TestAnonymous.py (1050 of 2163)
PASS: lldb-api :: commands/frame/select/TestFrameSelect.py (1051 of 2163)
UNSUPPORTED: lldb-shell :: Reproducer/TestLuaImport.test (1052 of 2163)
PASS: lldb-unit :: Host/./HostTests/Host.GetEnvironment (1053 of 2163)
PASS: lldb-shell :: SymbolFile/NativePDB/ast-functions.cpp (1054 of 2163)
PASS: lldb-api :: lang/objc/modules-incomplete/TestIncompleteModules.py (1055 of 2163)
PASS: lldb-unit :: Utility/./UtilityTests/StringListTest.LongestCommonPrefixNoPrefix (1056 of 2163)
UNSUPPORTED: lldb-api :: benchmarks/stepping/TestSteppingSpeed.py (1057 of 2163)
PASS: lldb-api :: tools/lldb-vscode/step/TestVSCode_step.py (1058 of 2163)
PASS: lldb-shell :: ObjectFile/PECOFF/dep-modules.yaml (1059 of 2163)
UNSUPPORTED: lldb-shell :: SymbolFile/NativePDB/ast-functions-msvc.cpp (1060 of 2163)
PASS: lldb-unit :: Interpreter/./InterpreterTests/OptionArgParserTest.toChar (1061 of 2163)
PASS: lldb-unit :: tools/lldb-server/tests/./LLDBServerTests/TestBase.LaunchModePreservesEnvironment (1062 of 2163)
PASS: lldb-unit :: Utility/./UtilityTests/PassiveReplayTest.InstrumentedFoo (1063 of 2163)
PASS: lldb-api :: commands/quit/TestQuit.py (1064 of 2163)
PASS: lldb-api :: python_api/disassemble-raw-data/TestDisassemble_VST1_64.py (1065 of 2163)
PASS: lldb-unit :: Language/CPlusPlus/./LanguageCPlusPlusTests/CPlusPlusLanguage.MethodNameParsing (1066 of 2163)
PASS: lldb-unit :: Utility/./UtilityTests/StreamTeeTest.Constructor1Stream (1067 of 2163)
PASS: lldb-shell :: SymbolFile/DWARF/find-basic-type.cpp (1068 of 2163)
PASS: lldb-api :: api/multiple-targets/TestMultipleTargets.py (1069 of 2163)
PASS: lldb-api :: commands/expression/rdar42038760/TestScalarURem.py (1070 of 2163)
PASS: lldb-api :: functionalities/gdb_remote_client/TestGDBRemoteLoad.py (1071 of 2163)
PASS: lldb-shell :: Driver/TestHelp.test (1072 of 2163)
PASS: lldb-api :: types/TestShortTypeExpr.py (1073 of 2163)
PASS: lldb-unit :: Utility/./UtilityTests/XcodeSDKTest.ParseTest (1074 of 2163)
PASS: lldb-api :: functionalities/conditional_break/TestConditionalBreak.py (1075 of 2163)
UNSUPPORTED: lldb-shell :: Register/x86-64-zmm-write.test (1076 of 2163)
PASS: lldb-unit :: Utility/./UtilityTests/UriParserTest.BracketedHostnamePort (1077 of 2163)
PASS: lldb-unit :: Language/Highlighting/./HighlighterTests/HighlighterTest.ClangUnterminatedString (1078 of 2163)
PASS: lldb-unit :: SymbolFile/NativePDB/./SymbolFileNativePDBTests/PDBFPOProgramToDWARFExpressionTests.UnknownOp (1079 of 2163)
PASS: lldb-unit :: Symbol/./SymbolTests/DWARFCallFrameInfoTest.Basic_eh (1080 of 2163)
PASS: lldb-unit :: Utility/./UtilityTests/LogChannelTest.EnableOptions (1081 of 2163)
UNSUPPORTED: lldb-api :: tools/lldb-server/signal-filtering/TestGdbRemote_QPassSignals.py (1082 of 2163)
PASS: lldb-unit :: Utility/./UtilityTests/StreamTest.PutRawBytesToBigEndian (1083 of 2163)
PASS: lldb-api :: functionalities/tail_call_frames/ambiguous_tail_call_seq2/TestAmbiguousTailCallSeq2.py (1084 of 2163)
PASS: lldb-api :: commands/expression/import-std-module/queue/TestQueueFromStdModule.py (1085 of 2163)
PASS: lldb-unit :: Utility/./UtilityTests/RangeTest.LessThanInvalid (1086 of 2163)
PASS: lldb-api :: lang/cpp/function_refs/TestFunctionRefs.py (1087 of 2163)
UNSUPPORTED: lldb-shell :: SymbolFile/PDB/pointers.test (1088 of 2163)
PASS: lldb-api :: functionalities/thread/concurrent_events/TestConcurrentCrashWithWatchpointBreakpointSignal.py (1089 of 2163)
PASS: lldb-shell :: ExecControl/StopHook/stop-hook.test (1090 of 2163)
PASS: lldb-unit :: Host/./HostTests/SocketTests/SocketTest.UDPGetConnectURI/ipv6 (1091 of 2163)
PASS: lldb-unit :: Utility/./UtilityTests/BinaryStreamTest.PutULEB128FourBytes (1092 of 2163)
PASS: lldb-api :: commands/expression/multiline-completion/TestMultilineCompletion.py (1093 of 2163)
PASS: lldb-api :: lang/objc/objc-ivar-offsets/TestObjCIvarOffsets.py (1094 of 2163)
PASS: lldb-api :: commands/command/script/TestCommandScript.py (1095 of 2163)
PASS: lldb-shell :: Reproducer/TestGDBRemoteRepro.test (1096 of 2163)
PASS: lldb-unit :: Utility/./UtilityTests/RecordReplayTest.InstrumentedFooSameThis (1097 of 2163)
PASS: lldb-api :: functionalities/postmortem/minidump-new/TestMiniDumpUUID.py (1098 of 2163)
PASS: lldb-api :: commands/expression/weak_symbols/TestWeakSymbols.py (1099 of 2163)
PASS: lldb-unit :: Host/./HostTests/SocketTests/SocketTest.DomainListenConnectAccept/ipv6 (1100 of 2163)
PASS: lldb-api :: functionalities/gdb_remote_client/TestArmRegisterDefinition.py (1101 of 2163)
PASS: lldb-shell :: SymbolFile/Breakpad/line-table-edgecases.test (1102 of 2163)
PASS: lldb-unit :: debugserver/./debugserverTests/JSON.Parse (1103 of 2163)
PASS: lldb-unit :: Language/Highlighting/./HighlighterTests/HighlighterTest.ClangOperators (1104 of 2163)
PASS: lldb-api :: functionalities/dlopen_other_executable/TestDlopenOtherExecutable.py (1105 of 2163)
PASS: lldb-api :: python_api/hello_world/TestHelloWorld.py (1106 of 2163)
PASS: lldb-unit :: Utility/./UtilityTests/RangeTest.NotEqual (1107 of 2163)
PASS: lldb-unit :: Utility/./UtilityTests/VMRange.ContainsAddr (1108 of 2163)
PASS: lldb-api :: functionalities/step_scripted/TestStepScripted.py (1109 of 2163)
PASS: lldb-api :: tools/lldb-server/inferior-crash/TestGdbRemoteSegFault.py (1110 of 2163)
PASS: lldb-shell :: SymbolFile/Breakpad/symtab-macho.test (1111 of 2163)
PASS: lldb-api :: lang/cpp/accelerator-table/TestCPPAccelerator.py (1112 of 2163)
PASS: lldb-unit :: Utility/./UtilityTests/Flags.Reset (1113 of 2163)
PASS: lldb-unit :: Utility/./UtilityTests/ProcessInstanceInfo.Dump (1114 of 2163)
PASS: lldb-unit :: Host/./HostTests/SocketTests/SocketTest.TCPListen0GetPort/ipv4 (1115 of 2163)
PASS: lldb-api :: lang/cpp/namespace/TestNamespace.py (1116 of 2163)
PASS: lldb-unit :: Utility/./UtilityTests/UriParserTest.SchemeHostSeparator3 (1117 of 2163)
PASS: lldb-api :: driver/batch_mode/TestBatchMode.py (1118 of 2163)
PASS: lldb-api :: lang/objc/conflicting-definition/TestConflictingDefinition.py (1119 of 2163)
PASS: lldb-api :: functionalities/data-formatter/data-formatter-python-synth/TestDataFormatterPythonSynth.py (1120 of 2163)
PASS: lldb-api :: lang/cpp/signed_types/TestSignedTypes.py (1121 of 2163)
PASS: lldb-unit :: Host/./HostTests/MainLoopTest.ReadObject (1122 of 2163)
PASS: lldb-api :: functionalities/tail_call_frames/disambiguate_tail_call_seq/TestDisambiguateTailCallSeq.py (1123 of 2163)
UNSUPPORTED: lldb-shell :: ScriptInterpreter/Lua/quit.test (1124 of 2163)
PASS: lldb-unit :: UnwindAssembly/PPC64/./PPC64InstEmulationTests/TestPPC64InstEmulation.TestSimpleFunction (1125 of 2163)
PASS: lldb-unit :: Utility/./UtilityTests/StringExtractorTest.InitEmpty (1126 of 2163)
PASS: lldb-unit :: Interpreter/./InterpreterTests/CompletionTest.DirCompletionAbsolute (1127 of 2163)
PASS: lldb-api :: lang/objcxx/class-name-clash/TestNameClash.py (1128 of 2163)
PASS: lldb-api :: functionalities/thread/concurrent_events/TestConcurrentTwoBreakpointThreads.py (1129 of 2163)
PASS: lldb-api :: tools/lldb-vscode/console/TestVSCode_console.py (1130 of 2163)
PASS: lldb-shell :: SymbolFile/DWARF/dwp-debug-types.s (1131 of 2163)
PASS: lldb-unit :: UnwindAssembly/x86/./UnwindAssemblyx86Tests/Testx86AssemblyInspectionEngine.TestPopR12 (1132 of 2163)
PASS: lldb-unit :: Expression/./ExpressionTests/CppModuleConfigurationTest.UnrelatedLibrary (1133 of 2163)
PASS: lldb-unit :: Utility/./UtilityTests/StreamTest.PutHex32ByteOrderLittle (1134 of 2163)
PASS: lldb-api :: functionalities/float-display/TestFloatDisplay.py (1135 of 2163)
PASS: lldb-api :: lang/objc/blocks/TestObjCIvarsInBlocks.py (1136 of 2163)
PASS: lldb-api :: python_api/sbvalue_persist/TestSBValuePersist.py (1137 of 2163)
PASS: lldb-shell :: Minidump/Windows/Sigsegv/sigsegv.test (1138 of 2163)
PASS: lldb-api :: lang/cpp/llvm-style/TestLLVMStyle.py (1139 of 2163)
PASS: lldb-api :: api/multithreaded/TestMultithreaded.py (1140 of 2163)
PASS: lldb-unit :: Symbol/./SymbolTests/TestClangASTImporter.CompleteFwdDeclWithOtherOrigin (1141 of 2163)
PASS: lldb-api :: lang/objc/foundation/TestObjCMethodsNSError.py (1142 of 2163)
PASS: lldb-unit :: Utility/./UtilityTests/NameMatchesTest.Ignore (1143 of 2163)
PASS: lldb-unit :: Utility/./UtilityTests/StringLexerTest.Peek (1144 of 2163)
PASS: lldb-unit :: Symbol/./SymbolTests/PostfixExpression.ToDWARF (1145 of 2163)
PASS: lldb-unit :: Process/gdb-remote/./ProcessGdbRemoteTests/GDBRemoteCommunicationServerTest.SendErrorResponse_Status (1146 of 2163)
PASS: lldb-shell :: SymbolFile/DWARF/find-variable-file.cpp (1147 of 2163)
UNSUPPORTED: lldb-shell :: Register/x86-64-gp-write.test (1148 of 2163)
PASS: lldb-unit :: Process/gdb-remote/./ProcessGdbRemoteTests/GDBRemoteClientBaseTest.SendContinueAndAsyncSignal (1149 of 2163)
PASS: lldb-api :: lang/objc/modules-app-update/TestClangModulesAppUpdate.py (1150 of 2163)
PASS: lldb-unit :: Utility/./UtilityTests/DataExtractorTest.GetFloat (1151 of 2163)
PASS: lldb-unit :: UnwindAssembly/x86/./UnwindAssemblyx86Tests/Testx86AssemblyInspectionEngine.TestPushEDX (1152 of 2163)
PASS: lldb-api :: commands/expression/codegen-crash-typedefdecl-not-in_declcontext/TestCodegenCrashTypedefDeclNotInDeclContext.py (1153 of 2163)
PASS: lldb-shell :: SymbolFile/DWARF/childless-compile-unit.s (1154 of 2163)
PASS: lldb-unit :: Expression/./ExpressionTests/DiagnosticManagerTest.AddDiagnostic (1155 of 2163)
PASS: lldb-unit :: Utility/./UtilityTests/RangeTest.DoesIntersect (1156 of 2163)
PASS: lldb-api :: lang/c/stepping/TestStepAndBreakpoints.py (1157 of 2163)
PASS: lldb-unit :: UnwindAssembly/x86/./UnwindAssemblyx86Tests/Testx86AssemblyInspectionEngine.TestSimplex86_64Augmented (1158 of 2163)
PASS: lldb-api :: macosx/load-kext/TestLoadKext.py (1159 of 2163)
PASS: lldb-unit :: Symbol/./SymbolTests/Type.GetTypeScopeAndBasename (1160 of 2163)
PASS: lldb-unit :: Host/./HostTests/SocketTests/SocketTest.TCPGetAddress/ipv6 (1161 of 2163)
PASS: lldb-api :: tools/lldb-server/TestGdbRemoteExitCode.py (1162 of 2163)
PASS: lldb-unit :: Utility/./UtilityTests/RangeDataVector.CustomSort (1163 of 2163)
PASS: lldb-unit :: Utility/./UtilityTests/DataExtractorTest.GetMaxU64_unchecked (1164 of 2163)
PASS: lldb-api :: functionalities/inferior-assert/TestInferiorAssert.py (1165 of 2163)
PASS: lldb-api :: functionalities/data-formatter/data-formatter-cpp/TestDataFormatterCpp.py (1166 of 2163)
PASS: lldb-unit :: Utility/./UtilityTests/BroadcasterTest.BroadcastEvent (1167 of 2163)
PASS: lldb-unit :: Utility/./UtilityTests/StringListTest.ForRange (1168 of 2163)
PASS: lldb-shell :: SymbolFile/Breakpad/symtab.test (1169 of 2163)
PASS: lldb-api :: commands/expression/import-std-module/deque-dbg-info-content/TestDbgInfoContentDequeFromStdModule.py (1170 of 2163)
UNSUPPORTED: lldb-api :: functionalities/process_save_core/TestProcessSaveCore.py (1171 of 2163)
PASS: lldb-api :: lang/c/function_types/TestFunctionTypes.py (1172 of 2163)
PASS: lldb-unit :: Process/minidump/./LLDBMinidumpTests/MinidumpParserTest.FindMemoryRangeWithFullMemoryMinidump (1173 of 2163)
PASS: lldb-unit :: Utility/./UtilityTests/FileSpecTest.RemoveLastPathComponent (1174 of 2163)
PASS: lldb-shell :: Minidump/fb-dump.test (1175 of 2163)
PASS: lldb-unit :: Utility/./UtilityTests/EnvironmentTest.EnvpConstruction (1176 of 2163)
PASS: lldb-api :: commands/expression/ir-interpreter-phi-nodes/TestIRInterpreterPHINodes.py (1177 of 2163)
PASS: lldb-unit :: Utility/./UtilityTests/UriParserTest.PortOverflow (1178 of 2163)
PASS: lldb-shell :: Driver/TestFile.test (1179 of 2163)
PASS: lldb-unit :: Utility/./UtilityTests/StreamTest.PutCStringWithStringRef (1180 of 2163)
PASS: lldb-unit :: Utility/./UtilityTests/StreamTest.QuotedCString (1181 of 2163)
PASS: lldb-unit :: Utility/./UtilityTests/RecordReplayTest.InstrumentedFoo (1182 of 2163)
PASS: lldb-unit :: Core/./LLDBCoreTests/RichManglingContextTest.Basic (1183 of 2163)
PASS: lldb-unit :: Language/Highlighting/./HighlighterTests/HighlighterTest.ClangCursorPosEndOfLine (1184 of 2163)
PASS: lldb-unit :: DataFormatter/./LLDBFormatterTests/TypeMatcherTests.ExactName (1185 of 2163)
PASS: lldb-api :: functionalities/wrong_commands/TestWrongCommands.py (1186 of 2163)
PASS: lldb-shell :: SymbolFile/DWARF/find-inline-method.s (1187 of 2163)
PASS: lldb-api :: functionalities/data-formatter/data-formatter-globals/TestDataFormatterGlobals.py (1188 of 2163)
PASS: lldb-api :: functionalities/backticks/TestBackticksWithoutATarget.py (1189 of 2163)
PASS: lldb-api :: commands/apropos/basic/TestApropos.py (1190 of 2163)
PASS: lldb-api :: commands/expression/call-function/TestCallBuiltinFunction.py (1191 of 2163)
PASS: lldb-api :: commands/expression/import-std-module/empty-module/TestEmptyStdModule.py (1192 of 2163)
PASS: lldb-unit :: Utility/./UtilityTests/BinaryStreamTest.PutSLEB128MaxValue (1193 of 2163)
PASS: lldb-api :: functionalities/signal/handle-abrt/TestHandleAbort.py (1194 of 2163)
PASS: lldb-unit :: Language/Highlighting/./HighlighterTests/HighlighterTest.ClangCursorPosInOtherToken (1195 of 2163)
PASS: lldb-shell :: SymbolFile/DWARF/debug_aranges-empty-section.s (1196 of 2163)
PASS: lldb-api :: tools/lldb-vscode/breakpoint/TestVSCode_setExceptionBreakpoints.py (1197 of 2163)
UNSUPPORTED: lldb-shell :: Process/Windows/exception_access_violation.cpp (1198 of 2163)
UNSUPPORTED: lldb-shell :: ScriptInterpreter/Lua/bindings.test (1199 of 2163)
PASS: lldb-api :: lang/cpp/modules-import/TestCXXModulesImport.py (1200 of 2163)
PASS: lldb-api :: commands/frame/diagnose/dereference-argument/TestDiagnoseDereferenceArgument.py (1201 of 2163)
PASS: lldb-unit :: Utility/./UtilityTests/RangeDataVector.FindEntryThatContains (1202 of 2163)
PASS: lldb-api :: tools/lldb-vscode/breakpoint/TestVSCode_setFunctionBreakpoints.py (1203 of 2163)
PASS: lldb-unit :: Utility/./UtilityTests/OptionsWithRawTest.MultiWordSuffix (1204 of 2163)
PASS: lldb-shell :: ObjectFile/PECOFF/uuid.yaml (1205 of 2163)
PASS: lldb-api :: functionalities/inferior-changed/TestInferiorChanged.py (1206 of 2163)
PASS: lldb-unit :: Utility/./UtilityTests/RangeTest.ContainsRangeStartingFromZero (1207 of 2163)
UNSUPPORTED: lldb-api :: benchmarks/expression/TestExpressionCmd.py (1208 of 2163)
PASS: lldb-api :: types/TestFloatTypes.py (1209 of 2163)
PASS: lldb-unit :: Utility/./UtilityTests/RangeTest.ContainsRange (1210 of 2163)
PASS: lldb-unit :: Expression/./ExpressionTests/DiagnosticManagerTest.HasFixits (1211 of 2163)
PASS: lldb-unit :: Utility/./UtilityTests/XcodeSDKTest.MergeTest (1212 of 2163)
PASS: lldb-api :: functionalities/thread/num_threads/TestNumThreads.py (1213 of 2163)
PASS: lldb-api :: commands/platform/basic/TestPlatformCommand.py (1214 of 2163)
PASS: lldb-unit :: Utility/./UtilityTests/StringListTest.InsertStringAtIndexStart (1215 of 2163)
PASS: lldb-shell :: ObjectFile/MachO/lc_version_min.yaml (1216 of 2163)
PASS: lldb-api :: commands/expression/codegen-crash-import-def-arraytype-element/TestImportDefinitionArrayType.py (1217 of 2163)
PASS: lldb-api :: python_api/default-constructor/TestDefaultConstructorForAPIObjects.py (1218 of 2163)
PASS: lldb-api :: lang/objc/objc-new-syntax/TestObjCNewSyntaxLiteral.py (1219 of 2163)
UNSUPPORTED: lldb-api :: arm/breakpoint-thumb-codesection/TestBreakpointThumbCodesection.py (1220 of 2163)
PASS: lldb-unit :: Utility/./UtilityTests/StringListTest.SplitIntoLinesEmpty (1221 of 2163)
PASS: lldb-shell :: SymbolFile/DWARF/array-sizes.s (1222 of 2163)
PASS: lldb-api :: functionalities/gdb_remote_client/TestPlatformClient.py (1223 of 2163)
PASS: lldb-unit :: Utility/./UtilityTests/ArchSpecTest.YAML (1224 of 2163)
PASS: lldb-api :: functionalities/inferior-crashing/TestInferiorCrashingStep.py (1225 of 2163)
PASS: lldb-api :: functionalities/breakpoint/breakpoint_command/TestRegexpBreakCommand.py (1226 of 2163)
PASS: lldb-api :: lang/objc/foundation/TestObjCMethods2.py (1227 of 2163)
PASS: lldb-api :: functionalities/breakpoint/source_regexp/TestSourceRegexBreakpoints.py (1228 of 2163)
PASS: lldb-unit :: ScriptInterpreter/Python/./ScriptInterpreterPythonTests/PythonDataObjectsTest.TestPythonDictionaryToStructuredDictionary (1229 of 2163)
PASS: lldb-unit :: Utility/./UtilityTests/StringExtractorTest.DecodeHexU8_InvalidHex2 (1230 of 2163)
PASS: lldb-unit :: Utility/./UtilityTests/ProcessInstanceInfoMatch.Name (1231 of 2163)
UNSUPPORTED: lldb-api :: tools/lldb-server/TestGdbRemote_vContThreads.py (1232 of 2163)
PASS: lldb-api :: functionalities/plugins/python_os_plugin/TestPythonOSPlugin.py (1233 of 2163)
PASS: lldb-unit :: Symbol/./SymbolTests/TestTypeSystemClang.TestGetTypeClassTypeOf (1234 of 2163)
PASS: lldb-unit :: Utility/./UtilityTests/AnsiTerminal.Basic (1235 of 2163)
UNSUPPORTED: lldb-api :: commands/trace/TestTraceLoad.py (1236 of 2163)
UNSUPPORTED: lldb-shell :: SymbolFile/PDB/variables.test (1237 of 2163)
PASS: lldb-shell :: ObjectFile/ELF/netbsd-exec-8.99.30-amd64.yaml (1238 of 2163)
PASS: lldb-shell :: SymbolFile/DWARF/dir-separator-posix.s (1239 of 2163)
PASS: lldb-unit :: Utility/./UtilityTests/OptionsWithRawTest.EmptyArgsOnlySuffix (1240 of 2163)
PASS: lldb-api :: functionalities/postmortem/netbsd-core/TestNetBSDCore.py (1241 of 2163)
PASS: lldb-api :: tools/lldb-vscode/breakpoint/TestVSCode_setBreakpoints.py (1242 of 2163)
PASS: lldb-api :: lang/objc/objc-class-method/TestObjCClassMethod.py (1243 of 2163)
PASS: lldb-unit :: Process/gdb-remote/./ProcessGdbRemoteTests/GDBRemoteClientBaseTest.SendContinueAndInterrupt2PacketBug (1244 of 2163)
PASS: lldb-api :: python_api/value/change_values/TestChangeValueAPI.py (1245 of 2163)
PASS: lldb-api :: functionalities/data-formatter/boolreference/TestFormattersBoolRefPtr.py (1246 of 2163)
PASS: lldb-unit :: Utility/./UtilityTests/StreamTeeTest.DefaultConstructor (1247 of 2163)
PASS: lldb-api :: functionalities/breakpoint/auto_continue/TestBreakpointAutoContinue.py (1248 of 2163)
UNSUPPORTED: lldb-shell :: Register/x86-zmm-write.test (1249 of 2163)
PASS: lldb-shell :: Unwind/trap_frame_sym_ctx.test (1250 of 2163)
PASS: lldb-api :: functionalities/breakpoint/hardware_breakpoints/require_hw_breakpoints/TestRequireHWBreakpoints.py (1251 of 2163)
PASS: lldb-unit :: Utility/./UtilityTests/StringListTest.AppendStringCString (1252 of 2163)
PASS: lldb-unit :: Utility/./UtilityTests/OptionsWithRawTest.SingleWhitespaceInput (1253 of 2163)
PASS: lldb-api :: functionalities/load_unload/TestLoadUnload.py (1254 of 2163)
PASS: lldb-shell :: ObjectFile/wasm/stripped-debug-sections.yaml (1255 of 2163)
PASS: lldb-api :: commands/expression/import-std-module/sysroot/TestStdModuleSysroot.py (1256 of 2163)
PASS: lldb-shell :: ObjectFile/ELF/duplicate-section.yaml (1257 of 2163)
PASS: lldb-shell :: SymbolFile/NativePDB/ast-methods.cpp (1258 of 2163)
PASS: lldb-unit :: Thread/./ThreadTests/ThreadTest.SetStopInfo (1259 of 2163)
PASS: lldb-api :: python_api/watchpoint/watchlocation/TestSetWatchlocation.py (1260 of 2163)
PASS: lldb-unit :: ScriptInterpreter/Python/./ScriptInterpreterPythonTests/PythonDataObjectsTest.TestPythonCallableInvoke (1261 of 2163)
PASS: lldb-shell :: Breakpoint/debug_rnglist_rlestartend.test (1262 of 2163)
PASS: lldb-unit :: Host/./HostTests/SocketTests/SocketTest.DecodeHostAndPort/ipv4 (1263 of 2163)
PASS: lldb-unit :: debugserver/./debugserverTests/RNBSocket.LoopBackListenIPv4 (1264 of 2163)
PASS: lldb-api :: python_api/section/TestSectionAPI.py (1265 of 2163)
PASS: lldb-unit :: Utility/./UtilityTests/StreamTeeTest.SetStreamAtIndexOverwrite (1266 of 2163)
PASS: lldb-shell :: Settings/TestFrameFormatNoColor.test (1267 of 2163)
PASS: lldb-api :: python_api/watchpoint/condition/TestWatchpointConditionAPI.py (1268 of 2163)
PASS: lldb-api :: tools/lldb-vscode/coreFile/TestVSCode_coreFile.py (1269 of 2163)
PASS: lldb-api :: iohandler/autosuggestion/TestAutosuggestion.py (1270 of 2163)
PASS: lldb-unit :: Editline/./EditlineTests/EditlineTestFixture.EditlineReceivesMultiLineText (1271 of 2163)
PASS: lldb-api :: functionalities/thread/concurrent_events/TestConcurrentWatchBreak.py (1272 of 2163)
PASS: lldb-unit :: Language/Highlighting/./HighlighterTests/HighlighterTest.ClangComments (1273 of 2163)
PASS: lldb-api :: commands/target/select/TestTargetSelect.py (1274 of 2163)
PASS: lldb-api :: functionalities/data-formatter/data-formatter-stl/libcxx/map/TestDataFormatterLibccMap.py (1275 of 2163)
PASS: lldb-api :: commands/expression/import-std-module/shared_ptr/TestSharedPtrFromStdModule.py (1276 of 2163)
UNSUPPORTED: lldb-api :: lang/cpp/static_members/TestCPPStaticMembers.py (1277 of 2163)
PASS: lldb-api :: functionalities/testid/TestTestId.py (1278 of 2163)
PASS: lldb-unit :: Utility/./UtilityTests/AnsiTerminal.WhiteSpace (1279 of 2163)
PASS: lldb-unit :: Utility/./UtilityTests/SerializationRountripTest.SerializeDeserializeCStringNull (1280 of 2163)
PASS: lldb-unit :: UnwindAssembly/x86/./UnwindAssemblyx86Tests/Testx86AssemblyInspectionEngine.TestReturnDetect (1281 of 2163)
PASS: lldb-shell :: SymbolFile/DWARF/limit-debug-info.s (1282 of 2163)
PASS: lldb-api :: functionalities/thread/concurrent_events/TestConcurrentSignalWatchBreak.py (1283 of 2163)
PASS: lldb-api :: functionalities/data-formatter/data-formatter-stl/libcxx/unordered/TestDataFormatterUnordered.py (1284 of 2163)
PASS: lldb-shell :: Reproducer/TestDebugSymbols.test (1285 of 2163)
PASS: lldb-unit :: Host/./HostTests/HostInfoTest.GetXcodeSDK (1286 of 2163)
PASS: lldb-unit :: Utility/./UtilityTests/StringExtractorTest.GetU32LittleEndian (1287 of 2163)
UNSUPPORTED: lldb-api :: tools/lldb-server/registers-target-xml-reading/TestGdbRemoteTargetXmlPacket.py (1288 of 2163)
PASS: lldb-unit :: ObjectFile/PECOFF/./ObjectFilePECOFFTests/PECallFrameInfoTest.Frame_reg_eh (1289 of 2163)
PASS: lldb-api :: functionalities/param_entry_vals/basic_entry_values/TestBasicEntryValues.py (1290 of 2163)
PASS: lldb-unit :: Expression/./ExpressionTests/DWARFExpression.DW_OP_unknown (1291 of 2163)
PASS: lldb-api :: functionalities/data-formatter/data-formatter-stl/libcxx/optional/TestDataFormatterLibcxxOptional.py (1292 of 2163)
PASS: lldb-unit :: Core/./LLDBCoreTests/SourceFileCache.FindSourceFileNotFound (1293 of 2163)
PASS: lldb-api :: commands/apropos/with-process/TestAproposWithProcess.py (1294 of 2163)
PASS: lldb-api :: lang/cpp/alignas_base_class/TestAlignAsBaseClass.py (1295 of 2163)
PASS: lldb-api :: functionalities/memory/read/TestMemoryRead.py (1296 of 2163)
PASS: lldb-unit :: Symbol/./SymbolTests/TestTypeSystemClang.TestNotDeletingUserCopyCstrDueToMoveCStr (1297 of 2163)
PASS: lldb-api :: commands/target/stop-hook/delete/TestTargetStopHookDelete.py (1298 of 2163)
PASS: lldb-shell :: SymbolFile/DWARF/DW_TAG_variable-invalid_location.s (1299 of 2163)
PASS: lldb-shell :: Reproducer/TestRelativePath.test (1300 of 2163)
PASS: lldb-api :: functionalities/avoids-fd-leak/TestFdLeak.py (1301 of 2163)
PASS: lldb-shell :: Reproducer/TestCrash.test (1302 of 2163)
PASS: lldb-unit :: Symbol/./SymbolTests/TestTypeSystemClang.TestFunctionTemplateConstruction (1303 of 2163)
PASS: lldb-unit :: Utility/./UtilityTests/Flags.AnySet (1304 of 2163)
PASS: lldb-shell :: Minidump/no-process-id.yaml (1305 of 2163)
PASS: lldb-unit :: Symbol/./SymbolTests/TestClangASTImporter.DeportTypeTagDecl (1306 of 2163)
PASS: lldb-unit :: Utility/./UtilityTests/TimeoutTest.Format (1307 of 2163)
PASS: lldb-unit :: SymbolFile/NativePDB/./SymbolFileNativePDBTests/PDBFPOProgramToDWARFExpressionTests.UnresolvedCyclicRegisterAssignmentReference (1308 of 2163)
UNSUPPORTED: lldb-shell :: Register/arm-fp-read.test (1309 of 2163)
PASS: lldb-unit :: Process/gdb-remote/./ProcessGdbRemoteTests/GDBRemoteCommunicationClientTest.SendStartTracePacket (1310 of 2163)
PASS: lldb-shell :: SymbolFile/DWARF/DW_AT_const_value-bitfields.s (1311 of 2163)
PASS: lldb-api :: functionalities/tail_call_frames/thread_step_out_message/TestArtificialFrameStepOutMessage.py (1312 of 2163)
PASS: lldb-unit :: Utility/./UtilityTests/StringExtractorTest.GetHexU8_Extra (1313 of 2163)
PASS: lldb-unit :: UnwindAssembly/x86/./UnwindAssemblyx86Tests/Testx86AssemblyInspectionEngine.TestPushECX (1314 of 2163)
PASS: lldb-unit :: Core/./LLDBCoreTests/RichManglingContextTest.IPDRealloc (1315 of 2163)
PASS: lldb-api :: functionalities/postmortem/minidump-new/TestMiniDumpNew.py (1316 of 2163)
PASS: lldb-shell :: ScriptInterpreter/Python/eof.test (1317 of 2163)
PASS: lldb-unit :: Interpreter/./InterpreterTests/OptionValueFileColonLine.setFromString (1318 of 2163)
PASS: lldb-api :: lang/objc/radar-9691614/TestObjCMethodReturningBOOL.py (1319 of 2163)
PASS: lldb-unit :: UnwindAssembly/x86/./UnwindAssemblyx86Tests/Testx86AssemblyInspectionEngine.TestSpArithx86_64Augmented (1320 of 2163)
PASS: lldb-api :: functionalities/thread/concurrent_events/TestConcurrentWatchpointWithDelayWatchpointThreads.py (1321 of 2163)
PASS: lldb-unit :: UnwindAssembly/x86/./UnwindAssemblyx86Tests/Testx86AssemblyInspectionEngine.TestPushExtended (1322 of 2163)
PASS: lldb-api :: lang/cpp/elaborated-types/TestElaboratedTypes.py (1323 of 2163)
PASS: lldb-shell :: Reproducer/Modules/TestModuleCXX.test (1324 of 2163)
UNSUPPORTED: lldb-api :: functionalities/darwin_log/source/info/TestDarwinLogSourceInfo.py (1325 of 2163)
PASS: lldb-unit :: Utility/./UtilityTests/ArchSpecTest.TestParseMachCPUDashSubtypeTripleSimple (1326 of 2163)
PASS: lldb-api :: functionalities/data-formatter/data-formatter-objc/TestDataFormatterObjCNSData.py (1327 of 2163)
UNSUPPORTED: lldb-shell :: ScriptInterpreter/Lua/independent_state.test (1328 of 2163)
PASS: lldb-unit :: SymbolFile/NativePDB/./SymbolFileNativePDBTests/PDBFPOProgramToDWARFExpressionTests.DependencyChain (1329 of 2163)
PASS: lldb-api :: lang/cpp/constructors/TestCppConstructors.py (1330 of 2163)
PASS: lldb-api :: functionalities/thread/concurrent_events/TestConcurrentSignalBreak.py (1331 of 2163)
PASS: lldb-unit :: UnwindAssembly/x86/./UnwindAssemblyx86Tests/Testx86AssemblyInspectionEngine.TestPushR15 (1332 of 2163)
PASS: lldb-api :: functionalities/tsan/cpp_global_location/TestTsanCPPGlobalLocation.py (1333 of 2163)
PASS: lldb-unit :: Utility/./UtilityTests/RangeTest.ContainsEndInclusive (1334 of 2163)
PASS: lldb-unit :: Utility/./UtilityTests/ReproducerTest.SetCapture (1335 of 2163)
PASS: lldb-unit :: Utility/./UtilityTests/TimerTest.CategoryTimesNested (1336 of 2163)
PASS: lldb-api :: tools/lldb-server/TestGdbRemote_qThreadStopInfo.py (1337 of 2163)
PASS: lldb-api :: lang/cpp/breakpoint_in_member_func_w_non_primitive_params/TestBreakpointInMemberFuncWNonPrimitiveParams.py (1338 of 2163)
FAIL: lldb-api :: commands/gui/basicdebug/TestGuiBasicDebug.py (1339 of 2163)
******************** TEST 'lldb-api :: commands/gui/basicdebug/TestGuiBasicDebug.py' FAILED ********************
Script:
--
/usr/local/Frameworks/Python.framework/Versions/3.7/bin/python3.7 /Users/buildslave/jenkins/workspace/lldb-cmake/llvm-project/lldb/test/API/dotest.py -S nm -u CXXFLAGS -u CFLAGS --codesign-identity - --arch x86_64 --build-dir /Users/buildslave/jenkins/workspace/lldb-cmake/lldb-build/lldb-test-build.noindex -s=/Users/buildslave/jenkins/workspace/lldb-cmake/test/logs -t --env TERM=vt100 --env LLVM_LIBS_DIR=/Users/buildslave/jenkins/workspace/lldb-cmake/lldb-build/./lib --arch x86_64 --build-dir /Users/buildslave/jenkins/workspace/lldb-cmake/lldb-build/lldb-test-build.noindex -s /Users/buildslave/jenkins/workspace/lldb-cmake/lldb-build/lldb-test-traces --lldb-module-cache-dir /Users/buildslave/jenkins/workspace/lldb-cmake/lldb-build/lldb-test-build.noindex/module-cache-lldb/lldb-api --clang-module-cache-dir /Users/buildslave/jenkins/workspace/lldb-cmake/lldb-build/lldb-test-build.noindex/module-cache-clang/lldb-api --executable /Users/buildslave/jenkins/workspace/lldb-cmake/lldb-build/./bin/lldb --compiler /Users/buildslave/jenkins/workspace/lldb-cmake/lldb-build/./bin/clang --dsymutil /Users/buildslave/jenkins/workspace/lldb-cmake/lldb-build/./bin/dsymutil --filecheck /Users/buildslave/jenkins/workspace/lldb-cmake/lldb-build/./bin/FileCheck --yaml2obj /Users/buildslave/jenkins/workspace/lldb-cmake/lldb-build/./bin/yaml2obj --server /Users/buildslave/jenkins/workspace/lldb-cmake/lldb-build/./bin/debugserver --lldb-libs-dir /Users/buildslave/jenkins/workspace/lldb-cmake/lldb-build/./lib /Users/buildslave/jenkins/workspace/lldb-cmake/llvm-project/lldb/test/API/commands/gui/basicdebug -p TestGuiBasicDebug.py
--
Exit Code: 1

Hide Details

Command Output (stdout): -- lldb version 12.0.99 clang revision bdc85292fb0f2a3965c8c65f9461d285b04841ed llvm revision bdc85292fb0f2a3965c8c65f9461d285b04841ed (lldb) settings clear -all (lldb) settings set symbols.enable-external-lookup false (lldb) settings set target.inherit-tcc true (lldb) settings set target.auto-apply-fixits false (lldb) settings set plugin.process.gdb-remote.packet-timeout 60 (lldb) settings set symbols.clang-modules-cache-path "/Users/buildslave/jenkins/workspace/lldb-cmake/lldb-build/lldb-test-build.noindex/module-cache-lldb/lldb-api" (lldb) settings set use-color false (lldb) setting set target.prefer-dynamic-value no-dynamic-values (lldb) target create "/Users/buildslave/jenkins/workspace/lldb-cmake/lldb-build/lldb-test-build.noindex/commands/gui/basicdebug/TestGuiBasicDebug.test_gui/a.out" Current executable set to '/Users/buildslave/jenkins/workspace/lldb-cmake/lldb-build/lldb-test-build.noindex/commands/gui/basicdebug/TestGuiBasicDebug.test_gui/a.out' (x86_64). (lldb) br set -f main.c -p "// Break here" br set -f main.c -p "// Break here" Breakpoint 1: where = a.out`main + 22 at main.c:4:3, address = 0x0000000100000f86 (lldb) run run Process 86485 launched: '/Users/buildslave/jenkins/workspace/lldb-cmake/lldb-build/lldb-test-build.noindex/commands/gui/basicdebug/TestGuiBasicDebug.test_gui/a.out' (x86_64) Process 86485 stopped * thread #1, queue = 'com.apple.main-thread', stop reason = breakpoint 1.1 frame #0: 0x0000000100000f86 a.out`main(argc=1, argv=0x00007ffeefbff898) at main.c:4:3 1 extern int func(); 2 3 int main(int argc, char **argv) { -> 4 func(); // Break here ^ 5 func(); // Second 6 return 0; 7 } (lldb) gui sgui (B)0[?7h[?1h=| LLDB (F1) | Target (F2) | Process (F3) | Thread (F4) | View (F5) | Help (F6) | lqq<Sources>qqqqqqqqqqqqqqqqqqqqqqqqqqqqqqqqqqqqqqqqqqqqqqqqqqqqqqqqqqqqqqqqqqqqqqqqqqqqqqqqqqqqqqqqqqqqqqqqqqqqqqqqqqqqqqqqqqqqqqqqqqqqqqqqqqqqqqqqqqqqqqqqqqqqqqqqqqqqqqqqqqqqqqqqqqqqqqqqqqqqqqqqqqqqqqqqqqqqqqqqqqqqqqqqqqqqqqqqqqqqqqqqqqqqqqqqqqqqqqqqqqqqqqqqqqqqqqqqqqqqqqqqqqqqqqqqqqqqqqqqqqqqqqqqqqqqqqqqqqqqqqqqqqqqqqqqqqqqqqqqqqqqqqqqqqqqqqqqqqqqqqqqqqqqqqqqqqqqqqqqqqqqqqqqqqqqqqqqqqqqqqqqqqqklqq<Threads>qqqqqqqqqqqqqqqqqqqqqqqqqqqqqqqqqqqqqqqqqqqqqqqqqqqqqqqqqqqqqqqqqqqqqqqqqqqqqqqqqqqqqqqkx a.out`main xx `qprocess 86485xx 1 x extern int func();xxxx 2 xxxxx 3 x int main(int argc, char **argv) {xxxx 4 x` func(); // Break here <<< Thread 1: breakpoint 1.1xxxx 5 x func(); // Secondxxxx 6 x return 0;xxxx 7 x }xxxx 8 xxxxxxxxxxxxxxxxxxxxxxxxxxxxxxxxxxxxxxxxxxxxxxxxxxxxxxxxxxxxxxxxxxxxxxxxxxxxxxxxxxxxxxxxxxxxxxxxxxxxxxxxxxxxxxxxxxxxxxxxxxxxxlqq<Help>qqqqqqqqqqqqqqqqqqqqqqqqqqqqqqqqqqqqqqqqqqqqqqqqqqqqqqqqqqqqqqqqqqqqqqqqqqqqqqqkxxxxx Welcome to the LLDB curses GUI.xxxxxxxxxxxx Press the TAB key to change the selected view.xxxxxx Each view has its own keyboard shortcuts, press 'h' to open a dialog to display them. xxxxxxxxxxxx Common key bindings for all views:xxxxxxxxxxxxtab - Select next viewxxxxxx back-tab key - Select previous viewxxxxxxh - Show help dialog with view specific key bindingsxxxxxx, - Page upxxxxxx. - Page downxxxxxxup - Select previousxxxxxxdown - Select nextxxxxxxleft - Unexpand or select parentxxxxxxright - Expandxxxxxx page-up - Page upxxxxxx page-down - Page downxxxxxmqqqqqqqqqqqqqqqqqqqqqqqqqqqqqqqqqqqqqqqqqqqqqqqqqqqqqqqqqqqqqq[Press any key to exit]qqjxxxxxxxxxxxxxxxxxxxxxxxxxxxxxxxmqqqqqqqqqqqqqqqqqqqqqqqqqqqqqqqqqqqqqqqqqqqqqqqqqqqqqqqqqqqqqqqqqqqqqqqqqqqqqqqqqqqqqqqqqqqqqqqqqqqqqqqqqqqqqqqqqqqqqqqqqqqqqqqqqqqqqqqqqqqqqqqqqqqqqqqqqqqqqqqqqqqqqqqqqqqqqqqqqqqqqqqqqqqqqqqqqqqqqqqqqqqqqqqqqqqqqqqqqqqqqqqqqqqqqqqqqqqqqqqqqqqqqqqqqqqqqqqqqqqqqqqqqqqqqqqqqqqqqqqqqqqqqqqqqqqqqqqqqqqqqqqqqqqqqqqqqqqqqqqqqqqqqqqqqqqqqqqqqqqqqqqqqqqqqqqqqqqqqqqqqqqqqqqqqqqqqqqqqqqqqqqqqqqqqqqqqqqqqqjxxlqq<Variables>qqqqqqqqqqqqqqqqqqqqqqqqqqqqqqqqqqqqqqqqqqqqqqqqqqqqqqqqqqqqqqqqqqqqqqqqqqqqqqqqqqqqqqqqqqqqqqqqqqqqqqqqqqqqqqqqqqqqqqqqqqqqqqqqqqqqqqqqqqqqqqqqqqqqqqqqqqqqqqqqqqqqqqqqqqqqqqqqqqqqqqqqqqqqqqqqqqqqqqqqqqqqqqqqqqqqqqqqqqqqqqqqqqqqqqqqqqqqqqqqqqqqqqqqqqqqqqqqqqqqqqqqqqqqqqqqqqqqqqqqqqqqqqqqqqqqqqqqqqqqqqqqqqqqqqqqqqqqqqqqqqqqqqqqqqqqqqqqqqqqqqqqqqqqqqqqqqqqqqqqqqqqqqqqqqqqqqqqqqqqqqqqqkxxx (int) argc = 1xxxx `q(char **) argv = 0x00007ffeefbff898xxxxxxxxxxxxxxxxxxxxxxxxxxxxxxxxxxxxxxxxxxxxxxxxxxxxxxxxxxxxxxxxxxxxxxxxxxxxxxxxxxxxxxxxxxxxxxxxxxxxxxxxxxxmqqqqqqqqqqqqqqqqqqqqqqqqqqqqqqqqqqqqqqqqqqqqqqqqqqqqqqqqqqqqqqqqqqqqqqqqqqqqqqqqqqqqqqqqqqqqqqqqqqqqqqqqqqqqqqqqqqqqqqqqqqqqqqqqqqqqqqqqqqqqqqqqqqqqqqqqqqqqqqqqqqqqqqqqqqqqqqqqqqqqqqqqqqqqqqqqqqqqqqqqqqqqqqqqqqqqqqqqqqqqqqqqqqqqqqqqqqqqqqqqqqqqqqqqqqqqqqqqqqqqqqqqqqqqqqqqqqqqqqqqqqqqqqqqqqqqqqqqqqqqqqqqqqqqqqqqqqqqqqqqqqqqqqqqqqqqqqqqqqqqqqqqqqqqqqqqqqqqqqqqqqqqqqqqqqqqqqqqqqqqqqqqqqqqqqqqqqqqqqjmqqqqqqqqqqqqqqqqqqqqqqqqqqqqqqqqqqqqqqqqqqqqqqqqqqqqqqqqqqqqqqqqqqqqqqqqqqqqqqqqqqqqqqqqqqqqqqqqqqjProcess: 86485 stopped Thread: 0x736e9e Frame: 0 PC = 0x0000000100000f86 lqq<Sources>qqqqqqqqqqqqqqqqqqqqqqqqqqqqqqqqqqqqqqqqqqqqqqqqqqqqqqqqqqqqqqqqqqqqqqqqqqqqqqqqqqqqqqqqqqqqqqqqqqqqqqqqqqqqqqqqqqqqqqqqqqqqqqqqqqqqqqqqqqqqqqqqqqqqqqqqqqqqqqqqqqqqqqqqqqqqqqqqqqqqqqqqqqqqqqqqqqqqqqqqqqqqqqqqqqqqqqqqqqqqqqqqqqqqqqqqqqqqqqqqqqqqqqqqqqqqqqqqqqqqqqqqqqqqqqqqqqqqqqqqqqqqqqqqqqqqqqqqqqqqqqqqqqqqqqqqqqqqqqqqqqqqqqqqqqqqqqqqqqqqqqqqqqqqqqqqqqqqqqqqqqqqqqqqqqqqqqqqqqqqqqqqqqqk xx xx xx xx xx xx xx xx xx xx xx xx xx xx xx xx xx xx xx xx xx xx xx xx xx xx xx xx xx xx xx xx xx xx xx xx xx xx xx x x x  x x  x x  x x x x  x x  x x  x x   x x  x x   x x   x x   x x   x x   x x   x x   x x  x x  x x x xx xx xx xx xx xx xx mqqqqqqqqqqqqqqqqqqqqqqqqqqqqqqqqqqqqqqqqqqqqqqqqqqqqqqqqqqqqqqqqqqqqqqqqqqqqqqqqqqqqqqqqqqqqqqqqqqqqqqqqqqqqqqqqqqqqqqqqqqqqqqqqqqqqqqqqqqqqqqqqqqqqqqqqqqqqqqqqqqqqqqqqqqqqqqqqqqqqqqqqqqqqqqqqqqqqqqqqqqqqqqqqqqqqqqqqqqqqqqqqqqqqqqqqqqqqqqqqqqqqqqqqqqqqqqqqqqqqqqqqqqqqqqqqqqqqqqqqqqqqqqqqqqqqqqqqqqqqqqqqqqqqqqqqqqqqqqqqqqqqqqqqqqqqqqqqqqqqqqqqqqqqqqqqqqqqqqqqqqqqqqqqqqqqqqqqqqqqqqqqqqqqqqqqqqqqqqj runningfunc int func() { ` return 1; // In function <<< Thread 1: step in }  4 x       stoppedThread: 0x736e9e Frame: 0 PC = 0x0000000100000fa4umain extern int func();  int main(int argc, char **argv) {  4 x` func(); // Break here 5 x func(); // Second 6 x return 0; 7 x } 8 x(int) argc = 1 `q(char **) argv = 0x00007ffeefbff89818ddfunc int func() { ` return 1; // In function <<< Thread 1: step in }  4 x       0a4f runningmain extern int func();  int main(int argc, char **argv) {  4 x func(); // Break here 5 x` func(); // Second <<< Thread 1: step out 6 x return 0; 7 x } 8 x(int) argc = 1 `q(char **) argv = 0x00007ffeefbff898stoppedThread: 0x736e9e Frame: 0 PC = 0x0000000100000f8dsettings set interpreter.prompt-on-quit false quit  running

Hide Details

Hide Details

extern int func();

Hide Details

Hide Details

Hide Details

 func(); // Secondfunc int func() { ` return 1; // In function <<< Thread 1: step in }  4 x       stoppedThread: 0x736e9e Frame: 0 PC = 0x0000000100000fa4

Hide Details

Hide Details

Hide Details

 2  running  exited with status = 0libstdcxx tests will not be run because: Don't know how to build with libstdcxx on macosx Skipping following debug info categories: ['dwo']

Hide Details

-- Command Output (stderr): --

Hide Details

Session logs for test failures/errors/unexpected successes will go into directory '/Users/buildslave/jenkins/workspace/lldb-cmake/lldb-build/lldb-test-traces' Change dir to: /Users/buildslave/jenkins/workspace/lldb-cmake/llvm-project/lldb/test/API/commands/gui/basicdebug runCmd: settings clear -all output:

Hide Details

runCmd: settings set symbols.enable-external-lookup false output:

Hide Details

runCmd: settings set target.inherit-tcc true output:

Hide Details

runCmd: settings set target.auto-apply-fixits false output:

Hide Details

runCmd: settings set plugin.process.gdb-remote.packet-timeout 60 output:

Hide Details

runCmd: settings set symbols.clang-modules-cache-path "/Users/buildslave/jenkins/workspace/lldb-cmake/lldb-build/lldb-test-build.noindex/module-cache-lldb/lldb-api" output:

Hide Details

runCmd: settings set use-color false output:

Hide Details

runCmd: setting set target.prefer-dynamic-value no-dynamic-values output:

Hide Details

FAIL: LLDB (/Users/buildslave/jenkins/workspace/lldb-cmake/lldb-build/bin/clang-x86_64) :: test_gui (TestGuiBasicDebug.TestGuiBasicDebugCommandTest) tearing down the child process....

Hide Details

Restore dir to: /Users/buildslave/jenkins/workspace/lldb-cmake/lldb-build/tools/lldb/test ====================================================================== ERROR: test_gui (TestGuiBasicDebug.TestGuiBasicDebugCommandTest) ---------------------------------------------------------------------- Traceback (most recent call last): File "/Users/buildslave/jenkins/workspace/lldb-cmake/llvm-project/lldb/third_party/Python/module/pexpect-4.6/pexpect/expect.py", line 111, in expect_loop incoming = spawn.read_nonblocking(spawn.maxread, timeout) File "/Users/buildslave/jenkins/workspace/lldb-cmake/llvm-project/lldb/third_party/Python/module/pexpect-4.6/pexpect/pty_spawn.py", line 482, in read_nonblocking raise TIMEOUT('Timeout exceeded.') pexpect.exceptions.TIMEOUT: Timeout exceeded.

Hide Details

During handling of the above exception, another exception occurred:

Hide Details

Traceback (most recent call last): File "/Users/buildslave/jenkins/workspace/lldb-cmake/llvm-project/lldb/packages/Python/lldbsuite/test/decorators.py", line 134, in wrapper return func(*args, **kwargs) File "/Users/buildslave/jenkins/workspace/lldb-cmake/llvm-project/lldb/packages/Python/lldbsuite/test/decorators.py", line 104, in wrapper func(*args, **kwargs) File "/Users/buildslave/jenkins/workspace/lldb-cmake/llvm-project/lldb/test/API/commands/gui/basicdebug/TestGuiBasicDebug.py", line 40, in test_gui self.child.expect("func\(\); // Break here[^\r\n]+<<< Thread 1: step out") File "/Users/buildslave/jenkins/workspace/lldb-cmake/llvm-project/lldb/third_party/Python/module/pexpect-4.6/pexpect/spawnbase.py", line 341, in expect timeout, searchwindowsize, async_) File "/Users/buildslave/jenkins/workspace/lldb-cmake/llvm-project/lldb/third_party/Python/module/pexpect-4.6/pexpect/spawnbase.py", line 369, in expect_list return exp.expect_loop(timeout) File "/Users/buildslave/jenkins/workspace/lldb-cmake/llvm-project/lldb/third_party/Python/module/pexpect-4.6/pexpect/expect.py", line 119, in expect_loop return self.timeout(e) File "/Users/buildslave/jenkins/workspace/lldb-cmake/llvm-project/lldb/third_party/Python/module/pexpect-4.6/pexpect/expect.py", line 82, in timeout raise TIMEOUT(msg) pexpect.exceptions.TIMEOUT: Timeout exceeded. <pexpect.pty_spawn.spawn object at 0x10fa48d68> command: /Users/buildslave/jenkins/workspace/lldb-cmake/lldb-build/bin/lldb args: ['/Users/buildslave/jenkins/workspace/lldb-cmake/lldb-build/bin/lldb', '--no-lldbinit', '--no-use-colors', '-O', 'settings clear -all', '-O', 'settings set symbols.enable-external-lookup false', '-O', 'settings set target.inherit-tcc true', '-O', 'settings set target.auto-apply-fixits false', '-O', 'settings set plugin.process.gdb-remote.packet-timeout 60', '-O', 'settings set symbols.clang-modules-cache-path "/Users/buildslave/jenkins/workspace/lldb-cmake/lldb-build/lldb-test-build.noindex/module-cache-lldb/lldb-api"', '-O', 'settings set use-color false', '-O', 'setting set target.prefer-dynamic-value no-dynamic-values', '--file', '/Users/buildslave/jenkins/workspace/lldb-cmake/lldb-build/lldb-test-build.noindex/commands/gui/basicdebug/TestGuiBasicDebug.test_gui/a.out'] buffer (last 100 chars): b'07ffeefbff898\x1b[100;19Hstopped\x1b[100;41HThread: 0x736e9e Frame: 0 PC = 0x0000000100000f8d\x1b[m\x0f\x1b[H' before (last 100 chars): b'07ffeefbff898\x1b[100;19Hstopped\x1b[100;41HThread: 0x736e9e Frame: 0 PC = 0x0000000100000f8d\x1b[m\x0f\x1b[H' after: <class 'pexpect.exceptions.TIMEOUT'> match: None match_index: None exitstatus: None flag_eof: False pid: 86479 child_fd: 6 closed: False timeout: 30 delimiter: <class 'pexpect.exceptions.EOF'> logfile: <_io.BufferedWriter name='<stdout>'> logfile_read: None logfile_send: None maxread: 2000 ignorecase: False searchwindowsize: None delaybeforesend: 0.05 delayafterclose: 0.1 delayafterterminate: 0.1 searcher: searcher_re: 0: re.compile(b'func\\(\\); // Break here[^\r\n]+<<< Thread 1: step out') Config=x86_64-/Users/buildslave/jenkins/workspace/lldb-cmake/lldb-build/bin/clang ---------------------------------------------------------------------- Ran 1 test in 61.888s

Hide Details

RESULT: FAILED (0 passes, 0 failures, 1 errors, 0 skipped, 0 expected failures, 0 unexpected successes)

Hide Details

--

Hide Details

******************** PASS: lldb-unit :: Process/minidump/./LLDBMinidumpTests/MinidumpParserTest.GetFilteredModuleList (1340 of 2163) PASS: lldb-api :: commands/frame/recognizer/TestFrameRecognizer.py (1341 of 2163) PASS: lldb-api :: functionalities/unwind/zeroth_frame/TestZerothFrame.py (1342 of 2163) PASS: lldb-unit :: ObjectFile/Breakpad/./ObjectFileBreakpadTests/InfoRecord.parse (1343 of 2163) PASS: lldb-unit :: UnwindAssembly/x86/./UnwindAssemblyx86Tests/Testx86AssemblyInspectionEngine.Test64bitFramelessSmallStackFrame (1344 of 2163) PASS: lldb-unit :: Language/Highlighting/./HighlighterTests/HighlighterTest.ClangCursorPosAfterOtherToken (1345 of 2163) PASS: lldb-api :: lang/c/shared_lib_stripped_symbols/TestSharedLibStrippedSymbols.py (1346 of 2163) PASS: lldb-unit :: Utility/./UtilityTests/StreamTeeTest.GetStreamAtIndexOutOfBoundsEmpty (1347 of 2163) PASS: lldb-api :: commands/target/stop-hooks/TestStopHookScripted.py (1348 of 2163) UNSUPPORTED: lldb-api :: commands/register/register/intel_xtended_registers/TestMPXRegisters.py (1349 of 2163) PASS: lldb-api :: tools/lldb-server/register-reading/TestGdbRemoteGPacket.py (1350 of 2163) PASS: lldb-unit :: Process/minidump/./LLDBMinidumpTests/MinidumpParserTest.GetMiscInfoWindows (1351 of 2163) UNSUPPORTED: lldb-shell :: ScriptInterpreter/Lua/breakpoint_callback.test (1352 of 2163) PASS: lldb-api :: types/TestDoubleTypes.py (1353 of 2163) PASS: lldb-unit :: Utility/./UtilityTests/StringLexerTest.GetUnlexed (1354 of 2163) PASS: lldb-unit :: Utility/./UtilityTests/StringListTest.JoinMultiCharSeparator (1355 of 2163) PASS: lldb-unit :: Utility/./UtilityTests/VMRange.ContainsRange (1356 of 2163) PASS: lldb-unit :: UnwindAssembly/ARM64/./Arm64InstEmulationTests/TestArm64InstEmulation.TestCFARegisterTrackedAcrossJumps (1357 of 2163) PASS: lldb-api :: functionalities/asan/TestReportData.py (1358 of 2163) PASS: lldb-shell :: ScriptInterpreter/None/none.test (1359 of 2163) PASS: lldb-unit :: Utility/./UtilityTests/StreamTest.ShiftOperatorChars (1360 of 2163) PASS: lldb-api :: functionalities/thread/concurrent_events/TestConcurrentBreakpointDelayBreakpointOneSignal.py (1361 of 2163) PASS: lldb-api :: python_api/process/io/TestProcessIO.py (1362 of 2163) PASS: lldb-api :: python_api/lldbutil/process/TestPrintStackTraces.py (1363 of 2163) PASS: lldb-api :: functionalities/thread/concurrent_events/TestConcurrentTwoBreakpointsOneDelaySignal.py (1364 of 2163) PASS: lldb-api :: lang/objc/direct-dispatch-step/TestObjCDirectDispatchStepping.py (1365 of 2163) PASS: lldb-api :: functionalities/breakpoint/breakpoint_language/TestBreakpointLanguage.py (1366 of 2163) PASS: lldb-unit :: Utility/./UtilityTests/StreamTest.PutRawBytesToLittleEndian (1367 of 2163) PASS: lldb-api :: commands/expression/persistent_types/TestPersistentTypes.py (1368 of 2163) PASS: lldb-unit :: Host/./HostTests/FileSystemTest.MakeAbsolute (1369 of 2163) PASS: lldb-unit :: Utility/./UtilityTests/FileSpecTest.GuessPathStyle (1370 of 2163) PASS: lldb-shell :: ScriptInterpreter/Python/crashlog.test (1371 of 2163) PASS: lldb-unit :: Utility/./UtilityTests/RangeTest.Clear (1372 of 2163) PASS: lldb-api :: lang/cpp/limit-debug-info/TestWithLimitDebugInfo.py (1373 of 2163) PASS: lldb-api :: functionalities/data-formatter/refpointer-recursion/TestDataFormatterRefPtrRecursion.py (1374 of 2163) PASS: lldb-api :: api/listeners/TestListener.py (1375 of 2163) PASS: lldb-unit :: UnwindAssembly/x86/./UnwindAssemblyx86Tests/Testx86AssemblyInspectionEngine.TestPopRBP (1376 of 2163) PASS: lldb-unit :: Utility/./UtilityTests/BinaryStreamTest.PutULEB128Zero (1377 of 2163) UNSUPPORTED: lldb-api :: commands/register/register/intel_xtended_registers/mpx_bound_violation/TestBoundViolation.py (1378 of 2163) PASS: lldb-api :: api/log/TestAPILog.py (1379 of 2163) PASS: lldb-unit :: Utility/./UtilityTests/StringListTest.InsertStringAtIndexMove (1380 of 2163) PASS: lldb-api :: iohandler/completion/TestIOHandlerCompletion.py (1381 of 2163) PASS: lldb-shell :: SymbolFile/DWARF/clang-ast-from-dwarf-unamed-and-anon-structs.cpp (1382 of 2163) PASS: lldb-unit :: SymbolFile/NativePDB/./SymbolFileNativePDBTests/PDBFPOProgramToDWARFExpressionTests.SingleAssignmentRegisterRef (1383 of 2163) PASS: lldb-unit :: UnwindAssembly/x86/./UnwindAssemblyx86Tests/Testx86AssemblyInspectionEngine.TestPush0 (1384 of 2163) PASS: lldb-unit :: Utility/./UtilityTests/BinaryStreamTest.PutSLEB128NineBytes (1385 of 2163) PASS: lldb-shell :: Driver/TestProcessAttach.test (1386 of 2163) PASS: lldb-shell :: Breakpoint/ppc64-localentry.test (1387 of 2163) PASS: lldb-api :: functionalities/gdb_remote_client/TestNoGPacketSupported.py (1388 of 2163) PASS: lldb-unit :: UnwindAssembly/x86/./UnwindAssemblyx86Tests/Testx86AssemblyInspectionEngine.TestPopR13 (1389 of 2163) PASS: lldb-api :: functionalities/thread/ignore_suspended/TestIgnoreSuspendedThread.py (1390 of 2163) PASS: lldb-unit :: SymbolFile/NativePDB/./SymbolFileNativePDBTests/PDBFPOProgramToDWARFExpressionTests.MissingTargetRegister (1391 of 2163) PASS: lldb-unit :: Utility/./UtilityTests/FileSpecTest.FormatFileSpec (1392 of 2163) PASS: lldb-shell :: Commands/command-source.test (1393 of 2163) PASS: lldb-unit :: Utility/./UtilityTests/AnsiTerminal.AtEnd (1394 of 2163) PASS: lldb-unit :: DataFormatter/./LLDBFormatterTests/TypeMatcherTests.RegexMatchPart (1395 of 2163) PASS: lldb-unit :: Utility/./UtilityTests/LogChannelTest.Disable (1396 of 2163) UNSUPPORTED: lldb-api :: lang/c/typedef/Testtypedef.py (1397 of 2163) PASS: lldb-unit :: Utility/./UtilityTests/StreamTest.PutPtr (1398 of 2163) PASS: lldb-unit :: Utility/./UtilityTests/VMRange.SetEndAddress (1399 of 2163) PASS: lldb-unit :: Process/gdb-remote/./ProcessGdbRemoteTests/GDBRemoteClientBaseTest.InterruptNoResponse (1400 of 2163) PASS: lldb-api :: lang/objc/exceptions/TestObjCExceptions.py (1401 of 2163) PASS: lldb-unit :: Utility/./UtilityTests/StringExtractorTest.InitMisc (1402 of 2163) PASS: lldb-api :: lang/c/const_variables/TestConstVariables.py (1403 of 2163) PASS: lldb-unit :: Utility/./UtilityTests/DataExtractorTest.GetCStr (1404 of 2163) PASS: lldb-api :: lang/cpp/unique-types/TestUniqueTypes.py (1405 of 2163) PASS: lldb-shell :: SymbolFile/NativePDB/globals-bss.cpp (1406 of 2163) PASS: lldb-unit :: Utility/./UtilityTests/VMRange.Clear (1407 of 2163) PASS: lldb-unit :: Target/./TargetTests/ModuleCacheTest.GetAndPutUuidExists (1408 of 2163) UNSUPPORTED: lldb-api :: benchmarks/expression/TestRepeatedExprs.py (1409 of 2163) PASS: lldb-api :: functionalities/type_lookup/TestTypeLookup.py (1410 of 2163) PASS: lldb-api :: functionalities/thread/concurrent_events/TestConcurrentTwoWatchpointThreads.py (1411 of 2163) UNSUPPORTED: lldb-api :: functionalities/breakpoint/breakpoint_in_delayslot/TestAvoidBreakpointInDelaySlot.py (1412 of 2163) PASS: lldb-api :: functionalities/breakpoint/global_constructor/TestBreakpointInGlobalConstructor.py (1413 of 2163) PASS: lldb-api :: python_api/sbplatform/TestSBPlatform.py (1414 of 2163) PASS: lldb-unit :: Utility/./UtilityTests/StringExtractorTest.GetHexU8_Exact (1415 of 2163) PASS: lldb-api :: macosx/macCatalyst/TestMacCatalyst.py (1416 of 2163) PASS: lldb-unit :: Utility/./UtilityTests/StreamTest.SetIndentLevel (1417 of 2163) PASS: lldb-unit :: Utility/./UtilityTests/UriParserTest.Minimal (1418 of 2163) PASS: lldb-unit :: Target/./TargetTests/PathMappingListTest.RelativeTests (1419 of 2163) PASS: lldb-api :: functionalities/data-formatter/data-formatter-stl/libcxx/list/TestDataFormatterLibcxxList.py (1420 of 2163) PASS: lldb-unit :: Utility/./UtilityTests/AnsiTerminal.AtStart (1421 of 2163) PASS: lldb-unit :: Utility/./UtilityTests/StreamTeeTest.GetStreamAtIndexOutOfBounds (1422 of 2163) PASS: lldb-unit :: Core/./LLDBCoreTests/SourceFileCache.FindSourceFileFound (1423 of 2163) PASS: lldb-api :: functionalities/data-formatter/data-formatter-objc/nsindexpath/TestDataFormatterNSIndexPath.py (1424 of 2163) PASS: lldb-unit :: UnwindAssembly/PPC64/./PPC64InstEmulationTests/TestPPC64InstEmulation.TestMediumFunction (1425 of 2163) PASS: lldb-unit :: Utility/./UtilityTests/BinaryStreamTest.PutSLEB128One (1426 of 2163) PASS: lldb-api :: lang/objc/objc-stepping/TestObjCStepping.py (1427 of 2163) PASS: lldb-api :: commands/expression/inline-namespace/TestInlineNamespace.py (1428 of 2163) PASS: lldb-unit :: Symbol/./SymbolTests/TestTypeSystemClang.TestFunctionTemplateInRecordConstruction (1429 of 2163) PASS: lldb-unit :: Utility/./UtilityTests/UserIDResolver.GetGroupName (1430 of 2163) PASS: lldb-api :: commands/expression/context-object-objc/TestContextObjectObjc.py (1431 of 2163) PASS: lldb-unit :: Utility/./UtilityTests/VMRange.IsValid (1432 of 2163) PASS: lldb-unit :: Utility/./UtilityTests/PassiveReplayTest.InstrumentedBar (1433 of 2163) PASS: lldb-api :: lang/objc/objc-static-method/TestObjCStaticMethod.py (1434 of 2163) PASS: lldb-unit :: DataFormatter/./LLDBFormatterTests/TypeMatcherTests.GetMatchStringExactName (1435 of 2163) PASS: lldb-unit :: Utility/./UtilityTests/RangeVector.CombineConsecutiveRanges (1436 of 2163) PASS: lldb-api :: functionalities/thread/state_after_expression/TestStateAfterExpression.py (1437 of 2163) PASS: lldb-unit :: Utility/./UtilityTests/StreamTest.AddressRangeEmptyRange (1438 of 2163) PASS: lldb-api :: lang/objc/rdar-10967107/TestRdar10967107.py (1439 of 2163) PASS: lldb-api :: types/TestFloatTypesExpr.py (1440 of 2163) PASS: lldb-unit :: Utility/./UtilityTests/StreamTest.PutHex16ByteOrderLittle (1441 of 2163) UNSUPPORTED: lldb-shell :: ScriptInterpreter/Lua/convenience_variables.test (1442 of 2163) PASS: lldb-api :: commands/session/save/TestSessionSave.py (1443 of 2163) PASS: lldb-api :: tools/lldb-vscode/attach/TestVSCode_attach.py (1444 of 2163) PASS: lldb-unit :: UnwindAssembly/x86/./UnwindAssemblyx86Tests/Testx86AssemblyInspectionEngine.TestStackRealign8BitDisp_i386 (1445 of 2163) PASS: lldb-api :: commands/process/attach-resume/TestAttachResume.py (1446 of 2163) PASS: lldb-api :: commands/expression/import-std-module/shared_ptr-dbg-info-content/TestSharedPtrDbgInfoContentFromStdModule.py (1447 of 2163) PASS: lldb-unit :: Symbol/./SymbolTests/TestClangASTImporter.DeportDeclTagDecl (1448 of 2163) PASS: lldb-shell :: Commands/CommandScriptImmediateOutput/CommandScriptImmediateOutputFile.test (1449 of 2163) PASS: lldb-api :: lang/cpp/class_types/TestClassTypes.py (1450 of 2163) PASS: lldb-api :: commands/expression/entry-bp/TestExprEntryBP.py (1451 of 2163) PASS: lldb-unit :: Utility/./UtilityTests/ConstStringTest.UpdateMangledCounterpart (1452 of 2163) PASS: lldb-unit :: Utility/./UtilityTests/StreamTest.ShiftOperatorPtr (1453 of 2163) PASS: lldb-unit :: Utility/./UtilityTests/StringExtractorTest.GetHexBytesAvail (1454 of 2163) PASS: lldb-unit :: Utility/./UtilityTests/BinaryStreamTest.PutULEB128EightBytes (1455 of 2163) PASS: lldb-api :: functionalities/thread/concurrent_events/TestConcurrentDelayedCrashWithBreakpointSignal.py (1456 of 2163) PASS: lldb-api :: lang/cpp/operators/TestCppOperators.py (1457 of 2163) PASS: lldb-shell :: SymbolFile/DWARF/DW_OP_piece-struct.s (1458 of 2163) PASS: lldb-unit :: Utility/./UtilityTests/StringExtractorTest.GetHexBytes_OddPair (1459 of 2163) PASS: lldb-unit :: Core/./LLDBCoreTests/ModuleSpecTest.InvalidInMemoryBufferValidFile (1460 of 2163) PASS: lldb-api :: lang/objc/objc-foundation-dictionary-empty/TestNSDictionary0.py (1461 of 2163) PASS: lldb-api :: functionalities/breakpoint/breakpoint_ids/TestBreakpointIDs.py (1462 of 2163) PASS: lldb-shell :: SymbolFile/DWARF/gnu-style-compression.cpp (1463 of 2163) PASS: lldb-api :: functionalities/data-formatter/data-formatter-stl/libcxx/function/TestLibCxxFunction.py (1464 of 2163) PASS: lldb-unit :: ObjectFile/ELF/./ObjectFileELFTests/ObjectFileELFTest.GetSymtab_NoSymEntryPointArmAddressClass (1465 of 2163) PASS: lldb-api :: commands/frame/diagnose/complicated-expression/TestComplicatedExpression.py (1466 of 2163) PASS: lldb-shell :: Reproducer/TestDSYM.test (1467 of 2163) PASS: lldb-api :: functionalities/signal/raise/TestRaise.py (1468 of 2163) PASS: lldb-unit :: Process/minidump/./LLDBMinidumpTests/MinidumpParserTest.MinidumpModuleOrder (1469 of 2163) PASS: lldb-shell :: SymbolFile/DWARF/debug_ranges.s (1470 of 2163) PASS: lldb-shell :: Quit/TestQuitExitCodeHexA.test (1471 of 2163) UNSUPPORTED: lldb-shell :: SymbolFile/DWARF/DW_TAG_GNU_call_site-DW_AT_low_pc.s (1472 of 2163) PASS: lldb-shell :: Reproducer/TestHomeDir.test (1473 of 2163) PASS: lldb-shell :: Reproducer/TestVersionCheck.test (1474 of 2163) PASS: lldb-shell :: Reproducer/TestFileRepro.test (1475 of 2163) PASS: lldb-api :: lang/cpp/stl/TestSTL.py (1476 of 2163) PASS: lldb-unit :: Expression/./ExpressionTests/CppModuleConfigurationTest.Xcode (1477 of 2163) PASS: lldb-api :: commands/expression/regression-access-function-template-in-record/TestRegressionAccessFunctionTemplateInRecord.py (1478 of 2163) PASS: lldb-unit :: Utility/./UtilityTests/StringListTest.InsertStringAtIndexOutOfBounds (1479 of 2163) PASS: lldb-unit :: Utility/./UtilityTests/Flags.AllSet (1480 of 2163) UNSUPPORTED: lldb-shell :: Register/x86-64-ymm16-read.test (1481 of 2163) PASS: lldb-unit :: Target/./TargetTests/PathMappingListTest.AbsoluteTests (1482 of 2163) PASS: lldb-api :: lang/objc/hidden-ivars/TestHiddenIvars.py (1483 of 2163) PASS: lldb-shell :: ObjectFile/PECOFF/invalid-export-table.yaml (1484 of 2163) PASS: lldb-api :: lang/c/local_types/TestUseClosestType.py (1485 of 2163) PASS: lldb-api :: lang/c/blocks/TestBlocks.py (1486 of 2163) UNSUPPORTED: lldb-shell :: ObjectFile/ELF/minidebuginfo-no-lzma.yaml (1487 of 2163) PASS: lldb-unit :: Target/./TargetTests/ExecutionContextTest.GetByteOrder (1488 of 2163) PASS: lldb-unit :: debugserver/./debugserverTests/RNBSocket.LoopBackListenIPv6 (1489 of 2163) PASS: lldb-unit :: Utility/./UtilityTests/AnsiTerminal.Unknown (1490 of 2163) PASS: lldb-unit :: Utility/./UtilityTests/StringListTest.SetSize (1491 of 2163) PASS: lldb-unit :: Process/./ProcessEventDataTests/ProcessEventDataTest.ShouldStop (1492 of 2163) UNSUPPORTED: lldb-api :: tools/lldb-server/thread-name/TestGdbRemoteThreadName.py (1493 of 2163) PASS: lldb-shell :: SymbolFile/DWARF/DW_AT_low_pc-addrx.s (1494 of 2163) PASS: lldb-shell :: SymbolFile/DWARF/DW_TAG_basic_type_DW_ATE_UTF_nonC.ll (1495 of 2163) PASS: lldb-unit :: Utility/./UtilityTests/ArchSpecTest.MergeFrom (1496 of 2163) PASS: lldb-unit :: Process/minidump/./LLDBMinidumpTests/RegisterContextMinidump.ConvertMinidumpContext_x86_32 (1497 of 2163) PASS: lldb-api :: commands/expression/class_template_specialization_empty_pack/TestClassTemplateSpecializationParametersHandling.py (1498 of 2163) PASS: lldb-api :: lang/c/tls_globals/TestTlsGlobals.py (1499 of 2163) PASS: lldb-shell :: Settings/TestStopCommandSourceOnError.test (1500 of 2163) PASS: lldb-shell :: ObjectFile/Breakpad/sections-trailing-func.test (1501 of 2163) PASS: lldb-api :: lang/cpp/dynamic-value/TestDynamicValue.py (1502 of 2163) PASS: lldb-api :: functionalities/tail_call_frames/unambiguous_sequence/TestUnambiguousTailCalls.py (1503 of 2163) PASS: lldb-unit :: Expression/./ExpressionTests/CppModuleConfigurationTest.UnknownLibCppFile (1504 of 2163) PASS: lldb-unit :: Language/Highlighting/./HighlighterTests/HighlighterTest.ClangCursorOutOfBounds (1505 of 2163) PASS: lldb-shell :: Expr/TestMultilineExpr.test (1506 of 2163) PASS: lldb-unit :: UnwindAssembly/x86/./UnwindAssemblyx86Tests/Testx86AssemblyInspectionEngine.TestPopESI (1507 of 2163) PASS: lldb-unit :: Symbol/./SymbolTests/TestTypeSystemClang.TestIsClangType (1508 of 2163) PASS: lldb-unit :: Symbol/./SymbolTests/TestTypeSystemClang.TestDisplayNameEmpty (1509 of 2163) PASS: lldb-unit :: Symbol/./SymbolTests/DWARFCallFrameInfoTest.Basic_dwarf3 (1510 of 2163) PASS: lldb-shell :: ObjectFile/MachO/symtab.yaml (1511 of 2163) PASS: lldb-unit :: Utility/./UtilityTests/SerializationRountripTest.SerializeDeserializeObjectPointer (1512 of 2163) PASS: lldb-api :: commands/expression/save_jit_objects/TestSaveJITObjects.py (1513 of 2163) PASS: lldb-api :: lang/objc/orderedset/TestOrderedSet.py (1514 of 2163) PASS: lldb-shell :: Driver/TestRepl.test (1515 of 2163) UNSUPPORTED: lldb-shell :: Register/x86-ymm-read.test (1516 of 2163) PASS: lldb-unit :: Target/./TargetTests/StackFrameRecognizerTest.NullModuleRegex (1517 of 2163) PASS: lldb-unit :: Core/./LLDBCoreTests/StreamCallbackTest.Callback (1518 of 2163) PASS: lldb-unit :: Process/minidump/./LLDBMinidumpTests/MinidumpParserTest.MinidumpDuplicateModuleMappedSecond (1519 of 2163) PASS: lldb-api :: functionalities/data-formatter/ostypeformatting/TestFormattersOsType.py (1520 of 2163) PASS: lldb-api :: lang/objcxx/cxx-bridged-po/TestObjCXXBridgedPO.py (1521 of 2163) PASS: lldb-shell :: SymbolFile/DWARF/debug_loc-aslr.s (1522 of 2163) PASS: lldb-api :: lang/objc/ptr_refs/TestPtrRefsObjC.py (1523 of 2163) PASS: lldb-api :: iohandler/resize/TestIOHandlerResize.py (1524 of 2163) PASS: lldb-api :: functionalities/var_path/TestVarPath.py (1525 of 2163) PASS: lldb-api :: lang/cpp/frame-var-anon-unions/TestFrameVariableAnonymousUnions.py (1526 of 2163) PASS: lldb-api :: commands/target/dump-symtab-demangle/TestDumpSymtabDemangle.py (1527 of 2163) PASS: lldb-unit :: Utility/./UtilityTests/StringListTest.SplitIntoLines (1528 of 2163) PASS: lldb-unit :: Utility/./UtilityTests/BinaryStreamTest.PutSLEB128ThreeBytes (1529 of 2163) PASS: lldb-api :: functionalities/history/TestHistoryRecall.py (1530 of 2163) PASS: lldb-api :: functionalities/target_var/TestTargetVar.py (1531 of 2163) PASS: lldb-unit :: ScriptInterpreter/Python/./ScriptInterpreterPythonTests/PythonDataObjectsTest.TestPythonByteArray (1532 of 2163) PASS: lldb-unit :: Utility/./UtilityTests/StringListTest.GetMaxStringLengthDecreasingSize (1533 of 2163) PASS: lldb-api :: lang/cpp/member-and-local-vars-with-same-name/TestMembersAndLocalsWithSameName.py (1534 of 2163) PASS: lldb-unit :: Utility/./UtilityTests/RangeTest.Union (1535 of 2163) PASS: lldb-unit :: Core/./LLDBCoreTests/RichManglingContextTest.SwitchProvider (1536 of 2163) PASS: lldb-api :: macosx/find-dsym/bundle-with-dot-in-filename/TestBundleWithDotInFilename.py (1537 of 2163) PASS: lldb-api :: lang/cpp/namespace_definitions/TestNamespaceDefinitions.py (1538 of 2163) PASS: lldb-unit :: Process/minidump/./LLDBMinidumpTests/MinidumpParserTest.GetThreadsAndGetThreadContext (1539 of 2163) PASS: lldb-unit :: ScriptInterpreter/Python/./ScriptInterpreterPythonTests/PythonDataObjectsTest.TestPythonTupleValues (1540 of 2163) PASS: lldb-unit :: Utility/./UtilityTests/RangeTest.Constructor (1541 of 2163) PASS: lldb-api :: commands/expression/import-std-module/basic/TestImportStdModule.py (1542 of 2163) PASS: lldb-api :: lang/c/inlines/TestRedefinitionsInInlines.py (1543 of 2163) PASS: lldb-unit :: Host/./HostTests/SocketTests/SocketTest.UDPConnect/ipv6 (1544 of 2163) PASS: lldb-unit :: Expression/./ExpressionTests/DiagnosticManagerTest.GetStringSeverityLabels (1545 of 2163) PASS: lldb-unit :: Utility/./UtilityTests/OptionsWithRawTest.LeadingSpaceArgs (1546 of 2163) PASS: lldb-unit :: Language/Highlighting/./HighlighterTests/HighlighterTest.ClangScalarLiterals (1547 of 2163) PASS: lldb-unit :: Utility/./UtilityTests/BinaryStreamTest.PutSLEB128SixBytes (1548 of 2163) PASS: lldb-api :: tools/lldb-server/commandline/TestStubSetSID.py (1549 of 2163) PASS: lldb-unit :: Expression/./ExpressionTests/ClangExpressionDeclMapTest.TestPersistentDeclLookup (1550 of 2163) UNSUPPORTED: lldb-api :: linux/mix-dwo-and-regular-objects/TestMixedDwarfBinary.py (1551 of 2163) PASS: lldb-unit :: Utility/./UtilityTests/CompletionRequest.DuplicateFilteringWithComments (1552 of 2163) PASS: lldb-api :: tools/lldb-server/TestGdbRemoteRegisterState.py (1553 of 2163) PASS: lldb-unit :: Process/minidump/./LLDBMinidumpTests/MinidumpParserTest.GetMiscInfo_no_stream (1554 of 2163) PASS: lldb-unit :: Symbol/./SymbolTests/SymbolsTest.LocateExecutableSymbolFileForUnknownExecutableAndMissingSymbolFile (1555 of 2163) PASS: lldb-unit :: Language/Highlighting/./HighlighterTests/HighlighterTest.ClangTrailingBackslashBeforeNewline (1556 of 2163) PASS: lldb-shell :: Driver/TestTarget.test (1557 of 2163) PASS: lldb-api :: functionalities/tsan/thread_leak/TestTsanThreadLeak.py (1558 of 2163) PASS: lldb-api :: lang/objc/objc-super/TestObjCSuper.py (1559 of 2163) PASS: lldb-api :: lang/cpp/template-function/TestTemplateFunctions.py (1560 of 2163) PASS: lldb-unit :: ScriptInterpreter/Python/./ScriptInterpreterPythonTests/PythonDataObjectsTest.TestPythonListToStructuredList (1561 of 2163) PASS: lldb-api :: commands/expression/call-function/TestCallStdStringFunction.py (1562 of 2163) PASS: lldb-unit :: Utility/./UtilityTests/StringExtractorTest.GetHexBytes_OddPair2 (1563 of 2163) PASS: lldb-api :: macosx/find-app-in-bundle/TestFindAppInBundle.py (1564 of 2163) PASS: lldb-unit :: Utility/./UtilityTests/TildeExpressionResolver.ResolveFullPath (1565 of 2163) PASS: lldb-unit :: Utility/./UtilityTests/StringExtractorTest.GetU32BigEndian (1566 of 2163) PASS: lldb-shell :: Expr/TestIRMemoryMap.test (1567 of 2163) PASS: lldb-unit :: Utility/./UtilityTests/StringListTest.Assignment (1568 of 2163) PASS: lldb-unit :: Utility/./UtilityTests/RecordReplayTest.InstrumentedBarPtr (1569 of 2163) PASS: lldb-api :: functionalities/data-formatter/data-formatter-categories/TestDataFormatterCategories.py (1570 of 2163) PASS: lldb-unit :: Symbol/./SymbolTests/PostfixExpression.ParseFPOProgram (1571 of 2163) PASS: lldb-unit :: UnwindAssembly/ARM64/./Arm64InstEmulationTests/TestArm64InstEmulation.TestSimpleDarwinFunction (1572 of 2163) PASS: lldb-api :: commands/target/create-deps/TestTargetCreateDeps.py (1573 of 2163) PASS: lldb-unit :: Process/minidump/./LLDBMinidumpTests/MinidumpParserTest.GetThreadContext_x86_32_wow64 (1574 of 2163) PASS: lldb-unit :: ObjectFile/ELF/./ObjectFileELFTests/ObjectFileELFTest.GetModuleSpecifications_EarlySectionHeaders (1575 of 2163) PASS: lldb-unit :: Utility/./UtilityTests/StringExtractorTest.GetHexBytesAvail_Partial (1576 of 2163) PASS: lldb-api :: functionalities/target-new-solib-notifications/TestModuleLoadedNotifys.py (1577 of 2163) PASS: lldb-unit :: Utility/./UtilityTests/StreamTest.AddressPrefix (1578 of 2163) PASS: lldb-unit :: Utility/./UtilityTests/StringListTest.Clear (1579 of 2163) PASS: lldb-api :: functionalities/thread/concurrent_events/TestConcurrentDelayedCrashWithBreakpointWatchpoint.py (1580 of 2163) PASS: lldb-unit :: Utility/./UtilityTests/StringListTest.LongestCommonPrefixEmpty (1581 of 2163) PASS: lldb-unit :: Symbol/./SymbolTests/LineEntryTest.GetSameLineContiguousAddressRangeOneInline (1582 of 2163) PASS: lldb-shell :: ScriptInterpreter/Python/scripted_breakpoint.test (1583 of 2163) PASS: lldb-unit :: ObjectFile/Breakpad/./ObjectFileBreakpadTests/FileRecord.parse (1584 of 2163) PASS: lldb-api :: commands/breakpoint/set/func-regex/TestBreakpointRegexError.py (1585 of 2163) PASS: lldb-api :: lang/cpp/lambdas/TestLambdas.py (1586 of 2163) PASS: lldb-unit :: Utility/./UtilityTests/Predicate.WaitForValueNotEqualTo (1587 of 2163) PASS: lldb-api :: functionalities/breakpoint/scripted_bkpt/TestScriptedResolver.py (1588 of 2163) PASS: lldb-api :: python_api/debugger/TestDebuggerAPI.py (1589 of 2163) PASS: lldb-unit :: Expression/./ExpressionTests/DiagnosticManagerTest.GetStringMultipleDiags (1590 of 2163) PASS: lldb-unit :: Host/./HostTests/SocketTests/SocketTest.TCPGetConnectURI/ipv6 (1591 of 2163) PASS: lldb-api :: types/TestLongTypes.py (1592 of 2163) PASS: lldb-api :: macosx/save_crashlog/TestSaveCrashlog.py (1593 of 2163) PASS: lldb-unit :: Utility/./UtilityTests/OptionsWithRawTest.TerminatedQuote (1594 of 2163) PASS: lldb-api :: python_api/module_section/TestModuleAndSection.py (1595 of 2163) PASS: lldb-api :: types/TestCharType.py (1596 of 2163) PASS: lldb-api :: macosx/safe-to-func-call/TestSafeFuncCalls.py (1597 of 2163) PASS: lldb-api :: lang/objc/objc-optimized/TestObjcOptimized.py (1598 of 2163) UNSUPPORTED: lldb-shell :: BuildScript/toolchain-clang-cl.test (1599 of 2163) PASS: lldb-unit :: ScriptInterpreter/Python/./ScriptInterpreterPythonTests/PythonDataObjectsTest.TestInstanceNameResolutionNoDot (1600 of 2163) PASS: lldb-unit :: Utility/./UtilityTests/ProcessInstanceInfo.DumpTable (1601 of 2163) PASS: lldb-api :: functionalities/lazy-loading/TestLazyLoading.py (1602 of 2163) PASS: lldb-api :: macosx/thread_suspend/TestInternalThreadSuspension.py (1603 of 2163) PASS: lldb-api :: functionalities/inferior-crashing/recursive-inferior/TestRecursiveInferior.py (1604 of 2163) PASS: lldb-shell :: Commands/command-disassemble-process.yaml (1605 of 2163) PASS: lldb-shell :: ObjectFile/Breakpad/uuid-matching-mac.test (1606 of 2163) PASS: lldb-unit :: ScriptInterpreter/Python/./ScriptInterpreterPythonTests/PythonDataObjectsTest.TestPythonInteger (1607 of 2163) PASS: lldb-unit :: Utility/./UtilityTests/StringExtractorTest.GetHexBytesAvail_OddPair2 (1608 of 2163) PASS: lldb-unit :: Symbol/./SymbolTests/SymbolsTest.TerminateLocateExecutableSymbolFileForUnknownExecutableAndUnknownSymbolFile (1609 of 2163) PASS: lldb-unit :: ScriptInterpreter/Python/./ScriptInterpreterPythonTests/PythonDataObjectsTest.TestScript (1610 of 2163) PASS: lldb-unit :: ObjectFile/Breakpad/./ObjectFileBreakpadTests/StackCFIRecord.parse (1611 of 2163) PASS: lldb-unit :: Signals/./SignalsTests/UnixSignalsTest.VersionChange (1612 of 2163) PASS: lldb-api :: sanity/TestModuleCacheSanity.py (1613 of 2163) PASS: lldb-shell :: Process/UnsupportedLanguage.test (1614 of 2163) PASS: lldb-shell :: SymbolFile/DWARF/inline-function-address.ll (1615 of 2163) PASS: lldb-api :: commands/expression/import-std-module/conflicts/TestStdModuleWithConflicts.py (1616 of 2163) PASS: lldb-unit :: UnwindAssembly/x86/./UnwindAssemblyx86Tests/Testx86AssemblyInspectionEngine.TestPushR12 (1617 of 2163) PASS: lldb-api :: tools/lldb-vscode/stackTrace/TestVSCode_stackTrace.py (1618 of 2163) PASS: lldb-unit :: Utility/./UtilityTests/BinaryStreamTest.PutSLEB128Zero (1619 of 2163) PASS: lldb-api :: python_api/process/TestProcessAPI.py (1620 of 2163) PASS: lldb-api :: source-manager/TestSourceManager.py (1621 of 2163) PASS: lldb-unit :: ObjectFile/PECOFF/./ObjectFilePECOFFTests/PECallFrameInfoTest.Basic_eh (1622 of 2163) PASS: lldb-unit :: SymbolFile/NativePDB/./SymbolFileNativePDBTests/PDBFPOProgramToDWARFExpressionTests.InvalidAssignmentSingle (1623 of 2163) PASS: lldb-unit :: Expression/./ExpressionTests/DWARFExpression.DW_OP_piece (1624 of 2163) PASS: lldb-api :: lang/objc/print-obj/TestPrintObj.py (1625 of 2163) UNSUPPORTED: lldb-shell :: BuildScript/toolchain-msvc.test (1626 of 2163) PASS: lldb-api :: commands/process/launch/TestProcessLaunch.py (1627 of 2163) PASS: lldb-api :: macosx/simulator/TestSimulatorPlatform.py (1628 of 2163) PASS: lldb-unit :: Process/gdb-remote/./ProcessGdbRemoteTests/GDBRemoteClientBaseTest.SendContinueDelegateStructuredDataReceipt (1629 of 2163) PASS: lldb-api :: functionalities/data-formatter/hexcaps/TestDataFormatterHexCaps.py (1630 of 2163) PASS: lldb-unit :: Utility/./UtilityTests/DataExtractorTest.GetCStrEmpty (1631 of 2163) PASS: lldb-unit :: Utility/./UtilityTests/OptionsWithRawTest.UnterminatedQuote (1632 of 2163) PASS: lldb-api :: functionalities/asan/TestMemoryHistory.py (1633 of 2163) PASS: lldb-api :: functionalities/data-formatter/data-formatter-stl/libcxx/initializerlist/TestInitializerList.py (1634 of 2163) PASS: lldb-shell :: BuildScript/script-args.test (1635 of 2163) PASS: lldb-unit :: DataFormatter/./LLDBFormatterTests/FormatManagerTests.CompatibleLangs (1636 of 2163) PASS: lldb-api :: commands/expression/fixits/TestFixIts.py (1637 of 2163) PASS: lldb-shell :: Reproducer/Functionalities/TestStepping.test (1638 of 2163) PASS: lldb-unit :: Symbol/./SymbolTests/TestTypeSystemClang.TestOwningModule (1639 of 2163) PASS: lldb-api :: terminal/TestEditline.py (1640 of 2163) PASS: lldb-unit :: Utility/./UtilityTests/LogChannelTest.Enable (1641 of 2163) PASS: lldb-api :: macosx/lc-note/kern-ver-str/TestKernVerStrLCNOTE.py (1642 of 2163) UNSUPPORTED: lldb-shell :: SymbolFile/target-symbols-add-unwind.test (1643 of 2163) PASS: lldb-api :: terminal/TestSTTYBeforeAndAfter.py (1644 of 2163) PASS: lldb-api :: functionalities/thread/concurrent_events/TestConcurrentManyWatchpoints.py (1645 of 2163) PASS: lldb-api :: functionalities/data-formatter/data-formatter-advanced/TestDataFormatterAdv.py (1646 of 2163) PASS: lldb-unit :: Utility/./UtilityTests/RangeTest.ContainsAddr (1647 of 2163) UNSUPPORTED: lldb-api :: functionalities/thread/thread_specific_break_plus_condition/TestThreadSpecificBpPlusCondition.py (1648 of 2163) PASS: lldb-unit :: Utility/./UtilityTests/PassiveReplayTest.InstrumentedBarPtr (1649 of 2163) PASS: lldb-api :: commands/expression/pr35310/TestExprsBug35310.py (1650 of 2163) UNSUPPORTED: lldb-shell :: ScriptInterpreter/Lua/command_script_import.test (1651 of 2163) PASS: lldb-unit :: Process/gdb-remote/./ProcessGdbRemoteTests/GDBRemoteCommunicationClientTest.WriteRegisterNoSuffix (1652 of 2163) PASS: lldb-unit :: ObjectFile/Breakpad/./ObjectFileBreakpadTests/FuncRecord.parse (1653 of 2163) PASS: lldb-unit :: Utility/./UtilityTests/StringExtractorTest.GetHexU8_Extra_NoEof (1654 of 2163) PASS: lldb-api :: functionalities/thread/concurrent_events/TestConcurrentTwoBreakpointsOneSignal.py (1655 of 2163) PASS: lldb-shell :: SymbolFile/DWARF/inline-function-address-shared.test (1656 of 2163) PASS: lldb-api :: lang/cpp/nsimport/TestCppNsImport.py (1657 of 2163) UNSUPPORTED: lldb-shell :: SymbolFile/PDB/func-symbols.test (1658 of 2163) PASS: lldb-api :: lang/cpp/std-function-step-into-callable/TestStdFunctionStepIntoCallable.py (1659 of 2163) PASS: lldb-unit :: Host/./HostTests/SocketTests/SocketTest.DecodeHostAndPort/ipv6 (1660 of 2163) PASS: lldb-api :: python_api/lldbutil/TestSwigVersion.py (1661 of 2163) PASS: lldb-shell :: Reproducer/TestReuseDirectory.test (1662 of 2163) PASS: lldb-shell :: ObjectFile/ELF/PT_LOAD-overlap-section.yaml (1663 of 2163) PASS: lldb-unit :: Utility/./UtilityTests/StringListTest.PopBack (1664 of 2163) PASS: lldb-unit :: Expression/./ExpressionTests/DiagnosticManagerTest.GetStringNoDiags (1665 of 2163) PASS: lldb-unit :: ScriptInterpreter/Python/./ScriptInterpreterPythonTests/PythonDataObjectsTest.TestPythonTupleInitializerList2 (1666 of 2163) PASS: lldb-api :: commands/frame/language/TestGuessLanguage.py (1667 of 2163) PASS: lldb-unit :: Expression/./ExpressionTests/CppModuleConfigurationTest.AmbiguousLibCpp (1668 of 2163) PASS: lldb-api :: lang/cpp/wchar_t/TestCxxWCharT.py (1669 of 2163) PASS: lldb-unit :: Core/./LLDBCoreTests/CommunicationTest.SynchronizeWhileClosing (1670 of 2163) PASS: lldb-api :: commands/expression/anonymous-struct/TestCallUserAnonTypedef.py (1671 of 2163) PASS: lldb-api :: functionalities/tsan/global_location/TestTsanGlobalLocation.py (1672 of 2163) PASS: lldb-api :: commands/watchpoints/watchpoint_on_vectors/TestValueOfVectorVariable.py (1673 of 2163) PASS: lldb-unit :: UnwindAssembly/ARM64/./Arm64InstEmulationTests/TestArm64InstEmulation.TestRegisterDoubleSpills (1674 of 2163) PASS: lldb-shell :: Breakpoint/jitbp_elf.test (1675 of 2163) PASS: lldb-api :: functionalities/thread/create_after_attach/TestCreateAfterAttach.py (1676 of 2163) PASS: lldb-shell :: Breakpoint/case-sensitive.test (1677 of 2163) PASS: lldb-api :: commands/expression/multiline-navigation/TestMultilineNavigation.py (1678 of 2163) PASS: lldb-unit :: Expression/./ExpressionTests/DiagnosticManagerTest.GetStringBasic (1679 of 2163) PASS: lldb-unit :: ScriptInterpreter/Python/./ScriptInterpreterPythonTests/PythonDataObjectsTest.TestTypeNameResolutionNoDot (1680 of 2163) UNSUPPORTED: lldb-shell :: Register/arm-gp-read.test (1681 of 2163) PASS: lldb-api :: functionalities/unwind/noreturn/TestNoreturnUnwind.py (1682 of 2163) PASS: lldb-api :: commands/expression/import_base_class_when_class_has_derived_member/TestImportBaseClassWhenClassHasDerivedMember.py (1683 of 2163) PASS: lldb-api :: functionalities/thread/concurrent_events/TestConcurrentWatchpointDelayWatchpointOneBreakpoint.py (1684 of 2163) PASS: lldb-unit :: Utility/./UtilityTests/FileSpecTest.Match (1685 of 2163) PASS: lldb-shell :: Driver/TestCore.test (1686 of 2163) PASS: lldb-unit :: UnwindAssembly/x86/./UnwindAssemblyx86Tests/Testx86AssemblyInspectionEngine.TestPushEAX (1687 of 2163) PASS: lldb-unit :: Utility/./UtilityTests/UUIDTest.Validity (1688 of 2163) UNSUPPORTED: lldb-api :: lang/cpp/function-template-parameter-pack/TestFunctionTemplateParameterPack.py (1689 of 2163) PASS: lldb-unit :: Process/gdb-remote/./ProcessGdbRemoteTests/GDBRemoteCommunicationClientTest.ReadRegister (1690 of 2163) PASS: lldb-unit :: Utility/./UtilityTests/ArgsTest.GetArgumentArrayRef (1691 of 2163) PASS: lldb-api :: functionalities/data-formatter/data-formatter-skip-summary/TestDataFormatterSkipSummary.py (1692 of 2163) PASS: lldb-shell :: ObjectFile/PECOFF/sections-names.yaml (1693 of 2163) PASS: lldb-api :: functionalities/tail_call_frames/disambiguate_paths_to_common_sink/TestDisambiguatePathsToCommonSink.py (1694 of 2163) PASS: lldb-unit :: Expression/./ExpressionTests/DiagnosticManagerTest.AppendMessageSubsequentDiags (1695 of 2163) PASS: lldb-api :: commands/help/TestHelp.py (1696 of 2163) PASS: lldb-api :: sanity/TestSettingSkipping.py (1697 of 2163) PASS: lldb-api :: functionalities/memory-region/TestMemoryRegion.py (1698 of 2163) UNSUPPORTED: lldb-shell :: Expr/TestIRMemoryMapWindows.test (1699 of 2163) PASS: lldb-unit :: Process/gdb-remote/./ProcessGdbRemoteTests/GDBRemoteCommunicationClientTest.GetModulesInfo (1700 of 2163) PASS: lldb-unit :: ScriptInterpreter/Python/./ScriptInterpreterPythonTests/PythonDataObjectsTest.TestPythonTupleSize (1701 of 2163) PASS: lldb-unit :: DataFormatter/./LLDBFormatterTests/TypeMatcherTests.GetMatchStringRegex (1702 of 2163) PASS: lldb-shell :: SymbolFile/DWARF/win-i386-line-table.s (1703 of 2163) PASS: lldb-unit :: Utility/./UtilityTests/FileSpecTest.EqualDotsPosix (1704 of 2163) PASS: lldb-unit :: Process/minidump/./LLDBMinidumpTests/MinidumpParserTest.GetMemoryRegionInfoFromMemory64List (1705 of 2163) PASS: lldb-shell :: ObjectFile/ELF/section-types-edgecases.yaml (1706 of 2163) PASS: lldb-api :: commands/expression/context-object/TestContextObject.py (1707 of 2163) PASS: lldb-unit :: Symbol/./SymbolTests/TestClangASTImporter.CopyTypeTagDecl (1708 of 2163) UNSUPPORTED: lldb-shell :: ScriptInterpreter/Lua/watchpoint_callback.test (1709 of 2163) PASS: lldb-api :: functionalities/data-formatter/data-formatter-script/TestDataFormatterScript.py (1710 of 2163) PASS: lldb-unit :: Utility/./UtilityTests/ArgsTest.ReplaceArgumentAtIndexEqual (1711 of 2163) XFAIL: lldb-shell :: SymbolFile/DWARF/find-type-in-function.cpp (1712 of 2163) PASS: lldb-api :: lang/objc/modules-non-objc-target/TestObjCModulesNonObjCTarget.py (1713 of 2163) PASS: lldb-shell :: Commands/command-breakpoint-col.test (1714 of 2163) PASS: lldb-api :: functionalities/data-formatter/synthupdate/TestSyntheticFilterRecompute.py (1715 of 2163) PASS: lldb-shell :: Breakpoint/debug_addrx.test (1716 of 2163) PASS: lldb-unit :: Host/./HostTests/NativeProcessProtocolTest.ReadMemoryWithoutTrap (1717 of 2163) PASS: lldb-api :: functionalities/data-formatter/data-formatter-stl/libcxx/vbool/TestDataFormatterLibcxxVBool.py (1718 of 2163) PASS: lldb-api :: lang/objc/objc-property/TestObjCProperty.py (1719 of 2163) PASS: lldb-api :: functionalities/data-formatter/dump_dynamic/TestDumpDynamic.py (1720 of 2163) UNSUPPORTED: lldb-api :: functionalities/darwin_log/filter/exact_match/category/TestDarwinLogFilterMatchCategory.py (1721 of 2163) PASS: lldb-api :: functionalities/dead-strip/TestDeadStrip.py (1722 of 2163) PASS: lldb-unit :: Utility/./UtilityTests/XcodeSDKTest.SDKSupportsSwift (1723 of 2163) PASS: lldb-unit :: Utility/./UtilityTests/StreamTest.AddressPrefixAndSuffix (1724 of 2163) PASS: lldb-unit :: Utility/./UtilityTests/ScalarTest.Promotion (1725 of 2163) PASS: lldb-unit :: Language/Highlighting/./HighlighterTests/HighlighterTest.ClangIdentifiers (1726 of 2163) PASS: lldb-unit :: UnwindAssembly/x86/./UnwindAssemblyx86Tests/Testx86AssemblyInspectionEngine.TestSimple64bitFrameFunction (1727 of 2163) PASS: lldb-unit :: API/./APITests/SBCommandInterpreterTest.SingleWordCommand (1728 of 2163) PASS: lldb-api :: lang/objcxx/objcxx-ivar-vector/TestIvarVector.py (1729 of 2163) PASS: lldb-api :: functionalities/jitloader_gdb/TestJITLoaderGDB.py (1730 of 2163) UNSUPPORTED: lldb-shell :: SymbolFile/PDB/udt-layout.test (1731 of 2163) PASS: lldb-api :: functionalities/data-formatter/nsarraysynth/TestNSArraySynthetic.py (1732 of 2163) PASS: lldb-api :: functionalities/thread/concurrent_events/TestConcurrentSignalWatch.py (1733 of 2163) PASS: lldb-unit :: ScriptInterpreter/Python/./ScriptInterpreterPythonTests/PythonDataObjectsTest.TestPythonStringToStr (1734 of 2163) PASS: lldb-api :: python_api/value/linked_list/TestValueAPILinkedList.py (1735 of 2163) PASS: lldb-unit :: Process/gdb-remote/./ProcessGdbRemoteTests/GDBRemoteCommunicationClientTest.GetQOffsets (1736 of 2163) PASS: lldb-unit :: Utility/./UtilityTests/DataExtractorTest.GetCStrAtEnd (1737 of 2163) PASS: lldb-unit :: Utility/./UtilityTests/BinaryStreamTest.PutSLEB128OneByte (1738 of 2163) PASS: lldb-api :: lang/objc/rdar-11355592/TestRdar11355592.py (1739 of 2163) PASS: lldb-api :: commands/expression/function_template_specialization_temp_args/TestFunctionTemplateSpecializationTempArgs.py (1740 of 2163) PASS: lldb-unit :: Language/Highlighting/./HighlighterTests/HighlighterTest.DefaultHighlighterWithCursor (1741 of 2163) PASS: lldb-unit :: Process/gdb-remote/./ProcessGdbRemoteTests/GDBRemoteCommunicationServerTest.SendErrorResponse_UnimplementedError (1742 of 2163) PASS: lldb-unit :: UnwindAssembly/x86/./UnwindAssemblyx86Tests/Testx86AssemblyInspectionEngine.TestStackRealign32BitDisp_x86_64 (1743 of 2163) PASS: lldb-api :: commands/expression/completion-crash-incomplete-record/TestCompletionCrashIncompleteRecord.py (1744 of 2163) PASS: lldb-unit :: ScriptInterpreter/Python/./ScriptInterpreterPythonTests/PythonDataObjectsTest.TestPythonDictionaryValueEquality (1745 of 2163) PASS: lldb-unit :: Utility/./UtilityTests/IndexToObjectTest.ObjectForIndex (1746 of 2163) PASS: lldb-api :: functionalities/thread/step_until/TestStepUntil.py (1747 of 2163) PASS: lldb-unit :: Utility/./UtilityTests/StringExtractorTest.DecodeHexU8_Underflow (1748 of 2163) UNSUPPORTED: lldb-shell :: ScriptInterpreter/Lua/lua.test (1749 of 2163) PASS: lldb-api :: functionalities/breakpoint/cpp_exception/TestCPPExceptionBreakpoint.py (1750 of 2163) PASS: lldb-unit :: Target/./TargetTests/ExecutionContextTest.GetByteOrderTarget (1751 of 2163) PASS: lldb-api :: functionalities/thread/exit_during_break/TestExitDuringBreak.py (1752 of 2163) PASS: lldb-unit :: Symbol/./SymbolTests/TestTypeSystemClang.TestUnifyAccessSpecifiers (1753 of 2163) UNSUPPORTED: lldb-shell :: Unwind/unwind-plan-dwarf-dump.test (1754 of 2163) PASS: lldb-unit :: SymbolFile/NativePDB/./SymbolFileNativePDBTests/PDBFPOProgramToDWARFExpressionTests.UnsupportedRASearch (1755 of 2163) PASS: lldb-unit :: Utility/./UtilityTests/RecordReplayTest.InstrumentedBarRef (1756 of 2163) PASS: lldb-api :: python_api/formatters/TestFormattersSBAPI.py (1757 of 2163) PASS: lldb-api :: lang/objc/foundation/TestObjectDescriptionAPI.py (1758 of 2163) PASS: lldb-api :: lang/c/bitfields/TestBitfields.py (1759 of 2163) PASS: lldb-api :: functionalities/thread/concurrent_events/TestConcurrentSignalDelayWatch.py (1760 of 2163) XFAIL: lldb-shell :: Register/x86-mm-xmm-write.test (1761 of 2163) PASS: lldb-unit :: Expression/./ExpressionTests/DiagnosticManagerTest.AppendMessageNoDiag (1762 of 2163) PASS: lldb-shell :: Commands/command-script-import.test (1763 of 2163) PASS: lldb-api :: commands/expression/call-throws/TestCallThatThrows.py (1764 of 2163) PASS: lldb-api :: tools/lldb-vscode/breakpoint-events/TestVSCode_breakpointEvents.py (1765 of 2163) PASS: lldb-unit :: SymbolFile/DWARF/./SymbolFileDWARFTests/SymbolFileDWARFTests.TestAbbrevOrder1Start1 (1766 of 2163) PASS: lldb-unit :: Utility/./UtilityTests/StringExtractorTest.GetHexBytesAvail_OddPair (1767 of 2163) PASS: lldb-unit :: Disassembler/./DisassemblerTests/TestArm64Disassembly.TestArmv81Instruction (1768 of 2163) PASS: lldb-api :: python_api/thread/TestThreadAPI.py (1769 of 2163) PASS: lldb-unit :: UnwindAssembly/x86/./UnwindAssemblyx86Tests/Testx86AssemblyInspectionEngine.TestPushRBP (1770 of 2163) PASS: lldb-shell :: ObjectFile/PECOFF/basic-info-arm.yaml (1771 of 2163) PASS: lldb-api :: commands/gui/breakpoints/TestGuiBreakpoints.py (1772 of 2163) PASS: lldb-api :: commands/register/register/register_command/TestRegisters.py (1773 of 2163) UNSUPPORTED: lldb-api :: functionalities/longjmp/TestLongjmp.py (1774 of 2163) PASS: lldb-api :: lang/cpp/char1632_t/TestChar1632T.py (1775 of 2163) PASS: lldb-unit :: Utility/./UtilityTests/LogTest.Register (1776 of 2163) PASS: lldb-unit :: UnwindAssembly/x86/./UnwindAssemblyx86Tests/Testx86AssemblyInspectionEngine.Test32bitFramelessSmallStackFrame (1777 of 2163) PASS: lldb-api :: functionalities/tail_call_frames/cross_object/TestCrossObjectTailCalls.py (1778 of 2163) UNSUPPORTED: lldb-api :: linux/thread/create_during_instruction_step/TestCreateDuringInstructionStep.py (1779 of 2163) PASS: lldb-api :: functionalities/data-formatter/typedef_array/TestTypedefArray.py (1780 of 2163) PASS: lldb-shell :: SymbolFile/DWARF/find-basic-namespace.cpp (1781 of 2163) UNSUPPORTED: lldb-api :: functionalities/darwin_log/source/debug/TestDarwinLogSourceDebug.py (1782 of 2163) PASS: lldb-api :: python_api/findvalue_duplist/TestSBFrameFindValue.py (1783 of 2163) PASS: lldb-api :: python_api/exprpath_synthetic/TestExprPathSynthetic.py (1784 of 2163) PASS: lldb-api :: functionalities/tsan/basic/TestTsanBasic.py (1785 of 2163) PASS: lldb-api :: functionalities/data-formatter/synthcapping/TestSyntheticCapping.py (1786 of 2163) PASS: lldb-api :: commands/expression/expr-in-syscall/TestExpressionInSyscall.py (1787 of 2163) PASS: lldb-api :: python_api/target/TestTargetAPI.py (1788 of 2163) PASS: lldb-api :: linux/builtin_trap/TestBuiltinTrap.py (1789 of 2163) PASS: lldb-unit :: Utility/./UtilityTests/UUIDTest.SetFromStringRef (1790 of 2163) PASS: lldb-unit :: Utility/./UtilityTests/StatusTest.Formatv (1791 of 2163) PASS: lldb-unit :: Utility/./UtilityTests/StringExtractorTest.GetU64BigEndian (1792 of 2163) PASS: lldb-shell :: VSCode/TestOptions.test (1793 of 2163) PASS: lldb-api :: lang/c/conflicting-symbol/TestConflictingSymbol.py (1794 of 2163) UNSUPPORTED: lldb-api :: functionalities/darwin_log/filter/regex/subsystem/TestDarwinLogFilterRegexSubsystem.py (1795 of 2163) PASS: lldb-unit :: Utility/./UtilityTests/ArgsTest.TestTrailingBackslash (1796 of 2163) PASS: lldb-unit :: Language/Highlighting/./HighlighterTests/HighlighterTest.HighlighterSelectionType (1797 of 2163) PASS: lldb-api :: functionalities/return-value/TestReturnValue.py (1798 of 2163) PASS: lldb-shell :: Minidump/Windows/arm-fp-unwind.test (1799 of 2163) PASS: lldb-unit :: Utility/./UtilityTests/OptionsWithRawTest.EmptySuffix (1800 of 2163) PASS: lldb-unit :: Process/gdb-remote/./ProcessGdbRemoteTests/GDBRemoteClientBaseTest.SendContinueDelegateInterface (1801 of 2163) PASS: lldb-unit :: Utility/./UtilityTests/ArgsTest.EscapeLLDBCommandArgument (1802 of 2163) PASS: lldb-unit :: Utility/./UtilityTests/NameMatchesTest.StartsWith (1803 of 2163) PASS: lldb-unit :: Utility/./UtilityTests/RangeTest.DoesAdjoinOrIntersect (1804 of 2163) PASS: lldb-api :: lang/objc/global_ptrs/TestGlobalObjects.py (1805 of 2163) PASS: lldb-unit :: Interpreter/./InterpreterTests/OptionArgParserTest.toBoolean (1806 of 2163) PASS: lldb-api :: functionalities/data-formatter/data-formatter-stl/libcxx/bitset/TestDataFormatterLibcxxBitset.py (1807 of 2163) PASS: lldb-unit :: Core/./LLDBCoreTests/ModuleSpecTest.TestELFFile (1808 of 2163) PASS: lldb-shell :: SymbolFile/DWARF/apple-index-is-used.cpp (1809 of 2163) PASS: lldb-api :: functionalities/data-formatter/data-formatter-disabling/TestDataFormatterDisabling.py (1810 of 2163) PASS: lldb-api :: lang/objc/objc-runtime-ivars/TestRuntimeIvars.py (1811 of 2163) PASS: lldb-shell :: Breakpoint/implicit_const_form_support.test (1812 of 2163) PASS: lldb-api :: lang/cpp/type_lookup/TestCppTypeLookup.py (1813 of 2163) PASS: lldb-unit :: Utility/./UtilityTests/ConstStringTest.CompareConstString (1814 of 2163) UNSUPPORTED: lldb-shell :: SymbolFile/PDB/enums-layout.test (1815 of 2163) PASS: lldb-unit :: Process/minidump/./LLDBMinidumpTests/RegisterContextMinidump.ConvertMinidumpContext_x86_64 (1816 of 2163) PASS: lldb-api :: commands/expression/rdar44436068/Test128BitsInteger.py (1817 of 2163) PASS: lldb-api :: lang/objc/modules-hash-mismatch/TestClangModulesHashMismatch.py (1818 of 2163) PASS: lldb-api :: functionalities/breakpoint/step_over_breakpoint/TestStepOverBreakpoint.py (1819 of 2163) UNSUPPORTED: lldb-api :: linux/add-symbols/TestTargetSymbolsAddCommand.py (1820 of 2163) PASS: lldb-api :: sample_test/TestSampleTest.py (1821 of 2163) PASS: lldb-unit :: Symbol/./SymbolTests/TestTypeSystemClang.TestDisplayName (1822 of 2163) PASS: lldb-api :: commands/watchpoints/multiple_hits/TestMultipleHits.py (1823 of 2163) PASS: lldb-shell :: SymbolFile/DWARF/find-qualified-variable.cpp (1824 of 2163) PASS: lldb-shell :: Settings/TestFrameFormatColor.test (1825 of 2163) PASS: lldb-api :: functionalities/pointer_num_children/TestPointerNumChildren.py (1826 of 2163) PASS: lldb-unit :: Utility/./UtilityTests/VMRange.Reset (1827 of 2163) PASS: lldb-unit :: Utility/./UtilityTests/LogChannelEnabledTest.LLDB_LOG_ERROR (1828 of 2163) PASS: lldb-shell :: SymbolFile/DWARF/find-function-regex.cpp (1829 of 2163) PASS: lldb-unit :: ScriptInterpreter/Python/./ScriptInterpreterPythonTests/PythonDataObjectsTest.TestCallable (1830 of 2163) PASS: lldb-api :: commands/watchpoints/watchpoint_set_command/TestWatchLocationWithWatchSet.py (1831 of 2163) PASS: lldb-unit :: Utility/./UtilityTests/StringListTest.CopyListEmpty (1832 of 2163) PASS: lldb-unit :: ScriptInterpreter/Python/./ScriptInterpreterPythonTests/PythonDataObjectsTest.TestGlobalNameResolutionNoDot (1833 of 2163) PASS: lldb-unit :: Language/Highlighting/./HighlighterTests/HighlighterTest.Colons (1834 of 2163) PASS: lldb-unit :: ScriptInterpreter/Python/./ScriptInterpreterPythonTests/PythonDataObjectsTest.TestDictionaryResolutionWithDot (1835 of 2163) PASS: lldb-api :: functionalities/data-formatter/var-in-aggregate-misuse/TestVarInAggregateMisuse.py (1836 of 2163) PASS: lldb-shell :: Driver/TestCommands.test (1837 of 2163) UNSUPPORTED: lldb-shell :: ExecControl/StopHook/stop-hook-threads.test (1838 of 2163) PASS: lldb-shell :: SymbolFile/NativePDB/s_constant.cpp (1839 of 2163) PASS: lldb-unit :: ScriptInterpreter/Python/./ScriptInterpreterPythonTests/PythonDataObjectsTest.TestPythonIntegerToStructuredInteger (1840 of 2163) PASS: lldb-unit :: Process/gdb-remote/./ProcessGdbRemoteTests/GDBRemoteCommunicationTest.ReadPacket_checksum (1841 of 2163) PASS: lldb-shell :: ObjectFile/ELF/short-build-id.yaml (1842 of 2163) PASS: lldb-unit :: Process/minidump/./LLDBMinidumpTests/MinidumpParserTest.FindMemoryRange (1843 of 2163) PASS: lldb-unit :: Symbol/./SymbolTests/TestClangASTImporter.CanImportInvalidType (1844 of 2163) PASS: lldb-api :: types/TestCharTypeExpr.py (1845 of 2163) PASS: lldb-shell :: Driver/TestConvenienceVariables.test (1846 of 2163) PASS: lldb-shell :: ObjectFile/ELF/PT_LOAD.yaml (1847 of 2163) PASS: lldb-api :: assert_messages_test/TestAssertMessages.py (1848 of 2163) PASS: lldb-api :: python_api/sbenvironment/TestSBEnvironment.py (1849 of 2163) PASS: lldb-api :: commands/settings/use_source_cache/TestUseSourceCache.py (1850 of 2163) PASS: lldb-unit :: Language/Highlighting/./HighlighterTests/HighlighterTest.ClangPPDirectives (1851 of 2163) PASS: lldb-unit :: Utility/./UtilityTests/StreamTest.PutRawBytesToMixedEndian (1852 of 2163) PASS: lldb-unit :: Host/./HostTests/Host.WaitStatusFormat (1853 of 2163) PASS: lldb-unit :: Utility/./UtilityTests/CompletionRequest.Constructor (1854 of 2163) PASS: lldb-unit :: Symbol/./SymbolTests/TestClangASTImporter.RecordLayout (1855 of 2163) PASS: lldb-unit :: SymbolFile/DWARF/./SymbolFileDWARFTests/DWARFASTParserClangTests.EnsureAllDIEsInDeclContextHaveBeenParsedParsesOnlyMatchingEntries (1856 of 2163) PASS: lldb-unit :: Utility/./UtilityTests/LogTest.Unregister (1857 of 2163) PASS: lldb-api :: commands/expression/argument_passing_restrictions/TestArgumentPassingRestrictions.py (1858 of 2163) UNSUPPORTED: lldb-api :: tools/lldb-vscode/completions/TestVSCode_completions.py (1859 of 2163) PASS: lldb-api :: functionalities/stats_api/TestStatisticsAPI.py (1860 of 2163) PASS: lldb-unit :: Utility/./UtilityTests/StringListTest.LongestCommonPrefix (1861 of 2163) PASS: lldb-unit :: Utility/./UtilityTests/StreamTest.AddressSize (1862 of 2163) PASS: lldb-shell :: Reproducer/TestMultipleTargets.test (1863 of 2163) PASS: lldb-shell :: Settings/TestSettingsWrite.test (1864 of 2163) PASS: lldb-unit :: Utility/./UtilityTests/UriParserTest.LongPath (1865 of 2163) PASS: lldb-unit :: Platform/./LLDBPlatformTests/PlatformDarwinTest.TestParseVersionBuildDir (1866 of 2163) PASS: lldb-api :: functionalities/thread/concurrent_events/TestConcurrentDelaySignalWatch.py (1867 of 2163) PASS: lldb-unit :: Host/./HostTests/FileSystemTest.EmptyTest (1868 of 2163) PASS: lldb-unit :: Signals/./SignalsTests/UnixSignalsTest.GetFilteredSignals (1869 of 2163) PASS: lldb-api :: functionalities/multidebugger_commands/TestMultipleDebuggersCommands.py (1870 of 2163) PASS: lldb-api :: commands/command/script/import/TestImport.py (1871 of 2163) PASS: lldb-shell :: Commands/command-regex-delete.test (1872 of 2163) PASS: lldb-unit :: Utility/./UtilityTests/StringExtractorTest.GetNameColonValueNoSemicolon (1873 of 2163) PASS: lldb-unit :: Utility/./UtilityTests/StreamTest.PutHex16ByteOrderBig (1874 of 2163) UNSUPPORTED: lldb-api :: tools/lldb-server/libraries-svr4/TestGdbRemoteLibrariesSvr4Support.py (1875 of 2163) PASS: lldb-unit :: ScriptInterpreter/Python/./ScriptInterpreterPythonTests/PythonDataObjectsTest.TestModuleNameResolutionNoDot (1876 of 2163) PASS: lldb-unit :: Utility/./UtilityTests/LogChannelEnabledTest.LogGetLogThread (1877 of 2163) PASS: lldb-unit :: Utility/./UtilityTests/RangeTest.LessThan (1878 of 2163) PASS: lldb-unit :: Expression/./ExpressionTests/CppModuleConfigurationTest.AmbiguousCLib (1879 of 2163) PASS: lldb-unit :: Utility/./UtilityTests/StreamTeeTest.Constructor2Streams (1880 of 2163) PASS: lldb-unit :: Interpreter/./InterpreterTests/CompletionTest.FileCompletionAbsolute (1881 of 2163) PASS: lldb-shell :: ObjectFile/ELF/PT_TLS-overlap-PT_LOAD.yaml (1882 of 2163) PASS: lldb-api :: lang/objc/foundation/TestObjCMethods.py (1883 of 2163) PASS: lldb-unit :: Expression/./ExpressionTests/ClangHostTest.MacOSX (1884 of 2163) PASS: lldb-api :: commands/expression/import-std-module/forward_decl_from_module/TestForwardDeclFromStdModule.py (1885 of 2163) PASS: lldb-api :: python_api/value/TestValueAPI.py (1886 of 2163) PASS: lldb-api :: lang/cpp/stl/TestStdCXXDisassembly.py (1887 of 2163) PASS: lldb-api :: commands/expression/radar_9531204/TestPrintfAfterUp.py (1888 of 2163) UNSUPPORTED: lldb-shell :: Breakpoint/case-insensitive.test (1889 of 2163) PASS: lldb-unit :: Host/./HostTests/NativeProcessProtocolTest.ReadCStringFromMemory_MaxSize (1890 of 2163) PASS: lldb-api :: functionalities/completion/TestCompletion.py (1891 of 2163) PASS: lldb-unit :: Utility/./UtilityTests/Flags.IsClear (1892 of 2163) UNSUPPORTED: lldb-api :: benchmarks/turnaround/TestCompileRunToBreakpointTurnaround.py (1893 of 2163) PASS: lldb-unit :: Symbol/./SymbolTests/LineEntryTest.GetSameLineContiguousAddressRangeNestedInline (1894 of 2163) PASS: lldb-api :: api/check_public_api_headers/TestPublicAPIHeaders.py (1895 of 2163) UNSUPPORTED: lldb-api :: commands/watchpoints/multi_watchpoint_slots/TestWatchpointMultipleSlots.py (1896 of 2163) PASS: lldb-shell :: SymbolFile/Breakpad/unwind-via-stack-win-no-memory-info.yaml (1897 of 2163) PASS: lldb-api :: commands/command/nested_alias/TestNestedAlias.py (1898 of 2163) PASS: lldb-api :: commands/platform/file/close/TestPlatformFileClose.py (1899 of 2163) PASS: lldb-unit :: Utility/./UtilityTests/StringExtractorTest.DecodeHexU8_Exact (1900 of 2163) PASS: lldb-shell :: Commands/command-stop-hook-output.test (1901 of 2163) PASS: lldb-api :: functionalities/recursion/TestValueObjectRecursion.py (1902 of 2163) PASS: lldb-unit :: UnwindAssembly/ARM64/./Arm64InstEmulationTests/TestArm64InstEmulation.TestMediumDarwinFunction (1903 of 2163) PASS: lldb-unit :: Utility/./UtilityTests/DataExtractorTest.GetSLEB128_bit63 (1904 of 2163) PASS: lldb-api :: python_api/signals/TestSignalsAPI.py (1905 of 2163) PASS: lldb-unit :: Utility/./UtilityTests/RangeDataVector.FindEntryThatContains_Overlap (1906 of 2163) PASS: lldb-unit :: Utility/./UtilityTests/StreamTest.PutHex8 (1907 of 2163) PASS: lldb-unit :: Core/./LLDBCoreTests/MangledTest.ResultForValidName (1908 of 2163) UNSUPPORTED: lldb-api :: functionalities/tty/TestTerminal.py (1909 of 2163) PASS: lldb-unit :: Utility/./UtilityTests/ArgsTest.ReplaceArgumentAtIndexShort (1910 of 2163) UNSUPPORTED: lldb-shell :: Watchpoint/netbsd-nouserdbregs.test (1911 of 2163) PASS: lldb-api :: lang/objc/bitfield_ivars/TestBitfieldIvars.py (1912 of 2163) PASS: lldb-unit :: SymbolFile/NativePDB/./SymbolFileNativePDBTests/PDBFPOProgramToDWARFExpressionTests.InvalidOpUnary (1913 of 2163) PASS: lldb-unit :: Utility/./UtilityTests/DataExtractorTest.GetMaxS64 (1914 of 2163) PASS: lldb-unit :: Utility/./UtilityTests/GeneratorTest.YamlMultiProvider (1915 of 2163) PASS: lldb-unit :: Process/minidump/./LLDBMinidumpTests/MinidumpParserTest.GetMemoryRegionInfo (1916 of 2163) PASS: lldb-unit :: Process/minidump/./LLDBMinidumpTests/MinidumpParserTest.GetThreadContext_x86_32 (1917 of 2163) PASS: lldb-shell :: Register/x86-64-read.test (1918 of 2163) PASS: lldb-api :: functionalities/data-formatter/data-formatter-ptr-to-array/TestPtrToArrayFormatting.py (1919 of 2163) PASS: lldb-api :: commands/watchpoints/watchpoint_commands/command/TestWatchpointCommandPython.py (1920 of 2163) PASS: lldb-shell :: Reproducer/Functionalities/TestImageList.test (1921 of 2163) PASS: lldb-unit :: Host/./HostTests/SocketAddressTest.GetAddressInfo (1922 of 2163) PASS: lldb-shell :: ScriptInterpreter/Python/sb_address_exception.test (1923 of 2163) PASS: lldb-shell :: ObjectFile/Breakpad/discontiguous-sections.test (1924 of 2163) PASS: lldb-unit :: Utility/./UtilityTests/OptionsWithRawTest.EmptySuffixSingleWhitespace (1925 of 2163) PASS: lldb-api :: macosx/nslog/TestDarwinNSLogOutput.py (1926 of 2163) PASS: lldb-shell :: SymbolFile/DWARF/dwarf5-debug_line.s (1927 of 2163) PASS: lldb-unit :: Utility/./UtilityTests/Flags.AllClear (1928 of 2163) PASS: lldb-api :: python_api/function_symbol/TestSymbolAPI.py (1929 of 2163) PASS: lldb-api :: macosx/version_zero/TestGetVersionZeroVersion.py (1930 of 2163) PASS: lldb-shell :: SymbolFile/NativePDB/globals-fundamental.cpp (1931 of 2163) PASS: lldb-api :: functionalities/data-formatter/data-formatter-stl/libstdcpp/unique_ptr/invalid/TestDataFormatterInvalidStdUniquePtr.py (1932 of 2163) PASS: lldb-unit :: Process/gdb-remote/./ProcessGdbRemoteTests/GDBRemoteCommunicationClientTest.SyncThreadState (1933 of 2163) PASS: lldb-api :: lang/cpp/inlines/TestInlines.py (1934 of 2163) PASS: lldb-unit :: Utility/./UtilityTests/StringExtractorTest.GetHexBytesAvail_FullString (1935 of 2163) PASS: lldb-api :: functionalities/thread/concurrent_events/TestConcurrentTwoWatchpointsOneSignal.py (1936 of 2163) PASS: lldb-api :: functionalities/data-formatter/nsdictionarysynth/TestNSDictionarySynthetic.py (1937 of 2163) PASS: lldb-unit :: ObjectFile/Breakpad/./ObjectFileBreakpadTests/Record.classify (1938 of 2163) PASS: lldb-api :: commands/gui/invalid-args/TestInvalidArgsGui.py (1939 of 2163) PASS: lldb-api :: lang/cpp/class_static/TestStaticVariables.py (1940 of 2163) PASS: lldb-unit :: UnwindAssembly/x86/./UnwindAssemblyx86Tests/Testx86AssemblyInspectionEngine.Test32bitFramelessBigStackFrame (1941 of 2163) PASS: lldb-unit :: ObjectFile/Breakpad/./ObjectFileBreakpadTests/StackWinRecord.parse (1942 of 2163) PASS: lldb-unit :: SymbolFile/DWARF/./SymbolFileDWARFTests/SymbolFileDWARFTests.TestAbilitiesForDWARF (1943 of 2163) PASS: lldb-api :: lang/cpp/this/TestCPPThis.py (1944 of 2163) PASS: lldb-api :: commands/expression/namespace_local_var_same_name_cpp_and_c/TestNamespaceLocalVarSameNameCppAndC.py (1945 of 2163) PASS: lldb-api :: commands/watchpoints/watchpoint_events/TestWatchpointEvents.py (1946 of 2163) PASS: lldb-unit :: Utility/./UtilityTests/ConstStringTest.YAML (1947 of 2163) PASS: lldb-api :: lang/c/local_variables/TestLocalVariables.py (1948 of 2163) PASS: lldb-api :: functionalities/data-formatter/language_category_updates/TestDataFormatterLanguageCategoryUpdates.py (1949 of 2163) PASS: lldb-api :: functionalities/data-formatter/data-formatter-objc/TestDataFormatterObjCPlain.py (1950 of 2163) UNSUPPORTED: lldb-api :: tools/intel-features/intel-pt/test/TestIntelPTSimpleBinary.py (1951 of 2163) PASS: lldb-api :: tools/lldb-vscode/runInTerminal/TestVSCode_runInTerminal.py (1952 of 2163) PASS: lldb-api :: tools/lldb-server/TestGdbRemoteThreadsInStopReply.py (1953 of 2163) PASS: lldb-api :: lang/c/global_variables/TestGlobalVariables.py (1954 of 2163) PASS: lldb-api :: python_api/sbvalue_const_addrof/TestSBValueConstAddrOf.py (1955 of 2163) PASS: lldb-api :: macosx/thread-names/TestInterruptThreadNames.py (1956 of 2163) UNSUPPORTED: lldb-shell :: Register/x86-zmm-read.test (1957 of 2163) PASS: lldb-api :: commands/expression/call-function/TestCallStopAndContinue.py (1958 of 2163) PASS: lldb-api :: functionalities/data-formatter/data-formatter-smart-array/TestDataFormatterSmartArray.py (1959 of 2163) PASS: lldb-unit :: Process/gdb-remote/./ProcessGdbRemoteTests/GDBRemoteCommunicationClientTest.GetMemoryRegionInfo (1960 of 2163) PASS: lldb-unit :: Utility/./UtilityTests/ScalarTest.TruncOrExtendTo (1961 of 2163) UNSUPPORTED: lldb-api :: functionalities/thread/multi_break/TestMultipleBreakpoints.py (1962 of 2163) UNSUPPORTED: lldb-api :: functionalities/data-formatter/data-formatter-stl/libstdcpp/iterator/TestDataFormatterStdIterator.py (1963 of 2163) UNSUPPORTED: lldb-shell :: Unwind/eh-frame-small-fde.test (1964 of 2163) PASS: lldb-api :: commands/expression/issue_11588/Test11588.py (1965 of 2163) PASS: lldb-unit :: SymbolFile/DWARF/./SymbolFileDWARFTests/SymbolFileDWARFTests.TestAbbrevInvalidNULLTag (1966 of 2163) PASS: lldb-unit :: Utility/./UtilityTests/ArgsTest.TestSingleQuotedArgWithSpace (1967 of 2163) PASS: lldb-api :: commands/expression/import-std-module/forward_list/TestForwardListFromStdModule.py (1968 of 2163) PASS: lldb-unit :: ObjectFile/Breakpad/./ObjectFileBreakpadTests/PublicRecord.parse (1969 of 2163) PASS: lldb-unit :: Utility/./UtilityTests/DataExtractorTest.GetDoubleUnaligned (1970 of 2163) PASS: lldb-api :: commands/expression/persistent_types/TestNestedPersistentTypes.py (1971 of 2163) PASS: lldb-unit :: Utility/./UtilityTests/StreamTest.AddressRangeInvalidRange (1972 of 2163) UNSUPPORTED: lldb-api :: benchmarks/startup/TestStartupDelays.py (1973 of 2163) PASS: lldb-shell :: SymbolFile/DWARF/dwarf5-index-is-used.cpp (1974 of 2163) PASS: lldb-unit :: Core/./LLDBCoreTests/MangledTest.NameIndexes_FindFunctionSymbols (1975 of 2163) PASS: lldb-unit :: Process/gdb-remote/./ProcessGdbRemoteTests/GDBRemoteCommunicationClientTest.SaveRestoreRegistersNoSuffix (1976 of 2163) UNSUPPORTED: lldb-api :: functionalities/darwin_log/filter/regex/message/TestDarwinLogFilterRegexMessage.py (1977 of 2163) PASS: lldb-unit :: Utility/./UtilityTests/FileSpecTest.IsRelative (1978 of 2163) PASS: lldb-unit :: UnwindAssembly/x86/./UnwindAssemblyx86Tests/Testx86AssemblyInspectionEngine.TestAddRSP (1979 of 2163) PASS: lldb-shell :: SymbolFile/DWARF/split-dwarf-multiple-cu.ll (1980 of 2163) UNSUPPORTED: lldb-api :: functionalities/data-formatter/data-formatter-stl/libstdcpp/vector/TestDataFormatterStdVector.py (1981 of 2163) PASS: lldb-api :: commands/target/modules/search-paths/insert/TestTargetModulesSearchpathsInsert.py (1982 of 2163) PASS: lldb-api :: commands/watchpoints/watchpoint_size/TestWatchpointSizes.py (1983 of 2163) PASS: lldb-unit :: Symbol/./SymbolTests/PostfixExpression.ParseOneExpression (1984 of 2163) PASS: lldb-unit :: Utility/./UtilityTests/TimeoutTest.Construction (1985 of 2163) PASS: lldb-unit :: ScriptInterpreter/Python/./ScriptInterpreterPythonTests/PythonDataObjectsTest.TestPythonFile (1986 of 2163) UNSUPPORTED: lldb-api :: commands/watchpoints/hello_watchlocation/TestWatchLocation.py (1987 of 2163) PASS: lldb-shell :: SymbolFile/NativePDB/break-by-line.cpp (1988 of 2163) PASS: lldb-unit :: Utility/./UtilityTests/ScalarTest.APIntConstructor (1989 of 2163) PASS: lldb-api :: functionalities/thread/backtrace_limit/TestBacktraceLimit.py (1990 of 2163) PASS: lldb-unit :: Utility/./UtilityTests/SerializationRountripTest.SerializeDeserializeCStringArrayNullptr (1991 of 2163) PASS: lldb-shell :: ObjectFile/ELF/section-overlap.yaml (1992 of 2163) PASS: lldb-unit :: Process/gdb-remote/./ProcessGdbRemoteTests/GDBRemoteCommunicationClientTest.SendGetDataPacket (1993 of 2163) PASS: lldb-unit :: Host/./HostTests/SocketTests/SocketTest.DomainListenConnectAccept/ipv4 (1994 of 2163) PASS: lldb-unit :: Host/./HostTests/ConnectionFileDescriptorTest.TCPGetURIv4 (1995 of 2163) PASS: lldb-api :: python_api/disassemble-raw-data/TestDisassembleRawData.py (1996 of 2163) PASS: lldb-unit :: DataFormatter/./LLDBFormatterTests/TypeMatcherTests.CreatedBySameMatchStringExactNamePrefixes (1997 of 2163) PASS: lldb-shell :: SymbolFile/DWARF/find-basic-function.cpp (1998 of 2163) UNSUPPORTED: lldb-shell :: SymbolFile/PDB/function-level-linking.test (1999 of 2163) PASS: lldb-api :: lang/objc/objc-builtin-types/TestObjCBuiltinTypes.py (2000 of 2163) PASS: lldb-api :: functionalities/thread/concurrent_events/TestConcurrentDelaySignalBreak.py (2001 of 2163) PASS: lldb-unit :: Utility/./UtilityTests/StringListTest.GetMaxStringLengthEqualSize (2002 of 2163) PASS: lldb-api :: commands/process/launch-with-shellexpand/TestLaunchWithShellExpand.py (2003 of 2163) PASS: lldb-api :: functionalities/breakpoint/breakpoint_by_line_and_column/TestBreakpointByLineAndColumn.py (2004 of 2163) PASS: lldb-api :: commands/expression/dont_allow_jit/TestAllowJIT.py (2005 of 2163) PASS: lldb-unit :: Utility/./UtilityTests/StringExtractorTest.GetHexBytesAvail_Underflow (2006 of 2163) PASS: lldb-shell :: SymbolFile/NativePDB/source-list.cpp (2007 of 2163) PASS: lldb-shell :: ObjectFile/wasm/embedded-debug-sections.yaml (2008 of 2163) PASS: lldb-unit :: Symbol/./SymbolTests/TestTypeSystemClang.TestBuiltinTypeForEncodingAndBitSize (2009 of 2163) PASS: lldb-shell :: SymbolFile/DWARF/dir-separator-windows.s (2010 of 2163) PASS: lldb-unit :: Process/minidump/./LLDBMinidumpTests/MinidumpParserTest.GetMemoryRegionInfoLinuxMaps (2011 of 2163) PASS: lldb-api :: lang/cpp/auto/TestCPPAuto.py (2012 of 2163) PASS: lldb-api :: commands/frame/diagnose/array/TestArray.py (2013 of 2163) PASS: lldb-api :: tools/lldb-server/TestAppleSimulatorOSType.py (2014 of 2163) PASS: lldb-api :: lang/cpp/class_types/TestClassTypesDisassembly.py (2015 of 2163) UNSUPPORTED: lldb-api :: linux/sepdebugsymlink/TestTargetSymbolsSepDebugSymlink.py (2016 of 2163) PASS: lldb-api :: commands/gui/basic/TestGuiBasic.py (2017 of 2163) PASS: lldb-unit :: Expression/./ExpressionTests/ClangExpressionDeclMapTest.TestUnknownIdentifierLookup (2018 of 2163) PASS: lldb-api :: tools/lldb-server/TestGdbRemote_vCont.py (2019 of 2163) PASS: lldb-api :: commands/expression/scoped_enums/TestScopedEnumType.py (2020 of 2163) PASS: lldb-unit :: Process/minidump/./LLDBMinidumpTests/MinidumpParserTest.GetPidWindows (2021 of 2163) PASS: lldb-unit :: Process/minidump/./LLDBMinidumpTests/MinidumpParserTest.GetPidWow64 (2022 of 2163) PASS: lldb-api :: commands/expression/import-std-module/vector/TestVectorFromStdModule.py (2023 of 2163) PASS: lldb-api :: functionalities/type_completion/TestTypeCompletion.py (2024 of 2163) UNSUPPORTED: lldb-shell :: SymbolFile/PDB/ast-restore.test (2025 of 2163) PASS: lldb-api :: functionalities/multiword-commands/TestMultiWordCommands.py (2026 of 2163) PASS: lldb-unit :: Process/gdb-remote/./ProcessGdbRemoteTests/GDBRemoteCommunicationServerTest.SendErrorResponse_StringError (2027 of 2163) PASS: lldb-api :: functionalities/gdb_remote_client/TestThreadSelectionBug.py (2028 of 2163) PASS: lldb-api :: functionalities/data-formatter/vector-types/TestVectorTypesFormatting.py (2029 of 2163) PASS: lldb-unit :: Utility/./UtilityTests/ArchSpecTest.TripleComponentsWereSpecified (2030 of 2163) PASS: lldb-api :: functionalities/gdb_remote_client/TestProcessConnect.py (2031 of 2163) PASS: lldb-unit :: Utility/./UtilityTests/NameMatchesTest.EndsWith (2032 of 2163) PASS: lldb-unit :: Utility/./UtilityTests/RangeTest.SlideZero (2033 of 2163) PASS: lldb-api :: lang/objc/objc++/TestObjCXX.py (2034 of 2163) UNSUPPORTED: lldb-api :: functionalities/thread/break_after_join/TestBreakAfterJoin.py (2035 of 2163) PASS: lldb-unit :: ObjectFile/PECOFF/./ObjectFilePECOFFTests/PECallFrameInfoTest.Chained_eh (2036 of 2163) PASS: lldb-shell :: SymbolFile/DWARF/debug_ranges_and_rnglists.test (2037 of 2163) PASS: lldb-shell :: Reproducer/TestDiscard.test (2038 of 2163) PASS: lldb-unit :: Language/Highlighting/./HighlighterTests/HighlighterTest.ClangPreserveNewLine (2039 of 2163) PASS: lldb-api :: commands/disassemble/basic/TestDisassembleBreakpoint.py (2040 of 2163) PASS: lldb-api :: commands/process/attach/attach_denied/TestAttachDenied.py (2041 of 2163) PASS: lldb-unit :: Symbol/./SymbolTests/TestTypeSystemClang.TestRecordHasFields (2042 of 2163) PASS: lldb-unit :: Expression/./ExpressionTests/CppModuleConfigurationTest.LinuxLocalLibCpp (2043 of 2163) PASS: lldb-api :: commands/expression/test/TestExprs2.py (2044 of 2163) PASS: lldb-api :: lang/cpp/this_class_type_mixing/TestThisClassTypeMixing.py (2045 of 2163) PASS: lldb-api :: functionalities/data-formatter/frameformat_smallstruct/TestFrameFormatSmallStruct.py (2046 of 2163) PASS: lldb-shell :: SymbolFile/Breakpad/stack-cfi-parsing.test (2047 of 2163) PASS: lldb-unit :: Language/Highlighting/./HighlighterTests/HighlighterTest.ClangCursorPosBeforeOtherToken (2048 of 2163) PASS: lldb-api :: functionalities/thread/concurrent_events/TestConcurrentSignalDelayBreak.py (2049 of 2163) PASS: lldb-api :: functionalities/breakpoint/comp_dir_symlink/TestCompDirSymLink.py (2050 of 2163) PASS: lldb-unit :: Host/./HostTests/FileSystemTest.OpenErrno (2051 of 2163) PASS: lldb-api :: functionalities/ubsan/user-expression/TestUbsanUserExpression.py (2052 of 2163) PASS: lldb-unit :: Utility/./UtilityTests/FileSpecTest.Equal (2053 of 2163) PASS: lldb-api :: lang/cpp/multiple-inheritance/TestCppMultipleInheritance.py (2054 of 2163) PASS: lldb-unit :: Utility/./UtilityTests/StringListTest.LongestCommonPrefixDuplicateElement (2055 of 2163) PASS: lldb-unit :: ScriptInterpreter/Python/./ScriptInterpreterPythonTests/PythonDataObjectsTest.TestPythonCallableCheck (2056 of 2163) PASS: lldb-api :: commands/command/invalid-args/TestInvalidArgsCommand.py (2057 of 2163) PASS: lldb-unit :: Utility/./UtilityTests/UriParserTest.Empty (2058 of 2163) PASS: lldb-unit :: ScriptInterpreter/Python/./ScriptInterpreterPythonTests/PythonDataObjectsTest.TestPythonString (2059 of 2163) PASS: lldb-api :: python_api/lldbutil/iter/TestRegistersIterator.py (2060 of 2163) PASS: lldb-api :: lang/objc/foundation/TestFoundationDisassembly.py (2061 of 2163) PASS: lldb-api :: functionalities/data-formatter/data-formatter-objc/TestDataFormatterObjCNSError.py (2062 of 2163) PASS: lldb-api :: types/TestRecursiveTypes.py (2063 of 2163) PASS: lldb-unit :: Utility/./UtilityTests/StreamTest.PutCharNull (2064 of 2163) PASS: lldb-unit :: Utility/./UtilityTests/ArgsTest.Yaml (2065 of 2163) UNSUPPORTED: lldb-api :: functionalities/thread/state/TestThreadStates.py (2066 of 2163) PASS: lldb-unit :: SymbolFile/DWARF/./SymbolFileDWARFTests/SymbolFileDWARFTests.TestAbbrevOrder1Start5 (2067 of 2163) PASS: lldb-api :: functionalities/data-formatter/data-formatter-objc/cmtime/TestDataFormatterCMTime.py (2068 of 2163) PASS: lldb-api :: functionalities/data-formatter/data-formatter-synthtype/TestDataFormatterSynthType.py (2069 of 2163) PASS: lldb-unit :: Host/./HostTests/NativeProcessProtocolTest.SetBreakpointFailWrite (2070 of 2163) PASS: lldb-api :: functionalities/data-formatter/data-formatter-stl/libcxx/forward_list/TestDataFormatterLibcxxForwardList.py (2071 of 2163) PASS: lldb-unit :: Utility/./UtilityTests/RecordReplayTest.InstrumentedBar (2072 of 2163) PASS: lldb-api :: lang/cpp/incomplete-types/TestCppIncompleteTypes.py (2073 of 2163) UNSUPPORTED: lldb-api :: tools/lldb-server/TestGdbRemoteCompletion.py (2074 of 2163) PASS: lldb-unit :: Process/gdb-remote/./ProcessGdbRemoteTests/GDBRemoteCommunicationServerTest.SendErrorResponse_ErrorList (2075 of 2163) UNSUPPORTED: lldb-api :: functionalities/data-formatter/data-formatter-stl/libstdcpp/tuple/TestDataFormatterStdTuple.py (2076 of 2163) PASS: lldb-unit :: Utility/./UtilityTests/ScalarTest.LongLongAssigmentOperator (2077 of 2163) PASS: lldb-unit :: ScriptInterpreter/Python/./ScriptInterpreterPythonTests/PythonDataObjectsTest.TestPythonListValueEquality (2078 of 2163) PASS: lldb-shell :: Driver/TestSingleQuote.test (2079 of 2163) PASS: lldb-shell :: ObjectFile/wasm/basic.yaml (2080 of 2163) PASS: lldb-shell :: Breakpoint/dummy-target.test (2081 of 2163) PASS: lldb-unit :: Symbol/./SymbolTests/TestTypeSystemClang.TestGetTypeClassDeclType (2082 of 2163) PASS: lldb-shell :: SymbolFile/DWARF/debug_line-relative_path.s (2083 of 2163) PASS: lldb-unit :: Utility/./UtilityTests/ArgsTest.ReplaceArgumentAtIndexLonger (2084 of 2163) PASS: lldb-unit :: Host/./HostTests/SocketTests/SocketTest.UDPGetConnectURI/ipv4 (2085 of 2163) PASS: lldb-unit :: DataFormatter/./LLDBFormatterTests/StringPrinterTests.SwiftUTF8 (2086 of 2163) PASS: lldb-unit :: ObjectFile/Breakpad/./ObjectFileBreakpadTests/LineRecord.parse (2087 of 2163) PASS: lldb-unit :: ScriptInterpreter/Python/./ScriptInterpreterPythonTests/PythonDataObjectsTest.TestPythonListManipulation (2088 of 2163) PASS: lldb-shell :: SymbolFile/DWARF/dwo-type-in-main-file.s (2089 of 2163) UNSUPPORTED: lldb-api :: benchmarks/frame_variable/TestFrameVariableResponse.py (2090 of 2163) PASS: lldb-api :: python_api/watchpoint/watchlocation/TestTargetWatchAddress.py (2091 of 2163) PASS: lldb-api :: tools/lldb-server/commandline/TestStubReverseConnect.py (2092 of 2163) PASS: lldb-unit :: Target/./TargetTests/ModuleCacheTest.GetAndPut (2093 of 2163) PASS: lldb-unit :: Symbol/./SymbolTests/TestTypeSystemClang.TestGetTypeClassNested (2094 of 2163) UNSUPPORTED: lldb-api :: functionalities/darwin_log/filter/regex/activity-chain/TestDarwinLogFilterRegexActivityChain.py (2095 of 2163) PASS: lldb-shell :: SymbolFile/DWARF/DW_AT_data_bit_offset-DW_OP_stack_value.s (2096 of 2163) PASS: lldb-shell :: ObjectFile/ELF/minidebuginfo-find-symbols.yaml (2097 of 2163) PASS: lldb-api :: functionalities/breakpoint/breakpoint_ignore_count/TestBreakpointIgnoreCount.py (2098 of 2163) PASS: lldb-api :: functionalities/data-formatter/builtin-formats/TestBuiltinFormats.py (2099 of 2163) PASS: lldb-api :: commands/expression/import-std-module/deque-basic/TestDequeFromStdModule.py (2100 of 2163) PASS: lldb-shell :: Process/TestAbortExitCode.test (2101 of 2163) PASS: lldb-api :: lang/objc/self/TestObjCSelf.py (2102 of 2163) PASS: lldb-shell :: ObjectFile/ELF/aarch64-relocations.yaml (2103 of 2163) UNSUPPORTED: lldb-api :: functionalities/darwin_log/format/TestDarwinLogMessageFormat.py (2104 of 2163) PASS: lldb-unit :: Symbol/./SymbolTests/LineEntryTest.GetSameLineContiguousAddressRangeNoInlines (2105 of 2163) PASS: lldb-unit :: Expression/./ExpressionTests/ClangHostTest.ComputeClangResourceDirectory (2106 of 2163) PASS: lldb-unit :: Utility/./UtilityTests/BinaryStreamTest.PutULEB128NineBytes (2107 of 2163) PASS: lldb-api :: python_api/value_var_update/TestValueVarUpdate.py (2108 of 2163) PASS: lldb-shell :: SymbolFile/DWARF/parallel-indexing-stress.s (2109 of 2163) PASS: lldb-api :: commands/watchpoints/watchpoint_commands/command/TestWatchpointCommandLLDB.py (2110 of 2163) PASS: lldb-unit :: Symbol/./SymbolTests/TestTypeSystemClang.AddMethodToObjCObjectType (2111 of 2163) PASS: lldb-api :: tools/lldb-server/TestGdbRemoteProcessInfo.py (2112 of 2163) PASS: lldb-unit :: Utility/./UtilityTests/StringExtractorTest.GetHexU8_Underflow2_NoEof (2113 of 2163) PASS: lldb-shell :: ObjectFile/Breakpad/breakpad-identification.test (2114 of 2163) PASS: lldb-shell :: SymbolFile/DWARF/dwarf5-atomic.s (2115 of 2163) PASS: lldb-unit :: Host/./HostTests/HostInfoTest.GetAugmentedArchSpec (2116 of 2163) UNSUPPORTED: lldb-api :: functionalities/darwin_log/filter/regex/category/TestDarwinLogFilterRegexCategory.py (2117 of 2163) PASS: lldb-unit :: Utility/./UtilityTests/UriParserTest.MinimalPort (2118 of 2163) PASS: lldb-unit :: Utility/./UtilityTests/UriParserTest.SchemeHostSeparator4 (2119 of 2163) PASS: lldb-unit :: Utility/./UtilityTests/OptionsWithRawTest.WhitespaceSuffix (2120 of 2163) PASS: lldb-api :: commands/breakpoint/command/list/TestBreakpointCommandList.py (2121 of 2163) PASS: lldb-unit :: Utility/./UtilityTests/StringListTest.DefaultConstructor (2122 of 2163) PASS: lldb-shell :: Commands/command-backtrace.test (2123 of 2163) UNSUPPORTED: lldb-shell :: SymbolFile/PDB/typedefs.test (2124 of 2163) PASS: lldb-api :: python_api/symbol-context/two-files/TestSymbolContextTwoFiles.py (2125 of 2163) PASS: lldb-api :: commands/thread/select/TestThreadSelect.py (2126 of 2163) PASS: lldb-api :: python_api/lldbutil/iter/TestLLDBIterator.py (2127 of 2163) PASS: lldb-unit :: Utility/./UtilityTests/StreamTest.AddressSuffix (2128 of 2163) PASS: lldb-unit :: Utility/./UtilityTests/AnsiTerminal.KnownPrefix (2129 of 2163) PASS: lldb-api :: functionalities/breakpoint/breakpoint_command/TestBreakpointCommandsFromPython.py (2130 of 2163) PASS: lldb-api :: functionalities/exec/TestExec.py (2131 of 2163) PASS: lldb-unit :: Utility/./UtilityTests/StringLexerTest.PutBack (2132 of 2163) PASS: lldb-unit :: Process/minidump/./LLDBMinidumpTests/MinidumpParserTest.GetExceptionStream (2133 of 2163) PASS: lldb-api :: python_api/breakpoint/TestBreakpointAPI.py (2134 of 2163) PASS: lldb-shell :: Reproducer/Functionalities/TestExpressionEvaluation.test (2135 of 2163) PASS: lldb-shell :: SymbolFile/NativePDB/function-types-classes.cpp (2136 of 2163) PASS: lldb-unit :: Utility/./UtilityTests/ReproducerTest.SetReplay (2137 of 2163) PASS: lldb-api :: functionalities/data-formatter/poarray/TestPrintObjectArray.py (2138 of 2163) PASS: lldb-shell :: SymbolFile/NativePDB/tag-types.cpp (2139 of 2163) PASS: lldb-unit :: Utility/./UtilityTests/BinaryStreamTest.PutULEB128FiveBytes (2140 of 2163) PASS: lldb-api :: python_api/interpreter/TestRunCommandInterpreterAPI.py (2141 of 2163) PASS: lldb-api :: commands/expression/unwind_expression/TestUnwindExpression.py (2142 of 2163) PASS: lldb-unit :: Utility/./UtilityTests/ArgsTest.ReplaceArgumentAtIndexOutOfRange (2143 of 2163) PASS: lldb-shell :: Breakpoint/split-dwarf5-debug-stroffsets.test (2144 of 2163) PASS: lldb-unit :: UnwindAssembly/x86/./UnwindAssemblyx86Tests/Testx86AssemblyInspectionEngine.Testi386IgnoredRegisters (2145 of 2163) PASS: lldb-unit :: Utility/./UtilityTests/ArgsTest.TestAppendArg (2146 of 2163) PASS: lldb-shell :: Driver/TestPositionalArgs.test (2147 of 2163) PASS: lldb-unit :: Utility/./UtilityTests/ListenerTest.GetEventImmediate (2148 of 2163) PASS: lldb-unit :: Utility/./UtilityTests/ScalarTest.SetValueFromData (2149 of 2163) PASS: lldb-unit :: Symbol/./SymbolTests/TestClangASTImporter.MetadataPropagationAfterCopying (2150 of 2163) PASS: lldb-unit :: Utility/./UtilityTests/XcodeSDKTest.GetSDKTypeForTriple (2151 of 2163) PASS: lldb-unit :: Utility/./UtilityTests/StreamTeeTest.SetStreamAtIndexOutOfBounds (2152 of 2163) PASS: lldb-unit :: Utility/./UtilityTests/SerializationRountripTest.SerializeDeserializePodReferences (2153 of 2163) PASS: lldb-shell :: ObjectFile/PECOFF/export-dllfunc.yaml (2154 of 2163) PASS: lldb-shell :: SymbolFile/DWARF/debug_rnglists.s (2155 of 2163) PASS: lldb-api :: commands/expression/namespace_local_var_same_name_obj_c/TestNamespaceLocalVarSameNameObjC.py (2156 of 2163) PASS: lldb-api :: commands/source/info/TestSourceInfo.py (2157 of 2163) PASS: lldb-unit :: UnwindAssembly/x86/./UnwindAssemblyx86Tests/Testx86AssemblyInspectionEngine.TestDisassemblyJunkBytes (2158 of 2163) PASS: lldb-api :: lang/cpp/char8_t/TestCxxChar8_t.py (2159 of 2163) PASS: lldb-unit :: Utility/./UtilityTests/RangeDataVector.FindEntryIndexesThatContain_Overlap (2160 of 2163) PASS: lldb-api :: commands/expression/radar_8638051/Test8638051.py (2161 of 2163) PASS: lldb-api :: lang/objc/objc-struct-argument/TestObjCStructArgument.py (2162 of 2163) PASS: lldb-api :: functionalities/data-formatter/data-formatter-stl/libcxx/multiset/TestDataFormatterLibcxxMultiSet.py (2163 of 2163) Slowest Tests: -------------------------------------------------------------------------- 147.64s: lldb-api :: macosx/simulator/TestSimulatorPlatform.py 100.65s: lldb-api :: tools/lldb-server/TestLldbGdbServer.py 62.36s: lldb-api :: commands/gui/basicdebug/TestGuiBasicDebug.py 59.34s: lldb-api :: types/TestLongTypes.py 54.36s: lldb-api :: lang/objc/hidden-ivars/TestHiddenIvars.py 54.16s: lldb-api :: lang/objc/foundation/TestFoundationDisassembly.py 51.19s: lldb-api :: lang/objc/foundation/TestObjCMethods.py 50.46s: lldb-api :: lang/objc/exceptions/TestObjCExceptions.py 50.37s: lldb-api :: functionalities/mtc/simple/TestMTCSimple.py 48.93s: lldb-api :: api/multithreaded/TestMultithreaded.py 44.79s: lldb-api :: types/TestLongTypesExpr.py 42.63s: lldb-api :: lang/cpp/namespace/TestNamespaceLookup.py 38.68s: lldb-api :: lang/objc/objc-new-syntax/TestObjCNewSyntaxLiteral.py 38.16s: lldb-api :: functionalities/completion/TestCompletion.py 37.68s: lldb-api :: functionalities/data-formatter/data-formatter-objc/TestDataFormatterObjCNSContainer.py 35.95s: lldb-api :: functionalities/postmortem/elf-core/TestLinuxCore.py 35.16s: lldb-api :: commands/target/basic/TestTargetCommand.py 35.13s: lldb-api :: python_api/target/TestTargetAPI.py 33.57s: lldb-api :: functionalities/postmortem/wow64_minidump/TestWow64MiniDump.py 33.42s: lldb-api :: lang/objc/real-definition/TestRealDefinition.py

Hide Details

Tests Times: -------------------------------------------------------------------------- [ Range ] :: [ Percentage ] :: [ Count ] -------------------------------------------------------------------------- [140s,150s) :: [ ] :: [ 1/2163] [130s,140s) :: [ ] :: [ 0/2163] [120s,130s) :: [ ] :: [ 0/2163] [110s,120s) :: [ ] :: [ 0/2163] [100s,110s) :: [ ] :: [ 1/2163] [ 90s,100s) :: [ ] :: [ 0/2163] [ 80s, 90s) :: [ ] :: [ 0/2163] [ 70s, 80s) :: [ ] :: [ 0/2163] [ 60s, 70s) :: [ ] :: [ 2/2163] [ 50s, 60s) :: [ ] :: [ 5/2163] [ 40s, 50s) :: [ ] :: [ 3/2163] [ 30s, 40s) :: [ ] :: [ 16/2163] [ 20s, 30s) :: [ ] :: [ 26/2163] [ 10s, 20s) :: [** ] :: [ 148/2163] [ 0s, 10s) :: [************************************ ] :: [1961/2163] -------------------------------------------------------------------------- ******************** Failed Tests (1): lldb-api :: commands/gui/basicdebug/TestGuiBasicDebug.py

Hide Details

Hide Details

Testing Time: 1668.75s Unsupported : 153 Passed : 2003 Expectedly Failed: 6 Failed : 1 FAILED: tools/lldb/test/CMakeFiles/check-lldb-lit cd /Users/buildslave/jenkins/workspace/lldb-cmake/lldb-build/tools/lldb/test && /usr/local/Frameworks/Python.framework/Versions/3.7/bin/python3.7 /Users/buildslave/jenkins/workspace/lldb-cmake/lldb-build/./bin/llvm-lit -v --time-tests --shuffle --xunit-xml-output=/Users/buildslave/jenkins/workspace/lldb-cmake/test/results.xml -v -j 4 /Users/buildslave/jenkins/workspace/lldb-cmake/lldb-build/tools/lldb/test ninja: build stopped: subcommand failed. Command failed: Command '['/usr/bin/env', 'TERM=vt100', '/usr/local/bin/ninja', '-v', 'check-lldb']' returned non-zero exit status 1 Command: ['/usr/bin/env', 'TERM=vt100', '/usr/local/bin/ninja', '-v', 'check-lldb'] [Pipeline] } [Pipeline] // timeout [Pipeline] } [Pipeline] // stage [Pipeline] stage [Pipeline] { (Declarative: Post Actions) [Pipeline] scanForIssues [Clang (LLVM based)] Sleeping for 5 seconds due to JENKINS-32191... [Clang (LLVM based)] Parsing console log (workspace: '/Users/buildslave/jenkins/workspace/lldb-cmake') [Clang (LLVM based)] Successfully parsed console log [Clang (LLVM based)] -> found 5 issues (skipped 12 duplicates) [Clang (LLVM based)] Post processing issues on 'green-dragon-10' with source code encoding 'UTF-8' [Clang (LLVM based)] Creating SCM blamer to obtain author and commit information for affected files [Clang (LLVM based)] Creating SCM miner to obtain statistics for affected repository files [Clang (LLVM based)] Resolving file names for all issues in source directory '/Users/buildslave/jenkins/workspace/lldb-cmake' [Clang (LLVM based)] -> resolved paths in source directory (3 found, 0 not found) [Clang (LLVM based)] Resolving module names from module definitions (build.xml, pom.xml, or Manifest.mf files) [Clang (LLVM based)] -> resolved module names for 5 issues [Clang (LLVM based)] Resolving package names (or namespaces) by parsing the affected files [Clang (LLVM based)] -> resolved package names of 3 affected files [Clang (LLVM based)] No filter has been set, publishing all 5 issues [Clang (LLVM based)] Creating fingerprints for all affected code blocks to track issues over different builds [Clang (LLVM based)] -> created fingerprints for 5 issues (skipped 0 issues) [Clang (LLVM based)] Copying affected files to Jenkins' build folder '/Users/Shared/Jenkins/Home/jobs/lldb-cmake/builds/24026/files-with-issues' [Clang (LLVM based)] -> 3 copied, 0 not in workspace, 0 not-found, 0 with I/O error [Pipeline] junit Recording test results [Pipeline] } [Pipeline] // stage [Pipeline] } [Pipeline] // withEnv [Pipeline] } [Pipeline] // node [Pipeline] End of Pipeline ERROR: script returned exit code 1 Finished: FAILURE