FailedConsole Output

Skipping 9,779 KB.. Full Log
ldb-api :: types/TestDoubleTypesExpr.py (1075 of 2163)
PASS: lldb-api :: functionalities/thread/num_threads/TestNumThreads.py (1076 of 2163)
PASS: lldb-api :: functionalities/breakpoint/breakpoint_names/TestBreakpointNames.py (1077 of 2163)
PASS: lldb-unit :: Utility/./UtilityTests/StreamTest.AddressPrefix (1078 of 2163)
PASS: lldb-unit :: UnwindAssembly/x86/./UnwindAssemblyx86Tests/Testx86AssemblyInspectionEngine.TestSimplei386ugmented (1079 of 2163)
PASS: lldb-api :: functionalities/data-formatter/vector-types/TestVectorTypesFormatting.py (1080 of 2163)
PASS: lldb-shell :: SymbolFile/DWARF/find-method.cpp (1081 of 2163)
PASS: lldb-shell :: ObjectFile/ELF/duplicate-section.yaml (1082 of 2163)
PASS: lldb-unit :: Utility/./UtilityTests/UUIDTest.SetFromStringRef (1083 of 2163)
PASS: lldb-api :: functionalities/thread/concurrent_events/TestConcurrentDelayedCrashWithBreakpointSignal.py (1084 of 2163)
PASS: lldb-api :: python_api/sbvalue_persist/TestSBValuePersist.py (1085 of 2163)
PASS: lldb-api :: lang/c/bitfields/TestBitfields.py (1086 of 2163)
PASS: lldb-api :: lang/cpp/stl/TestStdCXXDisassembly.py (1087 of 2163)
PASS: lldb-unit :: Expression/./ExpressionTests/CppModuleConfigurationTest.MissingLibCpp (1088 of 2163)
PASS: lldb-unit :: tools/lldb-server/tests/./LLDBServerTests/StandardStartupTest.TestStopReplyContainsThreadPcs (1089 of 2163)
PASS: lldb-unit :: Utility/./UtilityTests/ScalarTest.GetValue (1090 of 2163)
PASS: lldb-api :: commands/expression/import-std-module/queue/TestQueueFromStdModule.py (1091 of 2163)
PASS: lldb-api :: functionalities/dynamic_value_child_count/TestDynamicValueChildCount.py (1092 of 2163)
PASS: lldb-api :: tools/lldb-server/TestGdbRemoteThreadsInStopReply.py (1093 of 2163)
PASS: lldb-unit :: Expression/./ExpressionTests/DWARFExpression.DW_OP_pick (1094 of 2163)
PASS: lldb-unit :: Utility/./UtilityTests/StringExtractorTest.GetHexU8_Exact_NoEof (1095 of 2163)
PASS: lldb-api :: tools/lldb-vscode/stackTrace/TestVSCode_stackTrace.py (1096 of 2163)
PASS: lldb-unit :: Utility/./UtilityTests/LogTest.Unregister (1097 of 2163)
PASS: lldb-unit :: Utility/./UtilityTests/StringListTest.LongestCommonPrefixDuplicateElement (1098 of 2163)
PASS: lldb-api :: python_api/watchpoint/watchlocation/TestSetWatchlocation.py (1099 of 2163)
PASS: lldb-unit :: Utility/./UtilityTests/ArgsTest.TestInsertArg (1100 of 2163)
PASS: lldb-unit :: Utility/./UtilityTests/BinaryStreamTest.PutSLEB128Zero (1101 of 2163)
PASS: lldb-api :: functionalities/breakpoint/breakpoint_ignore_count/TestBreakpointIgnoreCount.py (1102 of 2163)
UNSUPPORTED: lldb-api :: commands/trace/TestTraceSchema.py (1103 of 2163)
PASS: lldb-api :: tools/lldb-vscode/breakpoint/TestVSCode_setFunctionBreakpoints.py (1104 of 2163)
PASS: lldb-shell :: SymbolFile/DWARF/debug_ranges.s (1105 of 2163)
PASS: lldb-unit :: Utility/./UtilityTests/VMRange.Ordering (1106 of 2163)
PASS: lldb-api :: lang/objc/foundation/TestRuntimeTypes.py (1107 of 2163)
PASS: lldb-shell :: Breakpoint/split-dwarf-5-addrbase.test (1108 of 2163)
PASS: lldb-unit :: Utility/./UtilityTests/DataExtractorTest.GetFloat (1109 of 2163)
PASS: lldb-api :: functionalities/data-formatter/nssetsynth/TestNSSetSynthetic.py (1110 of 2163)
PASS: lldb-unit :: Utility/./UtilityTests/OptionsWithRawTest.ArgsButNoLeadingDash (1111 of 2163)
PASS: lldb-api :: functionalities/breakpoint/consecutive_breakpoints/TestConsecutiveBreakpoints.py (1112 of 2163)
PASS: lldb-unit :: Utility/./UtilityTests/StreamTest.PutCharNull (1113 of 2163)
PASS: lldb-unit :: ScriptInterpreter/Python/./ScriptInterpreterPythonTests/PythonDataObjectsTest.TestPythonIntegerToStr (1114 of 2163)
PASS: lldb-unit :: Utility/./UtilityTests/NameMatchesTest.EndsWith (1115 of 2163)
PASS: lldb-api :: commands/frame/diagnose/dereference-argument/TestDiagnoseDereferenceArgument.py (1116 of 2163)
PASS: lldb-shell :: ObjectFile/PECOFF/basic-info.yaml (1117 of 2163)
PASS: lldb-unit :: Utility/./UtilityTests/VMRange.Clear (1118 of 2163)
PASS: lldb-shell :: ObjectFile/ELF/PT_LOAD.yaml (1119 of 2163)
PASS: lldb-api :: commands/watchpoints/watchpoint_set_command/TestWatchLocationWithWatchSet.py (1120 of 2163)
PASS: lldb-unit :: ScriptInterpreter/Python/./ScriptInterpreterPythonTests/PythonDataObjectsTest.TestPythonTupleSize (1121 of 2163)
PASS: lldb-api :: python_api/watchpoint/TestSetWatchpoint.py (1122 of 2163)
UNSUPPORTED: lldb-api :: linux/sepdebugsymlink/TestTargetSymbolsSepDebugSymlink.py (1123 of 2163)
PASS: lldb-api :: functionalities/data-formatter/boolreference/TestFormattersBoolRefPtr.py (1124 of 2163)
UNSUPPORTED: lldb-api :: lang/objc/rdar-12408181/TestRdar12408181.py (1125 of 2163)
PASS: lldb-api :: python_api/default-constructor/TestDefaultConstructorForAPIObjects.py (1126 of 2163)
PASS: lldb-unit :: Host/./HostTests/SocketTests/SocketTest.DomainListenConnectAccept/ipv6 (1127 of 2163)
PASS: lldb-unit :: Utility/./UtilityTests/StreamTest.Indent (1128 of 2163)
PASS: lldb-unit :: Language/Highlighting/./HighlighterTests/HighlighterTest.ClangIdentifiers (1129 of 2163)
PASS: lldb-unit :: Process/minidump/./LLDBMinidumpTests/MinidumpParserTest.GetMemory (1130 of 2163)
PASS: lldb-api :: iohandler/completion/TestIOHandlerCompletion.py (1131 of 2163)
PASS: lldb-api :: functionalities/data-formatter/data-formatter-stl/libcxx/list/loop/TestDataFormatterLibcxxListLoop.py (1132 of 2163)
PASS: lldb-shell :: SymbolFile/DWARF/DW_TAG_variable-DW_AT_const_value.s (1133 of 2163)
PASS: lldb-api :: types/TestCharTypeExpr.py (1134 of 2163)
PASS: lldb-unit :: UnwindAssembly/x86/./UnwindAssemblyx86Tests/Testx86AssemblyInspectionEngine.TestPopEBX (1135 of 2163)
PASS: lldb-unit :: UnwindAssembly/x86/./UnwindAssemblyx86Tests/Testx86AssemblyInspectionEngine.TestPopESI (1136 of 2163)
PASS: lldb-api :: functionalities/data-formatter/poarray/TestPrintObjectArray.py (1137 of 2163)
PASS: lldb-shell :: Heap/heap-cstr.test (1138 of 2163)
PASS: lldb-unit :: SymbolFile/DWARF/./SymbolFileDWARFTests/SymbolFileDWARFTests.TestAbbrevInvalidNULLTag (1139 of 2163)
PASS: lldb-api :: commands/platform/basic/TestPlatformPython.py (1140 of 2163)
PASS: lldb-api :: lang/c/complex_int/TestComplexInt.py (1141 of 2163)
PASS: lldb-unit :: Process/gdb-remote/./ProcessGdbRemoteTests/GDBRemoteCommunicationTest.ReadPacket_checksum (1142 of 2163)
UNSUPPORTED: lldb-api :: tools/lldb-server/TestGdbRemoteModuleInfo.py (1143 of 2163)
PASS: lldb-shell :: ObjectFile/ELF/PT_LOAD-empty.yaml (1144 of 2163)
PASS: lldb-api :: python_api/signals/TestSignalsAPI.py (1145 of 2163)
PASS: lldb-api :: python_api/disassemble-raw-data/TestDisassemble_VST1_64.py (1146 of 2163)
PASS: lldb-api :: functionalities/exec/TestExec.py (1147 of 2163)
PASS: lldb-api :: lang/objc/objc-checker/TestObjCCheckers.py (1148 of 2163)
PASS: lldb-api :: functionalities/data-formatter/compactvectors/TestCompactVectors.py (1149 of 2163)
PASS: lldb-unit :: SymbolFile/NativePDB/./SymbolFileNativePDBTests/PDBFPOProgramToDWARFExpressionTests.UnresolvedRegisterAssignmentReference (1150 of 2163)
PASS: lldb-api :: commands/expression/unwind_expression/TestUnwindExpression.py (1151 of 2163)
PASS: lldb-api :: tools/lldb-server/inferior-crash/TestGdbRemoteSegFault.py (1152 of 2163)
PASS: lldb-unit :: Utility/./UtilityTests/CompletionRequest.ShiftArguments (1153 of 2163)
PASS: lldb-unit :: Symbol/./SymbolTests/SymbolsTest.LocateExecutableSymbolFileForUnknownExecutableAndMissingSymbolFile (1154 of 2163)
PASS: lldb-unit :: Utility/./UtilityTests/RangeDataVector.CustomSort (1155 of 2163)
PASS: lldb-unit :: Utility/./UtilityTests/StreamTest.PutMaxHex64ByteOrderBig (1156 of 2163)
PASS: lldb-unit :: Utility/./UtilityTests/StreamTest.ShiftOperatorStrings (1157 of 2163)
PASS: lldb-shell :: ObjectFile/Breakpad/sections-trailing-func.test (1158 of 2163)
PASS: lldb-api :: commands/expression/call-function/TestCallBuiltinFunction.py (1159 of 2163)
PASS: lldb-unit :: Interpreter/./InterpreterTests/OptionArgParserTest.toBoolean (1160 of 2163)
PASS: lldb-unit :: Utility/./UtilityTests/ScalarTest.Getters (1161 of 2163)
PASS: lldb-unit :: Utility/./UtilityTests/BinaryStreamTest.PutULEB128EightBytes (1162 of 2163)
PASS: lldb-unit :: Utility/./UtilityTests/LogTest.LLDB_LOG_nullptr (1163 of 2163)
PASS: lldb-unit :: Utility/./UtilityTests/BinaryStreamTest.PutSLEB128SixBytes (1164 of 2163)
PASS: lldb-shell :: Breakpoint/ppc64-localentry.test (1165 of 2163)
PASS: lldb-unit :: Utility/./UtilityTests/ArgsTest.GetQuotedCommandString (1166 of 2163)
PASS: lldb-api :: functionalities/var_path/TestVarPath.py (1167 of 2163)
PASS: lldb-api :: functionalities/thread/concurrent_events/TestConcurrentBreakpointsDelayedBreakpointOneWatchpoint.py (1168 of 2163)
PASS: lldb-unit :: ScriptInterpreter/Python/./ScriptInterpreterPythonTests/PythonDataObjectsTest.TestModuleNameResolutionNoDot (1169 of 2163)
PASS: lldb-shell :: Reproducer/Functionalities/TestImageList.test (1170 of 2163)
PASS: lldb-unit :: Utility/./UtilityTests/DataExtractorTest.GetFloatUnaligned (1171 of 2163)
PASS: lldb-unit :: Utility/./UtilityTests/DataExtractorTest.GetDoubleUnaligned (1172 of 2163)
PASS: lldb-shell :: SymbolFile/DWARF/debug-types-signature-loop.s (1173 of 2163)
PASS: lldb-api :: commands/expression/namespace_local_var_same_name_cpp_and_c/TestNamespaceLocalVarSameNameCppAndC.py (1174 of 2163)
UNSUPPORTED: lldb-api :: functionalities/data-formatter/data-formatter-stl/libstdcpp/iterator/TestDataFormatterStdIterator.py (1175 of 2163)
PASS: lldb-api :: lang/objc/ivar-IMP/TestObjCiVarIMP.py (1176 of 2163)
UNSUPPORTED: lldb-api :: functionalities/thread/thread_specific_break_plus_condition/TestThreadSpecificBpPlusCondition.py (1177 of 2163)
PASS: lldb-api :: functionalities/gdb_remote_client/TestRegDefinitionInParts.py (1178 of 2163)
PASS: lldb-unit :: ObjectFile/MachO/./ObjectFileMachOTests/ObjectFileMachOTest.ModuleFromSharedCacheInfo (1179 of 2163)
PASS: lldb-api :: tools/lldb-vscode/module/TestVSCode_module.py (1180 of 2163)
PASS: lldb-unit :: Utility/./UtilityTests/UriParserTest.SchemeHostSeparator4 (1181 of 2163)
PASS: lldb-api :: commands/command/nested_alias/TestNestedAlias.py (1182 of 2163)
PASS: lldb-shell :: SymbolFile/Breakpad/symtab.test (1183 of 2163)
PASS: lldb-unit :: Utility/./UtilityTests/ScalarTest.Division (1184 of 2163)
PASS: lldb-shell :: SymbolFile/DWARF/debug_line-relative_path.s (1185 of 2163)
PASS: lldb-shell :: SymbolFile/NativePDB/ast-types.cpp (1186 of 2163)
UNSUPPORTED: lldb-api :: python_api/event/TestEvents.py (1187 of 2163)
PASS: lldb-unit :: Utility/./UtilityTests/XcodeSDKTest.ParseTest (1188 of 2163)
PASS: lldb-api :: functionalities/inline-stepping/TestInlineStepping.py (1189 of 2163)
UNSUPPORTED: lldb-shell :: Register/x86-64-xmm16-write.test (1190 of 2163)
PASS: lldb-api :: functionalities/thread/thread_exit/TestThreadExit.py (1191 of 2163)
PASS: lldb-api :: terminal/TestSTTYBeforeAndAfter.py (1192 of 2163)
PASS: lldb-shell :: Settings/TestSettingsSet.test (1193 of 2163)
PASS: lldb-api :: functionalities/data-formatter/parray/TestPrintArray.py (1194 of 2163)
PASS: lldb-api :: functionalities/tail_call_frames/disambiguate_call_site/TestDisambiguateCallSite.py (1195 of 2163)
PASS: lldb-unit :: Utility/./UtilityTests/ProcessInstanceInfo.DumpTable (1196 of 2163)
PASS: lldb-unit :: Utility/./UtilityTests/OptionsWithRawTest.EmptySuffix (1197 of 2163)
PASS: lldb-shell :: Reproducer/TestReuseDirectory.test (1198 of 2163)
PASS: lldb-api :: tools/lldb-server/TestGdbRemote_vCont.py (1199 of 2163)
PASS: lldb-api :: iohandler/unicode/TestUnicode.py (1200 of 2163)
PASS: lldb-api :: lang/cpp/multiple-inheritance/TestCppMultipleInheritance.py (1201 of 2163)
PASS: lldb-unit :: Utility/./UtilityTests/UriParserTest.PortOverflow (1202 of 2163)
PASS: lldb-api :: lang/cpp/unique-types/TestUniqueTypes.py (1203 of 2163)
PASS: lldb-api :: functionalities/breakpoint/objc/TestObjCBreakpoints.py (1204 of 2163)
PASS: lldb-shell :: ObjectFile/PECOFF/uuid.yaml (1205 of 2163)
PASS: lldb-unit :: Utility/./UtilityTests/StreamTest.AddressRange (1206 of 2163)
PASS: lldb-shell :: SymbolFile/Breakpad/unwind-via-raSearch.test (1207 of 2163)
PASS: lldb-api :: commands/expression/test/TestExprs.py (1208 of 2163)
PASS: lldb-unit :: Process/./ProcessEventDataTests/ProcessEventDataTest.ShouldStop (1209 of 2163)
UNSUPPORTED: lldb-shell :: SymbolFile/PDB/pointers.test (1210 of 2163)
PASS: lldb-shell :: SymbolFile/NativePDB/ast-functions.cpp (1211 of 2163)
UNSUPPORTED: lldb-api :: functionalities/data-formatter/data-formatter-stl/libstdcpp/smart_ptr/TestDataFormatterStdSmartPtr.py (1212 of 2163)
PASS: lldb-unit :: Utility/./UtilityTests/EventTest.DumpEventDataBytes (1213 of 2163)
PASS: lldb-api :: functionalities/thread/concurrent_events/TestConcurrentWatchpointDelayWatchpointOneBreakpoint.py (1214 of 2163)
PASS: lldb-api :: lang/c/shared_lib/TestSharedLib.py (1215 of 2163)
PASS: lldb-api :: commands/watchpoints/hello_watchpoint/TestMyFirstWatchpoint.py (1216 of 2163)
PASS: lldb-api :: functionalities/thread/exit_during_break/TestExitDuringBreak.py (1217 of 2163)
PASS: lldb-unit :: Utility/./UtilityTests/StringListTest.GetMaxStringLengthMixed (1218 of 2163)
PASS: lldb-shell :: SymbolFile/DWARF/debug-types-address-ranges.s (1219 of 2163)
UNSUPPORTED: lldb-api :: functionalities/signal/handle-segv/TestHandleSegv.py (1220 of 2163)
PASS: lldb-api :: functionalities/gdb_remote_client/TestWriteMemory.py (1221 of 2163)
PASS: lldb-shell :: VSCode/TestOptions.test (1222 of 2163)
PASS: lldb-shell :: SymbolFile/DWARF/debug-line-basic.s (1223 of 2163)
PASS: lldb-unit :: Utility/./UtilityTests/StreamTest.PutMaxHex64ByteOrderLittle (1224 of 2163)
PASS: lldb-unit :: Utility/./UtilityTests/StringExtractorTest.GetNameColonValueSuccess (1225 of 2163)
PASS: lldb-unit :: Utility/./UtilityTests/ListenerTest.GetEventImmediate (1226 of 2163)
PASS: lldb-api :: commands/expression/completion-in-lambda-and-unnamed-class/TestCompletionInLambdaAndUnnamedClass.py (1227 of 2163)
PASS: lldb-api :: tools/lldb-vscode/coreFile/TestVSCode_coreFile.py (1228 of 2163)
PASS: lldb-shell :: Unwind/trap_frame_sym_ctx.test (1229 of 2163)
UNSUPPORTED: lldb-shell :: SymbolFile/PDB/ast-restore.test (1230 of 2163)
PASS: lldb-api :: functionalities/breakpoint/breakpoint_by_file_colon_line/TestBreakpointByFileColonLine.py (1231 of 2163)
PASS: lldb-unit :: Utility/./UtilityTests/VMRange.CollectionContains (1232 of 2163)
PASS: lldb-api :: lang/objc/foundation/TestObjCMethodsNSError.py (1233 of 2163)
PASS: lldb-unit :: Symbol/./SymbolTests/TestClangASTImporter.ImportInvalidType (1234 of 2163)
PASS: lldb-api :: functionalities/thread/concurrent_events/TestConcurrentTwoWatchpointsOneBreakpoint.py (1235 of 2163)
UNSUPPORTED: lldb-api :: functionalities/data-formatter/data-formatter-stl/libstdcpp/list/TestDataFormatterStdList.py (1236 of 2163)
PASS: lldb-unit :: Utility/./UtilityTests/StringExtractorTest.GetHexU8_Underflow (1237 of 2163)
UNSUPPORTED: lldb-api :: functionalities/process_save_core/TestProcessSaveCore.py (1238 of 2163)
PASS: lldb-shell :: Breakpoint/debug_rnglist_rlestartend.test (1239 of 2163)
PASS: lldb-api :: lang/cpp/template/TestTemplateArgs.py (1240 of 2163)
PASS: lldb-api :: functionalities/gdb_remote_client/TestNestedRegDefinitions.py (1241 of 2163)
PASS: lldb-api :: commands/register/register/register_command/TestRegisters.py (1242 of 2163)
PASS: lldb-unit :: Utility/./UtilityTests/Flags.AnySet (1243 of 2163)
PASS: lldb-unit :: Utility/./UtilityTests/RangeDataVector.FindEntryThatContains_Overlap (1244 of 2163)
PASS: lldb-api :: lang/objc/rdar-11355592/TestRdar11355592.py (1245 of 2163)
PASS: lldb-shell :: Breakpoint/debug_rnglistx_rlex.test (1246 of 2163)
PASS: lldb-unit :: Utility/./UtilityTests/CompletionRequest.TestCompletionOwnership (1247 of 2163)
PASS: lldb-unit :: Utility/./UtilityTests/RangeTest.ContainsAddrInvalid (1248 of 2163)
PASS: lldb-unit :: Utility/./UtilityTests/BinaryStreamTest.PutSLEB128SevenBytes (1249 of 2163)
PASS: lldb-shell :: Commands/command-regex-unalias.test (1250 of 2163)
UNSUPPORTED: lldb-api :: commands/register/register/intel_xtended_registers/mpx_bound_violation/TestBoundViolation.py (1251 of 2163)
PASS: lldb-unit :: Utility/./UtilityTests/BinaryStreamTest.PutSLEB128TwoBytes (1252 of 2163)
PASS: lldb-api :: lang/objc/foundation/TestSymbolTable.py (1253 of 2163)
PASS: lldb-unit :: UnwindAssembly/x86/./UnwindAssemblyx86Tests/Testx86AssemblyInspectionEngine.TestSpArithx86_64Augmented (1254 of 2163)
PASS: lldb-api :: functionalities/data-formatter/data-formatter-stl/libcxx/initializerlist/TestInitializerList.py (1255 of 2163)
PASS: lldb-api :: functionalities/data-formatter/language_category_updates/TestDataFormatterLanguageCategoryUpdates.py (1256 of 2163)
PASS: lldb-shell :: ObjectFile/MachO/symtab.yaml (1257 of 2163)
PASS: lldb-api :: macosx/add-dsym/TestAddDsymMidExecutionCommand.py (1258 of 2163)
PASS: lldb-shell :: Reproducer/TestMultipleTargets.test (1259 of 2163)
PASS: lldb-api :: tools/lldb-server/TestLldbGdbServer.py (1260 of 2163)
PASS: lldb-unit :: Host/./HostTests/NativeProcessProtocolTest.SetBreakpointFailWrite (1261 of 2163)
UNSUPPORTED: lldb-api :: functionalities/breakpoint/breakpoint_in_delayslot/TestAvoidBreakpointInDelaySlot.py (1262 of 2163)
PASS: lldb-api :: macosx/macCatalyst/TestMacCatalyst.py (1263 of 2163)
PASS: lldb-shell :: SymbolFile/DWARF/split-dwarf-multiple-cu.ll (1264 of 2163)
PASS: lldb-api :: lang/cpp/static_methods/TestCPPStaticMethods.py (1265 of 2163)
PASS: lldb-unit :: Utility/./UtilityTests/StatusTest.Formatv (1266 of 2163)
PASS: lldb-unit :: Utility/./UtilityTests/ArchSpecTest.MergeFrom (1267 of 2163)
PASS: lldb-unit :: Process/gdb-remote/./ProcessGdbRemoteTests/GDBRemoteCommunicationClientTest.SaveRestoreRegistersNoSuffix (1268 of 2163)
PASS: lldb-unit :: Utility/./UtilityTests/VMRange.IsValid (1269 of 2163)
PASS: lldb-unit :: DataFormatter/./LLDBFormatterTests/TypeMatcherTests.GetMatchStringExactName (1270 of 2163)
PASS: lldb-unit :: Process/minidump/./LLDBMinidumpTests/MinidumpParserTest.MinidumpDuplicateModuleMappedSecond (1271 of 2163)
PASS: lldb-unit :: Language/Highlighting/./HighlighterTests/HighlighterTest.ClangCursorOutOfBounds (1272 of 2163)
PASS: lldb-unit :: ObjectFile/PECOFF/./ObjectFilePECOFFTests/PECallFrameInfoTest.Basic_eh (1273 of 2163)
PASS: lldb-unit :: Utility/./UtilityTests/StringLexerTest.HasAtLeast (1274 of 2163)
PASS: lldb-api :: python_api/process/TestProcessAPI.py (1275 of 2163)
PASS: lldb-api :: functionalities/ubsan/basic/TestUbsanBasic.py (1276 of 2163)
PASS: lldb-unit :: Core/./LLDBCoreTests/MangledTest.EmptyForInvalidName (1277 of 2163)
PASS: lldb-shell :: Process/TestEnvironment.test (1278 of 2163)
PASS: lldb-shell :: SymbolFile/DWARF/debug_ranges_and_rnglists.test (1279 of 2163)
PASS: lldb-api :: lang/cpp/call-function/TestCallCPPFunction.py (1280 of 2163)
PASS: lldb-unit :: Host/./HostTests/File.GetStreamFromDescriptor (1281 of 2163)
PASS: lldb-unit :: ScriptInterpreter/Python/./ScriptInterpreterPythonTests/PythonDataObjectsTest.TestPythonIntegerToStructuredInteger (1282 of 2163)
PASS: lldb-unit :: Language/Highlighting/./HighlighterTests/HighlighterTest.HighlighterSelectionPath (1283 of 2163)
PASS: lldb-unit :: Utility/./UtilityTests/StringListTest.Join (1284 of 2163)
PASS: lldb-unit :: Host/./HostTests/NativeProcessProtocolTest.ReadMemoryWithoutTrap (1285 of 2163)
PASS: lldb-unit :: Expression/./ExpressionTests/CppModuleConfigurationTest.Linux (1286 of 2163)
PASS: lldb-shell :: ObjectFile/wasm/basic.yaml (1287 of 2163)
PASS: lldb-unit :: Utility/./UtilityTests/StreamTeeTest.Constructor2Streams (1288 of 2163)
PASS: lldb-unit :: Utility/./UtilityTests/ScalarTest.LongLongAssigmentOperator (1289 of 2163)
PASS: lldb-api :: functionalities/gdb_remote_client/TestNoGPacketSupported.py (1290 of 2163)
PASS: lldb-shell :: ObjectFile/MachO/subsections.yaml (1291 of 2163)
PASS: lldb-unit :: Language/CPlusPlus/./LanguageCPlusPlusTests/CPlusPlusLanguage.MethodNameParsing (1292 of 2163)
PASS: lldb-api :: functionalities/data-formatter/data-formatter-stl/libcxx/optional/TestDataFormatterLibcxxOptional.py (1293 of 2163)
PASS: lldb-unit :: UnwindAssembly/x86/./UnwindAssemblyx86Tests/Testx86AssemblyInspectionEngine.TestPush0 (1294 of 2163)
PASS: lldb-api :: lang/cpp/template-specialization-type/TestTemplateSpecializationType.py (1295 of 2163)
PASS: lldb-unit :: Utility/./UtilityTests/BinaryStreamTest.PutULEB128SixBytes (1296 of 2163)
PASS: lldb-api :: types/TestFloatTypesExpr.py (1297 of 2163)
PASS: lldb-shell :: SymbolFile/DWARF/debug-types-dwo-cross-reference.cpp (1298 of 2163)
PASS: lldb-unit :: Utility/./UtilityTests/BinaryStreamTest.PutULEB128Zero (1299 of 2163)
PASS: lldb-api :: commands/frame/recognizer/TestFrameRecognizer.py (1300 of 2163)
PASS: lldb-api :: lang/cpp/global_operators/TestCppGlobalOperators.py (1301 of 2163)
PASS: lldb-unit :: Process/minidump/./LLDBMinidumpTests/MinidumpParserTest.GetMemoryRegionInfoFromMemory64List (1302 of 2163)
PASS: lldb-unit :: Utility/./UtilityTests/RegularExpression.Valid (1303 of 2163)
PASS: lldb-api :: python_api/sbvalue_const_addrof/TestSBValueConstAddrOf.py (1304 of 2163)
PASS: lldb-unit :: Utility/./UtilityTests/BinaryStreamTest.PutULEB128OneByte (1305 of 2163)
PASS: lldb-api :: python_api/lldbutil/iter/TestLLDBIterator.py (1306 of 2163)
PASS: lldb-api :: functionalities/inferior-crashing/recursive-inferior/TestRecursiveInferior.py (1307 of 2163)
PASS: lldb-shell :: SymbolFile/DWARF/limit-debug-info.s (1308 of 2163)
PASS: lldb-api :: lang/cpp/accelerator-table/TestCPPAccelerator.py (1309 of 2163)
PASS: lldb-api :: commands/expression/import-std-module/vector-bool/TestVectorBoolFromStdModule.py (1310 of 2163)
PASS: lldb-unit :: Process/gdb-remote/./ProcessGdbRemoteTests/GDBRemoteClientBaseTest.SendContinueAndWait (1311 of 2163)
PASS: lldb-api :: functionalities/unwind/noreturn/module-end/TestNoReturnModuleEnd.py (1312 of 2163)
UNSUPPORTED: lldb-shell :: SymbolFile/PDB/udt-layout.test (1313 of 2163)
PASS: lldb-unit :: Utility/./UtilityTests/OptionsWithRawTest.EmptySuffixSingleWhitespace (1314 of 2163)
PASS: lldb-unit :: Utility/./UtilityTests/ProcessInstanceInfoMatch.Name (1315 of 2163)
PASS: lldb-unit :: UnwindAssembly/x86/./UnwindAssemblyx86Tests/Testx86AssemblyInspectionEngine.TestPopEDI (1316 of 2163)
PASS: lldb-shell :: ObjectFile/PECOFF/invalid-export-table.yaml (1317 of 2163)
PASS: lldb-api :: sample_test/TestSampleTest.py (1318 of 2163)
UNSUPPORTED: lldb-api :: functionalities/darwin_log/format/TestDarwinLogMessageFormat.py (1319 of 2163)
PASS: lldb-api :: lang/cpp/stl/TestSTL.py (1320 of 2163)
PASS: lldb-api :: functionalities/type_lookup/TestTypeLookup.py (1321 of 2163)
PASS: lldb-api :: functionalities/data-formatter/data-formatter-synthval/TestDataFormatterSynthVal.py (1322 of 2163)
PASS: lldb-shell :: SymbolFile/NativePDB/function-types-builtins.cpp (1323 of 2163)
PASS: lldb-shell :: ObjectFile/ELF/PT_TLS-overlap-PT_LOAD.yaml (1324 of 2163)
PASS: lldb-unit :: Target/./TargetTests/ExecutionContextTest.GetByteOrderTarget (1325 of 2163)
PASS: lldb-api :: functionalities/backticks/TestBackticksWithoutATarget.py (1326 of 2163)
UNSUPPORTED: lldb-api :: functionalities/darwin_log/source/info/TestDarwinLogSourceInfo.py (1327 of 2163)
PASS: lldb-unit :: Process/gdb-remote/./ProcessGdbRemoteTests/GDBRemoteCommunicationClientTest.GetModulesInfoInvalidResponse (1328 of 2163)
PASS: lldb-unit :: Core/./LLDBCoreTests/RichManglingContextTest.Basic (1329 of 2163)
PASS: lldb-unit :: SymbolFile/NativePDB/./SymbolFileNativePDBTests/PDBFPOProgramToDWARFExpressionTests.SingleAssignmentRegisterRef (1330 of 2163)
PASS: lldb-api :: lang/objc/objc-super/TestObjCSuper.py (1331 of 2163)
PASS: lldb-shell :: SymbolFile/DWARF/deterministic-build.cpp (1332 of 2163)
PASS: lldb-unit :: Utility/./UtilityTests/StreamTest.PutRawBytesToBigEndian (1333 of 2163)
PASS: lldb-unit :: Utility/./UtilityTests/CompletionRequest.FakeLastArg (1334 of 2163)
PASS: lldb-unit :: Utility/./UtilityTests/RegularExpression.CopyAssignment (1335 of 2163)
PASS: lldb-api :: commands/expression/radar_9673664/TestExprHelpExamples.py (1336 of 2163)
PASS: lldb-unit :: Interpreter/./InterpreterTests/OptionArgParserTest.toChar (1337 of 2163)
PASS: lldb-api :: lang/c/conflicting-symbol/TestConflictingSymbol.py (1338 of 2163)
PASS: lldb-api :: functionalities/tail_call_frames/sbapi_support/TestTailCallFrameSBAPI.py (1339 of 2163)
PASS: lldb-api :: functionalities/data-formatter/data-formatter-objc/TestDataFormatterObjCCF.py (1340 of 2163)
PASS: lldb-api :: commands/expression/pr35310/TestExprsBug35310.py (1341 of 2163)
PASS: lldb-api :: commands/expression/context-object-objc/TestContextObjectObjc.py (1342 of 2163)
PASS: lldb-api :: commands/expression/scoped_enums/TestScopedEnumType.py (1343 of 2163)
PASS: lldb-api :: functionalities/thread/step_out/TestThreadStepOut.py (1344 of 2163)
PASS: lldb-api :: commands/expression/completion/TestExprCompletion.py (1345 of 2163)
PASS: lldb-unit :: debugserver/./debugserverTests/RNBSocket.LoopBackListenIPv4 (1346 of 2163)
PASS: lldb-unit :: Utility/./UtilityTests/StringExtractorTest.GetHexBytes (1347 of 2163)
PASS: lldb-unit :: Utility/./UtilityTests/OptionsWithRawTest.UnterminatedQuote (1348 of 2163)
PASS: lldb-shell :: SymbolFile/NativePDB/ast-methods.cpp (1349 of 2163)
PASS: lldb-unit :: Target/./TargetTests/ModuleCacheTest.GetAndPutStrangeHostname (1350 of 2163)
PASS: lldb-shell :: SymbolFile/DWARF/debug-names-compressed.cpp (1351 of 2163)
PASS: lldb-shell :: BuildScript/modes.test (1352 of 2163)
PASS: lldb-api :: commands/target/dump-symtab-demangle/TestDumpSymtabDemangle.py (1353 of 2163)
PASS: lldb-unit :: Utility/./UtilityTests/StreamTest.PutHex32ByteOrderBig (1354 of 2163)
PASS: lldb-api :: commands/gui/basic/TestGuiBasic.py (1355 of 2163)
PASS: lldb-unit :: Utility/./UtilityTests/BinaryStreamTest.PutULEB128One (1356 of 2163)
PASS: lldb-unit :: Host/./HostTests/NativeProcessProtocolTest.SetBreakpoint (1357 of 2163)
PASS: lldb-unit :: Utility/./UtilityTests/SubsystemRAIITest.SubsystemWithErrorFailure (1358 of 2163)
PASS: lldb-unit :: Utility/./UtilityTests/UUIDTest.Validity (1359 of 2163)
PASS: lldb-unit :: Utility/./UtilityTests/RecordReplayTest.InstrumentedBarPtr (1360 of 2163)
PASS: lldb-api :: lang/cpp/gmodules-templates/TestGModules.py (1361 of 2163)
PASS: lldb-api :: commands/platform/file/read/TestPlatformFileRead.py (1362 of 2163)
PASS: lldb-shell :: SymbolFile/DWARF/debug_line-tombstone.s (1363 of 2163)
PASS: lldb-api :: functionalities/data-formatter/array_typedef/TestArrayTypedef.py (1364 of 2163)
PASS: lldb-api :: macosx/order/TestOrderFile.py (1365 of 2163)
PASS: lldb-shell :: ObjectFile/PECOFF/symbol.yaml (1366 of 2163)
UNSUPPORTED: lldb-shell :: SymbolFile/PDB/class-layout.test (1367 of 2163)
PASS: lldb-api :: python_api/watchpoint/condition/TestWatchpointConditionAPI.py (1368 of 2163)
PASS: lldb-api :: functionalities/data-formatter/nsarraysynth/TestNSArraySynthetic.py (1369 of 2163)
PASS: lldb-shell :: ObjectFile/ELF/section-permissions.yaml (1370 of 2163)
PASS: lldb-unit :: ObjectFile/PECOFF/./ObjectFilePECOFFTests/PECallFrameInfoTest.Chained_eh (1371 of 2163)
PASS: lldb-shell :: SymbolFile/DWARF/find-basic-function.cpp (1372 of 2163)
PASS: lldb-api :: commands/watchpoints/watchpoint_commands/TestWatchpointCommands.py (1373 of 2163)
PASS: lldb-unit :: Utility/./UtilityTests/CompletionRequest.TryCompleteCurrentArgGood (1374 of 2163)
UNSUPPORTED: lldb-shell :: Register/aarch64-gp-read.test (1375 of 2163)
PASS: lldb-api :: lang/objc/objc-struct-return/TestObjCStructReturn.py (1376 of 2163)
PASS: lldb-api :: lang/cpp/scope/TestCppScope.py (1377 of 2163)
PASS: lldb-api :: functionalities/gdb_remote_client/TestProcessConnect.py (1378 of 2163)
PASS: lldb-api :: functionalities/postmortem/minidump/TestMiniDump.py (1379 of 2163)
PASS: lldb-api :: lang/objc/modules-auto-import/TestModulesAutoImport.py (1380 of 2163)
PASS: lldb-unit :: Utility/./UtilityTests/RangeTest.SetRangeBase (1381 of 2163)
PASS: lldb-api :: functionalities/inferior-changed/TestInferiorChanged.py (1382 of 2163)
PASS: lldb-unit :: Thread/./ThreadTests/ThreadTest.SetStopInfo (1383 of 2163)
PASS: lldb-shell :: Quit/TestQuitExitCode-30.test (1384 of 2163)
PASS: lldb-unit :: debugserver/./debugserverTests/RNBSocket.LoopBackConnectIPv4 (1385 of 2163)
PASS: lldb-api :: commands/settings/quoting/TestQuoting.py (1386 of 2163)
PASS: lldb-api :: functionalities/breakpoint/comp_dir_symlink/TestCompDirSymLink.py (1387 of 2163)
UNSUPPORTED: lldb-api :: benchmarks/expression/TestRepeatedExprs.py (1388 of 2163)
PASS: lldb-shell :: SymbolFile/DWARF/static_scope.s (1389 of 2163)
PASS: lldb-api :: tools/lldb-server/TestGdbRemoteAttach.py (1390 of 2163)
PASS: lldb-api :: python_api/exprpath_synthetic/TestExprPathSynthetic.py (1391 of 2163)
PASS: lldb-unit :: Host/./HostTests/SocketTests/SocketTest.TCPGetAddress/ipv6 (1392 of 2163)
PASS: lldb-unit :: ScriptInterpreter/Python/./ScriptInterpreterPythonTests/PythonDataObjectsTest.TestRun (1393 of 2163)
PASS: lldb-unit :: Utility/./UtilityTests/UriParserTest.MinimalPort (1394 of 2163)
PASS: lldb-api :: python_api/formatters/TestFormattersSBAPI.py (1395 of 2163)
PASS: lldb-api :: commands/watchpoints/watchpoint_commands/command/TestWatchpointCommandLLDB.py (1396 of 2163)
PASS: lldb-api :: functionalities/thread/state_after_expression/TestStateAfterExpression.py (1397 of 2163)
UNSUPPORTED: lldb-shell :: Register/x86-zmm-read.test (1398 of 2163)
PASS: lldb-unit :: Utility/./UtilityTests/UUIDTest.StringConverion (1399 of 2163)
PASS: lldb-unit :: UnwindAssembly/x86/./UnwindAssemblyx86Tests/Testx86AssemblyInspectionEngine.Testi386IgnoredRegisters (1400 of 2163)
PASS: lldb-shell :: SymbolFile/NativePDB/break-by-line.cpp (1401 of 2163)
PASS: lldb-unit :: SymbolFile/DWARF/./SymbolFileDWARFTests/SymbolFileDWARFTests.ParseAranges (1402 of 2163)
PASS: lldb-api :: lang/objc/objc-static-method-stripped/TestObjCStaticMethodStripped.py (1403 of 2163)
PASS: lldb-api :: python_api/file_handle/TestFileHandle.py (1404 of 2163)
PASS: lldb-unit :: Process/gdb-remote/./ProcessGdbRemoteTests/GDBRemoteClientBaseTest.SendContinueAndInterrupt2PacketBug (1405 of 2163)
PASS: lldb-api :: api/check_public_api_headers/TestPublicAPIHeaders.py (1406 of 2163)
PASS: lldb-unit :: Utility/./UtilityTests/StringListTest.JoinSingle (1407 of 2163)
PASS: lldb-unit :: SymbolFile/NativePDB/./SymbolFileNativePDBTests/PDBFPOProgramToDWARFExpressionTests.UnresolvedCyclicRegisterAssignmentReference (1408 of 2163)
PASS: lldb-unit :: Editline/./EditlineTests/EditlineTestFixture.EditlineReceivesMultiLineText (1409 of 2163)
PASS: lldb-shell :: ObjectFile/PECOFF/dep-modules.yaml (1410 of 2163)
PASS: lldb-shell :: Register/x86-64-ymm-read.test (1411 of 2163)
PASS: lldb-unit :: Target/./TargetTests/RemoteAwarePlatformTest.TestResolveExecutabelOnClientByPlatform (1412 of 2163)
PASS: lldb-unit :: Language/Highlighting/./HighlighterTests/HighlighterTest.ClangStringLiterals (1413 of 2163)
PASS: lldb-api :: functionalities/plugins/command_plugin/TestPluginCommands.py (1414 of 2163)
PASS: lldb-unit :: Utility/./UtilityTests/BinaryStreamTest.PutSLEB128OneByte (1415 of 2163)
PASS: lldb-shell :: Reproducer/TestDriverOptions.test (1416 of 2163)
PASS: lldb-shell :: SymbolFile/DWARF/find-variable-file.cpp (1417 of 2163)
UNSUPPORTED: lldb-api :: functionalities/data-formatter/data-formatter-stl/libstdcpp/map/TestDataFormatterStdMap.py (1418 of 2163)
PASS: lldb-shell :: SymbolFile/DWARF/dwarf5-debug_line.s (1419 of 2163)
PASS: lldb-unit :: Utility/./UtilityTests/VASprintfTest.EncodingError (1420 of 2163)
PASS: lldb-shell :: SymbolFile/DWARF/debug_loc-aslr.s (1421 of 2163)
PASS: lldb-unit :: Utility/./UtilityTests/AnsiTerminal.Basic (1422 of 2163)
PASS: lldb-shell :: SymbolFile/NativePDB/tag-types.cpp (1423 of 2163)
PASS: lldb-unit :: Utility/./UtilityTests/StringListTest.PopBack (1424 of 2163)
PASS: lldb-unit :: DataFormatter/./LLDBFormatterTests/StringPrinterTests.SwiftUTF8 (1425 of 2163)
PASS: lldb-api :: commands/expression/import-std-module/no-std-module/TestMissingStdModule.py (1426 of 2163)
PASS: lldb-shell :: ObjectFile/ELF/minidebuginfo-corrupt-xz.yaml (1427 of 2163)
PASS: lldb-unit :: Utility/./UtilityTests/RangeVector.CombineConsecutiveRanges (1428 of 2163)
UNSUPPORTED: lldb-api :: commands/expression/macros/TestMacros.py (1429 of 2163)
UNSUPPORTED: lldb-api :: functionalities/darwin_log/filter/regex/category/TestDarwinLogFilterRegexCategory.py (1430 of 2163)
PASS: lldb-api :: driver/batch_mode/TestBatchMode.py (1431 of 2163)
PASS: lldb-unit :: Utility/./UtilityTests/StreamTest.PutULEB128 (1432 of 2163)
PASS: lldb-unit :: Utility/./UtilityTests/StringListTest.AppendStringCString (1433 of 2163)
PASS: lldb-unit :: Utility/./UtilityTests/StructuredDataTest.StringDump (1434 of 2163)
PASS: lldb-api :: macosx/thread_suspend/TestInternalThreadSuspension.py (1435 of 2163)
PASS: lldb-unit :: UnwindAssembly/x86/./UnwindAssemblyx86Tests/Testx86AssemblyInspectionEngine.TestSubRSP (1436 of 2163)
PASS: lldb-unit :: Utility/./UtilityTests/CompletionRequest.Constructor (1437 of 2163)
PASS: lldb-api :: functionalities/data-formatter/data-formatter-stl/libstdcpp/unique_ptr/invalid/TestDataFormatterInvalidStdUniquePtr.py (1438 of 2163)
PASS: lldb-api :: functionalities/inferior-crashing/TestInferiorCrashing.py (1439 of 2163)
PASS: lldb-shell :: BuildScript/script-args.test (1440 of 2163)
PASS: lldb-api :: commands/frame/language/TestGuessLanguage.py (1441 of 2163)
PASS: lldb-shell :: SymbolFile/DWARF/debug_aranges-empty-section.s (1442 of 2163)
UNSUPPORTED: lldb-shell :: Unwind/eh-frame-augment-noop.test (1443 of 2163)
PASS: lldb-unit :: Utility/./UtilityTests/UriParserTest.Empty (1444 of 2163)
PASS: lldb-unit :: Utility/./UtilityTests/StringListTest.DefaultConstructor (1445 of 2163)
PASS: lldb-unit :: Symbol/./SymbolTests/TestTypeSystemClang.TestDisplayName (1446 of 2163)
PASS: lldb-api :: commands/expression/import-std-module/weak_ptr/TestWeakPtrFromStdModule.py (1447 of 2163)
PASS: lldb-shell :: ObjectFile/ELF/basic-info.yaml (1448 of 2163)
PASS: lldb-api :: tools/lldb-server/TestGdbRemoteExitCode.py (1449 of 2163)
PASS: lldb-unit :: Utility/./UtilityTests/XcodeSDKTest.MergeTest (1450 of 2163)
PASS: lldb-api :: functionalities/inferior-assert/TestInferiorAssert.py (1451 of 2163)
PASS: lldb-api :: lang/objc/objc-builtin-types/TestObjCBuiltinTypes.py (1452 of 2163)
PASS: lldb-shell :: Driver/TestConvenienceVariables.test (1453 of 2163)
PASS: lldb-unit :: Utility/./UtilityTests/StringExtractorTest.GetU64BigEndian (1454 of 2163)
PASS: lldb-api :: commands/statistics/basic/TestStats.py (1455 of 2163)
PASS: lldb-unit :: Instruction/./EmulatorTests/TestAArch64Emulator.TestOverflow (1456 of 2163)
UNSUPPORTED: lldb-api :: functionalities/darwin_log/filter/regex/activity/TestDarwinLogFilterRegexActivity.py (1457 of 2163)
PASS: lldb-api :: functionalities/postmortem/mach-core/TestMachCore.py (1458 of 2163)
PASS: lldb-api :: functionalities/tsan/cpp_global_location/TestTsanCPPGlobalLocation.py (1459 of 2163)
UNSUPPORTED: lldb-shell :: Process/Windows/exception_access_violation.cpp (1460 of 2163)
PASS: lldb-api :: commands/watchpoints/watchpoint_commands/command/TestWatchpointCommandPython.py (1461 of 2163)
PASS: lldb-unit :: Symbol/./SymbolTests/TestTypeSystemClang.TestDisplayNameEmpty (1462 of 2163)
PASS: lldb-unit :: Expression/./ExpressionTests/ClangHostTest.MacOSX (1463 of 2163)
PASS: lldb-unit :: Utility/./UtilityTests/StringListTest.ForRangeEmpty (1464 of 2163)
PASS: lldb-unit :: Utility/./UtilityTests/StringListTest.SplitIntoLines (1465 of 2163)
PASS: lldb-api :: macosx/queues/TestQueues.py (1466 of 2163)
PASS: lldb-shell :: ScriptInterpreter/Python/python.test (1467 of 2163)
PASS: lldb-unit :: Utility/./UtilityTests/RecordReplayTest.InstrumentedFooSameThis (1468 of 2163)
PASS: lldb-api :: functionalities/gdb_remote_client/TestNoWatchpointSupportInfo.py (1469 of 2163)
PASS: lldb-unit :: Language/Highlighting/./HighlighterTests/HighlighterTest.ClangCursorPosInOtherToken (1470 of 2163)
PASS: lldb-api :: lang/cpp/std-function-step-into-callable/TestStdFunctionStepIntoCallable.py (1471 of 2163)
PASS: lldb-api :: lang/c/step-target/TestStepTarget.py (1472 of 2163)
PASS: lldb-api :: python_api/objc_type/TestObjCType.py (1473 of 2163)
PASS: lldb-unit :: Process/minidump/./LLDBMinidumpTests/RegisterContextMinidump.CheckRegisterContextMinidump_ARM (1474 of 2163)
PASS: lldb-api :: functionalities/mtc/simple/TestMTCSimple.py (1475 of 2163)
PASS: lldb-api :: functionalities/dlopen_other_executable/TestDlopenOtherExecutable.py (1476 of 2163)
UNSUPPORTED: lldb-api :: lang/c/typedef/Testtypedef.py (1477 of 2163)
PASS: lldb-unit :: DataFormatter/./LLDBFormatterTests/StringPrinterTests.CxxASCII (1478 of 2163)
PASS: lldb-api :: lang/objc/modules-cache/TestClangModulesCache.py (1479 of 2163)
PASS: lldb-shell :: Quit/TestQuitExitCodeHexA.test (1480 of 2163)
PASS: lldb-unit :: SymbolFile/NativePDB/./SymbolFileNativePDBTests/PDBFPOProgramToDWARFExpressionTests.UnresolvedDependentCyclicRegisterAssignmentReference (1481 of 2163)
PASS: lldb-unit :: Utility/./UtilityTests/RangeTest.ContainsEndInclusiveInvalid (1482 of 2163)
PASS: lldb-api :: functionalities/breakpoint/breakpoint_hit_count/TestBreakpointHitCount.py (1483 of 2163)
PASS: lldb-unit :: Utility/./UtilityTests/StringExtractorTest.InitEmpty (1484 of 2163)
PASS: lldb-unit :: Utility/./UtilityTests/StringListTest.AppendStringStdString (1485 of 2163)
PASS: lldb-api :: functionalities/thread/concurrent_events/TestConcurrentDelaySignalBreak.py (1486 of 2163)
PASS: lldb-shell :: Driver/TestFile.test (1487 of 2163)
PASS: lldb-api :: functionalities/breakpoint/auto_continue/TestBreakpointAutoContinue.py (1488 of 2163)
PASS: lldb-api :: functionalities/data-formatter/stringprinter/TestStringPrinter.py (1489 of 2163)
PASS: lldb-api :: functionalities/breakpoint/serialize/TestBreakpointSerialization.py (1490 of 2163)
PASS: lldb-shell :: Minidump/dump-all.test (1491 of 2163)
PASS: lldb-shell :: Unwind/thread-step-out-ret-addr-check.test (1492 of 2163)
PASS: lldb-api :: python_api/target/TestTargetAPI.py (1493 of 2163)
PASS: lldb-api :: functionalities/data-formatter/user-format-vs-summary/TestUserFormatVsSummary.py (1494 of 2163)
PASS: lldb-api :: commands/help/TestHelp.py (1495 of 2163)
PASS: lldb-shell :: Minidump/memory-region.yaml (1496 of 2163)
PASS: lldb-api :: lang/c/const_variables/TestConstVariables.py (1497 of 2163)
PASS: lldb-shell :: SymbolFile/DWARF/debug_ranges-missing-section.s (1498 of 2163)
PASS: lldb-shell :: Settings/TestFrameFormatNoColor.test (1499 of 2163)
PASS: lldb-api :: commands/expression/multiline-navigation/TestMultilineNavigation.py (1500 of 2163)
PASS: lldb-api :: lang/objc/rdar-10967107/TestRdar10967107.py (1501 of 2163)
PASS: lldb-api :: lang/cpp/this/TestCPPThis.py (1502 of 2163)
PASS: lldb-api :: functionalities/load_using_paths/TestLoadUsingPaths.py (1503 of 2163)
PASS: lldb-shell :: SymbolFile/DWARF/debug-types-missing-signature.test (1504 of 2163)
PASS: lldb-unit :: UnwindAssembly/x86/./UnwindAssemblyx86Tests/Testx86AssemblyInspectionEngine.TestPushEBX (1505 of 2163)
PASS: lldb-unit :: Target/./TargetTests/PathMappingListTest.AbsoluteTests (1506 of 2163)
PASS: lldb-unit :: ScriptInterpreter/Python/./ScriptInterpreterPythonTests/PythonDataObjectsTest.TestPythonBytes (1507 of 2163)
PASS: lldb-api :: commands/log/invalid-args/TestInvalidArgsLog.py (1508 of 2163)
PASS: lldb-unit :: Utility/./UtilityTests/FileSpecTest.EqualSeparator (1509 of 2163)
PASS: lldb-api :: commands/quit/TestQuit.py (1510 of 2163)
PASS: lldb-shell :: SymbolFile/NativePDB/function-types-calling-conv.cpp (1511 of 2163)
PASS: lldb-api :: functionalities/breakpoint/debugbreak/TestDebugBreak.py (1512 of 2163)
PASS: lldb-api :: functionalities/breakpoint/dummy_target_breakpoints/TestBreakpointsWithNoTargets.py (1513 of 2163)
PASS: lldb-unit :: Platform/Android/./AdbClientTests/AdbClientTest.CreateByDeviceId_ByEnvVar (1514 of 2163)
PASS: lldb-unit :: Utility/./UtilityTests/RangeTest.DoesIntersect (1515 of 2163)
PASS: lldb-api :: functionalities/data-formatter/data-formatter-ptr-to-array/TestPtrToArrayFormatting.py (1516 of 2163)
PASS: lldb-unit :: Utility/./UtilityTests/ArgsTest.TestArgv (1517 of 2163)
PASS: lldb-shell :: ObjectFile/PECOFF/basic-info-arm64.yaml (1518 of 2163)
UNSUPPORTED: lldb-shell :: ScriptInterpreter/Lua/bindings.test (1519 of 2163)
PASS: lldb-unit :: Utility/./UtilityTests/StringListTest.JoinThree (1520 of 2163)
PASS: lldb-unit :: Utility/./UtilityTests/RangeTest.ContainsEndInclusive (1521 of 2163)
PASS: lldb-unit :: Process/gdb-remote/./ProcessGdbRemoteTests/GDBRemoteClientBaseTest.SendContinueAndInterrupt (1522 of 2163)
PASS: lldb-unit :: Utility/./UtilityTests/StringLexerTest.Peek (1523 of 2163)
UNSUPPORTED: lldb-shell :: Watchpoint/netbsd-nouserdbregs.test (1524 of 2163)
PASS: lldb-unit :: ScriptInterpreter/Python/./ScriptInterpreterPythonTests/PythonDataObjectsTest.TestObjectAttributes (1525 of 2163)
PASS: lldb-unit :: Language/Highlighting/./HighlighterTests/HighlighterTest.DefaultHighlighter (1526 of 2163)
PASS: lldb-api :: types/TestDoubleTypes.py (1527 of 2163)
PASS: lldb-unit :: Utility/./UtilityTests/SerializationRountripTest.SerializeDeserializeCStringArray (1528 of 2163)
PASS: lldb-shell :: Reproducer/TestSynchronous.test (1529 of 2163)
PASS: lldb-api :: functionalities/memory/cache/TestMemoryCache.py (1530 of 2163)
PASS: lldb-api :: commands/expression/import-std-module/list/TestListFromStdModule.py (1531 of 2163)
PASS: lldb-unit :: Utility/./UtilityTests/BinaryStreamTest.PutULEB128TwoBytes (1532 of 2163)
PASS: lldb-unit :: Utility/./UtilityTests/BinaryStreamTest.PutSLEB128ThreeBytes (1533 of 2163)
PASS: lldb-unit :: Utility/./UtilityTests/PassiveReplayTest.InstrumentedBar (1534 of 2163)
PASS: lldb-unit :: Utility/./UtilityTests/IndexToObjectTest.ObjectForIndex (1535 of 2163)
PASS: lldb-shell :: ObjectFile/ELF/minidebuginfo-find-symbols.yaml (1536 of 2163)
PASS: lldb-unit :: Language/Highlighting/./HighlighterTests/HighlighterTest.Colons (1537 of 2163)
PASS: lldb-api :: functionalities/data-formatter/data-formatter-stl/libcxx/atomic/TestLibCxxAtomic.py (1538 of 2163)
PASS: lldb-unit :: Platform/./LLDBPlatformTests/PlatformAppleSimulatorTest.TestSimHasSimEnvionament (1539 of 2163)
PASS: lldb-unit :: ScriptInterpreter/Python/./ScriptInterpreterPythonTests/PythonDataObjectsTest.TestPythonListValueEquality (1540 of 2163)
PASS: lldb-unit :: ScriptInterpreter/Python/./ScriptInterpreterPythonTests/PythonDataObjectsTest.TestExtractingUInt64ThroughStructuredData (1541 of 2163)
PASS: lldb-shell :: Commands/CommandScriptImmediateOutput/CommandScriptImmediateOutputFile.test (1542 of 2163)
PASS: lldb-api :: lang/c/function_types/TestFunctionTypes.py (1543 of 2163)
PASS: lldb-api :: functionalities/thread/concurrent_events/TestConcurrentWatchBreakDelay.py (1544 of 2163)
PASS: lldb-unit :: Platform/Android/./AdbClientTests/AdbClientTest.CreateByDeviceId (1545 of 2163)
PASS: lldb-unit :: Utility/./UtilityTests/StringListTest.AppendListCStringArrayEmpty (1546 of 2163)
PASS: lldb-unit :: Utility/./UtilityTests/UriParserTest.TypicalPortPathIPv4 (1547 of 2163)
PASS: lldb-unit :: Utility/./UtilityTests/FileSpecTest.EqualDotsPosix (1548 of 2163)
PASS: lldb-unit :: UnwindAssembly/x86/./UnwindAssemblyx86Tests/Testx86AssemblyInspectionEngine.Test32bitFramelessSmallStackFrame (1549 of 2163)
PASS: lldb-shell :: SymbolFile/DWARF/gnu-style-compression.cpp (1550 of 2163)
PASS: lldb-unit :: Symbol/./SymbolTests/PostfixExpression.ParseOneExpression (1551 of 2163)
PASS: lldb-api :: functionalities/thread/concurrent_events/TestConcurrentTwoBreakpointThreads.py (1552 of 2163)
PASS: lldb-unit :: Target/./TargetTests/ModuleCacheTest.GetAndPutUuidExists (1553 of 2163)
PASS: lldb-unit :: Expression/./ExpressionTests/DWARFExpression.DW_OP_unknown (1554 of 2163)
PASS: lldb-api :: functionalities/data-formatter/data-formatter-synth/TestDataFormatterSynth.py (1555 of 2163)
PASS: lldb-shell :: ObjectFile/Breakpad/sections.test (1556 of 2163)
PASS: lldb-unit :: Symbol/./SymbolTests/Type.GetTypeScopeAndBasename (1557 of 2163)
PASS: lldb-unit :: Utility/./UtilityTests/UriParserTest.BracketedHostnameWithColon (1558 of 2163)
PASS: lldb-unit :: Language/Highlighting/./HighlighterTests/HighlighterTest.DefaultHighlighterWithCursorOutOfBounds (1559 of 2163)
PASS: lldb-api :: commands/expression/po_verbosity/TestPoVerbosity.py (1560 of 2163)
UNSUPPORTED: lldb-shell :: Breakpoint/case-insensitive.test (1561 of 2163)
PASS: lldb-api :: lang/c/unions/TestUnionMembers.py (1562 of 2163)
PASS: lldb-api :: lang/cpp/dynamic-value-same-basename/TestDynamicValueSameBase.py (1563 of 2163)
PASS: lldb-unit :: UnwindAssembly/x86/./UnwindAssemblyx86Tests/Testx86AssemblyInspectionEngine.TestPopRBX (1564 of 2163)
PASS: lldb-api :: functionalities/thread/concurrent_events/TestConcurrentDelaySignalWatch.py (1565 of 2163)
PASS: lldb-api :: tools/lldb-vscode/breakpoint-events/TestVSCode_breakpointEvents.py (1566 of 2163)
PASS: lldb-api :: python_api/sbenvironment/TestSBEnvironment.py (1567 of 2163)
PASS: lldb-api :: lang/cpp/virtual-overload/TestVirtualOverload.py (1568 of 2163)
PASS: lldb-shell :: SymbolFile/Breakpad/stack-cfi-parsing.test (1569 of 2163)
PASS: lldb-api :: tools/lldb-server/commandline/TestStubReverseConnect.py (1570 of 2163)
PASS: lldb-unit :: Utility/./UtilityTests/StringExtractorTest.DecodeHexU8_Underflow (1571 of 2163)
PASS: lldb-api :: commands/settings/use_source_cache/TestUseSourceCache.py (1572 of 2163)
PASS: lldb-api :: functionalities/memory/find/TestMemoryFind.py (1573 of 2163)
PASS: lldb-api :: functionalities/thread/step_until/TestStepUntil.py (1574 of 2163)
PASS: lldb-api :: lang/objc/foundation/TestObjCMethodsString.py (1575 of 2163)
PASS: lldb-api :: macosx/indirect_symbol/TestIndirectSymbols.py (1576 of 2163)
PASS: lldb-unit :: Utility/./UtilityTests/RecordReplayTest.InstrumentedBar (1577 of 2163)
PASS: lldb-shell :: SymbolFile/Breakpad/stack-cfi-arm.yaml (1578 of 2163)
PASS: lldb-api :: commands/expression/persist_objc_pointeetype/TestPersistObjCPointeeType.py (1579 of 2163)
PASS: lldb-api :: functionalities/thread/concurrent_events/TestConcurrentBreakpointDelayBreakpointOneSignal.py (1580 of 2163)
PASS: lldb-api :: lang/objc/hidden-ivars/TestHiddenIvars.py (1581 of 2163)
PASS: lldb-api :: lang/c/tls_globals/TestTlsGlobals.py (1582 of 2163)
PASS: lldb-unit :: Host/./HostTests/ConnectionFileDescriptorTest.TCPGetURIv4 (1583 of 2163)
PASS: lldb-api :: lang/cpp/unsigned_types/TestUnsignedTypes.py (1584 of 2163)
PASS: lldb-unit :: Expression/./ExpressionTests/CppModuleConfigurationTest.AmbiguousCLib (1585 of 2163)
PASS: lldb-api :: commands/expression/issue_11588/Test11588.py (1586 of 2163)
PASS: lldb-unit :: Utility/./UtilityTests/RecordReplayTest.InstrumentedFoo (1587 of 2163)
PASS: lldb-shell :: ScriptInterpreter/Python/scripted_breakpoint.test (1588 of 2163)
PASS: lldb-unit :: Utility/./UtilityTests/BinaryStreamTest.PutULEB128MaxValue (1589 of 2163)
UNSUPPORTED: lldb-shell :: SymbolFile/NativePDB/local-variables.cpp (1590 of 2163)
PASS: lldb-unit :: Utility/./UtilityTests/RegularExpression.Match (1591 of 2163)
PASS: lldb-unit :: Utility/./UtilityTests/BinaryStreamTest.PutULEB128NineBytes (1592 of 2163)
PASS: lldb-api :: functionalities/data-formatter/data-formatter-objc/cmtime/TestDataFormatterCMTime.py (1593 of 2163)
UNSUPPORTED: lldb-api :: arm/breakpoint-it/TestBreakpointIt.py (1594 of 2163)
PASS: lldb-unit :: Target/./TargetTests/ExecutionContextTest.GetByteOrderProcess (1595 of 2163)
PASS: lldb-unit :: Utility/./UtilityTests/BroadcasterTest.BroadcastEvent (1596 of 2163)
PASS: lldb-api :: functionalities/tsan/thread_numbers/TestTsanThreadNumbers.py (1597 of 2163)
PASS: lldb-unit :: Host/./HostTests/SocketTests/SocketTest.TCPGetAddress/ipv4 (1598 of 2163)
PASS: lldb-shell :: Settings/TestEchoCommands.test (1599 of 2163)
PASS: lldb-shell :: SymbolFile/Breakpad/line-table-missing-file.test (1600 of 2163)
PASS: lldb-unit :: Language/Highlighting/./HighlighterTests/HighlighterTest.ClangTrailingBackslashMissingNewLine (1601 of 2163)
UNSUPPORTED: lldb-api :: commands/watchpoints/hello_watchlocation/TestWatchLocation.py (1602 of 2163)
PASS: lldb-unit :: Host/./HostTests/SocketTests/SocketTest.TCPGetConnectURI/ipv6 (1603 of 2163)
PASS: lldb-unit :: Utility/./UtilityTests/StringListTest.AppendList (1604 of 2163)
UNSUPPORTED: lldb-shell :: Register/aarch64-fp-read.test (1605 of 2163)
PASS: lldb-api :: lang/c/blocks/TestBlocks.py (1606 of 2163)
UNSUPPORTED: lldb-shell :: SymbolFile/PDB/variables-locations.test (1607 of 2163)
PASS: lldb-unit :: Expression/./ExpressionTests/DiagnosticManagerTest.AppendMessageAttachToLastDiag (1608 of 2163)
PASS: lldb-unit :: Utility/./UtilityTests/UriParserTest.MinimalPath (1609 of 2163)
PASS: lldb-unit :: Utility/./UtilityTests/StringListTest.InsertStringAtIndexStart (1610 of 2163)
PASS: lldb-unit :: Utility/./UtilityTests/RangeTest.ContainsRange (1611 of 2163)
PASS: lldb-unit :: Utility/./UtilityTests/LogChannelEnabledTest.LogThread (1612 of 2163)
PASS: lldb-api :: source-manager/TestSourceManager.py (1613 of 2163)
PASS: lldb-api :: functionalities/thread/concurrent_events/TestConcurrentTwoWatchpointsOneDelayBreakpoint.py (1614 of 2163)
PASS: lldb-unit :: API/./APITests/SBCommandInterpreterTest.MultiWordCommand (1615 of 2163)
PASS: lldb-shell :: SymbolFile/DWARF/clang-ast-from-dwarf-objc-property.m (1616 of 2163)
PASS: lldb-unit :: Host/./HostTests/NativeProcessProtocolTest.ReadCStringFromMemory_MaxSize (1617 of 2163)
PASS: lldb-shell :: Settings/TestSettingsWrite.test (1618 of 2163)
PASS: lldb-shell :: ScriptInterpreter/Python/crashlog.test (1619 of 2163)
PASS: lldb-api :: functionalities/thread/ignore_suspended/TestIgnoreSuspendedThread.py (1620 of 2163)
PASS: lldb-shell :: SymbolFile/NativePDB/globals-fundamental.cpp (1621 of 2163)
PASS: lldb-unit :: ScriptInterpreter/Python/./ScriptInterpreterPythonTests/PythonDataObjectsTest.TestPythonString (1622 of 2163)
PASS: lldb-api :: functionalities/breakpoint/source_regexp/TestSourceRegexBreakpoints.py (1623 of 2163)
PASS: lldb-api :: commands/expression/multiline-completion/TestMultilineCompletion.py (1624 of 2163)
PASS: lldb-api :: functionalities/data-formatter/data-formatter-globals/TestDataFormatterGlobals.py (1625 of 2163)
PASS: lldb-unit :: Utility/./UtilityTests/GeneratorTest.GetOrCreate (1626 of 2163)
PASS: lldb-api :: commands/process/launch-with-shellexpand/TestLaunchWithShellExpand.py (1627 of 2163)
PASS: lldb-unit :: Expression/./ExpressionTests/DiagnosticManagerTest.AppendMessageSubsequentDiags (1628 of 2163)
PASS: lldb-unit :: Utility/./UtilityTests/StreamTeeTest.DefaultConstructor (1629 of 2163)
UNSUPPORTED: lldb-api :: functionalities/unwind/ehframe/TestEhFrameUnwind.py (1630 of 2163)
PASS: lldb-unit :: Utility/./UtilityTests/SubsystemRAIITest.NormalSubsystem (1631 of 2163)
PASS: lldb-unit :: Utility/./UtilityTests/BinaryStreamTest.PutULEB128FiveBytes (1632 of 2163)
PASS: lldb-unit :: Utility/./UtilityTests/Predicate.WaitForValueNotEqualTo (1633 of 2163)
PASS: lldb-api :: commands/expression/no-deadlock/TestExprDoesntBlock.py (1634 of 2163)
PASS: lldb-unit :: Core/./LLDBCoreTests/RichManglingContextTest.FromCxxMethodName (1635 of 2163)
PASS: lldb-api :: python_api/lldbutil/iter/TestRegistersIterator.py (1636 of 2163)
PASS: lldb-shell :: Reproducer/TestGDBRemoteRepro.test (1637 of 2163)
PASS: lldb-shell :: SymbolFile/DWARF/dwp-debug-types.s (1638 of 2163)
UNSUPPORTED: lldb-shell :: Register/arm-gp-read.test (1639 of 2163)
PASS: lldb-api :: lang/cpp/thread_local/TestThreadLocal.py (1640 of 2163)
UNSUPPORTED: lldb-api :: commands/register/register/intel_xtended_registers/TestMPXRegisters.py (1641 of 2163)
PASS: lldb-unit :: UnwindAssembly/x86/./UnwindAssemblyx86Tests/Testx86AssemblyInspectionEngine.TestPushR14 (1642 of 2163)
PASS: lldb-unit :: debugserver/./debugserverTests/RNBSocket.LoopBackListenIPv6 (1643 of 2163)
PASS: lldb-unit :: Utility/./UtilityTests/FileSpecTest.FileAndDirectoryComponents (1644 of 2163)
PASS: lldb-unit :: Utility/./UtilityTests/VMRange.ContainsAddr (1645 of 2163)
PASS: lldb-api :: lang/cpp/gmodules/TestWithModuleDebugging.py (1646 of 2163)
PASS: lldb-api :: functionalities/data-formatter/data-formatter-skip-summary/TestDataFormatterSkipSummary.py (1647 of 2163)
PASS: lldb-api :: commands/expression/import-std-module/forward_list-dbg-info-content/TestDbgInfoContentForwardListFromStdModule.py (1648 of 2163)
PASS: lldb-api :: functionalities/param_entry_vals/basic_entry_values/TestBasicEntryValues.py (1649 of 2163)
PASS: lldb-unit :: Disassembler/./DisassemblerTests/TestArm64Disassembly.TestArmv81Instruction (1650 of 2163)
PASS: lldb-api :: functionalities/target_var/no_vars/TestTargetVarNoVars.py (1651 of 2163)
PASS: lldb-shell :: ObjectFile/Breakpad/uuid-matching-mac.test (1652 of 2163)
PASS: lldb-unit :: SymbolFile/NativePDB/./SymbolFileNativePDBTests/PDBFPOProgramToDWARFExpressionTests.UnknownOp (1653 of 2163)
PASS: lldb-api :: functionalities/data-formatter/data-formatter-objc/TestDataFormatterObjCPlain.py (1654 of 2163)
PASS: lldb-api :: functionalities/breakpoint/step_over_breakpoint/TestStepOverBreakpoint.py (1655 of 2163)
PASS: lldb-unit :: Utility/./UtilityTests/StreamTest.AddressSize (1656 of 2163)
PASS: lldb-shell :: Settings/TestStopCommandSourceOnError.test (1657 of 2163)
PASS: lldb-shell :: SymbolFile/DWARF/find-inline-method.s (1658 of 2163)
PASS: lldb-api :: lang/objc/foundation/TestFoundationDisassembly.py (1659 of 2163)
PASS: lldb-api :: functionalities/breakpoint/breakpoint_command/TestBreakpointCommandsFromPython.py (1660 of 2163)
PASS: lldb-shell :: Reproducer/Functionalities/TestExpressionEvaluation.test (1661 of 2163)
PASS: lldb-unit :: Symbol/./SymbolTests/TestClangASTImporter.MetadataPropagationAfterCopying (1662 of 2163)
PASS: lldb-api :: tools/lldb-server/TestGdbRemoteHostInfo.py (1663 of 2163)
PASS: lldb-api :: commands/frame/select/TestFrameSelect.py (1664 of 2163)
PASS: lldb-unit :: Utility/./UtilityTests/EnvironmentTest.EnvpConstruction (1665 of 2163)
PASS: lldb-unit :: SymbolFile/NativePDB/./SymbolFileNativePDBTests/PDBFPOProgramToDWARFExpressionTests.UnsupportedRASearch (1666 of 2163)
PASS: lldb-unit :: Process/gdb-remote/./ProcessGdbRemoteTests/GDBRemoteClientBaseTest.SendContinueAndLateInterrupt (1667 of 2163)
PASS: lldb-api :: commands/expression/test/TestExprs2.py (1668 of 2163)
UNSUPPORTED: lldb-shell :: ObjectFile/ELF/minidebuginfo-no-lzma.yaml (1669 of 2163)
PASS: lldb-unit :: Host/./HostTests/SocketTests/SocketTest.DomainGetConnectURI/ipv6 (1670 of 2163)
PASS: lldb-unit :: Utility/./UtilityTests/DataExtractorTest.GetMaxS64 (1671 of 2163)
PASS: lldb-unit :: Process/minidump/./LLDBMinidumpTests/MinidumpParserTest.GetLinuxProcStatus (1672 of 2163)
PASS: lldb-api :: commands/expression/import-std-module/deque-basic/TestDequeFromStdModule.py (1673 of 2163)
PASS: lldb-api :: functionalities/data-formatter/data-formatter-stl/libcxx/deque/TestDataFormatterLibcxxDeque.py (1674 of 2163)
PASS: lldb-api :: lang/objc/exceptions/TestObjCExceptions.py (1675 of 2163)
PASS: lldb-api :: macosx/nslog/TestDarwinNSLogOutput.py (1676 of 2163)
PASS: lldb-unit :: Utility/./UtilityTests/StreamTeeTest.GetStreamAtIndexOutOfBoundsEmpty (1677 of 2163)
PASS: lldb-unit :: Process/./ProcessEventDataTests/ProcessEventDataTest.DoOnRemoval (1678 of 2163)
PASS: lldb-unit :: UnwindAssembly/x86/./UnwindAssemblyx86Tests/Testx86AssemblyInspectionEngine.TestPushR12 (1679 of 2163)
PASS: lldb-api :: commands/expression/class_template_specialization_empty_pack/TestClassTemplateSpecializationParametersHandling.py (1680 of 2163)
PASS: lldb-shell :: SymbolFile/DWARF/DW_OP_piece-smaller-than-struct.s (1681 of 2163)
PASS: lldb-api :: functionalities/thread/concurrent_events/TestConcurrentManyWatchpoints.py (1682 of 2163)
PASS: lldb-unit :: Utility/./UtilityTests/BinaryStreamTest.PutULEB128SevenBytes (1683 of 2163)
PASS: lldb-api :: commands/expression/weak_symbols/TestWeakSymbols.py (1684 of 2163)
PASS: lldb-unit :: UnwindAssembly/x86/./UnwindAssemblyx86Tests/Testx86AssemblyInspectionEngine.TestPushEDX (1685 of 2163)
PASS: lldb-api :: functionalities/gdb_remote_client/TestTargetXMLArch.py (1686 of 2163)
PASS: lldb-api :: python_api/sbdata/TestSBData.py (1687 of 2163)
PASS: lldb-unit :: Process/gdb-remote/./ProcessGdbRemoteTests/GDBRemoteCommunicationClientTest.SendStartTracePacket (1688 of 2163)
PASS: lldb-api :: tools/lldb-server/TestGdbRemoteKill.py (1689 of 2163)
PASS: lldb-api :: functionalities/jitloader_gdb/TestJITLoaderGDB.py (1690 of 2163)
PASS: lldb-api :: lang/cpp/namespace_conflicts/TestNamespaceConflicts.py (1691 of 2163)
PASS: lldb-api :: lang/cpp/char1632_t/TestChar1632T.py (1692 of 2163)
PASS: lldb-api :: functionalities/data-formatter/data-formatter-stl/libcxx/variant/TestDataFormatterLibcxxVariant.py (1693 of 2163)
UNSUPPORTED: lldb-api :: benchmarks/continue/TestBenchmarkContinue.py (1694 of 2163)
PASS: lldb-api :: commands/expression/ir-interpreter/TestIRInterpreter.py (1695 of 2163)
PASS: lldb-shell :: Driver/TestCommands.test (1696 of 2163)
PASS: lldb-unit :: DataFormatter/./LLDBFormatterTests/TypeMatcherTests.CreatedBySameMatchString (1697 of 2163)
PASS: lldb-api :: lang/objc/objc-optimized/TestObjcOptimized.py (1698 of 2163)
UNSUPPORTED: lldb-api :: tools/lldb-server/thread-name/TestGdbRemoteThreadName.py (1699 of 2163)
UNSUPPORTED: lldb-shell :: ScriptInterpreter/Lua/nested_sessions.test (1700 of 2163)
PASS: lldb-unit :: Process/gdb-remote/./ProcessGdbRemoteTests/GDBRemoteCommunicationClientTest.GetModulesInfo (1701 of 2163)
PASS: lldb-shell :: Commands/command-stop-hook-output.test (1702 of 2163)
UNSUPPORTED: lldb-shell :: SymbolFile/target-symbols-add-unwind.test (1703 of 2163)
PASS: lldb-api :: functionalities/signal/handle-abrt/TestHandleAbort.py (1704 of 2163)
PASS: lldb-api :: commands/watchpoints/watchpoint_commands/condition/TestWatchpointConditionCmd.py (1705 of 2163)
PASS: lldb-api :: functionalities/data-formatter/data-formatter-stl/libcxx/list/TestDataFormatterLibcxxList.py (1706 of 2163)
PASS: lldb-unit :: Host/./HostTests/Host.GetEnvironment (1707 of 2163)
PASS: lldb-shell :: SymbolFile/Breakpad/unwind-via-stack-win-no-memory-info.yaml (1708 of 2163)
PASS: lldb-unit :: Symbol/./SymbolTests/DWARFCallFrameInfoTest.Basic_dwarf4 (1709 of 2163)
PASS: lldb-api :: functionalities/data-formatter/data-formatter-objc/TestDataFormatterObjCNSError.py (1710 of 2163)
PASS: lldb-unit :: Utility/./UtilityTests/ProcessInstanceInfo.Yaml (1711 of 2163)
PASS: lldb-shell :: SymbolFile/DWARF/childless-compile-unit.s (1712 of 2163)
PASS: lldb-unit :: Language/Highlighting/./HighlighterTests/HighlighterTest.HighlighterSelectionType (1713 of 2163)
PASS: lldb-unit :: Host/./HostTests/HostInfoTest.GetXcodeSDK (1714 of 2163)
PASS: lldb-api :: functionalities/data-formatter/data-formatter-objc/TestDataFormatterObjCExpr.py (1715 of 2163)
PASS: lldb-unit :: Process/minidump/./LLDBMinidumpTests/MinidumpParserTest.GetThreadContext_x86_64 (1716 of 2163)
PASS: lldb-shell :: SymbolFile/dissassemble-entry-point.s (1717 of 2163)
PASS: lldb-unit :: Utility/./UtilityTests/StringExtractorTest.DecodeHexU8_InvalidHex (1718 of 2163)
PASS: lldb-unit :: Target/./TargetTests/MCBasedABI.MapRegisterName (1719 of 2163)
PASS: lldb-api :: python_api/lldbutil/frame/TestFrameUtils.py (1720 of 2163)
PASS: lldb-api :: commands/disassemble/basic/TestDisassembleBreakpoint.py (1721 of 2163)
PASS: lldb-unit :: Utility/./UtilityTests/StringListTest.JoinEmpty (1722 of 2163)
PASS: lldb-unit :: debugserver/./debugserverTests/JSON.Parse (1723 of 2163)
PASS: lldb-api :: lang/c/inlines/TestRedefinitionsInInlines.py (1724 of 2163)
PASS: lldb-shell :: SymbolFile/DWARF/debug_rnglists.s (1725 of 2163)
PASS: lldb-api :: commands/command/script_alias/TestCommandScriptAlias.py (1726 of 2163)
PASS: lldb-unit :: Utility/./UtilityTests/UriParserTest.SchemeHostSeparator3 (1727 of 2163)
PASS: lldb-unit :: Utility/./UtilityTests/DataExtractorTest.GetBitfield (1728 of 2163)
UNSUPPORTED: lldb-shell :: SymbolFile/DWARF/debug-types-expressions.test (1729 of 2163)
PASS: lldb-api :: functionalities/breakpoint/breakpoint_options/TestBreakpointOptions.py (1730 of 2163)
PASS: lldb-unit :: Core/./LLDBCoreTests/MangledTest.ResultForValidName (1731 of 2163)
PASS: lldb-unit :: Process/minidump/./LLDBMinidumpTests/MinidumpParserTest.GetThreadsAndGetThreadContext (1732 of 2163)
PASS: lldb-api :: functionalities/data-formatter/data-formatter-stl/libcxx/unique_ptr/TestDataFormatterLibcxxUniquePtr.py (1733 of 2163)
PASS: lldb-api :: functionalities/tail_call_frames/disambiguate_paths_to_common_sink/TestDisambiguatePathsToCommonSink.py (1734 of 2163)
PASS: lldb-unit :: Utility/./UtilityTests/StringExtractorTest.DecodeHexU8_Exact (1735 of 2163)
PASS: lldb-api :: lang/objc/objc-class-method/TestObjCClassMethod.py (1736 of 2163)
PASS: lldb-shell :: Commands/command-thread-select.test (1737 of 2163)
UNSUPPORTED: lldb-shell :: Register/x86-64-gp-write.test (1738 of 2163)
PASS: lldb-unit :: Process/minidump/./LLDBMinidumpTests/MinidumpParserTest.GetThreadContext_x86_32 (1739 of 2163)
PASS: lldb-unit :: UnwindAssembly/x86/./UnwindAssemblyx86Tests/Testx86AssemblyInspectionEngine.TestSpillRegToStackViaMOVx86_64 (1740 of 2163)
PASS: lldb-api :: commands/expression/ignore-artificial-constructors/TestIgnoreArtificialConstructors.py (1741 of 2163)
PASS: lldb-api :: lang/c/complex/TestComplexC99.py (1742 of 2163)
PASS: lldb-unit :: Utility/./UtilityTests/BroadcasterTest.EventTypeHasListeners (1743 of 2163)
PASS: lldb-api :: functionalities/data-formatter/type_summary_list_script/TestTypeSummaryListScript.py (1744 of 2163)
PASS: lldb-unit :: Utility/./UtilityTests/FileSpecTest.GuessPathStyle (1745 of 2163)
PASS: lldb-api :: functionalities/thread/concurrent_events/TestConcurrentDelayWatchBreak.py (1746 of 2163)
PASS: lldb-unit :: Utility/./UtilityTests/FileSpecTest.OperatorBool (1747 of 2163)
PASS: lldb-unit :: Utility/./UtilityTests/Predicate.WaitForValueEqualTo (1748 of 2163)
PASS: lldb-api :: lang/c/stepping/TestStepAndBreakpoints.py (1749 of 2163)
PASS: lldb-api :: functionalities/thread/concurrent_events/TestConcurrentSignalNWatchNBreak.py (1750 of 2163)
PASS: lldb-unit :: Utility/./UtilityTests/ProcessInstanceInfo.Dump (1751 of 2163)
PASS: lldb-api :: lang/cpp/lambdas/TestLambdas.py (1752 of 2163)
PASS: lldb-shell :: ExecControl/StopHook/stop-hook.test (1753 of 2163)
PASS: lldb-api :: iohandler/resize/TestIOHandlerResizeNoEditline.py (1754 of 2163)
PASS: lldb-unit :: Expression/./ExpressionTests/CppModuleConfigurationTest.Xcode (1755 of 2163)
PASS: lldb-api :: lang/cpp/subst_template_type_param/TestSubstTemplateTypeParam.py (1756 of 2163)
PASS: lldb-api :: functionalities/tail_call_frames/cross_object/TestCrossObjectTailCalls.py (1757 of 2163)
PASS: lldb-shell :: ObjectFile/ELF/PT_LOAD-overlap.yaml (1758 of 2163)
PASS: lldb-unit :: Utility/./UtilityTests/ArgsTest.TestSingleQuotedArgWithSpace (1759 of 2163)
UNSUPPORTED: lldb-shell :: SymbolFile/PDB/func-symbols.test (1760 of 2163)
PASS: lldb-unit :: SymbolFile/DWARF/./SymbolFileDWARFTests/SymbolFileDWARFTests.TestAbbrevMissingTerminator (1761 of 2163)
PASS: lldb-unit :: UnwindAssembly/x86/./UnwindAssemblyx86Tests/Testx86AssemblyInspectionEngine.TestStackRealign8BitDisp_i386 (1762 of 2163)
PASS: lldb-unit :: Symbol/./SymbolTests/LineEntryTest.GetSameLineContiguousAddressRangeOneInline (1763 of 2163)
PASS: lldb-unit :: Utility/./UtilityTests/TimerTest.CategoryTimes (1764 of 2163)
PASS: lldb-shell :: Settings/TestFrameFormatColor.test (1765 of 2163)
XFAIL: lldb-shell :: Register/x86-mm-xmm-write.test (1766 of 2163)
PASS: lldb-unit :: Core/./LLDBCoreTests/ModuleSpecTest.TestELFFile (1767 of 2163)
PASS: lldb-shell :: SymbolFile/DWARF/dwp.s (1768 of 2163)
PASS: lldb-unit :: DataFormatter/./LLDBFormatterTests/TypeMatcherTests.ExactName (1769 of 2163)
PASS: lldb-unit :: Language/Highlighting/./HighlighterTests/HighlighterTest.ClangPreserveNewLine (1770 of 2163)
PASS: lldb-unit :: Symbol/./SymbolTests/TestTypeSystemClang.TestIsClangType (1771 of 2163)
PASS: lldb-unit :: Utility/./UtilityTests/BinaryStreamTest.PutULEB128ThreeBytes (1772 of 2163)
PASS: lldb-unit :: Utility/./UtilityTests/CompletionRequest.TryCompleteCurrentArgMode (1773 of 2163)
PASS: lldb-shell :: ObjectFile/wasm/unified-debug-sections.yaml (1774 of 2163)
PASS: lldb-shell :: SymbolFile/DWARF/dwp-separate-debug-file.cpp (1775 of 2163)
PASS: lldb-api :: python_api/value_var_update/TestValueVarUpdate.py (1776 of 2163)
PASS: lldb-unit :: ScriptInterpreter/Python/./ScriptInterpreterPythonTests/PythonDataObjectsTest.TestOwnedReferences (1777 of 2163)
PASS: lldb-unit :: UnwindAssembly/x86/./UnwindAssemblyx86Tests/Testx86AssemblyInspectionEngine.TestPushExtended (1778 of 2163)
UNSUPPORTED: lldb-api :: commands/register/register/aarch64_sve_registers/rw_access_static_config/TestSVERegisters.py (1779 of 2163)
PASS: lldb-api :: lang/cpp/member-and-local-vars-with-same-name/TestMembersAndLocalsWithSameName.py (1780 of 2163)
PASS: lldb-unit :: Utility/./UtilityTests/StreamTest.AddressPrefixAndSuffix (1781 of 2163)
PASS: lldb-unit :: Utility/./UtilityTests/LogChannelTest.Enable (1782 of 2163)
PASS: lldb-unit :: Utility/./UtilityTests/SerializationRountripTest.SerializeDeserializePodPointers (1783 of 2163)
PASS: lldb-unit :: UnwindAssembly/x86/./UnwindAssemblyx86Tests/Testx86AssemblyInspectionEngine.TestStackRealign32BitDisp_x86_64 (1784 of 2163)
PASS: lldb-unit :: Utility/./UtilityTests/Flags.AnyClear (1785 of 2163)
PASS: lldb-api :: lang/mixed/TestMixedLanguages.py (1786 of 2163)
UNSUPPORTED: lldb-api :: functionalities/darwin_log/filter/exact_match/activity-chain/TestDarwinLogFilterMatchActivityChain.py (1787 of 2163)
PASS: lldb-unit :: Utility/./UtilityTests/LogChannelEnabledTest.LLDB_LOG_ERROR (1788 of 2163)
PASS: lldb-api :: functionalities/gdb_remote_client/TestGDBRemoteDiskFileCompletion.py (1789 of 2163)
PASS: lldb-shell :: Reproducer/TestDSYM.test (1790 of 2163)
PASS: lldb-api :: functionalities/gdb_remote_client/TestqOffsets.py (1791 of 2163)
UNSUPPORTED: lldb-shell :: Register/x86-64-zmm-read.test (1792 of 2163)
PASS: lldb-api :: commands/session/history/TestSessionHistory.py (1793 of 2163)
UNSUPPORTED: lldb-shell :: SymbolFile/PDB/expressions.test (1794 of 2163)
PASS: lldb-api :: python_api/lldbutil/TestSwigVersion.py (1795 of 2163)
PASS: lldb-api :: functionalities/data-formatter/data-formatter-stl/libcxx/map/TestDataFormatterLibccMap.py (1796 of 2163)
PASS: lldb-api :: functionalities/data-formatter/data-formatter-categories/TestDataFormatterCategories.py (1797 of 2163)
PASS: lldb-api :: commands/frame/var/TestFrameVar.py (1798 of 2163)
PASS: lldb-unit :: UnwindAssembly/x86/./UnwindAssemblyx86Tests/Testx86AssemblyInspectionEngine.TestPushR13 (1799 of 2163)
PASS: lldb-api :: tools/lldb-vscode/runInTerminal/TestVSCode_runInTerminal.py (1800 of 2163)
PASS: lldb-api :: functionalities/plugins/python_os_plugin/stepping_plugin_threads/TestOSPluginStepping.py (1801 of 2163)
PASS: lldb-unit :: Utility/./UtilityTests/BinaryStreamTest.PutULEB128FourBytes (1802 of 2163)
PASS: lldb-api :: functionalities/thread/concurrent_events/TestConcurrentSignalDelayWatch.py (1803 of 2163)
PASS: lldb-api :: functionalities/thread/concurrent_events/TestConcurrentWatchpointWithDelayWatchpointThreads.py (1804 of 2163)
PASS: lldb-api :: commands/source/info/TestSourceInfo.py (1805 of 2163)
PASS: lldb-unit :: Host/./HostTests/SocketTests/SocketTest.UDPGetConnectURI/ipv4 (1806 of 2163)
PASS: lldb-api :: tools/lldb-server/commandline/TestStubSetSID.py (1807 of 2163)
UNSUPPORTED: lldb-api :: tools/lldb-vscode/completions/TestVSCode_completions.py (1808 of 2163)
PASS: lldb-api :: functionalities/gdb_remote_client/TestRecognizeBreakpoint.py (1809 of 2163)
PASS: lldb-unit :: Utility/./UtilityTests/FileSpecTest.EqualDotsPosixRoot (1810 of 2163)
PASS: lldb-shell :: Reproducer/TestDiscard.test (1811 of 2163)
PASS: lldb-api :: commands/frame/diagnose/inheritance/TestDiagnoseInheritance.py (1812 of 2163)
PASS: lldb-api :: functionalities/breakpoint/move_nearest/TestMoveNearest.py (1813 of 2163)
UNSUPPORTED: lldb-shell :: SymbolFile/PDB/calling-conventions.test (1814 of 2163)
PASS: lldb-unit :: ScriptInterpreter/Python/./ScriptInterpreterPythonTests/PythonDataObjectsTest.TestPythonDictionaryValueEquality (1815 of 2163)
PASS: lldb-api :: functionalities/process_group/TestChangeProcessGroup.py (1816 of 2163)
PASS: lldb-unit :: SymbolFile/NativePDB/./SymbolFileNativePDBTests/PDBFPOProgramToDWARFExpressionTests.InvalidOpUnary (1817 of 2163)
PASS: lldb-shell :: SymbolFile/DWARF/dir-separator-no-comp-dir-relative-name.s (1818 of 2163)
PASS: lldb-unit :: Host/./HostTests/FileSystemTest.FileAndDirectoryComponents (1819 of 2163)
PASS: lldb-api :: functionalities/plugins/python_os_plugin/TestPythonOSPlugin.py (1820 of 2163)
PASS: lldb-unit :: Process/gdb-remote/./ProcessGdbRemoteTests/GDBRemoteCommunicationClientTest.SendGetMetaDataPacket (1821 of 2163)
PASS: lldb-api :: functionalities/data-formatter/data-formatter-objc/nsstring/TestDataFormatterNSString.py (1822 of 2163)
UNSUPPORTED: lldb-api :: linux/thread/create_during_instruction_step/TestCreateDuringInstructionStep.py (1823 of 2163)
PASS: lldb-unit :: Utility/./UtilityTests/DataExtractorTest.GetSLEB128_bit63 (1824 of 2163)
PASS: lldb-unit :: ScriptInterpreter/Python/./ScriptInterpreterPythonTests/PythonDataObjectsTest.TestPythonTupleInitializerList2 (1825 of 2163)
PASS: lldb-unit :: Host/./HostTests/SocketTests/SocketTest.UDPConnect/ipv4 (1826 of 2163)
PASS: lldb-api :: commands/expression/import-std-module/forward_decl_from_module/TestForwardDeclFromStdModule.py (1827 of 2163)
PASS: lldb-api :: lang/cpp/enum_types/TestCPP11EnumTypes.py (1828 of 2163)
PASS: lldb-shell :: SymbolFile/DWARF/debug-types-dwarf5.s (1829 of 2163)
PASS: lldb-api :: functionalities/data-formatter/data-formatter-objc/TestDataFormatterObjCNSData.py (1830 of 2163)
PASS: lldb-unit :: Utility/./UtilityTests/StringListTest.Clear (1831 of 2163)
PASS: lldb-unit :: Utility/./UtilityTests/RangeTest.DefaultConstructor (1832 of 2163)
PASS: lldb-unit :: Utility/./UtilityTests/CompletionRequest.DuplicateFilteringWithComments (1833 of 2163)
PASS: lldb-api :: lang/c/enum_types/TestEnumTypes.py (1834 of 2163)
PASS: lldb-api :: functionalities/data-formatter/data-formatter-objc/TestDataFormatterObjCNSDate.py (1835 of 2163)
PASS: lldb-api :: functionalities/thread/concurrent_events/TestConcurrentCrashWithSignal.py (1836 of 2163)
PASS: lldb-unit :: Process/minidump/./LLDBMinidumpTests/RegisterContextMinidump.ConvertMinidumpContext_x86_64 (1837 of 2163)
PASS: lldb-unit :: Utility/./UtilityTests/SerializationRountripTest.SerializeDeserializeCStringArrayNullptrElem (1838 of 2163)
PASS: lldb-unit :: Utility/./UtilityTests/UriParserTest.BracketedHostnameWithPortIPv4 (1839 of 2163)
PASS: lldb-api :: python_api/symbol-context/TestSymbolContext.py (1840 of 2163)
PASS: lldb-unit :: Utility/./UtilityTests/RecordReplayTest.InstrumentedBarRef (1841 of 2163)
PASS: lldb-unit :: Symbol/./SymbolTests/DWARFCallFrameInfoTest.Basic_eh (1842 of 2163)
PASS: lldb-unit :: Expression/./ExpressionTests/ClangExpressionDeclMapTest.TestPersistentDeclLookup (1843 of 2163)
PASS: lldb-shell :: Reproducer/TestCrash.test (1844 of 2163)
PASS: lldb-unit :: ObjectFile/ELF/./ObjectFileELFTests/ObjectFileELFTest.GetSymtab_NoSymEntryPointArmAddressClass (1845 of 2163)
PASS: lldb-unit :: Utility/./UtilityTests/Flags.IsClear (1846 of 2163)
PASS: lldb-unit :: Utility/./UtilityTests/StringListTest.GetMaxStringLengthEmpty (1847 of 2163)
UNSUPPORTED: lldb-api :: functionalities/darwin_log/filter/exact_match/activity/TestDarwinLogFilterMatchActivity.py (1848 of 2163)
PASS: lldb-api :: functionalities/thread/concurrent_events/TestConcurrentSignalWatchBreak.py (1849 of 2163)
PASS: lldb-unit :: Process/gdb-remote/./ProcessGdbRemoteTests/GDBRemoteCommunicationServerTest.SendErrorResponse_ErrorNumber (1850 of 2163)
FAIL: lldb-api :: macosx/simulator/TestSimulatorPlatform.py (1851 of 2163)
******************** TEST 'lldb-api :: macosx/simulator/TestSimulatorPlatform.py' FAILED ********************
Script:
--
/usr/local/Frameworks/Python.framework/Versions/3.7/bin/python3.7 /Users/buildslave/jenkins/workspace/lldb-cmake/llvm-project/lldb/test/API/dotest.py -S nm -u CXXFLAGS -u CFLAGS --codesign-identity - --arch x86_64 --build-dir /Users/buildslave/jenkins/workspace/lldb-cmake/lldb-build/lldb-test-build.noindex -s=/Users/buildslave/jenkins/workspace/lldb-cmake/test/logs -t --env TERM=vt100 --env LLVM_LIBS_DIR=/Users/buildslave/jenkins/workspace/lldb-cmake/lldb-build/./lib --arch x86_64 --build-dir /Users/buildslave/jenkins/workspace/lldb-cmake/lldb-build/lldb-test-build.noindex -s /Users/buildslave/jenkins/workspace/lldb-cmake/lldb-build/lldb-test-traces --lldb-module-cache-dir /Users/buildslave/jenkins/workspace/lldb-cmake/lldb-build/lldb-test-build.noindex/module-cache-lldb/lldb-api --clang-module-cache-dir /Users/buildslave/jenkins/workspace/lldb-cmake/lldb-build/lldb-test-build.noindex/module-cache-clang/lldb-api --executable /Users/buildslave/jenkins/workspace/lldb-cmake/lldb-build/./bin/lldb --compiler /Users/buildslave/jenkins/workspace/lldb-cmake/lldb-build/./bin/clang --dsymutil /Users/buildslave/jenkins/workspace/lldb-cmake/lldb-build/./bin/dsymutil --filecheck /Users/buildslave/jenkins/workspace/lldb-cmake/lldb-build/./bin/FileCheck --yaml2obj /Users/buildslave/jenkins/workspace/lldb-cmake/lldb-build/./bin/yaml2obj --server /Users/buildslave/jenkins/workspace/lldb-cmake/lldb-build/./bin/debugserver --lldb-libs-dir /Users/buildslave/jenkins/workspace/lldb-cmake/lldb-build/./lib /Users/buildslave/jenkins/workspace/lldb-cmake/llvm-project/lldb/test/API/macosx/simulator -p TestSimulatorPlatform.py
--
Exit Code: 1

Hide Details

Command Output (stdout): -- lldb version 12.0.99 clang revision 71dcbe1e88b446ae7f405da1b3006b966ccc6ca6 llvm revision 71dcbe1e88b446ae7f405da1b3006b966ccc6ca6 libstdcxx tests will not be run because: Don't know how to build with libstdcxx on macosx Skipping following debug info categories: ['dwo'] ** Simulator is unresponsive. Retrying 2 more time(s) ** Simulator is unresponsive. Retrying 1 more time(s) ** Simulator is unresponsive. Retrying 0 more time(s)

Hide Details

-- Command Output (stderr): --

Hide Details

Session logs for test failures/errors/unexpected successes will go into directory '/Users/buildslave/jenkins/workspace/lldb-cmake/lldb-build/lldb-test-traces' Change dir to: /Users/buildslave/jenkins/workspace/lldb-cmake/llvm-project/lldb/test/API/macosx/simulator runCmd: settings clear -all output:

Hide Details

runCmd: settings set symbols.enable-external-lookup false output:

Hide Details

runCmd: settings set target.inherit-tcc true output:

Hide Details

runCmd: settings set target.auto-apply-fixits false output:

Hide Details

runCmd: settings set plugin.process.gdb-remote.packet-timeout 60 output:

Hide Details

runCmd: settings set symbols.clang-modules-cache-path "/Users/buildslave/jenkins/workspace/lldb-cmake/lldb-build/lldb-test-build.noindex/module-cache-lldb/lldb-api" output:

Hide Details

runCmd: settings set use-color false output:

Hide Details

runCmd: setting set target.prefer-dynamic-value no-dynamic-values output:

Hide Details

runCmd: log enable gdb-remote packets -f /Users/buildslave/jenkins/workspace/lldb-cmake/lldb-build/lldb-test-build.noindex/macosx/simulator/TestSimulatorPlatform.test_ios/packets.log output:

Hide Details

Ran command: "log enable gdb-remote packets -f /Users/buildslave/jenkins/workspace/lldb-cmake/lldb-build/lldb-test-build.noindex/macosx/simulator/TestSimulatorPlatform.test_ios/packets.log"

Hide Details

Got output:

Hide Details

Hide Details

runCmd: image list -b -t output: [ 0] a.out x86_64-apple-ios13.5.0-simulator [ 1] dyld x86_64-apple-macosx10.15.0 [ 2] dyld_sim x86_64-apple-ios13.5.0-simulator [ 3] libc++.1.dylib x86_64-apple-ios13.5.0-simulator [ 4] libSystem.B.dylib x86_64-apple-ios13.5.0-simulator [ 5] libc++abi.dylib x86_64-apple-ios13.5.0-simulator [ 6] libcache.dylib x86_64-apple-ios13.5.0-simulator [ 7] libcommonCrypto.dylib x86_64-apple-ios13.5.0-simulator [ 8] libcompiler_rt.dylib x86_64-apple-ios13.5.0-simulator [ 9] libcopyfile.dylib x86_64-apple-ios13.5.0-simulator [ 10] libcorecrypto.dylib x86_64-apple-ios13.5.0-simulator [ 11] libdispatch.dylib x86_64-apple-ios13.5.0-simulator [ 12] libdyld.dylib x86_64-apple-ios13.5.0-simulator [ 13] liblaunch.dylib x86_64-apple-ios13.5.0-simulator [ 14] libmacho.dylib x86_64-apple-ios13.5.0-simulator [ 15] libremovefile.dylib x86_64-apple-ios13.5.0-simulator [ 16] libsystem_asl.dylib x86_64-apple-ios13.5.0-simulator [ 17] libsystem_blocks.dylib x86_64-apple-ios13.5.0-simulator [ 18] libsystem_c.dylib x86_64-apple-ios13.5.0-simulator [ 19] libsystem_configuration.dylib x86_64-apple-ios13.5.0-simulator [ 20] libsystem_containermanager.dylib x86_64-apple-ios13.5.0-simulator [ 21] libsystem_coreservices.dylib x86_64-apple-ios13.5.0-simulator [ 22] libsystem_darwin.dylib x86_64-apple-ios13.5.0-simulator [ 23] libsystem_dnssd.dylib x86_64-apple-ios13.5.0-simulator [ 24] libsystem_featureflags.dylib x86_64-apple-ios13.5.0-simulator [ 25] libsystem_info.dylib x86_64-apple-ios13.5.0-simulator [ 26] libsystem_m.dylib x86_64-apple-ios13.5.0-simulator [ 27] libsystem_malloc.dylib x86_64-apple-ios13.5.0-simulator [ 28] libsystem_notify.dylib x86_64-apple-ios13.5.0-simulator [ 29] libsystem_sandbox.dylib x86_64-apple-ios13.5.0-simulator [ 30] libsystem_sim_kernel.dylib x86_64-apple-ios13.5.0-simulator [ 31] libsystem_sim_platform.dylib x86_64-apple-ios13.5.0-simulator [ 32] libsystem_sim_pthread.dylib x86_64-apple-ios13.5.0-simulator [ 33] libsystem_trace.dylib x86_64-apple-ios13.5.0-simulator [ 34] libunwind.dylib x86_64-apple-ios13.5.0-simulator [ 35] libxpc.dylib x86_64-apple-ios13.5.0-simulator [ 36] libsystem_sim_pthread_host.dylib x86_64-apple-ios13.5.0-simulator [ 37] libsystem_sim_platform_host.dylib x86_64-apple-ios13.5.0-simulator [ 38] libsystem_sim_kernel_host.dylib x86_64-apple-ios13.5.0-simulator [ 39] libsystem_kernel.dylib x86_64-apple-macosx10.15.0-simulator(0x00007fff51b5a000) [ 40] libobjc.A.dylib x86_64-apple-ios13.5.0-simulator [ 41] libsystem_platform.dylib x86_64-apple-macosx10.15.0-simulator(0x00007fff51bfd000) [ 42] libsystem_pthread.dylib x86_64-apple-macosx10.15.0-simulator(0x00007fff51c06000)

Hide Details

Hide Details

Ran command: "image list -b -t"

Hide Details

Got output: [ 0] a.out x86_64-apple-ios13.5.0-simulator [ 1] dyld x86_64-apple-macosx10.15.0 [ 2] dyld_sim x86_64-apple-ios13.5.0-simulator [ 3] libc++.1.dylib x86_64-apple-ios13.5.0-simulator [ 4] libSystem.B.dylib x86_64-apple-ios13.5.0-simulator [ 5] libc++abi.dylib x86_64-apple-ios13.5.0-simulator [ 6] libcache.dylib x86_64-apple-ios13.5.0-simulator [ 7] libcommonCrypto.dylib x86_64-apple-ios13.5.0-simulator [ 8] libcompiler_rt.dylib x86_64-apple-ios13.5.0-simulator [ 9] libcopyfile.dylib x86_64-apple-ios13.5.0-simulator [ 10] libcorecrypto.dylib x86_64-apple-ios13.5.0-simulator [ 11] libdispatch.dylib x86_64-apple-ios13.5.0-simulator [ 12] libdyld.dylib x86_64-apple-ios13.5.0-simulator [ 13] liblaunch.dylib x86_64-apple-ios13.5.0-simulator [ 14] libmacho.dylib x86_64-apple-ios13.5.0-simulator [ 15] libremovefile.dylib x86_64-apple-ios13.5.0-simulator [ 16] libsystem_asl.dylib x86_64-apple-ios13.5.0-simulator [ 17] libsystem_blocks.dylib x86_64-apple-ios13.5.0-simulator [ 18] libsystem_c.dylib x86_64-apple-ios13.5.0-simulator [ 19] libsystem_configuration.dylib x86_64-apple-ios13.5.0-simulator [ 20] libsystem_containermanager.dylib x86_64-apple-ios13.5.0-simulator [ 21] libsystem_coreservices.dylib x86_64-apple-ios13.5.0-simulator [ 22] libsystem_darwin.dylib x86_64-apple-ios13.5.0-simulator [ 23] libsystem_dnssd.dylib x86_64-apple-ios13.5.0-simulator [ 24] libsystem_featureflags.dylib x86_64-apple-ios13.5.0-simulator [ 25] libsystem_info.dylib x86_64-apple-ios13.5.0-simulator [ 26] libsystem_m.dylib x86_64-apple-ios13.5.0-simulator [ 27] libsystem_malloc.dylib x86_64-apple-ios13.5.0-simulator [ 28] libsystem_notify.dylib x86_64-apple-ios13.5.0-simulator [ 29] libsystem_sandbox.dylib x86_64-apple-ios13.5.0-simulator [ 30] libsystem_sim_kernel.dylib x86_64-apple-ios13.5.0-simulator [ 31] libsystem_sim_platform.dylib x86_64-apple-ios13.5.0-simulator [ 32] libsystem_sim_pthread.dylib x86_64-apple-ios13.5.0-simulator [ 33] libsystem_trace.dylib x86_64-apple-ios13.5.0-simulator [ 34] libunwind.dylib x86_64-apple-ios13.5.0-simulator [ 35] libxpc.dylib x86_64-apple-ios13.5.0-simulator [ 36] libsystem_sim_pthread_host.dylib x86_64-apple-ios13.5.0-simulator [ 37] libsystem_sim_platform_host.dylib x86_64-apple-ios13.5.0-simulator [ 38] libsystem_sim_kernel_host.dylib x86_64-apple-ios13.5.0-simulator [ 39] libsystem_kernel.dylib x86_64-apple-macosx10.15.0-simulator(0x00007fff51b5a000) [ 40] libobjc.A.dylib x86_64-apple-ios13.5.0-simulator [ 41] libsystem_platform.dylib x86_64-apple-macosx10.15.0-simulator(0x00007fff51bfd000) [ 42] libsystem_pthread.dylib x86_64-apple-macosx10.15.0-simulator(0x00007fff51c06000)

Hide Details

Expecting regex pattern: "a\.out x86_64-apple-ios13.5.*-simulator" (was found, matched "a.out x86_64-apple-ios13.5.0-simulator")

Hide Details

<bound method SBProcess.Kill of <lldb.SBProcess; proxy of <Swig Object of type 'lldb::SBProcess *' at 0x117404fc0> >>: success

Hide Details

PASS: LLDB (/Users/buildslave/jenkins/workspace/lldb-cmake/lldb-build/bin/clang-x86_64) :: test_ios (TestSimulatorPlatform.TestSimulatorPlatformLaunching) runCmd: settings clear -all output:

Hide Details

runCmd: settings set symbols.enable-external-lookup false output:

Hide Details

runCmd: settings set target.inherit-tcc true output:

Hide Details

runCmd: settings set target.auto-apply-fixits false output:

Hide Details

runCmd: settings set plugin.process.gdb-remote.packet-timeout 60 output:

Hide Details

runCmd: settings set symbols.clang-modules-cache-path "/Users/buildslave/jenkins/workspace/lldb-cmake/lldb-build/lldb-test-build.noindex/module-cache-lldb/lldb-api" output:

Hide Details

runCmd: settings set use-color false output:

Hide Details

runCmd: setting set target.prefer-dynamic-value no-dynamic-values output:

Hide Details

UNSUPPORTED: LLDB (/Users/buildslave/jenkins/workspace/lldb-cmake/lldb-build/bin/clang-x86_64) :: test_ios_backdeploy_apple_silicon (TestSimulatorPlatform.TestSimulatorPlatformLaunching) (skipping due to the following parameter(s): architecture) runCmd: settings clear -all output:

Hide Details

runCmd: settings set symbols.enable-external-lookup false output:

Hide Details

runCmd: settings set target.inherit-tcc true output:

Hide Details

runCmd: settings set target.auto-apply-fixits false output:

Hide Details

runCmd: settings set plugin.process.gdb-remote.packet-timeout 60 output:

Hide Details

runCmd: settings set symbols.clang-modules-cache-path "/Users/buildslave/jenkins/workspace/lldb-cmake/lldb-build/lldb-test-build.noindex/module-cache-lldb/lldb-api" output:

Hide Details

runCmd: settings set use-color false output:

Hide Details

runCmd: setting set target.prefer-dynamic-value no-dynamic-values output:

Hide Details

runCmd: log enable gdb-remote packets -f /Users/buildslave/jenkins/workspace/lldb-cmake/lldb-build/lldb-test-build.noindex/macosx/simulator/TestSimulatorPlatform.test_ios_backdeploy_x86/packets.log output:

Hide Details

Ran command: "log enable gdb-remote packets -f /Users/buildslave/jenkins/workspace/lldb-cmake/lldb-build/lldb-test-build.noindex/macosx/simulator/TestSimulatorPlatform.test_ios_backdeploy_x86/packets.log"

Hide Details

Got output:

Hide Details

Hide Details

runCmd: image list -b -t output: [ 0] a.out x86_64-apple-ios13.0.0-simulator [ 1] dyld x86_64-apple-macosx10.15.0 [ 2] dyld_sim x86_64-apple-ios13.5.0-simulator [ 3] libc++.1.dylib x86_64-apple-ios13.5.0-simulator [ 4] libSystem.B.dylib x86_64-apple-ios13.5.0-simulator [ 5] libc++abi.dylib x86_64-apple-ios13.5.0-simulator [ 6] libcache.dylib x86_64-apple-ios13.5.0-simulator [ 7] libcommonCrypto.dylib x86_64-apple-ios13.5.0-simulator [ 8] libcompiler_rt.dylib x86_64-apple-ios13.5.0-simulator [ 9] libcopyfile.dylib x86_64-apple-ios13.5.0-simulator [ 10] libcorecrypto.dylib x86_64-apple-ios13.5.0-simulator [ 11] libdispatch.dylib x86_64-apple-ios13.5.0-simulator [ 12] libdyld.dylib x86_64-apple-ios13.5.0-simulator [ 13] liblaunch.dylib x86_64-apple-ios13.5.0-simulator [ 14] libmacho.dylib x86_64-apple-ios13.5.0-simulator [ 15] libremovefile.dylib x86_64-apple-ios13.5.0-simulator [ 16] libsystem_asl.dylib x86_64-apple-ios13.5.0-simulator [ 17] libsystem_blocks.dylib x86_64-apple-ios13.5.0-simulator [ 18] libsystem_c.dylib x86_64-apple-ios13.5.0-simulator [ 19] libsystem_configuration.dylib x86_64-apple-ios13.5.0-simulator [ 20] libsystem_containermanager.dylib x86_64-apple-ios13.5.0-simulator [ 21] libsystem_coreservices.dylib x86_64-apple-ios13.5.0-simulator [ 22] libsystem_darwin.dylib x86_64-apple-ios13.5.0-simulator [ 23] libsystem_dnssd.dylib x86_64-apple-ios13.5.0-simulator [ 24] libsystem_featureflags.dylib x86_64-apple-ios13.5.0-simulator [ 25] libsystem_info.dylib x86_64-apple-ios13.5.0-simulator [ 26] libsystem_m.dylib x86_64-apple-ios13.5.0-simulator [ 27] libsystem_malloc.dylib x86_64-apple-ios13.5.0-simulator [ 28] libsystem_notify.dylib x86_64-apple-ios13.5.0-simulator [ 29] libsystem_sandbox.dylib x86_64-apple-ios13.5.0-simulator [ 30] libsystem_sim_kernel.dylib x86_64-apple-ios13.5.0-simulator [ 31] libsystem_sim_platform.dylib x86_64-apple-ios13.5.0-simulator [ 32] libsystem_sim_pthread.dylib x86_64-apple-ios13.5.0-simulator [ 33] libsystem_trace.dylib x86_64-apple-ios13.5.0-simulator [ 34] libunwind.dylib x86_64-apple-ios13.5.0-simulator [ 35] libxpc.dylib x86_64-apple-ios13.5.0-simulator [ 36] libsystem_sim_pthread_host.dylib x86_64-apple-ios13.5.0-simulator [ 37] libsystem_sim_platform_host.dylib x86_64-apple-ios13.5.0-simulator [ 38] libsystem_sim_kernel_host.dylib x86_64-apple-ios13.5.0-simulator [ 39] libsystem_kernel.dylib x86_64-apple-macosx10.15.0-simulator(0x00007fff51b5a000) [ 40] libobjc.A.dylib x86_64-apple-ios13.5.0-simulator [ 41] libsystem_platform.dylib x86_64-apple-macosx10.15.0-simulator(0x00007fff51bfd000) [ 42] libsystem_pthread.dylib x86_64-apple-macosx10.15.0-simulator(0x00007fff51c06000)

Hide Details

Hide Details

Ran command: "image list -b -t"

Hide Details

Got output: [ 0] a.out x86_64-apple-ios13.0.0-simulator [ 1] dyld x86_64-apple-macosx10.15.0 [ 2] dyld_sim x86_64-apple-ios13.5.0-simulator [ 3] libc++.1.dylib x86_64-apple-ios13.5.0-simulator [ 4] libSystem.B.dylib x86_64-apple-ios13.5.0-simulator [ 5] libc++abi.dylib x86_64-apple-ios13.5.0-simulator [ 6] libcache.dylib x86_64-apple-ios13.5.0-simulator [ 7] libcommonCrypto.dylib x86_64-apple-ios13.5.0-simulator [ 8] libcompiler_rt.dylib x86_64-apple-ios13.5.0-simulator [ 9] libcopyfile.dylib x86_64-apple-ios13.5.0-simulator [ 10] libcorecrypto.dylib x86_64-apple-ios13.5.0-simulator [ 11] libdispatch.dylib x86_64-apple-ios13.5.0-simulator [ 12] libdyld.dylib x86_64-apple-ios13.5.0-simulator [ 13] liblaunch.dylib x86_64-apple-ios13.5.0-simulator [ 14] libmacho.dylib x86_64-apple-ios13.5.0-simulator [ 15] libremovefile.dylib x86_64-apple-ios13.5.0-simulator [ 16] libsystem_asl.dylib x86_64-apple-ios13.5.0-simulator [ 17] libsystem_blocks.dylib x86_64-apple-ios13.5.0-simulator [ 18] libsystem_c.dylib x86_64-apple-ios13.5.0-simulator [ 19] libsystem_configuration.dylib x86_64-apple-ios13.5.0-simulator [ 20] libsystem_containermanager.dylib x86_64-apple-ios13.5.0-simulator [ 21] libsystem_coreservices.dylib x86_64-apple-ios13.5.0-simulator [ 22] libsystem_darwin.dylib x86_64-apple-ios13.5.0-simulator [ 23] libsystem_dnssd.dylib x86_64-apple-ios13.5.0-simulator [ 24] libsystem_featureflags.dylib x86_64-apple-ios13.5.0-simulator [ 25] libsystem_info.dylib x86_64-apple-ios13.5.0-simulator [ 26] libsystem_m.dylib x86_64-apple-ios13.5.0-simulator [ 27] libsystem_malloc.dylib x86_64-apple-ios13.5.0-simulator [ 28] libsystem_notify.dylib x86_64-apple-ios13.5.0-simulator [ 29] libsystem_sandbox.dylib x86_64-apple-ios13.5.0-simulator [ 30] libsystem_sim_kernel.dylib x86_64-apple-ios13.5.0-simulator [ 31] libsystem_sim_platform.dylib x86_64-apple-ios13.5.0-simulator [ 32] libsystem_sim_pthread.dylib x86_64-apple-ios13.5.0-simulator [ 33] libsystem_trace.dylib x86_64-apple-ios13.5.0-simulator [ 34] libunwind.dylib x86_64-apple-ios13.5.0-simulator [ 35] libxpc.dylib x86_64-apple-ios13.5.0-simulator [ 36] libsystem_sim_pthread_host.dylib x86_64-apple-ios13.5.0-simulator [ 37] libsystem_sim_platform_host.dylib x86_64-apple-ios13.5.0-simulator [ 38] libsystem_sim_kernel_host.dylib x86_64-apple-ios13.5.0-simulator [ 39] libsystem_kernel.dylib x86_64-apple-macosx10.15.0-simulator(0x00007fff51b5a000) [ 40] libobjc.A.dylib x86_64-apple-ios13.5.0-simulator [ 41] libsystem_platform.dylib x86_64-apple-macosx10.15.0-simulator(0x00007fff51bfd000) [ 42] libsystem_pthread.dylib x86_64-apple-macosx10.15.0-simulator(0x00007fff51c06000)

Hide Details

Expecting regex pattern: "a\.out x86_64-apple-ios13.0.*-simulator" (was found, matched "a.out x86_64-apple-ios13.0.0-simulator")

Hide Details

<bound method SBProcess.Kill of <lldb.SBProcess; proxy of <Swig Object of type 'lldb::SBProcess *' at 0x115e4e270> >>: success

Hide Details

PASS: LLDB (/Users/buildslave/jenkins/workspace/lldb-cmake/lldb-build/bin/clang-x86_64) :: test_ios_backdeploy_x86 (TestSimulatorPlatform.TestSimulatorPlatformLaunching) runCmd: settings clear -all output:

Hide Details

runCmd: settings set symbols.enable-external-lookup false output:

Hide Details

runCmd: settings set target.inherit-tcc true output:

Hide Details

runCmd: settings set target.auto-apply-fixits false output:

Hide Details

runCmd: settings set plugin.process.gdb-remote.packet-timeout 60 output:

Hide Details

runCmd: settings set symbols.clang-modules-cache-path "/Users/buildslave/jenkins/workspace/lldb-cmake/lldb-build/lldb-test-build.noindex/module-cache-lldb/lldb-api" output:

Hide Details

runCmd: settings set use-color false output:

Hide Details

runCmd: setting set target.prefer-dynamic-value no-dynamic-values output:

Hide Details

runCmd: log enable gdb-remote packets -f /Users/buildslave/jenkins/workspace/lldb-cmake/lldb-build/lldb-test-build.noindex/macosx/simulator/TestSimulatorPlatform.test_lc_version_min_iphoneos/packets.log output:

Hide Details

Ran command: "log enable gdb-remote packets -f /Users/buildslave/jenkins/workspace/lldb-cmake/lldb-build/lldb-test-build.noindex/macosx/simulator/TestSimulatorPlatform.test_lc_version_min_iphoneos/packets.log"

Hide Details

Got output:

Hide Details

Hide Details

runCmd: image list -b -t output: [ 0] a.out x86_64-apple-ios11.0.0-simulator [ 1] dyld x86_64-apple-macosx10.15.0 [ 2] dyld_sim x86_64-apple-ios13.5.0-simulator [ 3] libc++.1.dylib x86_64-apple-ios13.5.0-simulator [ 4] libSystem.B.dylib x86_64-apple-ios13.5.0-simulator [ 5] libc++abi.dylib x86_64-apple-ios13.5.0-simulator [ 6] libcache.dylib x86_64-apple-ios13.5.0-simulator [ 7] libcommonCrypto.dylib x86_64-apple-ios13.5.0-simulator [ 8] libcompiler_rt.dylib x86_64-apple-ios13.5.0-simulator [ 9] libcopyfile.dylib x86_64-apple-ios13.5.0-simulator [ 10] libcorecrypto.dylib x86_64-apple-ios13.5.0-simulator [ 11] libdispatch.dylib x86_64-apple-ios13.5.0-simulator [ 12] libdyld.dylib x86_64-apple-ios13.5.0-simulator [ 13] liblaunch.dylib x86_64-apple-ios13.5.0-simulator [ 14] libmacho.dylib x86_64-apple-ios13.5.0-simulator [ 15] libremovefile.dylib x86_64-apple-ios13.5.0-simulator [ 16] libsystem_asl.dylib x86_64-apple-ios13.5.0-simulator [ 17] libsystem_blocks.dylib x86_64-apple-ios13.5.0-simulator [ 18] libsystem_c.dylib x86_64-apple-ios13.5.0-simulator [ 19] libsystem_configuration.dylib x86_64-apple-ios13.5.0-simulator [ 20] libsystem_containermanager.dylib x86_64-apple-ios13.5.0-simulator [ 21] libsystem_coreservices.dylib x86_64-apple-ios13.5.0-simulator [ 22] libsystem_darwin.dylib x86_64-apple-ios13.5.0-simulator [ 23] libsystem_dnssd.dylib x86_64-apple-ios13.5.0-simulator [ 24] libsystem_featureflags.dylib x86_64-apple-ios13.5.0-simulator [ 25] libsystem_info.dylib x86_64-apple-ios13.5.0-simulator [ 26] libsystem_m.dylib x86_64-apple-ios13.5.0-simulator [ 27] libsystem_malloc.dylib x86_64-apple-ios13.5.0-simulator [ 28] libsystem_notify.dylib x86_64-apple-ios13.5.0-simulator [ 29] libsystem_sandbox.dylib x86_64-apple-ios13.5.0-simulator [ 30] libsystem_sim_kernel.dylib x86_64-apple-ios13.5.0-simulator [ 31] libsystem_sim_platform.dylib x86_64-apple-ios13.5.0-simulator [ 32] libsystem_sim_pthread.dylib x86_64-apple-ios13.5.0-simulator [ 33] libsystem_trace.dylib x86_64-apple-ios13.5.0-simulator [ 34] libunwind.dylib x86_64-apple-ios13.5.0-simulator [ 35] libxpc.dylib x86_64-apple-ios13.5.0-simulator [ 36] libsystem_sim_pthread_host.dylib x86_64-apple-ios13.5.0-simulator [ 37] libsystem_sim_platform_host.dylib x86_64-apple-ios13.5.0-simulator [ 38] libsystem_sim_kernel_host.dylib x86_64-apple-ios13.5.0-simulator [ 39] libsystem_kernel.dylib x86_64-apple-macosx10.15.0-simulator(0x00007fff51b5a000) [ 40] libobjc.A.dylib x86_64-apple-ios13.5.0-simulator [ 41] libsystem_platform.dylib x86_64-apple-macosx10.15.0-simulator(0x00007fff51bfd000) [ 42] libsystem_pthread.dylib x86_64-apple-macosx10.15.0-simulator(0x00007fff51c06000)

Hide Details

Hide Details

Ran command: "image list -b -t"

Hide Details

Got output: [ 0] a.out x86_64-apple-ios11.0.0-simulator [ 1] dyld x86_64-apple-macosx10.15.0 [ 2] dyld_sim x86_64-apple-ios13.5.0-simulator [ 3] libc++.1.dylib x86_64-apple-ios13.5.0-simulator [ 4] libSystem.B.dylib x86_64-apple-ios13.5.0-simulator [ 5] libc++abi.dylib x86_64-apple-ios13.5.0-simulator [ 6] libcache.dylib x86_64-apple-ios13.5.0-simulator [ 7] libcommonCrypto.dylib x86_64-apple-ios13.5.0-simulator [ 8] libcompiler_rt.dylib x86_64-apple-ios13.5.0-simulator [ 9] libcopyfile.dylib x86_64-apple-ios13.5.0-simulator [ 10] libcorecrypto.dylib x86_64-apple-ios13.5.0-simulator [ 11] libdispatch.dylib x86_64-apple-ios13.5.0-simulator [ 12] libdyld.dylib x86_64-apple-ios13.5.0-simulator [ 13] liblaunch.dylib x86_64-apple-ios13.5.0-simulator [ 14] libmacho.dylib x86_64-apple-ios13.5.0-simulator [ 15] libremovefile.dylib x86_64-apple-ios13.5.0-simulator [ 16] libsystem_asl.dylib x86_64-apple-ios13.5.0-simulator [ 17] libsystem_blocks.dylib x86_64-apple-ios13.5.0-simulator [ 18] libsystem_c.dylib x86_64-apple-ios13.5.0-simulator [ 19] libsystem_configuration.dylib x86_64-apple-ios13.5.0-simulator [ 20] libsystem_containermanager.dylib x86_64-apple-ios13.5.0-simulator [ 21] libsystem_coreservices.dylib x86_64-apple-ios13.5.0-simulator [ 22] libsystem_darwin.dylib x86_64-apple-ios13.5.0-simulator [ 23] libsystem_dnssd.dylib x86_64-apple-ios13.5.0-simulator [ 24] libsystem_featureflags.dylib x86_64-apple-ios13.5.0-simulator [ 25] libsystem_info.dylib x86_64-apple-ios13.5.0-simulator [ 26] libsystem_m.dylib x86_64-apple-ios13.5.0-simulator [ 27] libsystem_malloc.dylib x86_64-apple-ios13.5.0-simulator [ 28] libsystem_notify.dylib x86_64-apple-ios13.5.0-simulator [ 29] libsystem_sandbox.dylib x86_64-apple-ios13.5.0-simulator [ 30] libsystem_sim_kernel.dylib x86_64-apple-ios13.5.0-simulator [ 31] libsystem_sim_platform.dylib x86_64-apple-ios13.5.0-simulator [ 32] libsystem_sim_pthread.dylib x86_64-apple-ios13.5.0-simulator [ 33] libsystem_trace.dylib x86_64-apple-ios13.5.0-simulator [ 34] libunwind.dylib x86_64-apple-ios13.5.0-simulator [ 35] libxpc.dylib x86_64-apple-ios13.5.0-simulator [ 36] libsystem_sim_pthread_host.dylib x86_64-apple-ios13.5.0-simulator [ 37] libsystem_sim_platform_host.dylib x86_64-apple-ios13.5.0-simulator [ 38] libsystem_sim_kernel_host.dylib x86_64-apple-ios13.5.0-simulator [ 39] libsystem_kernel.dylib x86_64-apple-macosx10.15.0-simulator(0x00007fff51b5a000) [ 40] libobjc.A.dylib x86_64-apple-ios13.5.0-simulator [ 41] libsystem_platform.dylib x86_64-apple-macosx10.15.0-simulator(0x00007fff51bfd000) [ 42] libsystem_pthread.dylib x86_64-apple-macosx10.15.0-simulator(0x00007fff51c06000)

Hide Details

Expecting regex pattern: "a\.out x86_64-apple-ios11.0.*-simulator" (was found, matched "a.out x86_64-apple-ios11.0.0-simulator")

Hide Details

<bound method SBProcess.Kill of <lldb.SBProcess; proxy of <Swig Object of type 'lldb::SBProcess *' at 0x10e88ec60> >>: success

Hide Details

PASS: LLDB (/Users/buildslave/jenkins/workspace/lldb-cmake/lldb-build/bin/clang-x86_64) :: test_lc_version_min_iphoneos (TestSimulatorPlatform.TestSimulatorPlatformLaunching) runCmd: settings clear -all output:

Hide Details

runCmd: settings set symbols.enable-external-lookup false output:

Hide Details

runCmd: settings set target.inherit-tcc true output:

Hide Details

runCmd: settings set target.auto-apply-fixits false output:

Hide Details

runCmd: settings set plugin.process.gdb-remote.packet-timeout 60 output:

Hide Details

runCmd: settings set symbols.clang-modules-cache-path "/Users/buildslave/jenkins/workspace/lldb-cmake/lldb-build/lldb-test-build.noindex/module-cache-lldb/lldb-api" output:

Hide Details

runCmd: settings set use-color false output:

Hide Details

runCmd: setting set target.prefer-dynamic-value no-dynamic-values output:

Hide Details

runCmd: log enable gdb-remote packets -f /Users/buildslave/jenkins/workspace/lldb-cmake/lldb-build/lldb-test-build.noindex/macosx/simulator/TestSimulatorPlatform.test_lc_version_min_macosx/packets.log output:

Hide Details

Ran command: "log enable gdb-remote packets -f /Users/buildslave/jenkins/workspace/lldb-cmake/lldb-build/lldb-test-build.noindex/macosx/simulator/TestSimulatorPlatform.test_lc_version_min_macosx/packets.log"

Hide Details

Got output:

Hide Details

Hide Details

runCmd: image list -b -t output: [ 0] a.out x86_64-apple-macosx10.9.0 [ 1] dyld x86_64-apple-macosx10.15.0 [ 2] libc++.1.dylib x86_64-apple-macosx10.15.0 [ 3] libSystem.B.dylib x86_64-apple-macosx10.15.0 [ 4] libc++abi.dylib x86_64-apple-macosx10.15.0 [ 5] libcache.dylib x86_64-apple-macosx10.15.0 [ 6] libcommonCrypto.dylib x86_64-apple-macosx10.15.0 [ 7] libcompiler_rt.dylib x86_64-apple-macosx10.15.0 [ 8] libcopyfile.dylib x86_64-apple-macosx10.15.0 [ 9] libcorecrypto.dylib x86_64-apple-macosx10.15.0 [ 10] libdispatch.dylib x86_64-apple-macosx10.15.0 [ 11] libdyld.dylib x86_64-apple-macosx10.15.0 [ 12] libkeymgr.dylib x86_64-apple-macosx10.15.0 [ 13] liblaunch.dylib x86_64-apple-macosx10.15.0 [ 14] libmacho.dylib x86_64-apple-macosx10.15.0 [ 15] libquarantine.dylib x86_64-apple-macosx10.15.0 [ 16] libremovefile.dylib x86_64-apple-macosx10.15.0 [ 17] libsystem_asl.dylib x86_64-apple-macosx10.15.0 [ 18] libsystem_blocks.dylib x86_64-apple-macosx10.15.0 [ 19] libsystem_c.dylib x86_64-apple-macosx10.15.0 [ 20] libsystem_configuration.dylib x86_64-apple-macosx10.15.0 [ 21] libsystem_coreservices.dylib x86_64-apple-macosx10.15.0 [ 22] libsystem_darwin.dylib x86_64-apple-macosx10.15.0 [ 23] libsystem_dnssd.dylib x86_64-apple-macosx10.15.0 [ 24] libsystem_featureflags.dylib x86_64-apple-macosx10.15.0 [ 25] libsystem_info.dylib x86_64-apple-macosx10.15.0 [ 26] libsystem_m.dylib x86_64-apple-macosx10.15.0 [ 27] libsystem_malloc.dylib x86_64-apple-macosx10.15.0 [ 28] libsystem_networkextension.dylib x86_64-apple-macosx10.15.0 [ 29] libsystem_notify.dylib x86_64-apple-macosx10.15.0 [ 30] libsystem_sandbox.dylib x86_64-apple-macosx10.15.0 [ 31] libsystem_secinit.dylib x86_64-apple-macosx10.15.0 [ 32] libsystem_kernel.dylib x86_64-apple-macosx10.15.0 [ 33] libsystem_platform.dylib x86_64-apple-macosx10.15.0 [ 34] libsystem_pthread.dylib x86_64-apple-macosx10.15.0 [ 35] libsystem_symptoms.dylib x86_64-apple-macosx10.15.0 [ 36] libsystem_trace.dylib x86_64-apple-macosx10.15.0 [ 37] libunwind.dylib x86_64-apple-macosx10.15.0 [ 38] libxpc.dylib x86_64-apple-macosx10.15.0 [ 39] libobjc.A.dylib x86_64-apple-macosx10.15.0

Hide Details

Hide Details

Ran command: "image list -b -t"

Hide Details

Got output: [ 0] a.out x86_64-apple-macosx10.9.0 [ 1] dyld x86_64-apple-macosx10.15.0 [ 2] libc++.1.dylib x86_64-apple-macosx10.15.0 [ 3] libSystem.B.dylib x86_64-apple-macosx10.15.0 [ 4] libc++abi.dylib x86_64-apple-macosx10.15.0 [ 5] libcache.dylib x86_64-apple-macosx10.15.0 [ 6] libcommonCrypto.dylib x86_64-apple-macosx10.15.0 [ 7] libcompiler_rt.dylib x86_64-apple-macosx10.15.0 [ 8] libcopyfile.dylib x86_64-apple-macosx10.15.0 [ 9] libcorecrypto.dylib x86_64-apple-macosx10.15.0 [ 10] libdispatch.dylib x86_64-apple-macosx10.15.0 [ 11] libdyld.dylib x86_64-apple-macosx10.15.0 [ 12] libkeymgr.dylib x86_64-apple-macosx10.15.0 [ 13] liblaunch.dylib x86_64-apple-macosx10.15.0 [ 14] libmacho.dylib x86_64-apple-macosx10.15.0 [ 15] libquarantine.dylib x86_64-apple-macosx10.15.0 [ 16] libremovefile.dylib x86_64-apple-macosx10.15.0 [ 17] libsystem_asl.dylib x86_64-apple-macosx10.15.0 [ 18] libsystem_blocks.dylib x86_64-apple-macosx10.15.0 [ 19] libsystem_c.dylib x86_64-apple-macosx10.15.0 [ 20] libsystem_configuration.dylib x86_64-apple-macosx10.15.0 [ 21] libsystem_coreservices.dylib x86_64-apple-macosx10.15.0 [ 22] libsystem_darwin.dylib x86_64-apple-macosx10.15.0 [ 23] libsystem_dnssd.dylib x86_64-apple-macosx10.15.0 [ 24] libsystem_featureflags.dylib x86_64-apple-macosx10.15.0 [ 25] libsystem_info.dylib x86_64-apple-macosx10.15.0 [ 26] libsystem_m.dylib x86_64-apple-macosx10.15.0 [ 27] libsystem_malloc.dylib x86_64-apple-macosx10.15.0 [ 28] libsystem_networkextension.dylib x86_64-apple-macosx10.15.0 [ 29] libsystem_notify.dylib x86_64-apple-macosx10.15.0 [ 30] libsystem_sandbox.dylib x86_64-apple-macosx10.15.0 [ 31] libsystem_secinit.dylib x86_64-apple-macosx10.15.0 [ 32] libsystem_kernel.dylib x86_64-apple-macosx10.15.0 [ 33] libsystem_platform.dylib x86_64-apple-macosx10.15.0 [ 34] libsystem_pthread.dylib x86_64-apple-macosx10.15.0 [ 35] libsystem_symptoms.dylib x86_64-apple-macosx10.15.0 [ 36] libsystem_trace.dylib x86_64-apple-macosx10.15.0 [ 37] libunwind.dylib x86_64-apple-macosx10.15.0 [ 38] libxpc.dylib x86_64-apple-macosx10.15.0 [ 39] libobjc.A.dylib x86_64-apple-macosx10.15.0

Hide Details

Expecting regex pattern: "a\.out x86_64-apple-macosx10.9.*" (was found, matched "a.out x86_64-apple-macosx10.9.0")

Hide Details

<bound method SBProcess.Kill of <lldb.SBProcess; proxy of <Swig Object of type 'lldb::SBProcess *' at 0x115e2ade0> >>: success

Hide Details

PASS: LLDB (/Users/buildslave/jenkins/workspace/lldb-cmake/lldb-build/bin/clang-x86_64) :: test_lc_version_min_macosx (TestSimulatorPlatform.TestSimulatorPlatformLaunching) runCmd: settings clear -all output:

Hide Details

runCmd: settings set symbols.enable-external-lookup false output:

Hide Details

runCmd: settings set target.inherit-tcc true output:

Hide Details

runCmd: settings set target.auto-apply-fixits false output:

Hide Details

runCmd: settings set plugin.process.gdb-remote.packet-timeout 60 output:

Hide Details

runCmd: settings set symbols.clang-modules-cache-path "/Users/buildslave/jenkins/workspace/lldb-cmake/lldb-build/lldb-test-build.noindex/module-cache-lldb/lldb-api" output:

Hide Details

runCmd: settings set use-color false output:

Hide Details

runCmd: setting set target.prefer-dynamic-value no-dynamic-values output:

Hide Details

runCmd: log enable gdb-remote packets -f /Users/buildslave/jenkins/workspace/lldb-cmake/lldb-build/lldb-test-build.noindex/macosx/simulator/TestSimulatorPlatform.test_lc_version_min_tvos/packets.log output:

Hide Details

Ran command: "log enable gdb-remote packets -f /Users/buildslave/jenkins/workspace/lldb-cmake/lldb-build/lldb-test-build.noindex/macosx/simulator/TestSimulatorPlatform.test_lc_version_min_tvos/packets.log"

Hide Details

Got output:

Hide Details

Hide Details

FAIL: LLDB (/Users/buildslave/jenkins/workspace/lldb-cmake/lldb-build/bin/clang-x86_64) :: test_lc_version_min_tvos (TestSimulatorPlatform.TestSimulatorPlatformLaunching) UNSUPPORTED: LLDB (/Users/buildslave/jenkins/workspace/lldb-cmake/lldb-build/bin/clang-x86_64) :: test_lc_version_min_watchos (TestSimulatorPlatform.TestSimulatorPlatformLaunching) (skip on macosx, darwin, ios, tvos, watchos, bridgeos) runCmd: settings clear -all output:

Hide Details

runCmd: settings set symbols.enable-external-lookup false output:

Hide Details

runCmd: settings set target.inherit-tcc true output:

Hide Details

runCmd: settings set target.auto-apply-fixits false output:

Hide Details

runCmd: settings set plugin.process.gdb-remote.packet-timeout 60 output:

Hide Details

runCmd: settings set symbols.clang-modules-cache-path "/Users/buildslave/jenkins/workspace/lldb-cmake/lldb-build/lldb-test-build.noindex/module-cache-lldb/lldb-api" output:

Hide Details

runCmd: settings set use-color false output:

Hide Details

runCmd: setting set target.prefer-dynamic-value no-dynamic-values output:

Hide Details

runCmd: log enable gdb-remote packets -f /Users/buildslave/jenkins/workspace/lldb-cmake/lldb-build/lldb-test-build.noindex/macosx/simulator/TestSimulatorPlatform.test_tvos/packets.log output:

Hide Details

Ran command: "log enable gdb-remote packets -f /Users/buildslave/jenkins/workspace/lldb-cmake/lldb-build/lldb-test-build.noindex/macosx/simulator/TestSimulatorPlatform.test_tvos/packets.log"

Hide Details

Got output:

Hide Details

Hide Details

runCmd: image list -b -t output: [ 0] a.out x86_64-apple-tvos13.4.0-simulator [ 1] dyld x86_64-apple-macosx10.15.0 [ 2] dyld_sim x86_64-apple-tvos13.4.0-simulator [ 3] libc++.1.dylib x86_64-apple-tvos13.4.0-simulator [ 4] libSystem.B.dylib x86_64-apple-tvos13.4.0-simulator [ 5] libc++abi.dylib x86_64-apple-tvos13.4.0-simulator [ 6] libcache.dylib x86_64-apple-tvos13.4.0-simulator [ 7] libcommonCrypto.dylib x86_64-apple-tvos13.4.0-simulator [ 8] libcompiler_rt.dylib x86_64-apple-tvos13.4.0-simulator [ 9] libcopyfile.dylib x86_64-apple-tvos13.4.0-simulator [ 10] libcorecrypto.dylib x86_64-apple-tvos13.4.0-simulator [ 11] libdispatch.dylib x86_64-apple-tvos13.4.0-simulator [ 12] libdyld.dylib x86_64-apple-tvos13.4.0-simulator [ 13] liblaunch.dylib x86_64-apple-tvos13.4.0-simulator [ 14] libmacho.dylib x86_64-apple-tvos13.4.0-simulator [ 15] libremovefile.dylib x86_64-apple-tvos13.4.0-simulator [ 16] libsystem_asl.dylib x86_64-apple-tvos13.4.0-simulator [ 17] libsystem_blocks.dylib x86_64-apple-tvos13.4.0-simulator [ 18] libsystem_c.dylib x86_64-apple-tvos13.4.0-simulator [ 19] libsystem_configuration.dylib x86_64-apple-tvos13.4.0-simulator [ 20] libsystem_containermanager.dylib x86_64-apple-tvos13.4.0-simulator [ 21] libsystem_coreservices.dylib x86_64-apple-tvos13.4.0-simulator [ 22] libsystem_darwin.dylib x86_64-apple-tvos13.4.0-simulator [ 23] libsystem_dnssd.dylib x86_64-apple-tvos13.4.0-simulator [ 24] libsystem_featureflags.dylib x86_64-apple-tvos13.4.0-simulator [ 25] libsystem_info.dylib x86_64-apple-tvos13.4.0-simulator [ 26] libsystem_m.dylib x86_64-apple-tvos13.4.0-simulator [ 27] libsystem_malloc.dylib x86_64-apple-tvos13.4.0-simulator [ 28] libsystem_notify.dylib x86_64-apple-tvos13.4.0-simulator [ 29] libsystem_sandbox.dylib x86_64-apple-tvos13.4.0-simulator [ 30] libsystem_sim_kernel.dylib x86_64-apple-tvos13.4.0-simulator [ 31] libsystem_sim_platform.dylib x86_64-apple-tvos13.4.0-simulator [ 32] libsystem_sim_pthread.dylib x86_64-apple-tvos13.4.0-simulator [ 33] libsystem_trace.dylib x86_64-apple-tvos13.4.0-simulator [ 34] libunwind.dylib x86_64-apple-tvos13.4.0-simulator [ 35] libxpc.dylib x86_64-apple-tvos13.4.0-simulator [ 36] libsystem_sim_pthread_host.dylib x86_64-apple-tvos13.4.0-simulator [ 37] libsystem_sim_platform_host.dylib x86_64-apple-tvos13.4.0-simulator [ 38] libsystem_sim_kernel_host.dylib x86_64-apple-tvos13.4.0-simulator [ 39] libsystem_kernel.dylib x86_64-apple-macosx10.15.0-simulator(0x00007fff421b1000) [ 40] libobjc.A.dylib x86_64-apple-tvos13.4.0-simulator [ 41] libsystem_platform.dylib x86_64-apple-macosx10.15.0-simulator(0x00007fff42254000) [ 42] libsystem_pthread.dylib x86_64-apple-macosx10.15.0-simulator(0x00007fff4225d000)

Hide Details

Hide Details

Ran command: "image list -b -t"

Hide Details

Got output: [ 0] a.out x86_64-apple-tvos13.4.0-simulator [ 1] dyld x86_64-apple-macosx10.15.0 [ 2] dyld_sim x86_64-apple-tvos13.4.0-simulator [ 3] libc++.1.dylib x86_64-apple-tvos13.4.0-simulator [ 4] libSystem.B.dylib x86_64-apple-tvos13.4.0-simulator [ 5] libc++abi.dylib x86_64-apple-tvos13.4.0-simulator [ 6] libcache.dylib x86_64-apple-tvos13.4.0-simulator [ 7] libcommonCrypto.dylib x86_64-apple-tvos13.4.0-simulator [ 8] libcompiler_rt.dylib x86_64-apple-tvos13.4.0-simulator [ 9] libcopyfile.dylib x86_64-apple-tvos13.4.0-simulator [ 10] libcorecrypto.dylib x86_64-apple-tvos13.4.0-simulator [ 11] libdispatch.dylib x86_64-apple-tvos13.4.0-simulator [ 12] libdyld.dylib x86_64-apple-tvos13.4.0-simulator [ 13] liblaunch.dylib x86_64-apple-tvos13.4.0-simulator [ 14] libmacho.dylib x86_64-apple-tvos13.4.0-simulator [ 15] libremovefile.dylib x86_64-apple-tvos13.4.0-simulator [ 16] libsystem_asl.dylib x86_64-apple-tvos13.4.0-simulator [ 17] libsystem_blocks.dylib x86_64-apple-tvos13.4.0-simulator [ 18] libsystem_c.dylib x86_64-apple-tvos13.4.0-simulator [ 19] libsystem_configuration.dylib x86_64-apple-tvos13.4.0-simulator [ 20] libsystem_containermanager.dylib x86_64-apple-tvos13.4.0-simulator [ 21] libsystem_coreservices.dylib x86_64-apple-tvos13.4.0-simulator [ 22] libsystem_darwin.dylib x86_64-apple-tvos13.4.0-simulator [ 23] libsystem_dnssd.dylib x86_64-apple-tvos13.4.0-simulator [ 24] libsystem_featureflags.dylib x86_64-apple-tvos13.4.0-simulator [ 25] libsystem_info.dylib x86_64-apple-tvos13.4.0-simulator [ 26] libsystem_m.dylib x86_64-apple-tvos13.4.0-simulator [ 27] libsystem_malloc.dylib x86_64-apple-tvos13.4.0-simulator [ 28] libsystem_notify.dylib x86_64-apple-tvos13.4.0-simulator [ 29] libsystem_sandbox.dylib x86_64-apple-tvos13.4.0-simulator [ 30] libsystem_sim_kernel.dylib x86_64-apple-tvos13.4.0-simulator [ 31] libsystem_sim_platform.dylib x86_64-apple-tvos13.4.0-simulator [ 32] libsystem_sim_pthread.dylib x86_64-apple-tvos13.4.0-simulator [ 33] libsystem_trace.dylib x86_64-apple-tvos13.4.0-simulator [ 34] libunwind.dylib x86_64-apple-tvos13.4.0-simulator [ 35] libxpc.dylib x86_64-apple-tvos13.4.0-simulator [ 36] libsystem_sim_pthread_host.dylib x86_64-apple-tvos13.4.0-simulator [ 37] libsystem_sim_platform_host.dylib x86_64-apple-tvos13.4.0-simulator [ 38] libsystem_sim_kernel_host.dylib x86_64-apple-tvos13.4.0-simulator [ 39] libsystem_kernel.dylib x86_64-apple-macosx10.15.0-simulator(0x00007fff421b1000) [ 40] libobjc.A.dylib x86_64-apple-tvos13.4.0-simulator [ 41] libsystem_platform.dylib x86_64-apple-macosx10.15.0-simulator(0x00007fff42254000) [ 42] libsystem_pthread.dylib x86_64-apple-macosx10.15.0-simulator(0x00007fff4225d000)

Hide Details

Expecting regex pattern: "a\.out x86_64-apple-tvos13.4.*-simulator" (was found, matched "a.out x86_64-apple-tvos13.4.0-simulator")

Hide Details

<bound method SBProcess.Kill of <lldb.SBProcess; proxy of <Swig Object of type 'lldb::SBProcess *' at 0x115e2ade0> >>: success

Hide Details

PASS: LLDB (/Users/buildslave/jenkins/workspace/lldb-cmake/lldb-build/bin/clang-x86_64) :: test_tvos (TestSimulatorPlatform.TestSimulatorPlatformLaunching) runCmd: settings clear -all output:

Hide Details

runCmd: settings set symbols.enable-external-lookup false output:

Hide Details

runCmd: settings set target.inherit-tcc true output:

Hide Details

runCmd: settings set target.auto-apply-fixits false output:

Hide Details

runCmd: settings set plugin.process.gdb-remote.packet-timeout 60 output:

Hide Details

runCmd: settings set symbols.clang-modules-cache-path "/Users/buildslave/jenkins/workspace/lldb-cmake/lldb-build/lldb-test-build.noindex/module-cache-lldb/lldb-api" output:

Hide Details

runCmd: settings set use-color false output:

Hide Details

runCmd: setting set target.prefer-dynamic-value no-dynamic-values output:

Hide Details

UNSUPPORTED: LLDB (/Users/buildslave/jenkins/workspace/lldb-cmake/lldb-build/bin/clang-x86_64) :: test_tvos_backdeploy_apple_silicon (TestSimulatorPlatform.TestSimulatorPlatformLaunching) (skipping due to the following parameter(s): architecture) UNSUPPORTED: LLDB (/Users/buildslave/jenkins/workspace/lldb-cmake/lldb-build/bin/clang-x86_64) :: test_watchos_armv7k (TestSimulatorPlatform.TestSimulatorPlatformLaunching) (skip on macosx, darwin, ios, tvos, watchos, bridgeos) UNSUPPORTED: LLDB (/Users/buildslave/jenkins/workspace/lldb-cmake/lldb-build/bin/clang-x86_64) :: test_watchos_backdeploy_apple_silicon (TestSimulatorPlatform.TestSimulatorPlatformLaunching) (skip on macosx, darwin, ios, tvos, watchos, bridgeos) UNSUPPORTED: LLDB (/Users/buildslave/jenkins/workspace/lldb-cmake/lldb-build/bin/clang-x86_64) :: test_watchos_i386 (TestSimulatorPlatform.TestSimulatorPlatformLaunching) (skip on macosx, darwin, ios, tvos, watchos, bridgeos) Restore dir to: /Users/buildslave/jenkins/workspace/lldb-cmake/lldb-build/tools/lldb/test ====================================================================== FAIL: test_lc_version_min_tvos (TestSimulatorPlatform.TestSimulatorPlatformLaunching) Test running a back-deploying tvOS simulator binary ---------------------------------------------------------------------- Traceback (most recent call last): File "/Users/buildslave/jenkins/workspace/lldb-cmake/llvm-project/lldb/packages/Python/lldbsuite/test/decorators.py", line 134, in wrapper return func(*args, **kwargs) File "/Users/buildslave/jenkins/workspace/lldb-cmake/llvm-project/lldb/packages/Python/lldbsuite/test/decorators.py", line 134, in wrapper return func(*args, **kwargs) File "/Users/buildslave/jenkins/workspace/lldb-cmake/llvm-project/lldb/packages/Python/lldbsuite/test/decorators.py", line 134, in wrapper return func(*args, **kwargs) [Previous line repeated 1 more time] File "/Users/buildslave/jenkins/workspace/lldb-cmake/llvm-project/lldb/test/API/macosx/simulator/TestSimulatorPlatform.py", line 192, in test_lc_version_min_tvos expected_load_command='LC_VERSION_MIN_TVOS') File "/Users/buildslave/jenkins/workspace/lldb-cmake/llvm-project/lldb/test/API/macosx/simulator/TestSimulatorPlatform.py", line 72, in run_with lldb.SBFileSpec("hello.c")) File "/Users/buildslave/jenkins/workspace/lldb-cmake/llvm-project/lldb/packages/Python/lldbsuite/test/lldbutil.py", line 954, in run_to_source_breakpoint only_one_thread, extra_images) File "/Users/buildslave/jenkins/workspace/lldb-cmake/llvm-project/lldb/packages/Python/lldbsuite/test/lldbutil.py", line 871, in run_to_breakpoint_do_run (target.GetExecutable().GetFilename(), error.GetCString())) AssertionError: <lldb.SBProcess; proxy of <Swig Object of type 'lldb::SBProcess *' at 0x117041240> > is not True : Could not create a valid process for a.out: Error Domain=NSPOSIXErrorDomain Code=60 "Operation timed out" UserInfo={NSLocalizedFailureReason=launchd failed to respond., NSLocalizedDescription=Unable to boot the Simulator.} Config=x86_64-/Users/buildslave/jenkins/workspace/lldb-cmake/lldb-build/bin/clang ---------------------------------------------------------------------- Ran 12 tests in 566.215s

Hide Details

RESULT: FAILED (5 passes, 1 failures, 0 errors, 6 skipped, 0 expected failures, 0 unexpected successes)

Hide Details

--

Hide Details

******************** PASS: lldb-api :: functionalities/data-formatter/data-formatter-python-synth/TestDataFormatterPythonSynth.py (1852 of 2163) PASS: lldb-unit :: Host/./HostTests/SocketTests/SocketTest.UDPConnect/ipv6 (1853 of 2163) PASS: lldb-shell :: Commands/command-breakpoint-col.test (1854 of 2163) PASS: lldb-api :: functionalities/data-formatter/data-formatter-stl/libcxx/unordered/TestDataFormatterUnordered.py (1855 of 2163) PASS: lldb-unit :: Utility/./UtilityTests/ArgsTest.StringListConstructor (1856 of 2163) PASS: lldb-unit :: Utility/./UtilityTests/StreamTest.PutCharWhitespace (1857 of 2163) PASS: lldb-api :: macosx/find-dsym/deep-bundle/TestDeepBundle.py (1858 of 2163) PASS: lldb-api :: sample_test/TestSampleInlineTest.py (1859 of 2163) PASS: lldb-api :: functionalities/dead-strip/TestDeadStrip.py (1860 of 2163) PASS: lldb-unit :: Process/minidump/./LLDBMinidumpTests/MinidumpParserTest.MinidumpDuplicateModuleMappedFirst (1861 of 2163) PASS: lldb-api :: python_api/sbstructureddata/TestStructuredDataAPI.py (1862 of 2163) PASS: lldb-api :: lang/objc/objc-stepping/TestObjCStepping.py (1863 of 2163) PASS: lldb-unit :: Utility/./UtilityTests/PassiveReplayTest.InstrumentedBarPtr (1864 of 2163) PASS: lldb-shell :: ObjectFile/wasm/stripped-debug-sections.yaml (1865 of 2163) PASS: lldb-shell :: ObjectFile/PECOFF/sections-names.yaml (1866 of 2163) PASS: lldb-unit :: Language/Highlighting/./HighlighterTests/HighlighterTest.ClangCursorPosBeforeOtherToken (1867 of 2163) PASS: lldb-unit :: Utility/./UtilityTests/StringExtractorTest.GetU64LittleEndian (1868 of 2163) PASS: lldb-unit :: Core/./LLDBCoreTests/CommunicationTest.SynchronizeWhileClosing (1869 of 2163) PASS: lldb-unit :: Language/Highlighting/./HighlighterTests/HighlighterTest.ClangUnterminatedString (1870 of 2163) PASS: lldb-unit :: Utility/./UtilityTests/ScalarTest.GetBytes (1871 of 2163) PASS: lldb-api :: commands/expression/namespace_local_var_same_name_obj_c/TestNamespaceLocalVarSameNameObjC.py (1872 of 2163) PASS: lldb-api :: lang/objc/modules-update/TestClangModulesUpdate.py (1873 of 2163) PASS: lldb-unit :: Utility/./UtilityTests/FileSpecTest.Match (1874 of 2163) PASS: lldb-unit :: UnwindAssembly/x86/./UnwindAssemblyx86Tests/Testx86AssemblyInspectionEngine.TestPushRBPWithREX (1875 of 2163) PASS: lldb-api :: functionalities/thread/crash_during_step/TestCrashDuringStep.py (1876 of 2163) UNSUPPORTED: lldb-api :: tools/lldb-server/TestGdbRemoteCompletion.py (1877 of 2163) PASS: lldb-unit :: Expression/./ExpressionTests/CppModuleConfigurationTest.UnknownLibCppFile (1878 of 2163) PASS: lldb-shell :: SymbolFile/NativePDB/source-list.cpp (1879 of 2163) PASS: lldb-shell :: SymbolFile/DWARF/find-basic-variable.cpp (1880 of 2163) PASS: lldb-api :: commands/expression/import_base_class_when_class_has_derived_member/TestImportBaseClassWhenClassHasDerivedMember.py (1881 of 2163) UNSUPPORTED: lldb-api :: lang/cpp/function-template-parameter-pack/TestFunctionTemplateParameterPack.py (1882 of 2163) PASS: lldb-unit :: ScriptInterpreter/Python/./ScriptInterpreterPythonTests/PythonDataObjectsTest.TestPythonByteArray (1883 of 2163) PASS: lldb-unit :: Utility/./UtilityTests/DataExtractorTest.GetDouble (1884 of 2163) PASS: lldb-api :: lang/objc/blocks/TestObjCIvarsInBlocks.py (1885 of 2163) PASS: lldb-unit :: Utility/./UtilityTests/ArgsTest.ReplaceArgumentAtIndexOutOfRange (1886 of 2163) PASS: lldb-api :: lang/objc/conflicting-definition/TestConflictingDefinition.py (1887 of 2163) PASS: lldb-shell :: Driver/TestSingleQuote.test (1888 of 2163) PASS: lldb-unit :: Host/./HostTests/SocketTests/SocketTest.UDPGetConnectURI/ipv6 (1889 of 2163) PASS: lldb-api :: lang/objc/objc-static-method/TestObjCStaticMethod.py (1890 of 2163) PASS: lldb-unit :: Interpreter/./InterpreterTests/OptionValueFileColonLine.setFromString (1891 of 2163) UNSUPPORTED: lldb-shell :: Register/x86-gp-read.test (1892 of 2163) PASS: lldb-unit :: Symbol/./SymbolTests/DWARFCallFrameInfoTest.Basic_dwarf3 (1893 of 2163) PASS: lldb-api :: python_api/breakpoint/TestBreakpointAPI.py (1894 of 2163) PASS: lldb-unit :: Utility/./UtilityTests/StringExtractorTest.GetHexBytesAvail_Underflow (1895 of 2163) PASS: lldb-unit :: Utility/./UtilityTests/StringExtractorTest.GetHexU8_Underflow2 (1896 of 2163) UNSUPPORTED: lldb-api :: macosx/macCatalystAppMacOSFramework/TestMacCatalystAppWithMacOSFramework.py (1897 of 2163) PASS: lldb-shell :: Driver/TestUseColor.test (1898 of 2163) PASS: lldb-unit :: Process/minidump/./LLDBMinidumpTests/MinidumpParserTest.GetMemoryRegionInfo (1899 of 2163) PASS: lldb-api :: lang/objc/real-definition/TestRealDefinition.py (1900 of 2163) PASS: lldb-api :: python_api/watchpoint/watchlocation/TestTargetWatchAddress.py (1901 of 2163) PASS: lldb-unit :: Signals/./SignalsTests/UnixSignalsTest.GetInfo (1902 of 2163) PASS: lldb-api :: python_api/watchpoint/TestWatchpointIgnoreCount.py (1903 of 2163) PASS: lldb-unit :: Language/Highlighting/./HighlighterTests/HighlighterTest.ClangOperators (1904 of 2163) PASS: lldb-unit :: Utility/./UtilityTests/PassiveReplayTest.InstrumentedBarRef (1905 of 2163) PASS: lldb-api :: macosx/DBGSourcePathRemapping/TestDSYMSourcePathRemapping.py (1906 of 2163) PASS: lldb-unit :: Utility/./UtilityTests/StringListTest.GetMaxStringLengthDecreasingSize (1907 of 2163) PASS: lldb-shell :: Quit/TestQuitExitCodeNonInt.test (1908 of 2163) PASS: lldb-unit :: Process/minidump/./LLDBMinidumpTests/MinidumpParserTest.GetArchitecture (1909 of 2163) PASS: lldb-api :: assert_messages_test/TestAssertMessages.py (1910 of 2163) PASS: lldb-api :: functionalities/gdb_remote_client/TestArmRegisterDefinition.py (1911 of 2163) PASS: lldb-shell :: Reproducer/TestDebugSymbols.test (1912 of 2163) UNSUPPORTED: lldb-api :: android/platform/TestDefaultCacheLineSize.py (1913 of 2163) PASS: lldb-api :: commands/expression/options/TestExprOptions.py (1914 of 2163) PASS: lldb-api :: lang/cpp/frame-var-anon-unions/TestFrameVariableAnonymousUnions.py (1915 of 2163) PASS: lldb-unit :: Utility/./UtilityTests/ScalarTest.Promotion (1916 of 2163) PASS: lldb-unit :: Utility/./UtilityTests/SerializationRountripTest.SerializeDeserializePod (1917 of 2163) XFAIL: lldb-shell :: SymbolFile/DWARF/find-type-in-function.cpp (1918 of 2163) PASS: lldb-api :: functionalities/thread/concurrent_events/TestConcurrentTwoBreakpointsOneSignal.py (1919 of 2163) PASS: lldb-unit :: Utility/./UtilityTests/AnsiTerminal.Unknown (1920 of 2163) PASS: lldb-shell :: SymbolFile/DWARF/dwarf5_locations.s (1921 of 2163) PASS: lldb-unit :: Utility/./UtilityTests/NameMatchesTest.StartsWith (1922 of 2163) PASS: lldb-shell :: Reproducer/TestDump.test (1923 of 2163) PASS: lldb-unit :: Process/minidump/./LLDBMinidumpTests/MinidumpParserTest.GetLinuxProcStatus_no_stream (1924 of 2163) PASS: lldb-api :: lang/cpp/offsetof/TestOffsetofCpp.py (1925 of 2163) PASS: lldb-api :: commands/watchpoints/watchpoint_size/TestWatchpointSizes.py (1926 of 2163) PASS: lldb-unit :: Utility/./UtilityTests/AnsiTerminal.AtEnd (1927 of 2163) PASS: lldb-unit :: Utility/./UtilityTests/ArchSpecTest.TestParseMachCPUDashSubtypeTripleSimple (1928 of 2163) PASS: lldb-shell :: Minidump/no-process-id.yaml (1929 of 2163) PASS: lldb-api :: lang/objc/modules-non-objc-target/TestObjCModulesNonObjCTarget.py (1930 of 2163) PASS: lldb-unit :: Utility/./UtilityTests/LogChannelTest.Disable (1931 of 2163) PASS: lldb-shell :: SymbolFile/NativePDB/function-types-classes.cpp (1932 of 2163) PASS: lldb-unit :: Utility/./UtilityTests/RegisterValueTest.GetSet8 (1933 of 2163) PASS: lldb-unit :: Host/./HostTests/FileActionTest.Open (1934 of 2163) PASS: lldb-unit :: Utility/./UtilityTests/StringExtractorTest.GetHexU8_Extra (1935 of 2163) PASS: lldb-unit :: Utility/./UtilityTests/StringExtractorTest.GetHexU8_Exact (1936 of 2163) PASS: lldb-shell :: ObjectFile/ELF/aarch64-relocations.yaml (1937 of 2163) PASS: lldb-shell :: SymbolFile/DWARF/find-basic-type.cpp (1938 of 2163) PASS: lldb-unit :: UnwindAssembly/x86/./UnwindAssemblyx86Tests/Testx86AssemblyInspectionEngine.TestDisassemblyJunkBytes (1939 of 2163) UNSUPPORTED: lldb-shell :: Register/x86-64-ymm16-write.test (1940 of 2163) PASS: lldb-unit :: Utility/./UtilityTests/StringExtractorTest.GetHexU8_InvalidHex (1941 of 2163) PASS: lldb-api :: functionalities/thread/concurrent_events/TestConcurrentCrashWithWatchpoint.py (1942 of 2163) PASS: lldb-api :: lang/c/vla/TestVLA.py (1943 of 2163) PASS: lldb-unit :: Utility/./UtilityTests/VMRange.ContainsRange (1944 of 2163) PASS: lldb-api :: commands/expression/import-std-module/vector/TestVectorFromStdModule.py (1945 of 2163) UNSUPPORTED: lldb-shell :: Unwind/eh-frame-small-fde.test (1946 of 2163) PASS: lldb-unit :: Utility/./UtilityTests/ArgsTest.Yaml (1947 of 2163) PASS: lldb-unit :: Utility/./UtilityTests/FileSpecTest.FormatFileSpec (1948 of 2163) PASS: lldb-unit :: Utility/./UtilityTests/DeserializerTest.HasData (1949 of 2163) PASS: lldb-shell :: Driver/TestRepl.test (1950 of 2163) PASS: lldb-unit :: SymbolFile/DWARF/./SymbolFileDWARFTests/DWARFASTParserClangTests.EnsureAllDIEsInDeclContextHaveBeenParsedParsesOnlyMatchingEntries (1951 of 2163) UNSUPPORTED: lldb-shell :: Register/x86-64-zmm-write.test (1952 of 2163) PASS: lldb-shell :: Minidump/Windows/Sigsegv/sigsegv.test (1953 of 2163) PASS: lldb-api :: commands/expression/ir-interpreter-phi-nodes/TestIRInterpreterPHINodes.py (1954 of 2163) PASS: lldb-unit :: ScriptInterpreter/Python/./ScriptInterpreterPythonTests/PythonDataObjectsTest.TestDictionaryResolutionWithDot (1955 of 2163) PASS: lldb-unit :: Utility/./UtilityTests/StreamTeeTest.Constructor1Stream (1956 of 2163) PASS: lldb-api :: lang/c/shared_lib_stripped_symbols/TestSharedLibStrippedSymbols.py (1957 of 2163) PASS: lldb-unit :: Utility/./UtilityTests/ScalarTest.TruncOrExtendTo (1958 of 2163) PASS: lldb-api :: functionalities/fat_archives/TestFatArchives.py (1959 of 2163) UNSUPPORTED: lldb-api :: tools/intel-features/intel-pt/test/TestIntelPTSimpleBinary.py (1960 of 2163) PASS: lldb-api :: commands/gui/invalid-args/TestInvalidArgsGui.py (1961 of 2163) PASS: lldb-unit :: Utility/./UtilityTests/StateTest.Formatv (1962 of 2163) PASS: lldb-unit :: Utility/./UtilityTests/GeneratorTest.YamlMultiProvider (1963 of 2163) PASS: lldb-api :: functionalities/target-new-solib-notifications/TestModuleLoadedNotifys.py (1964 of 2163) PASS: lldb-api :: lang/cpp/namespace/TestNamespaceLookup.py (1965 of 2163) PASS: lldb-unit :: DataFormatter/./LLDBFormatterTests/TypeMatcherTests.CreatedBySameMatchStringExactNamePrefixes (1966 of 2163) PASS: lldb-unit :: ScriptInterpreter/Python/./ScriptInterpreterPythonTests/PythonDataObjectsTest.TestPythonListToStructuredList (1967 of 2163) PASS: lldb-api :: functionalities/data-formatter/data-formatter-enum-format/TestDataFormatterEnumFormat.py (1968 of 2163) PASS: lldb-api :: functionalities/breakpoint/breakpoint_command/TestBreakpointCommand.py (1969 of 2163) PASS: lldb-unit :: Utility/./UtilityTests/ArgsTest.TestSingleArg (1970 of 2163) PASS: lldb-unit :: Symbol/./SymbolTests/TestTypeSystemClang.TestGetTypeClassDeclType (1971 of 2163) PASS: lldb-unit :: Platform/./LLDBPlatformTests/PlatformAppleSimulatorTest.TestHostPlatformToSim (1972 of 2163) PASS: lldb-api :: sanity/TestModuleCacheSanity.py (1973 of 2163) PASS: lldb-shell :: Settings/TestFrameFormatMangling.test (1974 of 2163) PASS: lldb-api :: lang/objc/objc-new-syntax/TestObjCNewSyntaxDictionary.py (1975 of 2163) PASS: lldb-unit :: Utility/./UtilityTests/ScalarTest.Scalar_512 (1976 of 2163) PASS: lldb-unit :: Utility/./UtilityTests/StringListTest.RemoveBlankLines (1977 of 2163) PASS: lldb-api :: functionalities/data-formatter/data-formatter-cpp/TestDataFormatterCpp.py (1978 of 2163) PASS: lldb-unit :: ScriptInterpreter/Python/./ScriptInterpreterPythonTests/PythonDataObjectsTest.TestTypeNameResolutionNoDot (1979 of 2163) PASS: lldb-api :: python_api/frame/TestFrames.py (1980 of 2163) PASS: lldb-unit :: Core/./LLDBCoreTests/ModuleSpecTest.InvalidInMemoryBufferValidFile (1981 of 2163) PASS: lldb-unit :: Utility/./UtilityTests/UriParserTest.TypicalPortPathIPv6 (1982 of 2163) PASS: lldb-api :: macosx/duplicate-archive-members/TestDuplicateMembers.py (1983 of 2163) PASS: lldb-unit :: Utility/./UtilityTests/Flags.Reset (1984 of 2163) PASS: lldb-unit :: Process/gdb-remote/./ProcessGdbRemoteTests/GDBRemoteCommunicationServerTest.SendErrorResponse_Status (1985 of 2163) PASS: lldb-api :: python_api/get-value-32bit-int/TestGetValue32BitInt.py (1986 of 2163) PASS: lldb-shell :: ObjectFile/PECOFF/basic-info-arm.yaml (1987 of 2163) PASS: lldb-unit :: Host/./HostTests/SocketTests/SocketTest.TCPGetConnectURI/ipv4 (1988 of 2163) PASS: lldb-unit :: Utility/./UtilityTests/StreamTest.PutNHex8 (1989 of 2163) PASS: lldb-shell :: Process/TestAbortExitCode.test (1990 of 2163) PASS: lldb-unit :: SymbolFile/NativePDB/./SymbolFileNativePDBTests/PDBFPOProgramToDWARFExpressionTests.MissingTargetRegister (1991 of 2163) PASS: lldb-unit :: Utility/./UtilityTests/ArgsTest.TestUnknownEscape (1992 of 2163) PASS: lldb-api :: lang/cpp/rvalue-references/TestRvalueReferences.py (1993 of 2163) PASS: lldb-api :: commands/session/save/TestSessionSave.py (1994 of 2163) PASS: lldb-unit :: Language/Highlighting/./HighlighterTests/HighlighterTest.ClangTrailingBackslashBeforeNewline (1995 of 2163) PASS: lldb-unit :: Process/minidump/./LLDBMinidumpTests/MinidumpParserTest.GetArchitectureWindows (1996 of 2163) PASS: lldb-shell :: SymbolFile/DWARF/debug_loc_and_loclists.s (1997 of 2163) UNSUPPORTED: lldb-api :: benchmarks/expression/TestExpressionCmd.py (1998 of 2163) PASS: lldb-unit :: ObjectFile/ELF/./ObjectFileELFTests/ObjectFileELFTest.GetSymtab_NoSymEntryPointArmThumbAddressClass (1999 of 2163) PASS: lldb-shell :: Driver/TestHelp.test (2000 of 2163) PASS: lldb-unit :: Utility/./UtilityTests/ProcessInfoTest.Constructor (2001 of 2163) PASS: lldb-unit :: Utility/./UtilityTests/FileSpecTest.EqualDotsWindows (2002 of 2163) PASS: lldb-api :: functionalities/breakpoint/scripted_bkpt/TestScriptedResolver.py (2003 of 2163) UNSUPPORTED: lldb-shell :: Register/x86-gp-write.test (2004 of 2163) PASS: lldb-unit :: Utility/./UtilityTests/NameMatchesTest.Ignore (2005 of 2163) UNSUPPORTED: lldb-api :: lang/objc/objc-dynamic-value/TestObjCDynamicValue.py (2006 of 2163) PASS: lldb-api :: functionalities/tail_call_frames/disambiguate_tail_call_seq/TestDisambiguateTailCallSeq.py (2007 of 2163) PASS: lldb-unit :: Utility/./UtilityTests/StringListTest.AppendStringMove (2008 of 2163) PASS: lldb-shell :: ObjectFile/ELF/many-sections.s (2009 of 2163) PASS: lldb-unit :: Utility/./UtilityTests/GeneratorTest.Get (2010 of 2163) PASS: lldb-unit :: Utility/./UtilityTests/StringExtractorTest.GetHexU8_Underflow_NoEof (2011 of 2163) PASS: lldb-api :: functionalities/history/TestHistoryRecall.py (2012 of 2163) PASS: lldb-unit :: Symbol/./SymbolTests/PostfixExpression.ToDWARF (2013 of 2163) PASS: lldb-shell :: Minidump/Windows/arm-fp-unwind.test (2014 of 2163) PASS: lldb-unit :: Symbol/./SymbolTests/TestTypeSystemClang.AddMethodToObjCObjectType (2015 of 2163) PASS: lldb-unit :: Utility/./UtilityTests/DataExtractorTest.GetCStrAtEnd (2016 of 2163) PASS: lldb-api :: lang/cpp/inlines/TestInlines.py (2017 of 2163) PASS: lldb-unit :: API/./APITests/SBCommandInterpreterTest.SingleWordCommand (2018 of 2163) PASS: lldb-api :: lang/objc/foundation/TestObjCMethods.py (2019 of 2163) PASS: lldb-unit :: ObjectFile/PECOFF/./ObjectFilePECOFFTests/PECallFrameInfoTest.Frame_reg_eh (2020 of 2163) PASS: lldb-api :: lang/cpp/signed_types/TestSignedTypes.py (2021 of 2163) UNSUPPORTED: lldb-api :: functionalities/data-formatter/data-formatter-stl/libstdcpp/string/TestDataFormatterStdString.py (2022 of 2163) UNSUPPORTED: lldb-api :: benchmarks/turnaround/TestCompileRunToBreakpointTurnaround.py (2023 of 2163) PASS: lldb-api :: tools/lldb-vscode/breakpoint/TestVSCode_setExceptionBreakpoints.py (2024 of 2163) UNSUPPORTED: lldb-shell :: Register/x86-64-ymm16-read.test (2025 of 2163) PASS: lldb-unit :: Utility/./UtilityTests/StreamTest.ShiftOperatorChars (2026 of 2163) PASS: lldb-unit :: UnwindAssembly/x86/./UnwindAssemblyx86Tests/Testx86AssemblyInspectionEngine.TestSimple64bitFrameFunction (2027 of 2163) PASS: lldb-shell :: ObjectFile/ELF/section-types.yaml (2028 of 2163) PASS: lldb-api :: functionalities/thread/concurrent_events/TestConcurrentSignalBreak.py (2029 of 2163) PASS: lldb-api :: functionalities/thread/exit_during_expression/TestExitDuringExpression.py (2030 of 2163) PASS: lldb-api :: python_api/class_members/TestSBTypeClassMembers.py (2031 of 2163) UNSUPPORTED: lldb-api :: functionalities/darwin_log/source/debug/TestDarwinLogSourceDebug.py (2032 of 2163) PASS: lldb-shell :: SymbolFile/DWARF/DW_OP_piece-struct.s (2033 of 2163) PASS: lldb-unit :: Utility/./UtilityTests/DataExtractorTest.GetCStrAtNullOffset (2034 of 2163) PASS: lldb-api :: lang/cpp/breakpoint-commands/TestCPPBreakpointCommands.py (2035 of 2163) PASS: lldb-shell :: ScriptInterpreter/Python/sb_address_exception.test (2036 of 2163) PASS: lldb-api :: lang/cpp/extern_c/TestExternCSymbols.py (2037 of 2163) PASS: lldb-api :: lang/c/forward/TestForwardDeclaration.py (2038 of 2163) PASS: lldb-unit :: Host/./HostTests/FileSystemTest.OpenErrno (2039 of 2163) XFAIL: lldb-shell :: Register/x86-64-write.test (2040 of 2163) PASS: lldb-shell :: Expr/TestMultilineExpr.test (2041 of 2163) PASS: lldb-unit :: UnwindAssembly/x86/./UnwindAssemblyx86Tests/Testx86AssemblyInspectionEngine.TestAddESP (2042 of 2163) PASS: lldb-unit :: Process/gdb-remote/./ProcessGdbRemoteTests/GDBRemoteCommunicationClientTest.SendGetDataPacket (2043 of 2163) PASS: lldb-unit :: Utility/./UtilityTests/UUIDTest.RelationalOperators (2044 of 2163) PASS: lldb-unit :: Host/./HostTests/MainLoopTest.TerminatesImmediately (2045 of 2163) PASS: lldb-unit :: Utility/./UtilityTests/UserIDResolver.GetGroupName (2046 of 2163) PASS: lldb-unit :: Utility/./UtilityTests/RegularExpression.Empty (2047 of 2163) PASS: lldb-api :: lang/objc/modules-hash-mismatch/TestClangModulesHashMismatch.py (2048 of 2163) PASS: lldb-unit :: Symbol/./SymbolTests/TestTypeSystemClang.TestRemoveFastQualifiers (2049 of 2163) PASS: lldb-unit :: Utility/./UtilityTests/DataExtractorTest.GetMaxU64_unchecked (2050 of 2163) PASS: lldb-api :: lang/objcxx/class-name-clash/TestNameClash.py (2051 of 2163) PASS: lldb-shell :: Breakpoint/case-sensitive.test (2052 of 2163) PASS: lldb-unit :: Process/gdb-remote/./ProcessGdbRemoteTests/GDBRemoteCommunicationClientTest.TestPacketSpeedJSON (2053 of 2163) PASS: lldb-unit :: Host/./HostTests/SocketTests/SocketTest.DomainListenConnectAccept/ipv4 (2054 of 2163) PASS: lldb-api :: commands/target/create-deps/TestTargetCreateDeps.py (2055 of 2163) PASS: lldb-unit :: ObjectFile/Breakpad/./ObjectFileBreakpadTests/ModuleRecord.parse (2056 of 2163) PASS: lldb-unit :: Utility/./UtilityTests/UriParserTest.BadPort (2057 of 2163) PASS: lldb-api :: commands/disassemble/basic/TestFrameDisassemble.py (2058 of 2163) PASS: lldb-api :: commands/expression/fixits/TestFixIts.py (2059 of 2163) PASS: lldb-unit :: Expression/./ExpressionTests/DWARFExpression.DW_OP_piece (2060 of 2163) PASS: lldb-unit :: UnwindAssembly/ARM64/./Arm64InstEmulationTests/TestArm64InstEmulation.TestRegisterSavedTwice (2061 of 2163) PASS: lldb-api :: python_api/lldbutil/process/TestPrintStackTraces.py (2062 of 2163) PASS: lldb-unit :: Utility/./UtilityTests/RangeTest.Constructor (2063 of 2163) PASS: lldb-unit :: Utility/./UtilityTests/StringExtractorTest.GetHexBytesAvail (2064 of 2163) PASS: lldb-shell :: Breakpoint/implicit_const_form_support.test (2065 of 2163) PASS: lldb-api :: arm/emulation/TestEmulations.py (2066 of 2163) PASS: lldb-api :: lang/cpp/function_refs/TestFunctionRefs.py (2067 of 2163) PASS: lldb-unit :: Thread/./ThreadTests/ThreadTest.GetPrivateStopInfo (2068 of 2163) PASS: lldb-api :: commands/expression/inline-namespace/TestInlineNamespace.py (2069 of 2163) PASS: lldb-unit :: Utility/./UtilityTests/StreamTest.QuotedCString (2070 of 2163) PASS: lldb-unit :: Symbol/./SymbolTests/TestTypeSystemClang.TestGetEnumIntegerTypeInvalid (2071 of 2163) PASS: lldb-api :: python_api/value/empty_class/TestValueAPIEmptyClass.py (2072 of 2163) PASS: lldb-unit :: Utility/./UtilityTests/ReproducerTest.SetCapture (2073 of 2163) PASS: lldb-unit :: Utility/./UtilityTests/ConstStringTest.format_provider (2074 of 2163) PASS: lldb-shell :: SymbolFile/DWARF/debug_loc.s (2075 of 2163) PASS: lldb-unit :: Host/./HostTests/FileSystemTest.Exists (2076 of 2163) UNSUPPORTED: lldb-api :: benchmarks/frame_variable/TestFrameVariableResponse.py (2077 of 2163) PASS: lldb-api :: commands/gui/basicdebug/TestGuiBasicDebug.py (2078 of 2163) UNSUPPORTED: lldb-shell :: ObjectFile/ELF/minidebuginfo-set-and-hit-breakpoint.test (2079 of 2163) PASS: lldb-api :: commands/breakpoint/set/func-regex/TestBreakpointRegexError.py (2080 of 2163) PASS: lldb-unit :: UnwindAssembly/x86/./UnwindAssemblyx86Tests/Testx86AssemblyInspectionEngine.TestPopRBPWithREX (2081 of 2163) PASS: lldb-api :: commands/command/delete/TestCommandDelete.py (2082 of 2163) PASS: lldb-unit :: Expression/./ExpressionTests/CppModuleConfigurationTest.LinuxLocalLibCpp (2083 of 2163) PASS: lldb-unit :: Symbol/./SymbolTests/TestTypeSystemClang.TestGetEnumIntegerTypeBasicTypes (2084 of 2163) PASS: lldb-unit :: Utility/./UtilityTests/BinaryStreamTest.PutSLEB128NineBytes (2085 of 2163) PASS: lldb-unit :: Utility/./UtilityTests/DataExtractorTest.GetCStr (2086 of 2163) PASS: lldb-shell :: Reproducer/TestPythonImport.test (2087 of 2163) PASS: lldb-unit :: Utility/./UtilityTests/FileSpecTest.Equal (2088 of 2163) PASS: lldb-unit :: Host/./HostTests/HostInfoTest.GetHostname (2089 of 2163) PASS: lldb-api :: commands/watchpoints/multiple_hits/TestMultipleHits.py (2090 of 2163) PASS: lldb-api :: commands/expression/import-std-module/stack/TestStackFromStdModule.py (2091 of 2163) PASS: lldb-shell :: SymbolFile/DWARF/apple-index-is-used.cpp (2092 of 2163) PASS: lldb-api :: lang/cpp/typeof/TestTypeOfDeclTypeExpr.py (2093 of 2163) PASS: lldb-unit :: Utility/./UtilityTests/StringListTest.CopyList (2094 of 2163) PASS: lldb-api :: functionalities/tsan/thread_leak/TestTsanThreadLeak.py (2095 of 2163) PASS: lldb-unit :: Utility/./UtilityTests/AnsiTerminal.KnownPrefix (2096 of 2163) PASS: lldb-shell :: SymbolFile/DWARF/dir-separator-no-comp-dir.s (2097 of 2163) PASS: lldb-api :: lang/objc/objc-baseclass-sbtype/TestObjCBaseClassSBType.py (2098 of 2163) PASS: lldb-unit :: SymbolFile/DWARF/./SymbolFileDWARFTests/SymbolFileDWARFTests.TestAbilitiesForDWARF (2099 of 2163) PASS: lldb-unit :: Utility/./UtilityTests/ArgsTest.TestAppendArg (2100 of 2163) PASS: lldb-api :: functionalities/lazy-loading/TestLazyLoading.py (2101 of 2163) PASS: lldb-unit :: Utility/./UtilityTests/StringListTest.ForRange (2102 of 2163) PASS: lldb-api :: commands/expression/dollar-in-variable/TestDollarInVariable.py (2103 of 2163) PASS: lldb-api :: functionalities/process_crash_info/TestProcessCrashInfo.py (2104 of 2163) PASS: lldb-unit :: Utility/./UtilityTests/StringExtractorTest.GetU32LittleEndian (2105 of 2163) PASS: lldb-api :: commands/expression/cast_int_to_anonymous_enum/TestCastIntToAnonymousEnum.py (2106 of 2163) PASS: lldb-api :: commands/expression/persistent_ptr_update/TestPersistentPtrUpdate.py (2107 of 2163) PASS: lldb-unit :: Host/./HostTests/MainLoopTest.Signal (2108 of 2163) PASS: lldb-unit :: ScriptInterpreter/Python/./ScriptInterpreterPythonTests/PythonDataObjectsTest.TestPythonDictionaryToStructuredDictionary (2109 of 2163) UNSUPPORTED: lldb-shell :: BuildScript/toolchain-msvc.test (2110 of 2163) UNSUPPORTED: lldb-api :: functionalities/breakpoint/hardware_breakpoints/write_memory_with_hw_breakpoint/TestWriteMemoryWithHWBreakpoint.py (2111 of 2163) PASS: lldb-unit :: Utility/./UtilityTests/UriParserTest.Minimal (2112 of 2163) PASS: lldb-unit :: Utility/./UtilityTests/RangeTest.LessThan (2113 of 2163) PASS: lldb-unit :: Core/./LLDBCoreTests/StreamCallbackTest.Callback (2114 of 2163) PASS: lldb-shell :: SymbolFile/DWARF/array-sizes.s (2115 of 2163) PASS: lldb-unit :: Utility/./UtilityTests/RangeTest.DoesAdjoinOrIntersect (2116 of 2163) PASS: lldb-unit :: Language/CLanguages/./LanguageCLanguagesTests/CLanguages.LookupCLanguagesByLanguageType (2117 of 2163) PASS: lldb-api :: functionalities/breakpoint/breakpoint_locations/TestBreakpointLocations.py (2118 of 2163) PASS: lldb-api :: types/TestLongTypesExpr.py (2119 of 2163) PASS: lldb-unit :: Utility/./UtilityTests/StringExtractorTest.GetHexBytesAvail_OddPair (2120 of 2163) PASS: lldb-api :: python_api/sbtype_typeclass/TestSBTypeTypeClass.py (2121 of 2163) PASS: lldb-shell :: ObjectFile/ELF/PT_LOAD-overlap-PT_TLS.yaml (2122 of 2163) PASS: lldb-api :: lang/cpp/type_lookup/TestCppTypeLookup.py (2123 of 2163) PASS: lldb-unit :: Utility/./UtilityTests/RangeTest.Clear (2124 of 2163) PASS: lldb-api :: lang/objc/print-obj/TestPrintObj.py (2125 of 2163) PASS: lldb-shell :: Commands/command-source.test (2126 of 2163) PASS: lldb-api :: functionalities/thread/concurrent_events/TestConcurrentTwoBreakpointsOneWatchpoint.py (2127 of 2163) PASS: lldb-api :: functionalities/breakpoint/breakpoint_set_restart/TestBreakpointSetRestart.py (2128 of 2163) PASS: lldb-api :: commands/expression/rdar44436068/Test128BitsInteger.py (2129 of 2163) PASS: lldb-unit :: tools/lldb-server/tests/./LLDBServerTests/TestBase.LaunchModePreservesEnvironment (2130 of 2163) PASS: lldb-unit :: Utility/./UtilityTests/StringExtractorTest.GetHexBytes_Partial (2131 of 2163) PASS: lldb-api :: functionalities/data-formatter/type_summary_list_arg/TestTypeSummaryListArg.py (2132 of 2163) PASS: lldb-unit :: Signals/./SignalsTests/UnixSignalsTest.Iteration (2133 of 2163) UNSUPPORTED: lldb-api :: linux/mix-dwo-and-regular-objects/TestMixedDwarfBinary.py (2134 of 2163) PASS: lldb-unit :: Utility/./UtilityTests/ArgsTest.DoubleQuotedItem (2135 of 2163) PASS: lldb-unit :: Language/CPlusPlus/./LanguageCPlusPlusTests/CPlusPlusLanguage.CPlusPlusNameParser (2136 of 2163) PASS: lldb-unit :: Utility/./UtilityTests/OptionsWithRawTest.SingleWhitespaceInput (2137 of 2163) PASS: lldb-api :: python_api/section/TestSectionAPI.py (2138 of 2163) UNSUPPORTED: lldb-api :: commands/expression/completion-crash-invalid-iterator/TestInvalidIteratorCompletionCrash.py (2139 of 2163) PASS: lldb-unit :: Process/gdb-remote/./ProcessGdbRemoteTests/GDBRemoteCommunicationServerTest.SendErrorResponse_StringError (2140 of 2163) PASS: lldb-api :: functionalities/object-file/TestImageListMultiArchitecture.py (2141 of 2163) PASS: lldb-unit :: UnwindAssembly/x86/./UnwindAssemblyx86Tests/Testx86AssemblyInspectionEngine.TestDisassemblyMidFunctionEpilogues (2142 of 2163) PASS: lldb-unit :: Interpreter/./InterpreterTests/CompletionTest.DirCompletionUsername (2143 of 2163) PASS: lldb-unit :: Symbol/./SymbolTests/TestTypeSystemClang.TestUnifyAccessSpecifiers (2144 of 2163) UNSUPPORTED: lldb-api :: linux/add-symbols/TestTargetSymbolsAddCommand.py (2145 of 2163) PASS: lldb-api :: lang/objc/objc-ivar-stripped/TestObjCIvarStripped.py (2146 of 2163) UNSUPPORTED: lldb-shell :: Register/x86-zmm-write.test (2147 of 2163) PASS: lldb-api :: functionalities/thread/backtrace_limit/TestBacktraceLimit.py (2148 of 2163) PASS: lldb-unit :: Utility/./UtilityTests/LogTest.Register (2149 of 2163) PASS: lldb-api :: commands/expression/calculator_mode/TestCalculatorMode.py (2150 of 2163) PASS: lldb-unit :: Utility/./UtilityTests/StringListTest.GetMaxStringLengthEqualSize (2151 of 2163) PASS: lldb-unit :: Expression/./ExpressionTests/DiagnosticManagerTest.GetStringBasic (2152 of 2163) PASS: lldb-api :: commands/expression/call-function/TestCallStdStringFunction.py (2153 of 2163) PASS: lldb-shell :: SymbolFile/DWARF/dwo-type-in-main-file.s (2154 of 2163) PASS: lldb-shell :: SymbolFile/DWARF/inline-function-address-shared.test (2155 of 2163) PASS: lldb-shell :: ObjectFile/ELF/section-addresses.yaml (2156 of 2163) PASS: lldb-unit :: Utility/./UtilityTests/PassiveReplayTest.InstrumentedFoo (2157 of 2163) PASS: lldb-unit :: Utility/./UtilityTests/StatusTest.ErrorConversion (2158 of 2163) PASS: lldb-unit :: ScriptInterpreter/Python/./ScriptInterpreterPythonTests/PythonDataObjectsTest.TestPythonStringToStr (2159 of 2163) PASS: lldb-api :: tools/lldb-vscode/step/TestVSCode_step.py (2160 of 2163) PASS: lldb-api :: commands/process/attach/attach_denied/TestAttachDenied.py (2161 of 2163) PASS: lldb-api :: lang/objc/orderedset/TestOrderedSet.py (2162 of 2163) PASS: lldb-api :: api/multithreaded/TestMultithreaded.py (2163 of 2163) Slowest Tests: -------------------------------------------------------------------------- 567.09s: lldb-api :: macosx/simulator/TestSimulatorPlatform.py 164.64s: lldb-api :: functionalities/data-formatter/data-formatter-objc/nsstring/TestDataFormatterNSString.py 101.28s: lldb-api :: tools/lldb-server/TestLldbGdbServer.py 84.05s: lldb-api :: lang/objc/objc-class-method/TestObjCClassMethod.py 70.74s: lldb-api :: functionalities/breakpoint/move_nearest/TestMoveNearest.py 65.26s: lldb-api :: lang/objc/real-definition/TestRealDefinition.py 59.23s: lldb-api :: lang/objc/exceptions/TestObjCExceptions.py 57.36s: lldb-api :: functionalities/process_group/TestChangeProcessGroup.py 55.65s: lldb-api :: functionalities/gdb_remote_client/TestRecognizeBreakpoint.py 55.63s: lldb-api :: lang/objc/hidden-ivars/TestHiddenIvars.py 54.48s: lldb-api :: commands/frame/diagnose/inheritance/TestDiagnoseInheritance.py 53.77s: lldb-api :: lang/objc/foundation/TestFoundationDisassembly.py 50.51s: lldb-api :: lang/objc/foundation/TestObjCMethods.py 49.47s: lldb-api :: api/multithreaded/TestMultithreaded.py 47.88s: lldb-api :: functionalities/data-formatter/data-formatter-stl/libcxx/unordered/TestDataFormatterUnordered.py 47.43s: lldb-shell :: SymbolFile/dissassemble-entry-point.s 46.05s: lldb-api :: types/TestLongTypesExpr.py 43.48s: lldb-shell :: SymbolFile/NativePDB/locate-pdb.cpp 43.38s: lldb-api :: functionalities/data-formatter/data-formatter-stl/libcxx/unique_ptr/TestDataFormatterLibcxxUniquePtr.py 42.80s: lldb-api :: lang/objc/blocks/TestObjCIvarsInBlocks.py

Hide Details

Tests Times: -------------------------------------------------------------------------- [ Range ] :: [ Percentage ] :: [ Count ] -------------------------------------------------------------------------- [550s,600s) :: [ ] :: [ 1/2163] [500s,550s) :: [ ] :: [ 0/2163] [450s,500s) :: [ ] :: [ 0/2163] [400s,450s) :: [ ] :: [ 0/2163] [350s,400s) :: [ ] :: [ 0/2163] [300s,350s) :: [ ] :: [ 0/2163] [250s,300s) :: [ ] :: [ 0/2163] [200s,250s) :: [ ] :: [ 0/2163] [150s,200s) :: [ ] :: [ 1/2163] [100s,150s) :: [ ] :: [ 1/2163] [ 50s,100s) :: [ ] :: [ 13/2163] [ 0s, 50s) :: [*************************************** ] :: [2147/2163] -------------------------------------------------------------------------- ******************** Failed Tests (1): lldb-api :: macosx/simulator/TestSimulatorPlatform.py

Hide Details

Hide Details

Testing Time: 1976.23s Unsupported : 153 Passed : 2003 Expectedly Failed: 6 Failed : 1 FAILED: tools/lldb/test/CMakeFiles/check-lldb-lit cd /Users/buildslave/jenkins/workspace/lldb-cmake/lldb-build/tools/lldb/test && /usr/local/Frameworks/Python.framework/Versions/3.7/bin/python3.7 /Users/buildslave/jenkins/workspace/lldb-cmake/lldb-build/./bin/llvm-lit -v --time-tests --shuffle --xunit-xml-output=/Users/buildslave/jenkins/workspace/lldb-cmake/test/results.xml -v -j 4 /Users/buildslave/jenkins/workspace/lldb-cmake/lldb-build/tools/lldb/test ninja: build stopped: subcommand failed. Command failed: Command '['/usr/bin/env', 'TERM=vt100', '/usr/local/bin/ninja', '-v', 'check-lldb']' returned non-zero exit status 1 Command: ['/usr/bin/env', 'TERM=vt100', '/usr/local/bin/ninja', '-v', 'check-lldb'] [Pipeline] } [Pipeline] // timeout [Pipeline] } [Pipeline] // stage [Pipeline] stage [Pipeline] { (Declarative: Post Actions) [Pipeline] scanForIssues [Clang (LLVM based)] Sleeping for 5 seconds due to JENKINS-32191... [Clang (LLVM based)] Parsing console log (workspace: '/Users/buildslave/jenkins/workspace/lldb-cmake') [Clang (LLVM based)] Successfully parsed console log [Clang (LLVM based)] -> found 10 issues (skipped 12 duplicates) [Clang (LLVM based)] Post processing issues on 'green-dragon-10' with source code encoding 'UTF-8' [Clang (LLVM based)] Creating SCM blamer to obtain author and commit information for affected files [Clang (LLVM based)] Creating SCM miner to obtain statistics for affected repository files [Clang (LLVM based)] Resolving file names for all issues in source directory '/Users/buildslave/jenkins/workspace/lldb-cmake' [Clang (LLVM based)] -> resolved paths in source directory (7 found, 0 not found) [Clang (LLVM based)] Resolving module names from module definitions (build.xml, pom.xml, or Manifest.mf files) [Clang (LLVM based)] -> resolved module names for 10 issues [Clang (LLVM based)] Resolving package names (or namespaces) by parsing the affected files [Clang (LLVM based)] -> resolved package names of 7 affected files [Clang (LLVM based)] No filter has been set, publishing all 10 issues [Clang (LLVM based)] Creating fingerprints for all affected code blocks to track issues over different builds [Clang (LLVM based)] -> created fingerprints for 10 issues (skipped 0 issues) [Clang (LLVM based)] Copying affected files to Jenkins' build folder '/Users/Shared/Jenkins/Home/jobs/lldb-cmake/builds/24031/files-with-issues' [Clang (LLVM based)] -> 5 copied, 2 not in workspace, 0 not-found, 0 with I/O error [Pipeline] junit Recording test results [Pipeline] emailext Warning: kupokupokupopo@gmail.com is not a recognized user, but sending mail anyway Warning: clattner@nondot.org is not a recognized user, but sending mail anyway Warning: mkazantsev@azul.com is not a recognized user, but sending mail anyway Warning: omair.javaid@linaro.org is not a recognized user, but sending mail anyway Warning: kupokupokupopo@gmail.com is not a recognized user, but sending mail anyway Warning: clattner@nondot.org is not a recognized user, but sending mail anyway Warning: mkazantsev@azul.com is not a recognized user, but sending mail anyway Warning: omair.javaid@linaro.org is not a recognized user, but sending mail anyway

Hide Details

Begin Pre-Send Script... Sending email to: mschifer@apple.com kupokupokupopo@gmail.com clattner@nondot.org mkazantsev@azul.com omair.javaid@linaro.org "vsapsai@apple.com" <vsapsai@apple.com> Azhar Mohammed <azhar@apple.com>
[Pipeline] } [Pipeline] // stage [Pipeline] } [Pipeline] // withEnv [Pipeline] } [Pipeline] // node [Pipeline] End of Pipeline ERROR: script returned exit code 1 Finished: FAILURE