FailedConsole Output

Skipping 3,192 KB.. Full Log
/Xcode.app/Contents/Developer/Platforms/MacOSX.platform/Developer/SDKs/MacOSX10.15.sdk    -fno-exceptions -fno-rtti -UNDEBUG -std=c++14 -MD -MT lib/Target/X86/MCTargetDesc/CMakeFiles/LLVMX86Desc.dir/X86AsmBackend.cpp.o -MF lib/Target/X86/MCTargetDesc/CMakeFiles/LLVMX86Desc.dir/X86AsmBackend.cpp.o.d -o lib/Target/X86/MCTargetDesc/CMakeFiles/LLVMX86Desc.dir/X86AsmBackend.cpp.o -c /Users/buildslave/jenkins/workspace/lldb-cmake/llvm-project/llvm/lib/Target/X86/MCTargetDesc/X86AsmBackend.cpp
[2411/5202] /Users/buildslave/jenkins/workspace/lldb-cmake/host-compiler/bin/clang++  -DGTEST_HAS_RTTI=0 -D_DEBUG -D__STDC_CONSTANT_MACROS -D__STDC_FORMAT_MACROS -D__STDC_LIMIT_MACROS -Ilib/Target/X86/Disassembler -I/Users/buildslave/jenkins/workspace/lldb-cmake/llvm-project/llvm/lib/Target/X86/Disassembler -I/Users/buildslave/jenkins/workspace/lldb-cmake/llvm-project/llvm/lib/Target/X86 -Ilib/Target/X86 -Iinclude -I/Users/buildslave/jenkins/workspace/lldb-cmake/llvm-project/llvm/include -Wdocumentation -fPIC -fvisibility-inlines-hidden -Werror=date-time -Werror=unguarded-availability-new -fmodules -fmodules-cache-path=/Users/buildslave/jenkins/workspace/lldb-cmake/lldb-build/module.cache -fcxx-modules -Xclang -fmodules-local-submodule-visibility -Wall -Wextra -Wno-unused-parameter -Wwrite-strings -Wcast-qual -Wmissing-field-initializers -pedantic -Wno-long-long -Wimplicit-fallthrough -Wcovered-switch-default -Wno-noexcept-type -Wnon-virtual-dtor -Wdelete-non-virtual-dtor -Wsuggest-override -Wstring-conversion -fdiagnostics-color -O3  -isysroot /Applications/Xcode.app/Contents/Developer/Platforms/MacOSX.platform/Developer/SDKs/MacOSX10.15.sdk    -fno-exceptions -fno-rtti -UNDEBUG -std=c++14 -MD -MT lib/Target/X86/Disassembler/CMakeFiles/LLVMX86Disassembler.dir/X86Disassembler.cpp.o -MF lib/Target/X86/Disassembler/CMakeFiles/LLVMX86Disassembler.dir/X86Disassembler.cpp.o.d -o lib/Target/X86/Disassembler/CMakeFiles/LLVMX86Disassembler.dir/X86Disassembler.cpp.o -c /Users/buildslave/jenkins/workspace/lldb-cmake/llvm-project/llvm/lib/Target/X86/Disassembler/X86Disassembler.cpp
[2412/5202] : && "/Applications/Xcode.app/Contents/Developer/Toolchains/XcodeDefault.xctoolchain/usr/bin/libtool" -static -no_warning_for_no_symbols -o lib/libLLVMX86Disassembler.a  lib/Target/X86/Disassembler/CMakeFiles/LLVMX86Disassembler.dir/X86Disassembler.cpp.o && :
[2413/5202] /Users/buildslave/jenkins/workspace/lldb-cmake/host-compiler/bin/clang++  -DGTEST_HAS_RTTI=0 -D_DEBUG -D__STDC_CONSTANT_MACROS -D__STDC_FORMAT_MACROS -D__STDC_LIMIT_MACROS -Ilib/ProfileData -I/Users/buildslave/jenkins/workspace/lldb-cmake/llvm-project/llvm/lib/ProfileData -Iinclude -I/Users/buildslave/jenkins/workspace/lldb-cmake/llvm-project/llvm/include -Wdocumentation -fPIC -fvisibility-inlines-hidden -Werror=date-time -Werror=unguarded-availability-new -fmodules -fmodules-cache-path=/Users/buildslave/jenkins/workspace/lldb-cmake/lldb-build/module.cache -fcxx-modules -Xclang -fmodules-local-submodule-visibility -Wall -Wextra -Wno-unused-parameter -Wwrite-strings -Wcast-qual -Wmissing-field-initializers -pedantic -Wno-long-long -Wimplicit-fallthrough -Wcovered-switch-default -Wno-noexcept-type -Wnon-virtual-dtor -Wdelete-non-virtual-dtor -Wsuggest-override -Wstring-conversion -fdiagnostics-color -O3  -isysroot /Applications/Xcode.app/Contents/Developer/Platforms/MacOSX.platform/Developer/SDKs/MacOSX10.15.sdk    -fno-exceptions -fno-rtti -UNDEBUG -std=c++14 -MD -MT lib/ProfileData/CMakeFiles/LLVMProfileData.dir/ProfileSummaryBuilder.cpp.o -MF lib/ProfileData/CMakeFiles/LLVMProfileData.dir/ProfileSummaryBuilder.cpp.o.d -o lib/ProfileData/CMakeFiles/LLVMProfileData.dir/ProfileSummaryBuilder.cpp.o -c /Users/buildslave/jenkins/workspace/lldb-cmake/llvm-project/llvm/lib/ProfileData/ProfileSummaryBuilder.cpp
[2414/5202] /Users/buildslave/jenkins/workspace/lldb-cmake/host-compiler/bin/clang++  -DGTEST_HAS_RTTI=0 -D_DEBUG -D__STDC_CONSTANT_MACROS -D__STDC_FORMAT_MACROS -D__STDC_LIMIT_MACROS -Ilib/ProfileData -I/Users/buildslave/jenkins/workspace/lldb-cmake/llvm-project/llvm/lib/ProfileData -Iinclude -I/Users/buildslave/jenkins/workspace/lldb-cmake/llvm-project/llvm/include -Wdocumentation -fPIC -fvisibility-inlines-hidden -Werror=date-time -Werror=unguarded-availability-new -fmodules -fmodules-cache-path=/Users/buildslave/jenkins/workspace/lldb-cmake/lldb-build/module.cache -fcxx-modules -Xclang -fmodules-local-submodule-visibility -Wall -Wextra -Wno-unused-parameter -Wwrite-strings -Wcast-qual -Wmissing-field-initializers -pedantic -Wno-long-long -Wimplicit-fallthrough -Wcovered-switch-default -Wno-noexcept-type -Wnon-virtual-dtor -Wdelete-non-virtual-dtor -Wsuggest-override -Wstring-conversion -fdiagnostics-color -O3  -isysroot /Applications/Xcode.app/Contents/Developer/Platforms/MacOSX.platform/Developer/SDKs/MacOSX10.15.sdk    -fno-exceptions -fno-rtti -UNDEBUG -std=c++14 -MD -MT lib/ProfileData/CMakeFiles/LLVMProfileData.dir/GCOV.cpp.o -MF lib/ProfileData/CMakeFiles/LLVMProfileData.dir/GCOV.cpp.o.d -o lib/ProfileData/CMakeFiles/LLVMProfileData.dir/GCOV.cpp.o -c /Users/buildslave/jenkins/workspace/lldb-cmake/llvm-project/llvm/lib/ProfileData/GCOV.cpp
[2415/5202] /Users/buildslave/jenkins/workspace/lldb-cmake/host-compiler/bin/clang++  -DGTEST_HAS_RTTI=0 -D_DEBUG -D__STDC_CONSTANT_MACROS -D__STDC_FORMAT_MACROS -D__STDC_LIMIT_MACROS -Ilib/ProfileData -I/Users/buildslave/jenkins/workspace/lldb-cmake/llvm-project/llvm/lib/ProfileData -Iinclude -I/Users/buildslave/jenkins/workspace/lldb-cmake/llvm-project/llvm/include -Wdocumentation -fPIC -fvisibility-inlines-hidden -Werror=date-time -Werror=unguarded-availability-new -fmodules -fmodules-cache-path=/Users/buildslave/jenkins/workspace/lldb-cmake/lldb-build/module.cache -fcxx-modules -Xclang -fmodules-local-submodule-visibility -Wall -Wextra -Wno-unused-parameter -Wwrite-strings -Wcast-qual -Wmissing-field-initializers -pedantic -Wno-long-long -Wimplicit-fallthrough -Wcovered-switch-default -Wno-noexcept-type -Wnon-virtual-dtor -Wdelete-non-virtual-dtor -Wsuggest-override -Wstring-conversion -fdiagnostics-color -O3  -isysroot /Applications/Xcode.app/Contents/Developer/Platforms/MacOSX.platform/Developer/SDKs/MacOSX10.15.sdk    -fno-exceptions -fno-rtti -UNDEBUG -std=c++14 -MD -MT lib/ProfileData/CMakeFiles/LLVMProfileData.dir/SampleProf.cpp.o -MF lib/ProfileData/CMakeFiles/LLVMProfileData.dir/SampleProf.cpp.o.d -o lib/ProfileData/CMakeFiles/LLVMProfileData.dir/SampleProf.cpp.o -c /Users/buildslave/jenkins/workspace/lldb-cmake/llvm-project/llvm/lib/ProfileData/SampleProf.cpp
[2416/5202] /Users/buildslave/jenkins/workspace/lldb-cmake/host-compiler/bin/clang++  -DGTEST_HAS_RTTI=0 -D_DEBUG -D__STDC_CONSTANT_MACROS -D__STDC_FORMAT_MACROS -D__STDC_LIMIT_MACROS -Ilib/ProfileData -I/Users/buildslave/jenkins/workspace/lldb-cmake/llvm-project/llvm/lib/ProfileData -Iinclude -I/Users/buildslave/jenkins/workspace/lldb-cmake/llvm-project/llvm/include -Wdocumentation -fPIC -fvisibility-inlines-hidden -Werror=date-time -Werror=unguarded-availability-new -fmodules -fmodules-cache-path=/Users/buildslave/jenkins/workspace/lldb-cmake/lldb-build/module.cache -fcxx-modules -Xclang -fmodules-local-submodule-visibility -Wall -Wextra -Wno-unused-parameter -Wwrite-strings -Wcast-qual -Wmissing-field-initializers -pedantic -Wno-long-long -Wimplicit-fallthrough -Wcovered-switch-default -Wno-noexcept-type -Wnon-virtual-dtor -Wdelete-non-virtual-dtor -Wsuggest-override -Wstring-conversion -fdiagnostics-color -O3  -isysroot /Applications/Xcode.app/Contents/Developer/Platforms/MacOSX.platform/Developer/SDKs/MacOSX10.15.sdk    -fno-exceptions -fno-rtti -UNDEBUG -std=c++14 -MD -MT lib/ProfileData/CMakeFiles/LLVMProfileData.dir/InstrProf.cpp.o -MF lib/ProfileData/CMakeFiles/LLVMProfileData.dir/InstrProf.cpp.o.d -o lib/ProfileData/CMakeFiles/LLVMProfileData.dir/InstrProf.cpp.o -c /Users/buildslave/jenkins/workspace/lldb-cmake/llvm-project/llvm/lib/ProfileData/InstrProf.cpp
[2417/5202] /Users/buildslave/jenkins/workspace/lldb-cmake/host-compiler/bin/clang++  -DGTEST_HAS_RTTI=0 -D_DEBUG -D__STDC_CONSTANT_MACROS -D__STDC_FORMAT_MACROS -D__STDC_LIMIT_MACROS -Ilib/ProfileData -I/Users/buildslave/jenkins/workspace/lldb-cmake/llvm-project/llvm/lib/ProfileData -Iinclude -I/Users/buildslave/jenkins/workspace/lldb-cmake/llvm-project/llvm/include -Wdocumentation -fPIC -fvisibility-inlines-hidden -Werror=date-time -Werror=unguarded-availability-new -fmodules -fmodules-cache-path=/Users/buildslave/jenkins/workspace/lldb-cmake/lldb-build/module.cache -fcxx-modules -Xclang -fmodules-local-submodule-visibility -Wall -Wextra -Wno-unused-parameter -Wwrite-strings -Wcast-qual -Wmissing-field-initializers -pedantic -Wno-long-long -Wimplicit-fallthrough -Wcovered-switch-default -Wno-noexcept-type -Wnon-virtual-dtor -Wdelete-non-virtual-dtor -Wsuggest-override -Wstring-conversion -fdiagnostics-color -O3  -isysroot /Applications/Xcode.app/Contents/Developer/Platforms/MacOSX.platform/Developer/SDKs/MacOSX10.15.sdk    -fno-exceptions -fno-rtti -UNDEBUG -std=c++14 -MD -MT lib/ProfileData/CMakeFiles/LLVMProfileData.dir/InstrProfWriter.cpp.o -MF lib/ProfileData/CMakeFiles/LLVMProfileData.dir/InstrProfWriter.cpp.o.d -o lib/ProfileData/CMakeFiles/LLVMProfileData.dir/InstrProfWriter.cpp.o -c /Users/buildslave/jenkins/workspace/lldb-cmake/llvm-project/llvm/lib/ProfileData/InstrProfWriter.cpp
[2418/5202] /Users/buildslave/jenkins/workspace/lldb-cmake/host-compiler/bin/clang++  -DGTEST_HAS_RTTI=0 -D_DEBUG -D__STDC_CONSTANT_MACROS -D__STDC_FORMAT_MACROS -D__STDC_LIMIT_MACROS -Ilib/ProfileData -I/Users/buildslave/jenkins/workspace/lldb-cmake/llvm-project/llvm/lib/ProfileData -Iinclude -I/Users/buildslave/jenkins/workspace/lldb-cmake/llvm-project/llvm/include -Wdocumentation -fPIC -fvisibility-inlines-hidden -Werror=date-time -Werror=unguarded-availability-new -fmodules -fmodules-cache-path=/Users/buildslave/jenkins/workspace/lldb-cmake/lldb-build/module.cache -fcxx-modules -Xclang -fmodules-local-submodule-visibility -Wall -Wextra -Wno-unused-parameter -Wwrite-strings -Wcast-qual -Wmissing-field-initializers -pedantic -Wno-long-long -Wimplicit-fallthrough -Wcovered-switch-default -Wno-noexcept-type -Wnon-virtual-dtor -Wdelete-non-virtual-dtor -Wsuggest-override -Wstring-conversion -fdiagnostics-color -O3  -isysroot /Applications/Xcode.app/Contents/Developer/Platforms/MacOSX.platform/Developer/SDKs/MacOSX10.15.sdk    -fno-exceptions -fno-rtti -UNDEBUG -std=c++14 -MD -MT lib/ProfileData/CMakeFiles/LLVMProfileData.dir/InstrProfReader.cpp.o -MF lib/ProfileData/CMakeFiles/LLVMProfileData.dir/InstrProfReader.cpp.o.d -o lib/ProfileData/CMakeFiles/LLVMProfileData.dir/InstrProfReader.cpp.o -c /Users/buildslave/jenkins/workspace/lldb-cmake/llvm-project/llvm/lib/ProfileData/InstrProfReader.cpp
[2419/5202] /Users/buildslave/jenkins/workspace/lldb-cmake/host-compiler/bin/clang++  -DGTEST_HAS_RTTI=0 -D_DEBUG -D__STDC_CONSTANT_MACROS -D__STDC_FORMAT_MACROS -D__STDC_LIMIT_MACROS -Ilib/Passes -I/Users/buildslave/jenkins/workspace/lldb-cmake/llvm-project/llvm/lib/Passes -Iinclude -I/Users/buildslave/jenkins/workspace/lldb-cmake/llvm-project/llvm/include -Wdocumentation -fPIC -fvisibility-inlines-hidden -Werror=date-time -Werror=unguarded-availability-new -fmodules -fmodules-cache-path=/Users/buildslave/jenkins/workspace/lldb-cmake/lldb-build/module.cache -fcxx-modules -Xclang -fmodules-local-submodule-visibility -Wall -Wextra -Wno-unused-parameter -Wwrite-strings -Wcast-qual -Wmissing-field-initializers -pedantic -Wno-long-long -Wimplicit-fallthrough -Wcovered-switch-default -Wno-noexcept-type -Wnon-virtual-dtor -Wdelete-non-virtual-dtor -Wsuggest-override -Wstring-conversion -fdiagnostics-color -O3  -isysroot /Applications/Xcode.app/Contents/Developer/Platforms/MacOSX.platform/Developer/SDKs/MacOSX10.15.sdk    -fno-exceptions -fno-rtti -UNDEBUG -std=c++14 -MD -MT lib/Passes/CMakeFiles/LLVMPasses.dir/PassPlugin.cpp.o -MF lib/Passes/CMakeFiles/LLVMPasses.dir/PassPlugin.cpp.o.d -o lib/Passes/CMakeFiles/LLVMPasses.dir/PassPlugin.cpp.o -c /Users/buildslave/jenkins/workspace/lldb-cmake/llvm-project/llvm/lib/Passes/PassPlugin.cpp
[2420/5202] /Users/buildslave/jenkins/workspace/lldb-cmake/host-compiler/bin/clang++  -DGTEST_HAS_RTTI=0 -D_DEBUG -D__STDC_CONSTANT_MACROS -D__STDC_FORMAT_MACROS -D__STDC_LIMIT_MACROS -Ilib/ProfileData/Coverage -I/Users/buildslave/jenkins/workspace/lldb-cmake/llvm-project/llvm/lib/ProfileData/Coverage -Iinclude -I/Users/buildslave/jenkins/workspace/lldb-cmake/llvm-project/llvm/include -Wdocumentation -fPIC -fvisibility-inlines-hidden -Werror=date-time -Werror=unguarded-availability-new -fmodules -fmodules-cache-path=/Users/buildslave/jenkins/workspace/lldb-cmake/lldb-build/module.cache -fcxx-modules -Xclang -fmodules-local-submodule-visibility -Wall -Wextra -Wno-unused-parameter -Wwrite-strings -Wcast-qual -Wmissing-field-initializers -pedantic -Wno-long-long -Wimplicit-fallthrough -Wcovered-switch-default -Wno-noexcept-type -Wnon-virtual-dtor -Wdelete-non-virtual-dtor -Wsuggest-override -Wstring-conversion -fdiagnostics-color -O3  -isysroot /Applications/Xcode.app/Contents/Developer/Platforms/MacOSX.platform/Developer/SDKs/MacOSX10.15.sdk    -fno-exceptions -fno-rtti -UNDEBUG -std=c++14 -MD -MT lib/ProfileData/Coverage/CMakeFiles/LLVMCoverage.dir/CoverageMappingWriter.cpp.o -MF lib/ProfileData/Coverage/CMakeFiles/LLVMCoverage.dir/CoverageMappingWriter.cpp.o.d -o lib/ProfileData/Coverage/CMakeFiles/LLVMCoverage.dir/CoverageMappingWriter.cpp.o -c /Users/buildslave/jenkins/workspace/lldb-cmake/llvm-project/llvm/lib/ProfileData/Coverage/CoverageMappingWriter.cpp
[2421/5202] /Users/buildslave/jenkins/workspace/lldb-cmake/host-compiler/bin/clang++  -DGTEST_HAS_RTTI=0 -D_DEBUG -D__STDC_CONSTANT_MACROS -D__STDC_FORMAT_MACROS -D__STDC_LIMIT_MACROS -Ilib/TextAPI -I/Users/buildslave/jenkins/workspace/lldb-cmake/llvm-project/llvm/lib/TextAPI -Iinclude -I/Users/buildslave/jenkins/workspace/lldb-cmake/llvm-project/llvm/include -Wdocumentation -fPIC -fvisibility-inlines-hidden -Werror=date-time -Werror=unguarded-availability-new -fmodules -fmodules-cache-path=/Users/buildslave/jenkins/workspace/lldb-cmake/lldb-build/module.cache -fcxx-modules -Xclang -fmodules-local-submodule-visibility -Wall -Wextra -Wno-unused-parameter -Wwrite-strings -Wcast-qual -Wmissing-field-initializers -pedantic -Wno-long-long -Wimplicit-fallthrough -Wcovered-switch-default -Wno-noexcept-type -Wnon-virtual-dtor -Wdelete-non-virtual-dtor -Wsuggest-override -Wstring-conversion -fdiagnostics-color -O3  -isysroot /Applications/Xcode.app/Contents/Developer/Platforms/MacOSX.platform/Developer/SDKs/MacOSX10.15.sdk    -fno-exceptions -fno-rtti -UNDEBUG -std=c++14 -MD -MT lib/TextAPI/CMakeFiles/LLVMTextAPI.dir/MachO/Architecture.cpp.o -MF lib/TextAPI/CMakeFiles/LLVMTextAPI.dir/MachO/Architecture.cpp.o.d -o lib/TextAPI/CMakeFiles/LLVMTextAPI.dir/MachO/Architecture.cpp.o -c /Users/buildslave/jenkins/workspace/lldb-cmake/llvm-project/llvm/lib/TextAPI/MachO/Architecture.cpp
[2422/5202] /Users/buildslave/jenkins/workspace/lldb-cmake/host-compiler/bin/clang++  -DGTEST_HAS_RTTI=0 -D_DEBUG -D__STDC_CONSTANT_MACROS -D__STDC_FORMAT_MACROS -D__STDC_LIMIT_MACROS -Ilib/Target/X86/AsmParser -I/Users/buildslave/jenkins/workspace/lldb-cmake/llvm-project/llvm/lib/Target/X86/AsmParser -I/Users/buildslave/jenkins/workspace/lldb-cmake/llvm-project/llvm/lib/Target/X86 -Ilib/Target/X86 -Iinclude -I/Users/buildslave/jenkins/workspace/lldb-cmake/llvm-project/llvm/include -Wdocumentation -fPIC -fvisibility-inlines-hidden -Werror=date-time -Werror=unguarded-availability-new -fmodules -fmodules-cache-path=/Users/buildslave/jenkins/workspace/lldb-cmake/lldb-build/module.cache -fcxx-modules -Xclang -fmodules-local-submodule-visibility -Wall -Wextra -Wno-unused-parameter -Wwrite-strings -Wcast-qual -Wmissing-field-initializers -pedantic -Wno-long-long -Wimplicit-fallthrough -Wcovered-switch-default -Wno-noexcept-type -Wnon-virtual-dtor -Wdelete-non-virtual-dtor -Wsuggest-override -Wstring-conversion -fdiagnostics-color -O3  -isysroot /Applications/Xcode.app/Contents/Developer/Platforms/MacOSX.platform/Developer/SDKs/MacOSX10.15.sdk    -fno-exceptions -fno-rtti -UNDEBUG -std=c++14 -MD -MT lib/Target/X86/AsmParser/CMakeFiles/LLVMX86AsmParser.dir/X86AsmParser.cpp.o -MF lib/Target/X86/AsmParser/CMakeFiles/LLVMX86AsmParser.dir/X86AsmParser.cpp.o.d -o lib/Target/X86/AsmParser/CMakeFiles/LLVMX86AsmParser.dir/X86AsmParser.cpp.o -c /Users/buildslave/jenkins/workspace/lldb-cmake/llvm-project/llvm/lib/Target/X86/AsmParser/X86AsmParser.cpp
[2423/5202] /Users/buildslave/jenkins/workspace/lldb-cmake/host-compiler/bin/clang++  -DGTEST_HAS_RTTI=0 -D_DEBUG -D__STDC_CONSTANT_MACROS -D__STDC_FORMAT_MACROS -D__STDC_LIMIT_MACROS -Ilib/Target/X86/MCTargetDesc -I/Users/buildslave/jenkins/workspace/lldb-cmake/llvm-project/llvm/lib/Target/X86/MCTargetDesc -I/Users/buildslave/jenkins/workspace/lldb-cmake/llvm-project/llvm/lib/Target/X86 -Ilib/Target/X86 -Iinclude -I/Users/buildslave/jenkins/workspace/lldb-cmake/llvm-project/llvm/include -Wdocumentation -fPIC -fvisibility-inlines-hidden -Werror=date-time -Werror=unguarded-availability-new -fmodules -fmodules-cache-path=/Users/buildslave/jenkins/workspace/lldb-cmake/lldb-build/module.cache -fcxx-modules -Xclang -fmodules-local-submodule-visibility -Wall -Wextra -Wno-unused-parameter -Wwrite-strings -Wcast-qual -Wmissing-field-initializers -pedantic -Wno-long-long -Wimplicit-fallthrough -Wcovered-switch-default -Wno-noexcept-type -Wnon-virtual-dtor -Wdelete-non-virtual-dtor -Wsuggest-override -Wstring-conversion -fdiagnostics-color -O3  -isysroot /Applications/Xcode.app/Contents/Developer/Platforms/MacOSX.platform/Developer/SDKs/MacOSX10.15.sdk    -fno-exceptions -fno-rtti -UNDEBUG -std=c++14 -MD -MT lib/Target/X86/MCTargetDesc/CMakeFiles/LLVMX86Desc.dir/X86MCTargetDesc.cpp.o -MF lib/Target/X86/MCTargetDesc/CMakeFiles/LLVMX86Desc.dir/X86MCTargetDesc.cpp.o.d -o lib/Target/X86/MCTargetDesc/CMakeFiles/LLVMX86Desc.dir/X86MCTargetDesc.cpp.o -c /Users/buildslave/jenkins/workspace/lldb-cmake/llvm-project/llvm/lib/Target/X86/MCTargetDesc/X86MCTargetDesc.cpp
[2424/5202] : && "/Applications/Xcode.app/Contents/Developer/Toolchains/XcodeDefault.xctoolchain/usr/bin/libtool" -static -no_warning_for_no_symbols -o lib/libLLVMX86Desc.a  lib/Target/X86/MCTargetDesc/CMakeFiles/LLVMX86Desc.dir/X86ATTInstPrinter.cpp.o lib/Target/X86/MCTargetDesc/CMakeFiles/LLVMX86Desc.dir/X86IntelInstPrinter.cpp.o lib/Target/X86/MCTargetDesc/CMakeFiles/LLVMX86Desc.dir/X86InstComments.cpp.o lib/Target/X86/MCTargetDesc/CMakeFiles/LLVMX86Desc.dir/X86InstPrinterCommon.cpp.o lib/Target/X86/MCTargetDesc/CMakeFiles/LLVMX86Desc.dir/X86ShuffleDecode.cpp.o lib/Target/X86/MCTargetDesc/CMakeFiles/LLVMX86Desc.dir/X86AsmBackend.cpp.o lib/Target/X86/MCTargetDesc/CMakeFiles/LLVMX86Desc.dir/X86MCTargetDesc.cpp.o lib/Target/X86/MCTargetDesc/CMakeFiles/LLVMX86Desc.dir/X86MCAsmInfo.cpp.o lib/Target/X86/MCTargetDesc/CMakeFiles/LLVMX86Desc.dir/X86MCCodeEmitter.cpp.o lib/Target/X86/MCTargetDesc/CMakeFiles/LLVMX86Desc.dir/X86MachObjectWriter.cpp.o lib/Target/X86/MCTargetDesc/CMakeFiles/LLVMX86Desc.dir/X86ELFObjectWriter.cpp.o lib/Target/X86/MCTargetDesc/CMakeFiles/LLVMX86Desc.dir/X86WinCOFFObjectWriter.cpp.o lib/Target/X86/MCTargetDesc/CMakeFiles/LLVMX86Desc.dir/X86WinCOFFStreamer.cpp.o lib/Target/X86/MCTargetDesc/CMakeFiles/LLVMX86Desc.dir/X86WinCOFFTargetStreamer.cpp.o && :
[2425/5202] : && "/Applications/Xcode.app/Contents/Developer/Toolchains/XcodeDefault.xctoolchain/usr/bin/libtool" -static -no_warning_for_no_symbols -o lib/libLLVMX86AsmParser.a  lib/Target/X86/AsmParser/CMakeFiles/LLVMX86AsmParser.dir/X86AsmParser.cpp.o && :
[2426/5202] /Users/buildslave/jenkins/workspace/lldb-cmake/host-compiler/bin/clang++  -DGTEST_HAS_RTTI=0 -D_DEBUG -D__STDC_CONSTANT_MACROS -D__STDC_FORMAT_MACROS -D__STDC_LIMIT_MACROS -Ilib/TextAPI -I/Users/buildslave/jenkins/workspace/lldb-cmake/llvm-project/llvm/lib/TextAPI -Iinclude -I/Users/buildslave/jenkins/workspace/lldb-cmake/llvm-project/llvm/include -Wdocumentation -fPIC -fvisibility-inlines-hidden -Werror=date-time -Werror=unguarded-availability-new -fmodules -fmodules-cache-path=/Users/buildslave/jenkins/workspace/lldb-cmake/lldb-build/module.cache -fcxx-modules -Xclang -fmodules-local-submodule-visibility -Wall -Wextra -Wno-unused-parameter -Wwrite-strings -Wcast-qual -Wmissing-field-initializers -pedantic -Wno-long-long -Wimplicit-fallthrough -Wcovered-switch-default -Wno-noexcept-type -Wnon-virtual-dtor -Wdelete-non-virtual-dtor -Wsuggest-override -Wstring-conversion -fdiagnostics-color -O3  -isysroot /Applications/Xcode.app/Contents/Developer/Platforms/MacOSX.platform/Developer/SDKs/MacOSX10.15.sdk    -fno-exceptions -fno-rtti -UNDEBUG -std=c++14 -MD -MT lib/TextAPI/CMakeFiles/LLVMTextAPI.dir/MachO/ArchitectureSet.cpp.o -MF lib/TextAPI/CMakeFiles/LLVMTextAPI.dir/MachO/ArchitectureSet.cpp.o.d -o lib/TextAPI/CMakeFiles/LLVMTextAPI.dir/MachO/ArchitectureSet.cpp.o -c /Users/buildslave/jenkins/workspace/lldb-cmake/llvm-project/llvm/lib/TextAPI/MachO/ArchitectureSet.cpp
[2427/5202] /Users/buildslave/jenkins/workspace/lldb-cmake/host-compiler/bin/clang++  -DGTEST_HAS_RTTI=0 -D_DEBUG -D__STDC_CONSTANT_MACROS -D__STDC_FORMAT_MACROS -D__STDC_LIMIT_MACROS -Ilib/ProfileData -I/Users/buildslave/jenkins/workspace/lldb-cmake/llvm-project/llvm/lib/ProfileData -Iinclude -I/Users/buildslave/jenkins/workspace/lldb-cmake/llvm-project/llvm/include -Wdocumentation -fPIC -fvisibility-inlines-hidden -Werror=date-time -Werror=unguarded-availability-new -fmodules -fmodules-cache-path=/Users/buildslave/jenkins/workspace/lldb-cmake/lldb-build/module.cache -fcxx-modules -Xclang -fmodules-local-submodule-visibility -Wall -Wextra -Wno-unused-parameter -Wwrite-strings -Wcast-qual -Wmissing-field-initializers -pedantic -Wno-long-long -Wimplicit-fallthrough -Wcovered-switch-default -Wno-noexcept-type -Wnon-virtual-dtor -Wdelete-non-virtual-dtor -Wsuggest-override -Wstring-conversion -fdiagnostics-color -O3  -isysroot /Applications/Xcode.app/Contents/Developer/Platforms/MacOSX.platform/Developer/SDKs/MacOSX10.15.sdk    -fno-exceptions -fno-rtti -UNDEBUG -std=c++14 -MD -MT lib/ProfileData/CMakeFiles/LLVMProfileData.dir/SampleProfWriter.cpp.o -MF lib/ProfileData/CMakeFiles/LLVMProfileData.dir/SampleProfWriter.cpp.o.d -o lib/ProfileData/CMakeFiles/LLVMProfileData.dir/SampleProfWriter.cpp.o -c /Users/buildslave/jenkins/workspace/lldb-cmake/llvm-project/llvm/lib/ProfileData/SampleProfWriter.cpp
[2428/5202] /Users/buildslave/jenkins/workspace/lldb-cmake/host-compiler/bin/clang++  -DGTEST_HAS_RTTI=0 -D_DEBUG -D__STDC_CONSTANT_MACROS -D__STDC_FORMAT_MACROS -D__STDC_LIMIT_MACROS -Ilib/TextAPI -I/Users/buildslave/jenkins/workspace/lldb-cmake/llvm-project/llvm/lib/TextAPI -Iinclude -I/Users/buildslave/jenkins/workspace/lldb-cmake/llvm-project/llvm/include -Wdocumentation -fPIC -fvisibility-inlines-hidden -Werror=date-time -Werror=unguarded-availability-new -fmodules -fmodules-cache-path=/Users/buildslave/jenkins/workspace/lldb-cmake/lldb-build/module.cache -fcxx-modules -Xclang -fmodules-local-submodule-visibility -Wall -Wextra -Wno-unused-parameter -Wwrite-strings -Wcast-qual -Wmissing-field-initializers -pedantic -Wno-long-long -Wimplicit-fallthrough -Wcovered-switch-default -Wno-noexcept-type -Wnon-virtual-dtor -Wdelete-non-virtual-dtor -Wsuggest-override -Wstring-conversion -fdiagnostics-color -O3  -isysroot /Applications/Xcode.app/Contents/Developer/Platforms/MacOSX.platform/Developer/SDKs/MacOSX10.15.sdk    -fno-exceptions -fno-rtti -UNDEBUG -std=c++14 -MD -MT lib/TextAPI/CMakeFiles/LLVMTextAPI.dir/MachO/PackedVersion.cpp.o -MF lib/TextAPI/CMakeFiles/LLVMTextAPI.dir/MachO/PackedVersion.cpp.o.d -o lib/TextAPI/CMakeFiles/LLVMTextAPI.dir/MachO/PackedVersion.cpp.o -c /Users/buildslave/jenkins/workspace/lldb-cmake/llvm-project/llvm/lib/TextAPI/MachO/PackedVersion.cpp
[2429/5202] /Users/buildslave/jenkins/workspace/lldb-cmake/host-compiler/bin/clang++  -DGTEST_HAS_RTTI=0 -D_DEBUG -D__STDC_CONSTANT_MACROS -D__STDC_FORMAT_MACROS -D__STDC_LIMIT_MACROS -Ilib/ProfileData -I/Users/buildslave/jenkins/workspace/lldb-cmake/llvm-project/llvm/lib/ProfileData -Iinclude -I/Users/buildslave/jenkins/workspace/lldb-cmake/llvm-project/llvm/include -Wdocumentation -fPIC -fvisibility-inlines-hidden -Werror=date-time -Werror=unguarded-availability-new -fmodules -fmodules-cache-path=/Users/buildslave/jenkins/workspace/lldb-cmake/lldb-build/module.cache -fcxx-modules -Xclang -fmodules-local-submodule-visibility -Wall -Wextra -Wno-unused-parameter -Wwrite-strings -Wcast-qual -Wmissing-field-initializers -pedantic -Wno-long-long -Wimplicit-fallthrough -Wcovered-switch-default -Wno-noexcept-type -Wnon-virtual-dtor -Wdelete-non-virtual-dtor -Wsuggest-override -Wstring-conversion -fdiagnostics-color -O3  -isysroot /Applications/Xcode.app/Contents/Developer/Platforms/MacOSX.platform/Developer/SDKs/MacOSX10.15.sdk    -fno-exceptions -fno-rtti -UNDEBUG -std=c++14 -MD -MT lib/ProfileData/CMakeFiles/LLVMProfileData.dir/SampleProfReader.cpp.o -MF lib/ProfileData/CMakeFiles/LLVMProfileData.dir/SampleProfReader.cpp.o.d -o lib/ProfileData/CMakeFiles/LLVMProfileData.dir/SampleProfReader.cpp.o -c /Users/buildslave/jenkins/workspace/lldb-cmake/llvm-project/llvm/lib/ProfileData/SampleProfReader.cpp
[2430/5202] : && "/Applications/Xcode.app/Contents/Developer/Toolchains/XcodeDefault.xctoolchain/usr/bin/libtool" -static -no_warning_for_no_symbols -o lib/libLLVMProfileData.a  lib/ProfileData/CMakeFiles/LLVMProfileData.dir/GCOV.cpp.o lib/ProfileData/CMakeFiles/LLVMProfileData.dir/InstrProf.cpp.o lib/ProfileData/CMakeFiles/LLVMProfileData.dir/InstrProfReader.cpp.o lib/ProfileData/CMakeFiles/LLVMProfileData.dir/InstrProfWriter.cpp.o lib/ProfileData/CMakeFiles/LLVMProfileData.dir/ProfileSummaryBuilder.cpp.o lib/ProfileData/CMakeFiles/LLVMProfileData.dir/SampleProf.cpp.o lib/ProfileData/CMakeFiles/LLVMProfileData.dir/SampleProfReader.cpp.o lib/ProfileData/CMakeFiles/LLVMProfileData.dir/SampleProfWriter.cpp.o && :
[2431/5202] /Users/buildslave/jenkins/workspace/lldb-cmake/host-compiler/bin/clang++  -DGTEST_HAS_RTTI=0 -D_DEBUG -D__STDC_CONSTANT_MACROS -D__STDC_FORMAT_MACROS -D__STDC_LIMIT_MACROS -Ilib/TextAPI -I/Users/buildslave/jenkins/workspace/lldb-cmake/llvm-project/llvm/lib/TextAPI -Iinclude -I/Users/buildslave/jenkins/workspace/lldb-cmake/llvm-project/llvm/include -Wdocumentation -fPIC -fvisibility-inlines-hidden -Werror=date-time -Werror=unguarded-availability-new -fmodules -fmodules-cache-path=/Users/buildslave/jenkins/workspace/lldb-cmake/lldb-build/module.cache -fcxx-modules -Xclang -fmodules-local-submodule-visibility -Wall -Wextra -Wno-unused-parameter -Wwrite-strings -Wcast-qual -Wmissing-field-initializers -pedantic -Wno-long-long -Wimplicit-fallthrough -Wcovered-switch-default -Wno-noexcept-type -Wnon-virtual-dtor -Wdelete-non-virtual-dtor -Wsuggest-override -Wstring-conversion -fdiagnostics-color -O3  -isysroot /Applications/Xcode.app/Contents/Developer/Platforms/MacOSX.platform/Developer/SDKs/MacOSX10.15.sdk    -fno-exceptions -fno-rtti -UNDEBUG -std=c++14 -MD -MT lib/TextAPI/CMakeFiles/LLVMTextAPI.dir/MachO/Platform.cpp.o -MF lib/TextAPI/CMakeFiles/LLVMTextAPI.dir/MachO/Platform.cpp.o.d -o lib/TextAPI/CMakeFiles/LLVMTextAPI.dir/MachO/Platform.cpp.o -c /Users/buildslave/jenkins/workspace/lldb-cmake/llvm-project/llvm/lib/TextAPI/MachO/Platform.cpp
[2432/5202] /Users/buildslave/jenkins/workspace/lldb-cmake/host-compiler/bin/clang++  -DGTEST_HAS_RTTI=0 -D_DEBUG -D__STDC_CONSTANT_MACROS -D__STDC_FORMAT_MACROS -D__STDC_LIMIT_MACROS -Ilib/TextAPI -I/Users/buildslave/jenkins/workspace/lldb-cmake/llvm-project/llvm/lib/TextAPI -Iinclude -I/Users/buildslave/jenkins/workspace/lldb-cmake/llvm-project/llvm/include -Wdocumentation -fPIC -fvisibility-inlines-hidden -Werror=date-time -Werror=unguarded-availability-new -fmodules -fmodules-cache-path=/Users/buildslave/jenkins/workspace/lldb-cmake/lldb-build/module.cache -fcxx-modules -Xclang -fmodules-local-submodule-visibility -Wall -Wextra -Wno-unused-parameter -Wwrite-strings -Wcast-qual -Wmissing-field-initializers -pedantic -Wno-long-long -Wimplicit-fallthrough -Wcovered-switch-default -Wno-noexcept-type -Wnon-virtual-dtor -Wdelete-non-virtual-dtor -Wsuggest-override -Wstring-conversion -fdiagnostics-color -O3  -isysroot /Applications/Xcode.app/Contents/Developer/Platforms/MacOSX.platform/Developer/SDKs/MacOSX10.15.sdk    -fno-exceptions -fno-rtti -UNDEBUG -std=c++14 -MD -MT lib/TextAPI/CMakeFiles/LLVMTextAPI.dir/MachO/Symbol.cpp.o -MF lib/TextAPI/CMakeFiles/LLVMTextAPI.dir/MachO/Symbol.cpp.o.d -o lib/TextAPI/CMakeFiles/LLVMTextAPI.dir/MachO/Symbol.cpp.o -c /Users/buildslave/jenkins/workspace/lldb-cmake/llvm-project/llvm/lib/TextAPI/MachO/Symbol.cpp
[2433/5202] cd /Users/buildslave/jenkins/workspace/lldb-cmake/lldb-build && /Users/buildslave/jenkins/workspace/lldb-cmake/lldb-build/bin/llvm-tblgen -gen-opt-parser-defs -I /Users/buildslave/jenkins/workspace/lldb-cmake/llvm-project/llvm/lib/ToolDrivers/llvm-dlltool -I/Users/buildslave/jenkins/workspace/lldb-cmake/lldb-build/include -I/Users/buildslave/jenkins/workspace/lldb-cmake/llvm-project/llvm/include /Users/buildslave/jenkins/workspace/lldb-cmake/llvm-project/llvm/lib/ToolDrivers/llvm-dlltool/Options.td --write-if-changed -o lib/ToolDrivers/llvm-dlltool/Options.inc -d lib/ToolDrivers/llvm-dlltool/Options.inc.d
[2434/5202] /Users/buildslave/jenkins/workspace/lldb-cmake/host-compiler/bin/clang++  -DGTEST_HAS_RTTI=0 -D_DEBUG -D__STDC_CONSTANT_MACROS -D__STDC_FORMAT_MACROS -D__STDC_LIMIT_MACROS -Ilib/TextAPI -I/Users/buildslave/jenkins/workspace/lldb-cmake/llvm-project/llvm/lib/TextAPI -Iinclude -I/Users/buildslave/jenkins/workspace/lldb-cmake/llvm-project/llvm/include -Wdocumentation -fPIC -fvisibility-inlines-hidden -Werror=date-time -Werror=unguarded-availability-new -fmodules -fmodules-cache-path=/Users/buildslave/jenkins/workspace/lldb-cmake/lldb-build/module.cache -fcxx-modules -Xclang -fmodules-local-submodule-visibility -Wall -Wextra -Wno-unused-parameter -Wwrite-strings -Wcast-qual -Wmissing-field-initializers -pedantic -Wno-long-long -Wimplicit-fallthrough -Wcovered-switch-default -Wno-noexcept-type -Wnon-virtual-dtor -Wdelete-non-virtual-dtor -Wsuggest-override -Wstring-conversion -fdiagnostics-color -O3  -isysroot /Applications/Xcode.app/Contents/Developer/Platforms/MacOSX.platform/Developer/SDKs/MacOSX10.15.sdk    -fno-exceptions -fno-rtti -UNDEBUG -std=c++14 -MD -MT lib/TextAPI/CMakeFiles/LLVMTextAPI.dir/MachO/Target.cpp.o -MF lib/TextAPI/CMakeFiles/LLVMTextAPI.dir/MachO/Target.cpp.o.d -o lib/TextAPI/CMakeFiles/LLVMTextAPI.dir/MachO/Target.cpp.o -c /Users/buildslave/jenkins/workspace/lldb-cmake/llvm-project/llvm/lib/TextAPI/MachO/Target.cpp
[2435/5202] cd /Users/buildslave/jenkins/workspace/lldb-cmake/lldb-build && /Users/buildslave/jenkins/workspace/lldb-cmake/lldb-build/bin/llvm-tblgen -gen-opt-parser-defs -I /Users/buildslave/jenkins/workspace/lldb-cmake/llvm-project/llvm/lib/ToolDrivers/llvm-lib -I/Users/buildslave/jenkins/workspace/lldb-cmake/lldb-build/include -I/Users/buildslave/jenkins/workspace/lldb-cmake/llvm-project/llvm/include /Users/buildslave/jenkins/workspace/lldb-cmake/llvm-project/llvm/lib/ToolDrivers/llvm-lib/Options.td --write-if-changed -o lib/ToolDrivers/llvm-lib/Options.inc -d lib/ToolDrivers/llvm-lib/Options.inc.d
[2436/5202] /Users/buildslave/jenkins/workspace/lldb-cmake/host-compiler/bin/clang++  -DGTEST_HAS_RTTI=0 -D_DEBUG -D__STDC_CONSTANT_MACROS -D__STDC_FORMAT_MACROS -D__STDC_LIMIT_MACROS -Ilib/TextAPI -I/Users/buildslave/jenkins/workspace/lldb-cmake/llvm-project/llvm/lib/TextAPI -Iinclude -I/Users/buildslave/jenkins/workspace/lldb-cmake/llvm-project/llvm/include -Wdocumentation -fPIC -fvisibility-inlines-hidden -Werror=date-time -Werror=unguarded-availability-new -fmodules -fmodules-cache-path=/Users/buildslave/jenkins/workspace/lldb-cmake/lldb-build/module.cache -fcxx-modules -Xclang -fmodules-local-submodule-visibility -Wall -Wextra -Wno-unused-parameter -Wwrite-strings -Wcast-qual -Wmissing-field-initializers -pedantic -Wno-long-long -Wimplicit-fallthrough -Wcovered-switch-default -Wno-noexcept-type -Wnon-virtual-dtor -Wdelete-non-virtual-dtor -Wsuggest-override -Wstring-conversion -fdiagnostics-color -O3  -isysroot /Applications/Xcode.app/Contents/Developer/Platforms/MacOSX.platform/Developer/SDKs/MacOSX10.15.sdk    -fno-exceptions -fno-rtti -UNDEBUG -std=c++14 -MD -MT lib/TextAPI/CMakeFiles/LLVMTextAPI.dir/MachO/TextStubCommon.cpp.o -MF lib/TextAPI/CMakeFiles/LLVMTextAPI.dir/MachO/TextStubCommon.cpp.o.d -o lib/TextAPI/CMakeFiles/LLVMTextAPI.dir/MachO/TextStubCommon.cpp.o -c /Users/buildslave/jenkins/workspace/lldb-cmake/llvm-project/llvm/lib/TextAPI/MachO/TextStubCommon.cpp
[2437/5202] /Users/buildslave/jenkins/workspace/lldb-cmake/host-compiler/bin/clang++  -DGTEST_HAS_RTTI=0 -D_DEBUG -D__STDC_CONSTANT_MACROS -D__STDC_FORMAT_MACROS -D__STDC_LIMIT_MACROS -Ilib/ToolDrivers/llvm-dlltool -I/Users/buildslave/jenkins/workspace/lldb-cmake/llvm-project/llvm/lib/ToolDrivers/llvm-dlltool -Iinclude -I/Users/buildslave/jenkins/workspace/lldb-cmake/llvm-project/llvm/include -Wdocumentation -fPIC -fvisibility-inlines-hidden -Werror=date-time -Werror=unguarded-availability-new -fmodules -fmodules-cache-path=/Users/buildslave/jenkins/workspace/lldb-cmake/lldb-build/module.cache -fcxx-modules -Xclang -fmodules-local-submodule-visibility -Wall -Wextra -Wno-unused-parameter -Wwrite-strings -Wcast-qual -Wmissing-field-initializers -pedantic -Wno-long-long -Wimplicit-fallthrough -Wcovered-switch-default -Wno-noexcept-type -Wnon-virtual-dtor -Wdelete-non-virtual-dtor -Wsuggest-override -Wstring-conversion -fdiagnostics-color -O3  -isysroot /Applications/Xcode.app/Contents/Developer/Platforms/MacOSX.platform/Developer/SDKs/MacOSX10.15.sdk    -fno-exceptions -fno-rtti -UNDEBUG -std=c++14 -MD -MT lib/ToolDrivers/llvm-dlltool/CMakeFiles/LLVMDlltoolDriver.dir/DlltoolDriver.cpp.o -MF lib/ToolDrivers/llvm-dlltool/CMakeFiles/LLVMDlltoolDriver.dir/DlltoolDriver.cpp.o.d -o lib/ToolDrivers/llvm-dlltool/CMakeFiles/LLVMDlltoolDriver.dir/DlltoolDriver.cpp.o -c /Users/buildslave/jenkins/workspace/lldb-cmake/llvm-project/llvm/lib/ToolDrivers/llvm-dlltool/DlltoolDriver.cpp
[2438/5202] /Users/buildslave/jenkins/workspace/lldb-cmake/host-compiler/bin/clang++  -DGTEST_HAS_RTTI=0 -D_DEBUG -D__STDC_CONSTANT_MACROS -D__STDC_FORMAT_MACROS -D__STDC_LIMIT_MACROS -Ilib/TextAPI -I/Users/buildslave/jenkins/workspace/lldb-cmake/llvm-project/llvm/lib/TextAPI -Iinclude -I/Users/buildslave/jenkins/workspace/lldb-cmake/llvm-project/llvm/include -Wdocumentation -fPIC -fvisibility-inlines-hidden -Werror=date-time -Werror=unguarded-availability-new -fmodules -fmodules-cache-path=/Users/buildslave/jenkins/workspace/lldb-cmake/lldb-build/module.cache -fcxx-modules -Xclang -fmodules-local-submodule-visibility -Wall -Wextra -Wno-unused-parameter -Wwrite-strings -Wcast-qual -Wmissing-field-initializers -pedantic -Wno-long-long -Wimplicit-fallthrough -Wcovered-switch-default -Wno-noexcept-type -Wnon-virtual-dtor -Wdelete-non-virtual-dtor -Wsuggest-override -Wstring-conversion -fdiagnostics-color -O3  -isysroot /Applications/Xcode.app/Contents/Developer/Platforms/MacOSX.platform/Developer/SDKs/MacOSX10.15.sdk    -fno-exceptions -fno-rtti -UNDEBUG -std=c++14 -MD -MT lib/TextAPI/CMakeFiles/LLVMTextAPI.dir/MachO/InterfaceFile.cpp.o -MF lib/TextAPI/CMakeFiles/LLVMTextAPI.dir/MachO/InterfaceFile.cpp.o.d -o lib/TextAPI/CMakeFiles/LLVMTextAPI.dir/MachO/InterfaceFile.cpp.o -c /Users/buildslave/jenkins/workspace/lldb-cmake/llvm-project/llvm/lib/TextAPI/MachO/InterfaceFile.cpp
[2439/5202] /Users/buildslave/jenkins/workspace/lldb-cmake/host-compiler/bin/clang++  -DGTEST_HAS_RTTI=0 -D_DEBUG -D__STDC_CONSTANT_MACROS -D__STDC_FORMAT_MACROS -D__STDC_LIMIT_MACROS -Ilib/XRay -I/Users/buildslave/jenkins/workspace/lldb-cmake/llvm-project/llvm/lib/XRay -Iinclude -I/Users/buildslave/jenkins/workspace/lldb-cmake/llvm-project/llvm/include -Wdocumentation -fPIC -fvisibility-inlines-hidden -Werror=date-time -Werror=unguarded-availability-new -fmodules -fmodules-cache-path=/Users/buildslave/jenkins/workspace/lldb-cmake/lldb-build/module.cache -fcxx-modules -Xclang -fmodules-local-submodule-visibility -Wall -Wextra -Wno-unused-parameter -Wwrite-strings -Wcast-qual -Wmissing-field-initializers -pedantic -Wno-long-long -Wimplicit-fallthrough -Wcovered-switch-default -Wno-noexcept-type -Wnon-virtual-dtor -Wdelete-non-virtual-dtor -Wsuggest-override -Wstring-conversion -fdiagnostics-color -O3  -isysroot /Applications/Xcode.app/Contents/Developer/Platforms/MacOSX.platform/Developer/SDKs/MacOSX10.15.sdk    -fno-exceptions -fno-rtti -UNDEBUG -std=c++14 -MD -MT lib/XRay/CMakeFiles/LLVMXRay.dir/BlockPrinter.cpp.o -MF lib/XRay/CMakeFiles/LLVMXRay.dir/BlockPrinter.cpp.o.d -o lib/XRay/CMakeFiles/LLVMXRay.dir/BlockPrinter.cpp.o -c /Users/buildslave/jenkins/workspace/lldb-cmake/llvm-project/llvm/lib/XRay/BlockPrinter.cpp
[2440/5202] /Users/buildslave/jenkins/workspace/lldb-cmake/host-compiler/bin/clang++  -DGTEST_HAS_RTTI=0 -D_DEBUG -D__STDC_CONSTANT_MACROS -D__STDC_FORMAT_MACROS -D__STDC_LIMIT_MACROS -Ilib/XRay -I/Users/buildslave/jenkins/workspace/lldb-cmake/llvm-project/llvm/lib/XRay -Iinclude -I/Users/buildslave/jenkins/workspace/lldb-cmake/llvm-project/llvm/include -Wdocumentation -fPIC -fvisibility-inlines-hidden -Werror=date-time -Werror=unguarded-availability-new -fmodules -fmodules-cache-path=/Users/buildslave/jenkins/workspace/lldb-cmake/lldb-build/module.cache -fcxx-modules -Xclang -fmodules-local-submodule-visibility -Wall -Wextra -Wno-unused-parameter -Wwrite-strings -Wcast-qual -Wmissing-field-initializers -pedantic -Wno-long-long -Wimplicit-fallthrough -Wcovered-switch-default -Wno-noexcept-type -Wnon-virtual-dtor -Wdelete-non-virtual-dtor -Wsuggest-override -Wstring-conversion -fdiagnostics-color -O3  -isysroot /Applications/Xcode.app/Contents/Developer/Platforms/MacOSX.platform/Developer/SDKs/MacOSX10.15.sdk    -fno-exceptions -fno-rtti -UNDEBUG -std=c++14 -MD -MT lib/XRay/CMakeFiles/LLVMXRay.dir/BlockVerifier.cpp.o -MF lib/XRay/CMakeFiles/LLVMXRay.dir/BlockVerifier.cpp.o.d -o lib/XRay/CMakeFiles/LLVMXRay.dir/BlockVerifier.cpp.o -c /Users/buildslave/jenkins/workspace/lldb-cmake/llvm-project/llvm/lib/XRay/BlockVerifier.cpp
[2441/5202] /Users/buildslave/jenkins/workspace/lldb-cmake/host-compiler/bin/clang++  -DGTEST_HAS_RTTI=0 -D_DEBUG -D__STDC_CONSTANT_MACROS -D__STDC_FORMAT_MACROS -D__STDC_LIMIT_MACROS -Ilib/XRay -I/Users/buildslave/jenkins/workspace/lldb-cmake/llvm-project/llvm/lib/XRay -Iinclude -I/Users/buildslave/jenkins/workspace/lldb-cmake/llvm-project/llvm/include -Wdocumentation -fPIC -fvisibility-inlines-hidden -Werror=date-time -Werror=unguarded-availability-new -fmodules -fmodules-cache-path=/Users/buildslave/jenkins/workspace/lldb-cmake/lldb-build/module.cache -fcxx-modules -Xclang -fmodules-local-submodule-visibility -Wall -Wextra -Wno-unused-parameter -Wwrite-strings -Wcast-qual -Wmissing-field-initializers -pedantic -Wno-long-long -Wimplicit-fallthrough -Wcovered-switch-default -Wno-noexcept-type -Wnon-virtual-dtor -Wdelete-non-virtual-dtor -Wsuggest-override -Wstring-conversion -fdiagnostics-color -O3  -isysroot /Applications/Xcode.app/Contents/Developer/Platforms/MacOSX.platform/Developer/SDKs/MacOSX10.15.sdk    -fno-exceptions -fno-rtti -UNDEBUG -std=c++14 -MD -MT lib/XRay/CMakeFiles/LLVMXRay.dir/BlockIndexer.cpp.o -MF lib/XRay/CMakeFiles/LLVMXRay.dir/BlockIndexer.cpp.o.d -o lib/XRay/CMakeFiles/LLVMXRay.dir/BlockIndexer.cpp.o -c /Users/buildslave/jenkins/workspace/lldb-cmake/llvm-project/llvm/lib/XRay/BlockIndexer.cpp
[2442/5202] /Users/buildslave/jenkins/workspace/lldb-cmake/host-compiler/bin/clang++  -DGTEST_HAS_RTTI=0 -D_DEBUG -D__STDC_CONSTANT_MACROS -D__STDC_FORMAT_MACROS -D__STDC_LIMIT_MACROS -Ilib/XRay -I/Users/buildslave/jenkins/workspace/lldb-cmake/llvm-project/llvm/lib/XRay -Iinclude -I/Users/buildslave/jenkins/workspace/lldb-cmake/llvm-project/llvm/include -Wdocumentation -fPIC -fvisibility-inlines-hidden -Werror=date-time -Werror=unguarded-availability-new -fmodules -fmodules-cache-path=/Users/buildslave/jenkins/workspace/lldb-cmake/lldb-build/module.cache -fcxx-modules -Xclang -fmodules-local-submodule-visibility -Wall -Wextra -Wno-unused-parameter -Wwrite-strings -Wcast-qual -Wmissing-field-initializers -pedantic -Wno-long-long -Wimplicit-fallthrough -Wcovered-switch-default -Wno-noexcept-type -Wnon-virtual-dtor -Wdelete-non-virtual-dtor -Wsuggest-override -Wstring-conversion -fdiagnostics-color -O3  -isysroot /Applications/Xcode.app/Contents/Developer/Platforms/MacOSX.platform/Developer/SDKs/MacOSX10.15.sdk    -fno-exceptions -fno-rtti -UNDEBUG -std=c++14 -MD -MT lib/XRay/CMakeFiles/LLVMXRay.dir/FDRRecords.cpp.o -MF lib/XRay/CMakeFiles/LLVMXRay.dir/FDRRecords.cpp.o.d -o lib/XRay/CMakeFiles/LLVMXRay.dir/FDRRecords.cpp.o -c /Users/buildslave/jenkins/workspace/lldb-cmake/llvm-project/llvm/lib/XRay/FDRRecords.cpp
[2443/5202] /Users/buildslave/jenkins/workspace/lldb-cmake/host-compiler/bin/clang++  -DGTEST_HAS_RTTI=0 -D_DEBUG -D__STDC_CONSTANT_MACROS -D__STDC_FORMAT_MACROS -D__STDC_LIMIT_MACROS -Ilib/Passes -I/Users/buildslave/jenkins/workspace/lldb-cmake/llvm-project/llvm/lib/Passes -Iinclude -I/Users/buildslave/jenkins/workspace/lldb-cmake/llvm-project/llvm/include -Wdocumentation -fPIC -fvisibility-inlines-hidden -Werror=date-time -Werror=unguarded-availability-new -fmodules -fmodules-cache-path=/Users/buildslave/jenkins/workspace/lldb-cmake/lldb-build/module.cache -fcxx-modules -Xclang -fmodules-local-submodule-visibility -Wall -Wextra -Wno-unused-parameter -Wwrite-strings -Wcast-qual -Wmissing-field-initializers -pedantic -Wno-long-long -Wimplicit-fallthrough -Wcovered-switch-default -Wno-noexcept-type -Wnon-virtual-dtor -Wdelete-non-virtual-dtor -Wsuggest-override -Wstring-conversion -fdiagnostics-color -O3  -isysroot /Applications/Xcode.app/Contents/Developer/Platforms/MacOSX.platform/Developer/SDKs/MacOSX10.15.sdk    -fno-exceptions -fno-rtti -UNDEBUG -std=c++14 -MD -MT lib/Passes/CMakeFiles/LLVMPasses.dir/StandardInstrumentations.cpp.o -MF lib/Passes/CMakeFiles/LLVMPasses.dir/StandardInstrumentations.cpp.o.d -o lib/Passes/CMakeFiles/LLVMPasses.dir/StandardInstrumentations.cpp.o -c /Users/buildslave/jenkins/workspace/lldb-cmake/llvm-project/llvm/lib/Passes/StandardInstrumentations.cpp
[2444/5202] /Users/buildslave/jenkins/workspace/lldb-cmake/host-compiler/bin/clang++  -DGTEST_HAS_RTTI=0 -D_DEBUG -D__STDC_CONSTANT_MACROS -D__STDC_FORMAT_MACROS -D__STDC_LIMIT_MACROS -Ilib/XRay -I/Users/buildslave/jenkins/workspace/lldb-cmake/llvm-project/llvm/lib/XRay -Iinclude -I/Users/buildslave/jenkins/workspace/lldb-cmake/llvm-project/llvm/include -Wdocumentation -fPIC -fvisibility-inlines-hidden -Werror=date-time -Werror=unguarded-availability-new -fmodules -fmodules-cache-path=/Users/buildslave/jenkins/workspace/lldb-cmake/lldb-build/module.cache -fcxx-modules -Xclang -fmodules-local-submodule-visibility -Wall -Wextra -Wno-unused-parameter -Wwrite-strings -Wcast-qual -Wmissing-field-initializers -pedantic -Wno-long-long -Wimplicit-fallthrough -Wcovered-switch-default -Wno-noexcept-type -Wnon-virtual-dtor -Wdelete-non-virtual-dtor -Wsuggest-override -Wstring-conversion -fdiagnostics-color -O3  -isysroot /Applications/Xcode.app/Contents/Developer/Platforms/MacOSX.platform/Developer/SDKs/MacOSX10.15.sdk    -fno-exceptions -fno-rtti -UNDEBUG -std=c++14 -MD -MT lib/XRay/CMakeFiles/LLVMXRay.dir/FileHeaderReader.cpp.o -MF lib/XRay/CMakeFiles/LLVMXRay.dir/FileHeaderReader.cpp.o.d -o lib/XRay/CMakeFiles/LLVMXRay.dir/FileHeaderReader.cpp.o -c /Users/buildslave/jenkins/workspace/lldb-cmake/llvm-project/llvm/lib/XRay/FileHeaderReader.cpp
[2445/5202] /Users/buildslave/jenkins/workspace/lldb-cmake/host-compiler/bin/clang++  -DGTEST_HAS_RTTI=0 -D_DEBUG -D__STDC_CONSTANT_MACROS -D__STDC_FORMAT_MACROS -D__STDC_LIMIT_MACROS -Ilib/XRay -I/Users/buildslave/jenkins/workspace/lldb-cmake/llvm-project/llvm/lib/XRay -Iinclude -I/Users/buildslave/jenkins/workspace/lldb-cmake/llvm-project/llvm/include -Wdocumentation -fPIC -fvisibility-inlines-hidden -Werror=date-time -Werror=unguarded-availability-new -fmodules -fmodules-cache-path=/Users/buildslave/jenkins/workspace/lldb-cmake/lldb-build/module.cache -fcxx-modules -Xclang -fmodules-local-submodule-visibility -Wall -Wextra -Wno-unused-parameter -Wwrite-strings -Wcast-qual -Wmissing-field-initializers -pedantic -Wno-long-long -Wimplicit-fallthrough -Wcovered-switch-default -Wno-noexcept-type -Wnon-virtual-dtor -Wdelete-non-virtual-dtor -Wsuggest-override -Wstring-conversion -fdiagnostics-color -O3  -isysroot /Applications/Xcode.app/Contents/Developer/Platforms/MacOSX.platform/Developer/SDKs/MacOSX10.15.sdk    -fno-exceptions -fno-rtti -UNDEBUG -std=c++14 -MD -MT lib/XRay/CMakeFiles/LLVMXRay.dir/FDRTraceExpander.cpp.o -MF lib/XRay/CMakeFiles/LLVMXRay.dir/FDRTraceExpander.cpp.o.d -o lib/XRay/CMakeFiles/LLVMXRay.dir/FDRTraceExpander.cpp.o -c /Users/buildslave/jenkins/workspace/lldb-cmake/llvm-project/llvm/lib/XRay/FDRTraceExpander.cpp
[2446/5202] /Users/buildslave/jenkins/workspace/lldb-cmake/host-compiler/bin/clang++  -DGTEST_HAS_RTTI=0 -D_DEBUG -D__STDC_CONSTANT_MACROS -D__STDC_FORMAT_MACROS -D__STDC_LIMIT_MACROS -Ilib/XRay -I/Users/buildslave/jenkins/workspace/lldb-cmake/llvm-project/llvm/lib/XRay -Iinclude -I/Users/buildslave/jenkins/workspace/lldb-cmake/llvm-project/llvm/include -Wdocumentation -fPIC -fvisibility-inlines-hidden -Werror=date-time -Werror=unguarded-availability-new -fmodules -fmodules-cache-path=/Users/buildslave/jenkins/workspace/lldb-cmake/lldb-build/module.cache -fcxx-modules -Xclang -fmodules-local-submodule-visibility -Wall -Wextra -Wno-unused-parameter -Wwrite-strings -Wcast-qual -Wmissing-field-initializers -pedantic -Wno-long-long -Wimplicit-fallthrough -Wcovered-switch-default -Wno-noexcept-type -Wnon-virtual-dtor -Wdelete-non-virtual-dtor -Wsuggest-override -Wstring-conversion -fdiagnostics-color -O3  -isysroot /Applications/Xcode.app/Contents/Developer/Platforms/MacOSX.platform/Developer/SDKs/MacOSX10.15.sdk    -fno-exceptions -fno-rtti -UNDEBUG -std=c++14 -MD -MT lib/XRay/CMakeFiles/LLVMXRay.dir/FDRTraceWriter.cpp.o -MF lib/XRay/CMakeFiles/LLVMXRay.dir/FDRTraceWriter.cpp.o.d -o lib/XRay/CMakeFiles/LLVMXRay.dir/FDRTraceWriter.cpp.o -c /Users/buildslave/jenkins/workspace/lldb-cmake/llvm-project/llvm/lib/XRay/FDRTraceWriter.cpp
[2447/5202] /Users/buildslave/jenkins/workspace/lldb-cmake/host-compiler/bin/clang++  -DGTEST_HAS_RTTI=0 -D_DEBUG -D__STDC_CONSTANT_MACROS -D__STDC_FORMAT_MACROS -D__STDC_LIMIT_MACROS -Ilib/XRay -I/Users/buildslave/jenkins/workspace/lldb-cmake/llvm-project/llvm/lib/XRay -Iinclude -I/Users/buildslave/jenkins/workspace/lldb-cmake/llvm-project/llvm/include -Wdocumentation -fPIC -fvisibility-inlines-hidden -Werror=date-time -Werror=unguarded-availability-new -fmodules -fmodules-cache-path=/Users/buildslave/jenkins/workspace/lldb-cmake/lldb-build/module.cache -fcxx-modules -Xclang -fmodules-local-submodule-visibility -Wall -Wextra -Wno-unused-parameter -Wwrite-strings -Wcast-qual -Wmissing-field-initializers -pedantic -Wno-long-long -Wimplicit-fallthrough -Wcovered-switch-default -Wno-noexcept-type -Wnon-virtual-dtor -Wdelete-non-virtual-dtor -Wsuggest-override -Wstring-conversion -fdiagnostics-color -O3  -isysroot /Applications/Xcode.app/Contents/Developer/Platforms/MacOSX.platform/Developer/SDKs/MacOSX10.15.sdk    -fno-exceptions -fno-rtti -UNDEBUG -std=c++14 -MD -MT lib/XRay/CMakeFiles/LLVMXRay.dir/FDRRecordProducer.cpp.o -MF lib/XRay/CMakeFiles/LLVMXRay.dir/FDRRecordProducer.cpp.o.d -o lib/XRay/CMakeFiles/LLVMXRay.dir/FDRRecordProducer.cpp.o -c /Users/buildslave/jenkins/workspace/lldb-cmake/llvm-project/llvm/lib/XRay/FDRRecordProducer.cpp
[2448/5202] /Users/buildslave/jenkins/workspace/lldb-cmake/host-compiler/bin/clang++  -DGTEST_HAS_RTTI=0 -D_DEBUG -D__STDC_CONSTANT_MACROS -D__STDC_FORMAT_MACROS -D__STDC_LIMIT_MACROS -Ilib/ProfileData/Coverage -I/Users/buildslave/jenkins/workspace/lldb-cmake/llvm-project/llvm/lib/ProfileData/Coverage -Iinclude -I/Users/buildslave/jenkins/workspace/lldb-cmake/llvm-project/llvm/include -Wdocumentation -fPIC -fvisibility-inlines-hidden -Werror=date-time -Werror=unguarded-availability-new -fmodules -fmodules-cache-path=/Users/buildslave/jenkins/workspace/lldb-cmake/lldb-build/module.cache -fcxx-modules -Xclang -fmodules-local-submodule-visibility -Wall -Wextra -Wno-unused-parameter -Wwrite-strings -Wcast-qual -Wmissing-field-initializers -pedantic -Wno-long-long -Wimplicit-fallthrough -Wcovered-switch-default -Wno-noexcept-type -Wnon-virtual-dtor -Wdelete-non-virtual-dtor -Wsuggest-override -Wstring-conversion -fdiagnostics-color -O3  -isysroot /Applications/Xcode.app/Contents/Developer/Platforms/MacOSX.platform/Developer/SDKs/MacOSX10.15.sdk    -fno-exceptions -fno-rtti -UNDEBUG -std=c++14 -MD -MT lib/ProfileData/Coverage/CMakeFiles/LLVMCoverage.dir/CoverageMapping.cpp.o -MF lib/ProfileData/Coverage/CMakeFiles/LLVMCoverage.dir/CoverageMapping.cpp.o.d -o lib/ProfileData/Coverage/CMakeFiles/LLVMCoverage.dir/CoverageMapping.cpp.o -c /Users/buildslave/jenkins/workspace/lldb-cmake/llvm-project/llvm/lib/ProfileData/Coverage/CoverageMapping.cpp
[2449/5202] /Users/buildslave/jenkins/workspace/lldb-cmake/host-compiler/bin/clang++  -DGTEST_HAS_RTTI=0 -D_DEBUG -D__STDC_CONSTANT_MACROS -D__STDC_FORMAT_MACROS -D__STDC_LIMIT_MACROS -Ilib/ToolDrivers/llvm-lib -I/Users/buildslave/jenkins/workspace/lldb-cmake/llvm-project/llvm/lib/ToolDrivers/llvm-lib -Iinclude -I/Users/buildslave/jenkins/workspace/lldb-cmake/llvm-project/llvm/include -Wdocumentation -fPIC -fvisibility-inlines-hidden -Werror=date-time -Werror=unguarded-availability-new -fmodules -fmodules-cache-path=/Users/buildslave/jenkins/workspace/lldb-cmake/lldb-build/module.cache -fcxx-modules -Xclang -fmodules-local-submodule-visibility -Wall -Wextra -Wno-unused-parameter -Wwrite-strings -Wcast-qual -Wmissing-field-initializers -pedantic -Wno-long-long -Wimplicit-fallthrough -Wcovered-switch-default -Wno-noexcept-type -Wnon-virtual-dtor -Wdelete-non-virtual-dtor -Wsuggest-override -Wstring-conversion -fdiagnostics-color -O3  -isysroot /Applications/Xcode.app/Contents/Developer/Platforms/MacOSX.platform/Developer/SDKs/MacOSX10.15.sdk    -fno-exceptions -fno-rtti -UNDEBUG -std=c++14 -MD -MT lib/ToolDrivers/llvm-lib/CMakeFiles/LLVMLibDriver.dir/LibDriver.cpp.o -MF lib/ToolDrivers/llvm-lib/CMakeFiles/LLVMLibDriver.dir/LibDriver.cpp.o.d -o lib/ToolDrivers/llvm-lib/CMakeFiles/LLVMLibDriver.dir/LibDriver.cpp.o -c /Users/buildslave/jenkins/workspace/lldb-cmake/llvm-project/llvm/lib/ToolDrivers/llvm-lib/LibDriver.cpp
[2450/5202] /Users/buildslave/jenkins/workspace/lldb-cmake/host-compiler/bin/clang++  -DGTEST_HAS_RTTI=0 -D_DEBUG -D__STDC_CONSTANT_MACROS -D__STDC_FORMAT_MACROS -D__STDC_LIMIT_MACROS -Ilib/XRay -I/Users/buildslave/jenkins/workspace/lldb-cmake/llvm-project/llvm/lib/XRay -Iinclude -I/Users/buildslave/jenkins/workspace/lldb-cmake/llvm-project/llvm/include -Wdocumentation -fPIC -fvisibility-inlines-hidden -Werror=date-time -Werror=unguarded-availability-new -fmodules -fmodules-cache-path=/Users/buildslave/jenkins/workspace/lldb-cmake/lldb-build/module.cache -fcxx-modules -Xclang -fmodules-local-submodule-visibility -Wall -Wextra -Wno-unused-parameter -Wwrite-strings -Wcast-qual -Wmissing-field-initializers -pedantic -Wno-long-long -Wimplicit-fallthrough -Wcovered-switch-default -Wno-noexcept-type -Wnon-virtual-dtor -Wdelete-non-virtual-dtor -Wsuggest-override -Wstring-conversion -fdiagnostics-color -O3  -isysroot /Applications/Xcode.app/Contents/Developer/Platforms/MacOSX.platform/Developer/SDKs/MacOSX10.15.sdk    -fno-exceptions -fno-rtti -UNDEBUG -std=c++14 -MD -MT lib/XRay/CMakeFiles/LLVMXRay.dir/LogBuilderConsumer.cpp.o -MF lib/XRay/CMakeFiles/LLVMXRay.dir/LogBuilderConsumer.cpp.o.d -o lib/XRay/CMakeFiles/LLVMXRay.dir/LogBuilderConsumer.cpp.o -c /Users/buildslave/jenkins/workspace/lldb-cmake/llvm-project/llvm/lib/XRay/LogBuilderConsumer.cpp
[2451/5202] /Users/buildslave/jenkins/workspace/lldb-cmake/host-compiler/bin/clang++  -DGTEST_HAS_RTTI=0 -D_DEBUG -D__STDC_CONSTANT_MACROS -D__STDC_FORMAT_MACROS -D__STDC_LIMIT_MACROS -Ilib/XRay -I/Users/buildslave/jenkins/workspace/lldb-cmake/llvm-project/llvm/lib/XRay -Iinclude -I/Users/buildslave/jenkins/workspace/lldb-cmake/llvm-project/llvm/include -Wdocumentation -fPIC -fvisibility-inlines-hidden -Werror=date-time -Werror=unguarded-availability-new -fmodules -fmodules-cache-path=/Users/buildslave/jenkins/workspace/lldb-cmake/lldb-build/module.cache -fcxx-modules -Xclang -fmodules-local-submodule-visibility -Wall -Wextra -Wno-unused-parameter -Wwrite-strings -Wcast-qual -Wmissing-field-initializers -pedantic -Wno-long-long -Wimplicit-fallthrough -Wcovered-switch-default -Wno-noexcept-type -Wnon-virtual-dtor -Wdelete-non-virtual-dtor -Wsuggest-override -Wstring-conversion -fdiagnostics-color -O3  -isysroot /Applications/Xcode.app/Contents/Developer/Platforms/MacOSX.platform/Developer/SDKs/MacOSX10.15.sdk    -fno-exceptions -fno-rtti -UNDEBUG -std=c++14 -MD -MT lib/XRay/CMakeFiles/LLVMXRay.dir/RecordInitializer.cpp.o -MF lib/XRay/CMakeFiles/LLVMXRay.dir/RecordInitializer.cpp.o.d -o lib/XRay/CMakeFiles/LLVMXRay.dir/RecordInitializer.cpp.o -c /Users/buildslave/jenkins/workspace/lldb-cmake/llvm-project/llvm/lib/XRay/RecordInitializer.cpp
[2452/5202] /Users/buildslave/jenkins/workspace/lldb-cmake/host-compiler/bin/clang++  -DGTEST_HAS_RTTI=0 -D_DEBUG -D__STDC_CONSTANT_MACROS -D__STDC_FORMAT_MACROS -D__STDC_LIMIT_MACROS -Ilib/XRay -I/Users/buildslave/jenkins/workspace/lldb-cmake/llvm-project/llvm/lib/XRay -Iinclude -I/Users/buildslave/jenkins/workspace/lldb-cmake/llvm-project/llvm/include -Wdocumentation -fPIC -fvisibility-inlines-hidden -Werror=date-time -Werror=unguarded-availability-new -fmodules -fmodules-cache-path=/Users/buildslave/jenkins/workspace/lldb-cmake/lldb-build/module.cache -fcxx-modules -Xclang -fmodules-local-submodule-visibility -Wall -Wextra -Wno-unused-parameter -Wwrite-strings -Wcast-qual -Wmissing-field-initializers -pedantic -Wno-long-long -Wimplicit-fallthrough -Wcovered-switch-default -Wno-noexcept-type -Wnon-virtual-dtor -Wdelete-non-virtual-dtor -Wsuggest-override -Wstring-conversion -fdiagnostics-color -O3  -isysroot /Applications/Xcode.app/Contents/Developer/Platforms/MacOSX.platform/Developer/SDKs/MacOSX10.15.sdk    -fno-exceptions -fno-rtti -UNDEBUG -std=c++14 -MD -MT lib/XRay/CMakeFiles/LLVMXRay.dir/RecordPrinter.cpp.o -MF lib/XRay/CMakeFiles/LLVMXRay.dir/RecordPrinter.cpp.o.d -o lib/XRay/CMakeFiles/LLVMXRay.dir/RecordPrinter.cpp.o -c /Users/buildslave/jenkins/workspace/lldb-cmake/llvm-project/llvm/lib/XRay/RecordPrinter.cpp
[2453/5202] /Users/buildslave/jenkins/workspace/lldb-cmake/host-compiler/bin/clang++  -DGTEST_HAS_RTTI=0 -D_DEBUG -D__STDC_CONSTANT_MACROS -D__STDC_FORMAT_MACROS -D__STDC_LIMIT_MACROS -Ilib/ProfileData/Coverage -I/Users/buildslave/jenkins/workspace/lldb-cmake/llvm-project/llvm/lib/ProfileData/Coverage -Iinclude -I/Users/buildslave/jenkins/workspace/lldb-cmake/llvm-project/llvm/include -Wdocumentation -fPIC -fvisibility-inlines-hidden -Werror=date-time -Werror=unguarded-availability-new -fmodules -fmodules-cache-path=/Users/buildslave/jenkins/workspace/lldb-cmake/lldb-build/module.cache -fcxx-modules -Xclang -fmodules-local-submodule-visibility -Wall -Wextra -Wno-unused-parameter -Wwrite-strings -Wcast-qual -Wmissing-field-initializers -pedantic -Wno-long-long -Wimplicit-fallthrough -Wcovered-switch-default -Wno-noexcept-type -Wnon-virtual-dtor -Wdelete-non-virtual-dtor -Wsuggest-override -Wstring-conversion -fdiagnostics-color -O3  -isysroot /Applications/Xcode.app/Contents/Developer/Platforms/MacOSX.platform/Developer/SDKs/MacOSX10.15.sdk    -fno-exceptions -fno-rtti -UNDEBUG -std=c++14 -MD -MT lib/ProfileData/Coverage/CMakeFiles/LLVMCoverage.dir/CoverageMappingReader.cpp.o -MF lib/ProfileData/Coverage/CMakeFiles/LLVMCoverage.dir/CoverageMappingReader.cpp.o.d -o lib/ProfileData/Coverage/CMakeFiles/LLVMCoverage.dir/CoverageMappingReader.cpp.o -c /Users/buildslave/jenkins/workspace/lldb-cmake/llvm-project/llvm/lib/ProfileData/Coverage/CoverageMappingReader.cpp
[2454/5202] /Users/buildslave/jenkins/workspace/lldb-cmake/host-compiler/bin/clang++  -DGTEST_HAS_RTTI=0 -D_DEBUG -D__STDC_CONSTANT_MACROS -D__STDC_FORMAT_MACROS -D__STDC_LIMIT_MACROS -Ilib/XRay -I/Users/buildslave/jenkins/workspace/lldb-cmake/llvm-project/llvm/lib/XRay -Iinclude -I/Users/buildslave/jenkins/workspace/lldb-cmake/llvm-project/llvm/include -Wdocumentation -fPIC -fvisibility-inlines-hidden -Werror=date-time -Werror=unguarded-availability-new -fmodules -fmodules-cache-path=/Users/buildslave/jenkins/workspace/lldb-cmake/lldb-build/module.cache -fcxx-modules -Xclang -fmodules-local-submodule-visibility -Wall -Wextra -Wno-unused-parameter -Wwrite-strings -Wcast-qual -Wmissing-field-initializers -pedantic -Wno-long-long -Wimplicit-fallthrough -Wcovered-switch-default -Wno-noexcept-type -Wnon-virtual-dtor -Wdelete-non-virtual-dtor -Wsuggest-override -Wstring-conversion -fdiagnostics-color -O3  -isysroot /Applications/Xcode.app/Contents/Developer/Platforms/MacOSX.platform/Developer/SDKs/MacOSX10.15.sdk    -fno-exceptions -fno-rtti -UNDEBUG -std=c++14 -MD -MT lib/XRay/CMakeFiles/LLVMXRay.dir/InstrumentationMap.cpp.o -MF lib/XRay/CMakeFiles/LLVMXRay.dir/InstrumentationMap.cpp.o.d -o lib/XRay/CMakeFiles/LLVMXRay.dir/InstrumentationMap.cpp.o -c /Users/buildslave/jenkins/workspace/lldb-cmake/llvm-project/llvm/lib/XRay/InstrumentationMap.cpp
[2455/5202] /Users/buildslave/jenkins/workspace/lldb-cmake/host-compiler/bin/clang++  -DGTEST_HAS_RTTI=0 -D_DEBUG -D__STDC_CONSTANT_MACROS -D__STDC_FORMAT_MACROS -D__STDC_LIMIT_MACROS -Ilib/XRay -I/Users/buildslave/jenkins/workspace/lldb-cmake/llvm-project/llvm/lib/XRay -Iinclude -I/Users/buildslave/jenkins/workspace/lldb-cmake/llvm-project/llvm/include -Wdocumentation -fPIC -fvisibility-inlines-hidden -Werror=date-time -Werror=unguarded-availability-new -fmodules -fmodules-cache-path=/Users/buildslave/jenkins/workspace/lldb-cmake/lldb-build/module.cache -fcxx-modules -Xclang -fmodules-local-submodule-visibility -Wall -Wextra -Wno-unused-parameter -Wwrite-strings -Wcast-qual -Wmissing-field-initializers -pedantic -Wno-long-long -Wimplicit-fallthrough -Wcovered-switch-default -Wno-noexcept-type -Wnon-virtual-dtor -Wdelete-non-virtual-dtor -Wsuggest-override -Wstring-conversion -fdiagnostics-color -O3  -isysroot /Applications/Xcode.app/Contents/Developer/Platforms/MacOSX.platform/Developer/SDKs/MacOSX10.15.sdk    -fno-exceptions -fno-rtti -UNDEBUG -std=c++14 -MD -MT lib/XRay/CMakeFiles/LLVMXRay.dir/Profile.cpp.o -MF lib/XRay/CMakeFiles/LLVMXRay.dir/Profile.cpp.o.d -o lib/XRay/CMakeFiles/LLVMXRay.dir/Profile.cpp.o -c /Users/buildslave/jenkins/workspace/lldb-cmake/llvm-project/llvm/lib/XRay/Profile.cpp
[2456/5202] /Users/buildslave/jenkins/workspace/lldb-cmake/host-compiler/bin/clang++  -DGTEST_HAS_RTTI=0 -D_DEBUG -D__STDC_CONSTANT_MACROS -D__STDC_FORMAT_MACROS -D__STDC_LIMIT_MACROS -Ilib/XRay -I/Users/buildslave/jenkins/workspace/lldb-cmake/llvm-project/llvm/lib/XRay -Iinclude -I/Users/buildslave/jenkins/workspace/lldb-cmake/llvm-project/llvm/include -Wdocumentation -fPIC -fvisibility-inlines-hidden -Werror=date-time -Werror=unguarded-availability-new -fmodules -fmodules-cache-path=/Users/buildslave/jenkins/workspace/lldb-cmake/lldb-build/module.cache -fcxx-modules -Xclang -fmodules-local-submodule-visibility -Wall -Wextra -Wno-unused-parameter -Wwrite-strings -Wcast-qual -Wmissing-field-initializers -pedantic -Wno-long-long -Wimplicit-fallthrough -Wcovered-switch-default -Wno-noexcept-type -Wnon-virtual-dtor -Wdelete-non-virtual-dtor -Wsuggest-override -Wstring-conversion -fdiagnostics-color -O3  -isysroot /Applications/Xcode.app/Contents/Developer/Platforms/MacOSX.platform/Developer/SDKs/MacOSX10.15.sdk    -fno-exceptions -fno-rtti -UNDEBUG -std=c++14 -MD -MT lib/XRay/CMakeFiles/LLVMXRay.dir/Trace.cpp.o -MF lib/XRay/CMakeFiles/LLVMXRay.dir/Trace.cpp.o.d -o lib/XRay/CMakeFiles/LLVMXRay.dir/Trace.cpp.o -c /Users/buildslave/jenkins/workspace/lldb-cmake/llvm-project/llvm/lib/XRay/Trace.cpp
[2457/5202] /Users/buildslave/jenkins/workspace/lldb-cmake/host-compiler/bin/clang++  -DGTEST_HAS_RTTI=0 -D_DEBUG -D__STDC_CONSTANT_MACROS -D__STDC_FORMAT_MACROS -D__STDC_LIMIT_MACROS -Iutils/PerfectShuffle -I/Users/buildslave/jenkins/workspace/lldb-cmake/llvm-project/llvm/utils/PerfectShuffle -Iinclude -I/Users/buildslave/jenkins/workspace/lldb-cmake/llvm-project/llvm/include -Wdocumentation -fPIC -fvisibility-inlines-hidden -Werror=date-time -Werror=unguarded-availability-new -fmodules -fmodules-cache-path=/Users/buildslave/jenkins/workspace/lldb-cmake/lldb-build/module.cache -fcxx-modules -Xclang -fmodules-local-submodule-visibility -Wall -Wextra -Wno-unused-parameter -Wwrite-strings -Wcast-qual -Wmissing-field-initializers -pedantic -Wno-long-long -Wimplicit-fallthrough -Wcovered-switch-default -Wno-noexcept-type -Wnon-virtual-dtor -Wdelete-non-virtual-dtor -Wsuggest-override -Wstring-conversion -fdiagnostics-color -O3  -isysroot /Applications/Xcode.app/Contents/Developer/Platforms/MacOSX.platform/Developer/SDKs/MacOSX10.15.sdk    -fno-exceptions -fno-rtti -UNDEBUG -std=c++14 -MD -MT utils/PerfectShuffle/CMakeFiles/llvm-PerfectShuffle.dir/PerfectShuffle.cpp.o -MF utils/PerfectShuffle/CMakeFiles/llvm-PerfectShuffle.dir/PerfectShuffle.cpp.o.d -o utils/PerfectShuffle/CMakeFiles/llvm-PerfectShuffle.dir/PerfectShuffle.cpp.o -c /Users/buildslave/jenkins/workspace/lldb-cmake/llvm-project/llvm/utils/PerfectShuffle/PerfectShuffle.cpp
[2458/5202] : && /Users/buildslave/jenkins/workspace/lldb-cmake/host-compiler/bin/clang++  -Wdocumentation -fPIC -fvisibility-inlines-hidden -Werror=date-time -Werror=unguarded-availability-new -fmodules -fmodules-cache-path=/Users/buildslave/jenkins/workspace/lldb-cmake/lldb-build/module.cache -fcxx-modules -Xclang -fmodules-local-submodule-visibility -Wall -Wextra -Wno-unused-parameter -Wwrite-strings -Wcast-qual -Wmissing-field-initializers -pedantic -Wno-long-long -Wimplicit-fallthrough -Wcovered-switch-default -Wno-noexcept-type -Wnon-virtual-dtor -Wdelete-non-virtual-dtor -Wsuggest-override -Wstring-conversion -fdiagnostics-color -O3  -isysroot /Applications/Xcode.app/Contents/Developer/Platforms/MacOSX.platform/Developer/SDKs/MacOSX10.15.sdk -Wl,-search_paths_first -Wl,-headerpad_max_install_names -Wl,-dead_strip utils/PerfectShuffle/CMakeFiles/llvm-PerfectShuffle.dir/PerfectShuffle.cpp.o  -o bin/llvm-PerfectShuffle  -Wl,-rpath,@loader_path/../lib && :
[2459/5202] /Users/buildslave/jenkins/workspace/lldb-cmake/host-compiler/bin/clang++  -DGTEST_HAS_RTTI=0 -D_DEBUG -D__STDC_CONSTANT_MACROS -D__STDC_FORMAT_MACROS -D__STDC_LIMIT_MACROS -Iutils/not -I/Users/buildslave/jenkins/workspace/lldb-cmake/llvm-project/llvm/utils/not -Iinclude -I/Users/buildslave/jenkins/workspace/lldb-cmake/llvm-project/llvm/include -Wdocumentation -fPIC -fvisibility-inlines-hidden -Werror=date-time -Werror=unguarded-availability-new -fmodules -fmodules-cache-path=/Users/buildslave/jenkins/workspace/lldb-cmake/lldb-build/module.cache -fcxx-modules -Xclang -fmodules-local-submodule-visibility -Wall -Wextra -Wno-unused-parameter -Wwrite-strings -Wcast-qual -Wmissing-field-initializers -pedantic -Wno-long-long -Wimplicit-fallthrough -Wcovered-switch-default -Wno-noexcept-type -Wnon-virtual-dtor -Wdelete-non-virtual-dtor -Wsuggest-override -Wstring-conversion -fdiagnostics-color -O3  -isysroot /Applications/Xcode.app/Contents/Developer/Platforms/MacOSX.platform/Developer/SDKs/MacOSX10.15.sdk    -fno-exceptions -fno-rtti -UNDEBUG -std=c++14 -MD -MT utils/not/CMakeFiles/not.dir/not.cpp.o -MF utils/not/CMakeFiles/not.dir/not.cpp.o.d -o utils/not/CMakeFiles/not.dir/not.cpp.o -c /Users/buildslave/jenkins/workspace/lldb-cmake/llvm-project/llvm/utils/not/not.cpp
[2460/5202] : && /Users/buildslave/jenkins/workspace/lldb-cmake/host-compiler/bin/clang++  -Wdocumentation -fPIC -fvisibility-inlines-hidden -Werror=date-time -Werror=unguarded-availability-new -fmodules -fmodules-cache-path=/Users/buildslave/jenkins/workspace/lldb-cmake/lldb-build/module.cache -fcxx-modules -Xclang -fmodules-local-submodule-visibility -Wall -Wextra -Wno-unused-parameter -Wwrite-strings -Wcast-qual -Wmissing-field-initializers -pedantic -Wno-long-long -Wimplicit-fallthrough -Wcovered-switch-default -Wno-noexcept-type -Wnon-virtual-dtor -Wdelete-non-virtual-dtor -Wsuggest-override -Wstring-conversion -fdiagnostics-color -O3  -isysroot /Applications/Xcode.app/Contents/Developer/Platforms/MacOSX.platform/Developer/SDKs/MacOSX10.15.sdk -Wl,-search_paths_first -Wl,-headerpad_max_install_names -Wl,-dead_strip utils/not/CMakeFiles/not.dir/not.cpp.o  -o bin/not  -Wl,-rpath,@loader_path/../lib  lib/libLLVMSupport.a  -lm  /usr/lib/libz.dylib  /usr/lib/libcurses.dylib  lib/libLLVMDemangle.a && :
[2461/5202] : && /Users/buildslave/jenkins/workspace/lldb-cmake/host-compiler/bin/clang++ -Wdocumentation -fPIC -fvisibility-inlines-hidden -Werror=date-time -Werror=unguarded-availability-new -fmodules -fmodules-cache-path=/Users/buildslave/jenkins/workspace/lldb-cmake/lldb-build/module.cache -fcxx-modules -Xclang -fmodules-local-submodule-visibility -Wall -Wextra -Wno-unused-parameter -Wwrite-strings -Wcast-qual -Wmissing-field-initializers  -Wno-long-long -Wimplicit-fallthrough -Wcovered-switch-default -Wno-noexcept-type -Wnon-virtual-dtor -Wdelete-non-virtual-dtor -Wsuggest-override -Wstring-conversion -fdiagnostics-color -O3 -isysroot /Applications/Xcode.app/Contents/Developer/Platforms/MacOSX.platform/Developer/SDKs/MacOSX10.15.sdk -dynamiclib -Wl,-headerpad_max_install_names -compatibility_version 1.0.0 -current_version 1.0.0 -o lib/libc++.1.0.dylib -install_name @rpath/libc++.1.dylib projects/libcxx/src/CMakeFiles/cxx_shared.dir/algorithm.cpp.o projects/libcxx/src/CMakeFiles/cxx_shared.dir/any.cpp.o projects/libcxx/src/CMakeFiles/cxx_shared.dir/atomic.cpp.o projects/libcxx/src/CMakeFiles/cxx_shared.dir/barrier.cpp.o projects/libcxx/src/CMakeFiles/cxx_shared.dir/bind.cpp.o projects/libcxx/src/CMakeFiles/cxx_shared.dir/charconv.cpp.o projects/libcxx/src/CMakeFiles/cxx_shared.dir/chrono.cpp.o projects/libcxx/src/CMakeFiles/cxx_shared.dir/condition_variable.cpp.o projects/libcxx/src/CMakeFiles/cxx_shared.dir/condition_variable_destructor.cpp.o projects/libcxx/src/CMakeFiles/cxx_shared.dir/debug.cpp.o projects/libcxx/src/CMakeFiles/cxx_shared.dir/exception.cpp.o projects/libcxx/src/CMakeFiles/cxx_shared.dir/functional.cpp.o projects/libcxx/src/CMakeFiles/cxx_shared.dir/future.cpp.o projects/libcxx/src/CMakeFiles/cxx_shared.dir/hash.cpp.o projects/libcxx/src/CMakeFiles/cxx_shared.dir/ios.cpp.o projects/libcxx/src/CMakeFiles/cxx_shared.dir/iostream.cpp.o projects/libcxx/src/CMakeFiles/cxx_shared.dir/locale.cpp.o projects/libcxx/src/CMakeFiles/cxx_shared.dir/memory.cpp.o projects/libcxx/src/CMakeFiles/cxx_shared.dir/mutex.cpp.o projects/libcxx/src/CMakeFiles/cxx_shared.dir/mutex_destructor.cpp.o projects/libcxx/src/CMakeFiles/cxx_shared.dir/new.cpp.o projects/libcxx/src/CMakeFiles/cxx_shared.dir/optional.cpp.o projects/libcxx/src/CMakeFiles/cxx_shared.dir/random.cpp.o projects/libcxx/src/CMakeFiles/cxx_shared.dir/random_shuffle.cpp.o projects/libcxx/src/CMakeFiles/cxx_shared.dir/regex.cpp.o projects/libcxx/src/CMakeFiles/cxx_shared.dir/shared_mutex.cpp.o projects/libcxx/src/CMakeFiles/cxx_shared.dir/stdexcept.cpp.o projects/libcxx/src/CMakeFiles/cxx_shared.dir/string.cpp.o projects/libcxx/src/CMakeFiles/cxx_shared.dir/strstream.cpp.o projects/libcxx/src/CMakeFiles/cxx_shared.dir/system_error.cpp.o projects/libcxx/src/CMakeFiles/cxx_shared.dir/thread.cpp.o projects/libcxx/src/CMakeFiles/cxx_shared.dir/typeinfo.cpp.o projects/libcxx/src/CMakeFiles/cxx_shared.dir/utility.cpp.o projects/libcxx/src/CMakeFiles/cxx_shared.dir/valarray.cpp.o projects/libcxx/src/CMakeFiles/cxx_shared.dir/variant.cpp.o projects/libcxx/src/CMakeFiles/cxx_shared.dir/vector.cpp.o projects/libcxx/src/CMakeFiles/cxx_shared.dir/filesystem/operations.cpp.o projects/libcxx/src/CMakeFiles/cxx_shared.dir/filesystem/directory_iterator.cpp.o projects/libcxx/src/CMakeFiles/cxx_shared.dir/filesystem/int128_builtins.cpp.o  -Wl,-rpath,@loader_path/../lib  -nodefaultlibs  -lSystem  -lc  lib/libc++abi.1.0.dylib  -Wl,-unexported_symbols_list,/Users/buildslave/jenkins/workspace/lldb-cmake/llvm-project/libcxx/src/../lib/libc++unexp.exp  -Wl,-reexported_symbols_list,/Users/buildslave/jenkins/workspace/lldb-cmake/llvm-project/libcxx/src/../lib/libc++abi.v2.exp  -Wl,-force_symbols_not_weak_list,/Users/buildslave/jenkins/workspace/lldb-cmake/llvm-project/libcxx/src/../lib/notweak.exp  -Wl,-force_symbols_weak_list,/Users/buildslave/jenkins/workspace/lldb-cmake/llvm-project/libcxx/src/../lib/weak.exp  -Wl,-reexported_symbols_list,/Users/buildslave/jenkins/workspace/lldb-cmake/llvm-project/libcxxabi/src/../lib/new-delete.exp  -Wl,-reexported_symbols_list,/Users/buildslave/jenkins/workspace/lldb-cmake/llvm-project/libcxxabi/src/../lib/exceptions.exp  -Wl,-reexported_symbols_list,/Users/buildslave/jenkins/workspace/lldb-cmake/llvm-project/libcxxabi/src/../lib/personality-v0.exp && :
FAILED: lib/libc++.1.0.dylib 
: && /Users/buildslave/jenkins/workspace/lldb-cmake/host-compiler/bin/clang++ -Wdocumentation -fPIC -fvisibility-inlines-hidden -Werror=date-time -Werror=unguarded-availability-new -fmodules -fmodules-cache-path=/Users/buildslave/jenkins/workspace/lldb-cmake/lldb-build/module.cache -fcxx-modules -Xclang -fmodules-local-submodule-visibility -Wall -Wextra -Wno-unused-parameter -Wwrite-strings -Wcast-qual -Wmissing-field-initializers  -Wno-long-long -Wimplicit-fallthrough -Wcovered-switch-default -Wno-noexcept-type -Wnon-virtual-dtor -Wdelete-non-virtual-dtor -Wsuggest-override -Wstring-conversion -fdiagnostics-color -O3 -isysroot /Applications/Xcode.app/Contents/Developer/Platforms/MacOSX.platform/Developer/SDKs/MacOSX10.15.sdk -dynamiclib -Wl,-headerpad_max_install_names -compatibility_version 1.0.0 -current_version 1.0.0 -o lib/libc++.1.0.dylib -install_name @rpath/libc++.1.dylib projects/libcxx/src/CMakeFiles/cxx_shared.dir/algorithm.cpp.o projects/libcxx/src/CMakeFiles/cxx_shared.dir/any.cpp.o projects/libcxx/src/CMakeFiles/cxx_shared.dir/atomic.cpp.o projects/libcxx/src/CMakeFiles/cxx_shared.dir/barrier.cpp.o projects/libcxx/src/CMakeFiles/cxx_shared.dir/bind.cpp.o projects/libcxx/src/CMakeFiles/cxx_shared.dir/charconv.cpp.o projects/libcxx/src/CMakeFiles/cxx_shared.dir/chrono.cpp.o projects/libcxx/src/CMakeFiles/cxx_shared.dir/condition_variable.cpp.o projects/libcxx/src/CMakeFiles/cxx_shared.dir/condition_variable_destructor.cpp.o projects/libcxx/src/CMakeFiles/cxx_shared.dir/debug.cpp.o projects/libcxx/src/CMakeFiles/cxx_shared.dir/exception.cpp.o projects/libcxx/src/CMakeFiles/cxx_shared.dir/functional.cpp.o projects/libcxx/src/CMakeFiles/cxx_shared.dir/future.cpp.o projects/libcxx/src/CMakeFiles/cxx_shared.dir/hash.cpp.o projects/libcxx/src/CMakeFiles/cxx_shared.dir/ios.cpp.o projects/libcxx/src/CMakeFiles/cxx_shared.dir/iostream.cpp.o projects/libcxx/src/CMakeFiles/cxx_shared.dir/locale.cpp.o projects/libcxx/src/CMakeFiles/cxx_shared.dir/memory.cpp.o projects/libcxx/src/CMakeFiles/cxx_shared.dir/mutex.cpp.o projects/libcxx/src/CMakeFiles/cxx_shared.dir/mutex_destructor.cpp.o projects/libcxx/src/CMakeFiles/cxx_shared.dir/new.cpp.o projects/libcxx/src/CMakeFiles/cxx_shared.dir/optional.cpp.o projects/libcxx/src/CMakeFiles/cxx_shared.dir/random.cpp.o projects/libcxx/src/CMakeFiles/cxx_shared.dir/random_shuffle.cpp.o projects/libcxx/src/CMakeFiles/cxx_shared.dir/regex.cpp.o projects/libcxx/src/CMakeFiles/cxx_shared.dir/shared_mutex.cpp.o projects/libcxx/src/CMakeFiles/cxx_shared.dir/stdexcept.cpp.o projects/libcxx/src/CMakeFiles/cxx_shared.dir/string.cpp.o projects/libcxx/src/CMakeFiles/cxx_shared.dir/strstream.cpp.o projects/libcxx/src/CMakeFiles/cxx_shared.dir/system_error.cpp.o projects/libcxx/src/CMakeFiles/cxx_shared.dir/thread.cpp.o projects/libcxx/src/CMakeFiles/cxx_shared.dir/typeinfo.cpp.o projects/libcxx/src/CMakeFiles/cxx_shared.dir/utility.cpp.o projects/libcxx/src/CMakeFiles/cxx_shared.dir/valarray.cpp.o projects/libcxx/src/CMakeFiles/cxx_shared.dir/variant.cpp.o projects/libcxx/src/CMakeFiles/cxx_shared.dir/vector.cpp.o projects/libcxx/src/CMakeFiles/cxx_shared.dir/filesystem/operations.cpp.o projects/libcxx/src/CMakeFiles/cxx_shared.dir/filesystem/directory_iterator.cpp.o projects/libcxx/src/CMakeFiles/cxx_shared.dir/filesystem/int128_builtins.cpp.o  -Wl,-rpath,@loader_path/../lib  -nodefaultlibs  -lSystem  -lc  lib/libc++abi.1.0.dylib  -Wl,-unexported_symbols_list,/Users/buildslave/jenkins/workspace/lldb-cmake/llvm-project/libcxx/src/../lib/libc++unexp.exp  -Wl,-reexported_symbols_list,/Users/buildslave/jenkins/workspace/lldb-cmake/llvm-project/libcxx/src/../lib/libc++abi.v2.exp  -Wl,-force_symbols_not_weak_list,/Users/buildslave/jenkins/workspace/lldb-cmake/llvm-project/libcxx/src/../lib/notweak.exp  -Wl,-force_symbols_weak_list,/Users/buildslave/jenkins/workspace/lldb-cmake/llvm-project/libcxx/src/../lib/weak.exp  -Wl,-reexported_symbols_list,/Users/buildslave/jenkins/workspace/lldb-cmake/llvm-project/libcxxabi/src/../lib/new-delete.exp  -Wl,-reexported_symbols_list,/Users/buildslave/jenkins/workspace/lldb-cmake/llvm-project/libcxxabi/src/../lib/exceptions.exp  -Wl,-reexported_symbols_list,/Users/buildslave/jenkins/workspace/lldb-cmake/llvm-project/libcxxabi/src/../lib/personality-v0.exp && :
ld: requested re-export symbol operator new(unsigned long) is not from a dylib, but from projects/libcxx/src/CMakeFiles/cxx_shared.dir/new.cpp.o
 file 'projects/libcxx/src/CMakeFiles/cxx_shared.dir/new.cpp.o' for architecture x86_64
clang-12: error: linker command failed with exit code 1 (use -v to see invocation)
[2462/5202] /Users/buildslave/jenkins/workspace/lldb-cmake/host-compiler/bin/clang++  -DGTEST_HAS_RTTI=0 -D_DEBUG -D__STDC_CONSTANT_MACROS -D__STDC_FORMAT_MACROS -D__STDC_LIMIT_MACROS -Ilib/WindowsManifest -I/Users/buildslave/jenkins/workspace/lldb-cmake/llvm-project/llvm/lib/WindowsManifest -Iinclude -I/Users/buildslave/jenkins/workspace/lldb-cmake/llvm-project/llvm/include -isystem /Applications/Xcode.app/Contents/Developer/Platforms/MacOSX.platform/Developer/SDKs/MacOSX10.15.sdk/usr/include/libxml2 -Wdocumentation -fPIC -fvisibility-inlines-hidden -Werror=date-time -Werror=unguarded-availability-new -fmodules -fmodules-cache-path=/Users/buildslave/jenkins/workspace/lldb-cmake/lldb-build/module.cache -fcxx-modules -Xclang -fmodules-local-submodule-visibility -Wall -Wextra -Wno-unused-parameter -Wwrite-strings -Wcast-qual -Wmissing-field-initializers -pedantic -Wno-long-long -Wimplicit-fallthrough -Wcovered-switch-default -Wno-noexcept-type -Wnon-virtual-dtor -Wdelete-non-virtual-dtor -Wsuggest-override -Wstring-conversion -fdiagnostics-color -O3  -isysroot /Applications/Xcode.app/Contents/Developer/Platforms/MacOSX.platform/Developer/SDKs/MacOSX10.15.sdk    -fno-exceptions -fno-rtti -UNDEBUG -std=c++14 -MD -MT lib/WindowsManifest/CMakeFiles/LLVMWindowsManifest.dir/WindowsManifestMerger.cpp.o -MF lib/WindowsManifest/CMakeFiles/LLVMWindowsManifest.dir/WindowsManifestMerger.cpp.o.d -o lib/WindowsManifest/CMakeFiles/LLVMWindowsManifest.dir/WindowsManifestMerger.cpp.o -c /Users/buildslave/jenkins/workspace/lldb-cmake/llvm-project/llvm/lib/WindowsManifest/WindowsManifestMerger.cpp
[2463/5202] /Users/buildslave/jenkins/workspace/lldb-cmake/host-compiler/bin/clang++  -DGTEST_HAS_RTTI=0 -D_DEBUG -D__STDC_CONSTANT_MACROS -D__STDC_FORMAT_MACROS -D__STDC_LIMIT_MACROS -Ilib/TextAPI -I/Users/buildslave/jenkins/workspace/lldb-cmake/llvm-project/llvm/lib/TextAPI -Iinclude -I/Users/buildslave/jenkins/workspace/lldb-cmake/llvm-project/llvm/include -Wdocumentation -fPIC -fvisibility-inlines-hidden -Werror=date-time -Werror=unguarded-availability-new -fmodules -fmodules-cache-path=/Users/buildslave/jenkins/workspace/lldb-cmake/lldb-build/module.cache -fcxx-modules -Xclang -fmodules-local-submodule-visibility -Wall -Wextra -Wno-unused-parameter -Wwrite-strings -Wcast-qual -Wmissing-field-initializers -pedantic -Wno-long-long -Wimplicit-fallthrough -Wcovered-switch-default -Wno-noexcept-type -Wnon-virtual-dtor -Wdelete-non-virtual-dtor -Wsuggest-override -Wstring-conversion -fdiagnostics-color -O3  -isysroot /Applications/Xcode.app/Contents/Developer/Platforms/MacOSX.platform/Developer/SDKs/MacOSX10.15.sdk    -fno-exceptions -fno-rtti -UNDEBUG -std=c++14 -MD -MT lib/TextAPI/CMakeFiles/LLVMTextAPI.dir/MachO/TextStub.cpp.o -MF lib/TextAPI/CMakeFiles/LLVMTextAPI.dir/MachO/TextStub.cpp.o.d -o lib/TextAPI/CMakeFiles/LLVMTextAPI.dir/MachO/TextStub.cpp.o -c /Users/buildslave/jenkins/workspace/lldb-cmake/llvm-project/llvm/lib/TextAPI/MachO/TextStub.cpp
[2464/5202] /Users/buildslave/jenkins/workspace/lldb-cmake/host-compiler/bin/clang++  -DGTEST_HAS_RTTI=0 -D_DEBUG -D__STDC_CONSTANT_MACROS -D__STDC_FORMAT_MACROS -D__STDC_LIMIT_MACROS -Iutils/yaml-bench -I/Users/buildslave/jenkins/workspace/lldb-cmake/llvm-project/llvm/utils/yaml-bench -Iinclude -I/Users/buildslave/jenkins/workspace/lldb-cmake/llvm-project/llvm/include -Wdocumentation -fPIC -fvisibility-inlines-hidden -Werror=date-time -Werror=unguarded-availability-new -fmodules -fmodules-cache-path=/Users/buildslave/jenkins/workspace/lldb-cmake/lldb-build/module.cache -fcxx-modules -Xclang -fmodules-local-submodule-visibility -Wall -Wextra -Wno-unused-parameter -Wwrite-strings -Wcast-qual -Wmissing-field-initializers -pedantic -Wno-long-long -Wimplicit-fallthrough -Wcovered-switch-default -Wno-noexcept-type -Wnon-virtual-dtor -Wdelete-non-virtual-dtor -Wsuggest-override -Wstring-conversion -fdiagnostics-color -O3  -isysroot /Applications/Xcode.app/Contents/Developer/Platforms/MacOSX.platform/Developer/SDKs/MacOSX10.15.sdk    -fno-exceptions -fno-rtti -UNDEBUG -std=c++14 -MD -MT utils/yaml-bench/CMakeFiles/yaml-bench.dir/YAMLBench.cpp.o -MF utils/yaml-bench/CMakeFiles/yaml-bench.dir/YAMLBench.cpp.o.d -o utils/yaml-bench/CMakeFiles/yaml-bench.dir/YAMLBench.cpp.o -c /Users/buildslave/jenkins/workspace/lldb-cmake/llvm-project/llvm/utils/yaml-bench/YAMLBench.cpp
[2465/5202] /Users/buildslave/jenkins/workspace/lldb-cmake/host-compiler/bin/clang++  -DGTEST_HAS_RTTI=0 -D_DEBUG -D__STDC_CONSTANT_MACROS -D__STDC_FORMAT_MACROS -D__STDC_LIMIT_MACROS -Iutils/FileCheck -I/Users/buildslave/jenkins/workspace/lldb-cmake/llvm-project/llvm/utils/FileCheck -Iinclude -I/Users/buildslave/jenkins/workspace/lldb-cmake/llvm-project/llvm/include -Wdocumentation -fPIC -fvisibility-inlines-hidden -Werror=date-time -Werror=unguarded-availability-new -fmodules -fmodules-cache-path=/Users/buildslave/jenkins/workspace/lldb-cmake/lldb-build/module.cache -fcxx-modules -Xclang -fmodules-local-submodule-visibility -Wall -Wextra -Wno-unused-parameter -Wwrite-strings -Wcast-qual -Wmissing-field-initializers -pedantic -Wno-long-long -Wimplicit-fallthrough -Wcovered-switch-default -Wno-noexcept-type -Wnon-virtual-dtor -Wdelete-non-virtual-dtor -Wsuggest-override -Wstring-conversion -fdiagnostics-color -O3  -isysroot /Applications/Xcode.app/Contents/Developer/Platforms/MacOSX.platform/Developer/SDKs/MacOSX10.15.sdk    -fno-exceptions -fno-rtti -UNDEBUG -std=c++14 -MD -MT utils/FileCheck/CMakeFiles/FileCheck.dir/FileCheck.cpp.o -MF utils/FileCheck/CMakeFiles/FileCheck.dir/FileCheck.cpp.o.d -o utils/FileCheck/CMakeFiles/FileCheck.dir/FileCheck.cpp.o -c /Users/buildslave/jenkins/workspace/lldb-cmake/llvm-project/llvm/utils/FileCheck/FileCheck.cpp
[2466/5202] /Users/buildslave/jenkins/workspace/lldb-cmake/host-compiler/bin/clang++  -DGTEST_HAS_RTTI=0 -DGTEST_HAS_TR1_TUPLE=0 -D_DEBUG -D__STDC_CONSTANT_MACROS -D__STDC_FORMAT_MACROS -D__STDC_LIMIT_MACROS -Ilib/Testing/Support -I/Users/buildslave/jenkins/workspace/lldb-cmake/llvm-project/llvm/lib/Testing/Support -Iinclude -I/Users/buildslave/jenkins/workspace/lldb-cmake/llvm-project/llvm/include -I/Users/buildslave/jenkins/workspace/lldb-cmake/llvm-project/llvm/utils/unittest/googletest/include -I/Users/buildslave/jenkins/workspace/lldb-cmake/llvm-project/llvm/utils/unittest/googlemock/include -Wdocumentation -fPIC -fvisibility-inlines-hidden -Werror=date-time -Werror=unguarded-availability-new -fmodules -fmodules-cache-path=/Users/buildslave/jenkins/workspace/lldb-cmake/lldb-build/module.cache -fcxx-modules -Xclang -fmodules-local-submodule-visibility -Wall -Wextra -Wno-unused-parameter -Wwrite-strings -Wcast-qual -Wmissing-field-initializers -pedantic -Wno-long-long -Wimplicit-fallthrough -Wcovered-switch-default -Wno-noexcept-type -Wnon-virtual-dtor -Wdelete-non-virtual-dtor -Wsuggest-override -Wstring-conversion -fdiagnostics-color -O3  -isysroot /Applications/Xcode.app/Contents/Developer/Platforms/MacOSX.platform/Developer/SDKs/MacOSX10.15.sdk    -fno-exceptions -fno-rtti -UNDEBUG -Wno-suggest-override -std=c++14 -MD -MT lib/Testing/Support/CMakeFiles/LLVMTestingSupport.dir/Annotations.cpp.o -MF lib/Testing/Support/CMakeFiles/LLVMTestingSupport.dir/Annotations.cpp.o.d -o lib/Testing/Support/CMakeFiles/LLVMTestingSupport.dir/Annotations.cpp.o -c /Users/buildslave/jenkins/workspace/lldb-cmake/llvm-project/llvm/lib/Testing/Support/Annotations.cpp
[2467/5202] /Users/buildslave/jenkins/workspace/lldb-cmake/host-compiler/bin/clang++  -DGTEST_HAS_RTTI=0 -DGTEST_HAS_TR1_TUPLE=0 -D_DEBUG -D__STDC_CONSTANT_MACROS -D__STDC_FORMAT_MACROS -D__STDC_LIMIT_MACROS -Ilib/Testing/Support -I/Users/buildslave/jenkins/workspace/lldb-cmake/llvm-project/llvm/lib/Testing/Support -Iinclude -I/Users/buildslave/jenkins/workspace/lldb-cmake/llvm-project/llvm/include -I/Users/buildslave/jenkins/workspace/lldb-cmake/llvm-project/llvm/utils/unittest/googletest/include -I/Users/buildslave/jenkins/workspace/lldb-cmake/llvm-project/llvm/utils/unittest/googlemock/include -Wdocumentation -fPIC -fvisibility-inlines-hidden -Werror=date-time -Werror=unguarded-availability-new -fmodules -fmodules-cache-path=/Users/buildslave/jenkins/workspace/lldb-cmake/lldb-build/module.cache -fcxx-modules -Xclang -fmodules-local-submodule-visibility -Wall -Wextra -Wno-unused-parameter -Wwrite-strings -Wcast-qual -Wmissing-field-initializers -pedantic -Wno-long-long -Wimplicit-fallthrough -Wcovered-switch-default -Wno-noexcept-type -Wnon-virtual-dtor -Wdelete-non-virtual-dtor -Wsuggest-override -Wstring-conversion -fdiagnostics-color -O3  -isysroot /Applications/Xcode.app/Contents/Developer/Platforms/MacOSX.platform/Developer/SDKs/MacOSX10.15.sdk    -fno-exceptions -fno-rtti -UNDEBUG -Wno-suggest-override -std=c++14 -MD -MT lib/Testing/Support/CMakeFiles/LLVMTestingSupport.dir/SupportHelpers.cpp.o -MF lib/Testing/Support/CMakeFiles/LLVMTestingSupport.dir/SupportHelpers.cpp.o.d -o lib/Testing/Support/CMakeFiles/LLVMTestingSupport.dir/SupportHelpers.cpp.o -c /Users/buildslave/jenkins/workspace/lldb-cmake/llvm-project/llvm/lib/Testing/Support/SupportHelpers.cpp
[2468/5202] /Users/buildslave/jenkins/workspace/lldb-cmake/host-compiler/bin/clang++  -DGTEST_HAS_RTTI=0 -DGTEST_HAS_TR1_TUPLE=0 -D_DEBUG -D__STDC_CONSTANT_MACROS -D__STDC_FORMAT_MACROS -D__STDC_LIMIT_MACROS -Ilib/Testing/Support -I/Users/buildslave/jenkins/workspace/lldb-cmake/llvm-project/llvm/lib/Testing/Support -Iinclude -I/Users/buildslave/jenkins/workspace/lldb-cmake/llvm-project/llvm/include -I/Users/buildslave/jenkins/workspace/lldb-cmake/llvm-project/llvm/utils/unittest/googletest/include -I/Users/buildslave/jenkins/workspace/lldb-cmake/llvm-project/llvm/utils/unittest/googlemock/include -Wdocumentation -fPIC -fvisibility-inlines-hidden -Werror=date-time -Werror=unguarded-availability-new -fmodules -fmodules-cache-path=/Users/buildslave/jenkins/workspace/lldb-cmake/lldb-build/module.cache -fcxx-modules -Xclang -fmodules-local-submodule-visibility -Wall -Wextra -Wno-unused-parameter -Wwrite-strings -Wcast-qual -Wmissing-field-initializers -pedantic -Wno-long-long -Wimplicit-fallthrough -Wcovered-switch-default -Wno-noexcept-type -Wnon-virtual-dtor -Wdelete-non-virtual-dtor -Wsuggest-override -Wstring-conversion -fdiagnostics-color -O3  -isysroot /Applications/Xcode.app/Contents/Developer/Platforms/MacOSX.platform/Developer/SDKs/MacOSX10.15.sdk    -fno-exceptions -fno-rtti -UNDEBUG -Wno-suggest-override -std=c++14 -MD -MT lib/Testing/Support/CMakeFiles/LLVMTestingSupport.dir/Error.cpp.o -MF lib/Testing/Support/CMakeFiles/LLVMTestingSupport.dir/Error.cpp.o.d -o lib/Testing/Support/CMakeFiles/LLVMTestingSupport.dir/Error.cpp.o -c /Users/buildslave/jenkins/workspace/lldb-cmake/llvm-project/llvm/lib/Testing/Support/Error.cpp
[2469/5202] /Users/buildslave/jenkins/workspace/lldb-cmake/host-compiler/bin/clang++  -DGTEST_HAS_RTTI=0 -D_DEBUG -D__STDC_CONSTANT_MACROS -D__STDC_FORMAT_MACROS -D__STDC_LIMIT_MACROS -Ilib/Target/X86 -I/Users/buildslave/jenkins/workspace/lldb-cmake/llvm-project/llvm/lib/Target/X86 -Iinclude -I/Users/buildslave/jenkins/workspace/lldb-cmake/llvm-project/llvm/include -Wdocumentation -fPIC -fvisibility-inlines-hidden -Werror=date-time -Werror=unguarded-availability-new -fmodules -fmodules-cache-path=/Users/buildslave/jenkins/workspace/lldb-cmake/lldb-build/module.cache -fcxx-modules -Xclang -fmodules-local-submodule-visibility -Wall -Wextra -Wno-unused-parameter -Wwrite-strings -Wcast-qual -Wmissing-field-initializers -pedantic -Wno-long-long -Wimplicit-fallthrough -Wcovered-switch-default -Wno-noexcept-type -Wnon-virtual-dtor -Wdelete-non-virtual-dtor -Wsuggest-override -Wstring-conversion -fdiagnostics-color -O3  -isysroot /Applications/Xcode.app/Contents/Developer/Platforms/MacOSX.platform/Developer/SDKs/MacOSX10.15.sdk    -fno-exceptions -fno-rtti -UNDEBUG -std=c++14 -MD -MT lib/Target/X86/CMakeFiles/LLVMX86CodeGen.dir/X86ISelLowering.cpp.o -MF lib/Target/X86/CMakeFiles/LLVMX86CodeGen.dir/X86ISelLowering.cpp.o.d -o lib/Target/X86/CMakeFiles/LLVMX86CodeGen.dir/X86ISelLowering.cpp.o -c /Users/buildslave/jenkins/workspace/lldb-cmake/llvm-project/llvm/lib/Target/X86/X86ISelLowering.cpp
[2470/5202] /Users/buildslave/jenkins/workspace/lldb-cmake/host-compiler/bin/clang++  -DGTEST_HAS_RTTI=0 -D_DEBUG -D__STDC_CONSTANT_MACROS -D__STDC_FORMAT_MACROS -D__STDC_LIMIT_MACROS -Ilib/Passes -I/Users/buildslave/jenkins/workspace/lldb-cmake/llvm-project/llvm/lib/Passes -Iinclude -I/Users/buildslave/jenkins/workspace/lldb-cmake/llvm-project/llvm/include -Wdocumentation -fPIC -fvisibility-inlines-hidden -Werror=date-time -Werror=unguarded-availability-new -fmodules -fmodules-cache-path=/Users/buildslave/jenkins/workspace/lldb-cmake/lldb-build/module.cache -fcxx-modules -Xclang -fmodules-local-submodule-visibility -Wall -Wextra -Wno-unused-parameter -Wwrite-strings -Wcast-qual -Wmissing-field-initializers -pedantic -Wno-long-long -Wimplicit-fallthrough -Wcovered-switch-default -Wno-noexcept-type -Wnon-virtual-dtor -Wdelete-non-virtual-dtor -Wsuggest-override -Wstring-conversion -fdiagnostics-color -O3  -isysroot /Applications/Xcode.app/Contents/Developer/Platforms/MacOSX.platform/Developer/SDKs/MacOSX10.15.sdk    -fno-exceptions -fno-rtti -UNDEBUG -std=c++14 -MD -MT lib/Passes/CMakeFiles/LLVMPasses.dir/PassBuilder.cpp.o -MF lib/Passes/CMakeFiles/LLVMPasses.dir/PassBuilder.cpp.o.d -o lib/Passes/CMakeFiles/LLVMPasses.dir/PassBuilder.cpp.o -c /Users/buildslave/jenkins/workspace/lldb-cmake/llvm-project/llvm/lib/Passes/PassBuilder.cpp
ninja: build stopped: subcommand failed.
Command failed: Command '['/usr/local/bin/ninja', '-v']' returned non-zero exit status 1
Command: ['/usr/local/bin/ninja', '-v']
+ echo 'Retrying. debuginfo-tests may have failed due to high load.'
Retrying. debuginfo-tests may have failed due to high load.
+ sleep 30
+ python llvm-zorg/zorg/jenkins/monorepo_build.py lldb-cmake build --assertions '--projects=clang;libcxx;libcxxabi;compiler-rt;lld;lldb;debuginfo-tests' --compiler-flag=-Wdocumentation --cmake-type=Release
You are using pip version 18.1, however version 20.2.3 is available.
You should consider upgrading via the 'pip install --upgrade pip' command.
You are using pip version 18.1, however version 20.2.3 is available.
You should consider upgrading via the 'pip install --upgrade pip' command.
Dependency met os_version v10.15.5
Dependency met brew cmake v3.17.2
Dependency met brew ninja v1.8.2
Dependency met pip psutil v5.4.5
Dependency met pip six v1.11.0
Dependency met xcode v11.5
Clean

Hide Details

@@@ Clean @@@ Removing module cache: /Users/buildslave/jenkins/workspace/lldb-cmake/lldb-build/module.cache Completed at: 2020-10-01T06:32:09 @@@@@@
Cmake

Hide Details

@@@ Cmake @@@ cd /Users/buildslave/jenkins/workspace/lldb-cmake/lldb-build '/usr/local/bin/cmake' '-G' 'Ninja' '/Users/buildslave/jenkins/workspace/lldb-cmake/llvm-project/llvm' '-DCMAKE_BUILD_TYPE=Release' '-DCMAKE_EXPORT_COMPILE_COMMANDS=ON' '-DCMAKE_INSTALL_PREFIX=/Users/buildslave/jenkins/workspace/lldb-cmake/lldb-install' '-DCMAKE_MAKE_PROGRAM=/usr/local/bin/ninja' '-DLLDB_TEST_USER_ARGS=--arch;x86_64;--build-dir;/Users/buildslave/jenkins/workspace/lldb-cmake/lldb-build/lldb-test-build.noindex;-s=/Users/buildslave/jenkins/workspace/lldb-cmake/test/logs;-t;--env;TERM=vt100' '-DLLDB_ENABLE_PYTHON=On' '-DLLVM_ENABLE_ASSERTIONS:BOOL=TRUE' '-DLLVM_ENABLE_MODULES=On' '-DLLVM_ENABLE_PROJECTS=clang;libcxx;libcxxabi;compiler-rt;lld;lldb;debuginfo-tests' '-DLLVM_LIT_ARGS=-v --time-tests --shuffle --xunit-xml-output=/Users/buildslave/jenkins/workspace/lldb-cmake/test/results.xml -v -j 4' '-DLLVM_VERSION_PATCH=99' '-DCMAKE_C_FLAGS=-Wdocumentation' '-DCMAKE_CXX_FLAGS=-Wdocumentation' '-DCMAKE_C_COMPILER=/Users/buildslave/jenkins/workspace/lldb-cmake/host-compiler/bin/clang' '-DCMAKE_CXX_COMPILER=/Users/buildslave/jenkins/workspace/lldb-cmake/host-compiler/bin/clang++' -- clang project is enabled -- clang-tools-extra project is disabled -- compiler-rt project is enabled -- debuginfo-tests project is enabled -- libc project is disabled -- libclc project is disabled -- libcxx project is enabled -- libcxxabi project is enabled -- libunwind project is disabled -- lld project is enabled -- lldb project is enabled -- mlir project is disabled -- openmp project is disabled -- parallel-libs project is disabled -- polly project is disabled -- pstl project is disabled -- flang project is disabled -- Found libtool - /Applications/Xcode.app/Contents/Developer/Toolchains/XcodeDefault.xctoolchain/usr/bin/libtool -- Found LibXml2: /usr/lib/libxml2.dylib (found version "2.9.4") -- Native target architecture is X86 -- Threads enabled. -- Doxygen disabled. -- Go bindings disabled. -- Ninja version: 1.8.2 -- Found ld64 - /Applications/Xcode.app/Contents/Developer/Toolchains/XcodeDefault.xctoolchain/usr/bin/ld -- Could NOT find OCaml (missing: OCAMLFIND OCAML_VERSION OCAML_STDLIB_PATH) -- Could NOT find OCaml (missing: OCAMLFIND OCAML_VERSION OCAML_STDLIB_PATH) -- OCaml bindings disabled. -- LLVM host triple: x86_64-apple-darwin19.5.0 -- LLVM default target triple: x86_64-apple-darwin19.5.0 -- Building with -fPIC -- Found Python3: /usr/local/Frameworks/Python.framework/Versions/3.7/bin/python3.7 (found version "3.7.1") found components: Interpreter -- Constructing LLVMBuild project information -- Targeting AArch64 -- Targeting AMDGPU -- Targeting ARM -- Targeting AVR -- Targeting BPF -- Targeting Hexagon -- Targeting Lanai -- Targeting Mips -- Targeting MSP430 -- Targeting NVPTX -- Targeting PowerPC -- Targeting RISCV -- Targeting Sparc -- Targeting SystemZ -- Targeting WebAssembly -- Targeting X86 -- Targeting XCore -- Libc++abi will be using libc++ includes from /Users/buildslave/jenkins/workspace/lldb-cmake/llvm-project/libcxxabi/../libcxx/include -- Could not find CrashReporterClient, not linking against it -- Could not find ParallelSTL, libc++abi will not attempt to use it but the build may fail if the libc++ in use needs it to be available. -- Looking for cxxabi.h in /Users/buildslave/jenkins/workspace/lldb-cmake/llvm-project/libcxx/../libcxxabi/include -- Looking for cxxabi.h in /Users/buildslave/jenkins/workspace/lldb-cmake/llvm-project/libcxx/../libcxxabi/include - found -- Looking for __cxxabi_config.h in /Users/buildslave/jenkins/workspace/lldb-cmake/llvm-project/libcxx/../libcxxabi/include -- Looking for __cxxabi_config.h in /Users/buildslave/jenkins/workspace/lldb-cmake/llvm-project/libcxx/../libcxxabi/include - found -- Found OSX_SYSROOT: /Applications/Xcode.app/Contents/Developer/Platforms/MacOSX.platform/Developer/SDKs/MacOSX10.15.sdk -- Got ld supported ARCHES: armv6 armv7 armv7s arm64 arm64e arm64_32 i386 x86_64 x86_64h armv6m armv7k armv7m armv7em -- Toolchain supported arches: armv6;armv7;armv7s;arm64;arm64e;arm64_32;i386;x86_64;x86_64h;armv6m;armv7k;armv7m;armv7em -- Using cached valid architectures for osx. -- OSX supported arches: x86_64;x86_64h -- Using cached valid architectures for iossim. -- ios Simulator supported arches: i386;x86_64 -- Using cached valid architectures for ios. -- ios supported arches: armv6;armv7;armv7s;arm64;armv7k -- Compiler-RT supported architectures: x86_64;x86_64h;i386;armv6;armv7;armv7s;arm64;armv7k -- No arm64 support in /Applications/Xcode.app/Contents/Developer/Platforms/MacOSX.platform/Developer/SDKs/MacOSX10.15.sdk/SDKSettings.plist -- No arm64e support in /Applications/Xcode.app/Contents/Developer/Platforms/MacOSX.platform/Developer/SDKs/MacOSX10.15.sdk/SDKSettings.plist -- Using cached valid architectures for osx. -- OSX supported builtin arches: i386;x86_64;x86_64h -- Using cached valid architectures for iossim. -- ios Simulator supported builtin arches: i386;x86_64 -- Using cached valid architectures for ios. -- ios supported builtin arches: arm64;armv7;armv7k;armv7s -- Builtin supported architectures: i386;x86_64;x86_64h;armv7;armv7k;armv7s;arm64 -- For osx_i386 builtins preferring i386/fp_mode.c to fp_mode.c -- For osx_i386 builtins preferring i386/ashldi3.S to ashldi3.c -- For osx_i386 builtins preferring i386/ashrdi3.S to ashrdi3.c -- For osx_i386 builtins preferring i386/divdi3.S to divdi3.c -- For osx_i386 builtins preferring i386/floatdidf.S to floatdidf.c -- For osx_i386 builtins preferring i386/floatdisf.S to floatdisf.c -- For osx_i386 builtins preferring i386/floatundidf.S to floatundidf.c -- For osx_i386 builtins preferring i386/floatundisf.S to floatundisf.c -- For osx_i386 builtins preferring i386/lshrdi3.S to lshrdi3.c -- For osx_i386 builtins preferring i386/moddi3.S to moddi3.c -- For osx_i386 builtins preferring i386/muldi3.S to muldi3.c -- For osx_i386 builtins preferring i386/udivdi3.S to udivdi3.c -- For osx_i386 builtins preferring i386/umoddi3.S to umoddi3.c -- For osx_i386 builtins preferring i386/floatdixf.S to floatdixf.c -- For osx_i386 builtins preferring i386/floatundixf.S to floatundixf.c -- For osx_x86_64 builtins preferring i386/fp_mode.c to fp_mode.c -- For osx_x86_64 builtins preferring x86_64/floatdidf.c to floatdidf.c -- For osx_x86_64 builtins preferring x86_64/floatdisf.c to floatdisf.c -- For osx_x86_64 builtins preferring x86_64/floatundidf.S to floatundidf.c -- For osx_x86_64 builtins preferring x86_64/floatundisf.S to floatundisf.c -- For osx_x86_64 builtins preferring x86_64/floatdixf.c to floatdixf.c -- For osx_x86_64 builtins preferring x86_64/floatundixf.S to floatundixf.c -- For osx_x86_64h builtins preferring i386/fp_mode.c to fp_mode.c -- For osx_x86_64h builtins preferring x86_64/floatdidf.c to floatdidf.c -- For osx_x86_64h builtins preferring x86_64/floatdisf.c to floatdisf.c -- For osx_x86_64h builtins preferring x86_64/floatundidf.S to floatundidf.c -- For osx_x86_64h builtins preferring x86_64/floatundisf.S to floatundisf.c -- For osx_x86_64h builtins preferring x86_64/floatdixf.c to floatdixf.c -- For osx_x86_64h builtins preferring x86_64/floatundixf.S to floatundixf.c -- For cc_kext_osx_i386 builtins preferring i386/fp_mode.c to fp_mode.c -- For cc_kext_osx_i386 builtins preferring i386/ashldi3.S to ashldi3.c -- For cc_kext_osx_i386 builtins preferring i386/ashrdi3.S to ashrdi3.c -- For cc_kext_osx_i386 builtins preferring i386/divdi3.S to divdi3.c -- For cc_kext_osx_i386 builtins preferring i386/floatdidf.S to floatdidf.c -- For cc_kext_osx_i386 builtins preferring i386/floatdisf.S to floatdisf.c -- For cc_kext_osx_i386 builtins preferring i386/floatundidf.S to floatundidf.c -- For cc_kext_osx_i386 builtins preferring i386/floatundisf.S to floatundisf.c -- For cc_kext_osx_i386 builtins preferring i386/lshrdi3.S to lshrdi3.c -- For cc_kext_osx_i386 builtins preferring i386/moddi3.S to moddi3.c -- For cc_kext_osx_i386 builtins preferring i386/muldi3.S to muldi3.c -- For cc_kext_osx_i386 builtins preferring i386/udivdi3.S to udivdi3.c -- For cc_kext_osx_i386 builtins preferring i386/umoddi3.S to umoddi3.c -- For cc_kext_osx_i386 builtins preferring i386/floatdixf.S to floatdixf.c -- For cc_kext_osx_i386 builtins preferring i386/floatundixf.S to floatundixf.c -- For cc_kext_osx_x86_64 builtins preferring i386/fp_mode.c to fp_mode.c -- For cc_kext_osx_x86_64 builtins preferring x86_64/floatdidf.c to floatdidf.c -- For cc_kext_osx_x86_64 builtins preferring x86_64/floatdisf.c to floatdisf.c -- For cc_kext_osx_x86_64 builtins preferring x86_64/floatundidf.S to floatundidf.c -- For cc_kext_osx_x86_64 builtins preferring x86_64/floatundisf.S to floatundisf.c -- For cc_kext_osx_x86_64 builtins preferring x86_64/floatdixf.c to floatdixf.c -- For cc_kext_osx_x86_64 builtins preferring x86_64/floatundixf.S to floatundixf.c -- For cc_kext_osx_x86_64h builtins preferring i386/fp_mode.c to fp_mode.c -- For cc_kext_osx_x86_64h builtins preferring x86_64/floatdidf.c to floatdidf.c -- For cc_kext_osx_x86_64h builtins preferring x86_64/floatdisf.c to floatdisf.c -- For cc_kext_osx_x86_64h builtins preferring x86_64/floatundidf.S to floatundidf.c -- For cc_kext_osx_x86_64h builtins preferring x86_64/floatundisf.S to floatundisf.c -- For cc_kext_osx_x86_64h builtins preferring x86_64/floatdixf.c to floatdixf.c -- For cc_kext_osx_x86_64h builtins preferring x86_64/floatundixf.S to floatundixf.c -- For iossim_i386 builtins preferring i386/fp_mode.c to fp_mode.c -- For iossim_i386 builtins preferring i386/ashldi3.S to ashldi3.c -- For iossim_i386 builtins preferring i386/ashrdi3.S to ashrdi3.c -- For iossim_i386 builtins preferring i386/divdi3.S to divdi3.c -- For iossim_i386 builtins preferring i386/floatdidf.S to floatdidf.c -- For iossim_i386 builtins preferring i386/floatdisf.S to floatdisf.c -- For iossim_i386 builtins preferring i386/floatundidf.S to floatundidf.c -- For iossim_i386 builtins preferring i386/floatundisf.S to floatundisf.c -- For iossim_i386 builtins preferring i386/lshrdi3.S to lshrdi3.c -- For iossim_i386 builtins preferring i386/moddi3.S to moddi3.c -- For iossim_i386 builtins preferring i386/muldi3.S to muldi3.c -- For iossim_i386 builtins preferring i386/udivdi3.S to udivdi3.c -- For iossim_i386 builtins preferring i386/umoddi3.S to umoddi3.c -- For iossim_i386 builtins preferring i386/floatdixf.S to floatdixf.c -- For iossim_i386 builtins preferring i386/floatundixf.S to floatundixf.c -- For iossim_x86_64 builtins preferring i386/fp_mode.c to fp_mode.c -- For iossim_x86_64 builtins preferring x86_64/floatdidf.c to floatdidf.c -- For iossim_x86_64 builtins preferring x86_64/floatdisf.c to floatdisf.c -- For iossim_x86_64 builtins preferring x86_64/floatundidf.S to floatundidf.c -- For iossim_x86_64 builtins preferring x86_64/floatundisf.S to floatundisf.c -- For iossim_x86_64 builtins preferring x86_64/floatdixf.c to floatdixf.c -- For iossim_x86_64 builtins preferring x86_64/floatundixf.S to floatundixf.c -- For ios_arm64 builtins preferring aarch64/fp_mode.c to fp_mode.c -- For ios_armv7 builtins preferring arm/fp_mode.c to fp_mode.c -- For ios_armv7 builtins preferring arm/comparesf2.S to comparesf2.c -- For ios_armv7k builtins preferring arm/fp_mode.c to fp_mode.c -- For ios_armv7k builtins preferring arm/bswapdi2.S to bswapdi2.c -- For ios_armv7k builtins preferring arm/bswapsi2.S to bswapsi2.c -- For ios_armv7k builtins preferring arm/clzdi2.S to clzdi2.c -- For ios_armv7k builtins preferring arm/clzsi2.S to clzsi2.c -- For ios_armv7k builtins preferring arm/comparesf2.S to comparesf2.c -- For ios_armv7k builtins preferring arm/divmodsi4.S to divmodsi4.c -- For ios_armv7k builtins preferring arm/divsi3.S to divsi3.c -- For ios_armv7k builtins preferring arm/modsi3.S to modsi3.c -- For ios_armv7k builtins preferring arm/udivmodsi4.S to udivmodsi4.c -- For ios_armv7k builtins preferring arm/udivsi3.S to udivsi3.c -- For ios_armv7k builtins preferring arm/umodsi3.S to umodsi3.c -- For ios_armv7s builtins preferring arm/fp_mode.c to fp_mode.c -- For ios_armv7s builtins preferring arm/comparesf2.S to comparesf2.c -- For cc_kext_ios_arm64 builtins preferring aarch64/fp_mode.c to fp_mode.c -- For cc_kext_ios_armv7 builtins preferring arm/fp_mode.c to fp_mode.c -- For cc_kext_ios_armv7 builtins preferring arm/bswapdi2.S to bswapdi2.c -- For cc_kext_ios_armv7 builtins preferring arm/bswapsi2.S to bswapsi2.c -- For cc_kext_ios_armv7 builtins preferring arm/clzdi2.S to clzdi2.c -- For cc_kext_ios_armv7 builtins preferring arm/clzsi2.S to clzsi2.c -- For cc_kext_ios_armv7 builtins preferring arm/comparesf2.S to comparesf2.c -- For cc_kext_ios_armv7 builtins preferring arm/divmodsi4.S to divmodsi4.c -- For cc_kext_ios_armv7 builtins preferring arm/divsi3.S to divsi3.c -- For cc_kext_ios_armv7 builtins preferring arm/modsi3.S to modsi3.c -- For cc_kext_ios_armv7 builtins preferring arm/udivmodsi4.S to udivmodsi4.c -- For cc_kext_ios_armv7 builtins preferring arm/udivsi3.S to udivsi3.c -- For cc_kext_ios_armv7 builtins preferring arm/umodsi3.S to umodsi3.c -- For cc_kext_ios_armv7k builtins preferring arm/fp_mode.c to fp_mode.c -- For cc_kext_ios_armv7k builtins preferring arm/bswapdi2.S to bswapdi2.c -- For cc_kext_ios_armv7k builtins preferring arm/bswapsi2.S to bswapsi2.c -- For cc_kext_ios_armv7k builtins preferring arm/clzdi2.S to clzdi2.c -- For cc_kext_ios_armv7k builtins preferring arm/clzsi2.S to clzsi2.c -- For cc_kext_ios_armv7k builtins preferring arm/comparesf2.S to comparesf2.c -- For cc_kext_ios_armv7k builtins preferring arm/divmodsi4.S to divmodsi4.c -- For cc_kext_ios_armv7k builtins preferring arm/divsi3.S to divsi3.c -- For cc_kext_ios_armv7k builtins preferring arm/modsi3.S to modsi3.c -- For cc_kext_ios_armv7k builtins preferring arm/udivmodsi4.S to udivmodsi4.c -- For cc_kext_ios_armv7k builtins preferring arm/udivsi3.S to udivsi3.c -- For cc_kext_ios_armv7k builtins preferring arm/umodsi3.S to umodsi3.c -- For cc_kext_ios_armv7s builtins preferring arm/fp_mode.c to fp_mode.c -- For cc_kext_ios_armv7s builtins preferring arm/bswapdi2.S to bswapdi2.c -- For cc_kext_ios_armv7s builtins preferring arm/bswapsi2.S to bswapsi2.c -- For cc_kext_ios_armv7s builtins preferring arm/clzdi2.S to clzdi2.c -- For cc_kext_ios_armv7s builtins preferring arm/clzsi2.S to clzsi2.c -- For cc_kext_ios_armv7s builtins preferring arm/comparesf2.S to comparesf2.c -- For cc_kext_ios_armv7s builtins preferring arm/divmodsi4.S to divmodsi4.c -- For cc_kext_ios_armv7s builtins preferring arm/divsi3.S to divsi3.c -- For cc_kext_ios_armv7s builtins preferring arm/modsi3.S to modsi3.c -- For cc_kext_ios_armv7s builtins preferring arm/udivmodsi4.S to udivmodsi4.c -- For cc_kext_ios_armv7s builtins preferring arm/udivsi3.S to udivsi3.c -- For cc_kext_ios_armv7s builtins preferring arm/umodsi3.S to umodsi3.c -- For macho_embedded_armv6m builtins preferring arm/divsi3.S to divsi3.c -- For macho_embedded_armv6m builtins preferring arm/udivsi3.S to udivsi3.c -- For macho_embedded_armv6m builtins preferring arm/comparesf2.S to comparesf2.c -- For macho_embedded_armv6m builtins preferring arm/addsf3.S to addsf3.c -- For macho_embedded_armv7m builtins preferring arm/clzdi2.S to clzdi2.c -- For macho_embedded_armv7m builtins preferring arm/clzsi2.S to clzsi2.c -- For macho_embedded_armv7m builtins preferring arm/comparesf2.S to comparesf2.c -- For macho_embedded_armv7m builtins preferring arm/divmodsi4.S to divmodsi4.c -- For macho_embedded_armv7m builtins preferring arm/divsi3.S to divsi3.c -- For macho_embedded_armv7m builtins preferring arm/modsi3.S to modsi3.c -- For macho_embedded_armv7m builtins preferring arm/udivmodsi4.S to udivmodsi4.c -- For macho_embedded_armv7m builtins preferring arm/udivsi3.S to udivsi3.c -- For macho_embedded_armv7m builtins preferring arm/umodsi3.S to umodsi3.c -- For macho_embedded_armv7em builtins preferring arm/clzdi2.S to clzdi2.c -- For macho_embedded_armv7em builtins preferring arm/clzsi2.S to clzsi2.c -- For macho_embedded_armv7em builtins preferring arm/comparesf2.S to comparesf2.c -- For macho_embedded_armv7em builtins preferring arm/divmodsi4.S to divmodsi4.c -- For macho_embedded_armv7em builtins preferring arm/divsi3.S to divsi3.c -- For macho_embedded_armv7em builtins preferring arm/modsi3.S to modsi3.c -- For macho_embedded_armv7em builtins preferring arm/udivmodsi4.S to udivmodsi4.c -- For macho_embedded_armv7em builtins preferring arm/udivsi3.S to udivsi3.c -- For macho_embedded_armv7em builtins preferring arm/umodsi3.S to umodsi3.c -- For macho_embedded_armv7 builtins preferring arm/clzdi2.S to clzdi2.c -- For macho_embedded_armv7 builtins preferring arm/clzsi2.S to clzsi2.c -- For macho_embedded_armv7 builtins preferring arm/comparesf2.S to comparesf2.c -- For macho_embedded_armv7 builtins preferring arm/divmodsi4.S to divmodsi4.c -- For macho_embedded_armv7 builtins preferring arm/divsi3.S to divsi3.c -- For macho_embedded_armv7 builtins preferring arm/modsi3.S to modsi3.c -- For macho_embedded_armv7 builtins preferring arm/udivmodsi4.S to udivmodsi4.c -- For macho_embedded_armv7 builtins preferring arm/udivsi3.S to udivsi3.c -- For macho_embedded_armv7 builtins preferring arm/umodsi3.S to umodsi3.c -- For macho_embedded_i386 builtins preferring i386/ashldi3.S to ashldi3.c -- For macho_embedded_i386 builtins preferring i386/ashrdi3.S to ashrdi3.c -- For macho_embedded_i386 builtins preferring i386/divdi3.S to divdi3.c -- For macho_embedded_i386 builtins preferring i386/floatdidf.S to floatdidf.c -- For macho_embedded_i386 builtins preferring i386/floatdisf.S to floatdisf.c -- For macho_embedded_i386 builtins preferring i386/floatundidf.S to floatundidf.c -- For macho_embedded_i386 builtins preferring i386/floatundisf.S to floatundisf.c -- For macho_embedded_i386 builtins preferring i386/lshrdi3.S to lshrdi3.c -- For macho_embedded_i386 builtins preferring i386/moddi3.S to moddi3.c -- For macho_embedded_i386 builtins preferring i386/muldi3.S to muldi3.c -- For macho_embedded_i386 builtins preferring i386/udivdi3.S to udivdi3.c -- For macho_embedded_i386 builtins preferring i386/umoddi3.S to umoddi3.c -- For macho_embedded_x86_64 builtins preferring x86_64/floatdidf.c to floatdidf.c -- For macho_embedded_x86_64 builtins preferring x86_64/floatdisf.c to floatdisf.c -- For macho_embedded_x86_64 builtins preferring x86_64/floatundidf.S to floatundidf.c -- For macho_embedded_x86_64 builtins preferring x86_64/floatundisf.S to floatundisf.c -- No arm64 support in /Applications/Xcode.app/Contents/Developer/Platforms/MacOSX.platform/Developer/SDKs/MacOSX10.15.sdk/SDKSettings.plist -- No arm64e support in /Applications/Xcode.app/Contents/Developer/Platforms/MacOSX.platform/Developer/SDKs/MacOSX10.15.sdk/SDKSettings.plist -- Using cached valid architectures for osx. -- OSX supported builtin arches: i386;x86_64;x86_64h -- Using cached valid architectures for iossim. -- ios Simulator supported builtin arches: i386;x86_64 -- Using cached valid architectures for ios. -- ios supported builtin arches: arm64;armv7;armv7k;armv7s -- Builtin supported architectures: i386;x86_64;x86_64h;armv7;armv7k;armv7s;arm64 -- check-interception does nothing. -- Generated Sanitizer SUPPORTED_TOOLS list on "Darwin" is "asan;lsan;tsan;ubsan" -- sanitizer_common tests on "Darwin" will run against "asan;lsan;tsan;ubsan" -- Clang version: 12.0.99 -- Host linker version: 556.6 -- LLD version: 12.0.99 -- Enable editline support in LLDB: TRUE -- Enable curses support in LLDB: TRUE -- Enable LZMA compression support in LLDB: TRUE -- Could NOT find Lua (missing: LUA_LIBRARIES LUA_INCLUDE_DIR) (Required is at least version "5.3") -- Could NOT find LuaAndSwig (missing: LUA_LIBRARIES LUA_INCLUDE_DIR) -- Enable Lua scripting support in LLDB: FALSE -- Found Python3: /usr/local/Frameworks/Python.framework/Versions/3.7/bin/python3.7 (found version "3.7.1") found components: Interpreter Development -- Enable Python scripting support in LLDB: TRUE -- Found LibXml2: /usr/lib/libxml2.dylib (found suitable version "2.9.4", minimum required is "2.8") -- Enable Libxml 2 support in LLDB: TRUE -- LLDB version: 12.0.99git -- Symbols (liblldb): exporting all symbols from the lldb namespace CMake Warning at /Users/buildslave/jenkins/workspace/lldb-cmake/llvm-project/lldb/tools/debugserver/source/CMakeLists.txt:44 (message): Development code sign identity not found: 'lldb_codesign' This will cause failures in the test suite.Pass '-DLLDB_USE_SYSTEM_DEBUGSERVER=ON' to use the system one instead.See 'Code Signing on macOS' in the documentation. Call Stack (most recent call first): /Users/buildslave/jenkins/workspace/lldb-cmake/llvm-project/lldb/tools/debugserver/source/CMakeLists.txt:92 (get_debugserver_codesign_identity)

Hide Details

Hide Details

-- LLDB debugserver energy support is disabled -- Could NOT find Doxygen (missing: DOXYGEN_EXECUTABLE) -- Could NOT find epydoc -- LLDB Tests use just-built debugserver: /Users/buildslave/jenkins/workspace/lldb-cmake/lldb-build/./bin/debugserver -- Registering Bye as a pass plugin (static build: OFF) -- LLVM FileCheck Found: /usr/local/bin/FileCheck -- Version: 0.0.0 -- Performing Test HAVE_THREAD_SAFETY_ATTRIBUTES -- failed to compile -- Performing Test HAVE_GNU_POSIX_REGEX -- failed to compile -- Performing Test HAVE_POSIX_REGEX -- success -- Performing Test HAVE_STEADY_CLOCK -- success -- Configuring done -- Generating done -- Build files have been written to: /Users/buildslave/jenkins/workspace/lldb-cmake/lldb-build Completed at: 2020-10-01T06:32:52 @@@@@@
Build

Hide Details

@@@ Build @@@ cd /Users/buildslave/jenkins/workspace/lldb-cmake/lldb-build '/usr/local/bin/ninja' '-v' [1/2733] : && "/Applications/Xcode.app/Contents/Developer/Toolchains/XcodeDefault.xctoolchain/usr/bin/libtool" -static -no_warning_for_no_symbols -o lib/libLLVMWindowsManifest.a lib/WindowsManifest/CMakeFiles/LLVMWindowsManifest.dir/WindowsManifestMerger.cpp.o && : [2/2733] : && "/Applications/Xcode.app/Contents/Developer/Toolchains/XcodeDefault.xctoolchain/usr/bin/libtool" -static -no_warning_for_no_symbols -o lib/libLLVMTextAPI.a lib/TextAPI/CMakeFiles/LLVMTextAPI.dir/MachO/Architecture.cpp.o lib/TextAPI/CMakeFiles/LLVMTextAPI.dir/MachO/ArchitectureSet.cpp.o lib/TextAPI/CMakeFiles/LLVMTextAPI.dir/MachO/InterfaceFile.cpp.o lib/TextAPI/CMakeFiles/LLVMTextAPI.dir/MachO/PackedVersion.cpp.o lib/TextAPI/CMakeFiles/LLVMTextAPI.dir/MachO/Platform.cpp.o lib/TextAPI/CMakeFiles/LLVMTextAPI.dir/MachO/Symbol.cpp.o lib/TextAPI/CMakeFiles/LLVMTextAPI.dir/MachO/Target.cpp.o lib/TextAPI/CMakeFiles/LLVMTextAPI.dir/MachO/TextStub.cpp.o lib/TextAPI/CMakeFiles/LLVMTextAPI.dir/MachO/TextStubCommon.cpp.o && : [3/2733] /Users/buildslave/jenkins/workspace/lldb-cmake/host-compiler/bin/clang++ -DHAVE_RPC_XDR_H=0 -D_DEBUG -D__STDC_CONSTANT_MACROS -D__STDC_FORMAT_MACROS -D__STDC_LIMIT_MACROS -Iprojects/compiler-rt/lib/sanitizer_common -I/Users/buildslave/jenkins/workspace/lldb-cmake/llvm-project/compiler-rt/lib/sanitizer_common -Iinclude -I/Users/buildslave/jenkins/workspace/lldb-cmake/llvm-project/llvm/include -I/Users/buildslave/jenkins/workspace/lldb-cmake/llvm-project/compiler-rt/lib/sanitizer_common/.. -Wdocumentation -fPIC -fvisibility-inlines-hidden -Werror=date-time -Werror=unguarded-availability-new -fmodules -fmodules-cache-path=/Users/buildslave/jenkins/workspace/lldb-cmake/lldb-build/module.cache -fcxx-modules -Xclang -fmodules-local-submodule-visibility -Wall -Wextra -Wno-unused-parameter -Wwrite-strings -Wcast-qual -Wmissing-field-initializers -pedantic -Wno-long-long -Wimplicit-fallthrough -Wcovered-switch-default -Wno-noexcept-type -Wnon-virtual-dtor -Wdelete-non-virtual-dtor -Wsuggest-override -Wstring-conversion -fdiagnostics-color -Wall -std=c++14 -Wno-unused-parameter -O3 -arch x86_64 -arch x86_64h -isysroot /Applications/Xcode.app/Contents/Developer/Platforms/MacOSX.platform/Developer/SDKs/MacOSX10.15.sdk -stdlib=libc++ -mmacosx-version-min=10.10 -isysroot /Applications/Xcode.app/Contents/Developer/Platforms/MacOSX.platform/Developer/SDKs/MacOSX10.15.sdk -fPIC -fno-builtin -fno-exceptions -funwind-tables -fno-stack-protector -fno-sanitize=safe-stack -fvisibility=hidden -fno-lto -O3 -gline-tables-only -fno-modules -Wno-gnu -Wno-variadic-macros -Wno-c99-extensions -Wno-non-virtual-dtor -fno-rtti -Wframe-larger-than=570 -Wglobal-constructors -DSANITIZER_SUPPORTS_WEAK_HOOKS=0 -UNDEBUG -std=c++14 -MD -MT projects/compiler-rt/lib/sanitizer_common/CMakeFiles/RTSanitizerCommonNoHooks.osx.dir/sanitizer_errno.cpp.o -MF projects/compiler-rt/lib/sanitizer_common/CMakeFiles/RTSanitizerCommonNoHooks.osx.dir/sanitizer_errno.cpp.o.d -o projects/compiler-rt/lib/sanitizer_common/CMakeFiles/RTSanitizerCommonNoHooks.osx.dir/sanitizer_errno.cpp.o -c /Users/buildslave/jenkins/workspace/lldb-cmake/llvm-project/compiler-rt/lib/sanitizer_common/sanitizer_errno.cpp clang-12: warning: argument unused during compilation: '-fmodules-cache-path=/Users/buildslave/jenkins/workspace/lldb-cmake/lldb-build/module.cache' [-Wunused-command-line-argument] clang-12: warning: argument unused during compilation: '-fcxx-modules' [-Wunused-command-line-argument] [4/2733] : && /Users/buildslave/jenkins/workspace/lldb-cmake/host-compiler/bin/clang++ -Wdocumentation -fPIC -fvisibility-inlines-hidden -Werror=date-time -Werror=unguarded-availability-new -fmodules -fmodules-cache-path=/Users/buildslave/jenkins/workspace/lldb-cmake/lldb-build/module.cache -fcxx-modules -Xclang -fmodules-local-submodule-visibility -Wall -Wextra -Wno-unused-parameter -Wwrite-strings -Wcast-qual -Wmissing-field-initializers -Wno-long-long -Wimplicit-fallthrough -Wcovered-switch-default -Wno-noexcept-type -Wnon-virtual-dtor -Wdelete-non-virtual-dtor -Wsuggest-override -Wstring-conversion -fdiagnostics-color -O3 -isysroot /Applications/Xcode.app/Contents/Developer/Platforms/MacOSX.platform/Developer/SDKs/MacOSX10.15.sdk -dynamiclib -Wl,-headerpad_max_install_names -compatibility_version 1.0.0 -current_version 1.0.0 -o lib/libc++.1.0.dylib -install_name @rpath/libc++.1.dylib projects/libcxx/src/CMakeFiles/cxx_shared.dir/algorithm.cpp.o projects/libcxx/src/CMakeFiles/cxx_shared.dir/any.cpp.o projects/libcxx/src/CMakeFiles/cxx_shared.dir/atomic.cpp.o projects/libcxx/src/CMakeFiles/cxx_shared.dir/barrier.cpp.o projects/libcxx/src/CMakeFiles/cxx_shared.dir/bind.cpp.o projects/libcxx/src/CMakeFiles/cxx_shared.dir/charconv.cpp.o projects/libcxx/src/CMakeFiles/cxx_shared.dir/chrono.cpp.o projects/libcxx/src/CMakeFiles/cxx_shared.dir/condition_variable.cpp.o projects/libcxx/src/CMakeFiles/cxx_shared.dir/condition_variable_destructor.cpp.o projects/libcxx/src/CMakeFiles/cxx_shared.dir/debug.cpp.o projects/libcxx/src/CMakeFiles/cxx_shared.dir/exception.cpp.o projects/libcxx/src/CMakeFiles/cxx_shared.dir/functional.cpp.o projects/libcxx/src/CMakeFiles/cxx_shared.dir/future.cpp.o projects/libcxx/src/CMakeFiles/cxx_shared.dir/hash.cpp.o projects/libcxx/src/CMakeFiles/cxx_shared.dir/ios.cpp.o projects/libcxx/src/CMakeFiles/cxx_shared.dir/iostream.cpp.o projects/libcxx/src/CMakeFiles/cxx_shared.dir/locale.cpp.o projects/libcxx/src/CMakeFiles/cxx_shared.dir/memory.cpp.o projects/libcxx/src/CMakeFiles/cxx_shared.dir/mutex.cpp.o projects/libcxx/src/CMakeFiles/cxx_shared.dir/mutex_destructor.cpp.o projects/libcxx/src/CMakeFiles/cxx_shared.dir/new.cpp.o projects/libcxx/src/CMakeFiles/cxx_shared.dir/optional.cpp.o projects/libcxx/src/CMakeFiles/cxx_shared.dir/random.cpp.o projects/libcxx/src/CMakeFiles/cxx_shared.dir/random_shuffle.cpp.o projects/libcxx/src/CMakeFiles/cxx_shared.dir/regex.cpp.o projects/libcxx/src/CMakeFiles/cxx_shared.dir/shared_mutex.cpp.o projects/libcxx/src/CMakeFiles/cxx_shared.dir/stdexcept.cpp.o projects/libcxx/src/CMakeFiles/cxx_shared.dir/string.cpp.o projects/libcxx/src/CMakeFiles/cxx_shared.dir/strstream.cpp.o projects/libcxx/src/CMakeFiles/cxx_shared.dir/system_error.cpp.o projects/libcxx/src/CMakeFiles/cxx_shared.dir/thread.cpp.o projects/libcxx/src/CMakeFiles/cxx_shared.dir/typeinfo.cpp.o projects/libcxx/src/CMakeFiles/cxx_shared.dir/utility.cpp.o projects/libcxx/src/CMakeFiles/cxx_shared.dir/valarray.cpp.o projects/libcxx/src/CMakeFiles/cxx_shared.dir/variant.cpp.o projects/libcxx/src/CMakeFiles/cxx_shared.dir/vector.cpp.o projects/libcxx/src/CMakeFiles/cxx_shared.dir/filesystem/operations.cpp.o projects/libcxx/src/CMakeFiles/cxx_shared.dir/filesystem/directory_iterator.cpp.o projects/libcxx/src/CMakeFiles/cxx_shared.dir/filesystem/int128_builtins.cpp.o -Wl,-rpath,@loader_path/../lib -nodefaultlibs -lSystem -lc lib/libc++abi.1.0.dylib -Wl,-unexported_symbols_list,/Users/buildslave/jenkins/workspace/lldb-cmake/llvm-project/libcxx/src/../lib/libc++unexp.exp -Wl,-reexported_symbols_list,/Users/buildslave/jenkins/workspace/lldb-cmake/llvm-project/libcxx/src/../lib/libc++abi.v2.exp -Wl,-force_symbols_not_weak_list,/Users/buildslave/jenkins/workspace/lldb-cmake/llvm-project/libcxx/src/../lib/notweak.exp -Wl,-force_symbols_weak_list,/Users/buildslave/jenkins/workspace/lldb-cmake/llvm-project/libcxx/src/../lib/weak.exp -Wl,-reexported_symbols_list,/Users/buildslave/jenkins/workspace/lldb-cmake/llvm-project/libcxxabi/src/../lib/new-delete.exp -Wl,-reexported_symbols_list,/Users/buildslave/jenkins/workspace/lldb-cmake/llvm-project/libcxxabi/src/../lib/exceptions.exp -Wl,-reexported_symbols_list,/Users/buildslave/jenkins/workspace/lldb-cmake/llvm-project/libcxxabi/src/../lib/personality-v0.exp && : FAILED: lib/libc++.1.0.dylib : && /Users/buildslave/jenkins/workspace/lldb-cmake/host-compiler/bin/clang++ -Wdocumentation -fPIC -fvisibility-inlines-hidden -Werror=date-time -Werror=unguarded-availability-new -fmodules -fmodules-cache-path=/Users/buildslave/jenkins/workspace/lldb-cmake/lldb-build/module.cache -fcxx-modules -Xclang -fmodules-local-submodule-visibility -Wall -Wextra -Wno-unused-parameter -Wwrite-strings -Wcast-qual -Wmissing-field-initializers -Wno-long-long -Wimplicit-fallthrough -Wcovered-switch-default -Wno-noexcept-type -Wnon-virtual-dtor -Wdelete-non-virtual-dtor -Wsuggest-override -Wstring-conversion -fdiagnostics-color -O3 -isysroot /Applications/Xcode.app/Contents/Developer/Platforms/MacOSX.platform/Developer/SDKs/MacOSX10.15.sdk -dynamiclib -Wl,-headerpad_max_install_names -compatibility_version 1.0.0 -current_version 1.0.0 -o lib/libc++.1.0.dylib -install_name @rpath/libc++.1.dylib projects/libcxx/src/CMakeFiles/cxx_shared.dir/algorithm.cpp.o projects/libcxx/src/CMakeFiles/cxx_shared.dir/any.cpp.o projects/libcxx/src/CMakeFiles/cxx_shared.dir/atomic.cpp.o projects/libcxx/src/CMakeFiles/cxx_shared.dir/barrier.cpp.o projects/libcxx/src/CMakeFiles/cxx_shared.dir/bind.cpp.o projects/libcxx/src/CMakeFiles/cxx_shared.dir/charconv.cpp.o projects/libcxx/src/CMakeFiles/cxx_shared.dir/chrono.cpp.o projects/libcxx/src/CMakeFiles/cxx_shared.dir/condition_variable.cpp.o projects/libcxx/src/CMakeFiles/cxx_shared.dir/condition_variable_destructor.cpp.o projects/libcxx/src/CMakeFiles/cxx_shared.dir/debug.cpp.o projects/libcxx/src/CMakeFiles/cxx_shared.dir/exception.cpp.o projects/libcxx/src/CMakeFiles/cxx_shared.dir/functional.cpp.o projects/libcxx/src/CMakeFiles/cxx_shared.dir/future.cpp.o projects/libcxx/src/CMakeFiles/cxx_shared.dir/hash.cpp.o projects/libcxx/src/CMakeFiles/cxx_shared.dir/ios.cpp.o projects/libcxx/src/CMakeFiles/cxx_shared.dir/iostream.cpp.o projects/libcxx/src/CMakeFiles/cxx_shared.dir/locale.cpp.o projects/libcxx/src/CMakeFiles/cxx_shared.dir/memory.cpp.o projects/libcxx/src/CMakeFiles/cxx_shared.dir/mutex.cpp.o projects/libcxx/src/CMakeFiles/cxx_shared.dir/mutex_destructor.cpp.o projects/libcxx/src/CMakeFiles/cxx_shared.dir/new.cpp.o projects/libcxx/src/CMakeFiles/cxx_shared.dir/optional.cpp.o projects/libcxx/src/CMakeFiles/cxx_shared.dir/random.cpp.o projects/libcxx/src/CMakeFiles/cxx_shared.dir/random_shuffle.cpp.o projects/libcxx/src/CMakeFiles/cxx_shared.dir/regex.cpp.o projects/libcxx/src/CMakeFiles/cxx_shared.dir/shared_mutex.cpp.o projects/libcxx/src/CMakeFiles/cxx_shared.dir/stdexcept.cpp.o projects/libcxx/src/CMakeFiles/cxx_shared.dir/string.cpp.o projects/libcxx/src/CMakeFiles/cxx_shared.dir/strstream.cpp.o projects/libcxx/src/CMakeFiles/cxx_shared.dir/system_error.cpp.o projects/libcxx/src/CMakeFiles/cxx_shared.dir/thread.cpp.o projects/libcxx/src/CMakeFiles/cxx_shared.dir/typeinfo.cpp.o projects/libcxx/src/CMakeFiles/cxx_shared.dir/utility.cpp.o projects/libcxx/src/CMakeFiles/cxx_shared.dir/valarray.cpp.o projects/libcxx/src/CMakeFiles/cxx_shared.dir/variant.cpp.o projects/libcxx/src/CMakeFiles/cxx_shared.dir/vector.cpp.o projects/libcxx/src/CMakeFiles/cxx_shared.dir/filesystem/operations.cpp.o projects/libcxx/src/CMakeFiles/cxx_shared.dir/filesystem/directory_iterator.cpp.o projects/libcxx/src/CMakeFiles/cxx_shared.dir/filesystem/int128_builtins.cpp.o -Wl,-rpath,@loader_path/../lib -nodefaultlibs -lSystem -lc lib/libc++abi.1.0.dylib -Wl,-unexported_symbols_list,/Users/buildslave/jenkins/workspace/lldb-cmake/llvm-project/libcxx/src/../lib/libc++unexp.exp -Wl,-reexported_symbols_list,/Users/buildslave/jenkins/workspace/lldb-cmake/llvm-project/libcxx/src/../lib/libc++abi.v2.exp -Wl,-force_symbols_not_weak_list,/Users/buildslave/jenkins/workspace/lldb-cmake/llvm-project/libcxx/src/../lib/notweak.exp -Wl,-force_symbols_weak_list,/Users/buildslave/jenkins/workspace/lldb-cmake/llvm-project/libcxx/src/../lib/weak.exp -Wl,-reexported_symbols_list,/Users/buildslave/jenkins/workspace/lldb-cmake/llvm-project/libcxxabi/src/../lib/new-delete.exp -Wl,-reexported_symbols_list,/Users/buildslave/jenkins/workspace/lldb-cmake/llvm-project/libcxxabi/src/../lib/exceptions.exp -Wl,-reexported_symbols_list,/Users/buildslave/jenkins/workspace/lldb-cmake/llvm-project/libcxxabi/src/../lib/personality-v0.exp && : ld: requested re-export symbol operator new(unsigned long) is not from a dylib, but from projects/libcxx/src/CMakeFiles/cxx_shared.dir/new.cpp.o file 'projects/libcxx/src/CMakeFiles/cxx_shared.dir/new.cpp.o' for architecture x86_64 clang-12: error: linker command failed with exit code 1 (use -v to see invocation) [5/2733] /Users/buildslave/jenkins/workspace/lldb-cmake/host-compiler/bin/clang++ -DHAVE_RPC_XDR_H=0 -D_DEBUG -D__STDC_CONSTANT_MACROS -D__STDC_FORMAT_MACROS -D__STDC_LIMIT_MACROS -Iprojects/compiler-rt/lib/sanitizer_common -I/Users/buildslave/jenkins/workspace/lldb-cmake/llvm-project/compiler-rt/lib/sanitizer_common -Iinclude -I/Users/buildslave/jenkins/workspace/lldb-cmake/llvm-project/llvm/include -I/Users/buildslave/jenkins/workspace/lldb-cmake/llvm-project/compiler-rt/lib/sanitizer_common/.. -Wdocumentation -fPIC -fvisibility-inlines-hidden -Werror=date-time -Werror=unguarded-availability-new -fmodules -fmodules-cache-path=/Users/buildslave/jenkins/workspace/lldb-cmake/lldb-build/module.cache -fcxx-modules -Xclang -fmodules-local-submodule-visibility -Wall -Wextra -Wno-unused-parameter -Wwrite-strings -Wcast-qual -Wmissing-field-initializers -pedantic -Wno-long-long -Wimplicit-fallthrough -Wcovered-switch-default -Wno-noexcept-type -Wnon-virtual-dtor -Wdelete-non-virtual-dtor -Wsuggest-override -Wstring-conversion -fdiagnostics-color -Wall -std=c++14 -Wno-unused-parameter -O3 -arch x86_64 -arch x86_64h -isysroot /Applications/Xcode.app/Contents/Developer/Platforms/MacOSX.platform/Developer/SDKs/MacOSX10.15.sdk -stdlib=libc++ -mmacosx-version-min=10.10 -isysroot /Applications/Xcode.app/Contents/Developer/Platforms/MacOSX.platform/Developer/SDKs/MacOSX10.15.sdk -fPIC -fno-builtin -fno-exceptions -funwind-tables -fno-stack-protector -fno-sanitize=safe-stack -fvisibility=hidden -fno-lto -O3 -gline-tables-only -fno-modules -Wno-gnu -Wno-variadic-macros -Wno-c99-extensions -Wno-non-virtual-dtor -fno-rtti -Wframe-larger-than=570 -Wglobal-constructors -DSANITIZER_SUPPORTS_WEAK_HOOKS=0 -UNDEBUG -std=c++14 -MD -MT projects/compiler-rt/lib/sanitizer_common/CMakeFiles/RTSanitizerCommonNoHooks.osx.dir/sanitizer_posix.cpp.o -MF projects/compiler-rt/lib/sanitizer_common/CMakeFiles/RTSanitizerCommonNoHooks.osx.dir/sanitizer_posix.cpp.o.d -o projects/compiler-rt/lib/sanitizer_common/CMakeFiles/RTSanitizerCommonNoHooks.osx.dir/sanitizer_posix.cpp.o -c /Users/buildslave/jenkins/workspace/lldb-cmake/llvm-project/compiler-rt/lib/sanitizer_common/sanitizer_posix.cpp clang-12: warning: argument unused during compilation: '-fmodules-cache-path=/Users/buildslave/jenkins/workspace/lldb-cmake/lldb-build/module.cache' [-Wunused-command-line-argument] clang-12: warning: argument unused during compilation: '-fcxx-modules' [-Wunused-command-line-argument] [6/2733] : && /Users/buildslave/jenkins/workspace/lldb-cmake/host-compiler/bin/clang++ -Wdocumentation -fPIC -fvisibility-inlines-hidden -Werror=date-time -Werror=unguarded-availability-new -fmodules -fmodules-cache-path=/Users/buildslave/jenkins/workspace/lldb-cmake/lldb-build/module.cache -fcxx-modules -Xclang -fmodules-local-submodule-visibility -Wall -Wextra -Wno-unused-parameter -Wwrite-strings -Wcast-qual -Wmissing-field-initializers -pedantic -Wno-long-long -Wimplicit-fallthrough -Wcovered-switch-default -Wno-noexcept-type -Wnon-virtual-dtor -Wdelete-non-virtual-dtor -Wsuggest-override -Wstring-conversion -fdiagnostics-color -O3 -isysroot /Applications/Xcode.app/Contents/Developer/Platforms/MacOSX.platform/Developer/SDKs/MacOSX10.15.sdk -Wl,-search_paths_first -Wl,-headerpad_max_install_names -Wl,-dead_strip utils/yaml-bench/CMakeFiles/yaml-bench.dir/YAMLBench.cpp.o -o bin/yaml-bench -Wl,-rpath,@loader_path/../lib lib/libLLVMSupport.a -lm /usr/lib/libz.dylib /usr/lib/libcurses.dylib lib/libLLVMDemangle.a && : [7/2733] : && /Users/buildslave/jenkins/workspace/lldb-cmake/host-compiler/bin/clang++ -Wdocumentation -fPIC -fvisibility-inlines-hidden -Werror=date-time -Werror=unguarded-availability-new -fmodules -fmodules-cache-path=/Users/buildslave/jenkins/workspace/lldb-cmake/lldb-build/module.cache -fcxx-modules -Xclang -fmodules-local-submodule-visibility -Wall -Wextra -Wno-unused-parameter -Wwrite-strings -Wcast-qual -Wmissing-field-initializers -pedantic -Wno-long-long -Wimplicit-fallthrough -Wcovered-switch-default -Wno-noexcept-type -Wnon-virtual-dtor -Wdelete-non-virtual-dtor -Wsuggest-override -Wstring-conversion -fdiagnostics-color -O3 -isysroot /Applications/Xcode.app/Contents/Developer/Platforms/MacOSX.platform/Developer/SDKs/MacOSX10.15.sdk -Wl,-search_paths_first -Wl,-headerpad_max_install_names -Wl,-dead_strip utils/FileCheck/CMakeFiles/FileCheck.dir/FileCheck.cpp.o -o bin/FileCheck -Wl,-rpath,@loader_path/../lib lib/libLLVMFileCheck.a lib/libLLVMSupport.a -lm /usr/lib/libz.dylib /usr/lib/libcurses.dylib lib/libLLVMDemangle.a && : [8/2733] /Users/buildslave/jenkins/workspace/lldb-cmake/host-compiler/bin/clang++ -DHAVE_RPC_XDR_H=0 -D_DEBUG -D__STDC_CONSTANT_MACROS -D__STDC_FORMAT_MACROS -D__STDC_LIMIT_MACROS -Iprojects/compiler-rt/lib/sanitizer_common -I/Users/buildslave/jenkins/workspace/lldb-cmake/llvm-project/compiler-rt/lib/sanitizer_common -Iinclude -I/Users/buildslave/jenkins/workspace/lldb-cmake/llvm-project/llvm/include -I/Users/buildslave/jenkins/workspace/lldb-cmake/llvm-project/compiler-rt/lib/sanitizer_common/.. -Wdocumentation -fPIC -fvisibility-inlines-hidden -Werror=date-time -Werror=unguarded-availability-new -fmodules -fmodules-cache-path=/Users/buildslave/jenkins/workspace/lldb-cmake/lldb-build/module.cache -fcxx-modules -Xclang -fmodules-local-submodule-visibility -Wall -Wextra -Wno-unused-parameter -Wwrite-strings -Wcast-qual -Wmissing-field-initializers -pedantic -Wno-long-long -Wimplicit-fallthrough -Wcovered-switch-default -Wno-noexcept-type -Wnon-virtual-dtor -Wdelete-non-virtual-dtor -Wsuggest-override -Wstring-conversion -fdiagnostics-color -Wall -std=c++14 -Wno-unused-parameter -O3 -arch armv7 -arch armv7s -arch arm64 -arch armv7k -isysroot /Applications/Xcode.app/Contents/Developer/Platforms/MacOSX.platform/Developer/SDKs/MacOSX10.15.sdk -stdlib=libc++ -miphoneos-version-min=9.0 -isysroot /Applications/Xcode.app/Contents/Developer/Platforms/iPhoneOS.platform/Developer/SDKs/iPhoneOS13.5.sdk -fPIC -fno-builtin -fno-exceptions -funwind-tables -fno-stack-protector -fno-sanitize=safe-stack -fvisibility=hidden -fno-lto -O3 -gline-tables-only -fno-modules -Wno-gnu -Wno-variadic-macros -Wno-c99-extensions -Wno-non-virtual-dtor -fno-rtti -Wframe-larger-than=570 -Wglobal-constructors -DSANITIZER_SUPPORTS_WEAK_HOOKS=0 -UNDEBUG -std=c++14 -MD -MT projects/compiler-rt/lib/sanitizer_common/CMakeFiles/RTSanitizerCommonSymbolizerNoHooks.ios.dir/sanitizer_stackdepot.cpp.o -MF projects/compiler-rt/lib/sanitizer_common/CMakeFiles/RTSanitizerCommonSymbolizerNoHooks.ios.dir/sanitizer_stackdepot.cpp.o.d -o projects/compiler-rt/lib/sanitizer_common/CMakeFiles/RTSanitizerCommonSymbolizerNoHooks.ios.dir/sanitizer_stackdepot.cpp.o -c /Users/buildslave/jenkins/workspace/lldb-cmake/llvm-project/compiler-rt/lib/sanitizer_common/sanitizer_stackdepot.cpp clang-12: warning: argument unused during compilation: '-fmodules-cache-path=/Users/buildslave/jenkins/workspace/lldb-cmake/lldb-build/module.cache' [-Wunused-command-line-argument] clang-12: warning: argument unused during compilation: '-fcxx-modules' [-Wunused-command-line-argument] [9/2733] : && "/Applications/Xcode.app/Contents/Developer/Toolchains/XcodeDefault.xctoolchain/usr/bin/libtool" -static -no_warning_for_no_symbols -o lib/libLLVMObject.a lib/Object/CMakeFiles/LLVMObject.dir/Archive.cpp.o lib/Object/CMakeFiles/LLVMObject.dir/ArchiveWriter.cpp.o lib/Object/CMakeFiles/LLVMObject.dir/Binary.cpp.o lib/Object/CMakeFiles/LLVMObject.dir/COFFImportFile.cpp.o lib/Object/CMakeFiles/LLVMObject.dir/COFFModuleDefinition.cpp.o lib/Object/CMakeFiles/LLVMObject.dir/COFFObjectFile.cpp.o lib/Object/CMakeFiles/LLVMObject.dir/Decompressor.cpp.o lib/Object/CMakeFiles/LLVMObject.dir/ELF.cpp.o lib/Object/CMakeFiles/LLVMObject.dir/ELFObjectFile.cpp.o lib/Object/CMakeFiles/LLVMObject.dir/Error.cpp.o lib/Object/CMakeFiles/LLVMObject.dir/IRObjectFile.cpp.o lib/Object/CMakeFiles/LLVMObject.dir/IRSymtab.cpp.o lib/Object/CMakeFiles/LLVMObject.dir/MachOObjectFile.cpp.o lib/Object/CMakeFiles/LLVMObject.dir/MachOUniversal.cpp.o lib/Object/CMakeFiles/LLVMObject.dir/Minidump.cpp.o lib/Object/CMakeFiles/LLVMObject.dir/ModuleSymbolTable.cpp.o lib/Object/CMakeFiles/LLVMObject.dir/Object.cpp.o lib/Object/CMakeFiles/LLVMObject.dir/ObjectFile.cpp.o lib/Object/CMakeFiles/LLVMObject.dir/RecordStreamer.cpp.o lib/Object/CMakeFiles/LLVMObject.dir/RelocationResolver.cpp.o lib/Object/CMakeFiles/LLVMObject.dir/SymbolicFile.cpp.o lib/Object/CMakeFiles/LLVMObject.dir/SymbolSize.cpp.o lib/Object/CMakeFiles/LLVMObject.dir/TapiFile.cpp.o lib/Object/CMakeFiles/LLVMObject.dir/TapiUniversal.cpp.o lib/Object/CMakeFiles/LLVMObject.dir/MachOUniversalWriter.cpp.o lib/Object/CMakeFiles/LLVMObject.dir/WasmObjectFile.cpp.o lib/Object/CMakeFiles/LLVMObject.dir/WindowsMachineFlag.cpp.o lib/Object/CMakeFiles/LLVMObject.dir/WindowsResource.cpp.o lib/Object/CMakeFiles/LLVMObject.dir/XCOFFObjectFile.cpp.o && : [10/2733] /Users/buildslave/jenkins/workspace/lldb-cmake/host-compiler/bin/clang++ -DHAVE_RPC_XDR_H=0 -D_DEBUG -D__STDC_CONSTANT_MACROS -D__STDC_FORMAT_MACROS -D__STDC_LIMIT_MACROS -Iprojects/compiler-rt/lib/sanitizer_common -I/Users/buildslave/jenkins/workspace/lldb-cmake/llvm-project/compiler-rt/lib/sanitizer_common -Iinclude -I/Users/buildslave/jenkins/workspace/lldb-cmake/llvm-project/llvm/include -I/Users/buildslave/jenkins/workspace/lldb-cmake/llvm-project/compiler-rt/lib/sanitizer_common/.. -Wdocumentation -fPIC -fvisibility-inlines-hidden -Werror=date-time -Werror=unguarded-availability-new -fmodules -fmodules-cache-path=/Users/buildslave/jenkins/workspace/lldb-cmake/lldb-build/module.cache -fcxx-modules -Xclang -fmodules-local-submodule-visibility -Wall -Wextra -Wno-unused-parameter -Wwrite-strings -Wcast-qual -Wmissing-field-initializers -pedantic -Wno-long-long -Wimplicit-fallthrough -Wcovered-switch-default -Wno-noexcept-type -Wnon-virtual-dtor -Wdelete-non-virtual-dtor -Wsuggest-override -Wstring-conversion -fdiagnostics-color -Wall -std=c++14 -Wno-unused-parameter -O3 -arch x86_64 -arch x86_64h -isysroot /Applications/Xcode.app/Contents/Developer/Platforms/MacOSX.platform/Developer/SDKs/MacOSX10.15.sdk -stdlib=libc++ -mmacosx-version-min=10.10 -isysroot /Applications/Xcode.app/Contents/Developer/Platforms/MacOSX.platform/Developer/SDKs/MacOSX10.15.sdk -fPIC -fno-builtin -fno-exceptions -funwind-tables -fno-stack-protector -fno-sanitize=safe-stack -fvisibility=hidden -fno-lto -O3 -gline-tables-only -fno-modules -Wno-gnu -Wno-variadic-macros -Wno-c99-extensions -Wno-non-virtual-dtor -fno-rtti -Wframe-larger-than=570 -Wglobal-constructors -DSANITIZER_SUPPORTS_WEAK_HOOKS=0 -UNDEBUG -std=c++14 -MD -MT projects/compiler-rt/lib/sanitizer_common/CMakeFiles/RTSanitizerCommonNoHooks.osx.dir/sanitizer_platform_limits_posix.cpp.o -MF projects/compiler-rt/lib/sanitizer_common/CMakeFiles/RTSanitizerCommonNoHooks.osx.dir/sanitizer_platform_limits_posix.cpp.o.d -o projects/compiler-rt/lib/sanitizer_common/CMakeFiles/RTSanitizerCommonNoHooks.osx.dir/sanitizer_platform_limits_posix.cpp.o -c /Users/buildslave/jenkins/workspace/lldb-cmake/llvm-project/compiler-rt/lib/sanitizer_common/sanitizer_platform_limits_posix.cpp clang-12: warning: argument unused during compilation: '-fmodules-cache-path=/Users/buildslave/jenkins/workspace/lldb-cmake/lldb-build/module.cache' [-Wunused-command-line-argument] clang-12: warning: argument unused during compilation: '-fcxx-modules' [-Wunused-command-line-argument] [11/2733] /Users/buildslave/jenkins/workspace/lldb-cmake/host-compiler/bin/clang++ -DHAVE_RPC_XDR_H=0 -D_DEBUG -D__STDC_CONSTANT_MACROS -D__STDC_FORMAT_MACROS -D__STDC_LIMIT_MACROS -Iprojects/compiler-rt/lib/sanitizer_common -I/Users/buildslave/jenkins/workspace/lldb-cmake/llvm-project/compiler-rt/lib/sanitizer_common -Iinclude -I/Users/buildslave/jenkins/workspace/lldb-cmake/llvm-project/llvm/include -I/Users/buildslave/jenkins/workspace/lldb-cmake/llvm-project/compiler-rt/lib/sanitizer_common/.. -Wdocumentation -fPIC -fvisibility-inlines-hidden -Werror=date-time -Werror=unguarded-availability-new -fmodules -fmodules-cache-path=/Users/buildslave/jenkins/workspace/lldb-cmake/lldb-build/module.cache -fcxx-modules -Xclang -fmodules-local-submodule-visibility -Wall -Wextra -Wno-unused-parameter -Wwrite-strings -Wcast-qual -Wmissing-field-initializers -pedantic -Wno-long-long -Wimplicit-fallthrough -Wcovered-switch-default -Wno-noexcept-type -Wnon-virtual-dtor -Wdelete-non-virtual-dtor -Wsuggest-override -Wstring-conversion -fdiagnostics-color -Wall -std=c++14 -Wno-unused-parameter -O3 -arch armv7 -arch armv7s -arch arm64 -arch armv7k -isysroot /Applications/Xcode.app/Contents/Developer/Platforms/MacOSX.platform/Developer/SDKs/MacOSX10.15.sdk -stdlib=libc++ -miphoneos-version-min=9.0 -isysroot /Applications/Xcode.app/Contents/Developer/Platforms/iPhoneOS.platform/Developer/SDKs/iPhoneOS13.5.sdk -fPIC -fno-builtin -fno-exceptions -funwind-tables -fno-stack-protector -fno-sanitize=safe-stack -fvisibility=hidden -fno-lto -O3 -gline-tables-only -fno-modules -Wno-gnu -Wno-variadic-macros -Wno-c99-extensions -Wno-non-virtual-dtor -fno-rtti -Wframe-larger-than=570 -Wglobal-constructors -DSANITIZER_SUPPORTS_WEAK_HOOKS=0 -UNDEBUG -std=c++14 -MD -MT projects/compiler-rt/lib/sanitizer_common/CMakeFiles/RTSanitizerCommonSymbolizerNoHooks.ios.dir/sanitizer_symbolizer_posix_libcdep.cpp.o -MF projects/compiler-rt/lib/sanitizer_common/CMakeFiles/RTSanitizerCommonSymbolizerNoHooks.ios.dir/sanitizer_symbolizer_posix_libcdep.cpp.o.d -o projects/compiler-rt/lib/sanitizer_common/CMakeFiles/RTSanitizerCommonSymbolizerNoHooks.ios.dir/sanitizer_symbolizer_posix_libcdep.cpp.o -c /Users/buildslave/jenkins/workspace/lldb-cmake/llvm-project/compiler-rt/lib/sanitizer_common/sanitizer_symbolizer_posix_libcdep.cpp clang-12: warning: argument unused during compilation: '-fmodules-cache-path=/Users/buildslave/jenkins/workspace/lldb-cmake/lldb-build/module.cache' [-Wunused-command-line-argument] clang-12: warning: argument unused during compilation: '-fcxx-modules' [-Wunused-command-line-argument] [12/2733] /Users/buildslave/jenkins/workspace/lldb-cmake/host-compiler/bin/clang++ -DHAVE_RPC_XDR_H=0 -D_DEBUG -D__STDC_CONSTANT_MACROS -D__STDC_FORMAT_MACROS -D__STDC_LIMIT_MACROS -Iprojects/compiler-rt/lib/sanitizer_common -I/Users/buildslave/jenkins/workspace/lldb-cmake/llvm-project/compiler-rt/lib/sanitizer_common -Iinclude -I/Users/buildslave/jenkins/workspace/lldb-cmake/llvm-project/llvm/include -I/Users/buildslave/jenkins/workspace/lldb-cmake/llvm-project/compiler-rt/lib/sanitizer_common/.. -Wdocumentation -fPIC -fvisibility-inlines-hidden -Werror=date-time -Werror=unguarded-availability-new -fmodules -fmodules-cache-path=/Users/buildslave/jenkins/workspace/lldb-cmake/lldb-build/module.cache -fcxx-modules -Xclang -fmodules-local-submodule-visibility -Wall -Wextra -Wno-unused-parameter -Wwrite-strings -Wcast-qual -Wmissing-field-initializers -pedantic -Wno-long-long -Wimplicit-fallthrough -Wcovered-switch-default -Wno-noexcept-type -Wnon-virtual-dtor -Wdelete-non-virtual-dtor -Wsuggest-override -Wstring-conversion -fdiagnostics-color -Wall -std=c++14 -Wno-unused-parameter -O3 -arch armv7 -arch armv7s -arch arm64 -arch armv7k -isysroot /Applications/Xcode.app/Contents/Developer/Platforms/MacOSX.platform/Developer/SDKs/MacOSX10.15.sdk -stdlib=libc++ -miphoneos-version-min=9.0 -isysroot /Applications/Xcode.app/Contents/Developer/Platforms/iPhoneOS.platform/Developer/SDKs/iPhoneOS13.5.sdk -fPIC -fno-builtin -fno-exceptions -funwind-tables -fno-stack-protector -fno-sanitize=safe-stack -fvisibility=hidden -fno-lto -O3 -gline-tables-only -fno-modules -Wno-gnu -Wno-variadic-macros -Wno-c99-extensions -Wno-non-virtual-dtor -fno-rtti -Wframe-larger-than=570 -Wglobal-constructors -DSANITIZER_SUPPORTS_WEAK_HOOKS=0 -UNDEBUG -std=c++14 -MD -MT projects/compiler-rt/lib/sanitizer_common/CMakeFiles/RTSanitizerCommonSymbolizerNoHooks.ios.dir/sanitizer_symbolizer_mac.cpp.o -MF projects/compiler-rt/lib/sanitizer_common/CMakeFiles/RTSanitizerCommonSymbolizerNoHooks.ios.dir/sanitizer_symbolizer_mac.cpp.o.d -o projects/compiler-rt/lib/sanitizer_common/CMakeFiles/RTSanitizerCommonSymbolizerNoHooks.ios.dir/sanitizer_symbolizer_mac.cpp.o -c /Users/buildslave/jenkins/workspace/lldb-cmake/llvm-project/compiler-rt/lib/sanitizer_common/sanitizer_symbolizer_mac.cpp clang-12: warning: argument unused during compilation: '-fmodules-cache-path=/Users/buildslave/jenkins/workspace/lldb-cmake/lldb-build/module.cache' [-Wunused-command-line-argument] clang-12: warning: argument unused during compilation: '-fcxx-modules' [-Wunused-command-line-argument] [13/2733] /Users/buildslave/jenkins/workspace/lldb-cmake/host-compiler/bin/clang++ -DHAVE_RPC_XDR_H=0 -D_DEBUG -D__STDC_CONSTANT_MACROS -D__STDC_FORMAT_MACROS -D__STDC_LIMIT_MACROS -Iprojects/compiler-rt/lib/sanitizer_common -I/Users/buildslave/jenkins/workspace/lldb-cmake/llvm-project/compiler-rt/lib/sanitizer_common -Iinclude -I/Users/buildslave/jenkins/workspace/lldb-cmake/llvm-project/llvm/include -I/Users/buildslave/jenkins/workspace/lldb-cmake/llvm-project/compiler-rt/lib/sanitizer_common/.. -Wdocumentation -fPIC -fvisibility-inlines-hidden -Werror=date-time -Werror=unguarded-availability-new -fmodules -fmodules-cache-path=/Users/buildslave/jenkins/workspace/lldb-cmake/lldb-build/module.cache -fcxx-modules -Xclang -fmodules-local-submodule-visibility -Wall -Wextra -Wno-unused-parameter -Wwrite-strings -Wcast-qual -Wmissing-field-initializers -pedantic -Wno-long-long -Wimplicit-fallthrough -Wcovered-switch-default -Wno-noexcept-type -Wnon-virtual-dtor -Wdelete-non-virtual-dtor -Wsuggest-override -Wstring-conversion -fdiagnostics-color -Wall -std=c++14 -Wno-unused-parameter -O3 -arch x86_64 -arch x86_64h -isysroot /Applications/Xcode.app/Contents/Developer/Platforms/MacOSX.platform/Developer/SDKs/MacOSX10.15.sdk -stdlib=libc++ -mmacosx-version-min=10.10 -isysroot /Applications/Xcode.app/Contents/Developer/Platforms/MacOSX.platform/Developer/SDKs/MacOSX10.15.sdk -fPIC -fno-builtin -fno-exceptions -funwind-tables -fno-stack-protector -fno-sanitize=safe-stack -fvisibility=hidden -fno-lto -O3 -gline-tables-only -fno-modules -Wno-gnu -Wno-variadic-macros -Wno-c99-extensions -Wno-non-virtual-dtor -fno-rtti -Wframe-larger-than=570 -Wglobal-constructors -DSANITIZER_SUPPORTS_WEAK_HOOKS=0 -UNDEBUG -std=c++14 -MD -MT projects/compiler-rt/lib/sanitizer_common/CMakeFiles/RTSanitizerCommonNoHooks.osx.dir/sanitizer_mac.cpp.o -MF projects/compiler-rt/lib/sanitizer_common/CMakeFiles/RTSanitizerCommonNoHooks.osx.dir/sanitizer_mac.cpp.o.d -o projects/compiler-rt/lib/sanitizer_common/CMakeFiles/RTSanitizerCommonNoHooks.osx.dir/sanitizer_mac.cpp.o -c /Users/buildslave/jenkins/workspace/lldb-cmake/llvm-project/compiler-rt/lib/sanitizer_common/sanitizer_mac.cpp clang-12: warning: argument unused during compilation: '-fmodules-cache-path=/Users/buildslave/jenkins/workspace/lldb-cmake/lldb-build/module.cache' [-Wunused-command-line-argument] clang-12: warning: argument unused during compilation: '-fcxx-modules' [-Wunused-command-line-argument] ninja: build stopped: subcommand failed. Command failed: Command '['/usr/local/bin/ninja', '-v']' returned non-zero exit status 1 Command: ['/usr/local/bin/ninja', '-v'] [Pipeline] } [Pipeline] // timeout [Pipeline] } [Pipeline] // stage [Pipeline] stage [Pipeline] { (Test) Stage "Test" skipped due to earlier failure(s) [Pipeline] } [Pipeline] // stage [Pipeline] stage [Pipeline] { (Declarative: Post Actions) [Pipeline] scanForIssues [Clang (LLVM based)] Sleeping for 5 seconds due to JENKINS-32191... [Clang (LLVM based)] Parsing console log (workspace: '/Users/buildslave/jenkins/workspace/lldb-cmake') [Clang (LLVM based)] Successfully parsed console log [Clang (LLVM based)] -> found 1 issue (skipped 0 duplicates) [Clang (LLVM based)] Post processing issues on 'green-dragon-10' with source code encoding 'UTF-8' [Clang (LLVM based)] Creating SCM blamer to obtain author and commit information for affected files [Clang (LLVM based)] Creating SCM miner to obtain statistics for affected repository files [Clang (LLVM based)] Resolving file names for all issues in source directory '/Users/buildslave/jenkins/workspace/lldb-cmake' [Clang (LLVM based)] -> resolved paths in source directory (1 found, 0 not found) [Clang (LLVM based)] Resolving module names from module definitions (build.xml, pom.xml, or Manifest.mf files) [Clang (LLVM based)] -> resolved module names for 1 issues [Clang (LLVM based)] Resolving package names (or namespaces) by parsing the affected files [Clang (LLVM based)] -> resolved package names of 1 affected files [Clang (LLVM based)] No filter has been set, publishing all 1 issues [Clang (LLVM based)] Creating fingerprints for all affected code blocks to track issues over different builds [Clang (LLVM based)] -> created fingerprints for 1 issues (skipped 0 issues) [Clang (LLVM based)] Copying affected files to Jenkins' build folder '/Users/Shared/Jenkins/Home/jobs/lldb-cmake/builds/24034/files-with-issues' [Clang (LLVM based)] -> 1 copied, 0 not in workspace, 0 not-found, 0 with I/O error [Pipeline] junit Recording test results Test reports were found but none of them are new. Did leafNodes run? For example, /Users/buildslave/jenkins/workspace/lldb-cmake/test/results.xml is 47 sec old

Hide Details

Error when executing always post condition: Also: hudson.remoting.Channel$CallSiteStackTrace: Remote call to green-dragon-10 at hudson.remoting.Channel.attachCallSiteStackTrace(Channel.java:1788) at hudson.remoting.UserRequest$ExceptionResponse.retrieve(UserRequest.java:356) at hudson.remoting.Channel.call(Channel.java:998) at hudson.FilePath.act(FilePath.java:1069) at hudson.FilePath.act(FilePath.java:1058) at hudson.tasks.junit.JUnitParser.parseResult(JUnitParser.java:114) at hudson.tasks.junit.JUnitResultArchiver.parse(JUnitResultArchiver.java:137) at hudson.tasks.junit.JUnitResultArchiver.parseAndAttach(JUnitResultArchiver.java:167) at hudson.tasks.junit.pipeline.JUnitResultsStepExecution.run(JUnitResultsStepExecution.java:52) at hudson.tasks.junit.pipeline.JUnitResultsStepExecution.run(JUnitResultsStepExecution.java:25) at org.jenkinsci.plugins.workflow.steps.SynchronousNonBlockingStepExecution.lambda$start$0(SynchronousNonBlockingStepExecution.java:47) at java.util.concurrent.Executors$RunnableAdapter.call(Executors.java:511) at java.util.concurrent.FutureTask.run(FutureTask.java:266) at java.util.concurrent.ThreadPoolExecutor.runWorker(ThreadPoolExecutor.java:1149) at java.util.concurrent.ThreadPoolExecutor$Worker.run(ThreadPoolExecutor.java:624) at java.lang.Thread.run(Thread.java:748) hudson.AbortException: Test reports were found but none of them are new. Did leafNodes run? For example, /Users/buildslave/jenkins/workspace/lldb-cmake/test/results.xml is 47 sec old

Hide Details

at hudson.tasks.junit.TestResult.parse(TestResult.java:222) at hudson.tasks.junit.TestResult.parse(TestResult.java:178) at hudson.tasks.junit.TestResult.<init>(TestResult.java:143) at hudson.tasks.junit.JUnitParser$ParseResultCallable.invoke(JUnitParser.java:146) at hudson.tasks.junit.JUnitParser$ParseResultCallable.invoke(JUnitParser.java:118) at hudson.FilePath$FileCallableWrapper.call(FilePath.java:3073) at hudson.remoting.UserRequest.perform(UserRequest.java:211) at hudson.remoting.UserRequest.perform(UserRequest.java:54) at hudson.remoting.Request$2.run(Request.java:369) at hudson.remoting.InterceptingExecutorService$1.call(InterceptingExecutorService.java:72) at java.util.concurrent.FutureTask.run(Unknown Source) at java.util.concurrent.ThreadPoolExecutor.runWorker(Unknown Source) at java.util.concurrent.ThreadPoolExecutor$Worker.run(Unknown Source) at java.lang.Thread.run(Unknown Source)

Hide Details

[Pipeline] emailext Warning: sam.parker@arm.com is not a recognized user, but sending mail anyway Warning: kerry.mclaughlin@arm.com is not a recognized user, but sending mail anyway Warning: David.Chisnall@microsoft.com is not a recognized user, but sending mail anyway Warning: ntv@google.com is not a recognized user, but sending mail anyway Warning: llvm-dev@redking.me.uk is not a recognized user, but sending mail anyway Warning: sam.parker@arm.com is not a recognized user, but sending mail anyway Warning: kerry.mclaughlin@arm.com is not a recognized user, but sending mail anyway Warning: David.Chisnall@microsoft.com is not a recognized user, but sending mail anyway Warning: ntv@google.com is not a recognized user, but sending mail anyway Warning: llvm-dev@redking.me.uk is not a recognized user, but sending mail anyway

Hide Details

Begin Pre-Send Script... Sending email to: mschifer@apple.com ldionne@apple.com sam.parker@arm.com kerry.mclaughlin@arm.com David.Chisnall@microsoft.com risemann@apple.com ntv@google.com llvm-dev@redking.me.uk "vsapsai@apple.com" <vsapsai@apple.com> Azhar Mohammed <azhar@apple.com>
[Pipeline] } [Pipeline] // stage [Pipeline] } [Pipeline] // withEnv [Pipeline] } [Pipeline] // node [Pipeline] End of Pipeline ERROR: script returned exit code 1 Finished: FAILURE