FailedConsole Output

Skipping 2,790 KB.. Full Log
-D__STDC_FORMAT_MACROS -D__STDC_LIMIT_MACROS -Ilib/Target/X86 -I/Users/buildslave/jenkins/workspace/lldb-cmake/llvm-project/llvm/lib/Target/X86 -Iinclude -I/Users/buildslave/jenkins/workspace/lldb-cmake/llvm-project/llvm/include -Wdocumentation -fPIC -fvisibility-inlines-hidden -Werror=date-time -Werror=unguarded-availability-new -fmodules -fmodules-cache-path=/Users/buildslave/jenkins/workspace/lldb-cmake/lldb-build/module.cache -fcxx-modules -Xclang -fmodules-local-submodule-visibility -Wall -Wextra -Wno-unused-parameter -Wwrite-strings -Wcast-qual -Wmissing-field-initializers -pedantic -Wno-long-long -Wimplicit-fallthrough -Wcovered-switch-default -Wno-noexcept-type -Wnon-virtual-dtor -Wdelete-non-virtual-dtor -Wsuggest-override -Wstring-conversion -fdiagnostics-color -O3  -isysroot /Applications/Xcode.app/Contents/Developer/Platforms/MacOSX.platform/Developer/SDKs/MacOSX10.15.sdk    -fno-exceptions -fno-rtti -UNDEBUG -std=c++14 -MD -MT lib/Target/X86/CMakeFiles/LLVMX86CodeGen.dir/X86RegisterBankInfo.cpp.o -MF lib/Target/X86/CMakeFiles/LLVMX86CodeGen.dir/X86RegisterBankInfo.cpp.o.d -o lib/Target/X86/CMakeFiles/LLVMX86CodeGen.dir/X86RegisterBankInfo.cpp.o -c /Users/buildslave/jenkins/workspace/lldb-cmake/llvm-project/llvm/lib/Target/X86/X86RegisterBankInfo.cpp
[2111/4868] /Users/buildslave/jenkins/workspace/lldb-cmake/host-compiler/bin/clang++  -DGTEST_HAS_RTTI=0 -D_DEBUG -D__STDC_CONSTANT_MACROS -D__STDC_FORMAT_MACROS -D__STDC_LIMIT_MACROS -Ilib/Target/X86 -I/Users/buildslave/jenkins/workspace/lldb-cmake/llvm-project/llvm/lib/Target/X86 -Iinclude -I/Users/buildslave/jenkins/workspace/lldb-cmake/llvm-project/llvm/include -Wdocumentation -fPIC -fvisibility-inlines-hidden -Werror=date-time -Werror=unguarded-availability-new -fmodules -fmodules-cache-path=/Users/buildslave/jenkins/workspace/lldb-cmake/lldb-build/module.cache -fcxx-modules -Xclang -fmodules-local-submodule-visibility -Wall -Wextra -Wno-unused-parameter -Wwrite-strings -Wcast-qual -Wmissing-field-initializers -pedantic -Wno-long-long -Wimplicit-fallthrough -Wcovered-switch-default -Wno-noexcept-type -Wnon-virtual-dtor -Wdelete-non-virtual-dtor -Wsuggest-override -Wstring-conversion -fdiagnostics-color -O3  -isysroot /Applications/Xcode.app/Contents/Developer/Platforms/MacOSX.platform/Developer/SDKs/MacOSX10.15.sdk    -fno-exceptions -fno-rtti -UNDEBUG -std=c++14 -MD -MT lib/Target/X86/CMakeFiles/LLVMX86CodeGen.dir/X86MCInstLower.cpp.o -MF lib/Target/X86/CMakeFiles/LLVMX86CodeGen.dir/X86MCInstLower.cpp.o.d -o lib/Target/X86/CMakeFiles/LLVMX86CodeGen.dir/X86MCInstLower.cpp.o -c /Users/buildslave/jenkins/workspace/lldb-cmake/llvm-project/llvm/lib/Target/X86/X86MCInstLower.cpp
[2112/4868] /Users/buildslave/jenkins/workspace/lldb-cmake/host-compiler/bin/clang++  -DGTEST_HAS_RTTI=0 -D_DEBUG -D__STDC_CONSTANT_MACROS -D__STDC_FORMAT_MACROS -D__STDC_LIMIT_MACROS -Ilib/Target/X86 -I/Users/buildslave/jenkins/workspace/lldb-cmake/llvm-project/llvm/lib/Target/X86 -Iinclude -I/Users/buildslave/jenkins/workspace/lldb-cmake/llvm-project/llvm/include -Wdocumentation -fPIC -fvisibility-inlines-hidden -Werror=date-time -Werror=unguarded-availability-new -fmodules -fmodules-cache-path=/Users/buildslave/jenkins/workspace/lldb-cmake/lldb-build/module.cache -fcxx-modules -Xclang -fmodules-local-submodule-visibility -Wall -Wextra -Wno-unused-parameter -Wwrite-strings -Wcast-qual -Wmissing-field-initializers -pedantic -Wno-long-long -Wimplicit-fallthrough -Wcovered-switch-default -Wno-noexcept-type -Wnon-virtual-dtor -Wdelete-non-virtual-dtor -Wsuggest-override -Wstring-conversion -fdiagnostics-color -O3  -isysroot /Applications/Xcode.app/Contents/Developer/Platforms/MacOSX.platform/Developer/SDKs/MacOSX10.15.sdk    -fno-exceptions -fno-rtti -UNDEBUG -std=c++14 -MD -MT lib/Target/X86/CMakeFiles/LLVMX86CodeGen.dir/X86ShuffleDecodeConstantPool.cpp.o -MF lib/Target/X86/CMakeFiles/LLVMX86CodeGen.dir/X86ShuffleDecodeConstantPool.cpp.o.d -o lib/Target/X86/CMakeFiles/LLVMX86CodeGen.dir/X86ShuffleDecodeConstantPool.cpp.o -c /Users/buildslave/jenkins/workspace/lldb-cmake/llvm-project/llvm/lib/Target/X86/X86ShuffleDecodeConstantPool.cpp
[2113/4868] /Users/buildslave/jenkins/workspace/lldb-cmake/host-compiler/bin/clang++  -DGTEST_HAS_RTTI=0 -D_DEBUG -D__STDC_CONSTANT_MACROS -D__STDC_FORMAT_MACROS -D__STDC_LIMIT_MACROS -Ilib/Target/X86 -I/Users/buildslave/jenkins/workspace/lldb-cmake/llvm-project/llvm/lib/Target/X86 -Iinclude -I/Users/buildslave/jenkins/workspace/lldb-cmake/llvm-project/llvm/include -Wdocumentation -fPIC -fvisibility-inlines-hidden -Werror=date-time -Werror=unguarded-availability-new -fmodules -fmodules-cache-path=/Users/buildslave/jenkins/workspace/lldb-cmake/lldb-build/module.cache -fcxx-modules -Xclang -fmodules-local-submodule-visibility -Wall -Wextra -Wno-unused-parameter -Wwrite-strings -Wcast-qual -Wmissing-field-initializers -pedantic -Wno-long-long -Wimplicit-fallthrough -Wcovered-switch-default -Wno-noexcept-type -Wnon-virtual-dtor -Wdelete-non-virtual-dtor -Wsuggest-override -Wstring-conversion -fdiagnostics-color -O3  -isysroot /Applications/Xcode.app/Contents/Developer/Platforms/MacOSX.platform/Developer/SDKs/MacOSX10.15.sdk    -fno-exceptions -fno-rtti -UNDEBUG -std=c++14 -MD -MT lib/Target/X86/CMakeFiles/LLVMX86CodeGen.dir/X86PadShortFunction.cpp.o -MF lib/Target/X86/CMakeFiles/LLVMX86CodeGen.dir/X86PadShortFunction.cpp.o.d -o lib/Target/X86/CMakeFiles/LLVMX86CodeGen.dir/X86PadShortFunction.cpp.o -c /Users/buildslave/jenkins/workspace/lldb-cmake/llvm-project/llvm/lib/Target/X86/X86PadShortFunction.cpp
[2114/4868] /Users/buildslave/jenkins/workspace/lldb-cmake/host-compiler/bin/clang++  -DGTEST_HAS_RTTI=0 -D_DEBUG -D__STDC_CONSTANT_MACROS -D__STDC_FORMAT_MACROS -D__STDC_LIMIT_MACROS -Ilib/Target/X86 -I/Users/buildslave/jenkins/workspace/lldb-cmake/llvm-project/llvm/lib/Target/X86 -Iinclude -I/Users/buildslave/jenkins/workspace/lldb-cmake/llvm-project/llvm/include -Wdocumentation -fPIC -fvisibility-inlines-hidden -Werror=date-time -Werror=unguarded-availability-new -fmodules -fmodules-cache-path=/Users/buildslave/jenkins/workspace/lldb-cmake/lldb-build/module.cache -fcxx-modules -Xclang -fmodules-local-submodule-visibility -Wall -Wextra -Wno-unused-parameter -Wwrite-strings -Wcast-qual -Wmissing-field-initializers -pedantic -Wno-long-long -Wimplicit-fallthrough -Wcovered-switch-default -Wno-noexcept-type -Wnon-virtual-dtor -Wdelete-non-virtual-dtor -Wsuggest-override -Wstring-conversion -fdiagnostics-color -O3  -isysroot /Applications/Xcode.app/Contents/Developer/Platforms/MacOSX.platform/Developer/SDKs/MacOSX10.15.sdk    -fno-exceptions -fno-rtti -UNDEBUG -std=c++14 -MD -MT lib/Target/X86/CMakeFiles/LLVMX86CodeGen.dir/X86OptimizeLEAs.cpp.o -MF lib/Target/X86/CMakeFiles/LLVMX86CodeGen.dir/X86OptimizeLEAs.cpp.o.d -o lib/Target/X86/CMakeFiles/LLVMX86CodeGen.dir/X86OptimizeLEAs.cpp.o -c /Users/buildslave/jenkins/workspace/lldb-cmake/llvm-project/llvm/lib/Target/X86/X86OptimizeLEAs.cpp
[2115/4868] /Users/buildslave/jenkins/workspace/lldb-cmake/host-compiler/bin/clang++  -DGTEST_HAS_RTTI=0 -D_DEBUG -D__STDC_CONSTANT_MACROS -D__STDC_FORMAT_MACROS -D__STDC_LIMIT_MACROS -Ilib/Target/X86 -I/Users/buildslave/jenkins/workspace/lldb-cmake/llvm-project/llvm/lib/Target/X86 -Iinclude -I/Users/buildslave/jenkins/workspace/lldb-cmake/llvm-project/llvm/include -Wdocumentation -fPIC -fvisibility-inlines-hidden -Werror=date-time -Werror=unguarded-availability-new -fmodules -fmodules-cache-path=/Users/buildslave/jenkins/workspace/lldb-cmake/lldb-build/module.cache -fcxx-modules -Xclang -fmodules-local-submodule-visibility -Wall -Wextra -Wno-unused-parameter -Wwrite-strings -Wcast-qual -Wmissing-field-initializers -pedantic -Wno-long-long -Wimplicit-fallthrough -Wcovered-switch-default -Wno-noexcept-type -Wnon-virtual-dtor -Wdelete-non-virtual-dtor -Wsuggest-override -Wstring-conversion -fdiagnostics-color -O3  -isysroot /Applications/Xcode.app/Contents/Developer/Platforms/MacOSX.platform/Developer/SDKs/MacOSX10.15.sdk    -fno-exceptions -fno-rtti -UNDEBUG -std=c++14 -MD -MT lib/Target/X86/CMakeFiles/LLVMX86CodeGen.dir/X86PartialReduction.cpp.o -MF lib/Target/X86/CMakeFiles/LLVMX86CodeGen.dir/X86PartialReduction.cpp.o.d -o lib/Target/X86/CMakeFiles/LLVMX86CodeGen.dir/X86PartialReduction.cpp.o -c /Users/buildslave/jenkins/workspace/lldb-cmake/llvm-project/llvm/lib/Target/X86/X86PartialReduction.cpp
[2116/4868] /Users/buildslave/jenkins/workspace/lldb-cmake/host-compiler/bin/clang++  -DGTEST_HAS_RTTI=0 -D_DEBUG -D__STDC_CONSTANT_MACROS -D__STDC_FORMAT_MACROS -D__STDC_LIMIT_MACROS -Ilib/Target/X86 -I/Users/buildslave/jenkins/workspace/lldb-cmake/llvm-project/llvm/lib/Target/X86 -Iinclude -I/Users/buildslave/jenkins/workspace/lldb-cmake/llvm-project/llvm/include -Wdocumentation -fPIC -fvisibility-inlines-hidden -Werror=date-time -Werror=unguarded-availability-new -fmodules -fmodules-cache-path=/Users/buildslave/jenkins/workspace/lldb-cmake/lldb-build/module.cache -fcxx-modules -Xclang -fmodules-local-submodule-visibility -Wall -Wextra -Wno-unused-parameter -Wwrite-strings -Wcast-qual -Wmissing-field-initializers -pedantic -Wno-long-long -Wimplicit-fallthrough -Wcovered-switch-default -Wno-noexcept-type -Wnon-virtual-dtor -Wdelete-non-virtual-dtor -Wsuggest-override -Wstring-conversion -fdiagnostics-color -O3  -isysroot /Applications/Xcode.app/Contents/Developer/Platforms/MacOSX.platform/Developer/SDKs/MacOSX10.15.sdk    -fno-exceptions -fno-rtti -UNDEBUG -std=c++14 -MD -MT lib/Target/X86/CMakeFiles/LLVMX86CodeGen.dir/X86LoadValueInjectionLoadHardening.cpp.o -MF lib/Target/X86/CMakeFiles/LLVMX86CodeGen.dir/X86LoadValueInjectionLoadHardening.cpp.o.d -o lib/Target/X86/CMakeFiles/LLVMX86CodeGen.dir/X86LoadValueInjectionLoadHardening.cpp.o -c /Users/buildslave/jenkins/workspace/lldb-cmake/llvm-project/llvm/lib/Target/X86/X86LoadValueInjectionLoadHardening.cpp
[2117/4868] /Users/buildslave/jenkins/workspace/lldb-cmake/host-compiler/bin/clang++  -DGTEST_HAS_RTTI=0 -D_DEBUG -D__STDC_CONSTANT_MACROS -D__STDC_FORMAT_MACROS -D__STDC_LIMIT_MACROS -Ilib/Target/X86 -I/Users/buildslave/jenkins/workspace/lldb-cmake/llvm-project/llvm/lib/Target/X86 -Iinclude -I/Users/buildslave/jenkins/workspace/lldb-cmake/llvm-project/llvm/include -Wdocumentation -fPIC -fvisibility-inlines-hidden -Werror=date-time -Werror=unguarded-availability-new -fmodules -fmodules-cache-path=/Users/buildslave/jenkins/workspace/lldb-cmake/lldb-build/module.cache -fcxx-modules -Xclang -fmodules-local-submodule-visibility -Wall -Wextra -Wno-unused-parameter -Wwrite-strings -Wcast-qual -Wmissing-field-initializers -pedantic -Wno-long-long -Wimplicit-fallthrough -Wcovered-switch-default -Wno-noexcept-type -Wnon-virtual-dtor -Wdelete-non-virtual-dtor -Wsuggest-override -Wstring-conversion -fdiagnostics-color -O3  -isysroot /Applications/Xcode.app/Contents/Developer/Platforms/MacOSX.platform/Developer/SDKs/MacOSX10.15.sdk    -fno-exceptions -fno-rtti -UNDEBUG -std=c++14 -MD -MT lib/Target/X86/CMakeFiles/LLVMX86CodeGen.dir/X86RegisterInfo.cpp.o -MF lib/Target/X86/CMakeFiles/LLVMX86CodeGen.dir/X86RegisterInfo.cpp.o.d -o lib/Target/X86/CMakeFiles/LLVMX86CodeGen.dir/X86RegisterInfo.cpp.o -c /Users/buildslave/jenkins/workspace/lldb-cmake/llvm-project/llvm/lib/Target/X86/X86RegisterInfo.cpp
[2118/4868] /Users/buildslave/jenkins/workspace/lldb-cmake/host-compiler/bin/clang++  -DGTEST_HAS_RTTI=0 -D_DEBUG -D__STDC_CONSTANT_MACROS -D__STDC_FORMAT_MACROS -D__STDC_LIMIT_MACROS -Ilib/Target/X86 -I/Users/buildslave/jenkins/workspace/lldb-cmake/llvm-project/llvm/lib/Target/X86 -Iinclude -I/Users/buildslave/jenkins/workspace/lldb-cmake/llvm-project/llvm/include -Wdocumentation -fPIC -fvisibility-inlines-hidden -Werror=date-time -Werror=unguarded-availability-new -fmodules -fmodules-cache-path=/Users/buildslave/jenkins/workspace/lldb-cmake/lldb-build/module.cache -fcxx-modules -Xclang -fmodules-local-submodule-visibility -Wall -Wextra -Wno-unused-parameter -Wwrite-strings -Wcast-qual -Wmissing-field-initializers -pedantic -Wno-long-long -Wimplicit-fallthrough -Wcovered-switch-default -Wno-noexcept-type -Wnon-virtual-dtor -Wdelete-non-virtual-dtor -Wsuggest-override -Wstring-conversion -fdiagnostics-color -O3  -isysroot /Applications/Xcode.app/Contents/Developer/Platforms/MacOSX.platform/Developer/SDKs/MacOSX10.15.sdk    -fno-exceptions -fno-rtti -UNDEBUG -std=c++14 -MD -MT lib/Target/X86/CMakeFiles/LLVMX86CodeGen.dir/X86TargetObjectFile.cpp.o -MF lib/Target/X86/CMakeFiles/LLVMX86CodeGen.dir/X86TargetObjectFile.cpp.o.d -o lib/Target/X86/CMakeFiles/LLVMX86CodeGen.dir/X86TargetObjectFile.cpp.o -c /Users/buildslave/jenkins/workspace/lldb-cmake/llvm-project/llvm/lib/Target/X86/X86TargetObjectFile.cpp
[2119/4868] /Users/buildslave/jenkins/workspace/lldb-cmake/host-compiler/bin/clang++  -DGTEST_HAS_RTTI=0 -D_DEBUG -D__STDC_CONSTANT_MACROS -D__STDC_FORMAT_MACROS -D__STDC_LIMIT_MACROS -Ilib/Target/X86 -I/Users/buildslave/jenkins/workspace/lldb-cmake/llvm-project/llvm/lib/Target/X86 -Iinclude -I/Users/buildslave/jenkins/workspace/lldb-cmake/llvm-project/llvm/include -Wdocumentation -fPIC -fvisibility-inlines-hidden -Werror=date-time -Werror=unguarded-availability-new -fmodules -fmodules-cache-path=/Users/buildslave/jenkins/workspace/lldb-cmake/lldb-build/module.cache -fcxx-modules -Xclang -fmodules-local-submodule-visibility -Wall -Wextra -Wno-unused-parameter -Wwrite-strings -Wcast-qual -Wmissing-field-initializers -pedantic -Wno-long-long -Wimplicit-fallthrough -Wcovered-switch-default -Wno-noexcept-type -Wnon-virtual-dtor -Wdelete-non-virtual-dtor -Wsuggest-override -Wstring-conversion -fdiagnostics-color -O3  -isysroot /Applications/Xcode.app/Contents/Developer/Platforms/MacOSX.platform/Developer/SDKs/MacOSX10.15.sdk    -fno-exceptions -fno-rtti -UNDEBUG -std=c++14 -MD -MT lib/Target/X86/CMakeFiles/LLVMX86CodeGen.dir/X86SelectionDAGInfo.cpp.o -MF lib/Target/X86/CMakeFiles/LLVMX86CodeGen.dir/X86SelectionDAGInfo.cpp.o.d -o lib/Target/X86/CMakeFiles/LLVMX86CodeGen.dir/X86SelectionDAGInfo.cpp.o -c /Users/buildslave/jenkins/workspace/lldb-cmake/llvm-project/llvm/lib/Target/X86/X86SelectionDAGInfo.cpp
[2120/4868] /Users/buildslave/jenkins/workspace/lldb-cmake/host-compiler/bin/clang++  -DGTEST_HAS_RTTI=0 -D_DEBUG -D__STDC_CONSTANT_MACROS -D__STDC_FORMAT_MACROS -D__STDC_LIMIT_MACROS -Ilib/Target/X86 -I/Users/buildslave/jenkins/workspace/lldb-cmake/llvm-project/llvm/lib/Target/X86 -Iinclude -I/Users/buildslave/jenkins/workspace/lldb-cmake/llvm-project/llvm/include -Wdocumentation -fPIC -fvisibility-inlines-hidden -Werror=date-time -Werror=unguarded-availability-new -fmodules -fmodules-cache-path=/Users/buildslave/jenkins/workspace/lldb-cmake/lldb-build/module.cache -fcxx-modules -Xclang -fmodules-local-submodule-visibility -Wall -Wextra -Wno-unused-parameter -Wwrite-strings -Wcast-qual -Wmissing-field-initializers -pedantic -Wno-long-long -Wimplicit-fallthrough -Wcovered-switch-default -Wno-noexcept-type -Wnon-virtual-dtor -Wdelete-non-virtual-dtor -Wsuggest-override -Wstring-conversion -fdiagnostics-color -O3  -isysroot /Applications/Xcode.app/Contents/Developer/Platforms/MacOSX.platform/Developer/SDKs/MacOSX10.15.sdk    -fno-exceptions -fno-rtti -UNDEBUG -std=c++14 -MD -MT lib/Target/X86/CMakeFiles/LLVMX86CodeGen.dir/X86InstrInfo.cpp.o -MF lib/Target/X86/CMakeFiles/LLVMX86CodeGen.dir/X86InstrInfo.cpp.o.d -o lib/Target/X86/CMakeFiles/LLVMX86CodeGen.dir/X86InstrInfo.cpp.o -c /Users/buildslave/jenkins/workspace/lldb-cmake/llvm-project/llvm/lib/Target/X86/X86InstrInfo.cpp
[2121/4868] /Users/buildslave/jenkins/workspace/lldb-cmake/host-compiler/bin/clang++  -DGTEST_HAS_RTTI=0 -D_DEBUG -D__STDC_CONSTANT_MACROS -D__STDC_FORMAT_MACROS -D__STDC_LIMIT_MACROS -Ilib/Target/X86 -I/Users/buildslave/jenkins/workspace/lldb-cmake/llvm-project/llvm/lib/Target/X86 -Iinclude -I/Users/buildslave/jenkins/workspace/lldb-cmake/llvm-project/llvm/include -Wdocumentation -fPIC -fvisibility-inlines-hidden -Werror=date-time -Werror=unguarded-availability-new -fmodules -fmodules-cache-path=/Users/buildslave/jenkins/workspace/lldb-cmake/lldb-build/module.cache -fcxx-modules -Xclang -fmodules-local-submodule-visibility -Wall -Wextra -Wno-unused-parameter -Wwrite-strings -Wcast-qual -Wmissing-field-initializers -pedantic -Wno-long-long -Wimplicit-fallthrough -Wcovered-switch-default -Wno-noexcept-type -Wnon-virtual-dtor -Wdelete-non-virtual-dtor -Wsuggest-override -Wstring-conversion -fdiagnostics-color -O3  -isysroot /Applications/Xcode.app/Contents/Developer/Platforms/MacOSX.platform/Developer/SDKs/MacOSX10.15.sdk    -fno-exceptions -fno-rtti -UNDEBUG -std=c++14 -MD -MT lib/Target/X86/CMakeFiles/LLVMX86CodeGen.dir/X86SpeculativeExecutionSideEffectSuppression.cpp.o -MF lib/Target/X86/CMakeFiles/LLVMX86CodeGen.dir/X86SpeculativeExecutionSideEffectSuppression.cpp.o.d -o lib/Target/X86/CMakeFiles/LLVMX86CodeGen.dir/X86SpeculativeExecutionSideEffectSuppression.cpp.o -c /Users/buildslave/jenkins/workspace/lldb-cmake/llvm-project/llvm/lib/Target/X86/X86SpeculativeExecutionSideEffectSuppression.cpp
[2122/4868] /Users/buildslave/jenkins/workspace/lldb-cmake/host-compiler/bin/clang++  -DGTEST_HAS_RTTI=0 -D_DEBUG -D__STDC_CONSTANT_MACROS -D__STDC_FORMAT_MACROS -D__STDC_LIMIT_MACROS -Ilib/Target/X86 -I/Users/buildslave/jenkins/workspace/lldb-cmake/llvm-project/llvm/lib/Target/X86 -Iinclude -I/Users/buildslave/jenkins/workspace/lldb-cmake/llvm-project/llvm/include -Wdocumentation -fPIC -fvisibility-inlines-hidden -Werror=date-time -Werror=unguarded-availability-new -fmodules -fmodules-cache-path=/Users/buildslave/jenkins/workspace/lldb-cmake/lldb-build/module.cache -fcxx-modules -Xclang -fmodules-local-submodule-visibility -Wall -Wextra -Wno-unused-parameter -Wwrite-strings -Wcast-qual -Wmissing-field-initializers -pedantic -Wno-long-long -Wimplicit-fallthrough -Wcovered-switch-default -Wno-noexcept-type -Wnon-virtual-dtor -Wdelete-non-virtual-dtor -Wsuggest-override -Wstring-conversion -fdiagnostics-color -O3  -isysroot /Applications/Xcode.app/Contents/Developer/Platforms/MacOSX.platform/Developer/SDKs/MacOSX10.15.sdk    -fno-exceptions -fno-rtti -UNDEBUG -std=c++14 -MD -MT lib/Target/X86/CMakeFiles/LLVMX86CodeGen.dir/X86Subtarget.cpp.o -MF lib/Target/X86/CMakeFiles/LLVMX86CodeGen.dir/X86Subtarget.cpp.o.d -o lib/Target/X86/CMakeFiles/LLVMX86CodeGen.dir/X86Subtarget.cpp.o -c /Users/buildslave/jenkins/workspace/lldb-cmake/llvm-project/llvm/lib/Target/X86/X86Subtarget.cpp
[2123/4868] : && "/Applications/Xcode.app/Contents/Developer/Toolchains/XcodeDefault.xctoolchain/usr/bin/libtool" -static -no_warning_for_no_symbols -o lib/libLLVMXCoreDisassembler.a  lib/Target/XCore/Disassembler/CMakeFiles/LLVMXCoreDisassembler.dir/XCoreDisassembler.cpp.o && :
[2124/4868] : && "/Applications/Xcode.app/Contents/Developer/Toolchains/XcodeDefault.xctoolchain/usr/bin/libtool" -static -no_warning_for_no_symbols -o lib/libLLVMAsmParser.a  lib/AsmParser/CMakeFiles/LLVMAsmParser.dir/LLLexer.cpp.o lib/AsmParser/CMakeFiles/LLVMAsmParser.dir/LLParser.cpp.o lib/AsmParser/CMakeFiles/LLVMAsmParser.dir/Parser.cpp.o && :
[2125/4868] : && "/Applications/Xcode.app/Contents/Developer/Toolchains/XcodeDefault.xctoolchain/usr/bin/libtool" -static -no_warning_for_no_symbols -o lib/libLLVMIRReader.a  lib/IRReader/CMakeFiles/LLVMIRReader.dir/IRReader.cpp.o && :
[2126/4868] /Users/buildslave/jenkins/workspace/lldb-cmake/host-compiler/bin/clang++  -DGTEST_HAS_RTTI=0 -D_DEBUG -D__STDC_CONSTANT_MACROS -D__STDC_FORMAT_MACROS -D__STDC_LIMIT_MACROS -Ilib/Target/X86 -I/Users/buildslave/jenkins/workspace/lldb-cmake/llvm-project/llvm/lib/Target/X86 -Iinclude -I/Users/buildslave/jenkins/workspace/lldb-cmake/llvm-project/llvm/include -Wdocumentation -fPIC -fvisibility-inlines-hidden -Werror=date-time -Werror=unguarded-availability-new -fmodules -fmodules-cache-path=/Users/buildslave/jenkins/workspace/lldb-cmake/lldb-build/module.cache -fcxx-modules -Xclang -fmodules-local-submodule-visibility -Wall -Wextra -Wno-unused-parameter -Wwrite-strings -Wcast-qual -Wmissing-field-initializers -pedantic -Wno-long-long -Wimplicit-fallthrough -Wcovered-switch-default -Wno-noexcept-type -Wnon-virtual-dtor -Wdelete-non-virtual-dtor -Wsuggest-override -Wstring-conversion -fdiagnostics-color -O3  -isysroot /Applications/Xcode.app/Contents/Developer/Platforms/MacOSX.platform/Developer/SDKs/MacOSX10.15.sdk    -fno-exceptions -fno-rtti -UNDEBUG -std=c++14 -MD -MT lib/Target/X86/CMakeFiles/LLVMX86CodeGen.dir/X86ISelDAGToDAG.cpp.o -MF lib/Target/X86/CMakeFiles/LLVMX86CodeGen.dir/X86ISelDAGToDAG.cpp.o.d -o lib/Target/X86/CMakeFiles/LLVMX86CodeGen.dir/X86ISelDAGToDAG.cpp.o -c /Users/buildslave/jenkins/workspace/lldb-cmake/llvm-project/llvm/lib/Target/X86/X86ISelDAGToDAG.cpp
[2127/4868] /Users/buildslave/jenkins/workspace/lldb-cmake/host-compiler/bin/clang++  -DGTEST_HAS_RTTI=0 -D_DEBUG -D__STDC_CONSTANT_MACROS -D__STDC_FORMAT_MACROS -D__STDC_LIMIT_MACROS -Ilib/Target/X86 -I/Users/buildslave/jenkins/workspace/lldb-cmake/llvm-project/llvm/lib/Target/X86 -Iinclude -I/Users/buildslave/jenkins/workspace/lldb-cmake/llvm-project/llvm/include -Wdocumentation -fPIC -fvisibility-inlines-hidden -Werror=date-time -Werror=unguarded-availability-new -fmodules -fmodules-cache-path=/Users/buildslave/jenkins/workspace/lldb-cmake/lldb-build/module.cache -fcxx-modules -Xclang -fmodules-local-submodule-visibility -Wall -Wextra -Wno-unused-parameter -Wwrite-strings -Wcast-qual -Wmissing-field-initializers -pedantic -Wno-long-long -Wimplicit-fallthrough -Wcovered-switch-default -Wno-noexcept-type -Wnon-virtual-dtor -Wdelete-non-virtual-dtor -Wsuggest-override -Wstring-conversion -fdiagnostics-color -O3  -isysroot /Applications/Xcode.app/Contents/Developer/Platforms/MacOSX.platform/Developer/SDKs/MacOSX10.15.sdk    -fno-exceptions -fno-rtti -UNDEBUG -std=c++14 -MD -MT lib/Target/X86/CMakeFiles/LLVMX86CodeGen.dir/X86VZeroUpper.cpp.o -MF lib/Target/X86/CMakeFiles/LLVMX86CodeGen.dir/X86VZeroUpper.cpp.o.d -o lib/Target/X86/CMakeFiles/LLVMX86CodeGen.dir/X86VZeroUpper.cpp.o -c /Users/buildslave/jenkins/workspace/lldb-cmake/llvm-project/llvm/lib/Target/X86/X86VZeroUpper.cpp
[2128/4868] /Users/buildslave/jenkins/workspace/lldb-cmake/host-compiler/bin/clang++  -DGTEST_HAS_RTTI=0 -D_DEBUG -D__STDC_CONSTANT_MACROS -D__STDC_FORMAT_MACROS -D__STDC_LIMIT_MACROS -Ilib/Target/X86 -I/Users/buildslave/jenkins/workspace/lldb-cmake/llvm-project/llvm/lib/Target/X86 -Iinclude -I/Users/buildslave/jenkins/workspace/lldb-cmake/llvm-project/llvm/include -Wdocumentation -fPIC -fvisibility-inlines-hidden -Werror=date-time -Werror=unguarded-availability-new -fmodules -fmodules-cache-path=/Users/buildslave/jenkins/workspace/lldb-cmake/lldb-build/module.cache -fcxx-modules -Xclang -fmodules-local-submodule-visibility -Wall -Wextra -Wno-unused-parameter -Wwrite-strings -Wcast-qual -Wmissing-field-initializers -pedantic -Wno-long-long -Wimplicit-fallthrough -Wcovered-switch-default -Wno-noexcept-type -Wnon-virtual-dtor -Wdelete-non-virtual-dtor -Wsuggest-override -Wstring-conversion -fdiagnostics-color -O3  -isysroot /Applications/Xcode.app/Contents/Developer/Platforms/MacOSX.platform/Developer/SDKs/MacOSX10.15.sdk    -fno-exceptions -fno-rtti -UNDEBUG -std=c++14 -MD -MT lib/Target/X86/CMakeFiles/LLVMX86CodeGen.dir/X86InsertWait.cpp.o -MF lib/Target/X86/CMakeFiles/LLVMX86CodeGen.dir/X86InsertWait.cpp.o.d -o lib/Target/X86/CMakeFiles/LLVMX86CodeGen.dir/X86InsertWait.cpp.o -c /Users/buildslave/jenkins/workspace/lldb-cmake/llvm-project/llvm/lib/Target/X86/X86InsertWait.cpp
[2129/4868] /Users/buildslave/jenkins/workspace/lldb-cmake/host-compiler/bin/clang++  -DGTEST_HAS_RTTI=0 -D_DEBUG -D__STDC_CONSTANT_MACROS -D__STDC_FORMAT_MACROS -D__STDC_LIMIT_MACROS -Ilib/Target/X86 -I/Users/buildslave/jenkins/workspace/lldb-cmake/llvm-project/llvm/lib/Target/X86 -Iinclude -I/Users/buildslave/jenkins/workspace/lldb-cmake/llvm-project/llvm/include -Wdocumentation -fPIC -fvisibility-inlines-hidden -Werror=date-time -Werror=unguarded-availability-new -fmodules -fmodules-cache-path=/Users/buildslave/jenkins/workspace/lldb-cmake/lldb-build/module.cache -fcxx-modules -Xclang -fmodules-local-submodule-visibility -Wall -Wextra -Wno-unused-parameter -Wwrite-strings -Wcast-qual -Wmissing-field-initializers -pedantic -Wno-long-long -Wimplicit-fallthrough -Wcovered-switch-default -Wno-noexcept-type -Wnon-virtual-dtor -Wdelete-non-virtual-dtor -Wsuggest-override -Wstring-conversion -fdiagnostics-color -O3  -isysroot /Applications/Xcode.app/Contents/Developer/Platforms/MacOSX.platform/Developer/SDKs/MacOSX10.15.sdk    -fno-exceptions -fno-rtti -UNDEBUG -std=c++14 -MD -MT lib/Target/X86/CMakeFiles/LLVMX86CodeGen.dir/X86TargetMachine.cpp.o -MF lib/Target/X86/CMakeFiles/LLVMX86CodeGen.dir/X86TargetMachine.cpp.o.d -o lib/Target/X86/CMakeFiles/LLVMX86CodeGen.dir/X86TargetMachine.cpp.o -c /Users/buildslave/jenkins/workspace/lldb-cmake/llvm-project/llvm/lib/Target/X86/X86TargetMachine.cpp
[2130/4868] /Users/buildslave/jenkins/workspace/lldb-cmake/host-compiler/bin/clang++  -DGTEST_HAS_RTTI=0 -D_DEBUG -D__STDC_CONSTANT_MACROS -D__STDC_FORMAT_MACROS -D__STDC_LIMIT_MACROS -Ilib/Target/X86 -I/Users/buildslave/jenkins/workspace/lldb-cmake/llvm-project/llvm/lib/Target/X86 -Iinclude -I/Users/buildslave/jenkins/workspace/lldb-cmake/llvm-project/llvm/include -Wdocumentation -fPIC -fvisibility-inlines-hidden -Werror=date-time -Werror=unguarded-availability-new -fmodules -fmodules-cache-path=/Users/buildslave/jenkins/workspace/lldb-cmake/lldb-build/module.cache -fcxx-modules -Xclang -fmodules-local-submodule-visibility -Wall -Wextra -Wno-unused-parameter -Wwrite-strings -Wcast-qual -Wmissing-field-initializers -pedantic -Wno-long-long -Wimplicit-fallthrough -Wcovered-switch-default -Wno-noexcept-type -Wnon-virtual-dtor -Wdelete-non-virtual-dtor -Wsuggest-override -Wstring-conversion -fdiagnostics-color -O3  -isysroot /Applications/Xcode.app/Contents/Developer/Platforms/MacOSX.platform/Developer/SDKs/MacOSX10.15.sdk    -fno-exceptions -fno-rtti -UNDEBUG -std=c++14 -MD -MT lib/Target/X86/CMakeFiles/LLVMX86CodeGen.dir/X86WinAllocaExpander.cpp.o -MF lib/Target/X86/CMakeFiles/LLVMX86CodeGen.dir/X86WinAllocaExpander.cpp.o.d -o lib/Target/X86/CMakeFiles/LLVMX86CodeGen.dir/X86WinAllocaExpander.cpp.o -c /Users/buildslave/jenkins/workspace/lldb-cmake/llvm-project/llvm/lib/Target/X86/X86WinAllocaExpander.cpp
[2131/4868] /Users/buildslave/jenkins/workspace/lldb-cmake/host-compiler/bin/clang++  -DGTEST_HAS_RTTI=0 -D_DEBUG -D__STDC_CONSTANT_MACROS -D__STDC_FORMAT_MACROS -D__STDC_LIMIT_MACROS -Ilib/Target/X86 -I/Users/buildslave/jenkins/workspace/lldb-cmake/llvm-project/llvm/lib/Target/X86 -Iinclude -I/Users/buildslave/jenkins/workspace/lldb-cmake/llvm-project/llvm/include -Wdocumentation -fPIC -fvisibility-inlines-hidden -Werror=date-time -Werror=unguarded-availability-new -fmodules -fmodules-cache-path=/Users/buildslave/jenkins/workspace/lldb-cmake/lldb-build/module.cache -fcxx-modules -Xclang -fmodules-local-submodule-visibility -Wall -Wextra -Wno-unused-parameter -Wwrite-strings -Wcast-qual -Wmissing-field-initializers -pedantic -Wno-long-long -Wimplicit-fallthrough -Wcovered-switch-default -Wno-noexcept-type -Wnon-virtual-dtor -Wdelete-non-virtual-dtor -Wsuggest-override -Wstring-conversion -fdiagnostics-color -O3  -isysroot /Applications/Xcode.app/Contents/Developer/Platforms/MacOSX.platform/Developer/SDKs/MacOSX10.15.sdk    -fno-exceptions -fno-rtti -UNDEBUG -std=c++14 -MD -MT lib/Target/X86/CMakeFiles/LLVMX86CodeGen.dir/X86SpeculativeLoadHardening.cpp.o -MF lib/Target/X86/CMakeFiles/LLVMX86CodeGen.dir/X86SpeculativeLoadHardening.cpp.o.d -o lib/Target/X86/CMakeFiles/LLVMX86CodeGen.dir/X86SpeculativeLoadHardening.cpp.o -c /Users/buildslave/jenkins/workspace/lldb-cmake/llvm-project/llvm/lib/Target/X86/X86SpeculativeLoadHardening.cpp
[2132/4868] /Users/buildslave/jenkins/workspace/lldb-cmake/host-compiler/bin/clang++  -DGTEST_HAS_RTTI=0 -D_DEBUG -D__STDC_CONSTANT_MACROS -D__STDC_FORMAT_MACROS -D__STDC_LIMIT_MACROS -Ilib/ProfileData -I/Users/buildslave/jenkins/workspace/lldb-cmake/llvm-project/llvm/lib/ProfileData -Iinclude -I/Users/buildslave/jenkins/workspace/lldb-cmake/llvm-project/llvm/include -Wdocumentation -fPIC -fvisibility-inlines-hidden -Werror=date-time -Werror=unguarded-availability-new -fmodules -fmodules-cache-path=/Users/buildslave/jenkins/workspace/lldb-cmake/lldb-build/module.cache -fcxx-modules -Xclang -fmodules-local-submodule-visibility -Wall -Wextra -Wno-unused-parameter -Wwrite-strings -Wcast-qual -Wmissing-field-initializers -pedantic -Wno-long-long -Wimplicit-fallthrough -Wcovered-switch-default -Wno-noexcept-type -Wnon-virtual-dtor -Wdelete-non-virtual-dtor -Wsuggest-override -Wstring-conversion -fdiagnostics-color -O3  -isysroot /Applications/Xcode.app/Contents/Developer/Platforms/MacOSX.platform/Developer/SDKs/MacOSX10.15.sdk    -fno-exceptions -fno-rtti -UNDEBUG -std=c++14 -MD -MT lib/ProfileData/CMakeFiles/LLVMProfileData.dir/ProfileSummaryBuilder.cpp.o -MF lib/ProfileData/CMakeFiles/LLVMProfileData.dir/ProfileSummaryBuilder.cpp.o.d -o lib/ProfileData/CMakeFiles/LLVMProfileData.dir/ProfileSummaryBuilder.cpp.o -c /Users/buildslave/jenkins/workspace/lldb-cmake/llvm-project/llvm/lib/ProfileData/ProfileSummaryBuilder.cpp
[2133/4868] /Users/buildslave/jenkins/workspace/lldb-cmake/host-compiler/bin/clang++  -DGTEST_HAS_RTTI=0 -D_DEBUG -D__STDC_CONSTANT_MACROS -D__STDC_FORMAT_MACROS -D__STDC_LIMIT_MACROS -Ilib/Target/X86 -I/Users/buildslave/jenkins/workspace/lldb-cmake/llvm-project/llvm/lib/Target/X86 -Iinclude -I/Users/buildslave/jenkins/workspace/lldb-cmake/llvm-project/llvm/include -Wdocumentation -fPIC -fvisibility-inlines-hidden -Werror=date-time -Werror=unguarded-availability-new -fmodules -fmodules-cache-path=/Users/buildslave/jenkins/workspace/lldb-cmake/lldb-build/module.cache -fcxx-modules -Xclang -fmodules-local-submodule-visibility -Wall -Wextra -Wno-unused-parameter -Wwrite-strings -Wcast-qual -Wmissing-field-initializers -pedantic -Wno-long-long -Wimplicit-fallthrough -Wcovered-switch-default -Wno-noexcept-type -Wnon-virtual-dtor -Wdelete-non-virtual-dtor -Wsuggest-override -Wstring-conversion -fdiagnostics-color -O3  -isysroot /Applications/Xcode.app/Contents/Developer/Platforms/MacOSX.platform/Developer/SDKs/MacOSX10.15.sdk    -fno-exceptions -fno-rtti -UNDEBUG -std=c++14 -MD -MT lib/Target/X86/CMakeFiles/LLVMX86CodeGen.dir/X86TargetTransformInfo.cpp.o -MF lib/Target/X86/CMakeFiles/LLVMX86CodeGen.dir/X86TargetTransformInfo.cpp.o.d -o lib/Target/X86/CMakeFiles/LLVMX86CodeGen.dir/X86TargetTransformInfo.cpp.o -c /Users/buildslave/jenkins/workspace/lldb-cmake/llvm-project/llvm/lib/Target/X86/X86TargetTransformInfo.cpp
[2134/4868] /Users/buildslave/jenkins/workspace/lldb-cmake/host-compiler/bin/clang++  -DGTEST_HAS_RTTI=0 -D_DEBUG -D__STDC_CONSTANT_MACROS -D__STDC_FORMAT_MACROS -D__STDC_LIMIT_MACROS -Ilib/Target/X86 -I/Users/buildslave/jenkins/workspace/lldb-cmake/llvm-project/llvm/lib/Target/X86 -Iinclude -I/Users/buildslave/jenkins/workspace/lldb-cmake/llvm-project/llvm/include -Wdocumentation -fPIC -fvisibility-inlines-hidden -Werror=date-time -Werror=unguarded-availability-new -fmodules -fmodules-cache-path=/Users/buildslave/jenkins/workspace/lldb-cmake/lldb-build/module.cache -fcxx-modules -Xclang -fmodules-local-submodule-visibility -Wall -Wextra -Wno-unused-parameter -Wwrite-strings -Wcast-qual -Wmissing-field-initializers -pedantic -Wno-long-long -Wimplicit-fallthrough -Wcovered-switch-default -Wno-noexcept-type -Wnon-virtual-dtor -Wdelete-non-virtual-dtor -Wsuggest-override -Wstring-conversion -fdiagnostics-color -O3  -isysroot /Applications/Xcode.app/Contents/Developer/Platforms/MacOSX.platform/Developer/SDKs/MacOSX10.15.sdk    -fno-exceptions -fno-rtti -UNDEBUG -std=c++14 -MD -MT lib/Target/X86/CMakeFiles/LLVMX86CodeGen.dir/X86WinEHState.cpp.o -MF lib/Target/X86/CMakeFiles/LLVMX86CodeGen.dir/X86WinEHState.cpp.o.d -o lib/Target/X86/CMakeFiles/LLVMX86CodeGen.dir/X86WinEHState.cpp.o -c /Users/buildslave/jenkins/workspace/lldb-cmake/llvm-project/llvm/lib/Target/X86/X86WinEHState.cpp
[2135/4868] /Users/buildslave/jenkins/workspace/lldb-cmake/host-compiler/bin/clang++  -DGTEST_HAS_RTTI=0 -D_DEBUG -D__STDC_CONSTANT_MACROS -D__STDC_FORMAT_MACROS -D__STDC_LIMIT_MACROS -Ilib/ProfileData -I/Users/buildslave/jenkins/workspace/lldb-cmake/llvm-project/llvm/lib/ProfileData -Iinclude -I/Users/buildslave/jenkins/workspace/lldb-cmake/llvm-project/llvm/include -Wdocumentation -fPIC -fvisibility-inlines-hidden -Werror=date-time -Werror=unguarded-availability-new -fmodules -fmodules-cache-path=/Users/buildslave/jenkins/workspace/lldb-cmake/lldb-build/module.cache -fcxx-modules -Xclang -fmodules-local-submodule-visibility -Wall -Wextra -Wno-unused-parameter -Wwrite-strings -Wcast-qual -Wmissing-field-initializers -pedantic -Wno-long-long -Wimplicit-fallthrough -Wcovered-switch-default -Wno-noexcept-type -Wnon-virtual-dtor -Wdelete-non-virtual-dtor -Wsuggest-override -Wstring-conversion -fdiagnostics-color -O3  -isysroot /Applications/Xcode.app/Contents/Developer/Platforms/MacOSX.platform/Developer/SDKs/MacOSX10.15.sdk    -fno-exceptions -fno-rtti -UNDEBUG -std=c++14 -MD -MT lib/ProfileData/CMakeFiles/LLVMProfileData.dir/SampleProf.cpp.o -MF lib/ProfileData/CMakeFiles/LLVMProfileData.dir/SampleProf.cpp.o.d -o lib/ProfileData/CMakeFiles/LLVMProfileData.dir/SampleProf.cpp.o -c /Users/buildslave/jenkins/workspace/lldb-cmake/llvm-project/llvm/lib/ProfileData/SampleProf.cpp
[2136/4868] /Users/buildslave/jenkins/workspace/lldb-cmake/host-compiler/bin/clang++  -DGTEST_HAS_RTTI=0 -D_DEBUG -D__STDC_CONSTANT_MACROS -D__STDC_FORMAT_MACROS -D__STDC_LIMIT_MACROS -Ilib/ProfileData -I/Users/buildslave/jenkins/workspace/lldb-cmake/llvm-project/llvm/lib/ProfileData -Iinclude -I/Users/buildslave/jenkins/workspace/lldb-cmake/llvm-project/llvm/include -Wdocumentation -fPIC -fvisibility-inlines-hidden -Werror=date-time -Werror=unguarded-availability-new -fmodules -fmodules-cache-path=/Users/buildslave/jenkins/workspace/lldb-cmake/lldb-build/module.cache -fcxx-modules -Xclang -fmodules-local-submodule-visibility -Wall -Wextra -Wno-unused-parameter -Wwrite-strings -Wcast-qual -Wmissing-field-initializers -pedantic -Wno-long-long -Wimplicit-fallthrough -Wcovered-switch-default -Wno-noexcept-type -Wnon-virtual-dtor -Wdelete-non-virtual-dtor -Wsuggest-override -Wstring-conversion -fdiagnostics-color -O3  -isysroot /Applications/Xcode.app/Contents/Developer/Platforms/MacOSX.platform/Developer/SDKs/MacOSX10.15.sdk    -fno-exceptions -fno-rtti -UNDEBUG -std=c++14 -MD -MT lib/ProfileData/CMakeFiles/LLVMProfileData.dir/InstrProfWriter.cpp.o -MF lib/ProfileData/CMakeFiles/LLVMProfileData.dir/InstrProfWriter.cpp.o.d -o lib/ProfileData/CMakeFiles/LLVMProfileData.dir/InstrProfWriter.cpp.o -c /Users/buildslave/jenkins/workspace/lldb-cmake/llvm-project/llvm/lib/ProfileData/InstrProfWriter.cpp
[2137/4868] /Users/buildslave/jenkins/workspace/lldb-cmake/host-compiler/bin/clang++  -DGTEST_HAS_RTTI=0 -D_DEBUG -D__STDC_CONSTANT_MACROS -D__STDC_FORMAT_MACROS -D__STDC_LIMIT_MACROS -Ilib/ProfileData -I/Users/buildslave/jenkins/workspace/lldb-cmake/llvm-project/llvm/lib/ProfileData -Iinclude -I/Users/buildslave/jenkins/workspace/lldb-cmake/llvm-project/llvm/include -Wdocumentation -fPIC -fvisibility-inlines-hidden -Werror=date-time -Werror=unguarded-availability-new -fmodules -fmodules-cache-path=/Users/buildslave/jenkins/workspace/lldb-cmake/lldb-build/module.cache -fcxx-modules -Xclang -fmodules-local-submodule-visibility -Wall -Wextra -Wno-unused-parameter -Wwrite-strings -Wcast-qual -Wmissing-field-initializers -pedantic -Wno-long-long -Wimplicit-fallthrough -Wcovered-switch-default -Wno-noexcept-type -Wnon-virtual-dtor -Wdelete-non-virtual-dtor -Wsuggest-override -Wstring-conversion -fdiagnostics-color -O3  -isysroot /Applications/Xcode.app/Contents/Developer/Platforms/MacOSX.platform/Developer/SDKs/MacOSX10.15.sdk    -fno-exceptions -fno-rtti -UNDEBUG -std=c++14 -MD -MT lib/ProfileData/CMakeFiles/LLVMProfileData.dir/InstrProf.cpp.o -MF lib/ProfileData/CMakeFiles/LLVMProfileData.dir/InstrProf.cpp.o.d -o lib/ProfileData/CMakeFiles/LLVMProfileData.dir/InstrProf.cpp.o -c /Users/buildslave/jenkins/workspace/lldb-cmake/llvm-project/llvm/lib/ProfileData/InstrProf.cpp
[2138/4868] cd /Users/buildslave/jenkins/workspace/lldb-cmake/lldb-build && /Users/buildslave/jenkins/workspace/lldb-cmake/lldb-build/bin/llvm-tblgen -gen-opt-parser-defs -I /Users/buildslave/jenkins/workspace/lldb-cmake/llvm-project/llvm/lib/ToolDrivers/llvm-dlltool -I/Users/buildslave/jenkins/workspace/lldb-cmake/lldb-build/include -I/Users/buildslave/jenkins/workspace/lldb-cmake/llvm-project/llvm/include /Users/buildslave/jenkins/workspace/lldb-cmake/llvm-project/llvm/lib/ToolDrivers/llvm-dlltool/Options.td --write-if-changed -o lib/ToolDrivers/llvm-dlltool/Options.inc -d lib/ToolDrivers/llvm-dlltool/Options.inc.d
[2139/4868] /Users/buildslave/jenkins/workspace/lldb-cmake/host-compiler/bin/clang++  -DGTEST_HAS_RTTI=0 -D_DEBUG -D__STDC_CONSTANT_MACROS -D__STDC_FORMAT_MACROS -D__STDC_LIMIT_MACROS -Ilib/ProfileData/Coverage -I/Users/buildslave/jenkins/workspace/lldb-cmake/llvm-project/llvm/lib/ProfileData/Coverage -Iinclude -I/Users/buildslave/jenkins/workspace/lldb-cmake/llvm-project/llvm/include -Wdocumentation -fPIC -fvisibility-inlines-hidden -Werror=date-time -Werror=unguarded-availability-new -fmodules -fmodules-cache-path=/Users/buildslave/jenkins/workspace/lldb-cmake/lldb-build/module.cache -fcxx-modules -Xclang -fmodules-local-submodule-visibility -Wall -Wextra -Wno-unused-parameter -Wwrite-strings -Wcast-qual -Wmissing-field-initializers -pedantic -Wno-long-long -Wimplicit-fallthrough -Wcovered-switch-default -Wno-noexcept-type -Wnon-virtual-dtor -Wdelete-non-virtual-dtor -Wsuggest-override -Wstring-conversion -fdiagnostics-color -O3  -isysroot /Applications/Xcode.app/Contents/Developer/Platforms/MacOSX.platform/Developer/SDKs/MacOSX10.15.sdk    -fno-exceptions -fno-rtti -UNDEBUG -std=c++14 -MD -MT lib/ProfileData/Coverage/CMakeFiles/LLVMCoverage.dir/CoverageMappingWriter.cpp.o -MF lib/ProfileData/Coverage/CMakeFiles/LLVMCoverage.dir/CoverageMappingWriter.cpp.o.d -o lib/ProfileData/Coverage/CMakeFiles/LLVMCoverage.dir/CoverageMappingWriter.cpp.o -c /Users/buildslave/jenkins/workspace/lldb-cmake/llvm-project/llvm/lib/ProfileData/Coverage/CoverageMappingWriter.cpp
[2140/4868] cd /Users/buildslave/jenkins/workspace/lldb-cmake/lldb-build && /Users/buildslave/jenkins/workspace/lldb-cmake/lldb-build/bin/llvm-tblgen -gen-opt-parser-defs -I /Users/buildslave/jenkins/workspace/lldb-cmake/llvm-project/llvm/lib/ToolDrivers/llvm-lib -I/Users/buildslave/jenkins/workspace/lldb-cmake/lldb-build/include -I/Users/buildslave/jenkins/workspace/lldb-cmake/llvm-project/llvm/include /Users/buildslave/jenkins/workspace/lldb-cmake/llvm-project/llvm/lib/ToolDrivers/llvm-lib/Options.td --write-if-changed -o lib/ToolDrivers/llvm-lib/Options.inc -d lib/ToolDrivers/llvm-lib/Options.inc.d
[2141/4868] /Users/buildslave/jenkins/workspace/lldb-cmake/host-compiler/bin/clang++  -DGTEST_HAS_RTTI=0 -D_DEBUG -D__STDC_CONSTANT_MACROS -D__STDC_FORMAT_MACROS -D__STDC_LIMIT_MACROS -Ilib/ProfileData -I/Users/buildslave/jenkins/workspace/lldb-cmake/llvm-project/llvm/lib/ProfileData -Iinclude -I/Users/buildslave/jenkins/workspace/lldb-cmake/llvm-project/llvm/include -Wdocumentation -fPIC -fvisibility-inlines-hidden -Werror=date-time -Werror=unguarded-availability-new -fmodules -fmodules-cache-path=/Users/buildslave/jenkins/workspace/lldb-cmake/lldb-build/module.cache -fcxx-modules -Xclang -fmodules-local-submodule-visibility -Wall -Wextra -Wno-unused-parameter -Wwrite-strings -Wcast-qual -Wmissing-field-initializers -pedantic -Wno-long-long -Wimplicit-fallthrough -Wcovered-switch-default -Wno-noexcept-type -Wnon-virtual-dtor -Wdelete-non-virtual-dtor -Wsuggest-override -Wstring-conversion -fdiagnostics-color -O3  -isysroot /Applications/Xcode.app/Contents/Developer/Platforms/MacOSX.platform/Developer/SDKs/MacOSX10.15.sdk    -fno-exceptions -fno-rtti -UNDEBUG -std=c++14 -MD -MT lib/ProfileData/CMakeFiles/LLVMProfileData.dir/InstrProfReader.cpp.o -MF lib/ProfileData/CMakeFiles/LLVMProfileData.dir/InstrProfReader.cpp.o.d -o lib/ProfileData/CMakeFiles/LLVMProfileData.dir/InstrProfReader.cpp.o -c /Users/buildslave/jenkins/workspace/lldb-cmake/llvm-project/llvm/lib/ProfileData/InstrProfReader.cpp
[2142/4868] /Users/buildslave/jenkins/workspace/lldb-cmake/host-compiler/bin/clang++  -DGTEST_HAS_RTTI=0 -D_DEBUG -D__STDC_CONSTANT_MACROS -D__STDC_FORMAT_MACROS -D__STDC_LIMIT_MACROS -Ilib/ToolDrivers/llvm-dlltool -I/Users/buildslave/jenkins/workspace/lldb-cmake/llvm-project/llvm/lib/ToolDrivers/llvm-dlltool -Iinclude -I/Users/buildslave/jenkins/workspace/lldb-cmake/llvm-project/llvm/include -Wdocumentation -fPIC -fvisibility-inlines-hidden -Werror=date-time -Werror=unguarded-availability-new -fmodules -fmodules-cache-path=/Users/buildslave/jenkins/workspace/lldb-cmake/lldb-build/module.cache -fcxx-modules -Xclang -fmodules-local-submodule-visibility -Wall -Wextra -Wno-unused-parameter -Wwrite-strings -Wcast-qual -Wmissing-field-initializers -pedantic -Wno-long-long -Wimplicit-fallthrough -Wcovered-switch-default -Wno-noexcept-type -Wnon-virtual-dtor -Wdelete-non-virtual-dtor -Wsuggest-override -Wstring-conversion -fdiagnostics-color -O3  -isysroot /Applications/Xcode.app/Contents/Developer/Platforms/MacOSX.platform/Developer/SDKs/MacOSX10.15.sdk    -fno-exceptions -fno-rtti -UNDEBUG -std=c++14 -MD -MT lib/ToolDrivers/llvm-dlltool/CMakeFiles/LLVMDlltoolDriver.dir/DlltoolDriver.cpp.o -MF lib/ToolDrivers/llvm-dlltool/CMakeFiles/LLVMDlltoolDriver.dir/DlltoolDriver.cpp.o.d -o lib/ToolDrivers/llvm-dlltool/CMakeFiles/LLVMDlltoolDriver.dir/DlltoolDriver.cpp.o -c /Users/buildslave/jenkins/workspace/lldb-cmake/llvm-project/llvm/lib/ToolDrivers/llvm-dlltool/DlltoolDriver.cpp
[2143/4868] : && "/Applications/Xcode.app/Contents/Developer/Toolchains/XcodeDefault.xctoolchain/usr/bin/libtool" -static -no_warning_for_no_symbols -o lib/libLLVMDlltoolDriver.a  lib/ToolDrivers/llvm-dlltool/CMakeFiles/LLVMDlltoolDriver.dir/DlltoolDriver.cpp.o && :
[2144/4868] : && /Users/buildslave/jenkins/workspace/lldb-cmake/host-compiler/bin/clang++  -Wdocumentation -fPIC -fvisibility-inlines-hidden -Werror=date-time -Werror=unguarded-availability-new -fmodules -fmodules-cache-path=/Users/buildslave/jenkins/workspace/lldb-cmake/lldb-build/module.cache -fcxx-modules -Xclang -fmodules-local-submodule-visibility -Wall -Wextra -Wno-unused-parameter -Wwrite-strings -Wcast-qual -Wmissing-field-initializers -pedantic -Wno-long-long -Wimplicit-fallthrough -Wcovered-switch-default -Wno-noexcept-type -Wnon-virtual-dtor -Wdelete-non-virtual-dtor -Wsuggest-override -Wstring-conversion -fdiagnostics-color -O3  -isysroot /Applications/Xcode.app/Contents/Developer/Platforms/MacOSX.platform/Developer/SDKs/MacOSX10.15.sdk -Wl,-search_paths_first -Wl,-headerpad_max_install_names -Wl,-dead_strip utils/FileCheck/CMakeFiles/FileCheck.dir/FileCheck.cpp.o  -o bin/FileCheck  -Wl,-rpath,@loader_path/../lib  lib/libLLVMFileCheck.a  lib/libLLVMSupport.a  -lm  /usr/lib/libz.dylib  /usr/lib/libcurses.dylib  lib/libLLVMDemangle.a && :
[2145/4868] : && /Users/buildslave/jenkins/workspace/lldb-cmake/host-compiler/bin/clang++  -Wdocumentation -fPIC -fvisibility-inlines-hidden -Werror=date-time -Werror=unguarded-availability-new -fmodules -fmodules-cache-path=/Users/buildslave/jenkins/workspace/lldb-cmake/lldb-build/module.cache -fcxx-modules -Xclang -fmodules-local-submodule-visibility -Wall -Wextra -Wno-unused-parameter -Wwrite-strings -Wcast-qual -Wmissing-field-initializers -pedantic -Wno-long-long -Wimplicit-fallthrough -Wcovered-switch-default -Wno-noexcept-type -Wnon-virtual-dtor -Wdelete-non-virtual-dtor -Wsuggest-override -Wstring-conversion -fdiagnostics-color -O3  -isysroot /Applications/Xcode.app/Contents/Developer/Platforms/MacOSX.platform/Developer/SDKs/MacOSX10.15.sdk -Wl,-search_paths_first -Wl,-headerpad_max_install_names -Wl,-dead_strip utils/not/CMakeFiles/not.dir/not.cpp.o  -o bin/not  -Wl,-rpath,@loader_path/../lib  lib/libLLVMSupport.a  -lm  /usr/lib/libz.dylib  /usr/lib/libcurses.dylib  lib/libLLVMDemangle.a && :
[2146/4868] : && /Users/buildslave/jenkins/workspace/lldb-cmake/host-compiler/bin/clang++  -Wdocumentation -fPIC -fvisibility-inlines-hidden -Werror=date-time -Werror=unguarded-availability-new -fmodules -fmodules-cache-path=/Users/buildslave/jenkins/workspace/lldb-cmake/lldb-build/module.cache -fcxx-modules -Xclang -fmodules-local-submodule-visibility -Wall -Wextra -Wno-unused-parameter -Wwrite-strings -Wcast-qual -Wmissing-field-initializers -pedantic -Wno-long-long -Wimplicit-fallthrough -Wcovered-switch-default -Wno-noexcept-type -Wnon-virtual-dtor -Wdelete-non-virtual-dtor -Wsuggest-override -Wstring-conversion -fdiagnostics-color -O3  -isysroot /Applications/Xcode.app/Contents/Developer/Platforms/MacOSX.platform/Developer/SDKs/MacOSX10.15.sdk -Wl,-search_paths_first -Wl,-headerpad_max_install_names -Wl,-dead_strip utils/yaml-bench/CMakeFiles/yaml-bench.dir/YAMLBench.cpp.o  -o bin/yaml-bench  -Wl,-rpath,@loader_path/../lib  lib/libLLVMSupport.a  -lm  /usr/lib/libz.dylib  /usr/lib/libcurses.dylib  lib/libLLVMDemangle.a && :
[2147/4868] /Users/buildslave/jenkins/workspace/lldb-cmake/host-compiler/bin/clang++  -DGTEST_HAS_RTTI=0 -D_DEBUG -D__STDC_CONSTANT_MACROS -D__STDC_FORMAT_MACROS -D__STDC_LIMIT_MACROS -Ilib/ProfileData -I/Users/buildslave/jenkins/workspace/lldb-cmake/llvm-project/llvm/lib/ProfileData -Iinclude -I/Users/buildslave/jenkins/workspace/lldb-cmake/llvm-project/llvm/include -Wdocumentation -fPIC -fvisibility-inlines-hidden -Werror=date-time -Werror=unguarded-availability-new -fmodules -fmodules-cache-path=/Users/buildslave/jenkins/workspace/lldb-cmake/lldb-build/module.cache -fcxx-modules -Xclang -fmodules-local-submodule-visibility -Wall -Wextra -Wno-unused-parameter -Wwrite-strings -Wcast-qual -Wmissing-field-initializers -pedantic -Wno-long-long -Wimplicit-fallthrough -Wcovered-switch-default -Wno-noexcept-type -Wnon-virtual-dtor -Wdelete-non-virtual-dtor -Wsuggest-override -Wstring-conversion -fdiagnostics-color -O3  -isysroot /Applications/Xcode.app/Contents/Developer/Platforms/MacOSX.platform/Developer/SDKs/MacOSX10.15.sdk    -fno-exceptions -fno-rtti -UNDEBUG -std=c++14 -MD -MT lib/ProfileData/CMakeFiles/LLVMProfileData.dir/SampleProfWriter.cpp.o -MF lib/ProfileData/CMakeFiles/LLVMProfileData.dir/SampleProfWriter.cpp.o.d -o lib/ProfileData/CMakeFiles/LLVMProfileData.dir/SampleProfWriter.cpp.o -c /Users/buildslave/jenkins/workspace/lldb-cmake/llvm-project/llvm/lib/ProfileData/SampleProfWriter.cpp
[2148/4868] /Users/buildslave/jenkins/workspace/lldb-cmake/host-compiler/bin/clang++  -DGTEST_HAS_RTTI=0 -D_DEBUG -D__STDC_CONSTANT_MACROS -D__STDC_FORMAT_MACROS -D__STDC_LIMIT_MACROS -Ilib/ProfileData -I/Users/buildslave/jenkins/workspace/lldb-cmake/llvm-project/llvm/lib/ProfileData -Iinclude -I/Users/buildslave/jenkins/workspace/lldb-cmake/llvm-project/llvm/include -Wdocumentation -fPIC -fvisibility-inlines-hidden -Werror=date-time -Werror=unguarded-availability-new -fmodules -fmodules-cache-path=/Users/buildslave/jenkins/workspace/lldb-cmake/lldb-build/module.cache -fcxx-modules -Xclang -fmodules-local-submodule-visibility -Wall -Wextra -Wno-unused-parameter -Wwrite-strings -Wcast-qual -Wmissing-field-initializers -pedantic -Wno-long-long -Wimplicit-fallthrough -Wcovered-switch-default -Wno-noexcept-type -Wnon-virtual-dtor -Wdelete-non-virtual-dtor -Wsuggest-override -Wstring-conversion -fdiagnostics-color -O3  -isysroot /Applications/Xcode.app/Contents/Developer/Platforms/MacOSX.platform/Developer/SDKs/MacOSX10.15.sdk    -fno-exceptions -fno-rtti -UNDEBUG -std=c++14 -MD -MT lib/ProfileData/CMakeFiles/LLVMProfileData.dir/SampleProfReader.cpp.o -MF lib/ProfileData/CMakeFiles/LLVMProfileData.dir/SampleProfReader.cpp.o.d -o lib/ProfileData/CMakeFiles/LLVMProfileData.dir/SampleProfReader.cpp.o -c /Users/buildslave/jenkins/workspace/lldb-cmake/llvm-project/llvm/lib/ProfileData/SampleProfReader.cpp
[2149/4868] : && "/Applications/Xcode.app/Contents/Developer/Toolchains/XcodeDefault.xctoolchain/usr/bin/libtool" -static -no_warning_for_no_symbols -o lib/libLLVMProfileData.a  lib/ProfileData/CMakeFiles/LLVMProfileData.dir/GCOV.cpp.o lib/ProfileData/CMakeFiles/LLVMProfileData.dir/InstrProf.cpp.o lib/ProfileData/CMakeFiles/LLVMProfileData.dir/InstrProfReader.cpp.o lib/ProfileData/CMakeFiles/LLVMProfileData.dir/InstrProfWriter.cpp.o lib/ProfileData/CMakeFiles/LLVMProfileData.dir/ProfileSummaryBuilder.cpp.o lib/ProfileData/CMakeFiles/LLVMProfileData.dir/SampleProf.cpp.o lib/ProfileData/CMakeFiles/LLVMProfileData.dir/SampleProfReader.cpp.o lib/ProfileData/CMakeFiles/LLVMProfileData.dir/SampleProfWriter.cpp.o && :
[2150/4868] : && /Users/buildslave/jenkins/workspace/lldb-cmake/host-compiler/bin/clang++ -Wdocumentation -fPIC -fvisibility-inlines-hidden -Werror=date-time -Werror=unguarded-availability-new -fmodules -fmodules-cache-path=/Users/buildslave/jenkins/workspace/lldb-cmake/lldb-build/module.cache -fcxx-modules -Xclang -fmodules-local-submodule-visibility -Wall -Wextra -Wno-unused-parameter -Wwrite-strings -Wcast-qual -Wmissing-field-initializers  -Wno-long-long -Wimplicit-fallthrough -Wcovered-switch-default -Wno-noexcept-type -Wnon-virtual-dtor -Wdelete-non-virtual-dtor -Wsuggest-override -Wstring-conversion -fdiagnostics-color -O3 -isysroot /Applications/Xcode.app/Contents/Developer/Platforms/MacOSX.platform/Developer/SDKs/MacOSX10.15.sdk -dynamiclib -Wl,-headerpad_max_install_names -compatibility_version 1.0.0 -current_version 1.0.0 -o lib/libc++.1.0.dylib -install_name @rpath/libc++.1.dylib projects/libcxx/src/CMakeFiles/cxx_shared.dir/algorithm.cpp.o projects/libcxx/src/CMakeFiles/cxx_shared.dir/any.cpp.o projects/libcxx/src/CMakeFiles/cxx_shared.dir/atomic.cpp.o projects/libcxx/src/CMakeFiles/cxx_shared.dir/barrier.cpp.o projects/libcxx/src/CMakeFiles/cxx_shared.dir/bind.cpp.o projects/libcxx/src/CMakeFiles/cxx_shared.dir/charconv.cpp.o projects/libcxx/src/CMakeFiles/cxx_shared.dir/chrono.cpp.o projects/libcxx/src/CMakeFiles/cxx_shared.dir/condition_variable.cpp.o projects/libcxx/src/CMakeFiles/cxx_shared.dir/condition_variable_destructor.cpp.o projects/libcxx/src/CMakeFiles/cxx_shared.dir/debug.cpp.o projects/libcxx/src/CMakeFiles/cxx_shared.dir/exception.cpp.o projects/libcxx/src/CMakeFiles/cxx_shared.dir/functional.cpp.o projects/libcxx/src/CMakeFiles/cxx_shared.dir/future.cpp.o projects/libcxx/src/CMakeFiles/cxx_shared.dir/hash.cpp.o projects/libcxx/src/CMakeFiles/cxx_shared.dir/ios.cpp.o projects/libcxx/src/CMakeFiles/cxx_shared.dir/iostream.cpp.o projects/libcxx/src/CMakeFiles/cxx_shared.dir/locale.cpp.o projects/libcxx/src/CMakeFiles/cxx_shared.dir/memory.cpp.o projects/libcxx/src/CMakeFiles/cxx_shared.dir/mutex.cpp.o projects/libcxx/src/CMakeFiles/cxx_shared.dir/mutex_destructor.cpp.o projects/libcxx/src/CMakeFiles/cxx_shared.dir/new.cpp.o projects/libcxx/src/CMakeFiles/cxx_shared.dir/optional.cpp.o projects/libcxx/src/CMakeFiles/cxx_shared.dir/random.cpp.o projects/libcxx/src/CMakeFiles/cxx_shared.dir/random_shuffle.cpp.o projects/libcxx/src/CMakeFiles/cxx_shared.dir/regex.cpp.o projects/libcxx/src/CMakeFiles/cxx_shared.dir/shared_mutex.cpp.o projects/libcxx/src/CMakeFiles/cxx_shared.dir/stdexcept.cpp.o projects/libcxx/src/CMakeFiles/cxx_shared.dir/string.cpp.o projects/libcxx/src/CMakeFiles/cxx_shared.dir/strstream.cpp.o projects/libcxx/src/CMakeFiles/cxx_shared.dir/system_error.cpp.o projects/libcxx/src/CMakeFiles/cxx_shared.dir/thread.cpp.o projects/libcxx/src/CMakeFiles/cxx_shared.dir/typeinfo.cpp.o projects/libcxx/src/CMakeFiles/cxx_shared.dir/utility.cpp.o projects/libcxx/src/CMakeFiles/cxx_shared.dir/valarray.cpp.o projects/libcxx/src/CMakeFiles/cxx_shared.dir/variant.cpp.o projects/libcxx/src/CMakeFiles/cxx_shared.dir/vector.cpp.o projects/libcxx/src/CMakeFiles/cxx_shared.dir/filesystem/operations.cpp.o projects/libcxx/src/CMakeFiles/cxx_shared.dir/filesystem/directory_iterator.cpp.o projects/libcxx/src/CMakeFiles/cxx_shared.dir/filesystem/int128_builtins.cpp.o  -Wl,-rpath,@loader_path/../lib  -nodefaultlibs  -lSystem  -lc  lib/libc++abi.1.0.dylib  -Wl,-unexported_symbols_list,/Users/buildslave/jenkins/workspace/lldb-cmake/llvm-project/libcxx/src/../lib/libc++unexp.exp  -Wl,-reexported_symbols_list,/Users/buildslave/jenkins/workspace/lldb-cmake/llvm-project/libcxx/src/../lib/libc++abi.v2.exp  -Wl,-force_symbols_not_weak_list,/Users/buildslave/jenkins/workspace/lldb-cmake/llvm-project/libcxx/src/../lib/notweak.exp  -Wl,-force_symbols_weak_list,/Users/buildslave/jenkins/workspace/lldb-cmake/llvm-project/libcxx/src/../lib/weak.exp  -Wl,-reexported_symbols_list,/Users/buildslave/jenkins/workspace/lldb-cmake/llvm-project/libcxxabi/src/../lib/new-delete.exp  -Wl,-reexported_symbols_list,/Users/buildslave/jenkins/workspace/lldb-cmake/llvm-project/libcxxabi/src/../lib/exceptions.exp  -Wl,-reexported_symbols_list,/Users/buildslave/jenkins/workspace/lldb-cmake/llvm-project/libcxxabi/src/../lib/personality-v0.exp && :
FAILED: lib/libc++.1.0.dylib 
: && /Users/buildslave/jenkins/workspace/lldb-cmake/host-compiler/bin/clang++ -Wdocumentation -fPIC -fvisibility-inlines-hidden -Werror=date-time -Werror=unguarded-availability-new -fmodules -fmodules-cache-path=/Users/buildslave/jenkins/workspace/lldb-cmake/lldb-build/module.cache -fcxx-modules -Xclang -fmodules-local-submodule-visibility -Wall -Wextra -Wno-unused-parameter -Wwrite-strings -Wcast-qual -Wmissing-field-initializers  -Wno-long-long -Wimplicit-fallthrough -Wcovered-switch-default -Wno-noexcept-type -Wnon-virtual-dtor -Wdelete-non-virtual-dtor -Wsuggest-override -Wstring-conversion -fdiagnostics-color -O3 -isysroot /Applications/Xcode.app/Contents/Developer/Platforms/MacOSX.platform/Developer/SDKs/MacOSX10.15.sdk -dynamiclib -Wl,-headerpad_max_install_names -compatibility_version 1.0.0 -current_version 1.0.0 -o lib/libc++.1.0.dylib -install_name @rpath/libc++.1.dylib projects/libcxx/src/CMakeFiles/cxx_shared.dir/algorithm.cpp.o projects/libcxx/src/CMakeFiles/cxx_shared.dir/any.cpp.o projects/libcxx/src/CMakeFiles/cxx_shared.dir/atomic.cpp.o projects/libcxx/src/CMakeFiles/cxx_shared.dir/barrier.cpp.o projects/libcxx/src/CMakeFiles/cxx_shared.dir/bind.cpp.o projects/libcxx/src/CMakeFiles/cxx_shared.dir/charconv.cpp.o projects/libcxx/src/CMakeFiles/cxx_shared.dir/chrono.cpp.o projects/libcxx/src/CMakeFiles/cxx_shared.dir/condition_variable.cpp.o projects/libcxx/src/CMakeFiles/cxx_shared.dir/condition_variable_destructor.cpp.o projects/libcxx/src/CMakeFiles/cxx_shared.dir/debug.cpp.o projects/libcxx/src/CMakeFiles/cxx_shared.dir/exception.cpp.o projects/libcxx/src/CMakeFiles/cxx_shared.dir/functional.cpp.o projects/libcxx/src/CMakeFiles/cxx_shared.dir/future.cpp.o projects/libcxx/src/CMakeFiles/cxx_shared.dir/hash.cpp.o projects/libcxx/src/CMakeFiles/cxx_shared.dir/ios.cpp.o projects/libcxx/src/CMakeFiles/cxx_shared.dir/iostream.cpp.o projects/libcxx/src/CMakeFiles/cxx_shared.dir/locale.cpp.o projects/libcxx/src/CMakeFiles/cxx_shared.dir/memory.cpp.o projects/libcxx/src/CMakeFiles/cxx_shared.dir/mutex.cpp.o projects/libcxx/src/CMakeFiles/cxx_shared.dir/mutex_destructor.cpp.o projects/libcxx/src/CMakeFiles/cxx_shared.dir/new.cpp.o projects/libcxx/src/CMakeFiles/cxx_shared.dir/optional.cpp.o projects/libcxx/src/CMakeFiles/cxx_shared.dir/random.cpp.o projects/libcxx/src/CMakeFiles/cxx_shared.dir/random_shuffle.cpp.o projects/libcxx/src/CMakeFiles/cxx_shared.dir/regex.cpp.o projects/libcxx/src/CMakeFiles/cxx_shared.dir/shared_mutex.cpp.o projects/libcxx/src/CMakeFiles/cxx_shared.dir/stdexcept.cpp.o projects/libcxx/src/CMakeFiles/cxx_shared.dir/string.cpp.o projects/libcxx/src/CMakeFiles/cxx_shared.dir/strstream.cpp.o projects/libcxx/src/CMakeFiles/cxx_shared.dir/system_error.cpp.o projects/libcxx/src/CMakeFiles/cxx_shared.dir/thread.cpp.o projects/libcxx/src/CMakeFiles/cxx_shared.dir/typeinfo.cpp.o projects/libcxx/src/CMakeFiles/cxx_shared.dir/utility.cpp.o projects/libcxx/src/CMakeFiles/cxx_shared.dir/valarray.cpp.o projects/libcxx/src/CMakeFiles/cxx_shared.dir/variant.cpp.o projects/libcxx/src/CMakeFiles/cxx_shared.dir/vector.cpp.o projects/libcxx/src/CMakeFiles/cxx_shared.dir/filesystem/operations.cpp.o projects/libcxx/src/CMakeFiles/cxx_shared.dir/filesystem/directory_iterator.cpp.o projects/libcxx/src/CMakeFiles/cxx_shared.dir/filesystem/int128_builtins.cpp.o  -Wl,-rpath,@loader_path/../lib  -nodefaultlibs  -lSystem  -lc  lib/libc++abi.1.0.dylib  -Wl,-unexported_symbols_list,/Users/buildslave/jenkins/workspace/lldb-cmake/llvm-project/libcxx/src/../lib/libc++unexp.exp  -Wl,-reexported_symbols_list,/Users/buildslave/jenkins/workspace/lldb-cmake/llvm-project/libcxx/src/../lib/libc++abi.v2.exp  -Wl,-force_symbols_not_weak_list,/Users/buildslave/jenkins/workspace/lldb-cmake/llvm-project/libcxx/src/../lib/notweak.exp  -Wl,-force_symbols_weak_list,/Users/buildslave/jenkins/workspace/lldb-cmake/llvm-project/libcxx/src/../lib/weak.exp  -Wl,-reexported_symbols_list,/Users/buildslave/jenkins/workspace/lldb-cmake/llvm-project/libcxxabi/src/../lib/new-delete.exp  -Wl,-reexported_symbols_list,/Users/buildslave/jenkins/workspace/lldb-cmake/llvm-project/libcxxabi/src/../lib/exceptions.exp  -Wl,-reexported_symbols_list,/Users/buildslave/jenkins/workspace/lldb-cmake/llvm-project/libcxxabi/src/../lib/personality-v0.exp && :
ld: requested re-export symbol operator new(unsigned long) is not from a dylib, but from projects/libcxx/src/CMakeFiles/cxx_shared.dir/new.cpp.o
 file 'projects/libcxx/src/CMakeFiles/cxx_shared.dir/new.cpp.o' for architecture x86_64
clang-12: error: linker command failed with exit code 1 (use -v to see invocation)
[2151/4868] : && "/Applications/Xcode.app/Contents/Developer/Toolchains/XcodeDefault.xctoolchain/usr/bin/libtool" -static -no_warning_for_no_symbols -o lib/libLLVMAnalysis.a  lib/Analysis/CMakeFiles/LLVMAnalysis.dir/AliasAnalysis.cpp.o lib/Analysis/CMakeFiles/LLVMAnalysis.dir/AliasAnalysisEvaluator.cpp.o lib/Analysis/CMakeFiles/LLVMAnalysis.dir/AliasAnalysisSummary.cpp.o lib/Analysis/CMakeFiles/LLVMAnalysis.dir/AliasSetTracker.cpp.o lib/Analysis/CMakeFiles/LLVMAnalysis.dir/Analysis.cpp.o lib/Analysis/CMakeFiles/LLVMAnalysis.dir/AssumeBundleQueries.cpp.o lib/Analysis/CMakeFiles/LLVMAnalysis.dir/AssumptionCache.cpp.o lib/Analysis/CMakeFiles/LLVMAnalysis.dir/BasicAliasAnalysis.cpp.o lib/Analysis/CMakeFiles/LLVMAnalysis.dir/BlockFrequencyInfo.cpp.o lib/Analysis/CMakeFiles/LLVMAnalysis.dir/BlockFrequencyInfoImpl.cpp.o lib/Analysis/CMakeFiles/LLVMAnalysis.dir/BranchProbabilityInfo.cpp.o lib/Analysis/CMakeFiles/LLVMAnalysis.dir/CFG.cpp.o lib/Analysis/CMakeFiles/LLVMAnalysis.dir/CFGPrinter.cpp.o lib/Analysis/CMakeFiles/LLVMAnalysis.dir/CFLAndersAliasAnalysis.cpp.o lib/Analysis/CMakeFiles/LLVMAnalysis.dir/CFLSteensAliasAnalysis.cpp.o lib/Analysis/CMakeFiles/LLVMAnalysis.dir/CGSCCPassManager.cpp.o lib/Analysis/CMakeFiles/LLVMAnalysis.dir/CallGraph.cpp.o lib/Analysis/CMakeFiles/LLVMAnalysis.dir/CallGraphSCCPass.cpp.o lib/Analysis/CMakeFiles/LLVMAnalysis.dir/CallPrinter.cpp.o lib/Analysis/CMakeFiles/LLVMAnalysis.dir/CaptureTracking.cpp.o lib/Analysis/CMakeFiles/LLVMAnalysis.dir/CmpInstAnalysis.cpp.o lib/Analysis/CMakeFiles/LLVMAnalysis.dir/CostModel.cpp.o lib/Analysis/CMakeFiles/LLVMAnalysis.dir/CodeMetrics.cpp.o lib/Analysis/CMakeFiles/LLVMAnalysis.dir/ConstantFolding.cpp.o lib/Analysis/CMakeFiles/LLVMAnalysis.dir/DDG.cpp.o lib/Analysis/CMakeFiles/LLVMAnalysis.dir/ConstraintSystem.cpp.o lib/Analysis/CMakeFiles/LLVMAnalysis.dir/Delinearization.cpp.o lib/Analysis/CMakeFiles/LLVMAnalysis.dir/DemandedBits.cpp.o lib/Analysis/CMakeFiles/LLVMAnalysis.dir/DependenceAnalysis.cpp.o lib/Analysis/CMakeFiles/LLVMAnalysis.dir/DependenceGraphBuilder.cpp.o lib/Analysis/CMakeFiles/LLVMAnalysis.dir/DevelopmentModeInlineAdvisor.cpp.o lib/Analysis/CMakeFiles/LLVMAnalysis.dir/DivergenceAnalysis.cpp.o lib/Analysis/CMakeFiles/LLVMAnalysis.dir/DomPrinter.cpp.o lib/Analysis/CMakeFiles/LLVMAnalysis.dir/DomTreeUpdater.cpp.o lib/Analysis/CMakeFiles/LLVMAnalysis.dir/DominanceFrontier.cpp.o lib/Analysis/CMakeFiles/LLVMAnalysis.dir/EHPersonalities.cpp.o lib/Analysis/CMakeFiles/LLVMAnalysis.dir/FunctionPropertiesAnalysis.cpp.o lib/Analysis/CMakeFiles/LLVMAnalysis.dir/GlobalsModRef.cpp.o lib/Analysis/CMakeFiles/LLVMAnalysis.dir/GuardUtils.cpp.o lib/Analysis/CMakeFiles/LLVMAnalysis.dir/HeatUtils.cpp.o lib/Analysis/CMakeFiles/LLVMAnalysis.dir/IRSimilarityIdentifier.cpp.o lib/Analysis/CMakeFiles/LLVMAnalysis.dir/IVDescriptors.cpp.o lib/Analysis/CMakeFiles/LLVMAnalysis.dir/IVUsers.cpp.o lib/Analysis/CMakeFiles/LLVMAnalysis.dir/IndirectCallPromotionAnalysis.cpp.o lib/Analysis/CMakeFiles/LLVMAnalysis.dir/InlineCost.cpp.o lib/Analysis/CMakeFiles/LLVMAnalysis.dir/InlineAdvisor.cpp.o lib/Analysis/CMakeFiles/LLVMAnalysis.dir/InlineSizeEstimatorAnalysis.cpp.o lib/Analysis/CMakeFiles/LLVMAnalysis.dir/InstCount.cpp.o lib/Analysis/CMakeFiles/LLVMAnalysis.dir/InstructionPrecedenceTracking.cpp.o lib/Analysis/CMakeFiles/LLVMAnalysis.dir/InstructionSimplify.cpp.o lib/Analysis/CMakeFiles/LLVMAnalysis.dir/Interval.cpp.o lib/Analysis/CMakeFiles/LLVMAnalysis.dir/IntervalPartition.cpp.o lib/Analysis/CMakeFiles/LLVMAnalysis.dir/LazyBranchProbabilityInfo.cpp.o lib/Analysis/CMakeFiles/LLVMAnalysis.dir/LazyBlockFrequencyInfo.cpp.o lib/Analysis/CMakeFiles/LLVMAnalysis.dir/LazyCallGraph.cpp.o lib/Analysis/CMakeFiles/LLVMAnalysis.dir/LazyValueInfo.cpp.o lib/Analysis/CMakeFiles/LLVMAnalysis.dir/LegacyDivergenceAnalysis.cpp.o lib/Analysis/CMakeFiles/LLVMAnalysis.dir/Lint.cpp.o lib/Analysis/CMakeFiles/LLVMAnalysis.dir/Loads.cpp.o lib/Analysis/CMakeFiles/LLVMAnalysis.dir/LoopAccessAnalysis.cpp.o lib/Analysis/CMakeFiles/LLVMAnalysis.dir/LoopAnalysisManager.cpp.o lib/Analysis/CMakeFiles/LLVMAnalysis.dir/LoopCacheAnalysis.cpp.o lib/Analysis/CMakeFiles/LLVMAnalysis.dir/LoopNestAnalysis.cpp.o lib/Analysis/CMakeFiles/LLVMAnalysis.dir/LoopUnrollAnalyzer.cpp.o lib/Analysis/CMakeFiles/LLVMAnalysis.dir/LoopInfo.cpp.o lib/Analysis/CMakeFiles/LLVMAnalysis.dir/LoopPass.cpp.o lib/Analysis/CMakeFiles/LLVMAnalysis.dir/MLInlineAdvisor.cpp.o lib/Analysis/CMakeFiles/LLVMAnalysis.dir/MemDepPrinter.cpp.o lib/Analysis/CMakeFiles/LLVMAnalysis.dir/MemDerefPrinter.cpp.o lib/Analysis/CMakeFiles/LLVMAnalysis.dir/MemoryBuiltins.cpp.o lib/Analysis/CMakeFiles/LLVMAnalysis.dir/MemoryDependenceAnalysis.cpp.o lib/Analysis/CMakeFiles/LLVMAnalysis.dir/MemoryLocation.cpp.o lib/Analysis/CMakeFiles/LLVMAnalysis.dir/MemorySSA.cpp.o lib/Analysis/CMakeFiles/LLVMAnalysis.dir/MemorySSAUpdater.cpp.o lib/Analysis/CMakeFiles/LLVMAnalysis.dir/ModuleDebugInfoPrinter.cpp.o lib/Analysis/CMakeFiles/LLVMAnalysis.dir/ModuleSummaryAnalysis.cpp.o lib/Analysis/CMakeFiles/LLVMAnalysis.dir/MustExecute.cpp.o lib/Analysis/CMakeFiles/LLVMAnalysis.dir/ObjCARCAliasAnalysis.cpp.o lib/Analysis/CMakeFiles/LLVMAnalysis.dir/ObjCARCAnalysisUtils.cpp.o lib/Analysis/CMakeFiles/LLVMAnalysis.dir/ObjCARCInstKind.cpp.o lib/Analysis/CMakeFiles/LLVMAnalysis.dir/OptimizationRemarkEmitter.cpp.o lib/Analysis/CMakeFiles/LLVMAnalysis.dir/PHITransAddr.cpp.o lib/Analysis/CMakeFiles/LLVMAnalysis.dir/PhiValues.cpp.o lib/Analysis/CMakeFiles/LLVMAnalysis.dir/PostDominators.cpp.o lib/Analysis/CMakeFiles/LLVMAnalysis.dir/ProfileSummaryInfo.cpp.o lib/Analysis/CMakeFiles/LLVMAnalysis.dir/PtrUseVisitor.cpp.o lib/Analysis/CMakeFiles/LLVMAnalysis.dir/RegionInfo.cpp.o lib/Analysis/CMakeFiles/LLVMAnalysis.dir/RegionPass.cpp.o lib/Analysis/CMakeFiles/LLVMAnalysis.dir/RegionPrinter.cpp.o lib/Analysis/CMakeFiles/LLVMAnalysis.dir/ReleaseModeModelRunner.cpp.o lib/Analysis/CMakeFiles/LLVMAnalysis.dir/ReplayInlineAdvisor.cpp.o lib/Analysis/CMakeFiles/LLVMAnalysis.dir/ScalarEvolution.cpp.o lib/Analysis/CMakeFiles/LLVMAnalysis.dir/ScalarEvolutionAliasAnalysis.cpp.o lib/Analysis/CMakeFiles/LLVMAnalysis.dir/ScalarEvolutionDivision.cpp.o lib/Analysis/CMakeFiles/LLVMAnalysis.dir/ScalarEvolutionNormalization.cpp.o lib/Analysis/CMakeFiles/LLVMAnalysis.dir/StackLifetime.cpp.o lib/Analysis/CMakeFiles/LLVMAnalysis.dir/StackSafetyAnalysis.cpp.o lib/Analysis/CMakeFiles/LLVMAnalysis.dir/SyncDependenceAnalysis.cpp.o lib/Analysis/CMakeFiles/LLVMAnalysis.dir/SyntheticCountsUtils.cpp.o lib/Analysis/CMakeFiles/LLVMAnalysis.dir/TFUtils.cpp.o lib/Analysis/CMakeFiles/LLVMAnalysis.dir/TargetLibraryInfo.cpp.o lib/Analysis/CMakeFiles/LLVMAnalysis.dir/TargetTransformInfo.cpp.o lib/Analysis/CMakeFiles/LLVMAnalysis.dir/Trace.cpp.o lib/Analysis/CMakeFiles/LLVMAnalysis.dir/TypeBasedAliasAnalysis.cpp.o lib/Analysis/CMakeFiles/LLVMAnalysis.dir/TypeMetadataUtils.cpp.o lib/Analysis/CMakeFiles/LLVMAnalysis.dir/ScopedNoAliasAA.cpp.o lib/Analysis/CMakeFiles/LLVMAnalysis.dir/ValueLattice.cpp.o lib/Analysis/CMakeFiles/LLVMAnalysis.dir/ValueLatticeUtils.cpp.o lib/Analysis/CMakeFiles/LLVMAnalysis.dir/ValueTracking.cpp.o lib/Analysis/CMakeFiles/LLVMAnalysis.dir/VectorUtils.cpp.o lib/Analysis/CMakeFiles/LLVMAnalysis.dir/VFABIDemangling.cpp.o && :
[2152/4868] /Users/buildslave/jenkins/workspace/lldb-cmake/host-compiler/bin/clang++  -DHAVE_RPC_XDR_H=0 -D_DEBUG -D__STDC_CONSTANT_MACROS -D__STDC_FORMAT_MACROS -D__STDC_LIMIT_MACROS -Iprojects/compiler-rt/lib/sanitizer_common -I/Users/buildslave/jenkins/workspace/lldb-cmake/llvm-project/compiler-rt/lib/sanitizer_common -Iinclude -I/Users/buildslave/jenkins/workspace/lldb-cmake/llvm-project/llvm/include -I/Users/buildslave/jenkins/workspace/lldb-cmake/llvm-project/compiler-rt/lib/sanitizer_common/.. -Wdocumentation -fPIC -fvisibility-inlines-hidden -Werror=date-time -Werror=unguarded-availability-new -fmodules -fmodules-cache-path=/Users/buildslave/jenkins/workspace/lldb-cmake/lldb-build/module.cache -fcxx-modules -Xclang -fmodules-local-submodule-visibility -Wall -Wextra -Wno-unused-parameter -Wwrite-strings -Wcast-qual -Wmissing-field-initializers -pedantic -Wno-long-long -Wimplicit-fallthrough -Wcovered-switch-default -Wno-noexcept-type -Wnon-virtual-dtor -Wdelete-non-virtual-dtor -Wsuggest-override -Wstring-conversion -fdiagnostics-color -Wall -std=c++14 -Wno-unused-parameter -O3  -arch x86_64 -arch x86_64h -isysroot /Applications/Xcode.app/Contents/Developer/Platforms/MacOSX.platform/Developer/SDKs/MacOSX10.15.sdk    -stdlib=libc++ -mmacosx-version-min=10.10 -isysroot /Applications/Xcode.app/Contents/Developer/Platforms/MacOSX.platform/Developer/SDKs/MacOSX10.15.sdk -fPIC -fno-builtin -fno-exceptions -funwind-tables -fno-stack-protector -fno-sanitize=safe-stack -fvisibility=hidden -fno-lto -O3 -gline-tables-only -fno-modules -Wno-gnu -Wno-variadic-macros -Wno-c99-extensions -Wno-non-virtual-dtor -fno-rtti -Wframe-larger-than=570 -Wglobal-constructors -DSANITIZER_SUPPORTS_WEAK_HOOKS=0 -UNDEBUG -std=c++14 -MD -MT projects/compiler-rt/lib/sanitizer_common/CMakeFiles/RTSanitizerCommonNoHooks.osx.dir/sanitizer_printf.cpp.o -MF projects/compiler-rt/lib/sanitizer_common/CMakeFiles/RTSanitizerCommonNoHooks.osx.dir/sanitizer_printf.cpp.o.d -o projects/compiler-rt/lib/sanitizer_common/CMakeFiles/RTSanitizerCommonNoHooks.osx.dir/sanitizer_printf.cpp.o -c /Users/buildslave/jenkins/workspace/lldb-cmake/llvm-project/compiler-rt/lib/sanitizer_common/sanitizer_printf.cpp
clang-12: warning: argument unused during compilation: '-fmodules-cache-path=/Users/buildslave/jenkins/workspace/lldb-cmake/lldb-build/module.cache' [-Wunused-command-line-argument]
clang-12: warning: argument unused during compilation: '-fcxx-modules' [-Wunused-command-line-argument]
[2153/4868] /Users/buildslave/jenkins/workspace/lldb-cmake/host-compiler/bin/clang++  -DGTEST_HAS_RTTI=0 -D_DEBUG -D__STDC_CONSTANT_MACROS -D__STDC_FORMAT_MACROS -D__STDC_LIMIT_MACROS -Ilib/ToolDrivers/llvm-lib -I/Users/buildslave/jenkins/workspace/lldb-cmake/llvm-project/llvm/lib/ToolDrivers/llvm-lib -Iinclude -I/Users/buildslave/jenkins/workspace/lldb-cmake/llvm-project/llvm/include -Wdocumentation -fPIC -fvisibility-inlines-hidden -Werror=date-time -Werror=unguarded-availability-new -fmodules -fmodules-cache-path=/Users/buildslave/jenkins/workspace/lldb-cmake/lldb-build/module.cache -fcxx-modules -Xclang -fmodules-local-submodule-visibility -Wall -Wextra -Wno-unused-parameter -Wwrite-strings -Wcast-qual -Wmissing-field-initializers -pedantic -Wno-long-long -Wimplicit-fallthrough -Wcovered-switch-default -Wno-noexcept-type -Wnon-virtual-dtor -Wdelete-non-virtual-dtor -Wsuggest-override -Wstring-conversion -fdiagnostics-color -O3  -isysroot /Applications/Xcode.app/Contents/Developer/Platforms/MacOSX.platform/Developer/SDKs/MacOSX10.15.sdk    -fno-exceptions -fno-rtti -UNDEBUG -std=c++14 -MD -MT lib/ToolDrivers/llvm-lib/CMakeFiles/LLVMLibDriver.dir/LibDriver.cpp.o -MF lib/ToolDrivers/llvm-lib/CMakeFiles/LLVMLibDriver.dir/LibDriver.cpp.o.d -o lib/ToolDrivers/llvm-lib/CMakeFiles/LLVMLibDriver.dir/LibDriver.cpp.o -c /Users/buildslave/jenkins/workspace/lldb-cmake/llvm-project/llvm/lib/ToolDrivers/llvm-lib/LibDriver.cpp
[2154/4868] /Users/buildslave/jenkins/workspace/lldb-cmake/host-compiler/bin/clang++  -DGTEST_HAS_RTTI=0 -D_DEBUG -D__STDC_CONSTANT_MACROS -D__STDC_FORMAT_MACROS -D__STDC_LIMIT_MACROS -Ilib/XRay -I/Users/buildslave/jenkins/workspace/lldb-cmake/llvm-project/llvm/lib/XRay -Iinclude -I/Users/buildslave/jenkins/workspace/lldb-cmake/llvm-project/llvm/include -Wdocumentation -fPIC -fvisibility-inlines-hidden -Werror=date-time -Werror=unguarded-availability-new -fmodules -fmodules-cache-path=/Users/buildslave/jenkins/workspace/lldb-cmake/lldb-build/module.cache -fcxx-modules -Xclang -fmodules-local-submodule-visibility -Wall -Wextra -Wno-unused-parameter -Wwrite-strings -Wcast-qual -Wmissing-field-initializers -pedantic -Wno-long-long -Wimplicit-fallthrough -Wcovered-switch-default -Wno-noexcept-type -Wnon-virtual-dtor -Wdelete-non-virtual-dtor -Wsuggest-override -Wstring-conversion -fdiagnostics-color -O3  -isysroot /Applications/Xcode.app/Contents/Developer/Platforms/MacOSX.platform/Developer/SDKs/MacOSX10.15.sdk    -fno-exceptions -fno-rtti -UNDEBUG -std=c++14 -MD -MT lib/XRay/CMakeFiles/LLVMXRay.dir/InstrumentationMap.cpp.o -MF lib/XRay/CMakeFiles/LLVMXRay.dir/InstrumentationMap.cpp.o.d -o lib/XRay/CMakeFiles/LLVMXRay.dir/InstrumentationMap.cpp.o -c /Users/buildslave/jenkins/workspace/lldb-cmake/llvm-project/llvm/lib/XRay/InstrumentationMap.cpp
[2155/4868] /Users/buildslave/jenkins/workspace/lldb-cmake/host-compiler/bin/clang++  -DGTEST_HAS_RTTI=0 -D_DEBUG -D__STDC_CONSTANT_MACROS -D__STDC_FORMAT_MACROS -D__STDC_LIMIT_MACROS -Ilib/Passes -I/Users/buildslave/jenkins/workspace/lldb-cmake/llvm-project/llvm/lib/Passes -Iinclude -I/Users/buildslave/jenkins/workspace/lldb-cmake/llvm-project/llvm/include -Wdocumentation -fPIC -fvisibility-inlines-hidden -Werror=date-time -Werror=unguarded-availability-new -fmodules -fmodules-cache-path=/Users/buildslave/jenkins/workspace/lldb-cmake/lldb-build/module.cache -fcxx-modules -Xclang -fmodules-local-submodule-visibility -Wall -Wextra -Wno-unused-parameter -Wwrite-strings -Wcast-qual -Wmissing-field-initializers -pedantic -Wno-long-long -Wimplicit-fallthrough -Wcovered-switch-default -Wno-noexcept-type -Wnon-virtual-dtor -Wdelete-non-virtual-dtor -Wsuggest-override -Wstring-conversion -fdiagnostics-color -O3  -isysroot /Applications/Xcode.app/Contents/Developer/Platforms/MacOSX.platform/Developer/SDKs/MacOSX10.15.sdk    -fno-exceptions -fno-rtti -UNDEBUG -std=c++14 -MD -MT lib/Passes/CMakeFiles/LLVMPasses.dir/StandardInstrumentations.cpp.o -MF lib/Passes/CMakeFiles/LLVMPasses.dir/StandardInstrumentations.cpp.o.d -o lib/Passes/CMakeFiles/LLVMPasses.dir/StandardInstrumentations.cpp.o -c /Users/buildslave/jenkins/workspace/lldb-cmake/llvm-project/llvm/lib/Passes/StandardInstrumentations.cpp
[2156/4868] /Users/buildslave/jenkins/workspace/lldb-cmake/host-compiler/bin/clang++  -DGTEST_HAS_RTTI=0 -D_DEBUG -D__STDC_CONSTANT_MACROS -D__STDC_FORMAT_MACROS -D__STDC_LIMIT_MACROS -Ilib/ProfileData/Coverage -I/Users/buildslave/jenkins/workspace/lldb-cmake/llvm-project/llvm/lib/ProfileData/Coverage -Iinclude -I/Users/buildslave/jenkins/workspace/lldb-cmake/llvm-project/llvm/include -Wdocumentation -fPIC -fvisibility-inlines-hidden -Werror=date-time -Werror=unguarded-availability-new -fmodules -fmodules-cache-path=/Users/buildslave/jenkins/workspace/lldb-cmake/lldb-build/module.cache -fcxx-modules -Xclang -fmodules-local-submodule-visibility -Wall -Wextra -Wno-unused-parameter -Wwrite-strings -Wcast-qual -Wmissing-field-initializers -pedantic -Wno-long-long -Wimplicit-fallthrough -Wcovered-switch-default -Wno-noexcept-type -Wnon-virtual-dtor -Wdelete-non-virtual-dtor -Wsuggest-override -Wstring-conversion -fdiagnostics-color -O3  -isysroot /Applications/Xcode.app/Contents/Developer/Platforms/MacOSX.platform/Developer/SDKs/MacOSX10.15.sdk    -fno-exceptions -fno-rtti -UNDEBUG -std=c++14 -MD -MT lib/ProfileData/Coverage/CMakeFiles/LLVMCoverage.dir/CoverageMapping.cpp.o -MF lib/ProfileData/Coverage/CMakeFiles/LLVMCoverage.dir/CoverageMapping.cpp.o.d -o lib/ProfileData/Coverage/CMakeFiles/LLVMCoverage.dir/CoverageMapping.cpp.o -c /Users/buildslave/jenkins/workspace/lldb-cmake/llvm-project/llvm/lib/ProfileData/Coverage/CoverageMapping.cpp
[2157/4868] /Users/buildslave/jenkins/workspace/lldb-cmake/host-compiler/bin/clang++  -DGTEST_HAS_RTTI=0 -D_DEBUG -D__STDC_CONSTANT_MACROS -D__STDC_FORMAT_MACROS -D__STDC_LIMIT_MACROS -Ilib/ProfileData/Coverage -I/Users/buildslave/jenkins/workspace/lldb-cmake/llvm-project/llvm/lib/ProfileData/Coverage -Iinclude -I/Users/buildslave/jenkins/workspace/lldb-cmake/llvm-project/llvm/include -Wdocumentation -fPIC -fvisibility-inlines-hidden -Werror=date-time -Werror=unguarded-availability-new -fmodules -fmodules-cache-path=/Users/buildslave/jenkins/workspace/lldb-cmake/lldb-build/module.cache -fcxx-modules -Xclang -fmodules-local-submodule-visibility -Wall -Wextra -Wno-unused-parameter -Wwrite-strings -Wcast-qual -Wmissing-field-initializers -pedantic -Wno-long-long -Wimplicit-fallthrough -Wcovered-switch-default -Wno-noexcept-type -Wnon-virtual-dtor -Wdelete-non-virtual-dtor -Wsuggest-override -Wstring-conversion -fdiagnostics-color -O3  -isysroot /Applications/Xcode.app/Contents/Developer/Platforms/MacOSX.platform/Developer/SDKs/MacOSX10.15.sdk    -fno-exceptions -fno-rtti -UNDEBUG -std=c++14 -MD -MT lib/ProfileData/Coverage/CMakeFiles/LLVMCoverage.dir/CoverageMappingReader.cpp.o -MF lib/ProfileData/Coverage/CMakeFiles/LLVMCoverage.dir/CoverageMappingReader.cpp.o.d -o lib/ProfileData/Coverage/CMakeFiles/LLVMCoverage.dir/CoverageMappingReader.cpp.o -c /Users/buildslave/jenkins/workspace/lldb-cmake/llvm-project/llvm/lib/ProfileData/Coverage/CoverageMappingReader.cpp
[2158/4868] /Users/buildslave/jenkins/workspace/lldb-cmake/host-compiler/bin/clang++  -DGTEST_HAS_RTTI=0 -D_DEBUG -D__STDC_CONSTANT_MACROS -D__STDC_FORMAT_MACROS -D__STDC_LIMIT_MACROS -Ilib/Target/X86 -I/Users/buildslave/jenkins/workspace/lldb-cmake/llvm-project/llvm/lib/Target/X86 -Iinclude -I/Users/buildslave/jenkins/workspace/lldb-cmake/llvm-project/llvm/include -Wdocumentation -fPIC -fvisibility-inlines-hidden -Werror=date-time -Werror=unguarded-availability-new -fmodules -fmodules-cache-path=/Users/buildslave/jenkins/workspace/lldb-cmake/lldb-build/module.cache -fcxx-modules -Xclang -fmodules-local-submodule-visibility -Wall -Wextra -Wno-unused-parameter -Wwrite-strings -Wcast-qual -Wmissing-field-initializers -pedantic -Wno-long-long -Wimplicit-fallthrough -Wcovered-switch-default -Wno-noexcept-type -Wnon-virtual-dtor -Wdelete-non-virtual-dtor -Wsuggest-override -Wstring-conversion -fdiagnostics-color -O3  -isysroot /Applications/Xcode.app/Contents/Developer/Platforms/MacOSX.platform/Developer/SDKs/MacOSX10.15.sdk    -fno-exceptions -fno-rtti -UNDEBUG -std=c++14 -MD -MT lib/Target/X86/CMakeFiles/LLVMX86CodeGen.dir/X86ISelLowering.cpp.o -MF lib/Target/X86/CMakeFiles/LLVMX86CodeGen.dir/X86ISelLowering.cpp.o.d -o lib/Target/X86/CMakeFiles/LLVMX86CodeGen.dir/X86ISelLowering.cpp.o -c /Users/buildslave/jenkins/workspace/lldb-cmake/llvm-project/llvm/lib/Target/X86/X86ISelLowering.cpp
[2159/4868] /Users/buildslave/jenkins/workspace/lldb-cmake/host-compiler/bin/clang++  -DGTEST_HAS_RTTI=0 -D_DEBUG -D__STDC_CONSTANT_MACROS -D__STDC_FORMAT_MACROS -D__STDC_LIMIT_MACROS -Ilib/Passes -I/Users/buildslave/jenkins/workspace/lldb-cmake/llvm-project/llvm/lib/Passes -Iinclude -I/Users/buildslave/jenkins/workspace/lldb-cmake/llvm-project/llvm/include -Wdocumentation -fPIC -fvisibility-inlines-hidden -Werror=date-time -Werror=unguarded-availability-new -fmodules -fmodules-cache-path=/Users/buildslave/jenkins/workspace/lldb-cmake/lldb-build/module.cache -fcxx-modules -Xclang -fmodules-local-submodule-visibility -Wall -Wextra -Wno-unused-parameter -Wwrite-strings -Wcast-qual -Wmissing-field-initializers -pedantic -Wno-long-long -Wimplicit-fallthrough -Wcovered-switch-default -Wno-noexcept-type -Wnon-virtual-dtor -Wdelete-non-virtual-dtor -Wsuggest-override -Wstring-conversion -fdiagnostics-color -O3  -isysroot /Applications/Xcode.app/Contents/Developer/Platforms/MacOSX.platform/Developer/SDKs/MacOSX10.15.sdk    -fno-exceptions -fno-rtti -UNDEBUG -std=c++14 -MD -MT lib/Passes/CMakeFiles/LLVMPasses.dir/PassBuilder.cpp.o -MF lib/Passes/CMakeFiles/LLVMPasses.dir/PassBuilder.cpp.o.d -o lib/Passes/CMakeFiles/LLVMPasses.dir/PassBuilder.cpp.o -c /Users/buildslave/jenkins/workspace/lldb-cmake/llvm-project/llvm/lib/Passes/PassBuilder.cpp
ninja: build stopped: subcommand failed.
Command failed: Command '['/usr/local/bin/ninja', '-v']' returned non-zero exit status 1
Command: ['/usr/local/bin/ninja', '-v']
+ echo 'Retrying. debuginfo-tests may have failed due to high load.'
Retrying. debuginfo-tests may have failed due to high load.
+ sleep 30
+ python llvm-zorg/zorg/jenkins/monorepo_build.py lldb-cmake build --assertions '--projects=clang;libcxx;libcxxabi;compiler-rt;lld;lldb;debuginfo-tests' --compiler-flag=-Wdocumentation --cmake-type=Release
You are using pip version 18.1, however version 20.2.3 is available.
You should consider upgrading via the 'pip install --upgrade pip' command.
You are using pip version 18.1, however version 20.2.3 is available.
You should consider upgrading via the 'pip install --upgrade pip' command.
Dependency met os_version v10.15.5
Dependency met brew cmake v3.17.2
Dependency met brew ninja v1.8.2
Dependency met pip psutil v5.4.5
Dependency met pip six v1.11.0
Dependency met xcode v11.5
Clean

Hide Details

@@@ Clean @@@ Removing module cache: /Users/buildslave/jenkins/workspace/lldb-cmake/lldb-build/module.cache Completed at: 2020-10-01T07:17:26 @@@@@@
Cmake

Hide Details

@@@ Cmake @@@ cd /Users/buildslave/jenkins/workspace/lldb-cmake/lldb-build '/usr/local/bin/cmake' '-G' 'Ninja' '/Users/buildslave/jenkins/workspace/lldb-cmake/llvm-project/llvm' '-DCMAKE_BUILD_TYPE=Release' '-DCMAKE_EXPORT_COMPILE_COMMANDS=ON' '-DCMAKE_INSTALL_PREFIX=/Users/buildslave/jenkins/workspace/lldb-cmake/lldb-install' '-DCMAKE_MAKE_PROGRAM=/usr/local/bin/ninja' '-DLLDB_TEST_USER_ARGS=--arch;x86_64;--build-dir;/Users/buildslave/jenkins/workspace/lldb-cmake/lldb-build/lldb-test-build.noindex;-s=/Users/buildslave/jenkins/workspace/lldb-cmake/test/logs;-t;--env;TERM=vt100' '-DLLDB_ENABLE_PYTHON=On' '-DLLVM_ENABLE_ASSERTIONS:BOOL=TRUE' '-DLLVM_ENABLE_MODULES=On' '-DLLVM_ENABLE_PROJECTS=clang;libcxx;libcxxabi;compiler-rt;lld;lldb;debuginfo-tests' '-DLLVM_LIT_ARGS=-v --time-tests --shuffle --xunit-xml-output=/Users/buildslave/jenkins/workspace/lldb-cmake/test/results.xml -v -j 4' '-DLLVM_VERSION_PATCH=99' '-DCMAKE_C_FLAGS=-Wdocumentation' '-DCMAKE_CXX_FLAGS=-Wdocumentation' '-DCMAKE_C_COMPILER=/Users/buildslave/jenkins/workspace/lldb-cmake/host-compiler/bin/clang' '-DCMAKE_CXX_COMPILER=/Users/buildslave/jenkins/workspace/lldb-cmake/host-compiler/bin/clang++' -- clang project is enabled -- clang-tools-extra project is disabled -- compiler-rt project is enabled -- debuginfo-tests project is enabled -- libc project is disabled -- libclc project is disabled -- libcxx project is enabled -- libcxxabi project is enabled -- libunwind project is disabled -- lld project is enabled -- lldb project is enabled -- mlir project is disabled -- openmp project is disabled -- parallel-libs project is disabled -- polly project is disabled -- pstl project is disabled -- flang project is disabled -- Found libtool - /Applications/Xcode.app/Contents/Developer/Toolchains/XcodeDefault.xctoolchain/usr/bin/libtool -- Found LibXml2: /usr/lib/libxml2.dylib (found version "2.9.4") -- Native target architecture is X86 -- Threads enabled. -- Doxygen disabled. -- Go bindings disabled. -- Ninja version: 1.8.2 -- Found ld64 - /Applications/Xcode.app/Contents/Developer/Toolchains/XcodeDefault.xctoolchain/usr/bin/ld -- Could NOT find OCaml (missing: OCAMLFIND OCAML_VERSION OCAML_STDLIB_PATH) -- Could NOT find OCaml (missing: OCAMLFIND OCAML_VERSION OCAML_STDLIB_PATH) -- OCaml bindings disabled. -- LLVM host triple: x86_64-apple-darwin19.5.0 -- LLVM default target triple: x86_64-apple-darwin19.5.0 -- Building with -fPIC -- Found Python3: /usr/local/Frameworks/Python.framework/Versions/3.7/bin/python3.7 (found version "3.7.1") found components: Interpreter -- Constructing LLVMBuild project information -- Targeting AArch64 -- Targeting AMDGPU -- Targeting ARM -- Targeting AVR -- Targeting BPF -- Targeting Hexagon -- Targeting Lanai -- Targeting Mips -- Targeting MSP430 -- Targeting NVPTX -- Targeting PowerPC -- Targeting RISCV -- Targeting Sparc -- Targeting SystemZ -- Targeting WebAssembly -- Targeting X86 -- Targeting XCore -- Libc++abi will be using libc++ includes from /Users/buildslave/jenkins/workspace/lldb-cmake/llvm-project/libcxxabi/../libcxx/include -- Could not find CrashReporterClient, not linking against it -- Could not find ParallelSTL, libc++abi will not attempt to use it but the build may fail if the libc++ in use needs it to be available. -- Looking for cxxabi.h in /Users/buildslave/jenkins/workspace/lldb-cmake/llvm-project/libcxx/../libcxxabi/include -- Looking for cxxabi.h in /Users/buildslave/jenkins/workspace/lldb-cmake/llvm-project/libcxx/../libcxxabi/include - found -- Looking for __cxxabi_config.h in /Users/buildslave/jenkins/workspace/lldb-cmake/llvm-project/libcxx/../libcxxabi/include -- Looking for __cxxabi_config.h in /Users/buildslave/jenkins/workspace/lldb-cmake/llvm-project/libcxx/../libcxxabi/include - found -- Found OSX_SYSROOT: /Applications/Xcode.app/Contents/Developer/Platforms/MacOSX.platform/Developer/SDKs/MacOSX10.15.sdk -- Got ld supported ARCHES: armv6 armv7 armv7s arm64 arm64e arm64_32 i386 x86_64 x86_64h armv6m armv7k armv7m armv7em -- Toolchain supported arches: armv6;armv7;armv7s;arm64;arm64e;arm64_32;i386;x86_64;x86_64h;armv6m;armv7k;armv7m;armv7em -- Using cached valid architectures for osx. -- OSX supported arches: x86_64;x86_64h -- Using cached valid architectures for iossim. -- ios Simulator supported arches: i386;x86_64 -- Using cached valid architectures for ios. -- ios supported arches: armv6;armv7;armv7s;arm64;armv7k -- Compiler-RT supported architectures: x86_64;x86_64h;i386;armv6;armv7;armv7s;arm64;armv7k -- No arm64 support in /Applications/Xcode.app/Contents/Developer/Platforms/MacOSX.platform/Developer/SDKs/MacOSX10.15.sdk/SDKSettings.plist -- No arm64e support in /Applications/Xcode.app/Contents/Developer/Platforms/MacOSX.platform/Developer/SDKs/MacOSX10.15.sdk/SDKSettings.plist -- Using cached valid architectures for osx. -- OSX supported builtin arches: i386;x86_64;x86_64h -- Using cached valid architectures for iossim. -- ios Simulator supported builtin arches: i386;x86_64 -- Using cached valid architectures for ios. -- ios supported builtin arches: arm64;armv7;armv7k;armv7s -- Builtin supported architectures: i386;x86_64;x86_64h;armv7;armv7k;armv7s;arm64 -- For osx_i386 builtins preferring i386/fp_mode.c to fp_mode.c -- For osx_i386 builtins preferring i386/ashldi3.S to ashldi3.c -- For osx_i386 builtins preferring i386/ashrdi3.S to ashrdi3.c -- For osx_i386 builtins preferring i386/divdi3.S to divdi3.c -- For osx_i386 builtins preferring i386/floatdidf.S to floatdidf.c -- For osx_i386 builtins preferring i386/floatdisf.S to floatdisf.c -- For osx_i386 builtins preferring i386/floatundidf.S to floatundidf.c -- For osx_i386 builtins preferring i386/floatundisf.S to floatundisf.c -- For osx_i386 builtins preferring i386/lshrdi3.S to lshrdi3.c -- For osx_i386 builtins preferring i386/moddi3.S to moddi3.c -- For osx_i386 builtins preferring i386/muldi3.S to muldi3.c -- For osx_i386 builtins preferring i386/udivdi3.S to udivdi3.c -- For osx_i386 builtins preferring i386/umoddi3.S to umoddi3.c -- For osx_i386 builtins preferring i386/floatdixf.S to floatdixf.c -- For osx_i386 builtins preferring i386/floatundixf.S to floatundixf.c -- For osx_x86_64 builtins preferring i386/fp_mode.c to fp_mode.c -- For osx_x86_64 builtins preferring x86_64/floatdidf.c to floatdidf.c -- For osx_x86_64 builtins preferring x86_64/floatdisf.c to floatdisf.c -- For osx_x86_64 builtins preferring x86_64/floatundidf.S to floatundidf.c -- For osx_x86_64 builtins preferring x86_64/floatundisf.S to floatundisf.c -- For osx_x86_64 builtins preferring x86_64/floatdixf.c to floatdixf.c -- For osx_x86_64 builtins preferring x86_64/floatundixf.S to floatundixf.c -- For osx_x86_64h builtins preferring i386/fp_mode.c to fp_mode.c -- For osx_x86_64h builtins preferring x86_64/floatdidf.c to floatdidf.c -- For osx_x86_64h builtins preferring x86_64/floatdisf.c to floatdisf.c -- For osx_x86_64h builtins preferring x86_64/floatundidf.S to floatundidf.c -- For osx_x86_64h builtins preferring x86_64/floatundisf.S to floatundisf.c -- For osx_x86_64h builtins preferring x86_64/floatdixf.c to floatdixf.c -- For osx_x86_64h builtins preferring x86_64/floatundixf.S to floatundixf.c -- For cc_kext_osx_i386 builtins preferring i386/fp_mode.c to fp_mode.c -- For cc_kext_osx_i386 builtins preferring i386/ashldi3.S to ashldi3.c -- For cc_kext_osx_i386 builtins preferring i386/ashrdi3.S to ashrdi3.c -- For cc_kext_osx_i386 builtins preferring i386/divdi3.S to divdi3.c -- For cc_kext_osx_i386 builtins preferring i386/floatdidf.S to floatdidf.c -- For cc_kext_osx_i386 builtins preferring i386/floatdisf.S to floatdisf.c -- For cc_kext_osx_i386 builtins preferring i386/floatundidf.S to floatundidf.c -- For cc_kext_osx_i386 builtins preferring i386/floatundisf.S to floatundisf.c -- For cc_kext_osx_i386 builtins preferring i386/lshrdi3.S to lshrdi3.c -- For cc_kext_osx_i386 builtins preferring i386/moddi3.S to moddi3.c -- For cc_kext_osx_i386 builtins preferring i386/muldi3.S to muldi3.c -- For cc_kext_osx_i386 builtins preferring i386/udivdi3.S to udivdi3.c -- For cc_kext_osx_i386 builtins preferring i386/umoddi3.S to umoddi3.c -- For cc_kext_osx_i386 builtins preferring i386/floatdixf.S to floatdixf.c -- For cc_kext_osx_i386 builtins preferring i386/floatundixf.S to floatundixf.c -- For cc_kext_osx_x86_64 builtins preferring i386/fp_mode.c to fp_mode.c -- For cc_kext_osx_x86_64 builtins preferring x86_64/floatdidf.c to floatdidf.c -- For cc_kext_osx_x86_64 builtins preferring x86_64/floatdisf.c to floatdisf.c -- For cc_kext_osx_x86_64 builtins preferring x86_64/floatundidf.S to floatundidf.c -- For cc_kext_osx_x86_64 builtins preferring x86_64/floatundisf.S to floatundisf.c -- For cc_kext_osx_x86_64 builtins preferring x86_64/floatdixf.c to floatdixf.c -- For cc_kext_osx_x86_64 builtins preferring x86_64/floatundixf.S to floatundixf.c -- For cc_kext_osx_x86_64h builtins preferring i386/fp_mode.c to fp_mode.c -- For cc_kext_osx_x86_64h builtins preferring x86_64/floatdidf.c to floatdidf.c -- For cc_kext_osx_x86_64h builtins preferring x86_64/floatdisf.c to floatdisf.c -- For cc_kext_osx_x86_64h builtins preferring x86_64/floatundidf.S to floatundidf.c -- For cc_kext_osx_x86_64h builtins preferring x86_64/floatundisf.S to floatundisf.c -- For cc_kext_osx_x86_64h builtins preferring x86_64/floatdixf.c to floatdixf.c -- For cc_kext_osx_x86_64h builtins preferring x86_64/floatundixf.S to floatundixf.c -- For iossim_i386 builtins preferring i386/fp_mode.c to fp_mode.c -- For iossim_i386 builtins preferring i386/ashldi3.S to ashldi3.c -- For iossim_i386 builtins preferring i386/ashrdi3.S to ashrdi3.c -- For iossim_i386 builtins preferring i386/divdi3.S to divdi3.c -- For iossim_i386 builtins preferring i386/floatdidf.S to floatdidf.c -- For iossim_i386 builtins preferring i386/floatdisf.S to floatdisf.c -- For iossim_i386 builtins preferring i386/floatundidf.S to floatundidf.c -- For iossim_i386 builtins preferring i386/floatundisf.S to floatundisf.c -- For iossim_i386 builtins preferring i386/lshrdi3.S to lshrdi3.c -- For iossim_i386 builtins preferring i386/moddi3.S to moddi3.c -- For iossim_i386 builtins preferring i386/muldi3.S to muldi3.c -- For iossim_i386 builtins preferring i386/udivdi3.S to udivdi3.c -- For iossim_i386 builtins preferring i386/umoddi3.S to umoddi3.c -- For iossim_i386 builtins preferring i386/floatdixf.S to floatdixf.c -- For iossim_i386 builtins preferring i386/floatundixf.S to floatundixf.c -- For iossim_x86_64 builtins preferring i386/fp_mode.c to fp_mode.c -- For iossim_x86_64 builtins preferring x86_64/floatdidf.c to floatdidf.c -- For iossim_x86_64 builtins preferring x86_64/floatdisf.c to floatdisf.c -- For iossim_x86_64 builtins preferring x86_64/floatundidf.S to floatundidf.c -- For iossim_x86_64 builtins preferring x86_64/floatundisf.S to floatundisf.c -- For iossim_x86_64 builtins preferring x86_64/floatdixf.c to floatdixf.c -- For iossim_x86_64 builtins preferring x86_64/floatundixf.S to floatundixf.c -- For ios_arm64 builtins preferring aarch64/fp_mode.c to fp_mode.c -- For ios_armv7 builtins preferring arm/fp_mode.c to fp_mode.c -- For ios_armv7 builtins preferring arm/comparesf2.S to comparesf2.c -- For ios_armv7k builtins preferring arm/fp_mode.c to fp_mode.c -- For ios_armv7k builtins preferring arm/bswapdi2.S to bswapdi2.c -- For ios_armv7k builtins preferring arm/bswapsi2.S to bswapsi2.c -- For ios_armv7k builtins preferring arm/clzdi2.S to clzdi2.c -- For ios_armv7k builtins preferring arm/clzsi2.S to clzsi2.c -- For ios_armv7k builtins preferring arm/comparesf2.S to comparesf2.c -- For ios_armv7k builtins preferring arm/divmodsi4.S to divmodsi4.c -- For ios_armv7k builtins preferring arm/divsi3.S to divsi3.c -- For ios_armv7k builtins preferring arm/modsi3.S to modsi3.c -- For ios_armv7k builtins preferring arm/udivmodsi4.S to udivmodsi4.c -- For ios_armv7k builtins preferring arm/udivsi3.S to udivsi3.c -- For ios_armv7k builtins preferring arm/umodsi3.S to umodsi3.c -- For ios_armv7s builtins preferring arm/fp_mode.c to fp_mode.c -- For ios_armv7s builtins preferring arm/comparesf2.S to comparesf2.c -- For cc_kext_ios_arm64 builtins preferring aarch64/fp_mode.c to fp_mode.c -- For cc_kext_ios_armv7 builtins preferring arm/fp_mode.c to fp_mode.c -- For cc_kext_ios_armv7 builtins preferring arm/bswapdi2.S to bswapdi2.c -- For cc_kext_ios_armv7 builtins preferring arm/bswapsi2.S to bswapsi2.c -- For cc_kext_ios_armv7 builtins preferring arm/clzdi2.S to clzdi2.c -- For cc_kext_ios_armv7 builtins preferring arm/clzsi2.S to clzsi2.c -- For cc_kext_ios_armv7 builtins preferring arm/comparesf2.S to comparesf2.c -- For cc_kext_ios_armv7 builtins preferring arm/divmodsi4.S to divmodsi4.c -- For cc_kext_ios_armv7 builtins preferring arm/divsi3.S to divsi3.c -- For cc_kext_ios_armv7 builtins preferring arm/modsi3.S to modsi3.c -- For cc_kext_ios_armv7 builtins preferring arm/udivmodsi4.S to udivmodsi4.c -- For cc_kext_ios_armv7 builtins preferring arm/udivsi3.S to udivsi3.c -- For cc_kext_ios_armv7 builtins preferring arm/umodsi3.S to umodsi3.c -- For cc_kext_ios_armv7k builtins preferring arm/fp_mode.c to fp_mode.c -- For cc_kext_ios_armv7k builtins preferring arm/bswapdi2.S to bswapdi2.c -- For cc_kext_ios_armv7k builtins preferring arm/bswapsi2.S to bswapsi2.c -- For cc_kext_ios_armv7k builtins preferring arm/clzdi2.S to clzdi2.c -- For cc_kext_ios_armv7k builtins preferring arm/clzsi2.S to clzsi2.c -- For cc_kext_ios_armv7k builtins preferring arm/comparesf2.S to comparesf2.c -- For cc_kext_ios_armv7k builtins preferring arm/divmodsi4.S to divmodsi4.c -- For cc_kext_ios_armv7k builtins preferring arm/divsi3.S to divsi3.c -- For cc_kext_ios_armv7k builtins preferring arm/modsi3.S to modsi3.c -- For cc_kext_ios_armv7k builtins preferring arm/udivmodsi4.S to udivmodsi4.c -- For cc_kext_ios_armv7k builtins preferring arm/udivsi3.S to udivsi3.c -- For cc_kext_ios_armv7k builtins preferring arm/umodsi3.S to umodsi3.c -- For cc_kext_ios_armv7s builtins preferring arm/fp_mode.c to fp_mode.c -- For cc_kext_ios_armv7s builtins preferring arm/bswapdi2.S to bswapdi2.c -- For cc_kext_ios_armv7s builtins preferring arm/bswapsi2.S to bswapsi2.c -- For cc_kext_ios_armv7s builtins preferring arm/clzdi2.S to clzdi2.c -- For cc_kext_ios_armv7s builtins preferring arm/clzsi2.S to clzsi2.c -- For cc_kext_ios_armv7s builtins preferring arm/comparesf2.S to comparesf2.c -- For cc_kext_ios_armv7s builtins preferring arm/divmodsi4.S to divmodsi4.c -- For cc_kext_ios_armv7s builtins preferring arm/divsi3.S to divsi3.c -- For cc_kext_ios_armv7s builtins preferring arm/modsi3.S to modsi3.c -- For cc_kext_ios_armv7s builtins preferring arm/udivmodsi4.S to udivmodsi4.c -- For cc_kext_ios_armv7s builtins preferring arm/udivsi3.S to udivsi3.c -- For cc_kext_ios_armv7s builtins preferring arm/umodsi3.S to umodsi3.c -- For macho_embedded_armv6m builtins preferring arm/divsi3.S to divsi3.c -- For macho_embedded_armv6m builtins preferring arm/udivsi3.S to udivsi3.c -- For macho_embedded_armv6m builtins preferring arm/comparesf2.S to comparesf2.c -- For macho_embedded_armv6m builtins preferring arm/addsf3.S to addsf3.c -- For macho_embedded_armv7m builtins preferring arm/clzdi2.S to clzdi2.c -- For macho_embedded_armv7m builtins preferring arm/clzsi2.S to clzsi2.c -- For macho_embedded_armv7m builtins preferring arm/comparesf2.S to comparesf2.c -- For macho_embedded_armv7m builtins preferring arm/divmodsi4.S to divmodsi4.c -- For macho_embedded_armv7m builtins preferring arm/divsi3.S to divsi3.c -- For macho_embedded_armv7m builtins preferring arm/modsi3.S to modsi3.c -- For macho_embedded_armv7m builtins preferring arm/udivmodsi4.S to udivmodsi4.c -- For macho_embedded_armv7m builtins preferring arm/udivsi3.S to udivsi3.c -- For macho_embedded_armv7m builtins preferring arm/umodsi3.S to umodsi3.c -- For macho_embedded_armv7em builtins preferring arm/clzdi2.S to clzdi2.c -- For macho_embedded_armv7em builtins preferring arm/clzsi2.S to clzsi2.c -- For macho_embedded_armv7em builtins preferring arm/comparesf2.S to comparesf2.c -- For macho_embedded_armv7em builtins preferring arm/divmodsi4.S to divmodsi4.c -- For macho_embedded_armv7em builtins preferring arm/divsi3.S to divsi3.c -- For macho_embedded_armv7em builtins preferring arm/modsi3.S to modsi3.c -- For macho_embedded_armv7em builtins preferring arm/udivmodsi4.S to udivmodsi4.c -- For macho_embedded_armv7em builtins preferring arm/udivsi3.S to udivsi3.c -- For macho_embedded_armv7em builtins preferring arm/umodsi3.S to umodsi3.c -- For macho_embedded_armv7 builtins preferring arm/clzdi2.S to clzdi2.c -- For macho_embedded_armv7 builtins preferring arm/clzsi2.S to clzsi2.c -- For macho_embedded_armv7 builtins preferring arm/comparesf2.S to comparesf2.c -- For macho_embedded_armv7 builtins preferring arm/divmodsi4.S to divmodsi4.c -- For macho_embedded_armv7 builtins preferring arm/divsi3.S to divsi3.c -- For macho_embedded_armv7 builtins preferring arm/modsi3.S to modsi3.c -- For macho_embedded_armv7 builtins preferring arm/udivmodsi4.S to udivmodsi4.c -- For macho_embedded_armv7 builtins preferring arm/udivsi3.S to udivsi3.c -- For macho_embedded_armv7 builtins preferring arm/umodsi3.S to umodsi3.c -- For macho_embedded_i386 builtins preferring i386/ashldi3.S to ashldi3.c -- For macho_embedded_i386 builtins preferring i386/ashrdi3.S to ashrdi3.c -- For macho_embedded_i386 builtins preferring i386/divdi3.S to divdi3.c -- For macho_embedded_i386 builtins preferring i386/floatdidf.S to floatdidf.c -- For macho_embedded_i386 builtins preferring i386/floatdisf.S to floatdisf.c -- For macho_embedded_i386 builtins preferring i386/floatundidf.S to floatundidf.c -- For macho_embedded_i386 builtins preferring i386/floatundisf.S to floatundisf.c -- For macho_embedded_i386 builtins preferring i386/lshrdi3.S to lshrdi3.c -- For macho_embedded_i386 builtins preferring i386/moddi3.S to moddi3.c -- For macho_embedded_i386 builtins preferring i386/muldi3.S to muldi3.c -- For macho_embedded_i386 builtins preferring i386/udivdi3.S to udivdi3.c -- For macho_embedded_i386 builtins preferring i386/umoddi3.S to umoddi3.c -- For macho_embedded_x86_64 builtins preferring x86_64/floatdidf.c to floatdidf.c -- For macho_embedded_x86_64 builtins preferring x86_64/floatdisf.c to floatdisf.c -- For macho_embedded_x86_64 builtins preferring x86_64/floatundidf.S to floatundidf.c -- For macho_embedded_x86_64 builtins preferring x86_64/floatundisf.S to floatundisf.c -- No arm64 support in /Applications/Xcode.app/Contents/Developer/Platforms/MacOSX.platform/Developer/SDKs/MacOSX10.15.sdk/SDKSettings.plist -- No arm64e support in /Applications/Xcode.app/Contents/Developer/Platforms/MacOSX.platform/Developer/SDKs/MacOSX10.15.sdk/SDKSettings.plist -- Using cached valid architectures for osx. -- OSX supported builtin arches: i386;x86_64;x86_64h -- Using cached valid architectures for iossim. -- ios Simulator supported builtin arches: i386;x86_64 -- Using cached valid architectures for ios. -- ios supported builtin arches: arm64;armv7;armv7k;armv7s -- Builtin supported architectures: i386;x86_64;x86_64h;armv7;armv7k;armv7s;arm64 -- check-interception does nothing. -- Generated Sanitizer SUPPORTED_TOOLS list on "Darwin" is "asan;lsan;tsan;ubsan" -- sanitizer_common tests on "Darwin" will run against "asan;lsan;tsan;ubsan" -- Clang version: 12.0.99 -- Host linker version: 556.6 -- LLD version: 12.0.99 -- Enable editline support in LLDB: TRUE -- Enable curses support in LLDB: TRUE -- Enable LZMA compression support in LLDB: TRUE -- Could NOT find Lua (missing: LUA_LIBRARIES LUA_INCLUDE_DIR) (Required is at least version "5.3") -- Could NOT find LuaAndSwig (missing: LUA_LIBRARIES LUA_INCLUDE_DIR) -- Enable Lua scripting support in LLDB: FALSE -- Found Python3: /usr/local/Frameworks/Python.framework/Versions/3.7/bin/python3.7 (found version "3.7.1") found components: Interpreter Development -- Enable Python scripting support in LLDB: TRUE -- Found LibXml2: /usr/lib/libxml2.dylib (found suitable version "2.9.4", minimum required is "2.8") -- Enable Libxml 2 support in LLDB: TRUE -- LLDB version: 12.0.99git -- Symbols (liblldb): exporting all symbols from the lldb namespace CMake Warning at /Users/buildslave/jenkins/workspace/lldb-cmake/llvm-project/lldb/tools/debugserver/source/CMakeLists.txt:44 (message): Development code sign identity not found: 'lldb_codesign' This will cause failures in the test suite.Pass '-DLLDB_USE_SYSTEM_DEBUGSERVER=ON' to use the system one instead.See 'Code Signing on macOS' in the documentation. Call Stack (most recent call first): /Users/buildslave/jenkins/workspace/lldb-cmake/llvm-project/lldb/tools/debugserver/source/CMakeLists.txt:92 (get_debugserver_codesign_identity)

Hide Details

Hide Details

-- LLDB debugserver energy support is disabled -- Could NOT find Doxygen (missing: DOXYGEN_EXECUTABLE) -- Could NOT find epydoc -- LLDB Tests use just-built debugserver: /Users/buildslave/jenkins/workspace/lldb-cmake/lldb-build/./bin/debugserver -- Registering Bye as a pass plugin (static build: OFF) -- LLVM FileCheck Found: /usr/local/bin/FileCheck -- Version: 0.0.0 -- Performing Test HAVE_THREAD_SAFETY_ATTRIBUTES -- failed to compile -- Performing Test HAVE_GNU_POSIX_REGEX -- failed to compile -- Performing Test HAVE_POSIX_REGEX -- success -- Performing Test HAVE_STEADY_CLOCK -- success -- Configuring done -- Generating done -- Build files have been written to: /Users/buildslave/jenkins/workspace/lldb-cmake/lldb-build Completed at: 2020-10-01T07:18:11 @@@@@@
Build

Hide Details

@@@ Build @@@ cd /Users/buildslave/jenkins/workspace/lldb-cmake/lldb-build '/usr/local/bin/ninja' '-v' [1/2710] : && "/Applications/Xcode.app/Contents/Developer/Toolchains/XcodeDefault.xctoolchain/usr/bin/libtool" -static -no_warning_for_no_symbols -o lib/libLLVMLibDriver.a lib/ToolDrivers/llvm-lib/CMakeFiles/LLVMLibDriver.dir/LibDriver.cpp.o && : [2/2710] : && "/Applications/Xcode.app/Contents/Developer/Toolchains/XcodeDefault.xctoolchain/usr/bin/libtool" -static -no_warning_for_no_symbols -o lib/libLLVMTarget.a lib/Target/CMakeFiles/LLVMTarget.dir/Target.cpp.o lib/Target/CMakeFiles/LLVMTarget.dir/TargetIntrinsicInfo.cpp.o lib/Target/CMakeFiles/LLVMTarget.dir/TargetLoweringObjectFile.cpp.o lib/Target/CMakeFiles/LLVMTarget.dir/TargetMachine.cpp.o lib/Target/CMakeFiles/LLVMTarget.dir/TargetMachineC.cpp.o && : [3/2710] : && "/Applications/Xcode.app/Contents/Developer/Toolchains/XcodeDefault.xctoolchain/usr/bin/libtool" -static -no_warning_for_no_symbols -o lib/libLLVMCoverage.a lib/ProfileData/Coverage/CMakeFiles/LLVMCoverage.dir/CoverageMapping.cpp.o lib/ProfileData/Coverage/CMakeFiles/LLVMCoverage.dir/CoverageMappingWriter.cpp.o lib/ProfileData/Coverage/CMakeFiles/LLVMCoverage.dir/CoverageMappingReader.cpp.o && : [4/2710] : && "/Applications/Xcode.app/Contents/Developer/Toolchains/XcodeDefault.xctoolchain/usr/bin/libtool" -static -no_warning_for_no_symbols -o lib/libLLVMBitWriter.a lib/Bitcode/Writer/CMakeFiles/LLVMBitWriter.dir/BitWriter.cpp.o lib/Bitcode/Writer/CMakeFiles/LLVMBitWriter.dir/BitcodeWriter.cpp.o lib/Bitcode/Writer/CMakeFiles/LLVMBitWriter.dir/BitcodeWriterPass.cpp.o lib/Bitcode/Writer/CMakeFiles/LLVMBitWriter.dir/ValueEnumerator.cpp.o && : [5/2710] : && "/Applications/Xcode.app/Contents/Developer/Toolchains/XcodeDefault.xctoolchain/usr/bin/libtool" -static -no_warning_for_no_symbols -o lib/libLLVMExecutionEngine.a lib/ExecutionEngine/CMakeFiles/LLVMExecutionEngine.dir/ExecutionEngine.cpp.o lib/ExecutionEngine/CMakeFiles/LLVMExecutionEngine.dir/ExecutionEngineBindings.cpp.o lib/ExecutionEngine/CMakeFiles/LLVMExecutionEngine.dir/GDBRegistrationListener.cpp.o lib/ExecutionEngine/CMakeFiles/LLVMExecutionEngine.dir/SectionMemoryManager.cpp.o lib/ExecutionEngine/CMakeFiles/LLVMExecutionEngine.dir/TargetSelect.cpp.o && : [6/2710] : && "/Applications/Xcode.app/Contents/Developer/Toolchains/XcodeDefault.xctoolchain/usr/bin/libtool" -static -no_warning_for_no_symbols -o lib/libLLVMMCJIT.a lib/ExecutionEngine/MCJIT/CMakeFiles/LLVMMCJIT.dir/MCJIT.cpp.o && : [7/2710] : && "/Applications/Xcode.app/Contents/Developer/Toolchains/XcodeDefault.xctoolchain/usr/bin/libtool" -static -no_warning_for_no_symbols -o lib/libLLVMXRay.a lib/XRay/CMakeFiles/LLVMXRay.dir/BlockIndexer.cpp.o lib/XRay/CMakeFiles/LLVMXRay.dir/BlockPrinter.cpp.o lib/XRay/CMakeFiles/LLVMXRay.dir/BlockVerifier.cpp.o lib/XRay/CMakeFiles/LLVMXRay.dir/FDRRecordProducer.cpp.o lib/XRay/CMakeFiles/LLVMXRay.dir/FDRRecords.cpp.o lib/XRay/CMakeFiles/LLVMXRay.dir/FDRTraceExpander.cpp.o lib/XRay/CMakeFiles/LLVMXRay.dir/FDRTraceWriter.cpp.o lib/XRay/CMakeFiles/LLVMXRay.dir/FileHeaderReader.cpp.o lib/XRay/CMakeFiles/LLVMXRay.dir/InstrumentationMap.cpp.o lib/XRay/CMakeFiles/LLVMXRay.dir/LogBuilderConsumer.cpp.o lib/XRay/CMakeFiles/LLVMXRay.dir/Profile.cpp.o lib/XRay/CMakeFiles/LLVMXRay.dir/RecordInitializer.cpp.o lib/XRay/CMakeFiles/LLVMXRay.dir/RecordPrinter.cpp.o lib/XRay/CMakeFiles/LLVMXRay.dir/Trace.cpp.o && : [8/2710] /Users/buildslave/jenkins/workspace/lldb-cmake/host-compiler/bin/clang++ -DHAVE_RPC_XDR_H=0 -D_DEBUG -D__STDC_CONSTANT_MACROS -D__STDC_FORMAT_MACROS -D__STDC_LIMIT_MACROS -Iprojects/compiler-rt/lib/sanitizer_common -I/Users/buildslave/jenkins/workspace/lldb-cmake/llvm-project/compiler-rt/lib/sanitizer_common -Iinclude -I/Users/buildslave/jenkins/workspace/lldb-cmake/llvm-project/llvm/include -I/Users/buildslave/jenkins/workspace/lldb-cmake/llvm-project/compiler-rt/lib/sanitizer_common/.. -Wdocumentation -fPIC -fvisibility-inlines-hidden -Werror=date-time -Werror=unguarded-availability-new -fmodules -fmodules-cache-path=/Users/buildslave/jenkins/workspace/lldb-cmake/lldb-build/module.cache -fcxx-modules -Xclang -fmodules-local-submodule-visibility -Wall -Wextra -Wno-unused-parameter -Wwrite-strings -Wcast-qual -Wmissing-field-initializers -pedantic -Wno-long-long -Wimplicit-fallthrough -Wcovered-switch-default -Wno-noexcept-type -Wnon-virtual-dtor -Wdelete-non-virtual-dtor -Wsuggest-override -Wstring-conversion -fdiagnostics-color -Wall -std=c++14 -Wno-unused-parameter -O3 -arch i386 -arch x86_64 -isysroot /Applications/Xcode.app/Contents/Developer/Platforms/MacOSX.platform/Developer/SDKs/MacOSX10.15.sdk -stdlib=libc++ -mios-simulator-version-min=9.0 -isysroot /Applications/Xcode.app/Contents/Developer/Platforms/iPhoneSimulator.platform/Developer/SDKs/iPhoneSimulator13.5.sdk -fPIC -fno-builtin -fno-exceptions -funwind-tables -fno-stack-protector -fno-sanitize=safe-stack -fvisibility=hidden -fno-lto -O3 -gline-tables-only -fno-modules -Wno-gnu -Wno-variadic-macros -Wno-c99-extensions -Wno-non-virtual-dtor -fno-rtti -Wframe-larger-than=570 -Wglobal-constructors -UNDEBUG -std=c++14 -MD -MT projects/compiler-rt/lib/sanitizer_common/CMakeFiles/RTSanitizerCommon.iossim.dir/sanitizer_errno.cpp.o -MF projects/compiler-rt/lib/sanitizer_common/CMakeFiles/RTSanitizerCommon.iossim.dir/sanitizer_errno.cpp.o.d -o projects/compiler-rt/lib/sanitizer_common/CMakeFiles/RTSanitizerCommon.iossim.dir/sanitizer_errno.cpp.o -c /Users/buildslave/jenkins/workspace/lldb-cmake/llvm-project/compiler-rt/lib/sanitizer_common/sanitizer_errno.cpp clang-12: warning: argument unused during compilation: '-fmodules-cache-path=/Users/buildslave/jenkins/workspace/lldb-cmake/lldb-build/module.cache' [-Wunused-command-line-argument] clang-12: warning: argument unused during compilation: '-fcxx-modules' [-Wunused-command-line-argument] [9/2710] /Users/buildslave/jenkins/workspace/lldb-cmake/host-compiler/bin/clang++ -DHAVE_RPC_XDR_H=0 -D_DEBUG -D__STDC_CONSTANT_MACROS -D__STDC_FORMAT_MACROS -D__STDC_LIMIT_MACROS -Iprojects/compiler-rt/lib/sanitizer_common -I/Users/buildslave/jenkins/workspace/lldb-cmake/llvm-project/compiler-rt/lib/sanitizer_common -Iinclude -I/Users/buildslave/jenkins/workspace/lldb-cmake/llvm-project/llvm/include -I/Users/buildslave/jenkins/workspace/lldb-cmake/llvm-project/compiler-rt/lib/sanitizer_common/.. -Wdocumentation -fPIC -fvisibility-inlines-hidden -Werror=date-time -Werror=unguarded-availability-new -fmodules -fmodules-cache-path=/Users/buildslave/jenkins/workspace/lldb-cmake/lldb-build/module.cache -fcxx-modules -Xclang -fmodules-local-submodule-visibility -Wall -Wextra -Wno-unused-parameter -Wwrite-strings -Wcast-qual -Wmissing-field-initializers -pedantic -Wno-long-long -Wimplicit-fallthrough -Wcovered-switch-default -Wno-noexcept-type -Wnon-virtual-dtor -Wdelete-non-virtual-dtor -Wsuggest-override -Wstring-conversion -fdiagnostics-color -Wall -std=c++14 -Wno-unused-parameter -O3 -arch x86_64 -arch x86_64h -isysroot /Applications/Xcode.app/Contents/Developer/Platforms/MacOSX.platform/Developer/SDKs/MacOSX10.15.sdk -stdlib=libc++ -mmacosx-version-min=10.10 -isysroot /Applications/Xcode.app/Contents/Developer/Platforms/MacOSX.platform/Developer/SDKs/MacOSX10.15.sdk -fPIC -fno-builtin -fno-exceptions -funwind-tables -fno-stack-protector -fno-sanitize=safe-stack -fvisibility=hidden -fno-lto -O3 -gline-tables-only -fno-modules -Wno-gnu -Wno-variadic-macros -Wno-c99-extensions -Wno-non-virtual-dtor -fno-rtti -Wframe-larger-than=570 -Wglobal-constructors -UNDEBUG -std=c++14 -MD -MT projects/compiler-rt/lib/sanitizer_common/CMakeFiles/RTSanitizerCommonSymbolizer.osx.dir/sanitizer_stackdepot.cpp.o -MF projects/compiler-rt/lib/sanitizer_common/CMakeFiles/RTSanitizerCommonSymbolizer.osx.dir/sanitizer_stackdepot.cpp.o.d -o projects/compiler-rt/lib/sanitizer_common/CMakeFiles/RTSanitizerCommonSymbolizer.osx.dir/sanitizer_stackdepot.cpp.o -c /Users/buildslave/jenkins/workspace/lldb-cmake/llvm-project/compiler-rt/lib/sanitizer_common/sanitizer_stackdepot.cpp clang-12: warning: argument unused during compilation: '-fmodules-cache-path=/Users/buildslave/jenkins/workspace/lldb-cmake/lldb-build/module.cache' [-Wunused-command-line-argument] clang-12: warning: argument unused during compilation: '-fcxx-modules' [-Wunused-command-line-argument] [10/2710] : && /Users/buildslave/jenkins/workspace/lldb-cmake/host-compiler/bin/clang++ -Wdocumentation -fPIC -fvisibility-inlines-hidden -Werror=date-time -Werror=unguarded-availability-new -fmodules -fmodules-cache-path=/Users/buildslave/jenkins/workspace/lldb-cmake/lldb-build/module.cache -fcxx-modules -Xclang -fmodules-local-submodule-visibility -Wall -Wextra -Wno-unused-parameter -Wwrite-strings -Wcast-qual -Wmissing-field-initializers -Wno-long-long -Wimplicit-fallthrough -Wcovered-switch-default -Wno-noexcept-type -Wnon-virtual-dtor -Wdelete-non-virtual-dtor -Wsuggest-override -Wstring-conversion -fdiagnostics-color -O3 -isysroot /Applications/Xcode.app/Contents/Developer/Platforms/MacOSX.platform/Developer/SDKs/MacOSX10.15.sdk -dynamiclib -Wl,-headerpad_max_install_names -compatibility_version 1.0.0 -current_version 1.0.0 -o lib/libc++.1.0.dylib -install_name @rpath/libc++.1.dylib projects/libcxx/src/CMakeFiles/cxx_shared.dir/algorithm.cpp.o projects/libcxx/src/CMakeFiles/cxx_shared.dir/any.cpp.o projects/libcxx/src/CMakeFiles/cxx_shared.dir/atomic.cpp.o projects/libcxx/src/CMakeFiles/cxx_shared.dir/barrier.cpp.o projects/libcxx/src/CMakeFiles/cxx_shared.dir/bind.cpp.o projects/libcxx/src/CMakeFiles/cxx_shared.dir/charconv.cpp.o projects/libcxx/src/CMakeFiles/cxx_shared.dir/chrono.cpp.o projects/libcxx/src/CMakeFiles/cxx_shared.dir/condition_variable.cpp.o projects/libcxx/src/CMakeFiles/cxx_shared.dir/condition_variable_destructor.cpp.o projects/libcxx/src/CMakeFiles/cxx_shared.dir/debug.cpp.o projects/libcxx/src/CMakeFiles/cxx_shared.dir/exception.cpp.o projects/libcxx/src/CMakeFiles/cxx_shared.dir/functional.cpp.o projects/libcxx/src/CMakeFiles/cxx_shared.dir/future.cpp.o projects/libcxx/src/CMakeFiles/cxx_shared.dir/hash.cpp.o projects/libcxx/src/CMakeFiles/cxx_shared.dir/ios.cpp.o projects/libcxx/src/CMakeFiles/cxx_shared.dir/iostream.cpp.o projects/libcxx/src/CMakeFiles/cxx_shared.dir/locale.cpp.o projects/libcxx/src/CMakeFiles/cxx_shared.dir/memory.cpp.o projects/libcxx/src/CMakeFiles/cxx_shared.dir/mutex.cpp.o projects/libcxx/src/CMakeFiles/cxx_shared.dir/mutex_destructor.cpp.o projects/libcxx/src/CMakeFiles/cxx_shared.dir/new.cpp.o projects/libcxx/src/CMakeFiles/cxx_shared.dir/optional.cpp.o projects/libcxx/src/CMakeFiles/cxx_shared.dir/random.cpp.o projects/libcxx/src/CMakeFiles/cxx_shared.dir/random_shuffle.cpp.o projects/libcxx/src/CMakeFiles/cxx_shared.dir/regex.cpp.o projects/libcxx/src/CMakeFiles/cxx_shared.dir/shared_mutex.cpp.o projects/libcxx/src/CMakeFiles/cxx_shared.dir/stdexcept.cpp.o projects/libcxx/src/CMakeFiles/cxx_shared.dir/string.cpp.o projects/libcxx/src/CMakeFiles/cxx_shared.dir/strstream.cpp.o projects/libcxx/src/CMakeFiles/cxx_shared.dir/system_error.cpp.o projects/libcxx/src/CMakeFiles/cxx_shared.dir/thread.cpp.o projects/libcxx/src/CMakeFiles/cxx_shared.dir/typeinfo.cpp.o projects/libcxx/src/CMakeFiles/cxx_shared.dir/utility.cpp.o projects/libcxx/src/CMakeFiles/cxx_shared.dir/valarray.cpp.o projects/libcxx/src/CMakeFiles/cxx_shared.dir/variant.cpp.o projects/libcxx/src/CMakeFiles/cxx_shared.dir/vector.cpp.o projects/libcxx/src/CMakeFiles/cxx_shared.dir/filesystem/operations.cpp.o projects/libcxx/src/CMakeFiles/cxx_shared.dir/filesystem/directory_iterator.cpp.o projects/libcxx/src/CMakeFiles/cxx_shared.dir/filesystem/int128_builtins.cpp.o -Wl,-rpath,@loader_path/../lib -nodefaultlibs -lSystem -lc lib/libc++abi.1.0.dylib -Wl,-unexported_symbols_list,/Users/buildslave/jenkins/workspace/lldb-cmake/llvm-project/libcxx/src/../lib/libc++unexp.exp -Wl,-reexported_symbols_list,/Users/buildslave/jenkins/workspace/lldb-cmake/llvm-project/libcxx/src/../lib/libc++abi.v2.exp -Wl,-force_symbols_not_weak_list,/Users/buildslave/jenkins/workspace/lldb-cmake/llvm-project/libcxx/src/../lib/notweak.exp -Wl,-force_symbols_weak_list,/Users/buildslave/jenkins/workspace/lldb-cmake/llvm-project/libcxx/src/../lib/weak.exp -Wl,-reexported_symbols_list,/Users/buildslave/jenkins/workspace/lldb-cmake/llvm-project/libcxxabi/src/../lib/new-delete.exp -Wl,-reexported_symbols_list,/Users/buildslave/jenkins/workspace/lldb-cmake/llvm-project/libcxxabi/src/../lib/exceptions.exp -Wl,-reexported_symbols_list,/Users/buildslave/jenkins/workspace/lldb-cmake/llvm-project/libcxxabi/src/../lib/personality-v0.exp && : FAILED: lib/libc++.1.0.dylib : && /Users/buildslave/jenkins/workspace/lldb-cmake/host-compiler/bin/clang++ -Wdocumentation -fPIC -fvisibility-inlines-hidden -Werror=date-time -Werror=unguarded-availability-new -fmodules -fmodules-cache-path=/Users/buildslave/jenkins/workspace/lldb-cmake/lldb-build/module.cache -fcxx-modules -Xclang -fmodules-local-submodule-visibility -Wall -Wextra -Wno-unused-parameter -Wwrite-strings -Wcast-qual -Wmissing-field-initializers -Wno-long-long -Wimplicit-fallthrough -Wcovered-switch-default -Wno-noexcept-type -Wnon-virtual-dtor -Wdelete-non-virtual-dtor -Wsuggest-override -Wstring-conversion -fdiagnostics-color -O3 -isysroot /Applications/Xcode.app/Contents/Developer/Platforms/MacOSX.platform/Developer/SDKs/MacOSX10.15.sdk -dynamiclib -Wl,-headerpad_max_install_names -compatibility_version 1.0.0 -current_version 1.0.0 -o lib/libc++.1.0.dylib -install_name @rpath/libc++.1.dylib projects/libcxx/src/CMakeFiles/cxx_shared.dir/algorithm.cpp.o projects/libcxx/src/CMakeFiles/cxx_shared.dir/any.cpp.o projects/libcxx/src/CMakeFiles/cxx_shared.dir/atomic.cpp.o projects/libcxx/src/CMakeFiles/cxx_shared.dir/barrier.cpp.o projects/libcxx/src/CMakeFiles/cxx_shared.dir/bind.cpp.o projects/libcxx/src/CMakeFiles/cxx_shared.dir/charconv.cpp.o projects/libcxx/src/CMakeFiles/cxx_shared.dir/chrono.cpp.o projects/libcxx/src/CMakeFiles/cxx_shared.dir/condition_variable.cpp.o projects/libcxx/src/CMakeFiles/cxx_shared.dir/condition_variable_destructor.cpp.o projects/libcxx/src/CMakeFiles/cxx_shared.dir/debug.cpp.o projects/libcxx/src/CMakeFiles/cxx_shared.dir/exception.cpp.o projects/libcxx/src/CMakeFiles/cxx_shared.dir/functional.cpp.o projects/libcxx/src/CMakeFiles/cxx_shared.dir/future.cpp.o projects/libcxx/src/CMakeFiles/cxx_shared.dir/hash.cpp.o projects/libcxx/src/CMakeFiles/cxx_shared.dir/ios.cpp.o projects/libcxx/src/CMakeFiles/cxx_shared.dir/iostream.cpp.o projects/libcxx/src/CMakeFiles/cxx_shared.dir/locale.cpp.o projects/libcxx/src/CMakeFiles/cxx_shared.dir/memory.cpp.o projects/libcxx/src/CMakeFiles/cxx_shared.dir/mutex.cpp.o projects/libcxx/src/CMakeFiles/cxx_shared.dir/mutex_destructor.cpp.o projects/libcxx/src/CMakeFiles/cxx_shared.dir/new.cpp.o projects/libcxx/src/CMakeFiles/cxx_shared.dir/optional.cpp.o projects/libcxx/src/CMakeFiles/cxx_shared.dir/random.cpp.o projects/libcxx/src/CMakeFiles/cxx_shared.dir/random_shuffle.cpp.o projects/libcxx/src/CMakeFiles/cxx_shared.dir/regex.cpp.o projects/libcxx/src/CMakeFiles/cxx_shared.dir/shared_mutex.cpp.o projects/libcxx/src/CMakeFiles/cxx_shared.dir/stdexcept.cpp.o projects/libcxx/src/CMakeFiles/cxx_shared.dir/string.cpp.o projects/libcxx/src/CMakeFiles/cxx_shared.dir/strstream.cpp.o projects/libcxx/src/CMakeFiles/cxx_shared.dir/system_error.cpp.o projects/libcxx/src/CMakeFiles/cxx_shared.dir/thread.cpp.o projects/libcxx/src/CMakeFiles/cxx_shared.dir/typeinfo.cpp.o projects/libcxx/src/CMakeFiles/cxx_shared.dir/utility.cpp.o projects/libcxx/src/CMakeFiles/cxx_shared.dir/valarray.cpp.o projects/libcxx/src/CMakeFiles/cxx_shared.dir/variant.cpp.o projects/libcxx/src/CMakeFiles/cxx_shared.dir/vector.cpp.o projects/libcxx/src/CMakeFiles/cxx_shared.dir/filesystem/operations.cpp.o projects/libcxx/src/CMakeFiles/cxx_shared.dir/filesystem/directory_iterator.cpp.o projects/libcxx/src/CMakeFiles/cxx_shared.dir/filesystem/int128_builtins.cpp.o -Wl,-rpath,@loader_path/../lib -nodefaultlibs -lSystem -lc lib/libc++abi.1.0.dylib -Wl,-unexported_symbols_list,/Users/buildslave/jenkins/workspace/lldb-cmake/llvm-project/libcxx/src/../lib/libc++unexp.exp -Wl,-reexported_symbols_list,/Users/buildslave/jenkins/workspace/lldb-cmake/llvm-project/libcxx/src/../lib/libc++abi.v2.exp -Wl,-force_symbols_not_weak_list,/Users/buildslave/jenkins/workspace/lldb-cmake/llvm-project/libcxx/src/../lib/notweak.exp -Wl,-force_symbols_weak_list,/Users/buildslave/jenkins/workspace/lldb-cmake/llvm-project/libcxx/src/../lib/weak.exp -Wl,-reexported_symbols_list,/Users/buildslave/jenkins/workspace/lldb-cmake/llvm-project/libcxxabi/src/../lib/new-delete.exp -Wl,-reexported_symbols_list,/Users/buildslave/jenkins/workspace/lldb-cmake/llvm-project/libcxxabi/src/../lib/exceptions.exp -Wl,-reexported_symbols_list,/Users/buildslave/jenkins/workspace/lldb-cmake/llvm-project/libcxxabi/src/../lib/personality-v0.exp && : ld: requested re-export symbol operator new(unsigned long) is not from a dylib, but from projects/libcxx/src/CMakeFiles/cxx_shared.dir/new.cpp.o file 'projects/libcxx/src/CMakeFiles/cxx_shared.dir/new.cpp.o' for architecture x86_64 clang-12: error: linker command failed with exit code 1 (use -v to see invocation) [11/2710] /Users/buildslave/jenkins/workspace/lldb-cmake/host-compiler/bin/clang++ -DHAVE_RPC_XDR_H=0 -D_DEBUG -D__STDC_CONSTANT_MACROS -D__STDC_FORMAT_MACROS -D__STDC_LIMIT_MACROS -Iprojects/compiler-rt/lib/sanitizer_common -I/Users/buildslave/jenkins/workspace/lldb-cmake/llvm-project/compiler-rt/lib/sanitizer_common -Iinclude -I/Users/buildslave/jenkins/workspace/lldb-cmake/llvm-project/llvm/include -I/Users/buildslave/jenkins/workspace/lldb-cmake/llvm-project/compiler-rt/lib/sanitizer_common/.. -Wdocumentation -fPIC -fvisibility-inlines-hidden -Werror=date-time -Werror=unguarded-availability-new -fmodules -fmodules-cache-path=/Users/buildslave/jenkins/workspace/lldb-cmake/lldb-build/module.cache -fcxx-modules -Xclang -fmodules-local-submodule-visibility -Wall -Wextra -Wno-unused-parameter -Wwrite-strings -Wcast-qual -Wmissing-field-initializers -pedantic -Wno-long-long -Wimplicit-fallthrough -Wcovered-switch-default -Wno-noexcept-type -Wnon-virtual-dtor -Wdelete-non-virtual-dtor -Wsuggest-override -Wstring-conversion -fdiagnostics-color -Wall -std=c++14 -Wno-unused-parameter -O3 -arch i386 -arch x86_64 -isysroot /Applications/Xcode.app/Contents/Developer/Platforms/MacOSX.platform/Developer/SDKs/MacOSX10.15.sdk -stdlib=libc++ -mios-simulator-version-min=9.0 -isysroot /Applications/Xcode.app/Contents/Developer/Platforms/iPhoneSimulator.platform/Developer/SDKs/iPhoneSimulator13.5.sdk -fPIC -fno-builtin -fno-exceptions -funwind-tables -fno-stack-protector -fno-sanitize=safe-stack -fvisibility=hidden -fno-lto -O3 -gline-tables-only -fno-modules -Wno-gnu -Wno-variadic-macros -Wno-c99-extensions -Wno-non-virtual-dtor -fno-rtti -Wframe-larger-than=570 -Wglobal-constructors -UNDEBUG -std=c++14 -MD -MT projects/compiler-rt/lib/sanitizer_common/CMakeFiles/RTSanitizerCommonLibc.iossim.dir/sanitizer_posix_libcdep.cpp.o -MF projects/compiler-rt/lib/sanitizer_common/CMakeFiles/RTSanitizerCommonLibc.iossim.dir/sanitizer_posix_libcdep.cpp.o.d -o projects/compiler-rt/lib/sanitizer_common/CMakeFiles/RTSanitizerCommonLibc.iossim.dir/sanitizer_posix_libcdep.cpp.o -c /Users/buildslave/jenkins/workspace/lldb-cmake/llvm-project/compiler-rt/lib/sanitizer_common/sanitizer_posix_libcdep.cpp clang-12: warning: argument unused during compilation: '-fmodules-cache-path=/Users/buildslave/jenkins/workspace/lldb-cmake/lldb-build/module.cache' [-Wunused-command-line-argument] clang-12: warning: argument unused during compilation: '-fcxx-modules' [-Wunused-command-line-argument] [12/2710] /Users/buildslave/jenkins/workspace/lldb-cmake/host-compiler/bin/clang++ -DHAVE_RPC_XDR_H=0 -D_DEBUG -D__STDC_CONSTANT_MACROS -D__STDC_FORMAT_MACROS -D__STDC_LIMIT_MACROS -Iprojects/compiler-rt/lib/sanitizer_common -I/Users/buildslave/jenkins/workspace/lldb-cmake/llvm-project/compiler-rt/lib/sanitizer_common -Iinclude -I/Users/buildslave/jenkins/workspace/lldb-cmake/llvm-project/llvm/include -I/Users/buildslave/jenkins/workspace/lldb-cmake/llvm-project/compiler-rt/lib/sanitizer_common/.. -Wdocumentation -fPIC -fvisibility-inlines-hidden -Werror=date-time -Werror=unguarded-availability-new -fmodules -fmodules-cache-path=/Users/buildslave/jenkins/workspace/lldb-cmake/lldb-build/module.cache -fcxx-modules -Xclang -fmodules-local-submodule-visibility -Wall -Wextra -Wno-unused-parameter -Wwrite-strings -Wcast-qual -Wmissing-field-initializers -pedantic -Wno-long-long -Wimplicit-fallthrough -Wcovered-switch-default -Wno-noexcept-type -Wnon-virtual-dtor -Wdelete-non-virtual-dtor -Wsuggest-override -Wstring-conversion -fdiagnostics-color -Wall -std=c++14 -Wno-unused-parameter -O3 -arch i386 -arch x86_64 -isysroot /Applications/Xcode.app/Contents/Developer/Platforms/MacOSX.platform/Developer/SDKs/MacOSX10.15.sdk -stdlib=libc++ -mios-simulator-version-min=9.0 -isysroot /Applications/Xcode.app/Contents/Developer/Platforms/iPhoneSimulator.platform/Developer/SDKs/iPhoneSimulator13.5.sdk -fPIC -fno-builtin -fno-exceptions -funwind-tables -fno-stack-protector -fno-sanitize=safe-stack -fvisibility=hidden -fno-lto -O3 -gline-tables-only -fno-modules -Wno-gnu -Wno-variadic-macros -Wno-c99-extensions -Wno-non-virtual-dtor -fno-rtti -Wframe-larger-than=570 -Wglobal-constructors -DSANITIZER_SUPPORTS_WEAK_HOOKS=0 -UNDEBUG -std=c++14 -MD -MT projects/compiler-rt/lib/sanitizer_common/CMakeFiles/RTSanitizerCommonLibcNoHooks.iossim.dir/sanitizer_posix_libcdep.cpp.o -MF projects/compiler-rt/lib/sanitizer_common/CMakeFiles/RTSanitizerCommonLibcNoHooks.iossim.dir/sanitizer_posix_libcdep.cpp.o.d -o projects/compiler-rt/lib/sanitizer_common/CMakeFiles/RTSanitizerCommonLibcNoHooks.iossim.dir/sanitizer_posix_libcdep.cpp.o -c /Users/buildslave/jenkins/workspace/lldb-cmake/llvm-project/compiler-rt/lib/sanitizer_common/sanitizer_posix_libcdep.cpp clang-12: warning: argument unused during compilation: '-fmodules-cache-path=/Users/buildslave/jenkins/workspace/lldb-cmake/lldb-build/module.cache' [-Wunused-command-line-argument] clang-12: warning: argument unused during compilation: '-fcxx-modules' [-Wunused-command-line-argument] [13/2710] /Users/buildslave/jenkins/workspace/lldb-cmake/host-compiler/bin/clang++ -DHAVE_RPC_XDR_H=0 -D_DEBUG -D__STDC_CONSTANT_MACROS -D__STDC_FORMAT_MACROS -D__STDC_LIMIT_MACROS -Iprojects/compiler-rt/lib/sanitizer_common -I/Users/buildslave/jenkins/workspace/lldb-cmake/llvm-project/compiler-rt/lib/sanitizer_common -Iinclude -I/Users/buildslave/jenkins/workspace/lldb-cmake/llvm-project/llvm/include -I/Users/buildslave/jenkins/workspace/lldb-cmake/llvm-project/compiler-rt/lib/sanitizer_common/.. -Wdocumentation -fPIC -fvisibility-inlines-hidden -Werror=date-time -Werror=unguarded-availability-new -fmodules -fmodules-cache-path=/Users/buildslave/jenkins/workspace/lldb-cmake/lldb-build/module.cache -fcxx-modules -Xclang -fmodules-local-submodule-visibility -Wall -Wextra -Wno-unused-parameter -Wwrite-strings -Wcast-qual -Wmissing-field-initializers -pedantic -Wno-long-long -Wimplicit-fallthrough -Wcovered-switch-default -Wno-noexcept-type -Wnon-virtual-dtor -Wdelete-non-virtual-dtor -Wsuggest-override -Wstring-conversion -fdiagnostics-color -Wall -std=c++14 -Wno-unused-parameter -O3 -arch x86_64 -arch x86_64h -isysroot /Applications/Xcode.app/Contents/Developer/Platforms/MacOSX.platform/Developer/SDKs/MacOSX10.15.sdk -stdlib=libc++ -mmacosx-version-min=10.10 -isysroot /Applications/Xcode.app/Contents/Developer/Platforms/MacOSX.platform/Developer/SDKs/MacOSX10.15.sdk -fPIC -fno-builtin -fno-exceptions -funwind-tables -fno-stack-protector -fno-sanitize=safe-stack -fvisibility=hidden -fno-lto -O3 -gline-tables-only -fno-modules -Wno-gnu -Wno-variadic-macros -Wno-c99-extensions -Wno-non-virtual-dtor -fno-rtti -Wframe-larger-than=570 -Wglobal-constructors -UNDEBUG -std=c++14 -MD -MT projects/compiler-rt/lib/sanitizer_common/CMakeFiles/RTSanitizerCommonSymbolizer.osx.dir/sanitizer_symbolizer_posix_libcdep.cpp.o -MF projects/compiler-rt/lib/sanitizer_common/CMakeFiles/RTSanitizerCommonSymbolizer.osx.dir/sanitizer_symbolizer_posix_libcdep.cpp.o.d -o projects/compiler-rt/lib/sanitizer_common/CMakeFiles/RTSanitizerCommonSymbolizer.osx.dir/sanitizer_symbolizer_posix_libcdep.cpp.o -c /Users/buildslave/jenkins/workspace/lldb-cmake/llvm-project/compiler-rt/lib/sanitizer_common/sanitizer_symbolizer_posix_libcdep.cpp clang-12: warning: argument unused during compilation: '-fmodules-cache-path=/Users/buildslave/jenkins/workspace/lldb-cmake/lldb-build/module.cache' [-Wunused-command-line-argument] clang-12: warning: argument unused during compilation: '-fcxx-modules' [-Wunused-command-line-argument] [14/2710] : && "/Applications/Xcode.app/Contents/Developer/Toolchains/XcodeDefault.xctoolchain/usr/bin/libtool" -static -no_warning_for_no_symbols -o lib/libLLVMTransformUtils.a lib/Transforms/Utils/CMakeFiles/LLVMTransformUtils.dir/AddDiscriminators.cpp.o lib/Transforms/Utils/CMakeFiles/LLVMTransformUtils.dir/AMDGPUEmitPrintf.cpp.o lib/Transforms/Utils/CMakeFiles/LLVMTransformUtils.dir/ASanStackFrameLayout.cpp.o lib/Transforms/Utils/CMakeFiles/LLVMTransformUtils.dir/AssumeBundleBuilder.cpp.o lib/Transforms/Utils/CMakeFiles/LLVMTransformUtils.dir/BasicBlockUtils.cpp.o lib/Transforms/Utils/CMakeFiles/LLVMTransformUtils.dir/BreakCriticalEdges.cpp.o lib/Transforms/Utils/CMakeFiles/LLVMTransformUtils.dir/BuildLibCalls.cpp.o lib/Transforms/Utils/CMakeFiles/LLVMTransformUtils.dir/BypassSlowDivision.cpp.o lib/Transforms/Utils/CMakeFiles/LLVMTransformUtils.dir/CallPromotionUtils.cpp.o lib/Transforms/Utils/CMakeFiles/LLVMTransformUtils.dir/CallGraphUpdater.cpp.o lib/Transforms/Utils/CMakeFiles/LLVMTransformUtils.dir/CanonicalizeAliases.cpp.o lib/Transforms/Utils/CMakeFiles/LLVMTransformUtils.dir/CanonicalizeFreezeInLoops.cpp.o lib/Transforms/Utils/CMakeFiles/LLVMTransformUtils.dir/CloneFunction.cpp.o lib/Transforms/Utils/CMakeFiles/LLVMTransformUtils.dir/CloneModule.cpp.o lib/Transforms/Utils/CMakeFiles/LLVMTransformUtils.dir/CodeExtractor.cpp.o lib/Transforms/Utils/CMakeFiles/LLVMTransformUtils.dir/CodeMoverUtils.cpp.o lib/Transforms/Utils/CMakeFiles/LLVMTransformUtils.dir/CtorUtils.cpp.o lib/Transforms/Utils/CMakeFiles/LLVMTransformUtils.dir/Debugify.cpp.o lib/Transforms/Utils/CMakeFiles/LLVMTransformUtils.dir/DemoteRegToStack.cpp.o lib/Transforms/Utils/CMakeFiles/LLVMTransformUtils.dir/EntryExitInstrumenter.cpp.o lib/Transforms/Utils/CMakeFiles/LLVMTransformUtils.dir/EscapeEnumerator.cpp.o lib/Transforms/Utils/CMakeFiles/LLVMTransformUtils.dir/Evaluator.cpp.o lib/Transforms/Utils/CMakeFiles/LLVMTransformUtils.dir/FixIrreducible.cpp.o lib/Transforms/Utils/CMakeFiles/LLVMTransformUtils.dir/FlattenCFG.cpp.o lib/Transforms/Utils/CMakeFiles/LLVMTransformUtils.dir/FunctionComparator.cpp.o lib/Transforms/Utils/CMakeFiles/LLVMTransformUtils.dir/FunctionImportUtils.cpp.o lib/Transforms/Utils/CMakeFiles/LLVMTransformUtils.dir/GlobalStatus.cpp.o lib/Transforms/Utils/CMakeFiles/LLVMTransformUtils.dir/GuardUtils.cpp.o lib/Transforms/Utils/CMakeFiles/LLVMTransformUtils.dir/InlineFunction.cpp.o lib/Transforms/Utils/CMakeFiles/LLVMTransformUtils.dir/ImportedFunctionsInliningStatistics.cpp.o lib/Transforms/Utils/CMakeFiles/LLVMTransformUtils.dir/InjectTLIMappings.cpp.o lib/Transforms/Utils/CMakeFiles/LLVMTransformUtils.dir/InstructionNamer.cpp.o lib/Transforms/Utils/CMakeFiles/LLVMTransformUtils.dir/IntegerDivision.cpp.o lib/Transforms/Utils/CMakeFiles/LLVMTransformUtils.dir/LCSSA.cpp.o lib/Transforms/Utils/CMakeFiles/LLVMTransformUtils.dir/LibCallsShrinkWrap.cpp.o lib/Transforms/Utils/CMakeFiles/LLVMTransformUtils.dir/Local.cpp.o lib/Transforms/Utils/CMakeFiles/LLVMTransformUtils.dir/LoopPeel.cpp.o lib/Transforms/Utils/CMakeFiles/LLVMTransformUtils.dir/LoopRotationUtils.cpp.o lib/Transforms/Utils/CMakeFiles/LLVMTransformUtils.dir/LoopSimplify.cpp.o lib/Transforms/Utils/CMakeFiles/LLVMTransformUtils.dir/LoopUnroll.cpp.o lib/Transforms/Utils/CMakeFiles/LLVMTransformUtils.dir/LoopUnrollAndJam.cpp.o lib/Transforms/Utils/CMakeFiles/LLVMTransformUtils.dir/LoopUnrollRuntime.cpp.o lib/Transforms/Utils/CMakeFiles/LLVMTransformUtils.dir/LoopUtils.cpp.o lib/Transforms/Utils/CMakeFiles/LLVMTransformUtils.dir/LoopVersioning.cpp.o lib/Transforms/Utils/CMakeFiles/LLVMTransformUtils.dir/LowerInvoke.cpp.o lib/Transforms/Utils/CMakeFiles/LLVMTransformUtils.dir/LowerMemIntrinsics.cpp.o lib/Transforms/Utils/CMakeFiles/LLVMTransformUtils.dir/LowerSwitch.cpp.o lib/Transforms/Utils/CMakeFiles/LLVMTransformUtils.dir/MatrixUtils.cpp.o lib/Transforms/Utils/CMakeFiles/LLVMTransformUtils.dir/Mem2Reg.cpp.o lib/Transforms/Utils/CMakeFiles/LLVMTransformUtils.dir/MetaRenamer.cpp.o lib/Transforms/Utils/CMakeFiles/LLVMTransformUtils.dir/MisExpect.cpp.o lib/Transforms/Utils/CMakeFiles/LLVMTransformUtils.dir/ModuleUtils.cpp.o lib/Transforms/Utils/CMakeFiles/LLVMTransformUtils.dir/NameAnonGlobals.cpp.o lib/Transforms/Utils/CMakeFiles/LLVMTransformUtils.dir/PredicateInfo.cpp.o lib/Transforms/Utils/CMakeFiles/LLVMTransformUtils.dir/PromoteMemoryToRegister.cpp.o lib/Transforms/Utils/CMakeFiles/LLVMTransformUtils.dir/ScalarEvolutionExpander.cpp.o lib/Transforms/Utils/CMakeFiles/LLVMTransformUtils.dir/StripGCRelocates.cpp.o lib/Transforms/Utils/CMakeFiles/LLVMTransformUtils.dir/SSAUpdater.cpp.o lib/Transforms/Utils/CMakeFiles/LLVMTransformUtils.dir/SSAUpdaterBulk.cpp.o lib/Transforms/Utils/CMakeFiles/LLVMTransformUtils.dir/SanitizerStats.cpp.o lib/Transforms/Utils/CMakeFiles/LLVMTransformUtils.dir/SimplifyCFG.cpp.o lib/Transforms/Utils/CMakeFiles/LLVMTransformUtils.dir/SimplifyIndVar.cpp.o lib/Transforms/Utils/CMakeFiles/LLVMTransformUtils.dir/SimplifyLibCalls.cpp.o lib/Transforms/Utils/CMakeFiles/LLVMTransformUtils.dir/SizeOpts.cpp.o lib/Transforms/Utils/CMakeFiles/LLVMTransformUtils.dir/SplitModule.cpp.o lib/Transforms/Utils/CMakeFiles/LLVMTransformUtils.dir/StripNonLineTableDebugInfo.cpp.o lib/Transforms/Utils/CMakeFiles/LLVMTransformUtils.dir/SymbolRewriter.cpp.o lib/Transforms/Utils/CMakeFiles/LLVMTransformUtils.dir/UnifyFunctionExitNodes.cpp.o lib/Transforms/Utils/CMakeFiles/LLVMTransformUtils.dir/UnifyLoopExits.cpp.o lib/Transforms/Utils/CMakeFiles/LLVMTransformUtils.dir/UniqueInternalLinkageNames.cpp.o lib/Transforms/Utils/CMakeFiles/LLVMTransformUtils.dir/Utils.cpp.o lib/Transforms/Utils/CMakeFiles/LLVMTransformUtils.dir/ValueMapper.cpp.o lib/Transforms/Utils/CMakeFiles/LLVMTransformUtils.dir/VNCoercion.cpp.o && : [15/2710] /Users/buildslave/jenkins/workspace/lldb-cmake/host-compiler/bin/clang++ -DHAVE_RPC_XDR_H=0 -D_DEBUG -D__STDC_CONSTANT_MACROS -D__STDC_FORMAT_MACROS -D__STDC_LIMIT_MACROS -Iprojects/compiler-rt/lib/sanitizer_common -I/Users/buildslave/jenkins/workspace/lldb-cmake/llvm-project/compiler-rt/lib/sanitizer_common -Iinclude -I/Users/buildslave/jenkins/workspace/lldb-cmake/llvm-project/llvm/include -I/Users/buildslave/jenkins/workspace/lldb-cmake/llvm-project/compiler-rt/lib/sanitizer_common/.. -Wdocumentation -fPIC -fvisibility-inlines-hidden -Werror=date-time -Werror=unguarded-availability-new -fmodules -fmodules-cache-path=/Users/buildslave/jenkins/workspace/lldb-cmake/lldb-build/module.cache -fcxx-modules -Xclang -fmodules-local-submodule-visibility -Wall -Wextra -Wno-unused-parameter -Wwrite-strings -Wcast-qual -Wmissing-field-initializers -pedantic -Wno-long-long -Wimplicit-fallthrough -Wcovered-switch-default -Wno-noexcept-type -Wnon-virtual-dtor -Wdelete-non-virtual-dtor -Wsuggest-override -Wstring-conversion -fdiagnostics-color -Wall -std=c++14 -Wno-unused-parameter -O3 -arch i386 -arch x86_64 -isysroot /Applications/Xcode.app/Contents/Developer/Platforms/MacOSX.platform/Developer/SDKs/MacOSX10.15.sdk -stdlib=libc++ -mios-simulator-version-min=9.0 -isysroot /Applications/Xcode.app/Contents/Developer/Platforms/iPhoneSimulator.platform/Developer/SDKs/iPhoneSimulator13.5.sdk -fPIC -fno-builtin -fno-exceptions -funwind-tables -fno-stack-protector -fno-sanitize=safe-stack -fvisibility=hidden -fno-lto -O3 -gline-tables-only -fno-modules -Wno-gnu -Wno-variadic-macros -Wno-c99-extensions -Wno-non-virtual-dtor -fno-rtti -Wframe-larger-than=570 -Wglobal-constructors -UNDEBUG -std=c++14 -MD -MT projects/compiler-rt/lib/sanitizer_common/CMakeFiles/RTSanitizerCommon.iossim.dir/sanitizer_platform_limits_posix.cpp.o -MF projects/compiler-rt/lib/sanitizer_common/CMakeFiles/RTSanitizerCommon.iossim.dir/sanitizer_platform_limits_posix.cpp.o.d -o projects/compiler-rt/lib/sanitizer_common/CMakeFiles/RTSanitizerCommon.iossim.dir/sanitizer_platform_limits_posix.cpp.o -c /Users/buildslave/jenkins/workspace/lldb-cmake/llvm-project/compiler-rt/lib/sanitizer_common/sanitizer_platform_limits_posix.cpp clang-12: warning: argument unused during compilation: '-fmodules-cache-path=/Users/buildslave/jenkins/workspace/lldb-cmake/lldb-build/module.cache' [-Wunused-command-line-argument] clang-12: warning: argument unused during compilation: '-fcxx-modules' [-Wunused-command-line-argument] [16/2710] /Users/buildslave/jenkins/workspace/lldb-cmake/host-compiler/bin/clang++ -DHAVE_RPC_XDR_H=0 -D_DEBUG -D__STDC_CONSTANT_MACROS -D__STDC_FORMAT_MACROS -D__STDC_LIMIT_MACROS -Iprojects/compiler-rt/lib/sanitizer_common -I/Users/buildslave/jenkins/workspace/lldb-cmake/llvm-project/compiler-rt/lib/sanitizer_common -Iinclude -I/Users/buildslave/jenkins/workspace/lldb-cmake/llvm-project/llvm/include -I/Users/buildslave/jenkins/workspace/lldb-cmake/llvm-project/compiler-rt/lib/sanitizer_common/.. -Wdocumentation -fPIC -fvisibility-inlines-hidden -Werror=date-time -Werror=unguarded-availability-new -fmodules -fmodules-cache-path=/Users/buildslave/jenkins/workspace/lldb-cmake/lldb-build/module.cache -fcxx-modules -Xclang -fmodules-local-submodule-visibility -Wall -Wextra -Wno-unused-parameter -Wwrite-strings -Wcast-qual -Wmissing-field-initializers -pedantic -Wno-long-long -Wimplicit-fallthrough -Wcovered-switch-default -Wno-noexcept-type -Wnon-virtual-dtor -Wdelete-non-virtual-dtor -Wsuggest-override -Wstring-conversion -fdiagnostics-color -Wall -std=c++14 -Wno-unused-parameter -O3 -arch x86_64 -arch x86_64h -isysroot /Applications/Xcode.app/Contents/Developer/Platforms/MacOSX.platform/Developer/SDKs/MacOSX10.15.sdk -stdlib=libc++ -mmacosx-version-min=10.10 -isysroot /Applications/Xcode.app/Contents/Developer/Platforms/MacOSX.platform/Developer/SDKs/MacOSX10.15.sdk -fPIC -fno-builtin -fno-exceptions -funwind-tables -fno-stack-protector -fno-sanitize=safe-stack -fvisibility=hidden -fno-lto -O3 -gline-tables-only -fno-modules -Wno-gnu -Wno-variadic-macros -Wno-c99-extensions -Wno-non-virtual-dtor -fno-rtti -Wframe-larger-than=570 -Wglobal-constructors -DSANITIZER_SUPPORTS_WEAK_HOOKS=0 -UNDEBUG -std=c++14 -MD -MT projects/compiler-rt/lib/sanitizer_common/CMakeFiles/RTSanitizerCommonNoHooks.osx.dir/sanitizer_procmaps_mac.cpp.o -MF projects/compiler-rt/lib/sanitizer_common/CMakeFiles/RTSanitizerCommonNoHooks.osx.dir/sanitizer_procmaps_mac.cpp.o.d -o projects/compiler-rt/lib/sanitizer_common/CMakeFiles/RTSanitizerCommonNoHooks.osx.dir/sanitizer_procmaps_mac.cpp.o -c /Users/buildslave/jenkins/workspace/lldb-cmake/llvm-project/compiler-rt/lib/sanitizer_common/sanitizer_procmaps_mac.cpp clang-12: warning: argument unused during compilation: '-fmodules-cache-path=/Users/buildslave/jenkins/workspace/lldb-cmake/lldb-build/module.cache' [-Wunused-command-line-argument] clang-12: warning: argument unused during compilation: '-fcxx-modules' [-Wunused-command-line-argument] [17/2710] /Users/buildslave/jenkins/workspace/lldb-cmake/host-compiler/bin/clang++ -DHAVE_RPC_XDR_H=0 -D_DEBUG -D__STDC_CONSTANT_MACROS -D__STDC_FORMAT_MACROS -D__STDC_LIMIT_MACROS -Iprojects/compiler-rt/lib/sanitizer_common -I/Users/buildslave/jenkins/workspace/lldb-cmake/llvm-project/compiler-rt/lib/sanitizer_common -Iinclude -I/Users/buildslave/jenkins/workspace/lldb-cmake/llvm-project/llvm/include -I/Users/buildslave/jenkins/workspace/lldb-cmake/llvm-project/compiler-rt/lib/sanitizer_common/.. -Wdocumentation -fPIC -fvisibility-inlines-hidden -Werror=date-time -Werror=unguarded-availability-new -fmodules -fmodules-cache-path=/Users/buildslave/jenkins/workspace/lldb-cmake/lldb-build/module.cache -fcxx-modules -Xclang -fmodules-local-submodule-visibility -Wall -Wextra -Wno-unused-parameter -Wwrite-strings -Wcast-qual -Wmissing-field-initializers -pedantic -Wno-long-long -Wimplicit-fallthrough -Wcovered-switch-default -Wno-noexcept-type -Wnon-virtual-dtor -Wdelete-non-virtual-dtor -Wsuggest-override -Wstring-conversion -fdiagnostics-color -Wall -std=c++14 -Wno-unused-parameter -O3 -arch x86_64 -arch x86_64h -isysroot /Applications/Xcode.app/Contents/Developer/Platforms/MacOSX.platform/Developer/SDKs/MacOSX10.15.sdk -stdlib=libc++ -mmacosx-version-min=10.10 -isysroot /Applications/Xcode.app/Contents/Developer/Platforms/MacOSX.platform/Developer/SDKs/MacOSX10.15.sdk -fPIC -fno-builtin -fno-exceptions -funwind-tables -fno-stack-protector -fno-sanitize=safe-stack -fvisibility=hidden -fno-lto -O3 -gline-tables-only -fno-modules -Wno-gnu -Wno-variadic-macros -Wno-c99-extensions -Wno-non-virtual-dtor -fno-rtti -Wframe-larger-than=570 -Wglobal-constructors -DSANITIZER_SUPPORTS_WEAK_HOOKS=0 -UNDEBUG -std=c++14 -MD -MT projects/compiler-rt/lib/sanitizer_common/CMakeFiles/RTSanitizerCommonNoHooks.osx.dir/sanitizer_stoptheworld_mac.cpp.o -MF projects/compiler-rt/lib/sanitizer_common/CMakeFiles/RTSanitizerCommonNoHooks.osx.dir/sanitizer_stoptheworld_mac.cpp.o.d -o projects/compiler-rt/lib/sanitizer_common/CMakeFiles/RTSanitizerCommonNoHooks.osx.dir/sanitizer_stoptheworld_mac.cpp.o -c /Users/buildslave/jenkins/workspace/lldb-cmake/llvm-project/compiler-rt/lib/sanitizer_common/sanitizer_stoptheworld_mac.cpp clang-12: warning: argument unused during compilation: '-fmodules-cache-path=/Users/buildslave/jenkins/workspace/lldb-cmake/lldb-build/module.cache' [-Wunused-command-line-argument] clang-12: warning: argument unused during compilation: '-fcxx-modules' [-Wunused-command-line-argument] [18/2710] /Users/buildslave/jenkins/workspace/lldb-cmake/host-compiler/bin/clang++ -DHAVE_RPC_XDR_H=0 -D_DEBUG -D__STDC_CONSTANT_MACROS -D__STDC_FORMAT_MACROS -D__STDC_LIMIT_MACROS -Iprojects/compiler-rt/lib/sanitizer_common -I/Users/buildslave/jenkins/workspace/lldb-cmake/llvm-project/compiler-rt/lib/sanitizer_common -Iinclude -I/Users/buildslave/jenkins/workspace/lldb-cmake/llvm-project/llvm/include -I/Users/buildslave/jenkins/workspace/lldb-cmake/llvm-project/compiler-rt/lib/sanitizer_common/.. -Wdocumentation -fPIC -fvisibility-inlines-hidden -Werror=date-time -Werror=unguarded-availability-new -fmodules -fmodules-cache-path=/Users/buildslave/jenkins/workspace/lldb-cmake/lldb-build/module.cache -fcxx-modules -Xclang -fmodules-local-submodule-visibility -Wall -Wextra -Wno-unused-parameter -Wwrite-strings -Wcast-qual -Wmissing-field-initializers -pedantic -Wno-long-long -Wimplicit-fallthrough -Wcovered-switch-default -Wno-noexcept-type -Wnon-virtual-dtor -Wdelete-non-virtual-dtor -Wsuggest-override -Wstring-conversion -fdiagnostics-color -Wall -std=c++14 -Wno-unused-parameter -O3 -arch x86_64 -arch x86_64h -isysroot /Applications/Xcode.app/Contents/Developer/Platforms/MacOSX.platform/Developer/SDKs/MacOSX10.15.sdk -stdlib=libc++ -mmacosx-version-min=10.10 -isysroot /Applications/Xcode.app/Contents/Developer/Platforms/MacOSX.platform/Developer/SDKs/MacOSX10.15.sdk -fPIC -fno-builtin -fno-exceptions -funwind-tables -fno-stack-protector -fno-sanitize=safe-stack -fvisibility=hidden -fno-lto -O3 -gline-tables-only -fno-modules -Wno-gnu -Wno-variadic-macros -Wno-c99-extensions -Wno-non-virtual-dtor -fno-rtti -Wframe-larger-than=570 -Wglobal-constructors -UNDEBUG -std=c++14 -MD -MT projects/compiler-rt/lib/sanitizer_common/CMakeFiles/RTSanitizerCommonSymbolizer.osx.dir/sanitizer_symbolizer_mac.cpp.o -MF projects/compiler-rt/lib/sanitizer_common/CMakeFiles/RTSanitizerCommonSymbolizer.osx.dir/sanitizer_symbolizer_mac.cpp.o.d -o projects/compiler-rt/lib/sanitizer_common/CMakeFiles/RTSanitizerCommonSymbolizer.osx.dir/sanitizer_symbolizer_mac.cpp.o -c /Users/buildslave/jenkins/workspace/lldb-cmake/llvm-project/compiler-rt/lib/sanitizer_common/sanitizer_symbolizer_mac.cpp clang-12: warning: argument unused during compilation: '-fmodules-cache-path=/Users/buildslave/jenkins/workspace/lldb-cmake/lldb-build/module.cache' [-Wunused-command-line-argument] clang-12: warning: argument unused during compilation: '-fcxx-modules' [-Wunused-command-line-argument] [19/2710] /Users/buildslave/jenkins/workspace/lldb-cmake/host-compiler/bin/clang++ -DHAVE_RPC_XDR_H=0 -D_DEBUG -D__STDC_CONSTANT_MACROS -D__STDC_FORMAT_MACROS -D__STDC_LIMIT_MACROS -Iprojects/compiler-rt/lib/sanitizer_common -I/Users/buildslave/jenkins/workspace/lldb-cmake/llvm-project/compiler-rt/lib/sanitizer_common -Iinclude -I/Users/buildslave/jenkins/workspace/lldb-cmake/llvm-project/llvm/include -I/Users/buildslave/jenkins/workspace/lldb-cmake/llvm-project/compiler-rt/lib/sanitizer_common/.. -Wdocumentation -fPIC -fvisibility-inlines-hidden -Werror=date-time -Werror=unguarded-availability-new -fmodules -fmodules-cache-path=/Users/buildslave/jenkins/workspace/lldb-cmake/lldb-build/module.cache -fcxx-modules -Xclang -fmodules-local-submodule-visibility -Wall -Wextra -Wno-unused-parameter -Wwrite-strings -Wcast-qual -Wmissing-field-initializers -pedantic -Wno-long-long -Wimplicit-fallthrough -Wcovered-switch-default -Wno-noexcept-type -Wnon-virtual-dtor -Wdelete-non-virtual-dtor -Wsuggest-override -Wstring-conversion -fdiagnostics-color -Wall -std=c++14 -Wno-unused-parameter -O3 -arch i386 -arch x86_64 -isysroot /Applications/Xcode.app/Contents/Developer/Platforms/MacOSX.platform/Developer/SDKs/MacOSX10.15.sdk -stdlib=libc++ -mios-simulator-version-min=9.0 -isysroot /Applications/Xcode.app/Contents/Developer/Platforms/iPhoneSimulator.platform/Developer/SDKs/iPhoneSimulator13.5.sdk -fPIC -fno-builtin -fno-exceptions -funwind-tables -fno-stack-protector -fno-sanitize=safe-stack -fvisibility=hidden -fno-lto -O3 -gline-tables-only -fno-modules -Wno-gnu -Wno-variadic-macros -Wno-c99-extensions -Wno-non-virtual-dtor -fno-rtti -Wframe-larger-than=570 -Wglobal-constructors -UNDEBUG -std=c++14 -MD -MT projects/compiler-rt/lib/sanitizer_common/CMakeFiles/RTSanitizerCommon.iossim.dir/sanitizer_mac.cpp.o -MF projects/compiler-rt/lib/sanitizer_common/CMakeFiles/RTSanitizerCommon.iossim.dir/sanitizer_mac.cpp.o.d -o projects/compiler-rt/lib/sanitizer_common/CMakeFiles/RTSanitizerCommon.iossim.dir/sanitizer_mac.cpp.o -c /Users/buildslave/jenkins/workspace/lldb-cmake/llvm-project/compiler-rt/lib/sanitizer_common/sanitizer_mac.cpp clang-12: warning: argument unused during compilation: '-fmodules-cache-path=/Users/buildslave/jenkins/workspace/lldb-cmake/lldb-build/module.cache' [-Wunused-command-line-argument] clang-12: warning: argument unused during compilation: '-fcxx-modules' [-Wunused-command-line-argument] ninja: build stopped: subcommand failed. Command failed: Command '['/usr/local/bin/ninja', '-v']' returned non-zero exit status 1 Command: ['/usr/local/bin/ninja', '-v'] [Pipeline] } [Pipeline] // timeout [Pipeline] } [Pipeline] // stage [Pipeline] stage [Pipeline] { (Test) Stage "Test" skipped due to earlier failure(s) [Pipeline] } [Pipeline] // stage [Pipeline] stage [Pipeline] { (Declarative: Post Actions) [Pipeline] scanForIssues [Clang (LLVM based)] Sleeping for 5 seconds due to JENKINS-32191... [Clang (LLVM based)] Parsing console log (workspace: '/Users/buildslave/jenkins/workspace/lldb-cmake') [Clang (LLVM based)] Successfully parsed console log [Clang (LLVM based)] -> found 1 issue (skipped 0 duplicates) [Clang (LLVM based)] Post processing issues on 'green-dragon-10' with source code encoding 'UTF-8' [Clang (LLVM based)] Creating SCM blamer to obtain author and commit information for affected files [Clang (LLVM based)] Creating SCM miner to obtain statistics for affected repository files [Clang (LLVM based)] Resolving file names for all issues in source directory '/Users/buildslave/jenkins/workspace/lldb-cmake' [Clang (LLVM based)] -> resolved paths in source directory (1 found, 0 not found) [Clang (LLVM based)] Resolving module names from module definitions (build.xml, pom.xml, or Manifest.mf files) [Clang (LLVM based)] -> resolved module names for 1 issues [Clang (LLVM based)] Resolving package names (or namespaces) by parsing the affected files [Clang (LLVM based)] -> resolved package names of 1 affected files [Clang (LLVM based)] No filter has been set, publishing all 1 issues [Clang (LLVM based)] Creating fingerprints for all affected code blocks to track issues over different builds [Clang (LLVM based)] -> created fingerprints for 1 issues (skipped 0 issues) [Clang (LLVM based)] Copying affected files to Jenkins' build folder '/Users/Shared/Jenkins/Home/jobs/lldb-cmake/builds/24035/files-with-issues' [Clang (LLVM based)] -> 1 copied, 0 not in workspace, 0 not-found, 0 with I/O error [Pipeline] junit Recording test results Test reports were found but none of them are new. Did leafNodes run? For example, /Users/buildslave/jenkins/workspace/lldb-cmake/test/results.xml is 49 min old

Hide Details

Error when executing always post condition: Also: hudson.remoting.Channel$CallSiteStackTrace: Remote call to green-dragon-10 at hudson.remoting.Channel.attachCallSiteStackTrace(Channel.java:1788) at hudson.remoting.UserRequest$ExceptionResponse.retrieve(UserRequest.java:356) at hudson.remoting.Channel.call(Channel.java:998) at hudson.FilePath.act(FilePath.java:1069) at hudson.FilePath.act(FilePath.java:1058) at hudson.tasks.junit.JUnitParser.parseResult(JUnitParser.java:114) at hudson.tasks.junit.JUnitResultArchiver.parse(JUnitResultArchiver.java:137) at hudson.tasks.junit.JUnitResultArchiver.parseAndAttach(JUnitResultArchiver.java:167) at hudson.tasks.junit.pipeline.JUnitResultsStepExecution.run(JUnitResultsStepExecution.java:52) at hudson.tasks.junit.pipeline.JUnitResultsStepExecution.run(JUnitResultsStepExecution.java:25) at org.jenkinsci.plugins.workflow.steps.SynchronousNonBlockingStepExecution.lambda$start$0(SynchronousNonBlockingStepExecution.java:47) at java.util.concurrent.Executors$RunnableAdapter.call(Executors.java:511) at java.util.concurrent.FutureTask.run(FutureTask.java:266) at java.util.concurrent.ThreadPoolExecutor.runWorker(ThreadPoolExecutor.java:1149) at java.util.concurrent.ThreadPoolExecutor$Worker.run(ThreadPoolExecutor.java:624) at java.lang.Thread.run(Thread.java:748) hudson.AbortException: Test reports were found but none of them are new. Did leafNodes run? For example, /Users/buildslave/jenkins/workspace/lldb-cmake/test/results.xml is 49 min old

Hide Details

at hudson.tasks.junit.TestResult.parse(TestResult.java:222) at hudson.tasks.junit.TestResult.parse(TestResult.java:178) at hudson.tasks.junit.TestResult.<init>(TestResult.java:143) at hudson.tasks.junit.JUnitParser$ParseResultCallable.invoke(JUnitParser.java:146) at hudson.tasks.junit.JUnitParser$ParseResultCallable.invoke(JUnitParser.java:118) at hudson.FilePath$FileCallableWrapper.call(FilePath.java:3073) at hudson.remoting.UserRequest.perform(UserRequest.java:211) at hudson.remoting.UserRequest.perform(UserRequest.java:54) at hudson.remoting.Request$2.run(Request.java:369) at hudson.remoting.InterceptingExecutorService$1.call(InterceptingExecutorService.java:72) at java.util.concurrent.FutureTask.run(Unknown Source) at java.util.concurrent.ThreadPoolExecutor.runWorker(Unknown Source) at java.util.concurrent.ThreadPoolExecutor$Worker.run(Unknown Source) at java.lang.Thread.run(Unknown Source)

Hide Details

[Pipeline] } [Pipeline] // stage [Pipeline] } [Pipeline] // withEnv [Pipeline] } [Pipeline] // node [Pipeline] End of Pipeline ERROR: script returned exit code 1 Finished: FAILURE