FailedConsole Output

Skipping 3,018 KB.. Full Log
led to compile
-- Performing Test HAVE_GNU_POSIX_REGEX -- failed to compile
-- Performing Test HAVE_POSIX_REGEX -- success
-- Performing Test HAVE_STEADY_CLOCK -- success
-- Configuring done
-- Generating done
-- Build files have been written to: /Users/buildslave/jenkins/workspace/lldb-cmake/lldb-build
Completed at: 2020-10-01T08:00:49
@@@@@@
Build

Hide Details

@@@ Build @@@ cd /Users/buildslave/jenkins/workspace/lldb-cmake/lldb-build '/usr/local/bin/ninja' '-v' [1/2754] : && "/Applications/Xcode.app/Contents/Developer/Toolchains/XcodeDefault.xctoolchain/usr/bin/libtool" -static -no_warning_for_no_symbols -o lib/libLLVMWebAssemblyAsmParser.a lib/Target/WebAssembly/AsmParser/CMakeFiles/LLVMWebAssemblyAsmParser.dir/WebAssemblyAsmParser.cpp.o && : [2/2754] : && "/Applications/Xcode.app/Contents/Developer/Toolchains/XcodeDefault.xctoolchain/usr/bin/libtool" -static -no_warning_for_no_symbols -o lib/libLLVMWebAssemblyCodeGen.a lib/Target/WebAssembly/CMakeFiles/LLVMWebAssemblyCodeGen.dir/WebAssemblyAddMissingPrototypes.cpp.o lib/Target/WebAssembly/CMakeFiles/LLVMWebAssemblyCodeGen.dir/WebAssemblyArgumentMove.cpp.o lib/Target/WebAssembly/CMakeFiles/LLVMWebAssemblyCodeGen.dir/WebAssemblyAsmPrinter.cpp.o lib/Target/WebAssembly/CMakeFiles/LLVMWebAssemblyCodeGen.dir/WebAssemblyCFGStackify.cpp.o lib/Target/WebAssembly/CMakeFiles/LLVMWebAssemblyCodeGen.dir/WebAssemblyCFGSort.cpp.o lib/Target/WebAssembly/CMakeFiles/LLVMWebAssemblyCodeGen.dir/WebAssemblyDebugFixup.cpp.o lib/Target/WebAssembly/CMakeFiles/LLVMWebAssemblyCodeGen.dir/WebAssemblyDebugValueManager.cpp.o lib/Target/WebAssembly/CMakeFiles/LLVMWebAssemblyCodeGen.dir/WebAssemblyLateEHPrepare.cpp.o lib/Target/WebAssembly/CMakeFiles/LLVMWebAssemblyCodeGen.dir/WebAssemblyExceptionInfo.cpp.o lib/Target/WebAssembly/CMakeFiles/LLVMWebAssemblyCodeGen.dir/WebAssemblyExplicitLocals.cpp.o lib/Target/WebAssembly/CMakeFiles/LLVMWebAssemblyCodeGen.dir/WebAssemblyFastISel.cpp.o lib/Target/WebAssembly/CMakeFiles/LLVMWebAssemblyCodeGen.dir/WebAssemblyFixBrTableDefaults.cpp.o lib/Target/WebAssembly/CMakeFiles/LLVMWebAssemblyCodeGen.dir/WebAssemblyFixIrreducibleControlFlow.cpp.o lib/Target/WebAssembly/CMakeFiles/LLVMWebAssemblyCodeGen.dir/WebAssemblyFixFunctionBitcasts.cpp.o lib/Target/WebAssembly/CMakeFiles/LLVMWebAssemblyCodeGen.dir/WebAssemblyFrameLowering.cpp.o lib/Target/WebAssembly/CMakeFiles/LLVMWebAssemblyCodeGen.dir/WebAssemblyISelDAGToDAG.cpp.o lib/Target/WebAssembly/CMakeFiles/LLVMWebAssemblyCodeGen.dir/WebAssemblyISelLowering.cpp.o lib/Target/WebAssembly/CMakeFiles/LLVMWebAssemblyCodeGen.dir/WebAssemblyInstrInfo.cpp.o lib/Target/WebAssembly/CMakeFiles/LLVMWebAssemblyCodeGen.dir/WebAssemblyLowerBrUnless.cpp.o lib/Target/WebAssembly/CMakeFiles/LLVMWebAssemblyCodeGen.dir/WebAssemblyLowerEmscriptenEHSjLj.cpp.o lib/Target/WebAssembly/CMakeFiles/LLVMWebAssemblyCodeGen.dir/WebAssemblyLowerGlobalDtors.cpp.o lib/Target/WebAssembly/CMakeFiles/LLVMWebAssemblyCodeGen.dir/WebAssemblyMachineFunctionInfo.cpp.o lib/Target/WebAssembly/CMakeFiles/LLVMWebAssemblyCodeGen.dir/WebAssemblyMCInstLower.cpp.o lib/Target/WebAssembly/CMakeFiles/LLVMWebAssemblyCodeGen.dir/WebAssemblyOptimizeLiveIntervals.cpp.o lib/Target/WebAssembly/CMakeFiles/LLVMWebAssemblyCodeGen.dir/WebAssemblyOptimizeReturned.cpp.o lib/Target/WebAssembly/CMakeFiles/LLVMWebAssemblyCodeGen.dir/WebAssemblyPeephole.cpp.o lib/Target/WebAssembly/CMakeFiles/LLVMWebAssemblyCodeGen.dir/WebAssemblyPrepareForLiveIntervals.cpp.o lib/Target/WebAssembly/CMakeFiles/LLVMWebAssemblyCodeGen.dir/WebAssemblyRegisterInfo.cpp.o lib/Target/WebAssembly/CMakeFiles/LLVMWebAssemblyCodeGen.dir/WebAssemblyRegColoring.cpp.o lib/Target/WebAssembly/CMakeFiles/LLVMWebAssemblyCodeGen.dir/WebAssemblyRegNumbering.cpp.o lib/Target/WebAssembly/CMakeFiles/LLVMWebAssemblyCodeGen.dir/WebAssemblyRegStackify.cpp.o lib/Target/WebAssembly/CMakeFiles/LLVMWebAssemblyCodeGen.dir/WebAssemblyReplacePhysRegs.cpp.o lib/Target/WebAssembly/CMakeFiles/LLVMWebAssemblyCodeGen.dir/WebAssemblyRuntimeLibcallSignatures.cpp.o lib/Target/WebAssembly/CMakeFiles/LLVMWebAssemblyCodeGen.dir/WebAssemblySelectionDAGInfo.cpp.o lib/Target/WebAssembly/CMakeFiles/LLVMWebAssemblyCodeGen.dir/WebAssemblySetP2AlignOperands.cpp.o lib/Target/WebAssembly/CMakeFiles/LLVMWebAssemblyCodeGen.dir/WebAssemblySortRegion.cpp.o lib/Target/WebAssembly/CMakeFiles/LLVMWebAssemblyCodeGen.dir/WebAssemblyMemIntrinsicResults.cpp.o lib/Target/WebAssembly/CMakeFiles/LLVMWebAssemblyCodeGen.dir/WebAssemblySubtarget.cpp.o lib/Target/WebAssembly/CMakeFiles/LLVMWebAssemblyCodeGen.dir/WebAssemblyTargetMachine.cpp.o lib/Target/WebAssembly/CMakeFiles/LLVMWebAssemblyCodeGen.dir/WebAssemblyTargetObjectFile.cpp.o lib/Target/WebAssembly/CMakeFiles/LLVMWebAssemblyCodeGen.dir/WebAssemblyTargetTransformInfo.cpp.o lib/Target/WebAssembly/CMakeFiles/LLVMWebAssemblyCodeGen.dir/WebAssemblyUtilities.cpp.o && : [3/2754] /Users/buildslave/jenkins/workspace/lldb-cmake/host-compiler/bin/clang++ -DGTEST_HAS_RTTI=0 -D_DEBUG -D__STDC_CONSTANT_MACROS -D__STDC_FORMAT_MACROS -D__STDC_LIMIT_MACROS -Ilib/Target/X86 -I/Users/buildslave/jenkins/workspace/lldb-cmake/llvm-project/llvm/lib/Target/X86 -Iinclude -I/Users/buildslave/jenkins/workspace/lldb-cmake/llvm-project/llvm/include -Wdocumentation -fPIC -fvisibility-inlines-hidden -Werror=date-time -Werror=unguarded-availability-new -fmodules -fmodules-cache-path=/Users/buildslave/jenkins/workspace/lldb-cmake/lldb-build/module.cache -fcxx-modules -Xclang -fmodules-local-submodule-visibility -Wall -Wextra -Wno-unused-parameter -Wwrite-strings -Wcast-qual -Wmissing-field-initializers -pedantic -Wno-long-long -Wimplicit-fallthrough -Wcovered-switch-default -Wno-noexcept-type -Wnon-virtual-dtor -Wdelete-non-virtual-dtor -Wsuggest-override -Wstring-conversion -fdiagnostics-color -O3 -isysroot /Applications/Xcode.app/Contents/Developer/Platforms/MacOSX.platform/Developer/SDKs/MacOSX10.15.sdk -fno-exceptions -fno-rtti -UNDEBUG -std=c++14 -MD -MT lib/Target/X86/CMakeFiles/LLVMX86CodeGen.dir/X86AvoidTrailingCall.cpp.o -MF lib/Target/X86/CMakeFiles/LLVMX86CodeGen.dir/X86AvoidTrailingCall.cpp.o.d -o lib/Target/X86/CMakeFiles/LLVMX86CodeGen.dir/X86AvoidTrailingCall.cpp.o -c /Users/buildslave/jenkins/workspace/lldb-cmake/llvm-project/llvm/lib/Target/X86/X86AvoidTrailingCall.cpp [4/2754] /Users/buildslave/jenkins/workspace/lldb-cmake/host-compiler/bin/clang++ -DGTEST_HAS_RTTI=0 -D_DEBUG -D__STDC_CONSTANT_MACROS -D__STDC_FORMAT_MACROS -D__STDC_LIMIT_MACROS -Ilib/Target/X86 -I/Users/buildslave/jenkins/workspace/lldb-cmake/llvm-project/llvm/lib/Target/X86 -Iinclude -I/Users/buildslave/jenkins/workspace/lldb-cmake/llvm-project/llvm/include -Wdocumentation -fPIC -fvisibility-inlines-hidden -Werror=date-time -Werror=unguarded-availability-new -fmodules -fmodules-cache-path=/Users/buildslave/jenkins/workspace/lldb-cmake/lldb-build/module.cache -fcxx-modules -Xclang -fmodules-local-submodule-visibility -Wall -Wextra -Wno-unused-parameter -Wwrite-strings -Wcast-qual -Wmissing-field-initializers -pedantic -Wno-long-long -Wimplicit-fallthrough -Wcovered-switch-default -Wno-noexcept-type -Wnon-virtual-dtor -Wdelete-non-virtual-dtor -Wsuggest-override -Wstring-conversion -fdiagnostics-color -O3 -isysroot /Applications/Xcode.app/Contents/Developer/Platforms/MacOSX.platform/Developer/SDKs/MacOSX10.15.sdk -fno-exceptions -fno-rtti -UNDEBUG -std=c++14 -MD -MT lib/Target/X86/CMakeFiles/LLVMX86CodeGen.dir/X86CallLowering.cpp.o -MF lib/Target/X86/CMakeFiles/LLVMX86CodeGen.dir/X86CallLowering.cpp.o.d -o lib/Target/X86/CMakeFiles/LLVMX86CodeGen.dir/X86CallLowering.cpp.o -c /Users/buildslave/jenkins/workspace/lldb-cmake/llvm-project/llvm/lib/Target/X86/X86CallLowering.cpp While building module 'LLVM_Backend' imported from /Users/buildslave/jenkins/workspace/lldb-cmake/llvm-project/llvm/lib/Target/X86/X86CallLowering.h:17: In file included from <module-includes>:106: /Users/buildslave/jenkins/workspace/lldb-cmake/llvm-project/llvm/include/llvm/CodeGen/MachinePassManager.h:94:8: warning: '\returns' command used in a comment that is not attached to a function or method declaration [-Wdocumentation] /// \returns null if there is no cached result. ~^~~~~~~~~~~~~~~~~~~~~~~~~~~~~~~~~~~~~~~~~~ 1 warning generated. [5/2754] /Users/buildslave/jenkins/workspace/lldb-cmake/host-compiler/bin/clang++ -DGTEST_HAS_RTTI=0 -D_DEBUG -D__STDC_CONSTANT_MACROS -D__STDC_FORMAT_MACROS -D__STDC_LIMIT_MACROS -Ilib/Target/X86 -I/Users/buildslave/jenkins/workspace/lldb-cmake/llvm-project/llvm/lib/Target/X86 -Iinclude -I/Users/buildslave/jenkins/workspace/lldb-cmake/llvm-project/llvm/include -Wdocumentation -fPIC -fvisibility-inlines-hidden -Werror=date-time -Werror=unguarded-availability-new -fmodules -fmodules-cache-path=/Users/buildslave/jenkins/workspace/lldb-cmake/lldb-build/module.cache -fcxx-modules -Xclang -fmodules-local-submodule-visibility -Wall -Wextra -Wno-unused-parameter -Wwrite-strings -Wcast-qual -Wmissing-field-initializers -pedantic -Wno-long-long -Wimplicit-fallthrough -Wcovered-switch-default -Wno-noexcept-type -Wnon-virtual-dtor -Wdelete-non-virtual-dtor -Wsuggest-override -Wstring-conversion -fdiagnostics-color -O3 -isysroot /Applications/Xcode.app/Contents/Developer/Platforms/MacOSX.platform/Developer/SDKs/MacOSX10.15.sdk -fno-exceptions -fno-rtti -UNDEBUG -std=c++14 -MD -MT lib/Target/X86/CMakeFiles/LLVMX86CodeGen.dir/X86AsmPrinter.cpp.o -MF lib/Target/X86/CMakeFiles/LLVMX86CodeGen.dir/X86AsmPrinter.cpp.o.d -o lib/Target/X86/CMakeFiles/LLVMX86CodeGen.dir/X86AsmPrinter.cpp.o -c /Users/buildslave/jenkins/workspace/lldb-cmake/llvm-project/llvm/lib/Target/X86/X86AsmPrinter.cpp [6/2754] /Users/buildslave/jenkins/workspace/lldb-cmake/host-compiler/bin/clang++ -DGTEST_HAS_RTTI=0 -D_DEBUG -D__STDC_CONSTANT_MACROS -D__STDC_FORMAT_MACROS -D__STDC_LIMIT_MACROS -Ilib/Target/X86 -I/Users/buildslave/jenkins/workspace/lldb-cmake/llvm-project/llvm/lib/Target/X86 -Iinclude -I/Users/buildslave/jenkins/workspace/lldb-cmake/llvm-project/llvm/include -Wdocumentation -fPIC -fvisibility-inlines-hidden -Werror=date-time -Werror=unguarded-availability-new -fmodules -fmodules-cache-path=/Users/buildslave/jenkins/workspace/lldb-cmake/lldb-build/module.cache -fcxx-modules -Xclang -fmodules-local-submodule-visibility -Wall -Wextra -Wno-unused-parameter -Wwrite-strings -Wcast-qual -Wmissing-field-initializers -pedantic -Wno-long-long -Wimplicit-fallthrough -Wcovered-switch-default -Wno-noexcept-type -Wnon-virtual-dtor -Wdelete-non-virtual-dtor -Wsuggest-override -Wstring-conversion -fdiagnostics-color -O3 -isysroot /Applications/Xcode.app/Contents/Developer/Platforms/MacOSX.platform/Developer/SDKs/MacOSX10.15.sdk -fno-exceptions -fno-rtti -UNDEBUG -std=c++14 -MD -MT lib/Target/X86/CMakeFiles/LLVMX86CodeGen.dir/X86DiscriminateMemOps.cpp.o -MF lib/Target/X86/CMakeFiles/LLVMX86CodeGen.dir/X86DiscriminateMemOps.cpp.o.d -o lib/Target/X86/CMakeFiles/LLVMX86CodeGen.dir/X86DiscriminateMemOps.cpp.o -c /Users/buildslave/jenkins/workspace/lldb-cmake/llvm-project/llvm/lib/Target/X86/X86DiscriminateMemOps.cpp [7/2754] /Users/buildslave/jenkins/workspace/lldb-cmake/host-compiler/bin/clang++ -DGTEST_HAS_RTTI=0 -D_DEBUG -D__STDC_CONSTANT_MACROS -D__STDC_FORMAT_MACROS -D__STDC_LIMIT_MACROS -Ilib/Target/X86 -I/Users/buildslave/jenkins/workspace/lldb-cmake/llvm-project/llvm/lib/Target/X86 -Iinclude -I/Users/buildslave/jenkins/workspace/lldb-cmake/llvm-project/llvm/include -Wdocumentation -fPIC -fvisibility-inlines-hidden -Werror=date-time -Werror=unguarded-availability-new -fmodules -fmodules-cache-path=/Users/buildslave/jenkins/workspace/lldb-cmake/lldb-build/module.cache -fcxx-modules -Xclang -fmodules-local-submodule-visibility -Wall -Wextra -Wno-unused-parameter -Wwrite-strings -Wcast-qual -Wmissing-field-initializers -pedantic -Wno-long-long -Wimplicit-fallthrough -Wcovered-switch-default -Wno-noexcept-type -Wnon-virtual-dtor -Wdelete-non-virtual-dtor -Wsuggest-override -Wstring-conversion -fdiagnostics-color -O3 -isysroot /Applications/Xcode.app/Contents/Developer/Platforms/MacOSX.platform/Developer/SDKs/MacOSX10.15.sdk -fno-exceptions -fno-rtti -UNDEBUG -std=c++14 -MD -MT lib/Target/X86/CMakeFiles/LLVMX86CodeGen.dir/X86ExpandPseudo.cpp.o -MF lib/Target/X86/CMakeFiles/LLVMX86CodeGen.dir/X86ExpandPseudo.cpp.o.d -o lib/Target/X86/CMakeFiles/LLVMX86CodeGen.dir/X86ExpandPseudo.cpp.o -c /Users/buildslave/jenkins/workspace/lldb-cmake/llvm-project/llvm/lib/Target/X86/X86ExpandPseudo.cpp [8/2754] /Users/buildslave/jenkins/workspace/lldb-cmake/host-compiler/bin/clang++ -DGTEST_HAS_RTTI=0 -D_DEBUG -D__STDC_CONSTANT_MACROS -D__STDC_FORMAT_MACROS -D__STDC_LIMIT_MACROS -Ilib/Target/X86 -I/Users/buildslave/jenkins/workspace/lldb-cmake/llvm-project/llvm/lib/Target/X86 -Iinclude -I/Users/buildslave/jenkins/workspace/lldb-cmake/llvm-project/llvm/include -Wdocumentation -fPIC -fvisibility-inlines-hidden -Werror=date-time -Werror=unguarded-availability-new -fmodules -fmodules-cache-path=/Users/buildslave/jenkins/workspace/lldb-cmake/lldb-build/module.cache -fcxx-modules -Xclang -fmodules-local-submodule-visibility -Wall -Wextra -Wno-unused-parameter -Wwrite-strings -Wcast-qual -Wmissing-field-initializers -pedantic -Wno-long-long -Wimplicit-fallthrough -Wcovered-switch-default -Wno-noexcept-type -Wnon-virtual-dtor -Wdelete-non-virtual-dtor -Wsuggest-override -Wstring-conversion -fdiagnostics-color -O3 -isysroot /Applications/Xcode.app/Contents/Developer/Platforms/MacOSX.platform/Developer/SDKs/MacOSX10.15.sdk -fno-exceptions -fno-rtti -UNDEBUG -std=c++14 -MD -MT lib/Target/X86/CMakeFiles/LLVMX86CodeGen.dir/X86CallFrameOptimization.cpp.o -MF lib/Target/X86/CMakeFiles/LLVMX86CodeGen.dir/X86CallFrameOptimization.cpp.o.d -o lib/Target/X86/CMakeFiles/LLVMX86CodeGen.dir/X86CallFrameOptimization.cpp.o -c /Users/buildslave/jenkins/workspace/lldb-cmake/llvm-project/llvm/lib/Target/X86/X86CallFrameOptimization.cpp [9/2754] /Users/buildslave/jenkins/workspace/lldb-cmake/host-compiler/bin/clang++ -DGTEST_HAS_RTTI=0 -D_DEBUG -D__STDC_CONSTANT_MACROS -D__STDC_FORMAT_MACROS -D__STDC_LIMIT_MACROS -Ilib/Target/X86 -I/Users/buildslave/jenkins/workspace/lldb-cmake/llvm-project/llvm/lib/Target/X86 -Iinclude -I/Users/buildslave/jenkins/workspace/lldb-cmake/llvm-project/llvm/include -Wdocumentation -fPIC -fvisibility-inlines-hidden -Werror=date-time -Werror=unguarded-availability-new -fmodules -fmodules-cache-path=/Users/buildslave/jenkins/workspace/lldb-cmake/lldb-build/module.cache -fcxx-modules -Xclang -fmodules-local-submodule-visibility -Wall -Wextra -Wno-unused-parameter -Wwrite-strings -Wcast-qual -Wmissing-field-initializers -pedantic -Wno-long-long -Wimplicit-fallthrough -Wcovered-switch-default -Wno-noexcept-type -Wnon-virtual-dtor -Wdelete-non-virtual-dtor -Wsuggest-override -Wstring-conversion -fdiagnostics-color -O3 -isysroot /Applications/Xcode.app/Contents/Developer/Platforms/MacOSX.platform/Developer/SDKs/MacOSX10.15.sdk -fno-exceptions -fno-rtti -UNDEBUG -std=c++14 -MD -MT lib/Target/X86/CMakeFiles/LLVMX86CodeGen.dir/X86DomainReassignment.cpp.o -MF lib/Target/X86/CMakeFiles/LLVMX86CodeGen.dir/X86DomainReassignment.cpp.o.d -o lib/Target/X86/CMakeFiles/LLVMX86CodeGen.dir/X86DomainReassignment.cpp.o -c /Users/buildslave/jenkins/workspace/lldb-cmake/llvm-project/llvm/lib/Target/X86/X86DomainReassignment.cpp [10/2754] /Users/buildslave/jenkins/workspace/lldb-cmake/host-compiler/bin/clang++ -DGTEST_HAS_RTTI=0 -D_DEBUG -D__STDC_CONSTANT_MACROS -D__STDC_FORMAT_MACROS -D__STDC_LIMIT_MACROS -Ilib/Target/X86 -I/Users/buildslave/jenkins/workspace/lldb-cmake/llvm-project/llvm/lib/Target/X86 -Iinclude -I/Users/buildslave/jenkins/workspace/lldb-cmake/llvm-project/llvm/include -Wdocumentation -fPIC -fvisibility-inlines-hidden -Werror=date-time -Werror=unguarded-availability-new -fmodules -fmodules-cache-path=/Users/buildslave/jenkins/workspace/lldb-cmake/lldb-build/module.cache -fcxx-modules -Xclang -fmodules-local-submodule-visibility -Wall -Wextra -Wno-unused-parameter -Wwrite-strings -Wcast-qual -Wmissing-field-initializers -pedantic -Wno-long-long -Wimplicit-fallthrough -Wcovered-switch-default -Wno-noexcept-type -Wnon-virtual-dtor -Wdelete-non-virtual-dtor -Wsuggest-override -Wstring-conversion -fdiagnostics-color -O3 -isysroot /Applications/Xcode.app/Contents/Developer/Platforms/MacOSX.platform/Developer/SDKs/MacOSX10.15.sdk -fno-exceptions -fno-rtti -UNDEBUG -std=c++14 -MD -MT lib/Target/X86/CMakeFiles/LLVMX86CodeGen.dir/X86CmovConversion.cpp.o -MF lib/Target/X86/CMakeFiles/LLVMX86CodeGen.dir/X86CmovConversion.cpp.o.d -o lib/Target/X86/CMakeFiles/LLVMX86CodeGen.dir/X86CmovConversion.cpp.o -c /Users/buildslave/jenkins/workspace/lldb-cmake/llvm-project/llvm/lib/Target/X86/X86CmovConversion.cpp [11/2754] /Users/buildslave/jenkins/workspace/lldb-cmake/host-compiler/bin/clang++ -DGTEST_HAS_RTTI=0 -D_DEBUG -D__STDC_CONSTANT_MACROS -D__STDC_FORMAT_MACROS -D__STDC_LIMIT_MACROS -Ilib/Target/X86 -I/Users/buildslave/jenkins/workspace/lldb-cmake/llvm-project/llvm/lib/Target/X86 -Iinclude -I/Users/buildslave/jenkins/workspace/lldb-cmake/llvm-project/llvm/include -Wdocumentation -fPIC -fvisibility-inlines-hidden -Werror=date-time -Werror=unguarded-availability-new -fmodules -fmodules-cache-path=/Users/buildslave/jenkins/workspace/lldb-cmake/lldb-build/module.cache -fcxx-modules -Xclang -fmodules-local-submodule-visibility -Wall -Wextra -Wno-unused-parameter -Wwrite-strings -Wcast-qual -Wmissing-field-initializers -pedantic -Wno-long-long -Wimplicit-fallthrough -Wcovered-switch-default -Wno-noexcept-type -Wnon-virtual-dtor -Wdelete-non-virtual-dtor -Wsuggest-override -Wstring-conversion -fdiagnostics-color -O3 -isysroot /Applications/Xcode.app/Contents/Developer/Platforms/MacOSX.platform/Developer/SDKs/MacOSX10.15.sdk -fno-exceptions -fno-rtti -UNDEBUG -std=c++14 -MD -MT lib/Target/X86/CMakeFiles/LLVMX86CodeGen.dir/X86CallingConv.cpp.o -MF lib/Target/X86/CMakeFiles/LLVMX86CodeGen.dir/X86CallingConv.cpp.o.d -o lib/Target/X86/CMakeFiles/LLVMX86CodeGen.dir/X86CallingConv.cpp.o -c /Users/buildslave/jenkins/workspace/lldb-cmake/llvm-project/llvm/lib/Target/X86/X86CallingConv.cpp [12/2754] /Users/buildslave/jenkins/workspace/lldb-cmake/host-compiler/bin/clang++ -DGTEST_HAS_RTTI=0 -D_DEBUG -D__STDC_CONSTANT_MACROS -D__STDC_FORMAT_MACROS -D__STDC_LIMIT_MACROS -Ilib/Target/X86 -I/Users/buildslave/jenkins/workspace/lldb-cmake/llvm-project/llvm/lib/Target/X86 -Iinclude -I/Users/buildslave/jenkins/workspace/lldb-cmake/llvm-project/llvm/include -Wdocumentation -fPIC -fvisibility-inlines-hidden -Werror=date-time -Werror=unguarded-availability-new -fmodules -fmodules-cache-path=/Users/buildslave/jenkins/workspace/lldb-cmake/lldb-build/module.cache -fcxx-modules -Xclang -fmodules-local-submodule-visibility -Wall -Wextra -Wno-unused-parameter -Wwrite-strings -Wcast-qual -Wmissing-field-initializers -pedantic -Wno-long-long -Wimplicit-fallthrough -Wcovered-switch-default -Wno-noexcept-type -Wnon-virtual-dtor -Wdelete-non-virtual-dtor -Wsuggest-override -Wstring-conversion -fdiagnostics-color -O3 -isysroot /Applications/Xcode.app/Contents/Developer/Platforms/MacOSX.platform/Developer/SDKs/MacOSX10.15.sdk -fno-exceptions -fno-rtti -UNDEBUG -std=c++14 -MD -MT lib/Target/X86/CMakeFiles/LLVMX86CodeGen.dir/X86FixupBWInsts.cpp.o -MF lib/Target/X86/CMakeFiles/LLVMX86CodeGen.dir/X86FixupBWInsts.cpp.o.d -o lib/Target/X86/CMakeFiles/LLVMX86CodeGen.dir/X86FixupBWInsts.cpp.o -c /Users/buildslave/jenkins/workspace/lldb-cmake/llvm-project/llvm/lib/Target/X86/X86FixupBWInsts.cpp [13/2754] /Users/buildslave/jenkins/workspace/lldb-cmake/host-compiler/bin/clang++ -DGTEST_HAS_RTTI=0 -D_DEBUG -D__STDC_CONSTANT_MACROS -D__STDC_FORMAT_MACROS -D__STDC_LIMIT_MACROS -Ilib/Target/X86 -I/Users/buildslave/jenkins/workspace/lldb-cmake/llvm-project/llvm/lib/Target/X86 -Iinclude -I/Users/buildslave/jenkins/workspace/lldb-cmake/llvm-project/llvm/include -Wdocumentation -fPIC -fvisibility-inlines-hidden -Werror=date-time -Werror=unguarded-availability-new -fmodules -fmodules-cache-path=/Users/buildslave/jenkins/workspace/lldb-cmake/lldb-build/module.cache -fcxx-modules -Xclang -fmodules-local-submodule-visibility -Wall -Wextra -Wno-unused-parameter -Wwrite-strings -Wcast-qual -Wmissing-field-initializers -pedantic -Wno-long-long -Wimplicit-fallthrough -Wcovered-switch-default -Wno-noexcept-type -Wnon-virtual-dtor -Wdelete-non-virtual-dtor -Wsuggest-override -Wstring-conversion -fdiagnostics-color -O3 -isysroot /Applications/Xcode.app/Contents/Developer/Platforms/MacOSX.platform/Developer/SDKs/MacOSX10.15.sdk -fno-exceptions -fno-rtti -UNDEBUG -std=c++14 -MD -MT lib/Target/X86/CMakeFiles/LLVMX86CodeGen.dir/X86FixupSetCC.cpp.o -MF lib/Target/X86/CMakeFiles/LLVMX86CodeGen.dir/X86FixupSetCC.cpp.o.d -o lib/Target/X86/CMakeFiles/LLVMX86CodeGen.dir/X86FixupSetCC.cpp.o -c /Users/buildslave/jenkins/workspace/lldb-cmake/llvm-project/llvm/lib/Target/X86/X86FixupSetCC.cpp [14/2754] /Users/buildslave/jenkins/workspace/lldb-cmake/host-compiler/bin/clang++ -DGTEST_HAS_RTTI=0 -D_DEBUG -D__STDC_CONSTANT_MACROS -D__STDC_FORMAT_MACROS -D__STDC_LIMIT_MACROS -Ilib/Target/X86 -I/Users/buildslave/jenkins/workspace/lldb-cmake/llvm-project/llvm/lib/Target/X86 -Iinclude -I/Users/buildslave/jenkins/workspace/lldb-cmake/llvm-project/llvm/include -Wdocumentation -fPIC -fvisibility-inlines-hidden -Werror=date-time -Werror=unguarded-availability-new -fmodules -fmodules-cache-path=/Users/buildslave/jenkins/workspace/lldb-cmake/lldb-build/module.cache -fcxx-modules -Xclang -fmodules-local-submodule-visibility -Wall -Wextra -Wno-unused-parameter -Wwrite-strings -Wcast-qual -Wmissing-field-initializers -pedantic -Wno-long-long -Wimplicit-fallthrough -Wcovered-switch-default -Wno-noexcept-type -Wnon-virtual-dtor -Wdelete-non-virtual-dtor -Wsuggest-override -Wstring-conversion -fdiagnostics-color -O3 -isysroot /Applications/Xcode.app/Contents/Developer/Platforms/MacOSX.platform/Developer/SDKs/MacOSX10.15.sdk -fno-exceptions -fno-rtti -UNDEBUG -std=c++14 -MD -MT lib/Target/X86/CMakeFiles/LLVMX86CodeGen.dir/X86FixupLEAs.cpp.o -MF lib/Target/X86/CMakeFiles/LLVMX86CodeGen.dir/X86FixupLEAs.cpp.o.d -o lib/Target/X86/CMakeFiles/LLVMX86CodeGen.dir/X86FixupLEAs.cpp.o -c /Users/buildslave/jenkins/workspace/lldb-cmake/llvm-project/llvm/lib/Target/X86/X86FixupLEAs.cpp [15/2754] /Users/buildslave/jenkins/workspace/lldb-cmake/host-compiler/bin/clang++ -DGTEST_HAS_RTTI=0 -D_DEBUG -D__STDC_CONSTANT_MACROS -D__STDC_FORMAT_MACROS -D__STDC_LIMIT_MACROS -Ilib/Target/X86 -I/Users/buildslave/jenkins/workspace/lldb-cmake/llvm-project/llvm/lib/Target/X86 -Iinclude -I/Users/buildslave/jenkins/workspace/lldb-cmake/llvm-project/llvm/include -Wdocumentation -fPIC -fvisibility-inlines-hidden -Werror=date-time -Werror=unguarded-availability-new -fmodules -fmodules-cache-path=/Users/buildslave/jenkins/workspace/lldb-cmake/lldb-build/module.cache -fcxx-modules -Xclang -fmodules-local-submodule-visibility -Wall -Wextra -Wno-unused-parameter -Wwrite-strings -Wcast-qual -Wmissing-field-initializers -pedantic -Wno-long-long -Wimplicit-fallthrough -Wcovered-switch-default -Wno-noexcept-type -Wnon-virtual-dtor -Wdelete-non-virtual-dtor -Wsuggest-override -Wstring-conversion -fdiagnostics-color -O3 -isysroot /Applications/Xcode.app/Contents/Developer/Platforms/MacOSX.platform/Developer/SDKs/MacOSX10.15.sdk -fno-exceptions -fno-rtti -UNDEBUG -std=c++14 -MD -MT lib/Target/X86/CMakeFiles/LLVMX86CodeGen.dir/X86AvoidStoreForwardingBlocks.cpp.o -MF lib/Target/X86/CMakeFiles/LLVMX86CodeGen.dir/X86AvoidStoreForwardingBlocks.cpp.o.d -o lib/Target/X86/CMakeFiles/LLVMX86CodeGen.dir/X86AvoidStoreForwardingBlocks.cpp.o -c /Users/buildslave/jenkins/workspace/lldb-cmake/llvm-project/llvm/lib/Target/X86/X86AvoidStoreForwardingBlocks.cpp [16/2754] /Users/buildslave/jenkins/workspace/lldb-cmake/host-compiler/bin/clang++ -DGTEST_HAS_RTTI=0 -D_DEBUG -D__STDC_CONSTANT_MACROS -D__STDC_FORMAT_MACROS -D__STDC_LIMIT_MACROS -Ilib/Target/X86 -I/Users/buildslave/jenkins/workspace/lldb-cmake/llvm-project/llvm/lib/Target/X86 -Iinclude -I/Users/buildslave/jenkins/workspace/lldb-cmake/llvm-project/llvm/include -Wdocumentation -fPIC -fvisibility-inlines-hidden -Werror=date-time -Werror=unguarded-availability-new -fmodules -fmodules-cache-path=/Users/buildslave/jenkins/workspace/lldb-cmake/lldb-build/module.cache -fcxx-modules -Xclang -fmodules-local-submodule-visibility -Wall -Wextra -Wno-unused-parameter -Wwrite-strings -Wcast-qual -Wmissing-field-initializers -pedantic -Wno-long-long -Wimplicit-fallthrough -Wcovered-switch-default -Wno-noexcept-type -Wnon-virtual-dtor -Wdelete-non-virtual-dtor -Wsuggest-override -Wstring-conversion -fdiagnostics-color -O3 -isysroot /Applications/Xcode.app/Contents/Developer/Platforms/MacOSX.platform/Developer/SDKs/MacOSX10.15.sdk -fno-exceptions -fno-rtti -UNDEBUG -std=c++14 -MD -MT lib/Target/X86/CMakeFiles/LLVMX86CodeGen.dir/X86FlagsCopyLowering.cpp.o -MF lib/Target/X86/CMakeFiles/LLVMX86CodeGen.dir/X86FlagsCopyLowering.cpp.o.d -o lib/Target/X86/CMakeFiles/LLVMX86CodeGen.dir/X86FlagsCopyLowering.cpp.o -c /Users/buildslave/jenkins/workspace/lldb-cmake/llvm-project/llvm/lib/Target/X86/X86FlagsCopyLowering.cpp [17/2754] /Users/buildslave/jenkins/workspace/lldb-cmake/host-compiler/bin/clang++ -DGTEST_HAS_RTTI=0 -D_DEBUG -D__STDC_CONSTANT_MACROS -D__STDC_FORMAT_MACROS -D__STDC_LIMIT_MACROS -Ilib/Target/X86 -I/Users/buildslave/jenkins/workspace/lldb-cmake/llvm-project/llvm/lib/Target/X86 -Iinclude -I/Users/buildslave/jenkins/workspace/lldb-cmake/llvm-project/llvm/include -Wdocumentation -fPIC -fvisibility-inlines-hidden -Werror=date-time -Werror=unguarded-availability-new -fmodules -fmodules-cache-path=/Users/buildslave/jenkins/workspace/lldb-cmake/lldb-build/module.cache -fcxx-modules -Xclang -fmodules-local-submodule-visibility -Wall -Wextra -Wno-unused-parameter -Wwrite-strings -Wcast-qual -Wmissing-field-initializers -pedantic -Wno-long-long -Wimplicit-fallthrough -Wcovered-switch-default -Wno-noexcept-type -Wnon-virtual-dtor -Wdelete-non-virtual-dtor -Wsuggest-override -Wstring-conversion -fdiagnostics-color -O3 -isysroot /Applications/Xcode.app/Contents/Developer/Platforms/MacOSX.platform/Developer/SDKs/MacOSX10.15.sdk -fno-exceptions -fno-rtti -UNDEBUG -std=c++14 -MD -MT lib/Target/X86/CMakeFiles/LLVMX86CodeGen.dir/X86FloatingPoint.cpp.o -MF lib/Target/X86/CMakeFiles/LLVMX86CodeGen.dir/X86FloatingPoint.cpp.o.d -o lib/Target/X86/CMakeFiles/LLVMX86CodeGen.dir/X86FloatingPoint.cpp.o -c /Users/buildslave/jenkins/workspace/lldb-cmake/llvm-project/llvm/lib/Target/X86/X86FloatingPoint.cpp [18/2754] /Users/buildslave/jenkins/workspace/lldb-cmake/host-compiler/bin/clang++ -DGTEST_HAS_RTTI=0 -D_DEBUG -D__STDC_CONSTANT_MACROS -D__STDC_FORMAT_MACROS -D__STDC_LIMIT_MACROS -Ilib/Target/X86 -I/Users/buildslave/jenkins/workspace/lldb-cmake/llvm-project/llvm/lib/Target/X86 -Iinclude -I/Users/buildslave/jenkins/workspace/lldb-cmake/llvm-project/llvm/include -Wdocumentation -fPIC -fvisibility-inlines-hidden -Werror=date-time -Werror=unguarded-availability-new -fmodules -fmodules-cache-path=/Users/buildslave/jenkins/workspace/lldb-cmake/lldb-build/module.cache -fcxx-modules -Xclang -fmodules-local-submodule-visibility -Wall -Wextra -Wno-unused-parameter -Wwrite-strings -Wcast-qual -Wmissing-field-initializers -pedantic -Wno-long-long -Wimplicit-fallthrough -Wcovered-switch-default -Wno-noexcept-type -Wnon-virtual-dtor -Wdelete-non-virtual-dtor -Wsuggest-override -Wstring-conversion -fdiagnostics-color -O3 -isysroot /Applications/Xcode.app/Contents/Developer/Platforms/MacOSX.platform/Developer/SDKs/MacOSX10.15.sdk -fno-exceptions -fno-rtti -UNDEBUG -std=c++14 -MD -MT lib/Target/X86/CMakeFiles/LLVMX86CodeGen.dir/X86IndirectBranchTracking.cpp.o -MF lib/Target/X86/CMakeFiles/LLVMX86CodeGen.dir/X86IndirectBranchTracking.cpp.o.d -o lib/Target/X86/CMakeFiles/LLVMX86CodeGen.dir/X86IndirectBranchTracking.cpp.o -c /Users/buildslave/jenkins/workspace/lldb-cmake/llvm-project/llvm/lib/Target/X86/X86IndirectBranchTracking.cpp [19/2754] /Users/buildslave/jenkins/workspace/lldb-cmake/host-compiler/bin/clang++ -DGTEST_HAS_RTTI=0 -D_DEBUG -D__STDC_CONSTANT_MACROS -D__STDC_FORMAT_MACROS -D__STDC_LIMIT_MACROS -Ilib/Target/X86 -I/Users/buildslave/jenkins/workspace/lldb-cmake/llvm-project/llvm/lib/Target/X86 -Iinclude -I/Users/buildslave/jenkins/workspace/lldb-cmake/llvm-project/llvm/include -Wdocumentation -fPIC -fvisibility-inlines-hidden -Werror=date-time -Werror=unguarded-availability-new -fmodules -fmodules-cache-path=/Users/buildslave/jenkins/workspace/lldb-cmake/lldb-build/module.cache -fcxx-modules -Xclang -fmodules-local-submodule-visibility -Wall -Wextra -Wno-unused-parameter -Wwrite-strings -Wcast-qual -Wmissing-field-initializers -pedantic -Wno-long-long -Wimplicit-fallthrough -Wcovered-switch-default -Wno-noexcept-type -Wnon-virtual-dtor -Wdelete-non-virtual-dtor -Wsuggest-override -Wstring-conversion -fdiagnostics-color -O3 -isysroot /Applications/Xcode.app/Contents/Developer/Platforms/MacOSX.platform/Developer/SDKs/MacOSX10.15.sdk -fno-exceptions -fno-rtti -UNDEBUG -std=c++14 -MD -MT lib/Target/X86/CMakeFiles/LLVMX86CodeGen.dir/X86IndirectThunks.cpp.o -MF lib/Target/X86/CMakeFiles/LLVMX86CodeGen.dir/X86IndirectThunks.cpp.o.d -o lib/Target/X86/CMakeFiles/LLVMX86CodeGen.dir/X86IndirectThunks.cpp.o -c /Users/buildslave/jenkins/workspace/lldb-cmake/llvm-project/llvm/lib/Target/X86/X86IndirectThunks.cpp [20/2754] /Users/buildslave/jenkins/workspace/lldb-cmake/host-compiler/bin/clang++ -DGTEST_HAS_RTTI=0 -D_DEBUG -D__STDC_CONSTANT_MACROS -D__STDC_FORMAT_MACROS -D__STDC_LIMIT_MACROS -Ilib/Target/X86 -I/Users/buildslave/jenkins/workspace/lldb-cmake/llvm-project/llvm/lib/Target/X86 -Iinclude -I/Users/buildslave/jenkins/workspace/lldb-cmake/llvm-project/llvm/include -Wdocumentation -fPIC -fvisibility-inlines-hidden -Werror=date-time -Werror=unguarded-availability-new -fmodules -fmodules-cache-path=/Users/buildslave/jenkins/workspace/lldb-cmake/lldb-build/module.cache -fcxx-modules -Xclang -fmodules-local-submodule-visibility -Wall -Wextra -Wno-unused-parameter -Wwrite-strings -Wcast-qual -Wmissing-field-initializers -pedantic -Wno-long-long -Wimplicit-fallthrough -Wcovered-switch-default -Wno-noexcept-type -Wnon-virtual-dtor -Wdelete-non-virtual-dtor -Wsuggest-override -Wstring-conversion -fdiagnostics-color -O3 -isysroot /Applications/Xcode.app/Contents/Developer/Platforms/MacOSX.platform/Developer/SDKs/MacOSX10.15.sdk -fno-exceptions -fno-rtti -UNDEBUG -std=c++14 -MD -MT lib/Target/X86/CMakeFiles/LLVMX86CodeGen.dir/X86InstrFMA3Info.cpp.o -MF lib/Target/X86/CMakeFiles/LLVMX86CodeGen.dir/X86InstrFMA3Info.cpp.o.d -o lib/Target/X86/CMakeFiles/LLVMX86CodeGen.dir/X86InstrFMA3Info.cpp.o -c /Users/buildslave/jenkins/workspace/lldb-cmake/llvm-project/llvm/lib/Target/X86/X86InstrFMA3Info.cpp [21/2754] /Users/buildslave/jenkins/workspace/lldb-cmake/host-compiler/bin/clang++ -DGTEST_HAS_RTTI=0 -D_DEBUG -D__STDC_CONSTANT_MACROS -D__STDC_FORMAT_MACROS -D__STDC_LIMIT_MACROS -Ilib/Target/X86 -I/Users/buildslave/jenkins/workspace/lldb-cmake/llvm-project/llvm/lib/Target/X86 -Iinclude -I/Users/buildslave/jenkins/workspace/lldb-cmake/llvm-project/llvm/include -Wdocumentation -fPIC -fvisibility-inlines-hidden -Werror=date-time -Werror=unguarded-availability-new -fmodules -fmodules-cache-path=/Users/buildslave/jenkins/workspace/lldb-cmake/lldb-build/module.cache -fcxx-modules -Xclang -fmodules-local-submodule-visibility -Wall -Wextra -Wno-unused-parameter -Wwrite-strings -Wcast-qual -Wmissing-field-initializers -pedantic -Wno-long-long -Wimplicit-fallthrough -Wcovered-switch-default -Wno-noexcept-type -Wnon-virtual-dtor -Wdelete-non-virtual-dtor -Wsuggest-override -Wstring-conversion -fdiagnostics-color -O3 -isysroot /Applications/Xcode.app/Contents/Developer/Platforms/MacOSX.platform/Developer/SDKs/MacOSX10.15.sdk -fno-exceptions -fno-rtti -UNDEBUG -std=c++14 -MD -MT lib/Target/X86/CMakeFiles/LLVMX86CodeGen.dir/X86InterleavedAccess.cpp.o -MF lib/Target/X86/CMakeFiles/LLVMX86CodeGen.dir/X86InterleavedAccess.cpp.o.d -o lib/Target/X86/CMakeFiles/LLVMX86CodeGen.dir/X86InterleavedAccess.cpp.o -c /Users/buildslave/jenkins/workspace/lldb-cmake/llvm-project/llvm/lib/Target/X86/X86InterleavedAccess.cpp [22/2754] /Users/buildslave/jenkins/workspace/lldb-cmake/host-compiler/bin/clang++ -DGTEST_HAS_RTTI=0 -D_DEBUG -D__STDC_CONSTANT_MACROS -D__STDC_FORMAT_MACROS -D__STDC_LIMIT_MACROS -Ilib/Target/X86 -I/Users/buildslave/jenkins/workspace/lldb-cmake/llvm-project/llvm/lib/Target/X86 -Iinclude -I/Users/buildslave/jenkins/workspace/lldb-cmake/llvm-project/llvm/include -Wdocumentation -fPIC -fvisibility-inlines-hidden -Werror=date-time -Werror=unguarded-availability-new -fmodules -fmodules-cache-path=/Users/buildslave/jenkins/workspace/lldb-cmake/lldb-build/module.cache -fcxx-modules -Xclang -fmodules-local-submodule-visibility -Wall -Wextra -Wno-unused-parameter -Wwrite-strings -Wcast-qual -Wmissing-field-initializers -pedantic -Wno-long-long -Wimplicit-fallthrough -Wcovered-switch-default -Wno-noexcept-type -Wnon-virtual-dtor -Wdelete-non-virtual-dtor -Wsuggest-override -Wstring-conversion -fdiagnostics-color -O3 -isysroot /Applications/Xcode.app/Contents/Developer/Platforms/MacOSX.platform/Developer/SDKs/MacOSX10.15.sdk -fno-exceptions -fno-rtti -UNDEBUG -std=c++14 -MD -MT lib/Target/X86/CMakeFiles/LLVMX86CodeGen.dir/X86FrameLowering.cpp.o -MF lib/Target/X86/CMakeFiles/LLVMX86CodeGen.dir/X86FrameLowering.cpp.o.d -o lib/Target/X86/CMakeFiles/LLVMX86CodeGen.dir/X86FrameLowering.cpp.o -c /Users/buildslave/jenkins/workspace/lldb-cmake/llvm-project/llvm/lib/Target/X86/X86FrameLowering.cpp [23/2754] /Users/buildslave/jenkins/workspace/lldb-cmake/host-compiler/bin/clang++ -DGTEST_HAS_RTTI=0 -D_DEBUG -D__STDC_CONSTANT_MACROS -D__STDC_FORMAT_MACROS -D__STDC_LIMIT_MACROS -Ilib/Target/X86 -I/Users/buildslave/jenkins/workspace/lldb-cmake/llvm-project/llvm/lib/Target/X86 -Iinclude -I/Users/buildslave/jenkins/workspace/lldb-cmake/llvm-project/llvm/include -Wdocumentation -fPIC -fvisibility-inlines-hidden -Werror=date-time -Werror=unguarded-availability-new -fmodules -fmodules-cache-path=/Users/buildslave/jenkins/workspace/lldb-cmake/lldb-build/module.cache -fcxx-modules -Xclang -fmodules-local-submodule-visibility -Wall -Wextra -Wno-unused-parameter -Wwrite-strings -Wcast-qual -Wmissing-field-initializers -pedantic -Wno-long-long -Wimplicit-fallthrough -Wcovered-switch-default -Wno-noexcept-type -Wnon-virtual-dtor -Wdelete-non-virtual-dtor -Wsuggest-override -Wstring-conversion -fdiagnostics-color -O3 -isysroot /Applications/Xcode.app/Contents/Developer/Platforms/MacOSX.platform/Developer/SDKs/MacOSX10.15.sdk -fno-exceptions -fno-rtti -UNDEBUG -std=c++14 -MD -MT lib/Target/X86/CMakeFiles/LLVMX86CodeGen.dir/X86InsertPrefetch.cpp.o -MF lib/Target/X86/CMakeFiles/LLVMX86CodeGen.dir/X86InsertPrefetch.cpp.o.d -o lib/Target/X86/CMakeFiles/LLVMX86CodeGen.dir/X86InsertPrefetch.cpp.o -c /Users/buildslave/jenkins/workspace/lldb-cmake/llvm-project/llvm/lib/Target/X86/X86InsertPrefetch.cpp [24/2754] /Users/buildslave/jenkins/workspace/lldb-cmake/host-compiler/bin/clang++ -DGTEST_HAS_RTTI=0 -D_DEBUG -D__STDC_CONSTANT_MACROS -D__STDC_FORMAT_MACROS -D__STDC_LIMIT_MACROS -Ilib/Target/X86 -I/Users/buildslave/jenkins/workspace/lldb-cmake/llvm-project/llvm/lib/Target/X86 -Iinclude -I/Users/buildslave/jenkins/workspace/lldb-cmake/llvm-project/llvm/include -Wdocumentation -fPIC -fvisibility-inlines-hidden -Werror=date-time -Werror=unguarded-availability-new -fmodules -fmodules-cache-path=/Users/buildslave/jenkins/workspace/lldb-cmake/lldb-build/module.cache -fcxx-modules -Xclang -fmodules-local-submodule-visibility -Wall -Wextra -Wno-unused-parameter -Wwrite-strings -Wcast-qual -Wmissing-field-initializers -pedantic -Wno-long-long -Wimplicit-fallthrough -Wcovered-switch-default -Wno-noexcept-type -Wnon-virtual-dtor -Wdelete-non-virtual-dtor -Wsuggest-override -Wstring-conversion -fdiagnostics-color -O3 -isysroot /Applications/Xcode.app/Contents/Developer/Platforms/MacOSX.platform/Developer/SDKs/MacOSX10.15.sdk -fno-exceptions -fno-rtti -UNDEBUG -std=c++14 -MD -MT lib/Target/X86/CMakeFiles/LLVMX86CodeGen.dir/X86InstructionSelector.cpp.o -MF lib/Target/X86/CMakeFiles/LLVMX86CodeGen.dir/X86InstructionSelector.cpp.o.d -o lib/Target/X86/CMakeFiles/LLVMX86CodeGen.dir/X86InstructionSelector.cpp.o -c /Users/buildslave/jenkins/workspace/lldb-cmake/llvm-project/llvm/lib/Target/X86/X86InstructionSelector.cpp [25/2754] /Users/buildslave/jenkins/workspace/lldb-cmake/host-compiler/bin/clang++ -DGTEST_HAS_RTTI=0 -D_DEBUG -D__STDC_CONSTANT_MACROS -D__STDC_FORMAT_MACROS -D__STDC_LIMIT_MACROS -Ilib/Target/X86 -I/Users/buildslave/jenkins/workspace/lldb-cmake/llvm-project/llvm/lib/Target/X86 -Iinclude -I/Users/buildslave/jenkins/workspace/lldb-cmake/llvm-project/llvm/include -Wdocumentation -fPIC -fvisibility-inlines-hidden -Werror=date-time -Werror=unguarded-availability-new -fmodules -fmodules-cache-path=/Users/buildslave/jenkins/workspace/lldb-cmake/lldb-build/module.cache -fcxx-modules -Xclang -fmodules-local-submodule-visibility -Wall -Wextra -Wno-unused-parameter -Wwrite-strings -Wcast-qual -Wmissing-field-initializers -pedantic -Wno-long-long -Wimplicit-fallthrough -Wcovered-switch-default -Wno-noexcept-type -Wnon-virtual-dtor -Wdelete-non-virtual-dtor -Wsuggest-override -Wstring-conversion -fdiagnostics-color -O3 -isysroot /Applications/Xcode.app/Contents/Developer/Platforms/MacOSX.platform/Developer/SDKs/MacOSX10.15.sdk -fno-exceptions -fno-rtti -UNDEBUG -std=c++14 -MD -MT lib/Target/X86/CMakeFiles/LLVMX86CodeGen.dir/X86InstrFoldTables.cpp.o -MF lib/Target/X86/CMakeFiles/LLVMX86CodeGen.dir/X86InstrFoldTables.cpp.o.d -o lib/Target/X86/CMakeFiles/LLVMX86CodeGen.dir/X86InstrFoldTables.cpp.o -c /Users/buildslave/jenkins/workspace/lldb-cmake/llvm-project/llvm/lib/Target/X86/X86InstrFoldTables.cpp [26/2754] /Users/buildslave/jenkins/workspace/lldb-cmake/host-compiler/bin/clang++ -DGTEST_HAS_RTTI=0 -D_DEBUG -D__STDC_CONSTANT_MACROS -D__STDC_FORMAT_MACROS -D__STDC_LIMIT_MACROS -Ilib/Target/X86 -I/Users/buildslave/jenkins/workspace/lldb-cmake/llvm-project/llvm/lib/Target/X86 -Iinclude -I/Users/buildslave/jenkins/workspace/lldb-cmake/llvm-project/llvm/include -Wdocumentation -fPIC -fvisibility-inlines-hidden -Werror=date-time -Werror=unguarded-availability-new -fmodules -fmodules-cache-path=/Users/buildslave/jenkins/workspace/lldb-cmake/lldb-build/module.cache -fcxx-modules -Xclang -fmodules-local-submodule-visibility -Wall -Wextra -Wno-unused-parameter -Wwrite-strings -Wcast-qual -Wmissing-field-initializers -pedantic -Wno-long-long -Wimplicit-fallthrough -Wcovered-switch-default -Wno-noexcept-type -Wnon-virtual-dtor -Wdelete-non-virtual-dtor -Wsuggest-override -Wstring-conversion -fdiagnostics-color -O3 -isysroot /Applications/Xcode.app/Contents/Developer/Platforms/MacOSX.platform/Developer/SDKs/MacOSX10.15.sdk -fno-exceptions -fno-rtti -UNDEBUG -std=c++14 -MD -MT lib/Target/X86/CMakeFiles/LLVMX86CodeGen.dir/X86FastISel.cpp.o -MF lib/Target/X86/CMakeFiles/LLVMX86CodeGen.dir/X86FastISel.cpp.o.d -o lib/Target/X86/CMakeFiles/LLVMX86CodeGen.dir/X86FastISel.cpp.o -c /Users/buildslave/jenkins/workspace/lldb-cmake/llvm-project/llvm/lib/Target/X86/X86FastISel.cpp [27/2754] /Users/buildslave/jenkins/workspace/lldb-cmake/host-compiler/bin/clang++ -DGTEST_HAS_RTTI=0 -D_DEBUG -D__STDC_CONSTANT_MACROS -D__STDC_FORMAT_MACROS -D__STDC_LIMIT_MACROS -Ilib/Target/X86 -I/Users/buildslave/jenkins/workspace/lldb-cmake/llvm-project/llvm/lib/Target/X86 -Iinclude -I/Users/buildslave/jenkins/workspace/lldb-cmake/llvm-project/llvm/include -Wdocumentation -fPIC -fvisibility-inlines-hidden -Werror=date-time -Werror=unguarded-availability-new -fmodules -fmodules-cache-path=/Users/buildslave/jenkins/workspace/lldb-cmake/lldb-build/module.cache -fcxx-modules -Xclang -fmodules-local-submodule-visibility -Wall -Wextra -Wno-unused-parameter -Wwrite-strings -Wcast-qual -Wmissing-field-initializers -pedantic -Wno-long-long -Wimplicit-fallthrough -Wcovered-switch-default -Wno-noexcept-type -Wnon-virtual-dtor -Wdelete-non-virtual-dtor -Wsuggest-override -Wstring-conversion -fdiagnostics-color -O3 -isysroot /Applications/Xcode.app/Contents/Developer/Platforms/MacOSX.platform/Developer/SDKs/MacOSX10.15.sdk -fno-exceptions -fno-rtti -UNDEBUG -std=c++14 -MD -MT lib/Target/X86/CMakeFiles/LLVMX86CodeGen.dir/X86InstCombineIntrinsic.cpp.o -MF lib/Target/X86/CMakeFiles/LLVMX86CodeGen.dir/X86InstCombineIntrinsic.cpp.o.d -o lib/Target/X86/CMakeFiles/LLVMX86CodeGen.dir/X86InstCombineIntrinsic.cpp.o -c /Users/buildslave/jenkins/workspace/lldb-cmake/llvm-project/llvm/lib/Target/X86/X86InstCombineIntrinsic.cpp [28/2754] /Users/buildslave/jenkins/workspace/lldb-cmake/host-compiler/bin/clang++ -DGTEST_HAS_RTTI=0 -D_DEBUG -D__STDC_CONSTANT_MACROS -D__STDC_FORMAT_MACROS -D__STDC_LIMIT_MACROS -Ilib/Target/X86 -I/Users/buildslave/jenkins/workspace/lldb-cmake/llvm-project/llvm/lib/Target/X86 -Iinclude -I/Users/buildslave/jenkins/workspace/lldb-cmake/llvm-project/llvm/include -Wdocumentation -fPIC -fvisibility-inlines-hidden -Werror=date-time -Werror=unguarded-availability-new -fmodules -fmodules-cache-path=/Users/buildslave/jenkins/workspace/lldb-cmake/lldb-build/module.cache -fcxx-modules -Xclang -fmodules-local-submodule-visibility -Wall -Wextra -Wno-unused-parameter -Wwrite-strings -Wcast-qual -Wmissing-field-initializers -pedantic -Wno-long-long -Wimplicit-fallthrough -Wcovered-switch-default -Wno-noexcept-type -Wnon-virtual-dtor -Wdelete-non-virtual-dtor -Wsuggest-override -Wstring-conversion -fdiagnostics-color -O3 -isysroot /Applications/Xcode.app/Contents/Developer/Platforms/MacOSX.platform/Developer/SDKs/MacOSX10.15.sdk -fno-exceptions -fno-rtti -UNDEBUG -std=c++14 -MD -MT lib/Target/X86/CMakeFiles/LLVMX86CodeGen.dir/X86EvexToVex.cpp.o -MF lib/Target/X86/CMakeFiles/LLVMX86CodeGen.dir/X86EvexToVex.cpp.o.d -o lib/Target/X86/CMakeFiles/LLVMX86CodeGen.dir/X86EvexToVex.cpp.o -c /Users/buildslave/jenkins/workspace/lldb-cmake/llvm-project/llvm/lib/Target/X86/X86EvexToVex.cpp [29/2754] /Users/buildslave/jenkins/workspace/lldb-cmake/host-compiler/bin/clang++ -DGTEST_HAS_RTTI=0 -D_DEBUG -D__STDC_CONSTANT_MACROS -D__STDC_FORMAT_MACROS -D__STDC_LIMIT_MACROS -Ilib/Target/X86 -I/Users/buildslave/jenkins/workspace/lldb-cmake/llvm-project/llvm/lib/Target/X86 -Iinclude -I/Users/buildslave/jenkins/workspace/lldb-cmake/llvm-project/llvm/include -Wdocumentation -fPIC -fvisibility-inlines-hidden -Werror=date-time -Werror=unguarded-availability-new -fmodules -fmodules-cache-path=/Users/buildslave/jenkins/workspace/lldb-cmake/lldb-build/module.cache -fcxx-modules -Xclang -fmodules-local-submodule-visibility -Wall -Wextra -Wno-unused-parameter -Wwrite-strings -Wcast-qual -Wmissing-field-initializers -pedantic -Wno-long-long -Wimplicit-fallthrough -Wcovered-switch-default -Wno-noexcept-type -Wnon-virtual-dtor -Wdelete-non-virtual-dtor -Wsuggest-override -Wstring-conversion -fdiagnostics-color -O3 -isysroot /Applications/Xcode.app/Contents/Developer/Platforms/MacOSX.platform/Developer/SDKs/MacOSX10.15.sdk -fno-exceptions -fno-rtti -UNDEBUG -std=c++14 -MD -MT lib/Target/X86/CMakeFiles/LLVMX86CodeGen.dir/X86LoadValueInjectionRetHardening.cpp.o -MF lib/Target/X86/CMakeFiles/LLVMX86CodeGen.dir/X86LoadValueInjectionRetHardening.cpp.o.d -o lib/Target/X86/CMakeFiles/LLVMX86CodeGen.dir/X86LoadValueInjectionRetHardening.cpp.o -c /Users/buildslave/jenkins/workspace/lldb-cmake/llvm-project/llvm/lib/Target/X86/X86LoadValueInjectionRetHardening.cpp [30/2754] /Users/buildslave/jenkins/workspace/lldb-cmake/host-compiler/bin/clang++ -DGTEST_HAS_RTTI=0 -D_DEBUG -D__STDC_CONSTANT_MACROS -D__STDC_FORMAT_MACROS -D__STDC_LIMIT_MACROS -Ilib/Target/X86 -I/Users/buildslave/jenkins/workspace/lldb-cmake/llvm-project/llvm/lib/Target/X86 -Iinclude -I/Users/buildslave/jenkins/workspace/lldb-cmake/llvm-project/llvm/include -Wdocumentation -fPIC -fvisibility-inlines-hidden -Werror=date-time -Werror=unguarded-availability-new -fmodules -fmodules-cache-path=/Users/buildslave/jenkins/workspace/lldb-cmake/lldb-build/module.cache -fcxx-modules -Xclang -fmodules-local-submodule-visibility -Wall -Wextra -Wno-unused-parameter -Wwrite-strings -Wcast-qual -Wmissing-field-initializers -pedantic -Wno-long-long -Wimplicit-fallthrough -Wcovered-switch-default -Wno-noexcept-type -Wnon-virtual-dtor -Wdelete-non-virtual-dtor -Wsuggest-override -Wstring-conversion -fdiagnostics-color -O3 -isysroot /Applications/Xcode.app/Contents/Developer/Platforms/MacOSX.platform/Developer/SDKs/MacOSX10.15.sdk -fno-exceptions -fno-rtti -UNDEBUG -std=c++14 -MD -MT lib/Target/X86/CMakeFiles/LLVMX86CodeGen.dir/X86LegalizerInfo.cpp.o -MF lib/Target/X86/CMakeFiles/LLVMX86CodeGen.dir/X86LegalizerInfo.cpp.o.d -o lib/Target/X86/CMakeFiles/LLVMX86CodeGen.dir/X86LegalizerInfo.cpp.o -c /Users/buildslave/jenkins/workspace/lldb-cmake/llvm-project/llvm/lib/Target/X86/X86LegalizerInfo.cpp [31/2754] /Users/buildslave/jenkins/workspace/lldb-cmake/host-compiler/bin/clang++ -DGTEST_HAS_RTTI=0 -D_DEBUG -D__STDC_CONSTANT_MACROS -D__STDC_FORMAT_MACROS -D__STDC_LIMIT_MACROS -Ilib/Target/X86 -I/Users/buildslave/jenkins/workspace/lldb-cmake/llvm-project/llvm/lib/Target/X86 -Iinclude -I/Users/buildslave/jenkins/workspace/lldb-cmake/llvm-project/llvm/include -Wdocumentation -fPIC -fvisibility-inlines-hidden -Werror=date-time -Werror=unguarded-availability-new -fmodules -fmodules-cache-path=/Users/buildslave/jenkins/workspace/lldb-cmake/lldb-build/module.cache -fcxx-modules -Xclang -fmodules-local-submodule-visibility -Wall -Wextra -Wno-unused-parameter -Wwrite-strings -Wcast-qual -Wmissing-field-initializers -pedantic -Wno-long-long -Wimplicit-fallthrough -Wcovered-switch-default -Wno-noexcept-type -Wnon-virtual-dtor -Wdelete-non-virtual-dtor -Wsuggest-override -Wstring-conversion -fdiagnostics-color -O3 -isysroot /Applications/Xcode.app/Contents/Developer/Platforms/MacOSX.platform/Developer/SDKs/MacOSX10.15.sdk -fno-exceptions -fno-rtti -UNDEBUG -std=c++14 -MD -MT lib/Target/X86/CMakeFiles/LLVMX86CodeGen.dir/X86MachineFunctionInfo.cpp.o -MF lib/Target/X86/CMakeFiles/LLVMX86CodeGen.dir/X86MachineFunctionInfo.cpp.o.d -o lib/Target/X86/CMakeFiles/LLVMX86CodeGen.dir/X86MachineFunctionInfo.cpp.o -c /Users/buildslave/jenkins/workspace/lldb-cmake/llvm-project/llvm/lib/Target/X86/X86MachineFunctionInfo.cpp [32/2754] /Users/buildslave/jenkins/workspace/lldb-cmake/host-compiler/bin/clang++ -DGTEST_HAS_RTTI=0 -D_DEBUG -D__STDC_CONSTANT_MACROS -D__STDC_FORMAT_MACROS -D__STDC_LIMIT_MACROS -Ilib/Target/X86 -I/Users/buildslave/jenkins/workspace/lldb-cmake/llvm-project/llvm/lib/Target/X86 -Iinclude -I/Users/buildslave/jenkins/workspace/lldb-cmake/llvm-project/llvm/include -Wdocumentation -fPIC -fvisibility-inlines-hidden -Werror=date-time -Werror=unguarded-availability-new -fmodules -fmodules-cache-path=/Users/buildslave/jenkins/workspace/lldb-cmake/lldb-build/module.cache -fcxx-modules -Xclang -fmodules-local-submodule-visibility -Wall -Wextra -Wno-unused-parameter -Wwrite-strings -Wcast-qual -Wmissing-field-initializers -pedantic -Wno-long-long -Wimplicit-fallthrough -Wcovered-switch-default -Wno-noexcept-type -Wnon-virtual-dtor -Wdelete-non-virtual-dtor -Wsuggest-override -Wstring-conversion -fdiagnostics-color -O3 -isysroot /Applications/Xcode.app/Contents/Developer/Platforms/MacOSX.platform/Developer/SDKs/MacOSX10.15.sdk -fno-exceptions -fno-rtti -UNDEBUG -std=c++14 -MD -MT lib/Target/X86/CMakeFiles/LLVMX86CodeGen.dir/X86MacroFusion.cpp.o -MF lib/Target/X86/CMakeFiles/LLVMX86CodeGen.dir/X86MacroFusion.cpp.o.d -o lib/Target/X86/CMakeFiles/LLVMX86CodeGen.dir/X86MacroFusion.cpp.o -c /Users/buildslave/jenkins/workspace/lldb-cmake/llvm-project/llvm/lib/Target/X86/X86MacroFusion.cpp [33/2754] /Users/buildslave/jenkins/workspace/lldb-cmake/host-compiler/bin/clang++ -DGTEST_HAS_RTTI=0 -D_DEBUG -D__STDC_CONSTANT_MACROS -D__STDC_FORMAT_MACROS -D__STDC_LIMIT_MACROS -Ilib/Target/X86 -I/Users/buildslave/jenkins/workspace/lldb-cmake/llvm-project/llvm/lib/Target/X86 -Iinclude -I/Users/buildslave/jenkins/workspace/lldb-cmake/llvm-project/llvm/include -Wdocumentation -fPIC -fvisibility-inlines-hidden -Werror=date-time -Werror=unguarded-availability-new -fmodules -fmodules-cache-path=/Users/buildslave/jenkins/workspace/lldb-cmake/lldb-build/module.cache -fcxx-modules -Xclang -fmodules-local-submodule-visibility -Wall -Wextra -Wno-unused-parameter -Wwrite-strings -Wcast-qual -Wmissing-field-initializers -pedantic -Wno-long-long -Wimplicit-fallthrough -Wcovered-switch-default -Wno-noexcept-type -Wnon-virtual-dtor -Wdelete-non-virtual-dtor -Wsuggest-override -Wstring-conversion -fdiagnostics-color -O3 -isysroot /Applications/Xcode.app/Contents/Developer/Platforms/MacOSX.platform/Developer/SDKs/MacOSX10.15.sdk -fno-exceptions -fno-rtti -UNDEBUG -std=c++14 -MD -MT lib/Target/X86/CMakeFiles/LLVMX86CodeGen.dir/X86MCInstLower.cpp.o -MF lib/Target/X86/CMakeFiles/LLVMX86CodeGen.dir/X86MCInstLower.cpp.o.d -o lib/Target/X86/CMakeFiles/LLVMX86CodeGen.dir/X86MCInstLower.cpp.o -c /Users/buildslave/jenkins/workspace/lldb-cmake/llvm-project/llvm/lib/Target/X86/X86MCInstLower.cpp [34/2754] /Users/buildslave/jenkins/workspace/lldb-cmake/host-compiler/bin/clang++ -DGTEST_HAS_RTTI=0 -D_DEBUG -D__STDC_CONSTANT_MACROS -D__STDC_FORMAT_MACROS -D__STDC_LIMIT_MACROS -Ilib/Target/X86 -I/Users/buildslave/jenkins/workspace/lldb-cmake/llvm-project/llvm/lib/Target/X86 -Iinclude -I/Users/buildslave/jenkins/workspace/lldb-cmake/llvm-project/llvm/include -Wdocumentation -fPIC -fvisibility-inlines-hidden -Werror=date-time -Werror=unguarded-availability-new -fmodules -fmodules-cache-path=/Users/buildslave/jenkins/workspace/lldb-cmake/lldb-build/module.cache -fcxx-modules -Xclang -fmodules-local-submodule-visibility -Wall -Wextra -Wno-unused-parameter -Wwrite-strings -Wcast-qual -Wmissing-field-initializers -pedantic -Wno-long-long -Wimplicit-fallthrough -Wcovered-switch-default -Wno-noexcept-type -Wnon-virtual-dtor -Wdelete-non-virtual-dtor -Wsuggest-override -Wstring-conversion -fdiagnostics-color -O3 -isysroot /Applications/Xcode.app/Contents/Developer/Platforms/MacOSX.platform/Developer/SDKs/MacOSX10.15.sdk -fno-exceptions -fno-rtti -UNDEBUG -std=c++14 -MD -MT lib/Target/X86/CMakeFiles/LLVMX86CodeGen.dir/X86RegisterBankInfo.cpp.o -MF lib/Target/X86/CMakeFiles/LLVMX86CodeGen.dir/X86RegisterBankInfo.cpp.o.d -o lib/Target/X86/CMakeFiles/LLVMX86CodeGen.dir/X86RegisterBankInfo.cpp.o -c /Users/buildslave/jenkins/workspace/lldb-cmake/llvm-project/llvm/lib/Target/X86/X86RegisterBankInfo.cpp [35/2754] /Users/buildslave/jenkins/workspace/lldb-cmake/host-compiler/bin/clang++ -DGTEST_HAS_RTTI=0 -D_DEBUG -D__STDC_CONSTANT_MACROS -D__STDC_FORMAT_MACROS -D__STDC_LIMIT_MACROS -Ilib/Target/X86 -I/Users/buildslave/jenkins/workspace/lldb-cmake/llvm-project/llvm/lib/Target/X86 -Iinclude -I/Users/buildslave/jenkins/workspace/lldb-cmake/llvm-project/llvm/include -Wdocumentation -fPIC -fvisibility-inlines-hidden -Werror=date-time -Werror=unguarded-availability-new -fmodules -fmodules-cache-path=/Users/buildslave/jenkins/workspace/lldb-cmake/lldb-build/module.cache -fcxx-modules -Xclang -fmodules-local-submodule-visibility -Wall -Wextra -Wno-unused-parameter -Wwrite-strings -Wcast-qual -Wmissing-field-initializers -pedantic -Wno-long-long -Wimplicit-fallthrough -Wcovered-switch-default -Wno-noexcept-type -Wnon-virtual-dtor -Wdelete-non-virtual-dtor -Wsuggest-override -Wstring-conversion -fdiagnostics-color -O3 -isysroot /Applications/Xcode.app/Contents/Developer/Platforms/MacOSX.platform/Developer/SDKs/MacOSX10.15.sdk -fno-exceptions -fno-rtti -UNDEBUG -std=c++14 -MD -MT lib/Target/X86/CMakeFiles/LLVMX86CodeGen.dir/X86PadShortFunction.cpp.o -MF lib/Target/X86/CMakeFiles/LLVMX86CodeGen.dir/X86PadShortFunction.cpp.o.d -o lib/Target/X86/CMakeFiles/LLVMX86CodeGen.dir/X86PadShortFunction.cpp.o -c /Users/buildslave/jenkins/workspace/lldb-cmake/llvm-project/llvm/lib/Target/X86/X86PadShortFunction.cpp [36/2754] /Users/buildslave/jenkins/workspace/lldb-cmake/host-compiler/bin/clang++ -DGTEST_HAS_RTTI=0 -D_DEBUG -D__STDC_CONSTANT_MACROS -D__STDC_FORMAT_MACROS -D__STDC_LIMIT_MACROS -Ilib/Target/X86 -I/Users/buildslave/jenkins/workspace/lldb-cmake/llvm-project/llvm/lib/Target/X86 -Iinclude -I/Users/buildslave/jenkins/workspace/lldb-cmake/llvm-project/llvm/include -Wdocumentation -fPIC -fvisibility-inlines-hidden -Werror=date-time -Werror=unguarded-availability-new -fmodules -fmodules-cache-path=/Users/buildslave/jenkins/workspace/lldb-cmake/lldb-build/module.cache -fcxx-modules -Xclang -fmodules-local-submodule-visibility -Wall -Wextra -Wno-unused-parameter -Wwrite-strings -Wcast-qual -Wmissing-field-initializers -pedantic -Wno-long-long -Wimplicit-fallthrough -Wcovered-switch-default -Wno-noexcept-type -Wnon-virtual-dtor -Wdelete-non-virtual-dtor -Wsuggest-override -Wstring-conversion -fdiagnostics-color -O3 -isysroot /Applications/Xcode.app/Contents/Developer/Platforms/MacOSX.platform/Developer/SDKs/MacOSX10.15.sdk -fno-exceptions -fno-rtti -UNDEBUG -std=c++14 -MD -MT lib/Target/X86/CMakeFiles/LLVMX86CodeGen.dir/X86OptimizeLEAs.cpp.o -MF lib/Target/X86/CMakeFiles/LLVMX86CodeGen.dir/X86OptimizeLEAs.cpp.o.d -o lib/Target/X86/CMakeFiles/LLVMX86CodeGen.dir/X86OptimizeLEAs.cpp.o -c /Users/buildslave/jenkins/workspace/lldb-cmake/llvm-project/llvm/lib/Target/X86/X86OptimizeLEAs.cpp [37/2754] /Users/buildslave/jenkins/workspace/lldb-cmake/host-compiler/bin/clang++ -DGTEST_HAS_RTTI=0 -D_DEBUG -D__STDC_CONSTANT_MACROS -D__STDC_FORMAT_MACROS -D__STDC_LIMIT_MACROS -Ilib/Target/X86 -I/Users/buildslave/jenkins/workspace/lldb-cmake/llvm-project/llvm/lib/Target/X86 -Iinclude -I/Users/buildslave/jenkins/workspace/lldb-cmake/llvm-project/llvm/include -Wdocumentation -fPIC -fvisibility-inlines-hidden -Werror=date-time -Werror=unguarded-availability-new -fmodules -fmodules-cache-path=/Users/buildslave/jenkins/workspace/lldb-cmake/lldb-build/module.cache -fcxx-modules -Xclang -fmodules-local-submodule-visibility -Wall -Wextra -Wno-unused-parameter -Wwrite-strings -Wcast-qual -Wmissing-field-initializers -pedantic -Wno-long-long -Wimplicit-fallthrough -Wcovered-switch-default -Wno-noexcept-type -Wnon-virtual-dtor -Wdelete-non-virtual-dtor -Wsuggest-override -Wstring-conversion -fdiagnostics-color -O3 -isysroot /Applications/Xcode.app/Contents/Developer/Platforms/MacOSX.platform/Developer/SDKs/MacOSX10.15.sdk -fno-exceptions -fno-rtti -UNDEBUG -std=c++14 -MD -MT lib/Target/X86/CMakeFiles/LLVMX86CodeGen.dir/X86PartialReduction.cpp.o -MF lib/Target/X86/CMakeFiles/LLVMX86CodeGen.dir/X86PartialReduction.cpp.o.d -o lib/Target/X86/CMakeFiles/LLVMX86CodeGen.dir/X86PartialReduction.cpp.o -c /Users/buildslave/jenkins/workspace/lldb-cmake/llvm-project/llvm/lib/Target/X86/X86PartialReduction.cpp [38/2754] /Users/buildslave/jenkins/workspace/lldb-cmake/host-compiler/bin/clang++ -DGTEST_HAS_RTTI=0 -D_DEBUG -D__STDC_CONSTANT_MACROS -D__STDC_FORMAT_MACROS -D__STDC_LIMIT_MACROS -Ilib/Target/X86 -I/Users/buildslave/jenkins/workspace/lldb-cmake/llvm-project/llvm/lib/Target/X86 -Iinclude -I/Users/buildslave/jenkins/workspace/lldb-cmake/llvm-project/llvm/include -Wdocumentation -fPIC -fvisibility-inlines-hidden -Werror=date-time -Werror=unguarded-availability-new -fmodules -fmodules-cache-path=/Users/buildslave/jenkins/workspace/lldb-cmake/lldb-build/module.cache -fcxx-modules -Xclang -fmodules-local-submodule-visibility -Wall -Wextra -Wno-unused-parameter -Wwrite-strings -Wcast-qual -Wmissing-field-initializers -pedantic -Wno-long-long -Wimplicit-fallthrough -Wcovered-switch-default -Wno-noexcept-type -Wnon-virtual-dtor -Wdelete-non-virtual-dtor -Wsuggest-override -Wstring-conversion -fdiagnostics-color -O3 -isysroot /Applications/Xcode.app/Contents/Developer/Platforms/MacOSX.platform/Developer/SDKs/MacOSX10.15.sdk -fno-exceptions -fno-rtti -UNDEBUG -std=c++14 -MD -MT lib/Target/X86/CMakeFiles/LLVMX86CodeGen.dir/X86LoadValueInjectionLoadHardening.cpp.o -MF lib/Target/X86/CMakeFiles/LLVMX86CodeGen.dir/X86LoadValueInjectionLoadHardening.cpp.o.d -o lib/Target/X86/CMakeFiles/LLVMX86CodeGen.dir/X86LoadValueInjectionLoadHardening.cpp.o -c /Users/buildslave/jenkins/workspace/lldb-cmake/llvm-project/llvm/lib/Target/X86/X86LoadValueInjectionLoadHardening.cpp [39/2754] /Users/buildslave/jenkins/workspace/lldb-cmake/host-compiler/bin/clang++ -DGTEST_HAS_RTTI=0 -D_DEBUG -D__STDC_CONSTANT_MACROS -D__STDC_FORMAT_MACROS -D__STDC_LIMIT_MACROS -Ilib/Target/X86 -I/Users/buildslave/jenkins/workspace/lldb-cmake/llvm-project/llvm/lib/Target/X86 -Iinclude -I/Users/buildslave/jenkins/workspace/lldb-cmake/llvm-project/llvm/include -Wdocumentation -fPIC -fvisibility-inlines-hidden -Werror=date-time -Werror=unguarded-availability-new -fmodules -fmodules-cache-path=/Users/buildslave/jenkins/workspace/lldb-cmake/lldb-build/module.cache -fcxx-modules -Xclang -fmodules-local-submodule-visibility -Wall -Wextra -Wno-unused-parameter -Wwrite-strings -Wcast-qual -Wmissing-field-initializers -pedantic -Wno-long-long -Wimplicit-fallthrough -Wcovered-switch-default -Wno-noexcept-type -Wnon-virtual-dtor -Wdelete-non-virtual-dtor -Wsuggest-override -Wstring-conversion -fdiagnostics-color -O3 -isysroot /Applications/Xcode.app/Contents/Developer/Platforms/MacOSX.platform/Developer/SDKs/MacOSX10.15.sdk -fno-exceptions -fno-rtti -UNDEBUG -std=c++14 -MD -MT lib/Target/X86/CMakeFiles/LLVMX86CodeGen.dir/X86RegisterInfo.cpp.o -MF lib/Target/X86/CMakeFiles/LLVMX86CodeGen.dir/X86RegisterInfo.cpp.o.d -o lib/Target/X86/CMakeFiles/LLVMX86CodeGen.dir/X86RegisterInfo.cpp.o -c /Users/buildslave/jenkins/workspace/lldb-cmake/llvm-project/llvm/lib/Target/X86/X86RegisterInfo.cpp [40/2754] /Users/buildslave/jenkins/workspace/lldb-cmake/host-compiler/bin/clang++ -DGTEST_HAS_RTTI=0 -D_DEBUG -D__STDC_CONSTANT_MACROS -D__STDC_FORMAT_MACROS -D__STDC_LIMIT_MACROS -Ilib/Target/X86 -I/Users/buildslave/jenkins/workspace/lldb-cmake/llvm-project/llvm/lib/Target/X86 -Iinclude -I/Users/buildslave/jenkins/workspace/lldb-cmake/llvm-project/llvm/include -Wdocumentation -fPIC -fvisibility-inlines-hidden -Werror=date-time -Werror=unguarded-availability-new -fmodules -fmodules-cache-path=/Users/buildslave/jenkins/workspace/lldb-cmake/lldb-build/module.cache -fcxx-modules -Xclang -fmodules-local-submodule-visibility -Wall -Wextra -Wno-unused-parameter -Wwrite-strings -Wcast-qual -Wmissing-field-initializers -pedantic -Wno-long-long -Wimplicit-fallthrough -Wcovered-switch-default -Wno-noexcept-type -Wnon-virtual-dtor -Wdelete-non-virtual-dtor -Wsuggest-override -Wstring-conversion -fdiagnostics-color -O3 -isysroot /Applications/Xcode.app/Contents/Developer/Platforms/MacOSX.platform/Developer/SDKs/MacOSX10.15.sdk -fno-exceptions -fno-rtti -UNDEBUG -std=c++14 -MD -MT lib/Target/X86/CMakeFiles/LLVMX86CodeGen.dir/X86TargetObjectFile.cpp.o -MF lib/Target/X86/CMakeFiles/LLVMX86CodeGen.dir/X86TargetObjectFile.cpp.o.d -o lib/Target/X86/CMakeFiles/LLVMX86CodeGen.dir/X86TargetObjectFile.cpp.o -c /Users/buildslave/jenkins/workspace/lldb-cmake/llvm-project/llvm/lib/Target/X86/X86TargetObjectFile.cpp [41/2754] /Users/buildslave/jenkins/workspace/lldb-cmake/host-compiler/bin/clang++ -DGTEST_HAS_RTTI=0 -D_DEBUG -D__STDC_CONSTANT_MACROS -D__STDC_FORMAT_MACROS -D__STDC_LIMIT_MACROS -Ilib/Target/X86 -I/Users/buildslave/jenkins/workspace/lldb-cmake/llvm-project/llvm/lib/Target/X86 -Iinclude -I/Users/buildslave/jenkins/workspace/lldb-cmake/llvm-project/llvm/include -Wdocumentation -fPIC -fvisibility-inlines-hidden -Werror=date-time -Werror=unguarded-availability-new -fmodules -fmodules-cache-path=/Users/buildslave/jenkins/workspace/lldb-cmake/lldb-build/module.cache -fcxx-modules -Xclang -fmodules-local-submodule-visibility -Wall -Wextra -Wno-unused-parameter -Wwrite-strings -Wcast-qual -Wmissing-field-initializers -pedantic -Wno-long-long -Wimplicit-fallthrough -Wcovered-switch-default -Wno-noexcept-type -Wnon-virtual-dtor -Wdelete-non-virtual-dtor -Wsuggest-override -Wstring-conversion -fdiagnostics-color -O3 -isysroot /Applications/Xcode.app/Contents/Developer/Platforms/MacOSX.platform/Developer/SDKs/MacOSX10.15.sdk -fno-exceptions -fno-rtti -UNDEBUG -std=c++14 -MD -MT lib/Target/X86/CMakeFiles/LLVMX86CodeGen.dir/X86SelectionDAGInfo.cpp.o -MF lib/Target/X86/CMakeFiles/LLVMX86CodeGen.dir/X86SelectionDAGInfo.cpp.o.d -o lib/Target/X86/CMakeFiles/LLVMX86CodeGen.dir/X86SelectionDAGInfo.cpp.o -c /Users/buildslave/jenkins/workspace/lldb-cmake/llvm-project/llvm/lib/Target/X86/X86SelectionDAGInfo.cpp [42/2754] /Users/buildslave/jenkins/workspace/lldb-cmake/host-compiler/bin/clang++ -DGTEST_HAS_RTTI=0 -D_DEBUG -D__STDC_CONSTANT_MACROS -D__STDC_FORMAT_MACROS -D__STDC_LIMIT_MACROS -Ilib/Target/X86 -I/Users/buildslave/jenkins/workspace/lldb-cmake/llvm-project/llvm/lib/Target/X86 -Iinclude -I/Users/buildslave/jenkins/workspace/lldb-cmake/llvm-project/llvm/include -Wdocumentation -fPIC -fvisibility-inlines-hidden -Werror=date-time -Werror=unguarded-availability-new -fmodules -fmodules-cache-path=/Users/buildslave/jenkins/workspace/lldb-cmake/lldb-build/module.cache -fcxx-modules -Xclang -fmodules-local-submodule-visibility -Wall -Wextra -Wno-unused-parameter -Wwrite-strings -Wcast-qual -Wmissing-field-initializers -pedantic -Wno-long-long -Wimplicit-fallthrough -Wcovered-switch-default -Wno-noexcept-type -Wnon-virtual-dtor -Wdelete-non-virtual-dtor -Wsuggest-override -Wstring-conversion -fdiagnostics-color -O3 -isysroot /Applications/Xcode.app/Contents/Developer/Platforms/MacOSX.platform/Developer/SDKs/MacOSX10.15.sdk -fno-exceptions -fno-rtti -UNDEBUG -std=c++14 -MD -MT lib/Target/X86/CMakeFiles/LLVMX86CodeGen.dir/X86InstrInfo.cpp.o -MF lib/Target/X86/CMakeFiles/LLVMX86CodeGen.dir/X86InstrInfo.cpp.o.d -o lib/Target/X86/CMakeFiles/LLVMX86CodeGen.dir/X86InstrInfo.cpp.o -c /Users/buildslave/jenkins/workspace/lldb-cmake/llvm-project/llvm/lib/Target/X86/X86InstrInfo.cpp [43/2754] /Users/buildslave/jenkins/workspace/lldb-cmake/host-compiler/bin/clang++ -DGTEST_HAS_RTTI=0 -D_DEBUG -D__STDC_CONSTANT_MACROS -D__STDC_FORMAT_MACROS -D__STDC_LIMIT_MACROS -Ilib/Target/X86 -I/Users/buildslave/jenkins/workspace/lldb-cmake/llvm-project/llvm/lib/Target/X86 -Iinclude -I/Users/buildslave/jenkins/workspace/lldb-cmake/llvm-project/llvm/include -Wdocumentation -fPIC -fvisibility-inlines-hidden -Werror=date-time -Werror=unguarded-availability-new -fmodules -fmodules-cache-path=/Users/buildslave/jenkins/workspace/lldb-cmake/lldb-build/module.cache -fcxx-modules -Xclang -fmodules-local-submodule-visibility -Wall -Wextra -Wno-unused-parameter -Wwrite-strings -Wcast-qual -Wmissing-field-initializers -pedantic -Wno-long-long -Wimplicit-fallthrough -Wcovered-switch-default -Wno-noexcept-type -Wnon-virtual-dtor -Wdelete-non-virtual-dtor -Wsuggest-override -Wstring-conversion -fdiagnostics-color -O3 -isysroot /Applications/Xcode.app/Contents/Developer/Platforms/MacOSX.platform/Developer/SDKs/MacOSX10.15.sdk -fno-exceptions -fno-rtti -UNDEBUG -std=c++14 -MD -MT lib/Target/X86/CMakeFiles/LLVMX86CodeGen.dir/X86SpeculativeExecutionSideEffectSuppression.cpp.o -MF lib/Target/X86/CMakeFiles/LLVMX86CodeGen.dir/X86SpeculativeExecutionSideEffectSuppression.cpp.o.d -o lib/Target/X86/CMakeFiles/LLVMX86CodeGen.dir/X86SpeculativeExecutionSideEffectSuppression.cpp.o -c /Users/buildslave/jenkins/workspace/lldb-cmake/llvm-project/llvm/lib/Target/X86/X86SpeculativeExecutionSideEffectSuppression.cpp [44/2754] /Users/buildslave/jenkins/workspace/lldb-cmake/host-compiler/bin/clang++ -DGTEST_HAS_RTTI=0 -D_DEBUG -D__STDC_CONSTANT_MACROS -D__STDC_FORMAT_MACROS -D__STDC_LIMIT_MACROS -Ilib/Target/X86 -I/Users/buildslave/jenkins/workspace/lldb-cmake/llvm-project/llvm/lib/Target/X86 -Iinclude -I/Users/buildslave/jenkins/workspace/lldb-cmake/llvm-project/llvm/include -Wdocumentation -fPIC -fvisibility-inlines-hidden -Werror=date-time -Werror=unguarded-availability-new -fmodules -fmodules-cache-path=/Users/buildslave/jenkins/workspace/lldb-cmake/lldb-build/module.cache -fcxx-modules -Xclang -fmodules-local-submodule-visibility -Wall -Wextra -Wno-unused-parameter -Wwrite-strings -Wcast-qual -Wmissing-field-initializers -pedantic -Wno-long-long -Wimplicit-fallthrough -Wcovered-switch-default -Wno-noexcept-type -Wnon-virtual-dtor -Wdelete-non-virtual-dtor -Wsuggest-override -Wstring-conversion -fdiagnostics-color -O3 -isysroot /Applications/Xcode.app/Contents/Developer/Platforms/MacOSX.platform/Developer/SDKs/MacOSX10.15.sdk -fno-exceptions -fno-rtti -UNDEBUG -std=c++14 -MD -MT lib/Target/X86/CMakeFiles/LLVMX86CodeGen.dir/X86Subtarget.cpp.o -MF lib/Target/X86/CMakeFiles/LLVMX86CodeGen.dir/X86Subtarget.cpp.o.d -o lib/Target/X86/CMakeFiles/LLVMX86CodeGen.dir/X86Subtarget.cpp.o -c /Users/buildslave/jenkins/workspace/lldb-cmake/llvm-project/llvm/lib/Target/X86/X86Subtarget.cpp [45/2754] /Users/buildslave/jenkins/workspace/lldb-cmake/host-compiler/bin/clang++ -DGTEST_HAS_RTTI=0 -D_DEBUG -D__STDC_CONSTANT_MACROS -D__STDC_FORMAT_MACROS -D__STDC_LIMIT_MACROS -Ilib/Target/X86 -I/Users/buildslave/jenkins/workspace/lldb-cmake/llvm-project/llvm/lib/Target/X86 -Iinclude -I/Users/buildslave/jenkins/workspace/lldb-cmake/llvm-project/llvm/include -Wdocumentation -fPIC -fvisibility-inlines-hidden -Werror=date-time -Werror=unguarded-availability-new -fmodules -fmodules-cache-path=/Users/buildslave/jenkins/workspace/lldb-cmake/lldb-build/module.cache -fcxx-modules -Xclang -fmodules-local-submodule-visibility -Wall -Wextra -Wno-unused-parameter -Wwrite-strings -Wcast-qual -Wmissing-field-initializers -pedantic -Wno-long-long -Wimplicit-fallthrough -Wcovered-switch-default -Wno-noexcept-type -Wnon-virtual-dtor -Wdelete-non-virtual-dtor -Wsuggest-override -Wstring-conversion -fdiagnostics-color -O3 -isysroot /Applications/Xcode.app/Contents/Developer/Platforms/MacOSX.platform/Developer/SDKs/MacOSX10.15.sdk -fno-exceptions -fno-rtti -UNDEBUG -std=c++14 -MD -MT lib/Target/X86/CMakeFiles/LLVMX86CodeGen.dir/X86InsertWait.cpp.o -MF lib/Target/X86/CMakeFiles/LLVMX86CodeGen.dir/X86InsertWait.cpp.o.d -o lib/Target/X86/CMakeFiles/LLVMX86CodeGen.dir/X86InsertWait.cpp.o -c /Users/buildslave/jenkins/workspace/lldb-cmake/llvm-project/llvm/lib/Target/X86/X86InsertWait.cpp [46/2754] /Users/buildslave/jenkins/workspace/lldb-cmake/host-compiler/bin/clang++ -DGTEST_HAS_RTTI=0 -D_DEBUG -D__STDC_CONSTANT_MACROS -D__STDC_FORMAT_MACROS -D__STDC_LIMIT_MACROS -Ilib/Target/X86 -I/Users/buildslave/jenkins/workspace/lldb-cmake/llvm-project/llvm/lib/Target/X86 -Iinclude -I/Users/buildslave/jenkins/workspace/lldb-cmake/llvm-project/llvm/include -Wdocumentation -fPIC -fvisibility-inlines-hidden -Werror=date-time -Werror=unguarded-availability-new -fmodules -fmodules-cache-path=/Users/buildslave/jenkins/workspace/lldb-cmake/lldb-build/module.cache -fcxx-modules -Xclang -fmodules-local-submodule-visibility -Wall -Wextra -Wno-unused-parameter -Wwrite-strings -Wcast-qual -Wmissing-field-initializers -pedantic -Wno-long-long -Wimplicit-fallthrough -Wcovered-switch-default -Wno-noexcept-type -Wnon-virtual-dtor -Wdelete-non-virtual-dtor -Wsuggest-override -Wstring-conversion -fdiagnostics-color -O3 -isysroot /Applications/Xcode.app/Contents/Developer/Platforms/MacOSX.platform/Developer/SDKs/MacOSX10.15.sdk -fno-exceptions -fno-rtti -UNDEBUG -std=c++14 -MD -MT lib/Target/X86/CMakeFiles/LLVMX86CodeGen.dir/X86VZeroUpper.cpp.o -MF lib/Target/X86/CMakeFiles/LLVMX86CodeGen.dir/X86VZeroUpper.cpp.o.d -o lib/Target/X86/CMakeFiles/LLVMX86CodeGen.dir/X86VZeroUpper.cpp.o -c /Users/buildslave/jenkins/workspace/lldb-cmake/llvm-project/llvm/lib/Target/X86/X86VZeroUpper.cpp [47/2754] /Users/buildslave/jenkins/workspace/lldb-cmake/host-compiler/bin/clang++ -DGTEST_HAS_RTTI=0 -D_DEBUG -D__STDC_CONSTANT_MACROS -D__STDC_FORMAT_MACROS -D__STDC_LIMIT_MACROS -Ilib/Target/X86 -I/Users/buildslave/jenkins/workspace/lldb-cmake/llvm-project/llvm/lib/Target/X86 -Iinclude -I/Users/buildslave/jenkins/workspace/lldb-cmake/llvm-project/llvm/include -Wdocumentation -fPIC -fvisibility-inlines-hidden -Werror=date-time -Werror=unguarded-availability-new -fmodules -fmodules-cache-path=/Users/buildslave/jenkins/workspace/lldb-cmake/lldb-build/module.cache -fcxx-modules -Xclang -fmodules-local-submodule-visibility -Wall -Wextra -Wno-unused-parameter -Wwrite-strings -Wcast-qual -Wmissing-field-initializers -pedantic -Wno-long-long -Wimplicit-fallthrough -Wcovered-switch-default -Wno-noexcept-type -Wnon-virtual-dtor -Wdelete-non-virtual-dtor -Wsuggest-override -Wstring-conversion -fdiagnostics-color -O3 -isysroot /Applications/Xcode.app/Contents/Developer/Platforms/MacOSX.platform/Developer/SDKs/MacOSX10.15.sdk -fno-exceptions -fno-rtti -UNDEBUG -std=c++14 -MD -MT lib/Target/X86/CMakeFiles/LLVMX86CodeGen.dir/X86ISelDAGToDAG.cpp.o -MF lib/Target/X86/CMakeFiles/LLVMX86CodeGen.dir/X86ISelDAGToDAG.cpp.o.d -o lib/Target/X86/CMakeFiles/LLVMX86CodeGen.dir/X86ISelDAGToDAG.cpp.o -c /Users/buildslave/jenkins/workspace/lldb-cmake/llvm-project/llvm/lib/Target/X86/X86ISelDAGToDAG.cpp [48/2754] /Users/buildslave/jenkins/workspace/lldb-cmake/host-compiler/bin/clang++ -DGTEST_HAS_RTTI=0 -D_DEBUG -D__STDC_CONSTANT_MACROS -D__STDC_FORMAT_MACROS -D__STDC_LIMIT_MACROS -Ilib/Target/X86 -I/Users/buildslave/jenkins/workspace/lldb-cmake/llvm-project/llvm/lib/Target/X86 -Iinclude -I/Users/buildslave/jenkins/workspace/lldb-cmake/llvm-project/llvm/include -Wdocumentation -fPIC -fvisibility-inlines-hidden -Werror=date-time -Werror=unguarded-availability-new -fmodules -fmodules-cache-path=/Users/buildslave/jenkins/workspace/lldb-cmake/lldb-build/module.cache -fcxx-modules -Xclang -fmodules-local-submodule-visibility -Wall -Wextra -Wno-unused-parameter -Wwrite-strings -Wcast-qual -Wmissing-field-initializers -pedantic -Wno-long-long -Wimplicit-fallthrough -Wcovered-switch-default -Wno-noexcept-type -Wnon-virtual-dtor -Wdelete-non-virtual-dtor -Wsuggest-override -Wstring-conversion -fdiagnostics-color -O3 -isysroot /Applications/Xcode.app/Contents/Developer/Platforms/MacOSX.platform/Developer/SDKs/MacOSX10.15.sdk -fno-exceptions -fno-rtti -UNDEBUG -std=c++14 -MD -MT lib/Target/X86/CMakeFiles/LLVMX86CodeGen.dir/X86SpeculativeLoadHardening.cpp.o -MF lib/Target/X86/CMakeFiles/LLVMX86CodeGen.dir/X86SpeculativeLoadHardening.cpp.o.d -o lib/Target/X86/CMakeFiles/LLVMX86CodeGen.dir/X86SpeculativeLoadHardening.cpp.o -c /Users/buildslave/jenkins/workspace/lldb-cmake/llvm-project/llvm/lib/Target/X86/X86SpeculativeLoadHardening.cpp [49/2754] /Users/buildslave/jenkins/workspace/lldb-cmake/host-compiler/bin/clang++ -DGTEST_HAS_RTTI=0 -D_DEBUG -D__STDC_CONSTANT_MACROS -D__STDC_FORMAT_MACROS -D__STDC_LIMIT_MACROS -Ilib/Target/X86 -I/Users/buildslave/jenkins/workspace/lldb-cmake/llvm-project/llvm/lib/Target/X86 -Iinclude -I/Users/buildslave/jenkins/workspace/lldb-cmake/llvm-project/llvm/include -Wdocumentation -fPIC -fvisibility-inlines-hidden -Werror=date-time -Werror=unguarded-availability-new -fmodules -fmodules-cache-path=/Users/buildslave/jenkins/workspace/lldb-cmake/lldb-build/module.cache -fcxx-modules -Xclang -fmodules-local-submodule-visibility -Wall -Wextra -Wno-unused-parameter -Wwrite-strings -Wcast-qual -Wmissing-field-initializers -pedantic -Wno-long-long -Wimplicit-fallthrough -Wcovered-switch-default -Wno-noexcept-type -Wnon-virtual-dtor -Wdelete-non-virtual-dtor -Wsuggest-override -Wstring-conversion -fdiagnostics-color -O3 -isysroot /Applications/Xcode.app/Contents/Developer/Platforms/MacOSX.platform/Developer/SDKs/MacOSX10.15.sdk -fno-exceptions -fno-rtti -UNDEBUG -std=c++14 -MD -MT lib/Target/X86/CMakeFiles/LLVMX86CodeGen.dir/X86WinAllocaExpander.cpp.o -MF lib/Target/X86/CMakeFiles/LLVMX86CodeGen.dir/X86WinAllocaExpander.cpp.o.d -o lib/Target/X86/CMakeFiles/LLVMX86CodeGen.dir/X86WinAllocaExpander.cpp.o -c /Users/buildslave/jenkins/workspace/lldb-cmake/llvm-project/llvm/lib/Target/X86/X86WinAllocaExpander.cpp [50/2754] /Users/buildslave/jenkins/workspace/lldb-cmake/host-compiler/bin/clang++ -DGTEST_HAS_RTTI=0 -D_DEBUG -D__STDC_CONSTANT_MACROS -D__STDC_FORMAT_MACROS -D__STDC_LIMIT_MACROS -Ilib/Target/X86 -I/Users/buildslave/jenkins/workspace/lldb-cmake/llvm-project/llvm/lib/Target/X86 -Iinclude -I/Users/buildslave/jenkins/workspace/lldb-cmake/llvm-project/llvm/include -Wdocumentation -fPIC -fvisibility-inlines-hidden -Werror=date-time -Werror=unguarded-availability-new -fmodules -fmodules-cache-path=/Users/buildslave/jenkins/workspace/lldb-cmake/lldb-build/module.cache -fcxx-modules -Xclang -fmodules-local-submodule-visibility -Wall -Wextra -Wno-unused-parameter -Wwrite-strings -Wcast-qual -Wmissing-field-initializers -pedantic -Wno-long-long -Wimplicit-fallthrough -Wcovered-switch-default -Wno-noexcept-type -Wnon-virtual-dtor -Wdelete-non-virtual-dtor -Wsuggest-override -Wstring-conversion -fdiagnostics-color -O3 -isysroot /Applications/Xcode.app/Contents/Developer/Platforms/MacOSX.platform/Developer/SDKs/MacOSX10.15.sdk -fno-exceptions -fno-rtti -UNDEBUG -std=c++14 -MD -MT lib/Target/X86/CMakeFiles/LLVMX86CodeGen.dir/X86TargetMachine.cpp.o -MF lib/Target/X86/CMakeFiles/LLVMX86CodeGen.dir/X86TargetMachine.cpp.o.d -o lib/Target/X86/CMakeFiles/LLVMX86CodeGen.dir/X86TargetMachine.cpp.o -c /Users/buildslave/jenkins/workspace/lldb-cmake/llvm-project/llvm/lib/Target/X86/X86TargetMachine.cpp [51/2754] /Users/buildslave/jenkins/workspace/lldb-cmake/host-compiler/bin/clang++ -DGTEST_HAS_RTTI=0 -D_DEBUG -D__STDC_CONSTANT_MACROS -D__STDC_FORMAT_MACROS -D__STDC_LIMIT_MACROS -Ilib/Target/X86/MCTargetDesc -I/Users/buildslave/jenkins/workspace/lldb-cmake/llvm-project/llvm/lib/Target/X86/MCTargetDesc -I/Users/buildslave/jenkins/workspace/lldb-cmake/llvm-project/llvm/lib/Target/X86 -Ilib/Target/X86 -Iinclude -I/Users/buildslave/jenkins/workspace/lldb-cmake/llvm-project/llvm/include -Wdocumentation -fPIC -fvisibility-inlines-hidden -Werror=date-time -Werror=unguarded-availability-new -fmodules -fmodules-cache-path=/Users/buildslave/jenkins/workspace/lldb-cmake/lldb-build/module.cache -fcxx-modules -Xclang -fmodules-local-submodule-visibility -Wall -Wextra -Wno-unused-parameter -Wwrite-strings -Wcast-qual -Wmissing-field-initializers -pedantic -Wno-long-long -Wimplicit-fallthrough -Wcovered-switch-default -Wno-noexcept-type -Wnon-virtual-dtor -Wdelete-non-virtual-dtor -Wsuggest-override -Wstring-conversion -fdiagnostics-color -O3 -isysroot /Applications/Xcode.app/Contents/Developer/Platforms/MacOSX.platform/Developer/SDKs/MacOSX10.15.sdk -fno-exceptions -fno-rtti -UNDEBUG -std=c++14 -MD -MT lib/Target/X86/MCTargetDesc/CMakeFiles/LLVMX86Desc.dir/X86IntelInstPrinter.cpp.o -MF lib/Target/X86/MCTargetDesc/CMakeFiles/LLVMX86Desc.dir/X86IntelInstPrinter.cpp.o.d -o lib/Target/X86/MCTargetDesc/CMakeFiles/LLVMX86Desc.dir/X86IntelInstPrinter.cpp.o -c /Users/buildslave/jenkins/workspace/lldb-cmake/llvm-project/llvm/lib/Target/X86/MCTargetDesc/X86IntelInstPrinter.cpp [52/2754] /Users/buildslave/jenkins/workspace/lldb-cmake/host-compiler/bin/clang++ -DGTEST_HAS_RTTI=0 -D_DEBUG -D__STDC_CONSTANT_MACROS -D__STDC_FORMAT_MACROS -D__STDC_LIMIT_MACROS -Ilib/Target/X86/MCTargetDesc -I/Users/buildslave/jenkins/workspace/lldb-cmake/llvm-project/llvm/lib/Target/X86/MCTargetDesc -I/Users/buildslave/jenkins/workspace/lldb-cmake/llvm-project/llvm/lib/Target/X86 -Ilib/Target/X86 -Iinclude -I/Users/buildslave/jenkins/workspace/lldb-cmake/llvm-project/llvm/include -Wdocumentation -fPIC -fvisibility-inlines-hidden -Werror=date-time -Werror=unguarded-availability-new -fmodules -fmodules-cache-path=/Users/buildslave/jenkins/workspace/lldb-cmake/lldb-build/module.cache -fcxx-modules -Xclang -fmodules-local-submodule-visibility -Wall -Wextra -Wno-unused-parameter -Wwrite-strings -Wcast-qual -Wmissing-field-initializers -pedantic -Wno-long-long -Wimplicit-fallthrough -Wcovered-switch-default -Wno-noexcept-type -Wnon-virtual-dtor -Wdelete-non-virtual-dtor -Wsuggest-override -Wstring-conversion -fdiagnostics-color -O3 -isysroot /Applications/Xcode.app/Contents/Developer/Platforms/MacOSX.platform/Developer/SDKs/MacOSX10.15.sdk -fno-exceptions -fno-rtti -UNDEBUG -std=c++14 -MD -MT lib/Target/X86/MCTargetDesc/CMakeFiles/LLVMX86Desc.dir/X86ATTInstPrinter.cpp.o -MF lib/Target/X86/MCTargetDesc/CMakeFiles/LLVMX86Desc.dir/X86ATTInstPrinter.cpp.o.d -o lib/Target/X86/MCTargetDesc/CMakeFiles/LLVMX86Desc.dir/X86ATTInstPrinter.cpp.o -c /Users/buildslave/jenkins/workspace/lldb-cmake/llvm-project/llvm/lib/Target/X86/MCTargetDesc/X86ATTInstPrinter.cpp [53/2754] /Users/buildslave/jenkins/workspace/lldb-cmake/host-compiler/bin/clang++ -DGTEST_HAS_RTTI=0 -D_DEBUG -D__STDC_CONSTANT_MACROS -D__STDC_FORMAT_MACROS -D__STDC_LIMIT_MACROS -Ilib/Target/X86/MCTargetDesc -I/Users/buildslave/jenkins/workspace/lldb-cmake/llvm-project/llvm/lib/Target/X86/MCTargetDesc -I/Users/buildslave/jenkins/workspace/lldb-cmake/llvm-project/llvm/lib/Target/X86 -Ilib/Target/X86 -Iinclude -I/Users/buildslave/jenkins/workspace/lldb-cmake/llvm-project/llvm/include -Wdocumentation -fPIC -fvisibility-inlines-hidden -Werror=date-time -Werror=unguarded-availability-new -fmodules -fmodules-cache-path=/Users/buildslave/jenkins/workspace/lldb-cmake/lldb-build/module.cache -fcxx-modules -Xclang -fmodules-local-submodule-visibility -Wall -Wextra -Wno-unused-parameter -Wwrite-strings -Wcast-qual -Wmissing-field-initializers -pedantic -Wno-long-long -Wimplicit-fallthrough -Wcovered-switch-default -Wno-noexcept-type -Wnon-virtual-dtor -Wdelete-non-virtual-dtor -Wsuggest-override -Wstring-conversion -fdiagnostics-color -O3 -isysroot /Applications/Xcode.app/Contents/Developer/Platforms/MacOSX.platform/Developer/SDKs/MacOSX10.15.sdk -fno-exceptions -fno-rtti -UNDEBUG -std=c++14 -MD -MT lib/Target/X86/MCTargetDesc/CMakeFiles/LLVMX86Desc.dir/X86InstPrinterCommon.cpp.o -MF lib/Target/X86/MCTargetDesc/CMakeFiles/LLVMX86Desc.dir/X86InstPrinterCommon.cpp.o.d -o lib/Target/X86/MCTargetDesc/CMakeFiles/LLVMX86Desc.dir/X86InstPrinterCommon.cpp.o -c /Users/buildslave/jenkins/workspace/lldb-cmake/llvm-project/llvm/lib/Target/X86/MCTargetDesc/X86InstPrinterCommon.cpp [54/2754] /Users/buildslave/jenkins/workspace/lldb-cmake/host-compiler/bin/clang++ -DGTEST_HAS_RTTI=0 -D_DEBUG -D__STDC_CONSTANT_MACROS -D__STDC_FORMAT_MACROS -D__STDC_LIMIT_MACROS -Ilib/Target/X86/MCTargetDesc -I/Users/buildslave/jenkins/workspace/lldb-cmake/llvm-project/llvm/lib/Target/X86/MCTargetDesc -I/Users/buildslave/jenkins/workspace/lldb-cmake/llvm-project/llvm/lib/Target/X86 -Ilib/Target/X86 -Iinclude -I/Users/buildslave/jenkins/workspace/lldb-cmake/llvm-project/llvm/include -Wdocumentation -fPIC -fvisibility-inlines-hidden -Werror=date-time -Werror=unguarded-availability-new -fmodules -fmodules-cache-path=/Users/buildslave/jenkins/workspace/lldb-cmake/lldb-build/module.cache -fcxx-modules -Xclang -fmodules-local-submodule-visibility -Wall -Wextra -Wno-unused-parameter -Wwrite-strings -Wcast-qual -Wmissing-field-initializers -pedantic -Wno-long-long -Wimplicit-fallthrough -Wcovered-switch-default -Wno-noexcept-type -Wnon-virtual-dtor -Wdelete-non-virtual-dtor -Wsuggest-override -Wstring-conversion -fdiagnostics-color -O3 -isysroot /Applications/Xcode.app/Contents/Developer/Platforms/MacOSX.platform/Developer/SDKs/MacOSX10.15.sdk -fno-exceptions -fno-rtti -UNDEBUG -std=c++14 -MD -MT lib/Target/X86/MCTargetDesc/CMakeFiles/LLVMX86Desc.dir/X86ShuffleDecode.cpp.o -MF lib/Target/X86/MCTargetDesc/CMakeFiles/LLVMX86Desc.dir/X86ShuffleDecode.cpp.o.d -o lib/Target/X86/MCTargetDesc/CMakeFiles/LLVMX86Desc.dir/X86ShuffleDecode.cpp.o -c /Users/buildslave/jenkins/workspace/lldb-cmake/llvm-project/llvm/lib/Target/X86/MCTargetDesc/X86ShuffleDecode.cpp [55/2754] /Users/buildslave/jenkins/workspace/lldb-cmake/host-compiler/bin/clang++ -DGTEST_HAS_RTTI=0 -D_DEBUG -D__STDC_CONSTANT_MACROS -D__STDC_FORMAT_MACROS -D__STDC_LIMIT_MACROS -Ilib/Target/X86 -I/Users/buildslave/jenkins/workspace/lldb-cmake/llvm-project/llvm/lib/Target/X86 -Iinclude -I/Users/buildslave/jenkins/workspace/lldb-cmake/llvm-project/llvm/include -Wdocumentation -fPIC -fvisibility-inlines-hidden -Werror=date-time -Werror=unguarded-availability-new -fmodules -fmodules-cache-path=/Users/buildslave/jenkins/workspace/lldb-cmake/lldb-build/module.cache -fcxx-modules -Xclang -fmodules-local-submodule-visibility -Wall -Wextra -Wno-unused-parameter -Wwrite-strings -Wcast-qual -Wmissing-field-initializers -pedantic -Wno-long-long -Wimplicit-fallthrough -Wcovered-switch-default -Wno-noexcept-type -Wnon-virtual-dtor -Wdelete-non-virtual-dtor -Wsuggest-override -Wstring-conversion -fdiagnostics-color -O3 -isysroot /Applications/Xcode.app/Contents/Developer/Platforms/MacOSX.platform/Developer/SDKs/MacOSX10.15.sdk -fno-exceptions -fno-rtti -UNDEBUG -std=c++14 -MD -MT lib/Target/X86/CMakeFiles/LLVMX86CodeGen.dir/X86WinEHState.cpp.o -MF lib/Target/X86/CMakeFiles/LLVMX86CodeGen.dir/X86WinEHState.cpp.o.d -o lib/Target/X86/CMakeFiles/LLVMX86CodeGen.dir/X86WinEHState.cpp.o -c /Users/buildslave/jenkins/workspace/lldb-cmake/llvm-project/llvm/lib/Target/X86/X86WinEHState.cpp [56/2754] /Users/buildslave/jenkins/workspace/lldb-cmake/host-compiler/bin/clang++ -DGTEST_HAS_RTTI=0 -D_DEBUG -D__STDC_CONSTANT_MACROS -D__STDC_FORMAT_MACROS -D__STDC_LIMIT_MACROS -Ilib/Target/X86/MCTargetDesc -I/Users/buildslave/jenkins/workspace/lldb-cmake/llvm-project/llvm/lib/Target/X86/MCTargetDesc -I/Users/buildslave/jenkins/workspace/lldb-cmake/llvm-project/llvm/lib/Target/X86 -Ilib/Target/X86 -Iinclude -I/Users/buildslave/jenkins/workspace/lldb-cmake/llvm-project/llvm/include -Wdocumentation -fPIC -fvisibility-inlines-hidden -Werror=date-time -Werror=unguarded-availability-new -fmodules -fmodules-cache-path=/Users/buildslave/jenkins/workspace/lldb-cmake/lldb-build/module.cache -fcxx-modules -Xclang -fmodules-local-submodule-visibility -Wall -Wextra -Wno-unused-parameter -Wwrite-strings -Wcast-qual -Wmissing-field-initializers -pedantic -Wno-long-long -Wimplicit-fallthrough -Wcovered-switch-default -Wno-noexcept-type -Wnon-virtual-dtor -Wdelete-non-virtual-dtor -Wsuggest-override -Wstring-conversion -fdiagnostics-color -O3 -isysroot /Applications/Xcode.app/Contents/Developer/Platforms/MacOSX.platform/Developer/SDKs/MacOSX10.15.sdk -fno-exceptions -fno-rtti -UNDEBUG -std=c++14 -MD -MT lib/Target/X86/MCTargetDesc/CMakeFiles/LLVMX86Desc.dir/X86InstComments.cpp.o -MF lib/Target/X86/MCTargetDesc/CMakeFiles/LLVMX86Desc.dir/X86InstComments.cpp.o.d -o lib/Target/X86/MCTargetDesc/CMakeFiles/LLVMX86Desc.dir/X86InstComments.cpp.o -c /Users/buildslave/jenkins/workspace/lldb-cmake/llvm-project/llvm/lib/Target/X86/MCTargetDesc/X86InstComments.cpp [57/2754] /Users/buildslave/jenkins/workspace/lldb-cmake/host-compiler/bin/clang++ -DGTEST_HAS_RTTI=0 -D_DEBUG -D__STDC_CONSTANT_MACROS -D__STDC_FORMAT_MACROS -D__STDC_LIMIT_MACROS -Ilib/Target/X86 -I/Users/buildslave/jenkins/workspace/lldb-cmake/llvm-project/llvm/lib/Target/X86 -Iinclude -I/Users/buildslave/jenkins/workspace/lldb-cmake/llvm-project/llvm/include -Wdocumentation -fPIC -fvisibility-inlines-hidden -Werror=date-time -Werror=unguarded-availability-new -fmodules -fmodules-cache-path=/Users/buildslave/jenkins/workspace/lldb-cmake/lldb-build/module.cache -fcxx-modules -Xclang -fmodules-local-submodule-visibility -Wall -Wextra -Wno-unused-parameter -Wwrite-strings -Wcast-qual -Wmissing-field-initializers -pedantic -Wno-long-long -Wimplicit-fallthrough -Wcovered-switch-default -Wno-noexcept-type -Wnon-virtual-dtor -Wdelete-non-virtual-dtor -Wsuggest-override -Wstring-conversion -fdiagnostics-color -O3 -isysroot /Applications/Xcode.app/Contents/Developer/Platforms/MacOSX.platform/Developer/SDKs/MacOSX10.15.sdk -fno-exceptions -fno-rtti -UNDEBUG -std=c++14 -MD -MT lib/Target/X86/CMakeFiles/LLVMX86CodeGen.dir/X86TargetTransformInfo.cpp.o -MF lib/Target/X86/CMakeFiles/LLVMX86CodeGen.dir/X86TargetTransformInfo.cpp.o.d -o lib/Target/X86/CMakeFiles/LLVMX86CodeGen.dir/X86TargetTransformInfo.cpp.o -c /Users/buildslave/jenkins/workspace/lldb-cmake/llvm-project/llvm/lib/Target/X86/X86TargetTransformInfo.cpp [58/2754] /Users/buildslave/jenkins/workspace/lldb-cmake/host-compiler/bin/clang++ -DGTEST_HAS_RTTI=0 -D_DEBUG -D__STDC_CONSTANT_MACROS -D__STDC_FORMAT_MACROS -D__STDC_LIMIT_MACROS -Ilib/Target/X86/MCTargetDesc -I/Users/buildslave/jenkins/workspace/lldb-cmake/llvm-project/llvm/lib/Target/X86/MCTargetDesc -I/Users/buildslave/jenkins/workspace/lldb-cmake/llvm-project/llvm/lib/Target/X86 -Ilib/Target/X86 -Iinclude -I/Users/buildslave/jenkins/workspace/lldb-cmake/llvm-project/llvm/include -Wdocumentation -fPIC -fvisibility-inlines-hidden -Werror=date-time -Werror=unguarded-availability-new -fmodules -fmodules-cache-path=/Users/buildslave/jenkins/workspace/lldb-cmake/lldb-build/module.cache -fcxx-modules -Xclang -fmodules-local-submodule-visibility -Wall -Wextra -Wno-unused-parameter -Wwrite-strings -Wcast-qual -Wmissing-field-initializers -pedantic -Wno-long-long -Wimplicit-fallthrough -Wcovered-switch-default -Wno-noexcept-type -Wnon-virtual-dtor -Wdelete-non-virtual-dtor -Wsuggest-override -Wstring-conversion -fdiagnostics-color -O3 -isysroot /Applications/Xcode.app/Contents/Developer/Platforms/MacOSX.platform/Developer/SDKs/MacOSX10.15.sdk -fno-exceptions -fno-rtti -UNDEBUG -std=c++14 -MD -MT lib/Target/X86/MCTargetDesc/CMakeFiles/LLVMX86Desc.dir/X86MCAsmInfo.cpp.o -MF lib/Target/X86/MCTargetDesc/CMakeFiles/LLVMX86Desc.dir/X86MCAsmInfo.cpp.o.d -o lib/Target/X86/MCTargetDesc/CMakeFiles/LLVMX86Desc.dir/X86MCAsmInfo.cpp.o -c /Users/buildslave/jenkins/workspace/lldb-cmake/llvm-project/llvm/lib/Target/X86/MCTargetDesc/X86MCAsmInfo.cpp [59/2754] /Users/buildslave/jenkins/workspace/lldb-cmake/host-compiler/bin/clang++ -DGTEST_HAS_RTTI=0 -D_DEBUG -D__STDC_CONSTANT_MACROS -D__STDC_FORMAT_MACROS -D__STDC_LIMIT_MACROS -Ilib/Target/X86/MCTargetDesc -I/Users/buildslave/jenkins/workspace/lldb-cmake/llvm-project/llvm/lib/Target/X86/MCTargetDesc -I/Users/buildslave/jenkins/workspace/lldb-cmake/llvm-project/llvm/lib/Target/X86 -Ilib/Target/X86 -Iinclude -I/Users/buildslave/jenkins/workspace/lldb-cmake/llvm-project/llvm/include -Wdocumentation -fPIC -fvisibility-inlines-hidden -Werror=date-time -Werror=unguarded-availability-new -fmodules -fmodules-cache-path=/Users/buildslave/jenkins/workspace/lldb-cmake/lldb-build/module.cache -fcxx-modules -Xclang -fmodules-local-submodule-visibility -Wall -Wextra -Wno-unused-parameter -Wwrite-strings -Wcast-qual -Wmissing-field-initializers -pedantic -Wno-long-long -Wimplicit-fallthrough -Wcovered-switch-default -Wno-noexcept-type -Wnon-virtual-dtor -Wdelete-non-virtual-dtor -Wsuggest-override -Wstring-conversion -fdiagnostics-color -O3 -isysroot /Applications/Xcode.app/Contents/Developer/Platforms/MacOSX.platform/Developer/SDKs/MacOSX10.15.sdk -fno-exceptions -fno-rtti -UNDEBUG -std=c++14 -MD -MT lib/Target/X86/MCTargetDesc/CMakeFiles/LLVMX86Desc.dir/X86ELFObjectWriter.cpp.o -MF lib/Target/X86/MCTargetDesc/CMakeFiles/LLVMX86Desc.dir/X86ELFObjectWriter.cpp.o.d -o lib/Target/X86/MCTargetDesc/CMakeFiles/LLVMX86Desc.dir/X86ELFObjectWriter.cpp.o -c /Users/buildslave/jenkins/workspace/lldb-cmake/llvm-project/llvm/lib/Target/X86/MCTargetDesc/X86ELFObjectWriter.cpp [60/2754] /Users/buildslave/jenkins/workspace/lldb-cmake/host-compiler/bin/clang++ -DGTEST_HAS_RTTI=0 -D_DEBUG -D__STDC_CONSTANT_MACROS -D__STDC_FORMAT_MACROS -D__STDC_LIMIT_MACROS -Ilib/Target/X86/MCTargetDesc -I/Users/buildslave/jenkins/workspace/lldb-cmake/llvm-project/llvm/lib/Target/X86/MCTargetDesc -I/Users/buildslave/jenkins/workspace/lldb-cmake/llvm-project/llvm/lib/Target/X86 -Ilib/Target/X86 -Iinclude -I/Users/buildslave/jenkins/workspace/lldb-cmake/llvm-project/llvm/include -Wdocumentation -fPIC -fvisibility-inlines-hidden -Werror=date-time -Werror=unguarded-availability-new -fmodules -fmodules-cache-path=/Users/buildslave/jenkins/workspace/lldb-cmake/lldb-build/module.cache -fcxx-modules -Xclang -fmodules-local-submodule-visibility -Wall -Wextra -Wno-unused-parameter -Wwrite-strings -Wcast-qual -Wmissing-field-initializers -pedantic -Wno-long-long -Wimplicit-fallthrough -Wcovered-switch-default -Wno-noexcept-type -Wnon-virtual-dtor -Wdelete-non-virtual-dtor -Wsuggest-override -Wstring-conversion -fdiagnostics-color -O3 -isysroot /Applications/Xcode.app/Contents/Developer/Platforms/MacOSX.platform/Developer/SDKs/MacOSX10.15.sdk -fno-exceptions -fno-rtti -UNDEBUG -std=c++14 -MD -MT lib/Target/X86/MCTargetDesc/CMakeFiles/LLVMX86Desc.dir/X86WinCOFFObjectWriter.cpp.o -MF lib/Target/X86/MCTargetDesc/CMakeFiles/LLVMX86Desc.dir/X86WinCOFFObjectWriter.cpp.o.d -o lib/Target/X86/MCTargetDesc/CMakeFiles/LLVMX86Desc.dir/X86WinCOFFObjectWriter.cpp.o -c /Users/buildslave/jenkins/workspace/lldb-cmake/llvm-project/llvm/lib/Target/X86/MCTargetDesc/X86WinCOFFObjectWriter.cpp [61/2754] /Users/buildslave/jenkins/workspace/lldb-cmake/host-compiler/bin/clang++ -DGTEST_HAS_RTTI=0 -D_DEBUG -D__STDC_CONSTANT_MACROS -D__STDC_FORMAT_MACROS -D__STDC_LIMIT_MACROS -Ilib/Target/X86/MCTargetDesc -I/Users/buildslave/jenkins/workspace/lldb-cmake/llvm-project/llvm/lib/Target/X86/MCTargetDesc -I/Users/buildslave/jenkins/workspace/lldb-cmake/llvm-project/llvm/lib/Target/X86 -Ilib/Target/X86 -Iinclude -I/Users/buildslave/jenkins/workspace/lldb-cmake/llvm-project/llvm/include -Wdocumentation -fPIC -fvisibility-inlines-hidden -Werror=date-time -Werror=unguarded-availability-new -fmodules -fmodules-cache-path=/Users/buildslave/jenkins/workspace/lldb-cmake/lldb-build/module.cache -fcxx-modules -Xclang -fmodules-local-submodule-visibility -Wall -Wextra -Wno-unused-parameter -Wwrite-strings -Wcast-qual -Wmissing-field-initializers -pedantic -Wno-long-long -Wimplicit-fallthrough -Wcovered-switch-default -Wno-noexcept-type -Wnon-virtual-dtor -Wdelete-non-virtual-dtor -Wsuggest-override -Wstring-conversion -fdiagnostics-color -O3 -isysroot /Applications/Xcode.app/Contents/Developer/Platforms/MacOSX.platform/Developer/SDKs/MacOSX10.15.sdk -fno-exceptions -fno-rtti -UNDEBUG -std=c++14 -MD -MT lib/Target/X86/MCTargetDesc/CMakeFiles/LLVMX86Desc.dir/X86MCCodeEmitter.cpp.o -MF lib/Target/X86/MCTargetDesc/CMakeFiles/LLVMX86Desc.dir/X86MCCodeEmitter.cpp.o.d -o lib/Target/X86/MCTargetDesc/CMakeFiles/LLVMX86Desc.dir/X86MCCodeEmitter.cpp.o -c /Users/buildslave/jenkins/workspace/lldb-cmake/llvm-project/llvm/lib/Target/X86/MCTargetDesc/X86MCCodeEmitter.cpp [62/2754] /Users/buildslave/jenkins/workspace/lldb-cmake/host-compiler/bin/clang++ -DGTEST_HAS_RTTI=0 -D_DEBUG -D__STDC_CONSTANT_MACROS -D__STDC_FORMAT_MACROS -D__STDC_LIMIT_MACROS -Ilib/Target/X86/MCTargetDesc -I/Users/buildslave/jenkins/workspace/lldb-cmake/llvm-project/llvm/lib/Target/X86/MCTargetDesc -I/Users/buildslave/jenkins/workspace/lldb-cmake/llvm-project/llvm/lib/Target/X86 -Ilib/Target/X86 -Iinclude -I/Users/buildslave/jenkins/workspace/lldb-cmake/llvm-project/llvm/include -Wdocumentation -fPIC -fvisibility-inlines-hidden -Werror=date-time -Werror=unguarded-availability-new -fmodules -fmodules-cache-path=/Users/buildslave/jenkins/workspace/lldb-cmake/lldb-build/module.cache -fcxx-modules -Xclang -fmodules-local-submodule-visibility -Wall -Wextra -Wno-unused-parameter -Wwrite-strings -Wcast-qual -Wmissing-field-initializers -pedantic -Wno-long-long -Wimplicit-fallthrough -Wcovered-switch-default -Wno-noexcept-type -Wnon-virtual-dtor -Wdelete-non-virtual-dtor -Wsuggest-override -Wstring-conversion -fdiagnostics-color -O3 -isysroot /Applications/Xcode.app/Contents/Developer/Platforms/MacOSX.platform/Developer/SDKs/MacOSX10.15.sdk -fno-exceptions -fno-rtti -UNDEBUG -std=c++14 -MD -MT lib/Target/X86/MCTargetDesc/CMakeFiles/LLVMX86Desc.dir/X86WinCOFFStreamer.cpp.o -MF lib/Target/X86/MCTargetDesc/CMakeFiles/LLVMX86Desc.dir/X86WinCOFFStreamer.cpp.o.d -o lib/Target/X86/MCTargetDesc/CMakeFiles/LLVMX86Desc.dir/X86WinCOFFStreamer.cpp.o -c /Users/buildslave/jenkins/workspace/lldb-cmake/llvm-project/llvm/lib/Target/X86/MCTargetDesc/X86WinCOFFStreamer.cpp [63/2754] /Users/buildslave/jenkins/workspace/lldb-cmake/host-compiler/bin/clang++ -DGTEST_HAS_RTTI=0 -D_DEBUG -D__STDC_CONSTANT_MACROS -D__STDC_FORMAT_MACROS -D__STDC_LIMIT_MACROS -Ilib/Target/X86/TargetInfo -I/Users/buildslave/jenkins/workspace/lldb-cmake/llvm-project/llvm/lib/Target/X86/TargetInfo -I/Users/buildslave/jenkins/workspace/lldb-cmake/llvm-project/llvm/lib/Target/X86 -Ilib/Target/X86 -Iinclude -I/Users/buildslave/jenkins/workspace/lldb-cmake/llvm-project/llvm/include -Wdocumentation -fPIC -fvisibility-inlines-hidden -Werror=date-time -Werror=unguarded-availability-new -fmodules -fmodules-cache-path=/Users/buildslave/jenkins/workspace/lldb-cmake/lldb-build/module.cache -fcxx-modules -Xclang -fmodules-local-submodule-visibility -Wall -Wextra -Wno-unused-parameter -Wwrite-strings -Wcast-qual -Wmissing-field-initializers -pedantic -Wno-long-long -Wimplicit-fallthrough -Wcovered-switch-default -Wno-noexcept-type -Wnon-virtual-dtor -Wdelete-non-virtual-dtor -Wsuggest-override -Wstring-conversion -fdiagnostics-color -O3 -isysroot /Applications/Xcode.app/Contents/Developer/Platforms/MacOSX.platform/Developer/SDKs/MacOSX10.15.sdk -fno-exceptions -fno-rtti -UNDEBUG -std=c++14 -MD -MT lib/Target/X86/TargetInfo/CMakeFiles/LLVMX86Info.dir/X86TargetInfo.cpp.o -MF lib/Target/X86/TargetInfo/CMakeFiles/LLVMX86Info.dir/X86TargetInfo.cpp.o.d -o lib/Target/X86/TargetInfo/CMakeFiles/LLVMX86Info.dir/X86TargetInfo.cpp.o -c /Users/buildslave/jenkins/workspace/lldb-cmake/llvm-project/llvm/lib/Target/X86/TargetInfo/X86TargetInfo.cpp [64/2754] : && "/Applications/Xcode.app/Contents/Developer/Toolchains/XcodeDefault.xctoolchain/usr/bin/libtool" -static -no_warning_for_no_symbols -o lib/libLLVMX86Info.a lib/Target/X86/TargetInfo/CMakeFiles/LLVMX86Info.dir/X86TargetInfo.cpp.o && : [65/2754] /Users/buildslave/jenkins/workspace/lldb-cmake/host-compiler/bin/clang++ -DGTEST_HAS_RTTI=0 -D_DEBUG -D__STDC_CONSTANT_MACROS -D__STDC_FORMAT_MACROS -D__STDC_LIMIT_MACROS -Ilib/Target/X86/MCTargetDesc -I/Users/buildslave/jenkins/workspace/lldb-cmake/llvm-project/llvm/lib/Target/X86/MCTargetDesc -I/Users/buildslave/jenkins/workspace/lldb-cmake/llvm-project/llvm/lib/Target/X86 -Ilib/Target/X86 -Iinclude -I/Users/buildslave/jenkins/workspace/lldb-cmake/llvm-project/llvm/include -Wdocumentation -fPIC -fvisibility-inlines-hidden -Werror=date-time -Werror=unguarded-availability-new -fmodules -fmodules-cache-path=/Users/buildslave/jenkins/workspace/lldb-cmake/lldb-build/module.cache -fcxx-modules -Xclang -fmodules-local-submodule-visibility -Wall -Wextra -Wno-unused-parameter -Wwrite-strings -Wcast-qual -Wmissing-field-initializers -pedantic -Wno-long-long -Wimplicit-fallthrough -Wcovered-switch-default -Wno-noexcept-type -Wnon-virtual-dtor -Wdelete-non-virtual-dtor -Wsuggest-override -Wstring-conversion -fdiagnostics-color -O3 -isysroot /Applications/Xcode.app/Contents/Developer/Platforms/MacOSX.platform/Developer/SDKs/MacOSX10.15.sdk -fno-exceptions -fno-rtti -UNDEBUG -std=c++14 -MD -MT lib/Target/X86/MCTargetDesc/CMakeFiles/LLVMX86Desc.dir/X86MachObjectWriter.cpp.o -MF lib/Target/X86/MCTargetDesc/CMakeFiles/LLVMX86Desc.dir/X86MachObjectWriter.cpp.o.d -o lib/Target/X86/MCTargetDesc/CMakeFiles/LLVMX86Desc.dir/X86MachObjectWriter.cpp.o -c /Users/buildslave/jenkins/workspace/lldb-cmake/llvm-project/llvm/lib/Target/X86/MCTargetDesc/X86MachObjectWriter.cpp [66/2754] /Users/buildslave/jenkins/workspace/lldb-cmake/host-compiler/bin/clang++ -DGTEST_HAS_RTTI=0 -D_DEBUG -D__STDC_CONSTANT_MACROS -D__STDC_FORMAT_MACROS -D__STDC_LIMIT_MACROS -Ilib/Target/X86/MCTargetDesc -I/Users/buildslave/jenkins/workspace/lldb-cmake/llvm-project/llvm/lib/Target/X86/MCTargetDesc -I/Users/buildslave/jenkins/workspace/lldb-cmake/llvm-project/llvm/lib/Target/X86 -Ilib/Target/X86 -Iinclude -I/Users/buildslave/jenkins/workspace/lldb-cmake/llvm-project/llvm/include -Wdocumentation -fPIC -fvisibility-inlines-hidden -Werror=date-time -Werror=unguarded-availability-new -fmodules -fmodules-cache-path=/Users/buildslave/jenkins/workspace/lldb-cmake/lldb-build/module.cache -fcxx-modules -Xclang -fmodules-local-submodule-visibility -Wall -Wextra -Wno-unused-parameter -Wwrite-strings -Wcast-qual -Wmissing-field-initializers -pedantic -Wno-long-long -Wimplicit-fallthrough -Wcovered-switch-default -Wno-noexcept-type -Wnon-virtual-dtor -Wdelete-non-virtual-dtor -Wsuggest-override -Wstring-conversion -fdiagnostics-color -O3 -isysroot /Applications/Xcode.app/Contents/Developer/Platforms/MacOSX.platform/Developer/SDKs/MacOSX10.15.sdk -fno-exceptions -fno-rtti -UNDEBUG -std=c++14 -MD -MT lib/Target/X86/MCTargetDesc/CMakeFiles/LLVMX86Desc.dir/X86WinCOFFTargetStreamer.cpp.o -MF lib/Target/X86/MCTargetDesc/CMakeFiles/LLVMX86Desc.dir/X86WinCOFFTargetStreamer.cpp.o.d -o lib/Target/X86/MCTargetDesc/CMakeFiles/LLVMX86Desc.dir/X86WinCOFFTargetStreamer.cpp.o -c /Users/buildslave/jenkins/workspace/lldb-cmake/llvm-project/llvm/lib/Target/X86/MCTargetDesc/X86WinCOFFTargetStreamer.cpp [67/2754] /Users/buildslave/jenkins/workspace/lldb-cmake/host-compiler/bin/clang++ -DGTEST_HAS_RTTI=0 -D_DEBUG -D__STDC_CONSTANT_MACROS -D__STDC_FORMAT_MACROS -D__STDC_LIMIT_MACROS -Ilib/Target/X86/MCTargetDesc -I/Users/buildslave/jenkins/workspace/lldb-cmake/llvm-project/llvm/lib/Target/X86/MCTargetDesc -I/Users/buildslave/jenkins/workspace/lldb-cmake/llvm-project/llvm/lib/Target/X86 -Ilib/Target/X86 -Iinclude -I/Users/buildslave/jenkins/workspace/lldb-cmake/llvm-project/llvm/include -Wdocumentation -fPIC -fvisibility-inlines-hidden -Werror=date-time -Werror=unguarded-availability-new -fmodules -fmodules-cache-path=/Users/buildslave/jenkins/workspace/lldb-cmake/lldb-build/module.cache -fcxx-modules -Xclang -fmodules-local-submodule-visibility -Wall -Wextra -Wno-unused-parameter -Wwrite-strings -Wcast-qual -Wmissing-field-initializers -pedantic -Wno-long-long -Wimplicit-fallthrough -Wcovered-switch-default -Wno-noexcept-type -Wnon-virtual-dtor -Wdelete-non-virtual-dtor -Wsuggest-override -Wstring-conversion -fdiagnostics-color -O3 -isysroot /Applications/Xcode.app/Contents/Developer/Platforms/MacOSX.platform/Developer/SDKs/MacOSX10.15.sdk -fno-exceptions -fno-rtti -UNDEBUG -std=c++14 -MD -MT lib/Target/X86/MCTargetDesc/CMakeFiles/LLVMX86Desc.dir/X86AsmBackend.cpp.o -MF lib/Target/X86/MCTargetDesc/CMakeFiles/LLVMX86Desc.dir/X86AsmBackend.cpp.o.d -o lib/Target/X86/MCTargetDesc/CMakeFiles/LLVMX86Desc.dir/X86AsmBackend.cpp.o -c /Users/buildslave/jenkins/workspace/lldb-cmake/llvm-project/llvm/lib/Target/X86/MCTargetDesc/X86AsmBackend.cpp [68/2754] /Users/buildslave/jenkins/workspace/lldb-cmake/host-compiler/bin/clang++ -DGTEST_HAS_RTTI=0 -D_DEBUG -D__STDC_CONSTANT_MACROS -D__STDC_FORMAT_MACROS -D__STDC_LIMIT_MACROS -Ilib/Target/XCore -I/Users/buildslave/jenkins/workspace/lldb-cmake/llvm-project/llvm/lib/Target/XCore -Iinclude -I/Users/buildslave/jenkins/workspace/lldb-cmake/llvm-project/llvm/include -Wdocumentation -fPIC -fvisibility-inlines-hidden -Werror=date-time -Werror=unguarded-availability-new -fmodules -fmodules-cache-path=/Users/buildslave/jenkins/workspace/lldb-cmake/lldb-build/module.cache -fcxx-modules -Xclang -fmodules-local-submodule-visibility -Wall -Wextra -Wno-unused-parameter -Wwrite-strings -Wcast-qual -Wmissing-field-initializers -pedantic -Wno-long-long -Wimplicit-fallthrough -Wcovered-switch-default -Wno-noexcept-type -Wnon-virtual-dtor -Wdelete-non-virtual-dtor -Wsuggest-override -Wstring-conversion -fdiagnostics-color -O3 -isysroot /Applications/Xcode.app/Contents/Developer/Platforms/MacOSX.platform/Developer/SDKs/MacOSX10.15.sdk -fno-exceptions -fno-rtti -UNDEBUG -std=c++14 -MD -MT lib/Target/XCore/CMakeFiles/LLVMXCoreCodeGen.dir/XCoreMCInstLower.cpp.o -MF lib/Target/XCore/CMakeFiles/LLVMXCoreCodeGen.dir/XCoreMCInstLower.cpp.o.d -o lib/Target/XCore/CMakeFiles/LLVMXCoreCodeGen.dir/XCoreMCInstLower.cpp.o -c /Users/buildslave/jenkins/workspace/lldb-cmake/llvm-project/llvm/lib/Target/XCore/XCoreMCInstLower.cpp [69/2754] /Users/buildslave/jenkins/workspace/lldb-cmake/host-compiler/bin/clang++ -DGTEST_HAS_RTTI=0 -D_DEBUG -D__STDC_CONSTANT_MACROS -D__STDC_FORMAT_MACROS -D__STDC_LIMIT_MACROS -Ilib/Target/XCore -I/Users/buildslave/jenkins/workspace/lldb-cmake/llvm-project/llvm/lib/Target/XCore -Iinclude -I/Users/buildslave/jenkins/workspace/lldb-cmake/llvm-project/llvm/include -Wdocumentation -fPIC -fvisibility-inlines-hidden -Werror=date-time -Werror=unguarded-availability-new -fmodules -fmodules-cache-path=/Users/buildslave/jenkins/workspace/lldb-cmake/lldb-build/module.cache -fcxx-modules -Xclang -fmodules-local-submodule-visibility -Wall -Wextra -Wno-unused-parameter -Wwrite-strings -Wcast-qual -Wmissing-field-initializers -pedantic -Wno-long-long -Wimplicit-fallthrough -Wcovered-switch-default -Wno-noexcept-type -Wnon-virtual-dtor -Wdelete-non-virtual-dtor -Wsuggest-override -Wstring-conversion -fdiagnostics-color -O3 -isysroot /Applications/Xcode.app/Contents/Developer/Platforms/MacOSX.platform/Developer/SDKs/MacOSX10.15.sdk -fno-exceptions -fno-rtti -UNDEBUG -std=c++14 -MD -MT lib/Target/XCore/CMakeFiles/LLVMXCoreCodeGen.dir/XCoreInstrInfo.cpp.o -MF lib/Target/XCore/CMakeFiles/LLVMXCoreCodeGen.dir/XCoreInstrInfo.cpp.o.d -o lib/Target/XCore/CMakeFiles/LLVMXCoreCodeGen.dir/XCoreInstrInfo.cpp.o -c /Users/buildslave/jenkins/workspace/lldb-cmake/llvm-project/llvm/lib/Target/XCore/XCoreInstrInfo.cpp [70/2754] /Users/buildslave/jenkins/workspace/lldb-cmake/host-compiler/bin/clang++ -DGTEST_HAS_RTTI=0 -D_DEBUG -D__STDC_CONSTANT_MACROS -D__STDC_FORMAT_MACROS -D__STDC_LIMIT_MACROS -Ilib/Target/XCore -I/Users/buildslave/jenkins/workspace/lldb-cmake/llvm-project/llvm/lib/Target/XCore -Iinclude -I/Users/buildslave/jenkins/workspace/lldb-cmake/llvm-project/llvm/include -Wdocumentation -fPIC -fvisibility-inlines-hidden -Werror=date-time -Werror=unguarded-availability-new -fmodules -fmodules-cache-path=/Users/buildslave/jenkins/workspace/lldb-cmake/lldb-build/module.cache -fcxx-modules -Xclang -fmodules-local-submodule-visibility -Wall -Wextra -Wno-unused-parameter -Wwrite-strings -Wcast-qual -Wmissing-field-initializers -pedantic -Wno-long-long -Wimplicit-fallthrough -Wcovered-switch-default -Wno-noexcept-type -Wnon-virtual-dtor -Wdelete-non-virtual-dtor -Wsuggest-override -Wstring-conversion -fdiagnostics-color -O3 -isysroot /Applications/Xcode.app/Contents/Developer/Platforms/MacOSX.platform/Developer/SDKs/MacOSX10.15.sdk -fno-exceptions -fno-rtti -UNDEBUG -std=c++14 -MD -MT lib/Target/XCore/CMakeFiles/LLVMXCoreCodeGen.dir/XCoreISelDAGToDAG.cpp.o -MF lib/Target/XCore/CMakeFiles/LLVMXCoreCodeGen.dir/XCoreISelDAGToDAG.cpp.o.d -o lib/Target/XCore/CMakeFiles/LLVMXCoreCodeGen.dir/XCoreISelDAGToDAG.cpp.o -c /Users/buildslave/jenkins/workspace/lldb-cmake/llvm-project/llvm/lib/Target/XCore/XCoreISelDAGToDAG.cpp [71/2754] /Users/buildslave/jenkins/workspace/lldb-cmake/host-compiler/bin/clang++ -DGTEST_HAS_RTTI=0 -D_DEBUG -D__STDC_CONSTANT_MACROS -D__STDC_FORMAT_MACROS -D__STDC_LIMIT_MACROS -Ilib/Target/X86/Disassembler -I/Users/buildslave/jenkins/workspace/lldb-cmake/llvm-project/llvm/lib/Target/X86/Disassembler -I/Users/buildslave/jenkins/workspace/lldb-cmake/llvm-project/llvm/lib/Target/X86 -Ilib/Target/X86 -Iinclude -I/Users/buildslave/jenkins/workspace/lldb-cmake/llvm-project/llvm/include -Wdocumentation -fPIC -fvisibility-inlines-hidden -Werror=date-time -Werror=unguarded-availability-new -fmodules -fmodules-cache-path=/Users/buildslave/jenkins/workspace/lldb-cmake/lldb-build/module.cache -fcxx-modules -Xclang -fmodules-local-submodule-visibility -Wall -Wextra -Wno-unused-parameter -Wwrite-strings -Wcast-qual -Wmissing-field-initializers -pedantic -Wno-long-long -Wimplicit-fallthrough -Wcovered-switch-default -Wno-noexcept-type -Wnon-virtual-dtor -Wdelete-non-virtual-dtor -Wsuggest-override -Wstring-conversion -fdiagnostics-color -O3 -isysroot /Applications/Xcode.app/Contents/Developer/Platforms/MacOSX.platform/Developer/SDKs/MacOSX10.15.sdk -fno-exceptions -fno-rtti -UNDEBUG -std=c++14 -MD -MT lib/Target/X86/Disassembler/CMakeFiles/LLVMX86Disassembler.dir/X86Disassembler.cpp.o -MF lib/Target/X86/Disassembler/CMakeFiles/LLVMX86Disassembler.dir/X86Disassembler.cpp.o.d -o lib/Target/X86/Disassembler/CMakeFiles/LLVMX86Disassembler.dir/X86Disassembler.cpp.o -c /Users/buildslave/jenkins/workspace/lldb-cmake/llvm-project/llvm/lib/Target/X86/Disassembler/X86Disassembler.cpp [72/2754] : && "/Applications/Xcode.app/Contents/Developer/Toolchains/XcodeDefault.xctoolchain/usr/bin/libtool" -static -no_warning_for_no_symbols -o lib/libLLVMX86Disassembler.a lib/Target/X86/Disassembler/CMakeFiles/LLVMX86Disassembler.dir/X86Disassembler.cpp.o && : [73/2754] /Users/buildslave/jenkins/workspace/lldb-cmake/host-compiler/bin/clang++ -DGTEST_HAS_RTTI=0 -D_DEBUG -D__STDC_CONSTANT_MACROS -D__STDC_FORMAT_MACROS -D__STDC_LIMIT_MACROS -Ilib/Target/XCore -I/Users/buildslave/jenkins/workspace/lldb-cmake/llvm-project/llvm/lib/Target/XCore -Iinclude -I/Users/buildslave/jenkins/workspace/lldb-cmake/llvm-project/llvm/include -Wdocumentation -fPIC -fvisibility-inlines-hidden -Werror=date-time -Werror=unguarded-availability-new -fmodules -fmodules-cache-path=/Users/buildslave/jenkins/workspace/lldb-cmake/lldb-build/module.cache -fcxx-modules -Xclang -fmodules-local-submodule-visibility -Wall -Wextra -Wno-unused-parameter -Wwrite-strings -Wcast-qual -Wmissing-field-initializers -pedantic -Wno-long-long -Wimplicit-fallthrough -Wcovered-switch-default -Wno-noexcept-type -Wnon-virtual-dtor -Wdelete-non-virtual-dtor -Wsuggest-override -Wstring-conversion -fdiagnostics-color -O3 -isysroot /Applications/Xcode.app/Contents/Developer/Platforms/MacOSX.platform/Developer/SDKs/MacOSX10.15.sdk -fno-exceptions -fno-rtti -UNDEBUG -std=c++14 -MD -MT lib/Target/XCore/CMakeFiles/LLVMXCoreCodeGen.dir/XCoreMachineFunctionInfo.cpp.o -MF lib/Target/XCore/CMakeFiles/LLVMXCoreCodeGen.dir/XCoreMachineFunctionInfo.cpp.o.d -o lib/Target/XCore/CMakeFiles/LLVMXCoreCodeGen.dir/XCoreMachineFunctionInfo.cpp.o -c /Users/buildslave/jenkins/workspace/lldb-cmake/llvm-project/llvm/lib/Target/XCore/XCoreMachineFunctionInfo.cpp [74/2754] /Users/buildslave/jenkins/workspace/lldb-cmake/host-compiler/bin/clang++ -DGTEST_HAS_RTTI=0 -D_DEBUG -D__STDC_CONSTANT_MACROS -D__STDC_FORMAT_MACROS -D__STDC_LIMIT_MACROS -Ilib/Target/XCore -I/Users/buildslave/jenkins/workspace/lldb-cmake/llvm-project/llvm/lib/Target/XCore -Iinclude -I/Users/buildslave/jenkins/workspace/lldb-cmake/llvm-project/llvm/include -Wdocumentation -fPIC -fvisibility-inlines-hidden -Werror=date-time -Werror=unguarded-availability-new -fmodules -fmodules-cache-path=/Users/buildslave/jenkins/workspace/lldb-cmake/lldb-build/module.cache -fcxx-modules -Xclang -fmodules-local-submodule-visibility -Wall -Wextra -Wno-unused-parameter -Wwrite-strings -Wcast-qual -Wmissing-field-initializers -pedantic -Wno-long-long -Wimplicit-fallthrough -Wcovered-switch-default -Wno-noexcept-type -Wnon-virtual-dtor -Wdelete-non-virtual-dtor -Wsuggest-override -Wstring-conversion -fdiagnostics-color -O3 -isysroot /Applications/Xcode.app/Contents/Developer/Platforms/MacOSX.platform/Developer/SDKs/MacOSX10.15.sdk -fno-exceptions -fno-rtti -UNDEBUG -std=c++14 -MD -MT lib/Target/XCore/CMakeFiles/LLVMXCoreCodeGen.dir/XCoreLowerThreadLocal.cpp.o -MF lib/Target/XCore/CMakeFiles/LLVMXCoreCodeGen.dir/XCoreLowerThreadLocal.cpp.o.d -o lib/Target/XCore/CMakeFiles/LLVMXCoreCodeGen.dir/XCoreLowerThreadLocal.cpp.o -c /Users/buildslave/jenkins/workspace/lldb-cmake/llvm-project/llvm/lib/Target/XCore/XCoreLowerThreadLocal.cpp [75/2754] /Users/buildslave/jenkins/workspace/lldb-cmake/host-compiler/bin/clang++ -DGTEST_HAS_RTTI=0 -D_DEBUG -D__STDC_CONSTANT_MACROS -D__STDC_FORMAT_MACROS -D__STDC_LIMIT_MACROS -Ilib/Target/XCore -I/Users/buildslave/jenkins/workspace/lldb-cmake/llvm-project/llvm/lib/Target/XCore -Iinclude -I/Users/buildslave/jenkins/workspace/lldb-cmake/llvm-project/llvm/include -Wdocumentation -fPIC -fvisibility-inlines-hidden -Werror=date-time -Werror=unguarded-availability-new -fmodules -fmodules-cache-path=/Users/buildslave/jenkins/workspace/lldb-cmake/lldb-build/module.cache -fcxx-modules -Xclang -fmodules-local-submodule-visibility -Wall -Wextra -Wno-unused-parameter -Wwrite-strings -Wcast-qual -Wmissing-field-initializers -pedantic -Wno-long-long -Wimplicit-fallthrough -Wcovered-switch-default -Wno-noexcept-type -Wnon-virtual-dtor -Wdelete-non-virtual-dtor -Wsuggest-override -Wstring-conversion -fdiagnostics-color -O3 -isysroot /Applications/Xcode.app/Contents/Developer/Platforms/MacOSX.platform/Developer/SDKs/MacOSX10.15.sdk -fno-exceptions -fno-rtti -UNDEBUG -std=c++14 -MD -MT lib/Target/XCore/CMakeFiles/LLVMXCoreCodeGen.dir/XCoreTargetObjectFile.cpp.o -MF lib/Target/XCore/CMakeFiles/LLVMXCoreCodeGen.dir/XCoreTargetObjectFile.cpp.o.d -o lib/Target/XCore/CMakeFiles/LLVMXCoreCodeGen.dir/XCoreTargetObjectFile.cpp.o -c /Users/buildslave/jenkins/workspace/lldb-cmake/llvm-project/llvm/lib/Target/XCore/XCoreTargetObjectFile.cpp [76/2754] /Users/buildslave/jenkins/workspace/lldb-cmake/host-compiler/bin/clang++ -DGTEST_HAS_RTTI=0 -D_DEBUG -D__STDC_CONSTANT_MACROS -D__STDC_FORMAT_MACROS -D__STDC_LIMIT_MACROS -Ilib/Target/XCore -I/Users/buildslave/jenkins/workspace/lldb-cmake/llvm-project/llvm/lib/Target/XCore -Iinclude -I/Users/buildslave/jenkins/workspace/lldb-cmake/llvm-project/llvm/include -Wdocumentation -fPIC -fvisibility-inlines-hidden -Werror=date-time -Werror=unguarded-availability-new -fmodules -fmodules-cache-path=/Users/buildslave/jenkins/workspace/lldb-cmake/lldb-build/module.cache -fcxx-modules -Xclang -fmodules-local-submodule-visibility -Wall -Wextra -Wno-unused-parameter -Wwrite-strings -Wcast-qual -Wmissing-field-initializers -pedantic -Wno-long-long -Wimplicit-fallthrough -Wcovered-switch-default -Wno-noexcept-type -Wnon-virtual-dtor -Wdelete-non-virtual-dtor -Wsuggest-override -Wstring-conversion -fdiagnostics-color -O3 -isysroot /Applications/Xcode.app/Contents/Developer/Platforms/MacOSX.platform/Developer/SDKs/MacOSX10.15.sdk -fno-exceptions -fno-rtti -UNDEBUG -std=c++14 -MD -MT lib/Target/XCore/CMakeFiles/LLVMXCoreCodeGen.dir/XCoreFrameToArgsOffsetElim.cpp.o -MF lib/Target/XCore/CMakeFiles/LLVMXCoreCodeGen.dir/XCoreFrameToArgsOffsetElim.cpp.o.d -o lib/Target/XCore/CMakeFiles/LLVMXCoreCodeGen.dir/XCoreFrameToArgsOffsetElim.cpp.o -c /Users/buildslave/jenkins/workspace/lldb-cmake/llvm-project/llvm/lib/Target/XCore/XCoreFrameToArgsOffsetElim.cpp [77/2754] /Users/buildslave/jenkins/workspace/lldb-cmake/host-compiler/bin/clang++ -DGTEST_HAS_RTTI=0 -D_DEBUG -D__STDC_CONSTANT_MACROS -D__STDC_FORMAT_MACROS -D__STDC_LIMIT_MACROS -Ilib/Target/XCore/MCTargetDesc -I/Users/buildslave/jenkins/workspace/lldb-cmake/llvm-project/llvm/lib/Target/XCore/MCTargetDesc -I/Users/buildslave/jenkins/workspace/lldb-cmake/llvm-project/llvm/lib/Target/XCore -Ilib/Target/XCore -Iinclude -I/Users/buildslave/jenkins/workspace/lldb-cmake/llvm-project/llvm/include -Wdocumentation -fPIC -fvisibility-inlines-hidden -Werror=date-time -Werror=unguarded-availability-new -fmodules -fmodules-cache-path=/Users/buildslave/jenkins/workspace/lldb-cmake/lldb-build/module.cache -fcxx-modules -Xclang -fmodules-local-submodule-visibility -Wall -Wextra -Wno-unused-parameter -Wwrite-strings -Wcast-qual -Wmissing-field-initializers -pedantic -Wno-long-long -Wimplicit-fallthrough -Wcovered-switch-default -Wno-noexcept-type -Wnon-virtual-dtor -Wdelete-non-virtual-dtor -Wsuggest-override -Wstring-conversion -fdiagnostics-color -O3 -isysroot /Applications/Xcode.app/Contents/Developer/Platforms/MacOSX.platform/Developer/SDKs/MacOSX10.15.sdk -fno-exceptions -fno-rtti -UNDEBUG -std=c++14 -MD -MT lib/Target/XCore/MCTargetDesc/CMakeFiles/LLVMXCoreDesc.dir/XCoreInstPrinter.cpp.o -MF lib/Target/XCore/MCTargetDesc/CMakeFiles/LLVMXCoreDesc.dir/XCoreInstPrinter.cpp.o.d -o lib/Target/XCore/MCTargetDesc/CMakeFiles/LLVMXCoreDesc.dir/XCoreInstPrinter.cpp.o -c /Users/buildslave/jenkins/workspace/lldb-cmake/llvm-project/llvm/lib/Target/XCore/MCTargetDesc/XCoreInstPrinter.cpp [78/2754] /Users/buildslave/jenkins/workspace/lldb-cmake/host-compiler/bin/clang++ -DGTEST_HAS_RTTI=0 -D_DEBUG -D__STDC_CONSTANT_MACROS -D__STDC_FORMAT_MACROS -D__STDC_LIMIT_MACROS -Ilib/Target/XCore -I/Users/buildslave/jenkins/workspace/lldb-cmake/llvm-project/llvm/lib/Target/XCore -Iinclude -I/Users/buildslave/jenkins/workspace/lldb-cmake/llvm-project/llvm/include -Wdocumentation -fPIC -fvisibility-inlines-hidden -Werror=date-time -Werror=unguarded-availability-new -fmodules -fmodules-cache-path=/Users/buildslave/jenkins/workspace/lldb-cmake/lldb-build/module.cache -fcxx-modules -Xclang -fmodules-local-submodule-visibility -Wall -Wextra -Wno-unused-parameter -Wwrite-strings -Wcast-qual -Wmissing-field-initializers -pedantic -Wno-long-long -Wimplicit-fallthrough -Wcovered-switch-default -Wno-noexcept-type -Wnon-virtual-dtor -Wdelete-non-virtual-dtor -Wsuggest-override -Wstring-conversion -fdiagnostics-color -O3 -isysroot /Applications/Xcode.app/Contents/Developer/Platforms/MacOSX.platform/Developer/SDKs/MacOSX10.15.sdk -fno-exceptions -fno-rtti -UNDEBUG -std=c++14 -MD -MT lib/Target/XCore/CMakeFiles/LLVMXCoreCodeGen.dir/XCoreRegisterInfo.cpp.o -MF lib/Target/XCore/CMakeFiles/LLVMXCoreCodeGen.dir/XCoreRegisterInfo.cpp.o.d -o lib/Target/XCore/CMakeFiles/LLVMXCoreCodeGen.dir/XCoreRegisterInfo.cpp.o -c /Users/buildslave/jenkins/workspace/lldb-cmake/llvm-project/llvm/lib/Target/XCore/XCoreRegisterInfo.cpp [79/2754] /Users/buildslave/jenkins/workspace/lldb-cmake/host-compiler/bin/clang++ -DGTEST_HAS_RTTI=0 -D_DEBUG -D__STDC_CONSTANT_MACROS -D__STDC_FORMAT_MACROS -D__STDC_LIMIT_MACROS -Ilib/Target/XCore/MCTargetDesc -I/Users/buildslave/jenkins/workspace/lldb-cmake/llvm-project/llvm/lib/Target/XCore/MCTargetDesc -I/Users/buildslave/jenkins/workspace/lldb-cmake/llvm-project/llvm/lib/Target/XCore -Ilib/Target/XCore -Iinclude -I/Users/buildslave/jenkins/workspace/lldb-cmake/llvm-project/llvm/include -Wdocumentation -fPIC -fvisibility-inlines-hidden -Werror=date-time -Werror=unguarded-availability-new -fmodules -fmodules-cache-path=/Users/buildslave/jenkins/workspace/lldb-cmake/lldb-build/module.cache -fcxx-modules -Xclang -fmodules-local-submodule-visibility -Wall -Wextra -Wno-unused-parameter -Wwrite-strings -Wcast-qual -Wmissing-field-initializers -pedantic -Wno-long-long -Wimplicit-fallthrough -Wcovered-switch-default -Wno-noexcept-type -Wnon-virtual-dtor -Wdelete-non-virtual-dtor -Wsuggest-override -Wstring-conversion -fdiagnostics-color -O3 -isysroot /Applications/Xcode.app/Contents/Developer/Platforms/MacOSX.platform/Developer/SDKs/MacOSX10.15.sdk -fno-exceptions -fno-rtti -UNDEBUG -std=c++14 -MD -MT lib/Target/XCore/MCTargetDesc/CMakeFiles/LLVMXCoreDesc.dir/XCoreMCAsmInfo.cpp.o -MF lib/Target/XCore/MCTargetDesc/CMakeFiles/LLVMXCoreDesc.dir/XCoreMCAsmInfo.cpp.o.d -o lib/Target/XCore/MCTargetDesc/CMakeFiles/LLVMXCoreDesc.dir/XCoreMCAsmInfo.cpp.o -c /Users/buildslave/jenkins/workspace/lldb-cmake/llvm-project/llvm/lib/Target/XCore/MCTargetDesc/XCoreMCAsmInfo.cpp [80/2754] /Users/buildslave/jenkins/workspace/lldb-cmake/host-compiler/bin/clang++ -DGTEST_HAS_RTTI=0 -D_DEBUG -D__STDC_CONSTANT_MACROS -D__STDC_FORMAT_MACROS -D__STDC_LIMIT_MACROS -Ilib/Target/XCore -I/Users/buildslave/jenkins/workspace/lldb-cmake/llvm-project/llvm/lib/Target/XCore -Iinclude -I/Users/buildslave/jenkins/workspace/lldb-cmake/llvm-project/llvm/include -Wdocumentation -fPIC -fvisibility-inlines-hidden -Werror=date-time -Werror=unguarded-availability-new -fmodules -fmodules-cache-path=/Users/buildslave/jenkins/workspace/lldb-cmake/lldb-build/module.cache -fcxx-modules -Xclang -fmodules-local-submodule-visibility -Wall -Wextra -Wno-unused-parameter -Wwrite-strings -Wcast-qual -Wmissing-field-initializers -pedantic -Wno-long-long -Wimplicit-fallthrough -Wcovered-switch-default -Wno-noexcept-type -Wnon-virtual-dtor -Wdelete-non-virtual-dtor -Wsuggest-override -Wstring-conversion -fdiagnostics-color -O3 -isysroot /Applications/Xcode.app/Contents/Developer/Platforms/MacOSX.platform/Developer/SDKs/MacOSX10.15.sdk -fno-exceptions -fno-rtti -UNDEBUG -std=c++14 -MD -MT lib/Target/XCore/CMakeFiles/LLVMXCoreCodeGen.dir/XCoreSubtarget.cpp.o -MF lib/Target/XCore/CMakeFiles/LLVMXCoreCodeGen.dir/XCoreSubtarget.cpp.o.d -o lib/Target/XCore/CMakeFiles/LLVMXCoreCodeGen.dir/XCoreSubtarget.cpp.o -c /Users/buildslave/jenkins/workspace/lldb-cmake/llvm-project/llvm/lib/Target/XCore/XCoreSubtarget.cpp [81/2754] /Users/buildslave/jenkins/workspace/lldb-cmake/host-compiler/bin/clang++ -DGTEST_HAS_RTTI=0 -D_DEBUG -D__STDC_CONSTANT_MACROS -D__STDC_FORMAT_MACROS -D__STDC_LIMIT_MACROS -Ilib/Target/XCore/MCTargetDesc -I/Users/buildslave/jenkins/workspace/lldb-cmake/llvm-project/llvm/lib/Target/XCore/MCTargetDesc -I/Users/buildslave/jenkins/workspace/lldb-cmake/llvm-project/llvm/lib/Target/XCore -Ilib/Target/XCore -Iinclude -I/Users/buildslave/jenkins/workspace/lldb-cmake/llvm-project/llvm/include -Wdocumentation -fPIC -fvisibility-inlines-hidden -Werror=date-time -Werror=unguarded-availability-new -fmodules -fmodules-cache-path=/Users/buildslave/jenkins/workspace/lldb-cmake/lldb-build/module.cache -fcxx-modules -Xclang -fmodules-local-submodule-visibility -Wall -Wextra -Wno-unused-parameter -Wwrite-strings -Wcast-qual -Wmissing-field-initializers -pedantic -Wno-long-long -Wimplicit-fallthrough -Wcovered-switch-default -Wno-noexcept-type -Wnon-virtual-dtor -Wdelete-non-virtual-dtor -Wsuggest-override -Wstring-conversion -fdiagnostics-color -O3 -isysroot /Applications/Xcode.app/Contents/Developer/Platforms/MacOSX.platform/Developer/SDKs/MacOSX10.15.sdk -fno-exceptions -fno-rtti -UNDEBUG -std=c++14 -MD -MT lib/Target/XCore/MCTargetDesc/CMakeFiles/LLVMXCoreDesc.dir/XCoreMCTargetDesc.cpp.o -MF lib/Target/XCore/MCTargetDesc/CMakeFiles/LLVMXCoreDesc.dir/XCoreMCTargetDesc.cpp.o.d -o lib/Target/XCore/MCTargetDesc/CMakeFiles/LLVMXCoreDesc.dir/XCoreMCTargetDesc.cpp.o -c /Users/buildslave/jenkins/workspace/lldb-cmake/llvm-project/llvm/lib/Target/XCore/MCTargetDesc/XCoreMCTargetDesc.cpp [82/2754] : && "/Applications/Xcode.app/Contents/Developer/Toolchains/XcodeDefault.xctoolchain/usr/bin/libtool" -static -no_warning_for_no_symbols -o lib/libLLVMXCoreDesc.a lib/Target/XCore/MCTargetDesc/CMakeFiles/LLVMXCoreDesc.dir/XCoreInstPrinter.cpp.o lib/Target/XCore/MCTargetDesc/CMakeFiles/LLVMXCoreDesc.dir/XCoreMCTargetDesc.cpp.o lib/Target/XCore/MCTargetDesc/CMakeFiles/LLVMXCoreDesc.dir/XCoreMCAsmInfo.cpp.o && : [83/2754] : && /Users/buildslave/jenkins/workspace/lldb-cmake/host-compiler/bin/clang++ -Wdocumentation -fPIC -fvisibility-inlines-hidden -Werror=date-time -Werror=unguarded-availability-new -fmodules -fmodules-cache-path=/Users/buildslave/jenkins/workspace/lldb-cmake/lldb-build/module.cache -fcxx-modules -Xclang -fmodules-local-submodule-visibility -Wall -Wextra -Wno-unused-parameter -Wwrite-strings -Wcast-qual -Wmissing-field-initializers -Wno-long-long -Wimplicit-fallthrough -Wcovered-switch-default -Wno-noexcept-type -Wnon-virtual-dtor -Wdelete-non-virtual-dtor -Wsuggest-override -Wstring-conversion -fdiagnostics-color -O3 -isysroot /Applications/Xcode.app/Contents/Developer/Platforms/MacOSX.platform/Developer/SDKs/MacOSX10.15.sdk -dynamiclib -Wl,-headerpad_max_install_names -compatibility_version 1.0.0 -current_version 1.0.0 -o lib/libc++.1.0.dylib -install_name @rpath/libc++.1.dylib projects/libcxx/src/CMakeFiles/cxx_shared.dir/algorithm.cpp.o projects/libcxx/src/CMakeFiles/cxx_shared.dir/any.cpp.o projects/libcxx/src/CMakeFiles/cxx_shared.dir/atomic.cpp.o projects/libcxx/src/CMakeFiles/cxx_shared.dir/barrier.cpp.o projects/libcxx/src/CMakeFiles/cxx_shared.dir/bind.cpp.o projects/libcxx/src/CMakeFiles/cxx_shared.dir/charconv.cpp.o projects/libcxx/src/CMakeFiles/cxx_shared.dir/chrono.cpp.o projects/libcxx/src/CMakeFiles/cxx_shared.dir/condition_variable.cpp.o projects/libcxx/src/CMakeFiles/cxx_shared.dir/condition_variable_destructor.cpp.o projects/libcxx/src/CMakeFiles/cxx_shared.dir/debug.cpp.o projects/libcxx/src/CMakeFiles/cxx_shared.dir/exception.cpp.o projects/libcxx/src/CMakeFiles/cxx_shared.dir/functional.cpp.o projects/libcxx/src/CMakeFiles/cxx_shared.dir/future.cpp.o projects/libcxx/src/CMakeFiles/cxx_shared.dir/hash.cpp.o projects/libcxx/src/CMakeFiles/cxx_shared.dir/ios.cpp.o projects/libcxx/src/CMakeFiles/cxx_shared.dir/iostream.cpp.o projects/libcxx/src/CMakeFiles/cxx_shared.dir/locale.cpp.o projects/libcxx/src/CMakeFiles/cxx_shared.dir/memory.cpp.o projects/libcxx/src/CMakeFiles/cxx_shared.dir/mutex.cpp.o projects/libcxx/src/CMakeFiles/cxx_shared.dir/mutex_destructor.cpp.o projects/libcxx/src/CMakeFiles/cxx_shared.dir/new.cpp.o projects/libcxx/src/CMakeFiles/cxx_shared.dir/optional.cpp.o projects/libcxx/src/CMakeFiles/cxx_shared.dir/random.cpp.o projects/libcxx/src/CMakeFiles/cxx_shared.dir/random_shuffle.cpp.o projects/libcxx/src/CMakeFiles/cxx_shared.dir/regex.cpp.o projects/libcxx/src/CMakeFiles/cxx_shared.dir/shared_mutex.cpp.o projects/libcxx/src/CMakeFiles/cxx_shared.dir/stdexcept.cpp.o projects/libcxx/src/CMakeFiles/cxx_shared.dir/string.cpp.o projects/libcxx/src/CMakeFiles/cxx_shared.dir/strstream.cpp.o projects/libcxx/src/CMakeFiles/cxx_shared.dir/system_error.cpp.o projects/libcxx/src/CMakeFiles/cxx_shared.dir/thread.cpp.o projects/libcxx/src/CMakeFiles/cxx_shared.dir/typeinfo.cpp.o projects/libcxx/src/CMakeFiles/cxx_shared.dir/utility.cpp.o projects/libcxx/src/CMakeFiles/cxx_shared.dir/valarray.cpp.o projects/libcxx/src/CMakeFiles/cxx_shared.dir/variant.cpp.o projects/libcxx/src/CMakeFiles/cxx_shared.dir/vector.cpp.o projects/libcxx/src/CMakeFiles/cxx_shared.dir/filesystem/operations.cpp.o projects/libcxx/src/CMakeFiles/cxx_shared.dir/filesystem/directory_iterator.cpp.o projects/libcxx/src/CMakeFiles/cxx_shared.dir/filesystem/int128_builtins.cpp.o -Wl,-rpath,@loader_path/../lib -nodefaultlibs -lSystem -lc lib/libc++abi.1.0.dylib -Wl,-unexported_symbols_list,/Users/buildslave/jenkins/workspace/lldb-cmake/llvm-project/libcxx/src/../lib/libc++unexp.exp -Wl,-reexported_symbols_list,/Users/buildslave/jenkins/workspace/lldb-cmake/llvm-project/libcxx/src/../lib/libc++abi.v2.exp -Wl,-force_symbols_not_weak_list,/Users/buildslave/jenkins/workspace/lldb-cmake/llvm-project/libcxx/src/../lib/notweak.exp -Wl,-force_symbols_weak_list,/Users/buildslave/jenkins/workspace/lldb-cmake/llvm-project/libcxx/src/../lib/weak.exp -Wl,-reexported_symbols_list,/Users/buildslave/jenkins/workspace/lldb-cmake/llvm-project/libcxxabi/src/../lib/new-delete.exp -Wl,-reexported_symbols_list,/Users/buildslave/jenkins/workspace/lldb-cmake/llvm-project/libcxxabi/src/../lib/exceptions.exp -Wl,-reexported_symbols_list,/Users/buildslave/jenkins/workspace/lldb-cmake/llvm-project/libcxxabi/src/../lib/personality-v0.exp && : FAILED: lib/libc++.1.0.dylib : && /Users/buildslave/jenkins/workspace/lldb-cmake/host-compiler/bin/clang++ -Wdocumentation -fPIC -fvisibility-inlines-hidden -Werror=date-time -Werror=unguarded-availability-new -fmodules -fmodules-cache-path=/Users/buildslave/jenkins/workspace/lldb-cmake/lldb-build/module.cache -fcxx-modules -Xclang -fmodules-local-submodule-visibility -Wall -Wextra -Wno-unused-parameter -Wwrite-strings -Wcast-qual -Wmissing-field-initializers -Wno-long-long -Wimplicit-fallthrough -Wcovered-switch-default -Wno-noexcept-type -Wnon-virtual-dtor -Wdelete-non-virtual-dtor -Wsuggest-override -Wstring-conversion -fdiagnostics-color -O3 -isysroot /Applications/Xcode.app/Contents/Developer/Platforms/MacOSX.platform/Developer/SDKs/MacOSX10.15.sdk -dynamiclib -Wl,-headerpad_max_install_names -compatibility_version 1.0.0 -current_version 1.0.0 -o lib/libc++.1.0.dylib -install_name @rpath/libc++.1.dylib projects/libcxx/src/CMakeFiles/cxx_shared.dir/algorithm.cpp.o projects/libcxx/src/CMakeFiles/cxx_shared.dir/any.cpp.o projects/libcxx/src/CMakeFiles/cxx_shared.dir/atomic.cpp.o projects/libcxx/src/CMakeFiles/cxx_shared.dir/barrier.cpp.o projects/libcxx/src/CMakeFiles/cxx_shared.dir/bind.cpp.o projects/libcxx/src/CMakeFiles/cxx_shared.dir/charconv.cpp.o projects/libcxx/src/CMakeFiles/cxx_shared.dir/chrono.cpp.o projects/libcxx/src/CMakeFiles/cxx_shared.dir/condition_variable.cpp.o projects/libcxx/src/CMakeFiles/cxx_shared.dir/condition_variable_destructor.cpp.o projects/libcxx/src/CMakeFiles/cxx_shared.dir/debug.cpp.o projects/libcxx/src/CMakeFiles/cxx_shared.dir/exception.cpp.o projects/libcxx/src/CMakeFiles/cxx_shared.dir/functional.cpp.o projects/libcxx/src/CMakeFiles/cxx_shared.dir/future.cpp.o projects/libcxx/src/CMakeFiles/cxx_shared.dir/hash.cpp.o projects/libcxx/src/CMakeFiles/cxx_shared.dir/ios.cpp.o projects/libcxx/src/CMakeFiles/cxx_shared.dir/iostream.cpp.o projects/libcxx/src/CMakeFiles/cxx_shared.dir/locale.cpp.o projects/libcxx/src/CMakeFiles/cxx_shared.dir/memory.cpp.o projects/libcxx/src/CMakeFiles/cxx_shared.dir/mutex.cpp.o projects/libcxx/src/CMakeFiles/cxx_shared.dir/mutex_destructor.cpp.o projects/libcxx/src/CMakeFiles/cxx_shared.dir/new.cpp.o projects/libcxx/src/CMakeFiles/cxx_shared.dir/optional.cpp.o projects/libcxx/src/CMakeFiles/cxx_shared.dir/random.cpp.o projects/libcxx/src/CMakeFiles/cxx_shared.dir/random_shuffle.cpp.o projects/libcxx/src/CMakeFiles/cxx_shared.dir/regex.cpp.o projects/libcxx/src/CMakeFiles/cxx_shared.dir/shared_mutex.cpp.o projects/libcxx/src/CMakeFiles/cxx_shared.dir/stdexcept.cpp.o projects/libcxx/src/CMakeFiles/cxx_shared.dir/string.cpp.o projects/libcxx/src/CMakeFiles/cxx_shared.dir/strstream.cpp.o projects/libcxx/src/CMakeFiles/cxx_shared.dir/system_error.cpp.o projects/libcxx/src/CMakeFiles/cxx_shared.dir/thread.cpp.o projects/libcxx/src/CMakeFiles/cxx_shared.dir/typeinfo.cpp.o projects/libcxx/src/CMakeFiles/cxx_shared.dir/utility.cpp.o projects/libcxx/src/CMakeFiles/cxx_shared.dir/valarray.cpp.o projects/libcxx/src/CMakeFiles/cxx_shared.dir/variant.cpp.o projects/libcxx/src/CMakeFiles/cxx_shared.dir/vector.cpp.o projects/libcxx/src/CMakeFiles/cxx_shared.dir/filesystem/operations.cpp.o projects/libcxx/src/CMakeFiles/cxx_shared.dir/filesystem/directory_iterator.cpp.o projects/libcxx/src/CMakeFiles/cxx_shared.dir/filesystem/int128_builtins.cpp.o -Wl,-rpath,@loader_path/../lib -nodefaultlibs -lSystem -lc lib/libc++abi.1.0.dylib -Wl,-unexported_symbols_list,/Users/buildslave/jenkins/workspace/lldb-cmake/llvm-project/libcxx/src/../lib/libc++unexp.exp -Wl,-reexported_symbols_list,/Users/buildslave/jenkins/workspace/lldb-cmake/llvm-project/libcxx/src/../lib/libc++abi.v2.exp -Wl,-force_symbols_not_weak_list,/Users/buildslave/jenkins/workspace/lldb-cmake/llvm-project/libcxx/src/../lib/notweak.exp -Wl,-force_symbols_weak_list,/Users/buildslave/jenkins/workspace/lldb-cmake/llvm-project/libcxx/src/../lib/weak.exp -Wl,-reexported_symbols_list,/Users/buildslave/jenkins/workspace/lldb-cmake/llvm-project/libcxxabi/src/../lib/new-delete.exp -Wl,-reexported_symbols_list,/Users/buildslave/jenkins/workspace/lldb-cmake/llvm-project/libcxxabi/src/../lib/exceptions.exp -Wl,-reexported_symbols_list,/Users/buildslave/jenkins/workspace/lldb-cmake/llvm-project/libcxxabi/src/../lib/personality-v0.exp && : ld: requested re-export symbol operator new(unsigned long) is not from a dylib, but from projects/libcxx/src/CMakeFiles/cxx_shared.dir/new.cpp.o file 'projects/libcxx/src/CMakeFiles/cxx_shared.dir/new.cpp.o' for architecture x86_64 clang-12: error: linker command failed with exit code 1 (use -v to see invocation) [84/2754] /Users/buildslave/jenkins/workspace/lldb-cmake/host-compiler/bin/clang++ -DGTEST_HAS_RTTI=0 -D_DEBUG -D__STDC_CONSTANT_MACROS -D__STDC_FORMAT_MACROS -D__STDC_LIMIT_MACROS -Ilib/Target/XCore -I/Users/buildslave/jenkins/workspace/lldb-cmake/llvm-project/llvm/lib/Target/XCore -Iinclude -I/Users/buildslave/jenkins/workspace/lldb-cmake/llvm-project/llvm/include -Wdocumentation -fPIC -fvisibility-inlines-hidden -Werror=date-time -Werror=unguarded-availability-new -fmodules -fmodules-cache-path=/Users/buildslave/jenkins/workspace/lldb-cmake/lldb-build/module.cache -fcxx-modules -Xclang -fmodules-local-submodule-visibility -Wall -Wextra -Wno-unused-parameter -Wwrite-strings -Wcast-qual -Wmissing-field-initializers -pedantic -Wno-long-long -Wimplicit-fallthrough -Wcovered-switch-default -Wno-noexcept-type -Wnon-virtual-dtor -Wdelete-non-virtual-dtor -Wsuggest-override -Wstring-conversion -fdiagnostics-color -O3 -isysroot /Applications/Xcode.app/Contents/Developer/Platforms/MacOSX.platform/Developer/SDKs/MacOSX10.15.sdk -fno-exceptions -fno-rtti -UNDEBUG -std=c++14 -MD -MT lib/Target/XCore/CMakeFiles/LLVMXCoreCodeGen.dir/XCoreSelectionDAGInfo.cpp.o -MF lib/Target/XCore/CMakeFiles/LLVMXCoreCodeGen.dir/XCoreSelectionDAGInfo.cpp.o.d -o lib/Target/XCore/CMakeFiles/LLVMXCoreCodeGen.dir/XCoreSelectionDAGInfo.cpp.o -c /Users/buildslave/jenkins/workspace/lldb-cmake/llvm-project/llvm/lib/Target/XCore/XCoreSelectionDAGInfo.cpp [85/2754] /Users/buildslave/jenkins/workspace/lldb-cmake/host-compiler/bin/clang++ -DGTEST_HAS_RTTI=0 -D_DEBUG -D__STDC_CONSTANT_MACROS -D__STDC_FORMAT_MACROS -D__STDC_LIMIT_MACROS -Ilib/Target/XCore/Disassembler -I/Users/buildslave/jenkins/workspace/lldb-cmake/llvm-project/llvm/lib/Target/XCore/Disassembler -I/Users/buildslave/jenkins/workspace/lldb-cmake/llvm-project/llvm/lib/Target/XCore -Ilib/Target/XCore -Iinclude -I/Users/buildslave/jenkins/workspace/lldb-cmake/llvm-project/llvm/include -Wdocumentation -fPIC -fvisibility-inlines-hidden -Werror=date-time -Werror=unguarded-availability-new -fmodules -fmodules-cache-path=/Users/buildslave/jenkins/workspace/lldb-cmake/lldb-build/module.cache -fcxx-modules -Xclang -fmodules-local-submodule-visibility -Wall -Wextra -Wno-unused-parameter -Wwrite-strings -Wcast-qual -Wmissing-field-initializers -pedantic -Wno-long-long -Wimplicit-fallthrough -Wcovered-switch-default -Wno-noexcept-type -Wnon-virtual-dtor -Wdelete-non-virtual-dtor -Wsuggest-override -Wstring-conversion -fdiagnostics-color -O3 -isysroot /Applications/Xcode.app/Contents/Developer/Platforms/MacOSX.platform/Developer/SDKs/MacOSX10.15.sdk -fno-exceptions -fno-rtti -UNDEBUG -std=c++14 -MD -MT lib/Target/XCore/Disassembler/CMakeFiles/LLVMXCoreDisassembler.dir/XCoreDisassembler.cpp.o -MF lib/Target/XCore/Disassembler/CMakeFiles/LLVMXCoreDisassembler.dir/XCoreDisassembler.cpp.o.d -o lib/Target/XCore/Disassembler/CMakeFiles/LLVMXCoreDisassembler.dir/XCoreDisassembler.cpp.o -c /Users/buildslave/jenkins/workspace/lldb-cmake/llvm-project/llvm/lib/Target/XCore/Disassembler/XCoreDisassembler.cpp [86/2754] /Users/buildslave/jenkins/workspace/lldb-cmake/host-compiler/bin/clang++ -DGTEST_HAS_RTTI=0 -D_DEBUG -D__STDC_CONSTANT_MACROS -D__STDC_FORMAT_MACROS -D__STDC_LIMIT_MACROS -Ilib/Target/XCore -I/Users/buildslave/jenkins/workspace/lldb-cmake/llvm-project/llvm/lib/Target/XCore -Iinclude -I/Users/buildslave/jenkins/workspace/lldb-cmake/llvm-project/llvm/include -Wdocumentation -fPIC -fvisibility-inlines-hidden -Werror=date-time -Werror=unguarded-availability-new -fmodules -fmodules-cache-path=/Users/buildslave/jenkins/workspace/lldb-cmake/lldb-build/module.cache -fcxx-modules -Xclang -fmodules-local-submodule-visibility -Wall -Wextra -Wno-unused-parameter -Wwrite-strings -Wcast-qual -Wmissing-field-initializers -pedantic -Wno-long-long -Wimplicit-fallthrough -Wcovered-switch-default -Wno-noexcept-type -Wnon-virtual-dtor -Wdelete-non-virtual-dtor -Wsuggest-override -Wstring-conversion -fdiagnostics-color -O3 -isysroot /Applications/Xcode.app/Contents/Developer/Platforms/MacOSX.platform/Developer/SDKs/MacOSX10.15.sdk -fno-exceptions -fno-rtti -UNDEBUG -std=c++14 -MD -MT lib/Target/XCore/CMakeFiles/LLVMXCoreCodeGen.dir/XCoreISelLowering.cpp.o -MF lib/Target/XCore/CMakeFiles/LLVMXCoreCodeGen.dir/XCoreISelLowering.cpp.o.d -o lib/Target/XCore/CMakeFiles/LLVMXCoreCodeGen.dir/XCoreISelLowering.cpp.o -c /Users/buildslave/jenkins/workspace/lldb-cmake/llvm-project/llvm/lib/Target/XCore/XCoreISelLowering.cpp [87/2754] /Users/buildslave/jenkins/workspace/lldb-cmake/host-compiler/bin/clang++ -DHAVE_RPC_XDR_H=0 -D_DEBUG -D__STDC_CONSTANT_MACROS -D__STDC_FORMAT_MACROS -D__STDC_LIMIT_MACROS -Iprojects/compiler-rt/lib/sanitizer_common -I/Users/buildslave/jenkins/workspace/lldb-cmake/llvm-project/compiler-rt/lib/sanitizer_common -Iinclude -I/Users/buildslave/jenkins/workspace/lldb-cmake/llvm-project/llvm/include -I/Users/buildslave/jenkins/workspace/lldb-cmake/llvm-project/compiler-rt/lib/sanitizer_common/.. -Wdocumentation -fPIC -fvisibility-inlines-hidden -Werror=date-time -Werror=unguarded-availability-new -fmodules -fmodules-cache-path=/Users/buildslave/jenkins/workspace/lldb-cmake/lldb-build/module.cache -fcxx-modules -Xclang -fmodules-local-submodule-visibility -Wall -Wextra -Wno-unused-parameter -Wwrite-strings -Wcast-qual -Wmissing-field-initializers -pedantic -Wno-long-long -Wimplicit-fallthrough -Wcovered-switch-default -Wno-noexcept-type -Wnon-virtual-dtor -Wdelete-non-virtual-dtor -Wsuggest-override -Wstring-conversion -fdiagnostics-color -Wall -std=c++14 -Wno-unused-parameter -O3 -arch armv7 -arch armv7s -arch arm64 -arch armv7k -isysroot /Applications/Xcode.app/Contents/Developer/Platforms/MacOSX.platform/Developer/SDKs/MacOSX10.15.sdk -stdlib=libc++ -miphoneos-version-min=9.0 -isysroot /Applications/Xcode.app/Contents/Developer/Platforms/iPhoneOS.platform/Developer/SDKs/iPhoneOS13.5.sdk -fPIC -fno-builtin -fno-exceptions -funwind-tables -fno-stack-protector -fno-sanitize=safe-stack -fvisibility=hidden -fno-lto -O3 -gline-tables-only -fno-modules -Wno-gnu -Wno-variadic-macros -Wno-c99-extensions -Wno-non-virtual-dtor -fno-rtti -Wframe-larger-than=570 -Wglobal-constructors -DSANITIZER_SUPPORTS_WEAK_HOOKS=0 -UNDEBUG -std=c++14 -MD -MT projects/compiler-rt/lib/sanitizer_common/CMakeFiles/RTSanitizerCommonSymbolizerNoHooks.ios.dir/sanitizer_symbolizer_mac.cpp.o -MF projects/compiler-rt/lib/sanitizer_common/CMakeFiles/RTSanitizerCommonSymbolizerNoHooks.ios.dir/sanitizer_symbolizer_mac.cpp.o.d -o projects/compiler-rt/lib/sanitizer_common/CMakeFiles/RTSanitizerCommonSymbolizerNoHooks.ios.dir/sanitizer_symbolizer_mac.cpp.o -c /Users/buildslave/jenkins/workspace/lldb-cmake/llvm-project/compiler-rt/lib/sanitizer_common/sanitizer_symbolizer_mac.cpp clang-12: warning: argument unused during compilation: '-fmodules-cache-path=/Users/buildslave/jenkins/workspace/lldb-cmake/lldb-build/module.cache' [-Wunused-command-line-argument] clang-12: warning: argument unused during compilation: '-fcxx-modules' [-Wunused-command-line-argument] [88/2754] /Users/buildslave/jenkins/workspace/lldb-cmake/host-compiler/bin/clang++ -DHAVE_RPC_XDR_H=0 -D_DEBUG -D__STDC_CONSTANT_MACROS -D__STDC_FORMAT_MACROS -D__STDC_LIMIT_MACROS -Iprojects/compiler-rt/lib/sanitizer_common -I/Users/buildslave/jenkins/workspace/lldb-cmake/llvm-project/compiler-rt/lib/sanitizer_common -Iinclude -I/Users/buildslave/jenkins/workspace/lldb-cmake/llvm-project/llvm/include -I/Users/buildslave/jenkins/workspace/lldb-cmake/llvm-project/compiler-rt/lib/sanitizer_common/.. -Wdocumentation -fPIC -fvisibility-inlines-hidden -Werror=date-time -Werror=unguarded-availability-new -fmodules -fmodules-cache-path=/Users/buildslave/jenkins/workspace/lldb-cmake/lldb-build/module.cache -fcxx-modules -Xclang -fmodules-local-submodule-visibility -Wall -Wextra -Wno-unused-parameter -Wwrite-strings -Wcast-qual -Wmissing-field-initializers -pedantic -Wno-long-long -Wimplicit-fallthrough -Wcovered-switch-default -Wno-noexcept-type -Wnon-virtual-dtor -Wdelete-non-virtual-dtor -Wsuggest-override -Wstring-conversion -fdiagnostics-color -Wall -std=c++14 -Wno-unused-parameter -O3 -arch armv7 -arch armv7s -arch arm64 -arch armv7k -isysroot /Applications/Xcode.app/Contents/Developer/Platforms/MacOSX.platform/Developer/SDKs/MacOSX10.15.sdk -stdlib=libc++ -miphoneos-version-min=9.0 -isysroot /Applications/Xcode.app/Contents/Developer/Platforms/iPhoneOS.platform/Developer/SDKs/iPhoneOS13.5.sdk -fPIC -fno-builtin -fno-exceptions -funwind-tables -fno-stack-protector -fno-sanitize=safe-stack -fvisibility=hidden -fno-lto -O3 -gline-tables-only -fno-modules -Wno-gnu -Wno-variadic-macros -Wno-c99-extensions -Wno-non-virtual-dtor -fno-rtti -Wframe-larger-than=570 -Wglobal-constructors -DSANITIZER_SUPPORTS_WEAK_HOOKS=0 -UNDEBUG -std=c++14 -MD -MT projects/compiler-rt/lib/sanitizer_common/CMakeFiles/RTSanitizerCommonSymbolizerNoHooks.ios.dir/sanitizer_symbolizer_posix_libcdep.cpp.o -MF projects/compiler-rt/lib/sanitizer_common/CMakeFiles/RTSanitizerCommonSymbolizerNoHooks.ios.dir/sanitizer_symbolizer_posix_libcdep.cpp.o.d -o projects/compiler-rt/lib/sanitizer_common/CMakeFiles/RTSanitizerCommonSymbolizerNoHooks.ios.dir/sanitizer_symbolizer_posix_libcdep.cpp.o -c /Users/buildslave/jenkins/workspace/lldb-cmake/llvm-project/compiler-rt/lib/sanitizer_common/sanitizer_symbolizer_posix_libcdep.cpp clang-12: warning: argument unused during compilation: '-fmodules-cache-path=/Users/buildslave/jenkins/workspace/lldb-cmake/lldb-build/module.cache' [-Wunused-command-line-argument] clang-12: warning: argument unused during compilation: '-fcxx-modules' [-Wunused-command-line-argument] [89/2754] /Users/buildslave/jenkins/workspace/lldb-cmake/host-compiler/bin/clang++ -DGTEST_HAS_RTTI=0 -D_DEBUG -D__STDC_CONSTANT_MACROS -D__STDC_FORMAT_MACROS -D__STDC_LIMIT_MACROS -Ilib/Target/X86/AsmParser -I/Users/buildslave/jenkins/workspace/lldb-cmake/llvm-project/llvm/lib/Target/X86/AsmParser -I/Users/buildslave/jenkins/workspace/lldb-cmake/llvm-project/llvm/lib/Target/X86 -Ilib/Target/X86 -Iinclude -I/Users/buildslave/jenkins/workspace/lldb-cmake/llvm-project/llvm/include -Wdocumentation -fPIC -fvisibility-inlines-hidden -Werror=date-time -Werror=unguarded-availability-new -fmodules -fmodules-cache-path=/Users/buildslave/jenkins/workspace/lldb-cmake/lldb-build/module.cache -fcxx-modules -Xclang -fmodules-local-submodule-visibility -Wall -Wextra -Wno-unused-parameter -Wwrite-strings -Wcast-qual -Wmissing-field-initializers -pedantic -Wno-long-long -Wimplicit-fallthrough -Wcovered-switch-default -Wno-noexcept-type -Wnon-virtual-dtor -Wdelete-non-virtual-dtor -Wsuggest-override -Wstring-conversion -fdiagnostics-color -O3 -isysroot /Applications/Xcode.app/Contents/Developer/Platforms/MacOSX.platform/Developer/SDKs/MacOSX10.15.sdk -fno-exceptions -fno-rtti -UNDEBUG -std=c++14 -MD -MT lib/Target/X86/AsmParser/CMakeFiles/LLVMX86AsmParser.dir/X86AsmParser.cpp.o -MF lib/Target/X86/AsmParser/CMakeFiles/LLVMX86AsmParser.dir/X86AsmParser.cpp.o.d -o lib/Target/X86/AsmParser/CMakeFiles/LLVMX86AsmParser.dir/X86AsmParser.cpp.o -c /Users/buildslave/jenkins/workspace/lldb-cmake/llvm-project/llvm/lib/Target/X86/AsmParser/X86AsmParser.cpp [90/2754] /Users/buildslave/jenkins/workspace/lldb-cmake/host-compiler/bin/clang++ -DGTEST_HAS_RTTI=0 -D_DEBUG -D__STDC_CONSTANT_MACROS -D__STDC_FORMAT_MACROS -D__STDC_LIMIT_MACROS -Ilib/Target/XCore -I/Users/buildslave/jenkins/workspace/lldb-cmake/llvm-project/llvm/lib/Target/XCore -Iinclude -I/Users/buildslave/jenkins/workspace/lldb-cmake/llvm-project/llvm/include -Wdocumentation -fPIC -fvisibility-inlines-hidden -Werror=date-time -Werror=unguarded-availability-new -fmodules -fmodules-cache-path=/Users/buildslave/jenkins/workspace/lldb-cmake/lldb-build/module.cache -fcxx-modules -Xclang -fmodules-local-submodule-visibility -Wall -Wextra -Wno-unused-parameter -Wwrite-strings -Wcast-qual -Wmissing-field-initializers -pedantic -Wno-long-long -Wimplicit-fallthrough -Wcovered-switch-default -Wno-noexcept-type -Wnon-virtual-dtor -Wdelete-non-virtual-dtor -Wsuggest-override -Wstring-conversion -fdiagnostics-color -O3 -isysroot /Applications/Xcode.app/Contents/Developer/Platforms/MacOSX.platform/Developer/SDKs/MacOSX10.15.sdk -fno-exceptions -fno-rtti -UNDEBUG -std=c++14 -MD -MT lib/Target/XCore/CMakeFiles/LLVMXCoreCodeGen.dir/XCoreTargetMachine.cpp.o -MF lib/Target/XCore/CMakeFiles/LLVMXCoreCodeGen.dir/XCoreTargetMachine.cpp.o.d -o lib/Target/XCore/CMakeFiles/LLVMXCoreCodeGen.dir/XCoreTargetMachine.cpp.o -c /Users/buildslave/jenkins/workspace/lldb-cmake/llvm-project/llvm/lib/Target/XCore/XCoreTargetMachine.cpp [91/2754] /Users/buildslave/jenkins/workspace/lldb-cmake/host-compiler/bin/clang++ -DGTEST_HAS_RTTI=0 -D_DEBUG -D__STDC_CONSTANT_MACROS -D__STDC_FORMAT_MACROS -D__STDC_LIMIT_MACROS -Ilib/Target/X86/MCTargetDesc -I/Users/buildslave/jenkins/workspace/lldb-cmake/llvm-project/llvm/lib/Target/X86/MCTargetDesc -I/Users/buildslave/jenkins/workspace/lldb-cmake/llvm-project/llvm/lib/Target/X86 -Ilib/Target/X86 -Iinclude -I/Users/buildslave/jenkins/workspace/lldb-cmake/llvm-project/llvm/include -Wdocumentation -fPIC -fvisibility-inlines-hidden -Werror=date-time -Werror=unguarded-availability-new -fmodules -fmodules-cache-path=/Users/buildslave/jenkins/workspace/lldb-cmake/lldb-build/module.cache -fcxx-modules -Xclang -fmodules-local-submodule-visibility -Wall -Wextra -Wno-unused-parameter -Wwrite-strings -Wcast-qual -Wmissing-field-initializers -pedantic -Wno-long-long -Wimplicit-fallthrough -Wcovered-switch-default -Wno-noexcept-type -Wnon-virtual-dtor -Wdelete-non-virtual-dtor -Wsuggest-override -Wstring-conversion -fdiagnostics-color -O3 -isysroot /Applications/Xcode.app/Contents/Developer/Platforms/MacOSX.platform/Developer/SDKs/MacOSX10.15.sdk -fno-exceptions -fno-rtti -UNDEBUG -std=c++14 -MD -MT lib/Target/X86/MCTargetDesc/CMakeFiles/LLVMX86Desc.dir/X86MCTargetDesc.cpp.o -MF lib/Target/X86/MCTargetDesc/CMakeFiles/LLVMX86Desc.dir/X86MCTargetDesc.cpp.o.d -o lib/Target/X86/MCTargetDesc/CMakeFiles/LLVMX86Desc.dir/X86MCTargetDesc.cpp.o -c /Users/buildslave/jenkins/workspace/lldb-cmake/llvm-project/llvm/lib/Target/X86/MCTargetDesc/X86MCTargetDesc.cpp [92/2754] /Users/buildslave/jenkins/workspace/lldb-cmake/host-compiler/bin/clang++ -DGTEST_HAS_RTTI=0 -D_DEBUG -D__STDC_CONSTANT_MACROS -D__STDC_FORMAT_MACROS -D__STDC_LIMIT_MACROS -Ilib/Target/X86 -I/Users/buildslave/jenkins/workspace/lldb-cmake/llvm-project/llvm/lib/Target/X86 -Iinclude -I/Users/buildslave/jenkins/workspace/lldb-cmake/llvm-project/llvm/include -Wdocumentation -fPIC -fvisibility-inlines-hidden -Werror=date-time -Werror=unguarded-availability-new -fmodules -fmodules-cache-path=/Users/buildslave/jenkins/workspace/lldb-cmake/lldb-build/module.cache -fcxx-modules -Xclang -fmodules-local-submodule-visibility -Wall -Wextra -Wno-unused-parameter -Wwrite-strings -Wcast-qual -Wmissing-field-initializers -pedantic -Wno-long-long -Wimplicit-fallthrough -Wcovered-switch-default -Wno-noexcept-type -Wnon-virtual-dtor -Wdelete-non-virtual-dtor -Wsuggest-override -Wstring-conversion -fdiagnostics-color -O3 -isysroot /Applications/Xcode.app/Contents/Developer/Platforms/MacOSX.platform/Developer/SDKs/MacOSX10.15.sdk -fno-exceptions -fno-rtti -UNDEBUG -std=c++14 -MD -MT lib/Target/X86/CMakeFiles/LLVMX86CodeGen.dir/X86ISelLowering.cpp.o -MF lib/Target/X86/CMakeFiles/LLVMX86CodeGen.dir/X86ISelLowering.cpp.o.d -o lib/Target/X86/CMakeFiles/LLVMX86CodeGen.dir/X86ISelLowering.cpp.o -c /Users/buildslave/jenkins/workspace/lldb-cmake/llvm-project/llvm/lib/Target/X86/X86ISelLowering.cpp ninja: build stopped: subcommand failed. Command failed: Command '['/usr/local/bin/ninja', '-v']' returned non-zero exit status 1 Command: ['/usr/local/bin/ninja', '-v'] [Pipeline] } [Pipeline] // timeout [Pipeline] } [Pipeline] // stage [Pipeline] stage [Pipeline] { (Test) Stage "Test" skipped due to earlier failure(s) [Pipeline] } [Pipeline] // stage [Pipeline] stage [Pipeline] { (Declarative: Post Actions) [Pipeline] scanForIssues [Clang (LLVM based)] Sleeping for 5 seconds due to JENKINS-32191... [Clang (LLVM based)] Parsing console log (workspace: '/Users/buildslave/jenkins/workspace/lldb-cmake') [Clang (LLVM based)] Successfully parsed console log [Clang (LLVM based)] -> found 1 issue (skipped 1 duplicate) [Clang (LLVM based)] Post processing issues on 'green-dragon-10' with source code encoding 'UTF-8' [Clang (LLVM based)] Creating SCM blamer to obtain author and commit information for affected files [Clang (LLVM based)] Creating SCM miner to obtain statistics for affected repository files [Clang (LLVM based)] Resolving file names for all issues in source directory '/Users/buildslave/jenkins/workspace/lldb-cmake' [Clang (LLVM based)] -> resolved paths in source directory (1 found, 0 not found) [Clang (LLVM based)] Resolving module names from module definitions (build.xml, pom.xml, or Manifest.mf files) [Clang (LLVM based)] -> resolved module names for 1 issues [Clang (LLVM based)] Resolving package names (or namespaces) by parsing the affected files [Clang (LLVM based)] -> resolved package names of 1 affected files [Clang (LLVM based)] No filter has been set, publishing all 1 issues [Clang (LLVM based)] Creating fingerprints for all affected code blocks to track issues over different builds [Clang (LLVM based)] -> created fingerprints for 1 issues (skipped 0 issues) [Clang (LLVM based)] Copying affected files to Jenkins' build folder '/Users/Shared/Jenkins/Home/jobs/lldb-cmake/builds/24036/files-with-issues' [Clang (LLVM based)] -> 1 copied, 0 not in workspace, 0 not-found, 0 with I/O error [Pipeline] junit Recording test results Test reports were found but none of them are new. Did leafNodes run? For example, /Users/buildslave/jenkins/workspace/lldb-cmake/test/results.xml is 1 hr 35 min old

Hide Details

Error when executing always post condition: Also: hudson.remoting.Channel$CallSiteStackTrace: Remote call to green-dragon-10 at hudson.remoting.Channel.attachCallSiteStackTrace(Channel.java:1788) at hudson.remoting.UserRequest$ExceptionResponse.retrieve(UserRequest.java:356) at hudson.remoting.Channel.call(Channel.java:998) at hudson.FilePath.act(FilePath.java:1069) at hudson.FilePath.act(FilePath.java:1058) at hudson.tasks.junit.JUnitParser.parseResult(JUnitParser.java:114) at hudson.tasks.junit.JUnitResultArchiver.parse(JUnitResultArchiver.java:137) at hudson.tasks.junit.JUnitResultArchiver.parseAndAttach(JUnitResultArchiver.java:167) at hudson.tasks.junit.pipeline.JUnitResultsStepExecution.run(JUnitResultsStepExecution.java:52) at hudson.tasks.junit.pipeline.JUnitResultsStepExecution.run(JUnitResultsStepExecution.java:25) at org.jenkinsci.plugins.workflow.steps.SynchronousNonBlockingStepExecution.lambda$start$0(SynchronousNonBlockingStepExecution.java:47) at java.util.concurrent.Executors$RunnableAdapter.call(Executors.java:511) at java.util.concurrent.FutureTask.run(FutureTask.java:266) at java.util.concurrent.ThreadPoolExecutor.runWorker(ThreadPoolExecutor.java:1149) at java.util.concurrent.ThreadPoolExecutor$Worker.run(ThreadPoolExecutor.java:624) at java.lang.Thread.run(Thread.java:748) hudson.AbortException: Test reports were found but none of them are new. Did leafNodes run? For example, /Users/buildslave/jenkins/workspace/lldb-cmake/test/results.xml is 1 hr 35 min old

Hide Details

at hudson.tasks.junit.TestResult.parse(TestResult.java:222) at hudson.tasks.junit.TestResult.parse(TestResult.java:178) at hudson.tasks.junit.TestResult.<init>(TestResult.java:143) at hudson.tasks.junit.JUnitParser$ParseResultCallable.invoke(JUnitParser.java:146) at hudson.tasks.junit.JUnitParser$ParseResultCallable.invoke(JUnitParser.java:118) at hudson.FilePath$FileCallableWrapper.call(FilePath.java:3073) at hudson.remoting.UserRequest.perform(UserRequest.java:211) at hudson.remoting.UserRequest.perform(UserRequest.java:54) at hudson.remoting.Request$2.run(Request.java:369) at hudson.remoting.InterceptingExecutorService$1.call(InterceptingExecutorService.java:72) at java.util.concurrent.FutureTask.run(Unknown Source) at java.util.concurrent.ThreadPoolExecutor.runWorker(Unknown Source) at java.util.concurrent.ThreadPoolExecutor$Worker.run(Unknown Source) at java.lang.Thread.run(Unknown Source)

Hide Details

[Pipeline] } [Pipeline] // stage [Pipeline] } [Pipeline] // withEnv [Pipeline] } [Pipeline] // node [Pipeline] End of Pipeline ERROR: script returned exit code 1 Finished: FAILURE