FailedConsole Output

Skipping 1,777 KB.. Full Log
ude -I/Users/buildslave/jenkins/workspace/lldb-cmake/llvm-project/llvm/include -Wdocumentation -fPIC -fvisibility-inlines-hidden -Werror=date-time -Werror=unguarded-availability-new -fmodules -fmodules-cache-path=/Users/buildslave/jenkins/workspace/lldb-cmake/lldb-build/module.cache -fcxx-modules -Xclang -fmodules-local-submodule-visibility -Wall -Wextra -Wno-unused-parameter -Wwrite-strings -Wcast-qual -Wmissing-field-initializers -pedantic -Wno-long-long -Wimplicit-fallthrough -Wcovered-switch-default -Wno-noexcept-type -Wnon-virtual-dtor -Wdelete-non-virtual-dtor -Wsuggest-override -Wstring-conversion -fdiagnostics-color -O3  -isysroot /Applications/Xcode.app/Contents/Developer/Platforms/MacOSX.platform/Developer/SDKs/MacOSX10.15.sdk    -fno-exceptions -fno-rtti -UNDEBUG -std=c++14 -MD -MT lib/Target/Mips/MCTargetDesc/CMakeFiles/LLVMMipsDesc.dir/MipsELFStreamer.cpp.o -MF lib/Target/Mips/MCTargetDesc/CMakeFiles/LLVMMipsDesc.dir/MipsELFStreamer.cpp.o.d -o lib/Target/Mips/MCTargetDesc/CMakeFiles/LLVMMipsDesc.dir/MipsELFStreamer.cpp.o -c /Users/buildslave/jenkins/workspace/lldb-cmake/llvm-project/llvm/lib/Target/Mips/MCTargetDesc/MipsELFStreamer.cpp
[396/3513] : && "/Applications/Xcode.app/Contents/Developer/Toolchains/XcodeDefault.xctoolchain/usr/bin/libtool" -static -no_warning_for_no_symbols -o lib/libLLVMARMDesc.a  lib/Target/ARM/MCTargetDesc/CMakeFiles/LLVMARMDesc.dir/ARMAsmBackend.cpp.o lib/Target/ARM/MCTargetDesc/CMakeFiles/LLVMARMDesc.dir/ARMELFObjectWriter.cpp.o lib/Target/ARM/MCTargetDesc/CMakeFiles/LLVMARMDesc.dir/ARMELFStreamer.cpp.o lib/Target/ARM/MCTargetDesc/CMakeFiles/LLVMARMDesc.dir/ARMInstPrinter.cpp.o lib/Target/ARM/MCTargetDesc/CMakeFiles/LLVMARMDesc.dir/ARMMachObjectWriter.cpp.o lib/Target/ARM/MCTargetDesc/CMakeFiles/LLVMARMDesc.dir/ARMMachORelocationInfo.cpp.o lib/Target/ARM/MCTargetDesc/CMakeFiles/LLVMARMDesc.dir/ARMMCAsmInfo.cpp.o lib/Target/ARM/MCTargetDesc/CMakeFiles/LLVMARMDesc.dir/ARMMCCodeEmitter.cpp.o lib/Target/ARM/MCTargetDesc/CMakeFiles/LLVMARMDesc.dir/ARMMCExpr.cpp.o lib/Target/ARM/MCTargetDesc/CMakeFiles/LLVMARMDesc.dir/ARMMCTargetDesc.cpp.o lib/Target/ARM/MCTargetDesc/CMakeFiles/LLVMARMDesc.dir/ARMTargetStreamer.cpp.o lib/Target/ARM/MCTargetDesc/CMakeFiles/LLVMARMDesc.dir/ARMUnwindOpAsm.cpp.o lib/Target/ARM/MCTargetDesc/CMakeFiles/LLVMARMDesc.dir/ARMWinCOFFObjectWriter.cpp.o lib/Target/ARM/MCTargetDesc/CMakeFiles/LLVMARMDesc.dir/ARMWinCOFFStreamer.cpp.o && :
[397/3513] : && "/Applications/Xcode.app/Contents/Developer/Toolchains/XcodeDefault.xctoolchain/usr/bin/libtool" -static -no_warning_for_no_symbols -o lib/libLLVMMSP430Desc.a  lib/Target/MSP430/MCTargetDesc/CMakeFiles/LLVMMSP430Desc.dir/MSP430AsmBackend.cpp.o lib/Target/MSP430/MCTargetDesc/CMakeFiles/LLVMMSP430Desc.dir/MSP430ELFObjectWriter.cpp.o lib/Target/MSP430/MCTargetDesc/CMakeFiles/LLVMMSP430Desc.dir/MSP430ELFStreamer.cpp.o lib/Target/MSP430/MCTargetDesc/CMakeFiles/LLVMMSP430Desc.dir/MSP430InstPrinter.cpp.o lib/Target/MSP430/MCTargetDesc/CMakeFiles/LLVMMSP430Desc.dir/MSP430MCAsmInfo.cpp.o lib/Target/MSP430/MCTargetDesc/CMakeFiles/LLVMMSP430Desc.dir/MSP430MCCodeEmitter.cpp.o lib/Target/MSP430/MCTargetDesc/CMakeFiles/LLVMMSP430Desc.dir/MSP430MCTargetDesc.cpp.o && :
[398/3513] /Users/buildslave/jenkins/workspace/lldb-cmake/host-compiler/bin/clang++  -DGTEST_HAS_RTTI=0 -D_DEBUG -D__STDC_CONSTANT_MACROS -D__STDC_FORMAT_MACROS -D__STDC_LIMIT_MACROS -Ilib/Target/Mips/MCTargetDesc -I/Users/buildslave/jenkins/workspace/lldb-cmake/llvm-project/llvm/lib/Target/Mips/MCTargetDesc -I/Users/buildslave/jenkins/workspace/lldb-cmake/llvm-project/llvm/lib/Target/Mips -Ilib/Target/Mips -Iinclude -I/Users/buildslave/jenkins/workspace/lldb-cmake/llvm-project/llvm/include -Wdocumentation -fPIC -fvisibility-inlines-hidden -Werror=date-time -Werror=unguarded-availability-new -fmodules -fmodules-cache-path=/Users/buildslave/jenkins/workspace/lldb-cmake/lldb-build/module.cache -fcxx-modules -Xclang -fmodules-local-submodule-visibility -Wall -Wextra -Wno-unused-parameter -Wwrite-strings -Wcast-qual -Wmissing-field-initializers -pedantic -Wno-long-long -Wimplicit-fallthrough -Wcovered-switch-default -Wno-noexcept-type -Wnon-virtual-dtor -Wdelete-non-virtual-dtor -Wsuggest-override -Wstring-conversion -fdiagnostics-color -O3  -isysroot /Applications/Xcode.app/Contents/Developer/Platforms/MacOSX.platform/Developer/SDKs/MacOSX10.15.sdk    -fno-exceptions -fno-rtti -UNDEBUG -std=c++14 -MD -MT lib/Target/Mips/MCTargetDesc/CMakeFiles/LLVMMipsDesc.dir/MipsNaClELFStreamer.cpp.o -MF lib/Target/Mips/MCTargetDesc/CMakeFiles/LLVMMipsDesc.dir/MipsNaClELFStreamer.cpp.o.d -o lib/Target/Mips/MCTargetDesc/CMakeFiles/LLVMMipsDesc.dir/MipsNaClELFStreamer.cpp.o -c /Users/buildslave/jenkins/workspace/lldb-cmake/llvm-project/llvm/lib/Target/Mips/MCTargetDesc/MipsNaClELFStreamer.cpp
[399/3513] /Users/buildslave/jenkins/workspace/lldb-cmake/host-compiler/bin/clang++  -DGTEST_HAS_RTTI=0 -D_DEBUG -D__STDC_CONSTANT_MACROS -D__STDC_FORMAT_MACROS -D__STDC_LIMIT_MACROS -Ilib/Target/Mips/MCTargetDesc -I/Users/buildslave/jenkins/workspace/lldb-cmake/llvm-project/llvm/lib/Target/Mips/MCTargetDesc -I/Users/buildslave/jenkins/workspace/lldb-cmake/llvm-project/llvm/lib/Target/Mips -Ilib/Target/Mips -Iinclude -I/Users/buildslave/jenkins/workspace/lldb-cmake/llvm-project/llvm/include -Wdocumentation -fPIC -fvisibility-inlines-hidden -Werror=date-time -Werror=unguarded-availability-new -fmodules -fmodules-cache-path=/Users/buildslave/jenkins/workspace/lldb-cmake/lldb-build/module.cache -fcxx-modules -Xclang -fmodules-local-submodule-visibility -Wall -Wextra -Wno-unused-parameter -Wwrite-strings -Wcast-qual -Wmissing-field-initializers -pedantic -Wno-long-long -Wimplicit-fallthrough -Wcovered-switch-default -Wno-noexcept-type -Wnon-virtual-dtor -Wdelete-non-virtual-dtor -Wsuggest-override -Wstring-conversion -fdiagnostics-color -O3  -isysroot /Applications/Xcode.app/Contents/Developer/Platforms/MacOSX.platform/Developer/SDKs/MacOSX10.15.sdk    -fno-exceptions -fno-rtti -UNDEBUG -std=c++14 -MD -MT lib/Target/Mips/MCTargetDesc/CMakeFiles/LLVMMipsDesc.dir/MipsOptionRecord.cpp.o -MF lib/Target/Mips/MCTargetDesc/CMakeFiles/LLVMMipsDesc.dir/MipsOptionRecord.cpp.o.d -o lib/Target/Mips/MCTargetDesc/CMakeFiles/LLVMMipsDesc.dir/MipsOptionRecord.cpp.o -c /Users/buildslave/jenkins/workspace/lldb-cmake/llvm-project/llvm/lib/Target/Mips/MCTargetDesc/MipsOptionRecord.cpp
[400/3513] /Users/buildslave/jenkins/workspace/lldb-cmake/host-compiler/bin/clang++  -DGTEST_HAS_RTTI=0 -D_DEBUG -D__STDC_CONSTANT_MACROS -D__STDC_FORMAT_MACROS -D__STDC_LIMIT_MACROS -Ilib/Target/ARM -I/Users/buildslave/jenkins/workspace/lldb-cmake/llvm-project/llvm/lib/Target/ARM -Iinclude -I/Users/buildslave/jenkins/workspace/lldb-cmake/llvm-project/llvm/include -Wdocumentation -fPIC -fvisibility-inlines-hidden -Werror=date-time -Werror=unguarded-availability-new -fmodules -fmodules-cache-path=/Users/buildslave/jenkins/workspace/lldb-cmake/lldb-build/module.cache -fcxx-modules -Xclang -fmodules-local-submodule-visibility -Wall -Wextra -Wno-unused-parameter -Wwrite-strings -Wcast-qual -Wmissing-field-initializers -pedantic -Wno-long-long -Wimplicit-fallthrough -Wcovered-switch-default -Wno-noexcept-type -Wnon-virtual-dtor -Wdelete-non-virtual-dtor -Wsuggest-override -Wstring-conversion -fdiagnostics-color -O3  -isysroot /Applications/Xcode.app/Contents/Developer/Platforms/MacOSX.platform/Developer/SDKs/MacOSX10.15.sdk    -fno-exceptions -fno-rtti -UNDEBUG -std=c++14 -MD -MT lib/Target/ARM/CMakeFiles/LLVMARMCodeGen.dir/ARMISelLowering.cpp.o -MF lib/Target/ARM/CMakeFiles/LLVMARMCodeGen.dir/ARMISelLowering.cpp.o.d -o lib/Target/ARM/CMakeFiles/LLVMARMCodeGen.dir/ARMISelLowering.cpp.o -c /Users/buildslave/jenkins/workspace/lldb-cmake/llvm-project/llvm/lib/Target/ARM/ARMISelLowering.cpp
[401/3513] /Users/buildslave/jenkins/workspace/lldb-cmake/host-compiler/bin/clang++  -DGTEST_HAS_RTTI=0 -D_DEBUG -D__STDC_CONSTANT_MACROS -D__STDC_FORMAT_MACROS -D__STDC_LIMIT_MACROS -Ilib/Target/MSP430/Disassembler -I/Users/buildslave/jenkins/workspace/lldb-cmake/llvm-project/llvm/lib/Target/MSP430/Disassembler -I/Users/buildslave/jenkins/workspace/lldb-cmake/llvm-project/llvm/lib/Target/MSP430 -Ilib/Target/MSP430 -Iinclude -I/Users/buildslave/jenkins/workspace/lldb-cmake/llvm-project/llvm/include -Wdocumentation -fPIC -fvisibility-inlines-hidden -Werror=date-time -Werror=unguarded-availability-new -fmodules -fmodules-cache-path=/Users/buildslave/jenkins/workspace/lldb-cmake/lldb-build/module.cache -fcxx-modules -Xclang -fmodules-local-submodule-visibility -Wall -Wextra -Wno-unused-parameter -Wwrite-strings -Wcast-qual -Wmissing-field-initializers -pedantic -Wno-long-long -Wimplicit-fallthrough -Wcovered-switch-default -Wno-noexcept-type -Wnon-virtual-dtor -Wdelete-non-virtual-dtor -Wsuggest-override -Wstring-conversion -fdiagnostics-color -O3  -isysroot /Applications/Xcode.app/Contents/Developer/Platforms/MacOSX.platform/Developer/SDKs/MacOSX10.15.sdk    -fno-exceptions -fno-rtti -UNDEBUG -std=c++14 -MD -MT lib/Target/MSP430/Disassembler/CMakeFiles/LLVMMSP430Disassembler.dir/MSP430Disassembler.cpp.o -MF lib/Target/MSP430/Disassembler/CMakeFiles/LLVMMSP430Disassembler.dir/MSP430Disassembler.cpp.o.d -o lib/Target/MSP430/Disassembler/CMakeFiles/LLVMMSP430Disassembler.dir/MSP430Disassembler.cpp.o -c /Users/buildslave/jenkins/workspace/lldb-cmake/llvm-project/llvm/lib/Target/MSP430/Disassembler/MSP430Disassembler.cpp
[402/3513] : && "/Applications/Xcode.app/Contents/Developer/Toolchains/XcodeDefault.xctoolchain/usr/bin/libtool" -static -no_warning_for_no_symbols -o lib/libLLVMMSP430Disassembler.a  lib/Target/MSP430/Disassembler/CMakeFiles/LLVMMSP430Disassembler.dir/MSP430Disassembler.cpp.o && :
[403/3513] cd /Users/buildslave/jenkins/workspace/lldb-cmake/lldb-build && /Users/buildslave/jenkins/workspace/lldb-cmake/lldb-build/bin/llvm-tblgen -gen-register-info -I /Users/buildslave/jenkins/workspace/lldb-cmake/llvm-project/llvm/lib/Target/NVPTX -I/Users/buildslave/jenkins/workspace/lldb-cmake/lldb-build/include -I/Users/buildslave/jenkins/workspace/lldb-cmake/llvm-project/llvm/include -I /Users/buildslave/jenkins/workspace/lldb-cmake/llvm-project/llvm/lib/Target /Users/buildslave/jenkins/workspace/lldb-cmake/llvm-project/llvm/lib/Target/NVPTX/NVPTX.td --write-if-changed -o lib/Target/NVPTX/NVPTXGenRegisterInfo.inc -d lib/Target/NVPTX/NVPTXGenRegisterInfo.inc.d
[404/3503] cd /Users/buildslave/jenkins/workspace/lldb-cmake/lldb-build && /Users/buildslave/jenkins/workspace/lldb-cmake/lldb-build/bin/llvm-tblgen -gen-asm-matcher -I /Users/buildslave/jenkins/workspace/lldb-cmake/llvm-project/llvm/lib/Target/PowerPC -I/Users/buildslave/jenkins/workspace/lldb-cmake/lldb-build/include -I/Users/buildslave/jenkins/workspace/lldb-cmake/llvm-project/llvm/include -I /Users/buildslave/jenkins/workspace/lldb-cmake/llvm-project/llvm/lib/Target /Users/buildslave/jenkins/workspace/lldb-cmake/llvm-project/llvm/lib/Target/PowerPC/PPC.td --write-if-changed -o lib/Target/PowerPC/PPCGenAsmMatcher.inc -d lib/Target/PowerPC/PPCGenAsmMatcher.inc.d
[405/3503] cd /Users/buildslave/jenkins/workspace/lldb-cmake/lldb-build && /Users/buildslave/jenkins/workspace/lldb-cmake/lldb-build/bin/llvm-tblgen -gen-asm-writer -I /Users/buildslave/jenkins/workspace/lldb-cmake/llvm-project/llvm/lib/Target/PowerPC -I/Users/buildslave/jenkins/workspace/lldb-cmake/lldb-build/include -I/Users/buildslave/jenkins/workspace/lldb-cmake/llvm-project/llvm/include -I /Users/buildslave/jenkins/workspace/lldb-cmake/llvm-project/llvm/lib/Target /Users/buildslave/jenkins/workspace/lldb-cmake/llvm-project/llvm/lib/Target/PowerPC/PPC.td --write-if-changed -o lib/Target/PowerPC/PPCGenAsmWriter.inc -d lib/Target/PowerPC/PPCGenAsmWriter.inc.d
[406/3503] cd /Users/buildslave/jenkins/workspace/lldb-cmake/lldb-build && /Users/buildslave/jenkins/workspace/lldb-cmake/lldb-build/bin/llvm-tblgen -gen-subtarget -I /Users/buildslave/jenkins/workspace/lldb-cmake/llvm-project/llvm/lib/Target/NVPTX -I/Users/buildslave/jenkins/workspace/lldb-cmake/lldb-build/include -I/Users/buildslave/jenkins/workspace/lldb-cmake/llvm-project/llvm/include -I /Users/buildslave/jenkins/workspace/lldb-cmake/llvm-project/llvm/lib/Target /Users/buildslave/jenkins/workspace/lldb-cmake/llvm-project/llvm/lib/Target/NVPTX/NVPTX.td --write-if-changed -o lib/Target/NVPTX/NVPTXGenSubtargetInfo.inc -d lib/Target/NVPTX/NVPTXGenSubtargetInfo.inc.d
[407/3492] cd /Users/buildslave/jenkins/workspace/lldb-cmake/lldb-build && /Users/buildslave/jenkins/workspace/lldb-cmake/lldb-build/bin/llvm-tblgen -gen-callingconv -I /Users/buildslave/jenkins/workspace/lldb-cmake/llvm-project/llvm/lib/Target/PowerPC -I/Users/buildslave/jenkins/workspace/lldb-cmake/lldb-build/include -I/Users/buildslave/jenkins/workspace/lldb-cmake/llvm-project/llvm/include -I /Users/buildslave/jenkins/workspace/lldb-cmake/llvm-project/llvm/lib/Target /Users/buildslave/jenkins/workspace/lldb-cmake/llvm-project/llvm/lib/Target/PowerPC/PPC.td --write-if-changed -o lib/Target/PowerPC/PPCGenCallingConv.inc -d lib/Target/PowerPC/PPCGenCallingConv.inc.d
[408/3492] cd /Users/buildslave/jenkins/workspace/lldb-cmake/lldb-build && /Users/buildslave/jenkins/workspace/lldb-cmake/lldb-build/bin/llvm-tblgen -gen-dag-isel -I /Users/buildslave/jenkins/workspace/lldb-cmake/llvm-project/llvm/lib/Target/NVPTX -I/Users/buildslave/jenkins/workspace/lldb-cmake/lldb-build/include -I/Users/buildslave/jenkins/workspace/lldb-cmake/llvm-project/llvm/include -I /Users/buildslave/jenkins/workspace/lldb-cmake/llvm-project/llvm/lib/Target -omit-comments /Users/buildslave/jenkins/workspace/lldb-cmake/llvm-project/llvm/lib/Target/NVPTX/NVPTX.td --write-if-changed -o lib/Target/NVPTX/NVPTXGenDAGISel.inc -d lib/Target/NVPTX/NVPTXGenDAGISel.inc.d
[409/3490] cd /Users/buildslave/jenkins/workspace/lldb-cmake/lldb-build && /Users/buildslave/jenkins/workspace/lldb-cmake/lldb-build/bin/llvm-tblgen -gen-disassembler -I /Users/buildslave/jenkins/workspace/lldb-cmake/llvm-project/llvm/lib/Target/PowerPC -I/Users/buildslave/jenkins/workspace/lldb-cmake/lldb-build/include -I/Users/buildslave/jenkins/workspace/lldb-cmake/llvm-project/llvm/include -I /Users/buildslave/jenkins/workspace/lldb-cmake/llvm-project/llvm/lib/Target /Users/buildslave/jenkins/workspace/lldb-cmake/llvm-project/llvm/lib/Target/PowerPC/PPC.td --write-if-changed -o lib/Target/PowerPC/PPCGenDisassemblerTables.inc -d lib/Target/PowerPC/PPCGenDisassemblerTables.inc.d
[410/3490] cd /Users/buildslave/jenkins/workspace/lldb-cmake/lldb-build && /Users/buildslave/jenkins/workspace/lldb-cmake/lldb-build/bin/llvm-tblgen -gen-emitter -I /Users/buildslave/jenkins/workspace/lldb-cmake/llvm-project/llvm/lib/Target/PowerPC -I/Users/buildslave/jenkins/workspace/lldb-cmake/lldb-build/include -I/Users/buildslave/jenkins/workspace/lldb-cmake/llvm-project/llvm/include -I /Users/buildslave/jenkins/workspace/lldb-cmake/llvm-project/llvm/lib/Target /Users/buildslave/jenkins/workspace/lldb-cmake/llvm-project/llvm/lib/Target/PowerPC/PPC.td --write-if-changed -o lib/Target/PowerPC/PPCGenMCCodeEmitter.inc -d lib/Target/PowerPC/PPCGenMCCodeEmitter.inc.d
[411/3490] /Users/buildslave/jenkins/workspace/lldb-cmake/host-compiler/bin/clang++  -DGTEST_HAS_RTTI=0 -D_DEBUG -D__STDC_CONSTANT_MACROS -D__STDC_FORMAT_MACROS -D__STDC_LIMIT_MACROS -Ilib/Target/Mips/MCTargetDesc -I/Users/buildslave/jenkins/workspace/lldb-cmake/llvm-project/llvm/lib/Target/Mips/MCTargetDesc -I/Users/buildslave/jenkins/workspace/lldb-cmake/llvm-project/llvm/lib/Target/Mips -Ilib/Target/Mips -Iinclude -I/Users/buildslave/jenkins/workspace/lldb-cmake/llvm-project/llvm/include -Wdocumentation -fPIC -fvisibility-inlines-hidden -Werror=date-time -Werror=unguarded-availability-new -fmodules -fmodules-cache-path=/Users/buildslave/jenkins/workspace/lldb-cmake/lldb-build/module.cache -fcxx-modules -Xclang -fmodules-local-submodule-visibility -Wall -Wextra -Wno-unused-parameter -Wwrite-strings -Wcast-qual -Wmissing-field-initializers -pedantic -Wno-long-long -Wimplicit-fallthrough -Wcovered-switch-default -Wno-noexcept-type -Wnon-virtual-dtor -Wdelete-non-virtual-dtor -Wsuggest-override -Wstring-conversion -fdiagnostics-color -O3  -isysroot /Applications/Xcode.app/Contents/Developer/Platforms/MacOSX.platform/Developer/SDKs/MacOSX10.15.sdk    -fno-exceptions -fno-rtti -UNDEBUG -std=c++14 -MD -MT lib/Target/Mips/MCTargetDesc/CMakeFiles/LLVMMipsDesc.dir/MipsMCTargetDesc.cpp.o -MF lib/Target/Mips/MCTargetDesc/CMakeFiles/LLVMMipsDesc.dir/MipsMCTargetDesc.cpp.o.d -o lib/Target/Mips/MCTargetDesc/CMakeFiles/LLVMMipsDesc.dir/MipsMCTargetDesc.cpp.o -c /Users/buildslave/jenkins/workspace/lldb-cmake/llvm-project/llvm/lib/Target/Mips/MCTargetDesc/MipsMCTargetDesc.cpp
[412/3490] : && "/Applications/Xcode.app/Contents/Developer/Toolchains/XcodeDefault.xctoolchain/usr/bin/libtool" -static -no_warning_for_no_symbols -o lib/libLLVMMipsDesc.a  lib/Target/Mips/MCTargetDesc/CMakeFiles/LLVMMipsDesc.dir/MipsABIInfo.cpp.o lib/Target/Mips/MCTargetDesc/CMakeFiles/LLVMMipsDesc.dir/MipsABIFlagsSection.cpp.o lib/Target/Mips/MCTargetDesc/CMakeFiles/LLVMMipsDesc.dir/MipsAsmBackend.cpp.o lib/Target/Mips/MCTargetDesc/CMakeFiles/LLVMMipsDesc.dir/MipsELFObjectWriter.cpp.o lib/Target/Mips/MCTargetDesc/CMakeFiles/LLVMMipsDesc.dir/MipsELFStreamer.cpp.o lib/Target/Mips/MCTargetDesc/CMakeFiles/LLVMMipsDesc.dir/MipsInstPrinter.cpp.o lib/Target/Mips/MCTargetDesc/CMakeFiles/LLVMMipsDesc.dir/MipsMCAsmInfo.cpp.o lib/Target/Mips/MCTargetDesc/CMakeFiles/LLVMMipsDesc.dir/MipsMCCodeEmitter.cpp.o lib/Target/Mips/MCTargetDesc/CMakeFiles/LLVMMipsDesc.dir/MipsMCExpr.cpp.o lib/Target/Mips/MCTargetDesc/CMakeFiles/LLVMMipsDesc.dir/MipsMCTargetDesc.cpp.o lib/Target/Mips/MCTargetDesc/CMakeFiles/LLVMMipsDesc.dir/MipsNaClELFStreamer.cpp.o lib/Target/Mips/MCTargetDesc/CMakeFiles/LLVMMipsDesc.dir/MipsOptionRecord.cpp.o lib/Target/Mips/MCTargetDesc/CMakeFiles/LLVMMipsDesc.dir/MipsTargetStreamer.cpp.o && :
[413/3490] cd /Users/buildslave/jenkins/workspace/lldb-cmake/lldb-build && /Users/buildslave/jenkins/workspace/lldb-cmake/lldb-build/bin/llvm-tblgen -gen-register-info -I /Users/buildslave/jenkins/workspace/lldb-cmake/llvm-project/llvm/lib/Target/PowerPC -I/Users/buildslave/jenkins/workspace/lldb-cmake/lldb-build/include -I/Users/buildslave/jenkins/workspace/lldb-cmake/llvm-project/llvm/include -I /Users/buildslave/jenkins/workspace/lldb-cmake/llvm-project/llvm/lib/Target /Users/buildslave/jenkins/workspace/lldb-cmake/llvm-project/llvm/lib/Target/PowerPC/PPC.td --write-if-changed -o lib/Target/PowerPC/PPCGenRegisterInfo.inc -d lib/Target/PowerPC/PPCGenRegisterInfo.inc.d
[414/3490] cd /Users/buildslave/jenkins/workspace/lldb-cmake/lldb-build && /Users/buildslave/jenkins/workspace/lldb-cmake/lldb-build/bin/llvm-tblgen -gen-fast-isel -I /Users/buildslave/jenkins/workspace/lldb-cmake/llvm-project/llvm/lib/Target/PowerPC -I/Users/buildslave/jenkins/workspace/lldb-cmake/lldb-build/include -I/Users/buildslave/jenkins/workspace/lldb-cmake/llvm-project/llvm/include -I /Users/buildslave/jenkins/workspace/lldb-cmake/llvm-project/llvm/lib/Target /Users/buildslave/jenkins/workspace/lldb-cmake/llvm-project/llvm/lib/Target/PowerPC/PPC.td --write-if-changed -o lib/Target/PowerPC/PPCGenFastISel.inc -d lib/Target/PowerPC/PPCGenFastISel.inc.d
[415/3490] cd /Users/buildslave/jenkins/workspace/lldb-cmake/lldb-build && /Users/buildslave/jenkins/workspace/lldb-cmake/lldb-build/bin/llvm-tblgen -gen-subtarget -I /Users/buildslave/jenkins/workspace/lldb-cmake/llvm-project/llvm/lib/Target/PowerPC -I/Users/buildslave/jenkins/workspace/lldb-cmake/lldb-build/include -I/Users/buildslave/jenkins/workspace/lldb-cmake/llvm-project/llvm/include -I /Users/buildslave/jenkins/workspace/lldb-cmake/llvm-project/llvm/lib/Target /Users/buildslave/jenkins/workspace/lldb-cmake/llvm-project/llvm/lib/Target/PowerPC/PPC.td --write-if-changed -o lib/Target/PowerPC/PPCGenSubtargetInfo.inc -d lib/Target/PowerPC/PPCGenSubtargetInfo.inc.d
[416/3490] cd /Users/buildslave/jenkins/workspace/lldb-cmake/lldb-build && /Users/buildslave/jenkins/workspace/lldb-cmake/lldb-build/bin/llvm-tblgen -gen-dag-isel -I /Users/buildslave/jenkins/workspace/lldb-cmake/llvm-project/llvm/lib/Target/PowerPC -I/Users/buildslave/jenkins/workspace/lldb-cmake/lldb-build/include -I/Users/buildslave/jenkins/workspace/lldb-cmake/llvm-project/llvm/include -I /Users/buildslave/jenkins/workspace/lldb-cmake/llvm-project/llvm/lib/Target -omit-comments /Users/buildslave/jenkins/workspace/lldb-cmake/llvm-project/llvm/lib/Target/PowerPC/PPC.td --write-if-changed -o lib/Target/PowerPC/PPCGenDAGISel.inc -d lib/Target/PowerPC/PPCGenDAGISel.inc.d
[417/3490] cd /Users/buildslave/jenkins/workspace/lldb-cmake/lldb-build && /Users/buildslave/jenkins/workspace/lldb-cmake/lldb-build/bin/llvm-tblgen -gen-exegesis -I /Users/buildslave/jenkins/workspace/lldb-cmake/llvm-project/llvm/lib/Target/PowerPC -I/Users/buildslave/jenkins/workspace/lldb-cmake/lldb-build/include -I/Users/buildslave/jenkins/workspace/lldb-cmake/llvm-project/llvm/include -I /Users/buildslave/jenkins/workspace/lldb-cmake/llvm-project/llvm/lib/Target /Users/buildslave/jenkins/workspace/lldb-cmake/llvm-project/llvm/lib/Target/PowerPC/PPC.td --write-if-changed -o lib/Target/PowerPC/PPCGenExegesis.inc -d lib/Target/PowerPC/PPCGenExegesis.inc.d
[418/3490] cd /Users/buildslave/jenkins/workspace/lldb-cmake/lldb-build && /Users/buildslave/jenkins/workspace/lldb-cmake/lldb-build/bin/llvm-tblgen -gen-register-bank -I /Users/buildslave/jenkins/workspace/lldb-cmake/llvm-project/llvm/lib/Target/PowerPC -I/Users/buildslave/jenkins/workspace/lldb-cmake/lldb-build/include -I/Users/buildslave/jenkins/workspace/lldb-cmake/llvm-project/llvm/include -I /Users/buildslave/jenkins/workspace/lldb-cmake/llvm-project/llvm/lib/Target /Users/buildslave/jenkins/workspace/lldb-cmake/llvm-project/llvm/lib/Target/PowerPC/PPC.td --write-if-changed -o lib/Target/PowerPC/PPCGenRegisterBank.inc -d lib/Target/PowerPC/PPCGenRegisterBank.inc.d
[419/3490] cd /Users/buildslave/jenkins/workspace/lldb-cmake/lldb-build && /Users/buildslave/jenkins/workspace/lldb-cmake/lldb-build/bin/llvm-tblgen -gen-asm-matcher -I /Users/buildslave/jenkins/workspace/lldb-cmake/llvm-project/llvm/lib/Target/RISCV -I/Users/buildslave/jenkins/workspace/lldb-cmake/lldb-build/include -I/Users/buildslave/jenkins/workspace/lldb-cmake/llvm-project/llvm/include -I /Users/buildslave/jenkins/workspace/lldb-cmake/llvm-project/llvm/lib/Target /Users/buildslave/jenkins/workspace/lldb-cmake/llvm-project/llvm/lib/Target/RISCV/RISCV.td --write-if-changed -o lib/Target/RISCV/RISCVGenAsmMatcher.inc -d lib/Target/RISCV/RISCVGenAsmMatcher.inc.d
[420/3490] cd /Users/buildslave/jenkins/workspace/lldb-cmake/lldb-build && /Users/buildslave/jenkins/workspace/lldb-cmake/lldb-build/bin/llvm-tblgen -gen-asm-writer -I /Users/buildslave/jenkins/workspace/lldb-cmake/llvm-project/llvm/lib/Target/RISCV -I/Users/buildslave/jenkins/workspace/lldb-cmake/lldb-build/include -I/Users/buildslave/jenkins/workspace/lldb-cmake/llvm-project/llvm/include -I /Users/buildslave/jenkins/workspace/lldb-cmake/llvm-project/llvm/lib/Target /Users/buildslave/jenkins/workspace/lldb-cmake/llvm-project/llvm/lib/Target/RISCV/RISCV.td --write-if-changed -o lib/Target/RISCV/RISCVGenAsmWriter.inc -d lib/Target/RISCV/RISCVGenAsmWriter.inc.d
[421/3490] /Users/buildslave/jenkins/workspace/lldb-cmake/host-compiler/bin/clang++  -DGTEST_HAS_RTTI=0 -D_DEBUG -D__STDC_CONSTANT_MACROS -D__STDC_FORMAT_MACROS -D__STDC_LIMIT_MACROS -Ilib/Target/AMDGPU/Disassembler -I/Users/buildslave/jenkins/workspace/lldb-cmake/llvm-project/llvm/lib/Target/AMDGPU/Disassembler -I/Users/buildslave/jenkins/workspace/lldb-cmake/llvm-project/llvm/lib/Target/AMDGPU -Ilib/Target/AMDGPU -Iinclude -I/Users/buildslave/jenkins/workspace/lldb-cmake/llvm-project/llvm/include -Ilib/Target/AMDGPU/Disassembler/.. -I/Users/buildslave/jenkins/workspace/lldb-cmake/llvm-project/llvm/lib/Target/AMDGPU/Disassembler/.. -Wdocumentation -fPIC -fvisibility-inlines-hidden -Werror=date-time -Werror=unguarded-availability-new -fmodules -fmodules-cache-path=/Users/buildslave/jenkins/workspace/lldb-cmake/lldb-build/module.cache -fcxx-modules -Xclang -fmodules-local-submodule-visibility -Wall -Wextra -Wno-unused-parameter -Wwrite-strings -Wcast-qual -Wmissing-field-initializers -pedantic -Wno-long-long -Wimplicit-fallthrough -Wcovered-switch-default -Wno-noexcept-type -Wnon-virtual-dtor -Wdelete-non-virtual-dtor -Wsuggest-override -Wstring-conversion -fdiagnostics-color -O3  -isysroot /Applications/Xcode.app/Contents/Developer/Platforms/MacOSX.platform/Developer/SDKs/MacOSX10.15.sdk    -fno-exceptions -fno-rtti -UNDEBUG -std=c++14 -MD -MT lib/Target/AMDGPU/Disassembler/CMakeFiles/LLVMAMDGPUDisassembler.dir/AMDGPUDisassembler.cpp.o -MF lib/Target/AMDGPU/Disassembler/CMakeFiles/LLVMAMDGPUDisassembler.dir/AMDGPUDisassembler.cpp.o.d -o lib/Target/AMDGPU/Disassembler/CMakeFiles/LLVMAMDGPUDisassembler.dir/AMDGPUDisassembler.cpp.o -c /Users/buildslave/jenkins/workspace/lldb-cmake/llvm-project/llvm/lib/Target/AMDGPU/Disassembler/AMDGPUDisassembler.cpp
[422/3490] : && "/Applications/Xcode.app/Contents/Developer/Toolchains/XcodeDefault.xctoolchain/usr/bin/libtool" -static -no_warning_for_no_symbols -o lib/libLLVMAMDGPUDisassembler.a  lib/Target/AMDGPU/Disassembler/CMakeFiles/LLVMAMDGPUDisassembler.dir/AMDGPUDisassembler.cpp.o && :
[423/3490] cd /Users/buildslave/jenkins/workspace/lldb-cmake/lldb-build && /Users/buildslave/jenkins/workspace/lldb-cmake/lldb-build/bin/llvm-tblgen -gen-compress-inst-emitter -I /Users/buildslave/jenkins/workspace/lldb-cmake/llvm-project/llvm/lib/Target/RISCV -I/Users/buildslave/jenkins/workspace/lldb-cmake/lldb-build/include -I/Users/buildslave/jenkins/workspace/lldb-cmake/llvm-project/llvm/include -I /Users/buildslave/jenkins/workspace/lldb-cmake/llvm-project/llvm/lib/Target /Users/buildslave/jenkins/workspace/lldb-cmake/llvm-project/llvm/lib/Target/RISCV/RISCV.td --write-if-changed -o lib/Target/RISCV/RISCVGenCompressInstEmitter.inc -d lib/Target/RISCV/RISCVGenCompressInstEmitter.inc.d
[424/3490] cd /Users/buildslave/jenkins/workspace/lldb-cmake/lldb-build && /Users/buildslave/jenkins/workspace/lldb-cmake/lldb-build/bin/llvm-tblgen -gen-instr-info -I /Users/buildslave/jenkins/workspace/lldb-cmake/llvm-project/llvm/lib/Target/PowerPC -I/Users/buildslave/jenkins/workspace/lldb-cmake/lldb-build/include -I/Users/buildslave/jenkins/workspace/lldb-cmake/llvm-project/llvm/include -I /Users/buildslave/jenkins/workspace/lldb-cmake/llvm-project/llvm/lib/Target /Users/buildslave/jenkins/workspace/lldb-cmake/llvm-project/llvm/lib/Target/PowerPC/PPC.td --write-if-changed -o lib/Target/PowerPC/PPCGenInstrInfo.inc -d lib/Target/PowerPC/PPCGenInstrInfo.inc.d
[425/3445] cd /Users/buildslave/jenkins/workspace/lldb-cmake/lldb-build && /Users/buildslave/jenkins/workspace/lldb-cmake/lldb-build/bin/llvm-tblgen -gen-disassembler -I /Users/buildslave/jenkins/workspace/lldb-cmake/llvm-project/llvm/lib/Target/RISCV -I/Users/buildslave/jenkins/workspace/lldb-cmake/lldb-build/include -I/Users/buildslave/jenkins/workspace/lldb-cmake/llvm-project/llvm/include -I /Users/buildslave/jenkins/workspace/lldb-cmake/llvm-project/llvm/lib/Target /Users/buildslave/jenkins/workspace/lldb-cmake/llvm-project/llvm/lib/Target/RISCV/RISCV.td --write-if-changed -o lib/Target/RISCV/RISCVGenDisassemblerTables.inc -d lib/Target/RISCV/RISCVGenDisassemblerTables.inc.d
[426/3445] cd /Users/buildslave/jenkins/workspace/lldb-cmake/lldb-build && /Users/buildslave/jenkins/workspace/lldb-cmake/lldb-build/bin/llvm-tblgen -gen-pseudo-lowering -I /Users/buildslave/jenkins/workspace/lldb-cmake/llvm-project/llvm/lib/Target/RISCV -I/Users/buildslave/jenkins/workspace/lldb-cmake/lldb-build/include -I/Users/buildslave/jenkins/workspace/lldb-cmake/llvm-project/llvm/include -I /Users/buildslave/jenkins/workspace/lldb-cmake/llvm-project/llvm/lib/Target /Users/buildslave/jenkins/workspace/lldb-cmake/llvm-project/llvm/lib/Target/RISCV/RISCV.td --write-if-changed -o lib/Target/RISCV/RISCVGenMCPseudoLowering.inc -d lib/Target/RISCV/RISCVGenMCPseudoLowering.inc.d
[427/3445] cd /Users/buildslave/jenkins/workspace/lldb-cmake/lldb-build && /Users/buildslave/jenkins/workspace/lldb-cmake/lldb-build/bin/llvm-tblgen -gen-dag-isel -I /Users/buildslave/jenkins/workspace/lldb-cmake/llvm-project/llvm/lib/Target/RISCV -I/Users/buildslave/jenkins/workspace/lldb-cmake/lldb-build/include -I/Users/buildslave/jenkins/workspace/lldb-cmake/llvm-project/llvm/include -I /Users/buildslave/jenkins/workspace/lldb-cmake/llvm-project/llvm/lib/Target -omit-comments /Users/buildslave/jenkins/workspace/lldb-cmake/llvm-project/llvm/lib/Target/RISCV/RISCV.td --write-if-changed -o lib/Target/RISCV/RISCVGenDAGISel.inc -d lib/Target/RISCV/RISCVGenDAGISel.inc.d
[428/3445] cd /Users/buildslave/jenkins/workspace/lldb-cmake/lldb-build && /Users/buildslave/jenkins/workspace/lldb-cmake/lldb-build/bin/llvm-tblgen -gen-instr-info -I /Users/buildslave/jenkins/workspace/lldb-cmake/llvm-project/llvm/lib/Target/RISCV -I/Users/buildslave/jenkins/workspace/lldb-cmake/lldb-build/include -I/Users/buildslave/jenkins/workspace/lldb-cmake/llvm-project/llvm/include -I /Users/buildslave/jenkins/workspace/lldb-cmake/llvm-project/llvm/lib/Target /Users/buildslave/jenkins/workspace/lldb-cmake/llvm-project/llvm/lib/Target/RISCV/RISCV.td --write-if-changed -o lib/Target/RISCV/RISCVGenInstrInfo.inc -d lib/Target/RISCV/RISCVGenInstrInfo.inc.d
[429/3445] cd /Users/buildslave/jenkins/workspace/lldb-cmake/lldb-build && /Users/buildslave/jenkins/workspace/lldb-cmake/lldb-build/bin/llvm-tblgen -gen-emitter -I /Users/buildslave/jenkins/workspace/lldb-cmake/llvm-project/llvm/lib/Target/RISCV -I/Users/buildslave/jenkins/workspace/lldb-cmake/lldb-build/include -I/Users/buildslave/jenkins/workspace/lldb-cmake/llvm-project/llvm/include -I /Users/buildslave/jenkins/workspace/lldb-cmake/llvm-project/llvm/lib/Target /Users/buildslave/jenkins/workspace/lldb-cmake/llvm-project/llvm/lib/Target/RISCV/RISCV.td --write-if-changed -o lib/Target/RISCV/RISCVGenMCCodeEmitter.inc -d lib/Target/RISCV/RISCVGenMCCodeEmitter.inc.d
[430/3445] cd /Users/buildslave/jenkins/workspace/lldb-cmake/lldb-build && /Users/buildslave/jenkins/workspace/lldb-cmake/lldb-build/bin/llvm-tblgen -gen-register-info -I /Users/buildslave/jenkins/workspace/lldb-cmake/llvm-project/llvm/lib/Target/RISCV -I/Users/buildslave/jenkins/workspace/lldb-cmake/lldb-build/include -I/Users/buildslave/jenkins/workspace/lldb-cmake/llvm-project/llvm/include -I /Users/buildslave/jenkins/workspace/lldb-cmake/llvm-project/llvm/lib/Target /Users/buildslave/jenkins/workspace/lldb-cmake/llvm-project/llvm/lib/Target/RISCV/RISCV.td --write-if-changed -o lib/Target/RISCV/RISCVGenRegisterInfo.inc -d lib/Target/RISCV/RISCVGenRegisterInfo.inc.d
[431/3445] cd /Users/buildslave/jenkins/workspace/lldb-cmake/lldb-build && /Users/buildslave/jenkins/workspace/lldb-cmake/lldb-build/bin/llvm-tblgen -gen-register-bank -I /Users/buildslave/jenkins/workspace/lldb-cmake/llvm-project/llvm/lib/Target/RISCV -I/Users/buildslave/jenkins/workspace/lldb-cmake/lldb-build/include -I/Users/buildslave/jenkins/workspace/lldb-cmake/llvm-project/llvm/include -I /Users/buildslave/jenkins/workspace/lldb-cmake/llvm-project/llvm/lib/Target /Users/buildslave/jenkins/workspace/lldb-cmake/llvm-project/llvm/lib/Target/RISCV/RISCV.td --write-if-changed -o lib/Target/RISCV/RISCVGenRegisterBank.inc -d lib/Target/RISCV/RISCVGenRegisterBank.inc.d
[432/3445] cd /Users/buildslave/jenkins/workspace/lldb-cmake/lldb-build && /Users/buildslave/jenkins/workspace/lldb-cmake/lldb-build/bin/llvm-tblgen -gen-global-isel -I /Users/buildslave/jenkins/workspace/lldb-cmake/llvm-project/llvm/lib/Target/RISCV -I/Users/buildslave/jenkins/workspace/lldb-cmake/lldb-build/include -I/Users/buildslave/jenkins/workspace/lldb-cmake/llvm-project/llvm/include -I /Users/buildslave/jenkins/workspace/lldb-cmake/llvm-project/llvm/lib/Target /Users/buildslave/jenkins/workspace/lldb-cmake/llvm-project/llvm/lib/Target/RISCV/RISCV.td --write-if-changed -o lib/Target/RISCV/RISCVGenGlobalISel.inc -d lib/Target/RISCV/RISCVGenGlobalISel.inc.d
[433/3445] cd /Users/buildslave/jenkins/workspace/lldb-cmake/lldb-build && /Users/buildslave/jenkins/workspace/lldb-cmake/lldb-build/bin/llvm-tblgen -gen-searchable-tables -I /Users/buildslave/jenkins/workspace/lldb-cmake/llvm-project/llvm/lib/Target/RISCV -I/Users/buildslave/jenkins/workspace/lldb-cmake/lldb-build/include -I/Users/buildslave/jenkins/workspace/lldb-cmake/llvm-project/llvm/include -I /Users/buildslave/jenkins/workspace/lldb-cmake/llvm-project/llvm/lib/Target /Users/buildslave/jenkins/workspace/lldb-cmake/llvm-project/llvm/lib/Target/RISCV/RISCV.td --write-if-changed -o lib/Target/RISCV/RISCVGenSystemOperands.inc -d lib/Target/RISCV/RISCVGenSystemOperands.inc.d
[434/3445] cd /Users/buildslave/jenkins/workspace/lldb-cmake/lldb-build && /Users/buildslave/jenkins/workspace/lldb-cmake/lldb-build/bin/llvm-tblgen -gen-subtarget -I /Users/buildslave/jenkins/workspace/lldb-cmake/llvm-project/llvm/lib/Target/RISCV -I/Users/buildslave/jenkins/workspace/lldb-cmake/lldb-build/include -I/Users/buildslave/jenkins/workspace/lldb-cmake/llvm-project/llvm/include -I /Users/buildslave/jenkins/workspace/lldb-cmake/llvm-project/llvm/lib/Target /Users/buildslave/jenkins/workspace/lldb-cmake/llvm-project/llvm/lib/Target/RISCV/RISCV.td --write-if-changed -o lib/Target/RISCV/RISCVGenSubtargetInfo.inc -d lib/Target/RISCV/RISCVGenSubtargetInfo.inc.d
[435/3411] cd /Users/buildslave/jenkins/workspace/lldb-cmake/lldb-build && /Users/buildslave/jenkins/workspace/lldb-cmake/lldb-build/bin/llvm-tblgen -gen-asm-writer -I /Users/buildslave/jenkins/workspace/lldb-cmake/llvm-project/llvm/lib/Target/Sparc -I/Users/buildslave/jenkins/workspace/lldb-cmake/lldb-build/include -I/Users/buildslave/jenkins/workspace/lldb-cmake/llvm-project/llvm/include -I /Users/buildslave/jenkins/workspace/lldb-cmake/llvm-project/llvm/lib/Target /Users/buildslave/jenkins/workspace/lldb-cmake/llvm-project/llvm/lib/Target/Sparc/Sparc.td --write-if-changed -o lib/Target/Sparc/SparcGenAsmWriter.inc -d lib/Target/Sparc/SparcGenAsmWriter.inc.d
[436/3411] cd /Users/buildslave/jenkins/workspace/lldb-cmake/lldb-build && /Users/buildslave/jenkins/workspace/lldb-cmake/lldb-build/bin/llvm-tblgen -gen-asm-matcher -I /Users/buildslave/jenkins/workspace/lldb-cmake/llvm-project/llvm/lib/Target/Sparc -I/Users/buildslave/jenkins/workspace/lldb-cmake/lldb-build/include -I/Users/buildslave/jenkins/workspace/lldb-cmake/llvm-project/llvm/include -I /Users/buildslave/jenkins/workspace/lldb-cmake/llvm-project/llvm/lib/Target /Users/buildslave/jenkins/workspace/lldb-cmake/llvm-project/llvm/lib/Target/Sparc/Sparc.td --write-if-changed -o lib/Target/Sparc/SparcGenAsmMatcher.inc -d lib/Target/Sparc/SparcGenAsmMatcher.inc.d
[437/3411] cd /Users/buildslave/jenkins/workspace/lldb-cmake/lldb-build && /Users/buildslave/jenkins/workspace/lldb-cmake/lldb-build/bin/llvm-tblgen -gen-callingconv -I /Users/buildslave/jenkins/workspace/lldb-cmake/llvm-project/llvm/lib/Target/Sparc -I/Users/buildslave/jenkins/workspace/lldb-cmake/lldb-build/include -I/Users/buildslave/jenkins/workspace/lldb-cmake/llvm-project/llvm/include -I /Users/buildslave/jenkins/workspace/lldb-cmake/llvm-project/llvm/lib/Target /Users/buildslave/jenkins/workspace/lldb-cmake/llvm-project/llvm/lib/Target/Sparc/Sparc.td --write-if-changed -o lib/Target/Sparc/SparcGenCallingConv.inc -d lib/Target/Sparc/SparcGenCallingConv.inc.d
[438/3411] cd /Users/buildslave/jenkins/workspace/lldb-cmake/lldb-build && /Users/buildslave/jenkins/workspace/lldb-cmake/lldb-build/bin/llvm-tblgen -gen-dag-isel -I /Users/buildslave/jenkins/workspace/lldb-cmake/llvm-project/llvm/lib/Target/Sparc -I/Users/buildslave/jenkins/workspace/lldb-cmake/lldb-build/include -I/Users/buildslave/jenkins/workspace/lldb-cmake/llvm-project/llvm/include -I /Users/buildslave/jenkins/workspace/lldb-cmake/llvm-project/llvm/lib/Target -omit-comments /Users/buildslave/jenkins/workspace/lldb-cmake/llvm-project/llvm/lib/Target/Sparc/Sparc.td --write-if-changed -o lib/Target/Sparc/SparcGenDAGISel.inc -d lib/Target/Sparc/SparcGenDAGISel.inc.d
[439/3411] cd /Users/buildslave/jenkins/workspace/lldb-cmake/lldb-build && /Users/buildslave/jenkins/workspace/lldb-cmake/lldb-build/bin/llvm-tblgen -gen-emitter -I /Users/buildslave/jenkins/workspace/lldb-cmake/llvm-project/llvm/lib/Target/Sparc -I/Users/buildslave/jenkins/workspace/lldb-cmake/lldb-build/include -I/Users/buildslave/jenkins/workspace/lldb-cmake/llvm-project/llvm/include -I /Users/buildslave/jenkins/workspace/lldb-cmake/llvm-project/llvm/lib/Target /Users/buildslave/jenkins/workspace/lldb-cmake/llvm-project/llvm/lib/Target/Sparc/Sparc.td --write-if-changed -o lib/Target/Sparc/SparcGenMCCodeEmitter.inc -d lib/Target/Sparc/SparcGenMCCodeEmitter.inc.d
[440/3411] cd /Users/buildslave/jenkins/workspace/lldb-cmake/lldb-build && /Users/buildslave/jenkins/workspace/lldb-cmake/lldb-build/bin/llvm-tblgen -gen-global-isel -I /Users/buildslave/jenkins/workspace/lldb-cmake/llvm-project/llvm/lib/Target/PowerPC -I/Users/buildslave/jenkins/workspace/lldb-cmake/lldb-build/include -I/Users/buildslave/jenkins/workspace/lldb-cmake/llvm-project/llvm/include -I /Users/buildslave/jenkins/workspace/lldb-cmake/llvm-project/llvm/lib/Target /Users/buildslave/jenkins/workspace/lldb-cmake/llvm-project/llvm/lib/Target/PowerPC/PPC.td --write-if-changed -o lib/Target/PowerPC/PPCGenGlobalISel.inc -d lib/Target/PowerPC/PPCGenGlobalISel.inc.d
[441/3409] cd /Users/buildslave/jenkins/workspace/lldb-cmake/lldb-build && /Users/buildslave/jenkins/workspace/lldb-cmake/lldb-build/bin/llvm-tblgen -gen-disassembler -I /Users/buildslave/jenkins/workspace/lldb-cmake/llvm-project/llvm/lib/Target/Sparc -I/Users/buildslave/jenkins/workspace/lldb-cmake/lldb-build/include -I/Users/buildslave/jenkins/workspace/lldb-cmake/llvm-project/llvm/include -I /Users/buildslave/jenkins/workspace/lldb-cmake/llvm-project/llvm/lib/Target /Users/buildslave/jenkins/workspace/lldb-cmake/llvm-project/llvm/lib/Target/Sparc/Sparc.td --write-if-changed -o lib/Target/Sparc/SparcGenDisassemblerTables.inc -d lib/Target/Sparc/SparcGenDisassemblerTables.inc.d
[442/3409] cd /Users/buildslave/jenkins/workspace/lldb-cmake/lldb-build && /Users/buildslave/jenkins/workspace/lldb-cmake/lldb-build/bin/llvm-tblgen -gen-register-info -I /Users/buildslave/jenkins/workspace/lldb-cmake/llvm-project/llvm/lib/Target/Sparc -I/Users/buildslave/jenkins/workspace/lldb-cmake/lldb-build/include -I/Users/buildslave/jenkins/workspace/lldb-cmake/llvm-project/llvm/include -I /Users/buildslave/jenkins/workspace/lldb-cmake/llvm-project/llvm/lib/Target /Users/buildslave/jenkins/workspace/lldb-cmake/llvm-project/llvm/lib/Target/Sparc/Sparc.td --write-if-changed -o lib/Target/Sparc/SparcGenRegisterInfo.inc -d lib/Target/Sparc/SparcGenRegisterInfo.inc.d
[443/3409] cd /Users/buildslave/jenkins/workspace/lldb-cmake/lldb-build && /Users/buildslave/jenkins/workspace/lldb-cmake/lldb-build/bin/llvm-tblgen -gen-subtarget -I /Users/buildslave/jenkins/workspace/lldb-cmake/llvm-project/llvm/lib/Target/Sparc -I/Users/buildslave/jenkins/workspace/lldb-cmake/lldb-build/include -I/Users/buildslave/jenkins/workspace/lldb-cmake/llvm-project/llvm/include -I /Users/buildslave/jenkins/workspace/lldb-cmake/llvm-project/llvm/lib/Target /Users/buildslave/jenkins/workspace/lldb-cmake/llvm-project/llvm/lib/Target/Sparc/Sparc.td --write-if-changed -o lib/Target/Sparc/SparcGenSubtargetInfo.inc -d lib/Target/Sparc/SparcGenSubtargetInfo.inc.d
[444/3409] cd /Users/buildslave/jenkins/workspace/lldb-cmake/lldb-build && /Users/buildslave/jenkins/workspace/lldb-cmake/lldb-build/bin/llvm-tblgen -gen-instr-info -I /Users/buildslave/jenkins/workspace/lldb-cmake/llvm-project/llvm/lib/Target/Sparc -I/Users/buildslave/jenkins/workspace/lldb-cmake/lldb-build/include -I/Users/buildslave/jenkins/workspace/lldb-cmake/llvm-project/llvm/include -I /Users/buildslave/jenkins/workspace/lldb-cmake/llvm-project/llvm/lib/Target /Users/buildslave/jenkins/workspace/lldb-cmake/llvm-project/llvm/lib/Target/Sparc/Sparc.td --write-if-changed -o lib/Target/Sparc/SparcGenInstrInfo.inc -d lib/Target/Sparc/SparcGenInstrInfo.inc.d
[445/3389] cd /Users/buildslave/jenkins/workspace/lldb-cmake/lldb-build && /Users/buildslave/jenkins/workspace/lldb-cmake/lldb-build/bin/llvm-tblgen -gen-asm-writer -I /Users/buildslave/jenkins/workspace/lldb-cmake/llvm-project/llvm/lib/Target/SystemZ -I/Users/buildslave/jenkins/workspace/lldb-cmake/lldb-build/include -I/Users/buildslave/jenkins/workspace/lldb-cmake/llvm-project/llvm/include -I /Users/buildslave/jenkins/workspace/lldb-cmake/llvm-project/llvm/lib/Target /Users/buildslave/jenkins/workspace/lldb-cmake/llvm-project/llvm/lib/Target/SystemZ/SystemZ.td --write-if-changed -o lib/Target/SystemZ/SystemZGenAsmWriter.inc -d lib/Target/SystemZ/SystemZGenAsmWriter.inc.d
[446/3388] cd /Users/buildslave/jenkins/workspace/lldb-cmake/lldb-build && /Users/buildslave/jenkins/workspace/lldb-cmake/lldb-build/bin/llvm-tblgen -gen-callingconv -I /Users/buildslave/jenkins/workspace/lldb-cmake/llvm-project/llvm/lib/Target/SystemZ -I/Users/buildslave/jenkins/workspace/lldb-cmake/lldb-build/include -I/Users/buildslave/jenkins/workspace/lldb-cmake/llvm-project/llvm/include -I /Users/buildslave/jenkins/workspace/lldb-cmake/llvm-project/llvm/lib/Target /Users/buildslave/jenkins/workspace/lldb-cmake/llvm-project/llvm/lib/Target/SystemZ/SystemZ.td --write-if-changed -o lib/Target/SystemZ/SystemZGenCallingConv.inc -d lib/Target/SystemZ/SystemZGenCallingConv.inc.d
[447/3388] cd /Users/buildslave/jenkins/workspace/lldb-cmake/lldb-build && /Users/buildslave/jenkins/workspace/lldb-cmake/lldb-build/bin/llvm-tblgen -gen-asm-matcher -I /Users/buildslave/jenkins/workspace/lldb-cmake/llvm-project/llvm/lib/Target/SystemZ -I/Users/buildslave/jenkins/workspace/lldb-cmake/lldb-build/include -I/Users/buildslave/jenkins/workspace/lldb-cmake/llvm-project/llvm/include -I /Users/buildslave/jenkins/workspace/lldb-cmake/llvm-project/llvm/lib/Target /Users/buildslave/jenkins/workspace/lldb-cmake/llvm-project/llvm/lib/Target/SystemZ/SystemZ.td --write-if-changed -o lib/Target/SystemZ/SystemZGenAsmMatcher.inc -d lib/Target/SystemZ/SystemZGenAsmMatcher.inc.d
[448/3388] cd /Users/buildslave/jenkins/workspace/lldb-cmake/lldb-build && /Users/buildslave/jenkins/workspace/lldb-cmake/lldb-build/bin/llvm-tblgen -gen-emitter -I /Users/buildslave/jenkins/workspace/lldb-cmake/llvm-project/llvm/lib/Target/SystemZ -I/Users/buildslave/jenkins/workspace/lldb-cmake/lldb-build/include -I/Users/buildslave/jenkins/workspace/lldb-cmake/llvm-project/llvm/include -I /Users/buildslave/jenkins/workspace/lldb-cmake/llvm-project/llvm/lib/Target /Users/buildslave/jenkins/workspace/lldb-cmake/llvm-project/llvm/lib/Target/SystemZ/SystemZ.td --write-if-changed -o lib/Target/SystemZ/SystemZGenMCCodeEmitter.inc -d lib/Target/SystemZ/SystemZGenMCCodeEmitter.inc.d
[449/3388] cd /Users/buildslave/jenkins/workspace/lldb-cmake/lldb-build && /Users/buildslave/jenkins/workspace/lldb-cmake/lldb-build/bin/llvm-tblgen -gen-disassembler -I /Users/buildslave/jenkins/workspace/lldb-cmake/llvm-project/llvm/lib/Target/SystemZ -I/Users/buildslave/jenkins/workspace/lldb-cmake/lldb-build/include -I/Users/buildslave/jenkins/workspace/lldb-cmake/llvm-project/llvm/include -I /Users/buildslave/jenkins/workspace/lldb-cmake/llvm-project/llvm/lib/Target /Users/buildslave/jenkins/workspace/lldb-cmake/llvm-project/llvm/lib/Target/SystemZ/SystemZ.td --write-if-changed -o lib/Target/SystemZ/SystemZGenDisassemblerTables.inc -d lib/Target/SystemZ/SystemZGenDisassemblerTables.inc.d
[450/3388] cd /Users/buildslave/jenkins/workspace/lldb-cmake/lldb-build && /Users/buildslave/jenkins/workspace/lldb-cmake/lldb-build/bin/llvm-tblgen -gen-dag-isel -I /Users/buildslave/jenkins/workspace/lldb-cmake/llvm-project/llvm/lib/Target/SystemZ -I/Users/buildslave/jenkins/workspace/lldb-cmake/lldb-build/include -I/Users/buildslave/jenkins/workspace/lldb-cmake/llvm-project/llvm/include -I /Users/buildslave/jenkins/workspace/lldb-cmake/llvm-project/llvm/lib/Target -omit-comments /Users/buildslave/jenkins/workspace/lldb-cmake/llvm-project/llvm/lib/Target/SystemZ/SystemZ.td --write-if-changed -o lib/Target/SystemZ/SystemZGenDAGISel.inc -d lib/Target/SystemZ/SystemZGenDAGISel.inc.d
[451/3388] /Users/buildslave/jenkins/workspace/lldb-cmake/host-compiler/bin/clang++  -DGTEST_HAS_RTTI=0 -D_DEBUG -D__STDC_CONSTANT_MACROS -D__STDC_FORMAT_MACROS -D__STDC_LIMIT_MACROS -Ilib/Target/Sparc/MCTargetDesc -I/Users/buildslave/jenkins/workspace/lldb-cmake/llvm-project/llvm/lib/Target/Sparc/MCTargetDesc -I/Users/buildslave/jenkins/workspace/lldb-cmake/llvm-project/llvm/lib/Target/Sparc -Ilib/Target/Sparc -Iinclude -I/Users/buildslave/jenkins/workspace/lldb-cmake/llvm-project/llvm/include -Wdocumentation -fPIC -fvisibility-inlines-hidden -Werror=date-time -Werror=unguarded-availability-new -fmodules -fmodules-cache-path=/Users/buildslave/jenkins/workspace/lldb-cmake/lldb-build/module.cache -fcxx-modules -Xclang -fmodules-local-submodule-visibility -Wall -Wextra -Wno-unused-parameter -Wwrite-strings -Wcast-qual -Wmissing-field-initializers -pedantic -Wno-long-long -Wimplicit-fallthrough -Wcovered-switch-default -Wno-noexcept-type -Wnon-virtual-dtor -Wdelete-non-virtual-dtor -Wsuggest-override -Wstring-conversion -fdiagnostics-color -O3  -isysroot /Applications/Xcode.app/Contents/Developer/Platforms/MacOSX.platform/Developer/SDKs/MacOSX10.15.sdk    -fno-exceptions -fno-rtti -UNDEBUG -std=c++14 -MD -MT lib/Target/Sparc/MCTargetDesc/CMakeFiles/LLVMSparcDesc.dir/SparcInstPrinter.cpp.o -MF lib/Target/Sparc/MCTargetDesc/CMakeFiles/LLVMSparcDesc.dir/SparcInstPrinter.cpp.o.d -o lib/Target/Sparc/MCTargetDesc/CMakeFiles/LLVMSparcDesc.dir/SparcInstPrinter.cpp.o -c /Users/buildslave/jenkins/workspace/lldb-cmake/llvm-project/llvm/lib/Target/Sparc/MCTargetDesc/SparcInstPrinter.cpp
[452/3388] : && "/Applications/Xcode.app/Contents/Developer/Toolchains/XcodeDefault.xctoolchain/usr/bin/libtool" -static -no_warning_for_no_symbols -o lib/libLLVMSparcDesc.a  lib/Target/Sparc/MCTargetDesc/CMakeFiles/LLVMSparcDesc.dir/SparcAsmBackend.cpp.o lib/Target/Sparc/MCTargetDesc/CMakeFiles/LLVMSparcDesc.dir/SparcELFObjectWriter.cpp.o lib/Target/Sparc/MCTargetDesc/CMakeFiles/LLVMSparcDesc.dir/SparcInstPrinter.cpp.o lib/Target/Sparc/MCTargetDesc/CMakeFiles/LLVMSparcDesc.dir/SparcMCAsmInfo.cpp.o lib/Target/Sparc/MCTargetDesc/CMakeFiles/LLVMSparcDesc.dir/SparcMCCodeEmitter.cpp.o lib/Target/Sparc/MCTargetDesc/CMakeFiles/LLVMSparcDesc.dir/SparcMCTargetDesc.cpp.o lib/Target/Sparc/MCTargetDesc/CMakeFiles/LLVMSparcDesc.dir/SparcMCExpr.cpp.o lib/Target/Sparc/MCTargetDesc/CMakeFiles/LLVMSparcDesc.dir/SparcTargetStreamer.cpp.o && :
[453/3388] cd /Users/buildslave/jenkins/workspace/lldb-cmake/lldb-build && /Users/buildslave/jenkins/workspace/lldb-cmake/lldb-build/bin/llvm-tblgen -gen-register-info -I /Users/buildslave/jenkins/workspace/lldb-cmake/llvm-project/llvm/lib/Target/SystemZ -I/Users/buildslave/jenkins/workspace/lldb-cmake/lldb-build/include -I/Users/buildslave/jenkins/workspace/lldb-cmake/llvm-project/llvm/include -I /Users/buildslave/jenkins/workspace/lldb-cmake/llvm-project/llvm/lib/Target /Users/buildslave/jenkins/workspace/lldb-cmake/llvm-project/llvm/lib/Target/SystemZ/SystemZ.td --write-if-changed -o lib/Target/SystemZ/SystemZGenRegisterInfo.inc -d lib/Target/SystemZ/SystemZGenRegisterInfo.inc.d
[454/3388] cd /Users/buildslave/jenkins/workspace/lldb-cmake/lldb-build && /Users/buildslave/jenkins/workspace/lldb-cmake/lldb-build/bin/llvm-tblgen -gen-asm-writer -I /Users/buildslave/jenkins/workspace/lldb-cmake/llvm-project/llvm/lib/Target/WebAssembly -I/Users/buildslave/jenkins/workspace/lldb-cmake/lldb-build/include -I/Users/buildslave/jenkins/workspace/lldb-cmake/llvm-project/llvm/include -I /Users/buildslave/jenkins/workspace/lldb-cmake/llvm-project/llvm/lib/Target /Users/buildslave/jenkins/workspace/lldb-cmake/llvm-project/llvm/lib/Target/WebAssembly/WebAssembly.td --write-if-changed -o lib/Target/WebAssembly/WebAssemblyGenAsmWriter.inc -d lib/Target/WebAssembly/WebAssemblyGenAsmWriter.inc.d
[455/3388] cd /Users/buildslave/jenkins/workspace/lldb-cmake/lldb-build && /Users/buildslave/jenkins/workspace/lldb-cmake/lldb-build/bin/llvm-tblgen -gen-asm-matcher -I /Users/buildslave/jenkins/workspace/lldb-cmake/llvm-project/llvm/lib/Target/WebAssembly -I/Users/buildslave/jenkins/workspace/lldb-cmake/lldb-build/include -I/Users/buildslave/jenkins/workspace/lldb-cmake/llvm-project/llvm/include -I /Users/buildslave/jenkins/workspace/lldb-cmake/llvm-project/llvm/lib/Target /Users/buildslave/jenkins/workspace/lldb-cmake/llvm-project/llvm/lib/Target/WebAssembly/WebAssembly.td --write-if-changed -o lib/Target/WebAssembly/WebAssemblyGenAsmMatcher.inc -d lib/Target/WebAssembly/WebAssemblyGenAsmMatcher.inc.d
[456/3388] cd /Users/buildslave/jenkins/workspace/lldb-cmake/lldb-build && /Users/buildslave/jenkins/workspace/lldb-cmake/lldb-build/bin/llvm-tblgen -gen-disassembler -I /Users/buildslave/jenkins/workspace/lldb-cmake/llvm-project/llvm/lib/Target/WebAssembly -I/Users/buildslave/jenkins/workspace/lldb-cmake/lldb-build/include -I/Users/buildslave/jenkins/workspace/lldb-cmake/llvm-project/llvm/include -I /Users/buildslave/jenkins/workspace/lldb-cmake/llvm-project/llvm/lib/Target /Users/buildslave/jenkins/workspace/lldb-cmake/llvm-project/llvm/lib/Target/WebAssembly/WebAssembly.td --write-if-changed -o lib/Target/WebAssembly/WebAssemblyGenDisassemblerTables.inc -d lib/Target/WebAssembly/WebAssemblyGenDisassemblerTables.inc.d
[457/3388] cd /Users/buildslave/jenkins/workspace/lldb-cmake/lldb-build && /Users/buildslave/jenkins/workspace/lldb-cmake/lldb-build/bin/llvm-tblgen -gen-fast-isel -I /Users/buildslave/jenkins/workspace/lldb-cmake/llvm-project/llvm/lib/Target/WebAssembly -I/Users/buildslave/jenkins/workspace/lldb-cmake/lldb-build/include -I/Users/buildslave/jenkins/workspace/lldb-cmake/llvm-project/llvm/include -I /Users/buildslave/jenkins/workspace/lldb-cmake/llvm-project/llvm/lib/Target /Users/buildslave/jenkins/workspace/lldb-cmake/llvm-project/llvm/lib/Target/WebAssembly/WebAssembly.td --write-if-changed -o lib/Target/WebAssembly/WebAssemblyGenFastISel.inc -d lib/Target/WebAssembly/WebAssemblyGenFastISel.inc.d
[458/3388] cd /Users/buildslave/jenkins/workspace/lldb-cmake/lldb-build && /Users/buildslave/jenkins/workspace/lldb-cmake/lldb-build/bin/llvm-tblgen -gen-dag-isel -I /Users/buildslave/jenkins/workspace/lldb-cmake/llvm-project/llvm/lib/Target/WebAssembly -I/Users/buildslave/jenkins/workspace/lldb-cmake/lldb-build/include -I/Users/buildslave/jenkins/workspace/lldb-cmake/llvm-project/llvm/include -I /Users/buildslave/jenkins/workspace/lldb-cmake/llvm-project/llvm/lib/Target -omit-comments /Users/buildslave/jenkins/workspace/lldb-cmake/llvm-project/llvm/lib/Target/WebAssembly/WebAssembly.td --write-if-changed -o lib/Target/WebAssembly/WebAssemblyGenDAGISel.inc -d lib/Target/WebAssembly/WebAssemblyGenDAGISel.inc.d
[459/3388] cd /Users/buildslave/jenkins/workspace/lldb-cmake/lldb-build && /Users/buildslave/jenkins/workspace/lldb-cmake/lldb-build/bin/llvm-tblgen -gen-emitter -I /Users/buildslave/jenkins/workspace/lldb-cmake/llvm-project/llvm/lib/Target/WebAssembly -I/Users/buildslave/jenkins/workspace/lldb-cmake/lldb-build/include -I/Users/buildslave/jenkins/workspace/lldb-cmake/llvm-project/llvm/include -I /Users/buildslave/jenkins/workspace/lldb-cmake/llvm-project/llvm/lib/Target /Users/buildslave/jenkins/workspace/lldb-cmake/llvm-project/llvm/lib/Target/WebAssembly/WebAssembly.td --write-if-changed -o lib/Target/WebAssembly/WebAssemblyGenMCCodeEmitter.inc -d lib/Target/WebAssembly/WebAssemblyGenMCCodeEmitter.inc.d
[460/3388] cd /Users/buildslave/jenkins/workspace/lldb-cmake/lldb-build && /Users/buildslave/jenkins/workspace/lldb-cmake/lldb-build/bin/llvm-tblgen -gen-register-info -I /Users/buildslave/jenkins/workspace/lldb-cmake/llvm-project/llvm/lib/Target/WebAssembly -I/Users/buildslave/jenkins/workspace/lldb-cmake/lldb-build/include -I/Users/buildslave/jenkins/workspace/lldb-cmake/llvm-project/llvm/include -I /Users/buildslave/jenkins/workspace/lldb-cmake/llvm-project/llvm/lib/Target /Users/buildslave/jenkins/workspace/lldb-cmake/llvm-project/llvm/lib/Target/WebAssembly/WebAssembly.td --write-if-changed -o lib/Target/WebAssembly/WebAssemblyGenRegisterInfo.inc -d lib/Target/WebAssembly/WebAssemblyGenRegisterInfo.inc.d
[461/3388] cd /Users/buildslave/jenkins/workspace/lldb-cmake/lldb-build && /Users/buildslave/jenkins/workspace/lldb-cmake/lldb-build/bin/llvm-tblgen -gen-subtarget -I /Users/buildslave/jenkins/workspace/lldb-cmake/llvm-project/llvm/lib/Target/WebAssembly -I/Users/buildslave/jenkins/workspace/lldb-cmake/lldb-build/include -I/Users/buildslave/jenkins/workspace/lldb-cmake/llvm-project/llvm/include -I /Users/buildslave/jenkins/workspace/lldb-cmake/llvm-project/llvm/lib/Target /Users/buildslave/jenkins/workspace/lldb-cmake/llvm-project/llvm/lib/Target/WebAssembly/WebAssembly.td --write-if-changed -o lib/Target/WebAssembly/WebAssemblyGenSubtargetInfo.inc -d lib/Target/WebAssembly/WebAssemblyGenSubtargetInfo.inc.d
[462/3388] cd /Users/buildslave/jenkins/workspace/lldb-cmake/lldb-build && /Users/buildslave/jenkins/workspace/lldb-cmake/lldb-build/bin/llvm-tblgen -gen-instr-info -I /Users/buildslave/jenkins/workspace/lldb-cmake/llvm-project/llvm/lib/Target/WebAssembly -I/Users/buildslave/jenkins/workspace/lldb-cmake/lldb-build/include -I/Users/buildslave/jenkins/workspace/lldb-cmake/llvm-project/llvm/include -I /Users/buildslave/jenkins/workspace/lldb-cmake/llvm-project/llvm/lib/Target /Users/buildslave/jenkins/workspace/lldb-cmake/llvm-project/llvm/lib/Target/WebAssembly/WebAssembly.td --write-if-changed -o lib/Target/WebAssembly/WebAssemblyGenInstrInfo.inc -d lib/Target/WebAssembly/WebAssemblyGenInstrInfo.inc.d
[463/3337] cd /Users/buildslave/jenkins/workspace/lldb-cmake/lldb-build && /Users/buildslave/jenkins/workspace/lldb-cmake/lldb-build/bin/llvm-tblgen -gen-instr-info -I /Users/buildslave/jenkins/workspace/lldb-cmake/llvm-project/llvm/lib/Target/SystemZ -I/Users/buildslave/jenkins/workspace/lldb-cmake/lldb-build/include -I/Users/buildslave/jenkins/workspace/lldb-cmake/llvm-project/llvm/include -I /Users/buildslave/jenkins/workspace/lldb-cmake/llvm-project/llvm/lib/Target /Users/buildslave/jenkins/workspace/lldb-cmake/llvm-project/llvm/lib/Target/SystemZ/SystemZ.td --write-if-changed -o lib/Target/SystemZ/SystemZGenInstrInfo.inc -d lib/Target/SystemZ/SystemZGenInstrInfo.inc.d
[464/3337] cd /Users/buildslave/jenkins/workspace/lldb-cmake/lldb-build && /Users/buildslave/jenkins/workspace/lldb-cmake/lldb-build/bin/llvm-tblgen -gen-subtarget -I /Users/buildslave/jenkins/workspace/lldb-cmake/llvm-project/llvm/lib/Target/SystemZ -I/Users/buildslave/jenkins/workspace/lldb-cmake/lldb-build/include -I/Users/buildslave/jenkins/workspace/lldb-cmake/llvm-project/llvm/include -I /Users/buildslave/jenkins/workspace/lldb-cmake/llvm-project/llvm/lib/Target /Users/buildslave/jenkins/workspace/lldb-cmake/llvm-project/llvm/lib/Target/SystemZ/SystemZ.td --write-if-changed -o lib/Target/SystemZ/SystemZGenSubtargetInfo.inc -d lib/Target/SystemZ/SystemZGenSubtargetInfo.inc.d
[465/3306] cd /Users/buildslave/jenkins/workspace/lldb-cmake/lldb-build && /Users/buildslave/jenkins/workspace/lldb-cmake/lldb-build/bin/llvm-tblgen -gen-callingconv -I /Users/buildslave/jenkins/workspace/lldb-cmake/llvm-project/llvm/lib/Target/X86 -I/Users/buildslave/jenkins/workspace/lldb-cmake/lldb-build/include -I/Users/buildslave/jenkins/workspace/lldb-cmake/llvm-project/llvm/include -I /Users/buildslave/jenkins/workspace/lldb-cmake/llvm-project/llvm/lib/Target /Users/buildslave/jenkins/workspace/lldb-cmake/llvm-project/llvm/lib/Target/X86/X86.td --write-if-changed -o lib/Target/X86/X86GenCallingConv.inc -d lib/Target/X86/X86GenCallingConv.inc.d
[466/3306] cd /Users/buildslave/jenkins/workspace/lldb-cmake/lldb-build && /Users/buildslave/jenkins/workspace/lldb-cmake/lldb-build/bin/llvm-tblgen -gen-asm-writer -I /Users/buildslave/jenkins/workspace/lldb-cmake/llvm-project/llvm/lib/Target/X86 -I/Users/buildslave/jenkins/workspace/lldb-cmake/lldb-build/include -I/Users/buildslave/jenkins/workspace/lldb-cmake/llvm-project/llvm/include -I /Users/buildslave/jenkins/workspace/lldb-cmake/llvm-project/llvm/lib/Target /Users/buildslave/jenkins/workspace/lldb-cmake/llvm-project/llvm/lib/Target/X86/X86.td --write-if-changed -o lib/Target/X86/X86GenAsmWriter.inc -d lib/Target/X86/X86GenAsmWriter.inc.d
[467/3306] cd /Users/buildslave/jenkins/workspace/lldb-cmake/lldb-build && /Users/buildslave/jenkins/workspace/lldb-cmake/lldb-build/bin/llvm-tblgen -gen-asm-writer -asmwriternum=1 -I /Users/buildslave/jenkins/workspace/lldb-cmake/llvm-project/llvm/lib/Target/X86 -I/Users/buildslave/jenkins/workspace/lldb-cmake/lldb-build/include -I/Users/buildslave/jenkins/workspace/lldb-cmake/llvm-project/llvm/include -I /Users/buildslave/jenkins/workspace/lldb-cmake/llvm-project/llvm/lib/Target /Users/buildslave/jenkins/workspace/lldb-cmake/llvm-project/llvm/lib/Target/X86/X86.td --write-if-changed -o lib/Target/X86/X86GenAsmWriter1.inc -d lib/Target/X86/X86GenAsmWriter1.inc.d
[468/3306] cd /Users/buildslave/jenkins/workspace/lldb-cmake/lldb-build && /Users/buildslave/jenkins/workspace/lldb-cmake/lldb-build/bin/llvm-tblgen -gen-asm-matcher -I /Users/buildslave/jenkins/workspace/lldb-cmake/llvm-project/llvm/lib/Target/X86 -I/Users/buildslave/jenkins/workspace/lldb-cmake/lldb-build/include -I/Users/buildslave/jenkins/workspace/lldb-cmake/llvm-project/llvm/include -I /Users/buildslave/jenkins/workspace/lldb-cmake/llvm-project/llvm/lib/Target /Users/buildslave/jenkins/workspace/lldb-cmake/llvm-project/llvm/lib/Target/X86/X86.td --write-if-changed -o lib/Target/X86/X86GenAsmMatcher.inc -d lib/Target/X86/X86GenAsmMatcher.inc.d
[469/3306] cd /Users/buildslave/jenkins/workspace/lldb-cmake/lldb-build && /Users/buildslave/jenkins/workspace/lldb-cmake/lldb-build/bin/llvm-tblgen -gen-exegesis -I /Users/buildslave/jenkins/workspace/lldb-cmake/llvm-project/llvm/lib/Target/X86 -I/Users/buildslave/jenkins/workspace/lldb-cmake/lldb-build/include -I/Users/buildslave/jenkins/workspace/lldb-cmake/llvm-project/llvm/include -I /Users/buildslave/jenkins/workspace/lldb-cmake/llvm-project/llvm/lib/Target /Users/buildslave/jenkins/workspace/lldb-cmake/llvm-project/llvm/lib/Target/X86/X86.td --write-if-changed -o lib/Target/X86/X86GenExegesis.inc -d lib/Target/X86/X86GenExegesis.inc.d
[470/3306] /Users/buildslave/jenkins/workspace/lldb-cmake/host-compiler/bin/clang++  -DGTEST_HAS_RTTI=0 -D_DEBUG -D__STDC_CONSTANT_MACROS -D__STDC_FORMAT_MACROS -D__STDC_LIMIT_MACROS -Ilib/Target/Mips/AsmParser -I/Users/buildslave/jenkins/workspace/lldb-cmake/llvm-project/llvm/lib/Target/Mips/AsmParser -I/Users/buildslave/jenkins/workspace/lldb-cmake/llvm-project/llvm/lib/Target/Mips -Ilib/Target/Mips -Iinclude -I/Users/buildslave/jenkins/workspace/lldb-cmake/llvm-project/llvm/include -Wdocumentation -fPIC -fvisibility-inlines-hidden -Werror=date-time -Werror=unguarded-availability-new -fmodules -fmodules-cache-path=/Users/buildslave/jenkins/workspace/lldb-cmake/lldb-build/module.cache -fcxx-modules -Xclang -fmodules-local-submodule-visibility -Wall -Wextra -Wno-unused-parameter -Wwrite-strings -Wcast-qual -Wmissing-field-initializers -pedantic -Wno-long-long -Wimplicit-fallthrough -Wcovered-switch-default -Wno-noexcept-type -Wnon-virtual-dtor -Wdelete-non-virtual-dtor -Wsuggest-override -Wstring-conversion -fdiagnostics-color -O3  -isysroot /Applications/Xcode.app/Contents/Developer/Platforms/MacOSX.platform/Developer/SDKs/MacOSX10.15.sdk    -fno-exceptions -fno-rtti -UNDEBUG -std=c++14 -MD -MT lib/Target/Mips/AsmParser/CMakeFiles/LLVMMipsAsmParser.dir/MipsAsmParser.cpp.o -MF lib/Target/Mips/AsmParser/CMakeFiles/LLVMMipsAsmParser.dir/MipsAsmParser.cpp.o.d -o lib/Target/Mips/AsmParser/CMakeFiles/LLVMMipsAsmParser.dir/MipsAsmParser.cpp.o -c /Users/buildslave/jenkins/workspace/lldb-cmake/llvm-project/llvm/lib/Target/Mips/AsmParser/MipsAsmParser.cpp
[471/3306] : && "/Applications/Xcode.app/Contents/Developer/Toolchains/XcodeDefault.xctoolchain/usr/bin/libtool" -static -no_warning_for_no_symbols -o lib/libLLVMMipsAsmParser.a  lib/Target/Mips/AsmParser/CMakeFiles/LLVMMipsAsmParser.dir/MipsAsmParser.cpp.o && :
[472/3306] cd /Users/buildslave/jenkins/workspace/lldb-cmake/lldb-build && /Users/buildslave/jenkins/workspace/lldb-cmake/lldb-build/bin/llvm-tblgen -gen-x86-EVEX2VEX-tables -I /Users/buildslave/jenkins/workspace/lldb-cmake/llvm-project/llvm/lib/Target/X86 -I/Users/buildslave/jenkins/workspace/lldb-cmake/lldb-build/include -I/Users/buildslave/jenkins/workspace/lldb-cmake/llvm-project/llvm/include -I /Users/buildslave/jenkins/workspace/lldb-cmake/llvm-project/llvm/lib/Target /Users/buildslave/jenkins/workspace/lldb-cmake/llvm-project/llvm/lib/Target/X86/X86.td --write-if-changed -o lib/Target/X86/X86GenEVEX2VEXTables.inc -d lib/Target/X86/X86GenEVEX2VEXTables.inc.d
[473/3306] /Users/buildslave/jenkins/workspace/lldb-cmake/host-compiler/bin/clang++  -DGTEST_HAS_RTTI=0 -D_DEBUG -D__STDC_CONSTANT_MACROS -D__STDC_FORMAT_MACROS -D__STDC_LIMIT_MACROS -Ilib/Target/Mips/Disassembler -I/Users/buildslave/jenkins/workspace/lldb-cmake/llvm-project/llvm/lib/Target/Mips/Disassembler -I/Users/buildslave/jenkins/workspace/lldb-cmake/llvm-project/llvm/lib/Target/Mips -Ilib/Target/Mips -Iinclude -I/Users/buildslave/jenkins/workspace/lldb-cmake/llvm-project/llvm/include -Wdocumentation -fPIC -fvisibility-inlines-hidden -Werror=date-time -Werror=unguarded-availability-new -fmodules -fmodules-cache-path=/Users/buildslave/jenkins/workspace/lldb-cmake/lldb-build/module.cache -fcxx-modules -Xclang -fmodules-local-submodule-visibility -Wall -Wextra -Wno-unused-parameter -Wwrite-strings -Wcast-qual -Wmissing-field-initializers -pedantic -Wno-long-long -Wimplicit-fallthrough -Wcovered-switch-default -Wno-noexcept-type -Wnon-virtual-dtor -Wdelete-non-virtual-dtor -Wsuggest-override -Wstring-conversion -fdiagnostics-color -O3  -isysroot /Applications/Xcode.app/Contents/Developer/Platforms/MacOSX.platform/Developer/SDKs/MacOSX10.15.sdk    -fno-exceptions -fno-rtti -UNDEBUG -std=c++14 -MD -MT lib/Target/Mips/Disassembler/CMakeFiles/LLVMMipsDisassembler.dir/MipsDisassembler.cpp.o -MF lib/Target/Mips/Disassembler/CMakeFiles/LLVMMipsDisassembler.dir/MipsDisassembler.cpp.o.d -o lib/Target/Mips/Disassembler/CMakeFiles/LLVMMipsDisassembler.dir/MipsDisassembler.cpp.o -c /Users/buildslave/jenkins/workspace/lldb-cmake/llvm-project/llvm/lib/Target/Mips/Disassembler/MipsDisassembler.cpp
[474/3306] : && "/Applications/Xcode.app/Contents/Developer/Toolchains/XcodeDefault.xctoolchain/usr/bin/libtool" -static -no_warning_for_no_symbols -o lib/libLLVMMipsDisassembler.a  lib/Target/Mips/Disassembler/CMakeFiles/LLVMMipsDisassembler.dir/MipsDisassembler.cpp.o && :
[475/3306] cd /Users/buildslave/jenkins/workspace/lldb-cmake/lldb-build && /Users/buildslave/jenkins/workspace/lldb-cmake/lldb-build/bin/llvm-tblgen -gen-disassembler -I /Users/buildslave/jenkins/workspace/lldb-cmake/llvm-project/llvm/lib/Target/X86 -I/Users/buildslave/jenkins/workspace/lldb-cmake/lldb-build/include -I/Users/buildslave/jenkins/workspace/lldb-cmake/llvm-project/llvm/include -I /Users/buildslave/jenkins/workspace/lldb-cmake/llvm-project/llvm/lib/Target /Users/buildslave/jenkins/workspace/lldb-cmake/llvm-project/llvm/lib/Target/X86/X86.td --write-if-changed -o lib/Target/X86/X86GenDisassemblerTables.inc -d lib/Target/X86/X86GenDisassemblerTables.inc.d
[476/3306] cd /Users/buildslave/jenkins/workspace/lldb-cmake/lldb-build && /Users/buildslave/jenkins/workspace/lldb-cmake/lldb-build/bin/llvm-tblgen -gen-register-bank -I /Users/buildslave/jenkins/workspace/lldb-cmake/llvm-project/llvm/lib/Target/X86 -I/Users/buildslave/jenkins/workspace/lldb-cmake/lldb-build/include -I/Users/buildslave/jenkins/workspace/lldb-cmake/llvm-project/llvm/include -I /Users/buildslave/jenkins/workspace/lldb-cmake/llvm-project/llvm/lib/Target /Users/buildslave/jenkins/workspace/lldb-cmake/llvm-project/llvm/lib/Target/X86/X86.td --write-if-changed -o lib/Target/X86/X86GenRegisterBank.inc -d lib/Target/X86/X86GenRegisterBank.inc.d
[477/3306] cd /Users/buildslave/jenkins/workspace/lldb-cmake/lldb-build && /Users/buildslave/jenkins/workspace/lldb-cmake/lldb-build/bin/llvm-tblgen -gen-register-info -I /Users/buildslave/jenkins/workspace/lldb-cmake/llvm-project/llvm/lib/Target/X86 -I/Users/buildslave/jenkins/workspace/lldb-cmake/lldb-build/include -I/Users/buildslave/jenkins/workspace/lldb-cmake/llvm-project/llvm/include -I /Users/buildslave/jenkins/workspace/lldb-cmake/llvm-project/llvm/lib/Target /Users/buildslave/jenkins/workspace/lldb-cmake/llvm-project/llvm/lib/Target/X86/X86.td --write-if-changed -o lib/Target/X86/X86GenRegisterInfo.inc -d lib/Target/X86/X86GenRegisterInfo.inc.d
[478/3305] cd /Users/buildslave/jenkins/workspace/lldb-cmake/lldb-build && /Users/buildslave/jenkins/workspace/lldb-cmake/lldb-build/bin/llvm-tblgen -gen-asm-writer -I /Users/buildslave/jenkins/workspace/lldb-cmake/llvm-project/llvm/lib/Target/XCore -I/Users/buildslave/jenkins/workspace/lldb-cmake/lldb-build/include -I/Users/buildslave/jenkins/workspace/lldb-cmake/llvm-project/llvm/include -I /Users/buildslave/jenkins/workspace/lldb-cmake/llvm-project/llvm/lib/Target /Users/buildslave/jenkins/workspace/lldb-cmake/llvm-project/llvm/lib/Target/XCore/XCore.td --write-if-changed -o lib/Target/XCore/XCoreGenAsmWriter.inc -d lib/Target/XCore/XCoreGenAsmWriter.inc.d
[479/3304] cd /Users/buildslave/jenkins/workspace/lldb-cmake/lldb-build && /Users/buildslave/jenkins/workspace/lldb-cmake/lldb-build/bin/llvm-tblgen -gen-callingconv -I /Users/buildslave/jenkins/workspace/lldb-cmake/llvm-project/llvm/lib/Target/XCore -I/Users/buildslave/jenkins/workspace/lldb-cmake/lldb-build/include -I/Users/buildslave/jenkins/workspace/lldb-cmake/llvm-project/llvm/include -I /Users/buildslave/jenkins/workspace/lldb-cmake/llvm-project/llvm/lib/Target /Users/buildslave/jenkins/workspace/lldb-cmake/llvm-project/llvm/lib/Target/XCore/XCore.td --write-if-changed -o lib/Target/XCore/XCoreGenCallingConv.inc -d lib/Target/XCore/XCoreGenCallingConv.inc.d
[480/3304] cd /Users/buildslave/jenkins/workspace/lldb-cmake/lldb-build && /Users/buildslave/jenkins/workspace/lldb-cmake/lldb-build/bin/llvm-tblgen -gen-dag-isel -I /Users/buildslave/jenkins/workspace/lldb-cmake/llvm-project/llvm/lib/Target/XCore -I/Users/buildslave/jenkins/workspace/lldb-cmake/lldb-build/include -I/Users/buildslave/jenkins/workspace/lldb-cmake/llvm-project/llvm/include -I /Users/buildslave/jenkins/workspace/lldb-cmake/llvm-project/llvm/lib/Target -omit-comments /Users/buildslave/jenkins/workspace/lldb-cmake/llvm-project/llvm/lib/Target/XCore/XCore.td --write-if-changed -o lib/Target/XCore/XCoreGenDAGISel.inc -d lib/Target/XCore/XCoreGenDAGISel.inc.d
[481/3304] cd /Users/buildslave/jenkins/workspace/lldb-cmake/lldb-build && /Users/buildslave/jenkins/workspace/lldb-cmake/lldb-build/bin/llvm-tblgen -gen-disassembler -I /Users/buildslave/jenkins/workspace/lldb-cmake/llvm-project/llvm/lib/Target/XCore -I/Users/buildslave/jenkins/workspace/lldb-cmake/lldb-build/include -I/Users/buildslave/jenkins/workspace/lldb-cmake/llvm-project/llvm/include -I /Users/buildslave/jenkins/workspace/lldb-cmake/llvm-project/llvm/lib/Target /Users/buildslave/jenkins/workspace/lldb-cmake/llvm-project/llvm/lib/Target/XCore/XCore.td --write-if-changed -o lib/Target/XCore/XCoreGenDisassemblerTables.inc -d lib/Target/XCore/XCoreGenDisassemblerTables.inc.d
[482/3304] cd /Users/buildslave/jenkins/workspace/lldb-cmake/lldb-build && /Users/buildslave/jenkins/workspace/lldb-cmake/lldb-build/bin/llvm-tblgen -gen-register-info -I /Users/buildslave/jenkins/workspace/lldb-cmake/llvm-project/llvm/lib/Target/XCore -I/Users/buildslave/jenkins/workspace/lldb-cmake/lldb-build/include -I/Users/buildslave/jenkins/workspace/lldb-cmake/llvm-project/llvm/include -I /Users/buildslave/jenkins/workspace/lldb-cmake/llvm-project/llvm/lib/Target /Users/buildslave/jenkins/workspace/lldb-cmake/llvm-project/llvm/lib/Target/XCore/XCore.td --write-if-changed -o lib/Target/XCore/XCoreGenRegisterInfo.inc -d lib/Target/XCore/XCoreGenRegisterInfo.inc.d
[483/3304] /Users/buildslave/jenkins/workspace/lldb-cmake/host-compiler/bin/clang++  -DGTEST_HAS_RTTI=0 -D_DEBUG -D__STDC_CONSTANT_MACROS -D__STDC_FORMAT_MACROS -D__STDC_LIMIT_MACROS -Ilib/Target/ARM/Disassembler -I/Users/buildslave/jenkins/workspace/lldb-cmake/llvm-project/llvm/lib/Target/ARM/Disassembler -I/Users/buildslave/jenkins/workspace/lldb-cmake/llvm-project/llvm/lib/Target/ARM -Ilib/Target/ARM -Iinclude -I/Users/buildslave/jenkins/workspace/lldb-cmake/llvm-project/llvm/include -Wdocumentation -fPIC -fvisibility-inlines-hidden -Werror=date-time -Werror=unguarded-availability-new -fmodules -fmodules-cache-path=/Users/buildslave/jenkins/workspace/lldb-cmake/lldb-build/module.cache -fcxx-modules -Xclang -fmodules-local-submodule-visibility -Wall -Wextra -Wno-unused-parameter -Wwrite-strings -Wcast-qual -Wmissing-field-initializers -pedantic -Wno-long-long -Wimplicit-fallthrough -Wcovered-switch-default -Wno-noexcept-type -Wnon-virtual-dtor -Wdelete-non-virtual-dtor -Wsuggest-override -Wstring-conversion -fdiagnostics-color -O3  -isysroot /Applications/Xcode.app/Contents/Developer/Platforms/MacOSX.platform/Developer/SDKs/MacOSX10.15.sdk    -fno-exceptions -fno-rtti -UNDEBUG -std=c++14 -MD -MT lib/Target/ARM/Disassembler/CMakeFiles/LLVMARMDisassembler.dir/ARMDisassembler.cpp.o -MF lib/Target/ARM/Disassembler/CMakeFiles/LLVMARMDisassembler.dir/ARMDisassembler.cpp.o.d -o lib/Target/ARM/Disassembler/CMakeFiles/LLVMARMDisassembler.dir/ARMDisassembler.cpp.o -c /Users/buildslave/jenkins/workspace/lldb-cmake/llvm-project/llvm/lib/Target/ARM/Disassembler/ARMDisassembler.cpp
[484/3304] : && "/Applications/Xcode.app/Contents/Developer/Toolchains/XcodeDefault.xctoolchain/usr/bin/libtool" -static -no_warning_for_no_symbols -o lib/libLLVMARMDisassembler.a  lib/Target/ARM/Disassembler/CMakeFiles/LLVMARMDisassembler.dir/ARMDisassembler.cpp.o && :
[485/3304] cd /Users/buildslave/jenkins/workspace/lldb-cmake/lldb-build && /Users/buildslave/jenkins/workspace/lldb-cmake/lldb-build/bin/llvm-tblgen -gen-subtarget -I /Users/buildslave/jenkins/workspace/lldb-cmake/llvm-project/llvm/lib/Target/XCore -I/Users/buildslave/jenkins/workspace/lldb-cmake/lldb-build/include -I/Users/buildslave/jenkins/workspace/lldb-cmake/llvm-project/llvm/include -I /Users/buildslave/jenkins/workspace/lldb-cmake/llvm-project/llvm/lib/Target /Users/buildslave/jenkins/workspace/lldb-cmake/llvm-project/llvm/lib/Target/XCore/XCore.td --write-if-changed -o lib/Target/XCore/XCoreGenSubtargetInfo.inc -d lib/Target/XCore/XCoreGenSubtargetInfo.inc.d
[486/3304] cd /Users/buildslave/jenkins/workspace/lldb-cmake/lldb-build && /Users/buildslave/jenkins/workspace/lldb-cmake/lldb-build/bin/llvm-tblgen -gen-instr-info -I /Users/buildslave/jenkins/workspace/lldb-cmake/llvm-project/llvm/lib/Target/XCore -I/Users/buildslave/jenkins/workspace/lldb-cmake/lldb-build/include -I/Users/buildslave/jenkins/workspace/lldb-cmake/llvm-project/llvm/include -I /Users/buildslave/jenkins/workspace/lldb-cmake/llvm-project/llvm/lib/Target /Users/buildslave/jenkins/workspace/lldb-cmake/llvm-project/llvm/lib/Target/XCore/XCore.td --write-if-changed -o lib/Target/XCore/XCoreGenInstrInfo.inc -d lib/Target/XCore/XCoreGenInstrInfo.inc.d
[487/3288] : && "/Applications/Xcode.app/Contents/Developer/Toolchains/XcodeDefault.xctoolchain/usr/bin/libtool" -static -no_warning_for_no_symbols -o lib/libLLVMXCoreDisassembler.a  lib/Target/XCore/Disassembler/CMakeFiles/LLVMXCoreDisassembler.dir/XCoreDisassembler.cpp.o && :
[488/3288] cd /Users/buildslave/jenkins/workspace/lldb-cmake/lldb-build && /Users/buildslave/jenkins/workspace/lldb-cmake/lldb-build/bin/llvm-tblgen -gen-subtarget -I /Users/buildslave/jenkins/workspace/lldb-cmake/llvm-project/llvm/lib/Target/X86 -I/Users/buildslave/jenkins/workspace/lldb-cmake/lldb-build/include -I/Users/buildslave/jenkins/workspace/lldb-cmake/llvm-project/llvm/include -I /Users/buildslave/jenkins/workspace/lldb-cmake/llvm-project/llvm/lib/Target /Users/buildslave/jenkins/workspace/lldb-cmake/llvm-project/llvm/lib/Target/X86/X86.td --write-if-changed -o lib/Target/X86/X86GenSubtargetInfo.inc -d lib/Target/X86/X86GenSubtargetInfo.inc.d
[489/3288] cd /Users/buildslave/jenkins/workspace/lldb-cmake/lldb-build && /Users/buildslave/jenkins/workspace/lldb-cmake/lldb-build/bin/llvm-tblgen -gen-global-isel -I /Users/buildslave/jenkins/workspace/lldb-cmake/llvm-project/llvm/lib/Target/X86 -I/Users/buildslave/jenkins/workspace/lldb-cmake/lldb-build/include -I/Users/buildslave/jenkins/workspace/lldb-cmake/llvm-project/llvm/include -I /Users/buildslave/jenkins/workspace/lldb-cmake/llvm-project/llvm/lib/Target /Users/buildslave/jenkins/workspace/lldb-cmake/llvm-project/llvm/lib/Target/X86/X86.td --write-if-changed -o lib/Target/X86/X86GenGlobalISel.inc -d lib/Target/X86/X86GenGlobalISel.inc.d
[490/3288] /Users/buildslave/jenkins/workspace/lldb-cmake/host-compiler/bin/clang++  -DGTEST_HAS_RTTI=0 -D_DEBUG -D__STDC_CONSTANT_MACROS -D__STDC_FORMAT_MACROS -D__STDC_LIMIT_MACROS -Ilib/LineEditor -I/Users/buildslave/jenkins/workspace/lldb-cmake/llvm-project/llvm/lib/LineEditor -Iinclude -I/Users/buildslave/jenkins/workspace/lldb-cmake/llvm-project/llvm/include -Wdocumentation -fPIC -fvisibility-inlines-hidden -Werror=date-time -Werror=unguarded-availability-new -fmodules -fmodules-cache-path=/Users/buildslave/jenkins/workspace/lldb-cmake/lldb-build/module.cache -fcxx-modules -Xclang -fmodules-local-submodule-visibility -Wall -Wextra -Wno-unused-parameter -Wwrite-strings -Wcast-qual -Wmissing-field-initializers -pedantic -Wno-long-long -Wimplicit-fallthrough -Wcovered-switch-default -Wno-noexcept-type -Wnon-virtual-dtor -Wdelete-non-virtual-dtor -Wsuggest-override -Wstring-conversion -fdiagnostics-color -O3  -isysroot /Applications/Xcode.app/Contents/Developer/Platforms/MacOSX.platform/Developer/SDKs/MacOSX10.15.sdk    -fno-exceptions -fno-rtti -UNDEBUG -std=c++14 -MD -MT lib/LineEditor/CMakeFiles/LLVMLineEditor.dir/LineEditor.cpp.o -MF lib/LineEditor/CMakeFiles/LLVMLineEditor.dir/LineEditor.cpp.o.d -o lib/LineEditor/CMakeFiles/LLVMLineEditor.dir/LineEditor.cpp.o -c /Users/buildslave/jenkins/workspace/lldb-cmake/llvm-project/llvm/lib/LineEditor/LineEditor.cpp
[491/3288] : && "/Applications/Xcode.app/Contents/Developer/Toolchains/XcodeDefault.xctoolchain/usr/bin/libtool" -static -no_warning_for_no_symbols -o lib/libLLVMLineEditor.a  lib/LineEditor/CMakeFiles/LLVMLineEditor.dir/LineEditor.cpp.o && :
[492/3288] cd /Users/buildslave/jenkins/workspace/lldb-cmake/lldb-build && /Users/buildslave/jenkins/workspace/lldb-cmake/lldb-build/bin/llvm-tblgen -gen-fast-isel -I /Users/buildslave/jenkins/workspace/lldb-cmake/llvm-project/llvm/lib/Target/X86 -I/Users/buildslave/jenkins/workspace/lldb-cmake/lldb-build/include -I/Users/buildslave/jenkins/workspace/lldb-cmake/llvm-project/llvm/include -I /Users/buildslave/jenkins/workspace/lldb-cmake/llvm-project/llvm/lib/Target /Users/buildslave/jenkins/workspace/lldb-cmake/llvm-project/llvm/lib/Target/X86/X86.td --write-if-changed -o lib/Target/X86/X86GenFastISel.inc -d lib/Target/X86/X86GenFastISel.inc.d
[493/3288] /Users/buildslave/jenkins/workspace/lldb-cmake/host-compiler/bin/clang++  -DGTEST_HAS_RTTI=0 -D_DEBUG -D__STDC_CONSTANT_MACROS -D__STDC_FORMAT_MACROS -D__STDC_LIMIT_MACROS -Ilib/AsmParser -I/Users/buildslave/jenkins/workspace/lldb-cmake/llvm-project/llvm/lib/AsmParser -Iinclude -I/Users/buildslave/jenkins/workspace/lldb-cmake/llvm-project/llvm/include -Wdocumentation -fPIC -fvisibility-inlines-hidden -Werror=date-time -Werror=unguarded-availability-new -fmodules -fmodules-cache-path=/Users/buildslave/jenkins/workspace/lldb-cmake/lldb-build/module.cache -fcxx-modules -Xclang -fmodules-local-submodule-visibility -Wall -Wextra -Wno-unused-parameter -Wwrite-strings -Wcast-qual -Wmissing-field-initializers -pedantic -Wno-long-long -Wimplicit-fallthrough -Wcovered-switch-default -Wno-noexcept-type -Wnon-virtual-dtor -Wdelete-non-virtual-dtor -Wsuggest-override -Wstring-conversion -fdiagnostics-color -O3  -isysroot /Applications/Xcode.app/Contents/Developer/Platforms/MacOSX.platform/Developer/SDKs/MacOSX10.15.sdk    -fno-exceptions -fno-rtti -UNDEBUG -std=c++14 -MD -MT lib/AsmParser/CMakeFiles/LLVMAsmParser.dir/LLLexer.cpp.o -MF lib/AsmParser/CMakeFiles/LLVMAsmParser.dir/LLLexer.cpp.o.d -o lib/AsmParser/CMakeFiles/LLVMAsmParser.dir/LLLexer.cpp.o -c /Users/buildslave/jenkins/workspace/lldb-cmake/llvm-project/llvm/lib/AsmParser/LLLexer.cpp
[494/3288] /Users/buildslave/jenkins/workspace/lldb-cmake/host-compiler/bin/clang++  -DGTEST_HAS_RTTI=0 -D_DEBUG -D__STDC_CONSTANT_MACROS -D__STDC_FORMAT_MACROS -D__STDC_LIMIT_MACROS -Ilib/AsmParser -I/Users/buildslave/jenkins/workspace/lldb-cmake/llvm-project/llvm/lib/AsmParser -Iinclude -I/Users/buildslave/jenkins/workspace/lldb-cmake/llvm-project/llvm/include -Wdocumentation -fPIC -fvisibility-inlines-hidden -Werror=date-time -Werror=unguarded-availability-new -fmodules -fmodules-cache-path=/Users/buildslave/jenkins/workspace/lldb-cmake/lldb-build/module.cache -fcxx-modules -Xclang -fmodules-local-submodule-visibility -Wall -Wextra -Wno-unused-parameter -Wwrite-strings -Wcast-qual -Wmissing-field-initializers -pedantic -Wno-long-long -Wimplicit-fallthrough -Wcovered-switch-default -Wno-noexcept-type -Wnon-virtual-dtor -Wdelete-non-virtual-dtor -Wsuggest-override -Wstring-conversion -fdiagnostics-color -O3  -isysroot /Applications/Xcode.app/Contents/Developer/Platforms/MacOSX.platform/Developer/SDKs/MacOSX10.15.sdk    -fno-exceptions -fno-rtti -UNDEBUG -std=c++14 -MD -MT lib/AsmParser/CMakeFiles/LLVMAsmParser.dir/Parser.cpp.o -MF lib/AsmParser/CMakeFiles/LLVMAsmParser.dir/Parser.cpp.o.d -o lib/AsmParser/CMakeFiles/LLVMAsmParser.dir/Parser.cpp.o -c /Users/buildslave/jenkins/workspace/lldb-cmake/llvm-project/llvm/lib/AsmParser/Parser.cpp
[495/3288] cd /Users/buildslave/jenkins/workspace/lldb-cmake/lldb-build && /Users/buildslave/jenkins/workspace/lldb-cmake/lldb-build/bin/llvm-tblgen -gen-dag-isel -I /Users/buildslave/jenkins/workspace/lldb-cmake/llvm-project/llvm/lib/Target/X86 -I/Users/buildslave/jenkins/workspace/lldb-cmake/lldb-build/include -I/Users/buildslave/jenkins/workspace/lldb-cmake/llvm-project/llvm/include -I /Users/buildslave/jenkins/workspace/lldb-cmake/llvm-project/llvm/lib/Target -omit-comments /Users/buildslave/jenkins/workspace/lldb-cmake/llvm-project/llvm/lib/Target/X86/X86.td --write-if-changed -o lib/Target/X86/X86GenDAGISel.inc -d lib/Target/X86/X86GenDAGISel.inc.d
[496/3288] /Users/buildslave/jenkins/workspace/lldb-cmake/host-compiler/bin/clang++  -DGTEST_HAS_RTTI=0 -D_DEBUG -D__STDC_CONSTANT_MACROS -D__STDC_FORMAT_MACROS -D__STDC_LIMIT_MACROS -Ilib/Target/ARM/AsmParser -I/Users/buildslave/jenkins/workspace/lldb-cmake/llvm-project/llvm/lib/Target/ARM/AsmParser -I/Users/buildslave/jenkins/workspace/lldb-cmake/llvm-project/llvm/lib/Target/ARM -Ilib/Target/ARM -Iinclude -I/Users/buildslave/jenkins/workspace/lldb-cmake/llvm-project/llvm/include -Wdocumentation -fPIC -fvisibility-inlines-hidden -Werror=date-time -Werror=unguarded-availability-new -fmodules -fmodules-cache-path=/Users/buildslave/jenkins/workspace/lldb-cmake/lldb-build/module.cache -fcxx-modules -Xclang -fmodules-local-submodule-visibility -Wall -Wextra -Wno-unused-parameter -Wwrite-strings -Wcast-qual -Wmissing-field-initializers -pedantic -Wno-long-long -Wimplicit-fallthrough -Wcovered-switch-default -Wno-noexcept-type -Wnon-virtual-dtor -Wdelete-non-virtual-dtor -Wsuggest-override -Wstring-conversion -fdiagnostics-color -O3  -isysroot /Applications/Xcode.app/Contents/Developer/Platforms/MacOSX.platform/Developer/SDKs/MacOSX10.15.sdk    -fno-exceptions -fno-rtti -UNDEBUG -std=c++14 -MD -MT lib/Target/ARM/AsmParser/CMakeFiles/LLVMARMAsmParser.dir/ARMAsmParser.cpp.o -MF lib/Target/ARM/AsmParser/CMakeFiles/LLVMARMAsmParser.dir/ARMAsmParser.cpp.o.d -o lib/Target/ARM/AsmParser/CMakeFiles/LLVMARMAsmParser.dir/ARMAsmParser.cpp.o -c /Users/buildslave/jenkins/workspace/lldb-cmake/llvm-project/llvm/lib/Target/ARM/AsmParser/ARMAsmParser.cpp
[497/3288] : && "/Applications/Xcode.app/Contents/Developer/Toolchains/XcodeDefault.xctoolchain/usr/bin/libtool" -static -no_warning_for_no_symbols -o lib/libLLVMARMAsmParser.a  lib/Target/ARM/AsmParser/CMakeFiles/LLVMARMAsmParser.dir/ARMAsmParser.cpp.o && :
[498/3288] cd /Users/buildslave/jenkins/workspace/lldb-cmake/lldb-build && /Users/buildslave/jenkins/workspace/lldb-cmake/lldb-build/bin/llvm-tblgen -gen-instr-info -I /Users/buildslave/jenkins/workspace/lldb-cmake/llvm-project/llvm/lib/Target/X86 -I/Users/buildslave/jenkins/workspace/lldb-cmake/lldb-build/include -I/Users/buildslave/jenkins/workspace/lldb-cmake/llvm-project/llvm/include -I /Users/buildslave/jenkins/workspace/lldb-cmake/llvm-project/llvm/lib/Target /Users/buildslave/jenkins/workspace/lldb-cmake/llvm-project/llvm/lib/Target/X86/X86.td --write-if-changed -o lib/Target/X86/X86GenInstrInfo.inc -d lib/Target/X86/X86GenInstrInfo.inc.d
[499/3225] /Users/buildslave/jenkins/workspace/lldb-cmake/host-compiler/bin/clang++  -DGTEST_HAS_RTTI=0 -D_DEBUG -D__STDC_CONSTANT_MACROS -D__STDC_FORMAT_MACROS -D__STDC_LIMIT_MACROS -Ilib/ProfileData -I/Users/buildslave/jenkins/workspace/lldb-cmake/llvm-project/llvm/lib/ProfileData -Iinclude -I/Users/buildslave/jenkins/workspace/lldb-cmake/llvm-project/llvm/include -Wdocumentation -fPIC -fvisibility-inlines-hidden -Werror=date-time -Werror=unguarded-availability-new -fmodules -fmodules-cache-path=/Users/buildslave/jenkins/workspace/lldb-cmake/lldb-build/module.cache -fcxx-modules -Xclang -fmodules-local-submodule-visibility -Wall -Wextra -Wno-unused-parameter -Wwrite-strings -Wcast-qual -Wmissing-field-initializers -pedantic -Wno-long-long -Wimplicit-fallthrough -Wcovered-switch-default -Wno-noexcept-type -Wnon-virtual-dtor -Wdelete-non-virtual-dtor -Wsuggest-override -Wstring-conversion -fdiagnostics-color -O3  -isysroot /Applications/Xcode.app/Contents/Developer/Platforms/MacOSX.platform/Developer/SDKs/MacOSX10.15.sdk    -fno-exceptions -fno-rtti -UNDEBUG -std=c++14 -MD -MT lib/ProfileData/CMakeFiles/LLVMProfileData.dir/ProfileSummaryBuilder.cpp.o -MF lib/ProfileData/CMakeFiles/LLVMProfileData.dir/ProfileSummaryBuilder.cpp.o.d -o lib/ProfileData/CMakeFiles/LLVMProfileData.dir/ProfileSummaryBuilder.cpp.o -c /Users/buildslave/jenkins/workspace/lldb-cmake/llvm-project/llvm/lib/ProfileData/ProfileSummaryBuilder.cpp
[500/3225] : && "/Applications/Xcode.app/Contents/Developer/Toolchains/XcodeDefault.xctoolchain/usr/bin/libtool" -static -no_warning_for_no_symbols -o lib/libLLVMX86Desc.a  lib/Target/X86/MCTargetDesc/CMakeFiles/LLVMX86Desc.dir/X86ATTInstPrinter.cpp.o lib/Target/X86/MCTargetDesc/CMakeFiles/LLVMX86Desc.dir/X86IntelInstPrinter.cpp.o lib/Target/X86/MCTargetDesc/CMakeFiles/LLVMX86Desc.dir/X86InstComments.cpp.o lib/Target/X86/MCTargetDesc/CMakeFiles/LLVMX86Desc.dir/X86InstPrinterCommon.cpp.o lib/Target/X86/MCTargetDesc/CMakeFiles/LLVMX86Desc.dir/X86ShuffleDecode.cpp.o lib/Target/X86/MCTargetDesc/CMakeFiles/LLVMX86Desc.dir/X86AsmBackend.cpp.o lib/Target/X86/MCTargetDesc/CMakeFiles/LLVMX86Desc.dir/X86MCTargetDesc.cpp.o lib/Target/X86/MCTargetDesc/CMakeFiles/LLVMX86Desc.dir/X86MCAsmInfo.cpp.o lib/Target/X86/MCTargetDesc/CMakeFiles/LLVMX86Desc.dir/X86MCCodeEmitter.cpp.o lib/Target/X86/MCTargetDesc/CMakeFiles/LLVMX86Desc.dir/X86MachObjectWriter.cpp.o lib/Target/X86/MCTargetDesc/CMakeFiles/LLVMX86Desc.dir/X86ELFObjectWriter.cpp.o lib/Target/X86/MCTargetDesc/CMakeFiles/LLVMX86Desc.dir/X86WinCOFFObjectWriter.cpp.o lib/Target/X86/MCTargetDesc/CMakeFiles/LLVMX86Desc.dir/X86WinCOFFStreamer.cpp.o lib/Target/X86/MCTargetDesc/CMakeFiles/LLVMX86Desc.dir/X86WinCOFFTargetStreamer.cpp.o && :
[501/3225] : && "/Applications/Xcode.app/Contents/Developer/Toolchains/XcodeDefault.xctoolchain/usr/bin/libtool" -static -no_warning_for_no_symbols -o lib/libLLVMX86AsmParser.a  lib/Target/X86/AsmParser/CMakeFiles/LLVMX86AsmParser.dir/X86AsmParser.cpp.o && :
[502/3225] /Users/buildslave/jenkins/workspace/lldb-cmake/host-compiler/bin/clang++  -DGTEST_HAS_RTTI=0 -D_DEBUG -D__STDC_CONSTANT_MACROS -D__STDC_FORMAT_MACROS -D__STDC_LIMIT_MACROS -Ilib/Target/X86 -I/Users/buildslave/jenkins/workspace/lldb-cmake/llvm-project/llvm/lib/Target/X86 -Iinclude -I/Users/buildslave/jenkins/workspace/lldb-cmake/llvm-project/llvm/include -Wdocumentation -fPIC -fvisibility-inlines-hidden -Werror=date-time -Werror=unguarded-availability-new -fmodules -fmodules-cache-path=/Users/buildslave/jenkins/workspace/lldb-cmake/lldb-build/module.cache -fcxx-modules -Xclang -fmodules-local-submodule-visibility -Wall -Wextra -Wno-unused-parameter -Wwrite-strings -Wcast-qual -Wmissing-field-initializers -pedantic -Wno-long-long -Wimplicit-fallthrough -Wcovered-switch-default -Wno-noexcept-type -Wnon-virtual-dtor -Wdelete-non-virtual-dtor -Wsuggest-override -Wstring-conversion -fdiagnostics-color -O3  -isysroot /Applications/Xcode.app/Contents/Developer/Platforms/MacOSX.platform/Developer/SDKs/MacOSX10.15.sdk    -fno-exceptions -fno-rtti -UNDEBUG -std=c++14 -MD -MT lib/Target/X86/CMakeFiles/LLVMX86CodeGen.dir/X86ShuffleDecodeConstantPool.cpp.o -MF lib/Target/X86/CMakeFiles/LLVMX86CodeGen.dir/X86ShuffleDecodeConstantPool.cpp.o.d -o lib/Target/X86/CMakeFiles/LLVMX86CodeGen.dir/X86ShuffleDecodeConstantPool.cpp.o -c /Users/buildslave/jenkins/workspace/lldb-cmake/llvm-project/llvm/lib/Target/X86/X86ShuffleDecodeConstantPool.cpp
[503/3225] /Users/buildslave/jenkins/workspace/lldb-cmake/host-compiler/bin/clang++  -DGTEST_HAS_RTTI=0 -D_DEBUG -D__STDC_CONSTANT_MACROS -D__STDC_FORMAT_MACROS -D__STDC_LIMIT_MACROS -Ilib/ProfileData -I/Users/buildslave/jenkins/workspace/lldb-cmake/llvm-project/llvm/lib/ProfileData -Iinclude -I/Users/buildslave/jenkins/workspace/lldb-cmake/llvm-project/llvm/include -Wdocumentation -fPIC -fvisibility-inlines-hidden -Werror=date-time -Werror=unguarded-availability-new -fmodules -fmodules-cache-path=/Users/buildslave/jenkins/workspace/lldb-cmake/lldb-build/module.cache -fcxx-modules -Xclang -fmodules-local-submodule-visibility -Wall -Wextra -Wno-unused-parameter -Wwrite-strings -Wcast-qual -Wmissing-field-initializers -pedantic -Wno-long-long -Wimplicit-fallthrough -Wcovered-switch-default -Wno-noexcept-type -Wnon-virtual-dtor -Wdelete-non-virtual-dtor -Wsuggest-override -Wstring-conversion -fdiagnostics-color -O3  -isysroot /Applications/Xcode.app/Contents/Developer/Platforms/MacOSX.platform/Developer/SDKs/MacOSX10.15.sdk    -fno-exceptions -fno-rtti -UNDEBUG -std=c++14 -MD -MT lib/ProfileData/CMakeFiles/LLVMProfileData.dir/SampleProf.cpp.o -MF lib/ProfileData/CMakeFiles/LLVMProfileData.dir/SampleProf.cpp.o.d -o lib/ProfileData/CMakeFiles/LLVMProfileData.dir/SampleProf.cpp.o -c /Users/buildslave/jenkins/workspace/lldb-cmake/llvm-project/llvm/lib/ProfileData/SampleProf.cpp
[504/3225] /Users/buildslave/jenkins/workspace/lldb-cmake/host-compiler/bin/clang++  -DGTEST_HAS_RTTI=0 -D_DEBUG -D__STDC_CONSTANT_MACROS -D__STDC_FORMAT_MACROS -D__STDC_LIMIT_MACROS -Ilib/ProfileData -I/Users/buildslave/jenkins/workspace/lldb-cmake/llvm-project/llvm/lib/ProfileData -Iinclude -I/Users/buildslave/jenkins/workspace/lldb-cmake/llvm-project/llvm/include -Wdocumentation -fPIC -fvisibility-inlines-hidden -Werror=date-time -Werror=unguarded-availability-new -fmodules -fmodules-cache-path=/Users/buildslave/jenkins/workspace/lldb-cmake/lldb-build/module.cache -fcxx-modules -Xclang -fmodules-local-submodule-visibility -Wall -Wextra -Wno-unused-parameter -Wwrite-strings -Wcast-qual -Wmissing-field-initializers -pedantic -Wno-long-long -Wimplicit-fallthrough -Wcovered-switch-default -Wno-noexcept-type -Wnon-virtual-dtor -Wdelete-non-virtual-dtor -Wsuggest-override -Wstring-conversion -fdiagnostics-color -O3  -isysroot /Applications/Xcode.app/Contents/Developer/Platforms/MacOSX.platform/Developer/SDKs/MacOSX10.15.sdk    -fno-exceptions -fno-rtti -UNDEBUG -std=c++14 -MD -MT lib/ProfileData/CMakeFiles/LLVMProfileData.dir/GCOV.cpp.o -MF lib/ProfileData/CMakeFiles/LLVMProfileData.dir/GCOV.cpp.o.d -o lib/ProfileData/CMakeFiles/LLVMProfileData.dir/GCOV.cpp.o -c /Users/buildslave/jenkins/workspace/lldb-cmake/llvm-project/llvm/lib/ProfileData/GCOV.cpp
[505/3225] /Users/buildslave/jenkins/workspace/lldb-cmake/host-compiler/bin/clang++  -DGTEST_HAS_RTTI=0 -D_DEBUG -D__STDC_CONSTANT_MACROS -D__STDC_FORMAT_MACROS -D__STDC_LIMIT_MACROS -Ilib/ProfileData -I/Users/buildslave/jenkins/workspace/lldb-cmake/llvm-project/llvm/lib/ProfileData -Iinclude -I/Users/buildslave/jenkins/workspace/lldb-cmake/llvm-project/llvm/include -Wdocumentation -fPIC -fvisibility-inlines-hidden -Werror=date-time -Werror=unguarded-availability-new -fmodules -fmodules-cache-path=/Users/buildslave/jenkins/workspace/lldb-cmake/lldb-build/module.cache -fcxx-modules -Xclang -fmodules-local-submodule-visibility -Wall -Wextra -Wno-unused-parameter -Wwrite-strings -Wcast-qual -Wmissing-field-initializers -pedantic -Wno-long-long -Wimplicit-fallthrough -Wcovered-switch-default -Wno-noexcept-type -Wnon-virtual-dtor -Wdelete-non-virtual-dtor -Wsuggest-override -Wstring-conversion -fdiagnostics-color -O3  -isysroot /Applications/Xcode.app/Contents/Developer/Platforms/MacOSX.platform/Developer/SDKs/MacOSX10.15.sdk    -fno-exceptions -fno-rtti -UNDEBUG -std=c++14 -MD -MT lib/ProfileData/CMakeFiles/LLVMProfileData.dir/InstrProfWriter.cpp.o -MF lib/ProfileData/CMakeFiles/LLVMProfileData.dir/InstrProfWriter.cpp.o.d -o lib/ProfileData/CMakeFiles/LLVMProfileData.dir/InstrProfWriter.cpp.o -c /Users/buildslave/jenkins/workspace/lldb-cmake/llvm-project/llvm/lib/ProfileData/InstrProfWriter.cpp
[506/3225] /Users/buildslave/jenkins/workspace/lldb-cmake/host-compiler/bin/clang++  -DGTEST_HAS_RTTI=0 -D_DEBUG -D__STDC_CONSTANT_MACROS -D__STDC_FORMAT_MACROS -D__STDC_LIMIT_MACROS -Ilib/Passes -I/Users/buildslave/jenkins/workspace/lldb-cmake/llvm-project/llvm/lib/Passes -Iinclude -I/Users/buildslave/jenkins/workspace/lldb-cmake/llvm-project/llvm/include -Wdocumentation -fPIC -fvisibility-inlines-hidden -Werror=date-time -Werror=unguarded-availability-new -fmodules -fmodules-cache-path=/Users/buildslave/jenkins/workspace/lldb-cmake/lldb-build/module.cache -fcxx-modules -Xclang -fmodules-local-submodule-visibility -Wall -Wextra -Wno-unused-parameter -Wwrite-strings -Wcast-qual -Wmissing-field-initializers -pedantic -Wno-long-long -Wimplicit-fallthrough -Wcovered-switch-default -Wno-noexcept-type -Wnon-virtual-dtor -Wdelete-non-virtual-dtor -Wsuggest-override -Wstring-conversion -fdiagnostics-color -O3  -isysroot /Applications/Xcode.app/Contents/Developer/Platforms/MacOSX.platform/Developer/SDKs/MacOSX10.15.sdk    -fno-exceptions -fno-rtti -UNDEBUG -std=c++14 -MD -MT lib/Passes/CMakeFiles/LLVMPasses.dir/PassPlugin.cpp.o -MF lib/Passes/CMakeFiles/LLVMPasses.dir/PassPlugin.cpp.o.d -o lib/Passes/CMakeFiles/LLVMPasses.dir/PassPlugin.cpp.o -c /Users/buildslave/jenkins/workspace/lldb-cmake/llvm-project/llvm/lib/Passes/PassPlugin.cpp
[507/3225] /Users/buildslave/jenkins/workspace/lldb-cmake/host-compiler/bin/clang++  -DGTEST_HAS_RTTI=0 -D_DEBUG -D__STDC_CONSTANT_MACROS -D__STDC_FORMAT_MACROS -D__STDC_LIMIT_MACROS -Ilib/ProfileData -I/Users/buildslave/jenkins/workspace/lldb-cmake/llvm-project/llvm/lib/ProfileData -Iinclude -I/Users/buildslave/jenkins/workspace/lldb-cmake/llvm-project/llvm/include -Wdocumentation -fPIC -fvisibility-inlines-hidden -Werror=date-time -Werror=unguarded-availability-new -fmodules -fmodules-cache-path=/Users/buildslave/jenkins/workspace/lldb-cmake/lldb-build/module.cache -fcxx-modules -Xclang -fmodules-local-submodule-visibility -Wall -Wextra -Wno-unused-parameter -Wwrite-strings -Wcast-qual -Wmissing-field-initializers -pedantic -Wno-long-long -Wimplicit-fallthrough -Wcovered-switch-default -Wno-noexcept-type -Wnon-virtual-dtor -Wdelete-non-virtual-dtor -Wsuggest-override -Wstring-conversion -fdiagnostics-color -O3  -isysroot /Applications/Xcode.app/Contents/Developer/Platforms/MacOSX.platform/Developer/SDKs/MacOSX10.15.sdk    -fno-exceptions -fno-rtti -UNDEBUG -std=c++14 -MD -MT lib/ProfileData/CMakeFiles/LLVMProfileData.dir/InstrProf.cpp.o -MF lib/ProfileData/CMakeFiles/LLVMProfileData.dir/InstrProf.cpp.o.d -o lib/ProfileData/CMakeFiles/LLVMProfileData.dir/InstrProf.cpp.o -c /Users/buildslave/jenkins/workspace/lldb-cmake/llvm-project/llvm/lib/ProfileData/InstrProf.cpp
[508/3225] : && "/Applications/Xcode.app/Contents/Developer/Toolchains/XcodeDefault.xctoolchain/usr/bin/libtool" -static -no_warning_for_no_symbols -o lib/libLLVMTextAPI.a  lib/TextAPI/CMakeFiles/LLVMTextAPI.dir/MachO/Architecture.cpp.o lib/TextAPI/CMakeFiles/LLVMTextAPI.dir/MachO/ArchitectureSet.cpp.o lib/TextAPI/CMakeFiles/LLVMTextAPI.dir/MachO/InterfaceFile.cpp.o lib/TextAPI/CMakeFiles/LLVMTextAPI.dir/MachO/PackedVersion.cpp.o lib/TextAPI/CMakeFiles/LLVMTextAPI.dir/MachO/Platform.cpp.o lib/TextAPI/CMakeFiles/LLVMTextAPI.dir/MachO/Symbol.cpp.o lib/TextAPI/CMakeFiles/LLVMTextAPI.dir/MachO/Target.cpp.o lib/TextAPI/CMakeFiles/LLVMTextAPI.dir/MachO/TextStub.cpp.o lib/TextAPI/CMakeFiles/LLVMTextAPI.dir/MachO/TextStubCommon.cpp.o && :
[509/3225] : && "/Applications/Xcode.app/Contents/Developer/Toolchains/XcodeDefault.xctoolchain/usr/bin/libtool" -static -no_warning_for_no_symbols -o lib/libLLVMObject.a  lib/Object/CMakeFiles/LLVMObject.dir/Archive.cpp.o lib/Object/CMakeFiles/LLVMObject.dir/ArchiveWriter.cpp.o lib/Object/CMakeFiles/LLVMObject.dir/Binary.cpp.o lib/Object/CMakeFiles/LLVMObject.dir/COFFImportFile.cpp.o lib/Object/CMakeFiles/LLVMObject.dir/COFFModuleDefinition.cpp.o lib/Object/CMakeFiles/LLVMObject.dir/COFFObjectFile.cpp.o lib/Object/CMakeFiles/LLVMObject.dir/Decompressor.cpp.o lib/Object/CMakeFiles/LLVMObject.dir/ELF.cpp.o lib/Object/CMakeFiles/LLVMObject.dir/ELFObjectFile.cpp.o lib/Object/CMakeFiles/LLVMObject.dir/Error.cpp.o lib/Object/CMakeFiles/LLVMObject.dir/IRObjectFile.cpp.o lib/Object/CMakeFiles/LLVMObject.dir/IRSymtab.cpp.o lib/Object/CMakeFiles/LLVMObject.dir/MachOObjectFile.cpp.o lib/Object/CMakeFiles/LLVMObject.dir/MachOUniversal.cpp.o lib/Object/CMakeFiles/LLVMObject.dir/Minidump.cpp.o lib/Object/CMakeFiles/LLVMObject.dir/ModuleSymbolTable.cpp.o lib/Object/CMakeFiles/LLVMObject.dir/Object.cpp.o lib/Object/CMakeFiles/LLVMObject.dir/ObjectFile.cpp.o lib/Object/CMakeFiles/LLVMObject.dir/RecordStreamer.cpp.o lib/Object/CMakeFiles/LLVMObject.dir/RelocationResolver.cpp.o lib/Object/CMakeFiles/LLVMObject.dir/SymbolicFile.cpp.o lib/Object/CMakeFiles/LLVMObject.dir/SymbolSize.cpp.o lib/Object/CMakeFiles/LLVMObject.dir/TapiFile.cpp.o lib/Object/CMakeFiles/LLVMObject.dir/TapiUniversal.cpp.o lib/Object/CMakeFiles/LLVMObject.dir/MachOUniversalWriter.cpp.o lib/Object/CMakeFiles/LLVMObject.dir/WasmObjectFile.cpp.o lib/Object/CMakeFiles/LLVMObject.dir/WindowsMachineFlag.cpp.o lib/Object/CMakeFiles/LLVMObject.dir/WindowsResource.cpp.o lib/Object/CMakeFiles/LLVMObject.dir/XCOFFObjectFile.cpp.o && :
[510/3225] : && "/Applications/Xcode.app/Contents/Developer/Toolchains/XcodeDefault.xctoolchain/usr/bin/libtool" -static -no_warning_for_no_symbols -o lib/libLLVMInterfaceStub.a  lib/InterfaceStub/CMakeFiles/LLVMInterfaceStub.dir/ELFObjHandler.cpp.o lib/InterfaceStub/CMakeFiles/LLVMInterfaceStub.dir/ELFStub.cpp.o lib/InterfaceStub/CMakeFiles/LLVMInterfaceStub.dir/TBEHandler.cpp.o && :
[511/3225] /Users/buildslave/jenkins/workspace/lldb-cmake/host-compiler/bin/clang++  -DGTEST_HAS_RTTI=0 -D_DEBUG -D__STDC_CONSTANT_MACROS -D__STDC_FORMAT_MACROS -D__STDC_LIMIT_MACROS -Ilib/ProfileData/Coverage -I/Users/buildslave/jenkins/workspace/lldb-cmake/llvm-project/llvm/lib/ProfileData/Coverage -Iinclude -I/Users/buildslave/jenkins/workspace/lldb-cmake/llvm-project/llvm/include -Wdocumentation -fPIC -fvisibility-inlines-hidden -Werror=date-time -Werror=unguarded-availability-new -fmodules -fmodules-cache-path=/Users/buildslave/jenkins/workspace/lldb-cmake/lldb-build/module.cache -fcxx-modules -Xclang -fmodules-local-submodule-visibility -Wall -Wextra -Wno-unused-parameter -Wwrite-strings -Wcast-qual -Wmissing-field-initializers -pedantic -Wno-long-long -Wimplicit-fallthrough -Wcovered-switch-default -Wno-noexcept-type -Wnon-virtual-dtor -Wdelete-non-virtual-dtor -Wsuggest-override -Wstring-conversion -fdiagnostics-color -O3  -isysroot /Applications/Xcode.app/Contents/Developer/Platforms/MacOSX.platform/Developer/SDKs/MacOSX10.15.sdk    -fno-exceptions -fno-rtti -UNDEBUG -std=c++14 -MD -MT lib/ProfileData/Coverage/CMakeFiles/LLVMCoverage.dir/CoverageMappingWriter.cpp.o -MF lib/ProfileData/Coverage/CMakeFiles/LLVMCoverage.dir/CoverageMappingWriter.cpp.o.d -o lib/ProfileData/Coverage/CMakeFiles/LLVMCoverage.dir/CoverageMappingWriter.cpp.o -c /Users/buildslave/jenkins/workspace/lldb-cmake/llvm-project/llvm/lib/ProfileData/Coverage/CoverageMappingWriter.cpp
[512/3225] : && "/Applications/Xcode.app/Contents/Developer/Toolchains/XcodeDefault.xctoolchain/usr/bin/libtool" -static -no_warning_for_no_symbols -o lib/libLLVMDebugInfoDWARF.a  lib/DebugInfo/DWARF/CMakeFiles/LLVMDebugInfoDWARF.dir/DWARFAbbreviationDeclaration.cpp.o lib/DebugInfo/DWARF/CMakeFiles/LLVMDebugInfoDWARF.dir/DWARFAddressRange.cpp.o lib/DebugInfo/DWARF/CMakeFiles/LLVMDebugInfoDWARF.dir/DWARFAcceleratorTable.cpp.o lib/DebugInfo/DWARF/CMakeFiles/LLVMDebugInfoDWARF.dir/DWARFCompileUnit.cpp.o lib/DebugInfo/DWARF/CMakeFiles/LLVMDebugInfoDWARF.dir/DWARFContext.cpp.o lib/DebugInfo/DWARF/CMakeFiles/LLVMDebugInfoDWARF.dir/DWARFDataExtractor.cpp.o lib/DebugInfo/DWARF/CMakeFiles/LLVMDebugInfoDWARF.dir/DWARFDebugAbbrev.cpp.o lib/DebugInfo/DWARF/CMakeFiles/LLVMDebugInfoDWARF.dir/DWARFDebugAddr.cpp.o lib/DebugInfo/DWARF/CMakeFiles/LLVMDebugInfoDWARF.dir/DWARFDebugArangeSet.cpp.o lib/DebugInfo/DWARF/CMakeFiles/LLVMDebugInfoDWARF.dir/DWARFDebugAranges.cpp.o lib/DebugInfo/DWARF/CMakeFiles/LLVMDebugInfoDWARF.dir/DWARFDebugFrame.cpp.o lib/DebugInfo/DWARF/CMakeFiles/LLVMDebugInfoDWARF.dir/DWARFDebugInfoEntry.cpp.o lib/DebugInfo/DWARF/CMakeFiles/LLVMDebugInfoDWARF.dir/DWARFDebugLine.cpp.o lib/DebugInfo/DWARF/CMakeFiles/LLVMDebugInfoDWARF.dir/DWARFDebugLoc.cpp.o lib/DebugInfo/DWARF/CMakeFiles/LLVMDebugInfoDWARF.dir/DWARFDebugMacro.cpp.o lib/DebugInfo/DWARF/CMakeFiles/LLVMDebugInfoDWARF.dir/DWARFDebugPubTable.cpp.o lib/DebugInfo/DWARF/CMakeFiles/LLVMDebugInfoDWARF.dir/DWARFDebugRangeList.cpp.o lib/DebugInfo/DWARF/CMakeFiles/LLVMDebugInfoDWARF.dir/DWARFDebugRnglists.cpp.o lib/DebugInfo/DWARF/CMakeFiles/LLVMDebugInfoDWARF.dir/DWARFDie.cpp.o lib/DebugInfo/DWARF/CMakeFiles/LLVMDebugInfoDWARF.dir/DWARFExpression.cpp.o lib/DebugInfo/DWARF/CMakeFiles/LLVMDebugInfoDWARF.dir/DWARFFormValue.cpp.o lib/DebugInfo/DWARF/CMakeFiles/LLVMDebugInfoDWARF.dir/DWARFGdbIndex.cpp.o lib/DebugInfo/DWARF/CMakeFiles/LLVMDebugInfoDWARF.dir/DWARFListTable.cpp.o lib/DebugInfo/DWARF/CMakeFiles/LLVMDebugInfoDWARF.dir/DWARFLocationExpression.cpp.o lib/DebugInfo/DWARF/CMakeFiles/LLVMDebugInfoDWARF.dir/DWARFTypeUnit.cpp.o lib/DebugInfo/DWARF/CMakeFiles/LLVMDebugInfoDWARF.dir/DWARFUnitIndex.cpp.o lib/DebugInfo/DWARF/CMakeFiles/LLVMDebugInfoDWARF.dir/DWARFUnit.cpp.o lib/DebugInfo/DWARF/CMakeFiles/LLVMDebugInfoDWARF.dir/DWARFVerifier.cpp.o && :
[513/3225] : && "/Applications/Xcode.app/Contents/Developer/Toolchains/XcodeDefault.xctoolchain/usr/bin/libtool" -static -no_warning_for_no_symbols -o lib/libLLVMDebugInfoGSYM.a  lib/DebugInfo/GSYM/CMakeFiles/LLVMDebugInfoGSYM.dir/DwarfTransformer.cpp.o lib/DebugInfo/GSYM/CMakeFiles/LLVMDebugInfoGSYM.dir/Header.cpp.o lib/DebugInfo/GSYM/CMakeFiles/LLVMDebugInfoGSYM.dir/FileWriter.cpp.o lib/DebugInfo/GSYM/CMakeFiles/LLVMDebugInfoGSYM.dir/FunctionInfo.cpp.o lib/DebugInfo/GSYM/CMakeFiles/LLVMDebugInfoGSYM.dir/GsymCreator.cpp.o lib/DebugInfo/GSYM/CMakeFiles/LLVMDebugInfoGSYM.dir/GsymReader.cpp.o lib/DebugInfo/GSYM/CMakeFiles/LLVMDebugInfoGSYM.dir/InlineInfo.cpp.o lib/DebugInfo/GSYM/CMakeFiles/LLVMDebugInfoGSYM.dir/LineTable.cpp.o lib/DebugInfo/GSYM/CMakeFiles/LLVMDebugInfoGSYM.dir/LookupResult.cpp.o lib/DebugInfo/GSYM/CMakeFiles/LLVMDebugInfoGSYM.dir/ObjectFileTransformer.cpp.o lib/DebugInfo/GSYM/CMakeFiles/LLVMDebugInfoGSYM.dir/Range.cpp.o && :
[514/3225] /Users/buildslave/jenkins/workspace/lldb-cmake/host-compiler/bin/clang++  -DGTEST_HAS_RTTI=0 -D_DEBUG -D__STDC_CONSTANT_MACROS -D__STDC_FORMAT_MACROS -D__STDC_LIMIT_MACROS -Ilib/ProfileData -I/Users/buildslave/jenkins/workspace/lldb-cmake/llvm-project/llvm/lib/ProfileData -Iinclude -I/Users/buildslave/jenkins/workspace/lldb-cmake/llvm-project/llvm/include -Wdocumentation -fPIC -fvisibility-inlines-hidden -Werror=date-time -Werror=unguarded-availability-new -fmodules -fmodules-cache-path=/Users/buildslave/jenkins/workspace/lldb-cmake/lldb-build/module.cache -fcxx-modules -Xclang -fmodules-local-submodule-visibility -Wall -Wextra -Wno-unused-parameter -Wwrite-strings -Wcast-qual -Wmissing-field-initializers -pedantic -Wno-long-long -Wimplicit-fallthrough -Wcovered-switch-default -Wno-noexcept-type -Wnon-virtual-dtor -Wdelete-non-virtual-dtor -Wsuggest-override -Wstring-conversion -fdiagnostics-color -O3  -isysroot /Applications/Xcode.app/Contents/Developer/Platforms/MacOSX.platform/Developer/SDKs/MacOSX10.15.sdk    -fno-exceptions -fno-rtti -UNDEBUG -std=c++14 -MD -MT lib/ProfileData/CMakeFiles/LLVMProfileData.dir/InstrProfReader.cpp.o -MF lib/ProfileData/CMakeFiles/LLVMProfileData.dir/InstrProfReader.cpp.o.d -o lib/ProfileData/CMakeFiles/LLVMProfileData.dir/InstrProfReader.cpp.o -c /Users/buildslave/jenkins/workspace/lldb-cmake/llvm-project/llvm/lib/ProfileData/InstrProfReader.cpp
[515/3225] : && "/Applications/Xcode.app/Contents/Developer/Toolchains/XcodeDefault.xctoolchain/usr/bin/libtool" -static -no_warning_for_no_symbols -o lib/libLLVMDlltoolDriver.a  lib/ToolDrivers/llvm-dlltool/CMakeFiles/LLVMDlltoolDriver.dir/DlltoolDriver.cpp.o && :
[516/3225] : && "/Applications/Xcode.app/Contents/Developer/Toolchains/XcodeDefault.xctoolchain/usr/bin/libtool" -static -no_warning_for_no_symbols -o lib/libLLVMObjectYAML.a  lib/ObjectYAML/CMakeFiles/LLVMObjectYAML.dir/CodeViewYAMLDebugSections.cpp.o lib/ObjectYAML/CMakeFiles/LLVMObjectYAML.dir/CodeViewYAMLSymbols.cpp.o lib/ObjectYAML/CMakeFiles/LLVMObjectYAML.dir/CodeViewYAMLTypeHashing.cpp.o lib/ObjectYAML/CMakeFiles/LLVMObjectYAML.dir/CodeViewYAMLTypes.cpp.o lib/ObjectYAML/CMakeFiles/LLVMObjectYAML.dir/COFFEmitter.cpp.o lib/ObjectYAML/CMakeFiles/LLVMObjectYAML.dir/COFFYAML.cpp.o lib/ObjectYAML/CMakeFiles/LLVMObjectYAML.dir/DWARFEmitter.cpp.o lib/ObjectYAML/CMakeFiles/LLVMObjectYAML.dir/DWARFYAML.cpp.o lib/ObjectYAML/CMakeFiles/LLVMObjectYAML.dir/ELFEmitter.cpp.o lib/ObjectYAML/CMakeFiles/LLVMObjectYAML.dir/ELFYAML.cpp.o lib/ObjectYAML/CMakeFiles/LLVMObjectYAML.dir/MachOEmitter.cpp.o lib/ObjectYAML/CMakeFiles/LLVMObjectYAML.dir/MachOYAML.cpp.o lib/ObjectYAML/CMakeFiles/LLVMObjectYAML.dir/ObjectYAML.cpp.o lib/ObjectYAML/CMakeFiles/LLVMObjectYAML.dir/MinidumpEmitter.cpp.o lib/ObjectYAML/CMakeFiles/LLVMObjectYAML.dir/MinidumpYAML.cpp.o lib/ObjectYAML/CMakeFiles/LLVMObjectYAML.dir/WasmEmitter.cpp.o lib/ObjectYAML/CMakeFiles/LLVMObjectYAML.dir/WasmYAML.cpp.o lib/ObjectYAML/CMakeFiles/LLVMObjectYAML.dir/XCOFFYAML.cpp.o lib/ObjectYAML/CMakeFiles/LLVMObjectYAML.dir/YAML.cpp.o lib/ObjectYAML/CMakeFiles/LLVMObjectYAML.dir/yaml2obj.cpp.o && :
[517/3225] : && "/Applications/Xcode.app/Contents/Developer/Toolchains/XcodeDefault.xctoolchain/usr/bin/libtool" -static -no_warning_for_no_symbols -o lib/libLLVMLibDriver.a  lib/ToolDrivers/llvm-lib/CMakeFiles/LLVMLibDriver.dir/LibDriver.cpp.o && :
[518/3225] : && "/Applications/Xcode.app/Contents/Developer/Toolchains/XcodeDefault.xctoolchain/usr/bin/libtool" -static -no_warning_for_no_symbols -o lib/libLLVMDebugInfoPDB.a  lib/DebugInfo/PDB/CMakeFiles/LLVMDebugInfoPDB.dir/GenericError.cpp.o lib/DebugInfo/PDB/CMakeFiles/LLVMDebugInfoPDB.dir/IPDBSourceFile.cpp.o lib/DebugInfo/PDB/CMakeFiles/LLVMDebugInfoPDB.dir/PDB.cpp.o lib/DebugInfo/PDB/CMakeFiles/LLVMDebugInfoPDB.dir/PDBContext.cpp.o lib/DebugInfo/PDB/CMakeFiles/LLVMDebugInfoPDB.dir/PDBExtras.cpp.o lib/DebugInfo/PDB/CMakeFiles/LLVMDebugInfoPDB.dir/PDBInterfaceAnchors.cpp.o lib/DebugInfo/PDB/CMakeFiles/LLVMDebugInfoPDB.dir/PDBSymbol.cpp.o lib/DebugInfo/PDB/CMakeFiles/LLVMDebugInfoPDB.dir/PDBSymbolAnnotation.cpp.o lib/DebugInfo/PDB/CMakeFiles/LLVMDebugInfoPDB.dir/PDBSymbolBlock.cpp.o lib/DebugInfo/PDB/CMakeFiles/LLVMDebugInfoPDB.dir/PDBSymbolCompiland.cpp.o lib/DebugInfo/PDB/CMakeFiles/LLVMDebugInfoPDB.dir/PDBSymbolCompilandDetails.cpp.o lib/DebugInfo/PDB/CMakeFiles/LLVMDebugInfoPDB.dir/PDBSymbolCompilandEnv.cpp.o lib/DebugInfo/PDB/CMakeFiles/LLVMDebugInfoPDB.dir/PDBSymbolCustom.cpp.o lib/DebugInfo/PDB/CMakeFiles/LLVMDebugInfoPDB.dir/PDBSymbolData.cpp.o lib/DebugInfo/PDB/CMakeFiles/LLVMDebugInfoPDB.dir/PDBSymbolExe.cpp.o lib/DebugInfo/PDB/CMakeFiles/LLVMDebugInfoPDB.dir/PDBSymbolFunc.cpp.o lib/DebugInfo/PDB/CMakeFiles/LLVMDebugInfoPDB.dir/PDBSymbolFuncDebugEnd.cpp.o lib/DebugInfo/PDB/CMakeFiles/LLVMDebugInfoPDB.dir/PDBSymbolFuncDebugStart.cpp.o lib/DebugInfo/PDB/CMakeFiles/LLVMDebugInfoPDB.dir/PDBSymbolLabel.cpp.o lib/DebugInfo/PDB/CMakeFiles/LLVMDebugInfoPDB.dir/PDBSymbolPublicSymbol.cpp.o lib/DebugInfo/PDB/CMakeFiles/LLVMDebugInfoPDB.dir/PDBSymbolThunk.cpp.o lib/DebugInfo/PDB/CMakeFiles/LLVMDebugInfoPDB.dir/PDBSymbolTypeArray.cpp.o lib/DebugInfo/PDB/CMakeFiles/LLVMDebugInfoPDB.dir/PDBSymbolTypeBaseClass.cpp.o lib/DebugInfo/PDB/CMakeFiles/LLVMDebugInfoPDB.dir/PDBSymbolTypeBuiltin.cpp.o lib/DebugInfo/PDB/CMakeFiles/LLVMDebugInfoPDB.dir/PDBSymbolTypeCustom.cpp.o lib/DebugInfo/PDB/CMakeFiles/LLVMDebugInfoPDB.dir/PDBSymbolTypeDimension.cpp.o lib/DebugInfo/PDB/CMakeFiles/LLVMDebugInfoPDB.dir/PDBSymbolTypeEnum.cpp.o lib/DebugInfo/PDB/CMakeFiles/LLVMDebugInfoPDB.dir/PDBSymbolTypeFriend.cpp.o lib/DebugInfo/PDB/CMakeFiles/LLVMDebugInfoPDB.dir/PDBSymbolTypeFunctionArg.cpp.o lib/DebugInfo/PDB/CMakeFiles/LLVMDebugInfoPDB.dir/PDBSymbolTypeFunctionSig.cpp.o lib/DebugInfo/PDB/CMakeFiles/LLVMDebugInfoPDB.dir/PDBSymbolTypeManaged.cpp.o lib/DebugInfo/PDB/CMakeFiles/LLVMDebugInfoPDB.dir/PDBSymbolTypePointer.cpp.o lib/DebugInfo/PDB/CMakeFiles/LLVMDebugInfoPDB.dir/PDBSymbolTypeTypedef.cpp.o lib/DebugInfo/PDB/CMakeFiles/LLVMDebugInfoPDB.dir/PDBSymbolTypeUDT.cpp.o lib/DebugInfo/PDB/CMakeFiles/LLVMDebugInfoPDB.dir/PDBSymbolTypeVTable.cpp.o lib/DebugInfo/PDB/CMakeFiles/LLVMDebugInfoPDB.dir/PDBSymbolTypeVTableShape.cpp.o lib/DebugInfo/PDB/CMakeFiles/LLVMDebugInfoPDB.dir/PDBSymbolUnknown.cpp.o lib/DebugInfo/PDB/CMakeFiles/LLVMDebugInfoPDB.dir/PDBSymbolUsingNamespace.cpp.o lib/DebugInfo/PDB/CMakeFiles/LLVMDebugInfoPDB.dir/PDBSymDumper.cpp.o lib/DebugInfo/PDB/CMakeFiles/LLVMDebugInfoPDB.dir/UDTLayout.cpp.o lib/DebugInfo/PDB/CMakeFiles/LLVMDebugInfoPDB.dir/Native/DbiModuleDescriptor.cpp.o lib/DebugInfo/PDB/CMakeFiles/LLVMDebugInfoPDB.dir/Native/DbiModuleDescriptorBuilder.cpp.o lib/DebugInfo/PDB/CMakeFiles/LLVMDebugInfoPDB.dir/Native/DbiModuleList.cpp.o lib/DebugInfo/PDB/CMakeFiles/LLVMDebugInfoPDB.dir/Native/DbiStream.cpp.o lib/DebugInfo/PDB/CMakeFiles/LLVMDebugInfoPDB.dir/Native/DbiStreamBuilder.cpp.o lib/DebugInfo/PDB/CMakeFiles/LLVMDebugInfoPDB.dir/Native/EnumTables.cpp.o lib/DebugInfo/PDB/CMakeFiles/LLVMDebugInfoPDB.dir/Native/GlobalsStream.cpp.o lib/DebugInfo/PDB/CMakeFiles/LLVMDebugInfoPDB.dir/Native/Hash.cpp.o lib/DebugInfo/PDB/CMakeFiles/LLVMDebugInfoPDB.dir/Native/HashTable.cpp.o lib/DebugInfo/PDB/CMakeFiles/LLVMDebugInfoPDB.dir/Native/InfoStream.cpp.o lib/DebugInfo/PDB/CMakeFiles/LLVMDebugInfoPDB.dir/Native/InfoStreamBuilder.cpp.o lib/DebugInfo/PDB/CMakeFiles/LLVMDebugInfoPDB.dir/Native/InjectedSourceStream.cpp.o lib/DebugInfo/PDB/CMakeFiles/LLVMDebugInfoPDB.dir/Native/ModuleDebugStream.cpp.o lib/DebugInfo/PDB/CMakeFiles/LLVMDebugInfoPDB.dir/Native/NativeCompilandSymbol.cpp.o lib/DebugInfo/PDB/CMakeFiles/LLVMDebugInfoPDB.dir/Native/NativeEnumGlobals.cpp.o lib/DebugInfo/PDB/CMakeFiles/LLVMDebugInfoPDB.dir/Native/NativeEnumInjectedSources.cpp.o lib/DebugInfo/PDB/CMakeFiles/LLVMDebugInfoPDB.dir/Native/NativeEnumLineNumbers.cpp.o lib/DebugInfo/PDB/CMakeFiles/LLVMDebugInfoPDB.dir/Native/NativeEnumModules.cpp.o lib/DebugInfo/PDB/CMakeFiles/LLVMDebugInfoPDB.dir/Native/NativeEnumTypes.cpp.o lib/DebugInfo/PDB/CMakeFiles/LLVMDebugInfoPDB.dir/Native/NativeExeSymbol.cpp.o lib/DebugInfo/PDB/CMakeFiles/LLVMDebugInfoPDB.dir/Native/NativeFunctionSymbol.cpp.o lib/DebugInfo/PDB/CMakeFiles/LLVMDebugInfoPDB.dir/Native/NativeLineNumber.cpp.o lib/DebugInfo/PDB/CMakeFiles/LLVMDebugInfoPDB.dir/Native/NativePublicSymbol.cpp.o lib/DebugInfo/PDB/CMakeFiles/LLVMDebugInfoPDB.dir/Native/NativeRawSymbol.cpp.o lib/DebugInfo/PDB/CMakeFiles/LLVMDebugInfoPDB.dir/Native/NativeSourceFile.cpp.o lib/DebugInfo/PDB/CMakeFiles/LLVMDebugInfoPDB.dir/Native/NativeSymbolEnumerator.cpp.o lib/DebugInfo/PDB/CMakeFiles/LLVMDebugInfoPDB.dir/Native/NativeTypeArray.cpp.o lib/DebugInfo/PDB/CMakeFiles/LLVMDebugInfoPDB.dir/Native/NativeTypeBuiltin.cpp.o lib/DebugInfo/PDB/CMakeFiles/LLVMDebugInfoPDB.dir/Native/NativeTypeEnum.cpp.o lib/DebugInfo/PDB/CMakeFiles/LLVMDebugInfoPDB.dir/Native/NativeTypeFunctionSig.cpp.o lib/DebugInfo/PDB/CMakeFiles/LLVMDebugInfoPDB.dir/Native/NativeTypePointer.cpp.o lib/DebugInfo/PDB/CMakeFiles/LLVMDebugInfoPDB.dir/Native/NativeTypeTypedef.cpp.o lib/DebugInfo/PDB/CMakeFiles/LLVMDebugInfoPDB.dir/Native/NativeTypeUDT.cpp.o lib/DebugInfo/PDB/CMakeFiles/LLVMDebugInfoPDB.dir/Native/NativeTypeVTShape.cpp.o lib/DebugInfo/PDB/CMakeFiles/LLVMDebugInfoPDB.dir/Native/NamedStreamMap.cpp.o lib/DebugInfo/PDB/CMakeFiles/LLVMDebugInfoPDB.dir/Native/NativeSession.cpp.o lib/DebugInfo/PDB/CMakeFiles/LLVMDebugInfoPDB.dir/Native/PDBFile.cpp.o lib/DebugInfo/PDB/CMakeFiles/LLVMDebugInfoPDB.dir/Native/PDBFileBuilder.cpp.o lib/DebugInfo/PDB/CMakeFiles/LLVMDebugInfoPDB.dir/Native/PDBStringTable.cpp.o lib/DebugInfo/PDB/CMakeFiles/LLVMDebugInfoPDB.dir/Native/PDBStringTableBuilder.cpp.o lib/DebugInfo/PDB/CMakeFiles/LLVMDebugInfoPDB.dir/Native/PublicsStream.cpp.o lib/DebugInfo/PDB/CMakeFiles/LLVMDebugInfoPDB.dir/Native/GSIStreamBuilder.cpp.o lib/DebugInfo/PDB/CMakeFiles/LLVMDebugInfoPDB.dir/Native/RawError.cpp.o lib/DebugInfo/PDB/CMakeFiles/LLVMDebugInfoPDB.dir/Native/SymbolCache.cpp.o lib/DebugInfo/PDB/CMakeFiles/LLVMDebugInfoPDB.dir/Native/SymbolStream.cpp.o lib/DebugInfo/PDB/CMakeFiles/LLVMDebugInfoPDB.dir/Native/TpiHashing.cpp.o lib/DebugInfo/PDB/CMakeFiles/LLVMDebugInfoPDB.dir/Native/TpiStream.cpp.o lib/DebugInfo/PDB/CMakeFiles/LLVMDebugInfoPDB.dir/Native/TpiStreamBuilder.cpp.o && :
[519/3225] : && "/Applications/Xcode.app/Contents/Developer/Toolchains/XcodeDefault.xctoolchain/usr/bin/libtool" -static -no_warning_for_no_symbols -o lib/libLLVMSymbolize.a  lib/DebugInfo/Symbolize/CMakeFiles/LLVMSymbolize.dir/DIPrinter.cpp.o lib/DebugInfo/Symbolize/CMakeFiles/LLVMSymbolize.dir/SymbolizableObjectFile.cpp.o lib/DebugInfo/Symbolize/CMakeFiles/LLVMSymbolize.dir/Symbolize.cpp.o && :
[520/3225] : && "/Applications/Xcode.app/Contents/Developer/Toolchains/XcodeDefault.xctoolchain/usr/bin/libtool" -static -no_warning_for_no_symbols -o lib/libLLVMXRay.a  lib/XRay/CMakeFiles/LLVMXRay.dir/BlockIndexer.cpp.o lib/XRay/CMakeFiles/LLVMXRay.dir/BlockPrinter.cpp.o lib/XRay/CMakeFiles/LLVMXRay.dir/BlockVerifier.cpp.o lib/XRay/CMakeFiles/LLVMXRay.dir/FDRRecordProducer.cpp.o lib/XRay/CMakeFiles/LLVMXRay.dir/FDRRecords.cpp.o lib/XRay/CMakeFiles/LLVMXRay.dir/FDRTraceExpander.cpp.o lib/XRay/CMakeFiles/LLVMXRay.dir/FDRTraceWriter.cpp.o lib/XRay/CMakeFiles/LLVMXRay.dir/FileHeaderReader.cpp.o lib/XRay/CMakeFiles/LLVMXRay.dir/InstrumentationMap.cpp.o lib/XRay/CMakeFiles/LLVMXRay.dir/LogBuilderConsumer.cpp.o lib/XRay/CMakeFiles/LLVMXRay.dir/Profile.cpp.o lib/XRay/CMakeFiles/LLVMXRay.dir/RecordInitializer.cpp.o lib/XRay/CMakeFiles/LLVMXRay.dir/RecordPrinter.cpp.o lib/XRay/CMakeFiles/LLVMXRay.dir/Trace.cpp.o && :
[521/3225] : && /Users/buildslave/jenkins/workspace/lldb-cmake/host-compiler/bin/clang++  -Wdocumentation -fPIC -fvisibility-inlines-hidden -Werror=date-time -Werror=unguarded-availability-new -fmodules -fmodules-cache-path=/Users/buildslave/jenkins/workspace/lldb-cmake/lldb-build/module.cache -fcxx-modules -Xclang -fmodules-local-submodule-visibility -Wall -Wextra -Wno-unused-parameter -Wwrite-strings -Wcast-qual -Wmissing-field-initializers -pedantic -Wno-long-long -Wimplicit-fallthrough -Wcovered-switch-default -Wno-noexcept-type -Wnon-virtual-dtor -Wdelete-non-virtual-dtor -Wsuggest-override -Wstring-conversion -fdiagnostics-color -O3  -isysroot /Applications/Xcode.app/Contents/Developer/Platforms/MacOSX.platform/Developer/SDKs/MacOSX10.15.sdk -Wl,-search_paths_first -Wl,-headerpad_max_install_names -Wl,-dead_strip utils/yaml-bench/CMakeFiles/yaml-bench.dir/YAMLBench.cpp.o  -o bin/yaml-bench  -Wl,-rpath,@loader_path/../lib  lib/libLLVMSupport.a  -lm  /usr/lib/libz.dylib  /usr/lib/libcurses.dylib  lib/libLLVMDemangle.a && :
[522/3225] : && /Users/buildslave/jenkins/workspace/lldb-cmake/host-compiler/bin/clang++  -Wdocumentation -fPIC -fvisibility-inlines-hidden -Werror=date-time -Werror=unguarded-availability-new -fmodules -fmodules-cache-path=/Users/buildslave/jenkins/workspace/lldb-cmake/lldb-build/module.cache -fcxx-modules -Xclang -fmodules-local-submodule-visibility -Wall -Wextra -Wno-unused-parameter -Wwrite-strings -Wcast-qual -Wmissing-field-initializers -pedantic -Wno-long-long -Wimplicit-fallthrough -Wcovered-switch-default -Wno-noexcept-type -Wnon-virtual-dtor -Wdelete-non-virtual-dtor -Wsuggest-override -Wstring-conversion -fdiagnostics-color -O3  -isysroot /Applications/Xcode.app/Contents/Developer/Platforms/MacOSX.platform/Developer/SDKs/MacOSX10.15.sdk -Wl,-search_paths_first -Wl,-headerpad_max_install_names -Wl,-dead_strip utils/FileCheck/CMakeFiles/FileCheck.dir/FileCheck.cpp.o  -o bin/FileCheck  -Wl,-rpath,@loader_path/../lib  lib/libLLVMFileCheck.a  lib/libLLVMSupport.a  -lm  /usr/lib/libz.dylib  /usr/lib/libcurses.dylib  lib/libLLVMDemangle.a && :
[523/3225] /Users/buildslave/jenkins/workspace/lldb-cmake/host-compiler/bin/clang++  -DHAVE_RPC_XDR_H=0 -D_DEBUG -D__STDC_CONSTANT_MACROS -D__STDC_FORMAT_MACROS -D__STDC_LIMIT_MACROS -Iprojects/compiler-rt/lib/sanitizer_common -I/Users/buildslave/jenkins/workspace/lldb-cmake/llvm-project/compiler-rt/lib/sanitizer_common -Iinclude -I/Users/buildslave/jenkins/workspace/lldb-cmake/llvm-project/llvm/include -I/Users/buildslave/jenkins/workspace/lldb-cmake/llvm-project/compiler-rt/lib/sanitizer_common/.. -Wdocumentation -fPIC -fvisibility-inlines-hidden -Werror=date-time -Werror=unguarded-availability-new -fmodules -fmodules-cache-path=/Users/buildslave/jenkins/workspace/lldb-cmake/lldb-build/module.cache -fcxx-modules -Xclang -fmodules-local-submodule-visibility -Wall -Wextra -Wno-unused-parameter -Wwrite-strings -Wcast-qual -Wmissing-field-initializers -pedantic -Wno-long-long -Wimplicit-fallthrough -Wcovered-switch-default -Wno-noexcept-type -Wnon-virtual-dtor -Wdelete-non-virtual-dtor -Wsuggest-override -Wstring-conversion -fdiagnostics-color -Wall -std=c++14 -Wno-unused-parameter -O3  -arch x86_64 -arch x86_64h -isysroot /Applications/Xcode.app/Contents/Developer/Platforms/MacOSX.platform/Developer/SDKs/MacOSX10.15.sdk    -stdlib=libc++ -mmacosx-version-min=10.10 -isysroot /Applications/Xcode.app/Contents/Developer/Platforms/MacOSX.platform/Developer/SDKs/MacOSX10.15.sdk -fPIC -fno-builtin -fno-exceptions -funwind-tables -fno-stack-protector -fno-sanitize=safe-stack -fvisibility=hidden -fno-lto -O3 -gline-tables-only -fno-modules -Wno-gnu -Wno-variadic-macros -Wno-c99-extensions -Wno-non-virtual-dtor -fno-rtti -Wframe-larger-than=570 -Wglobal-constructors -DSANITIZER_SUPPORTS_WEAK_HOOKS=0 -UNDEBUG -std=c++14 -MD -MT projects/compiler-rt/lib/sanitizer_common/CMakeFiles/RTSanitizerCommonNoHooks.osx.dir/sanitizer_errno.cpp.o -MF projects/compiler-rt/lib/sanitizer_common/CMakeFiles/RTSanitizerCommonNoHooks.osx.dir/sanitizer_errno.cpp.o.d -o projects/compiler-rt/lib/sanitizer_common/CMakeFiles/RTSanitizerCommonNoHooks.osx.dir/sanitizer_errno.cpp.o -c /Users/buildslave/jenkins/workspace/lldb-cmake/llvm-project/compiler-rt/lib/sanitizer_common/sanitizer_errno.cpp
clang-12: warning: argument unused during compilation: '-fmodules-cache-path=/Users/buildslave/jenkins/workspace/lldb-cmake/lldb-build/module.cache' [-Wunused-command-line-argument]
clang-12: warning: argument unused during compilation: '-fcxx-modules' [-Wunused-command-line-argument]
[524/3225] /Users/buildslave/jenkins/workspace/lldb-cmake/host-compiler/bin/clang++  -DGTEST_HAS_RTTI=0 -D_DEBUG -D__STDC_CONSTANT_MACROS -D__STDC_FORMAT_MACROS -D__STDC_LIMIT_MACROS -Ilib/ProfileData -I/Users/buildslave/jenkins/workspace/lldb-cmake/llvm-project/llvm/lib/ProfileData -Iinclude -I/Users/buildslave/jenkins/workspace/lldb-cmake/llvm-project/llvm/include -Wdocumentation -fPIC -fvisibility-inlines-hidden -Werror=date-time -Werror=unguarded-availability-new -fmodules -fmodules-cache-path=/Users/buildslave/jenkins/workspace/lldb-cmake/lldb-build/module.cache -fcxx-modules -Xclang -fmodules-local-submodule-visibility -Wall -Wextra -Wno-unused-parameter -Wwrite-strings -Wcast-qual -Wmissing-field-initializers -pedantic -Wno-long-long -Wimplicit-fallthrough -Wcovered-switch-default -Wno-noexcept-type -Wnon-virtual-dtor -Wdelete-non-virtual-dtor -Wsuggest-override -Wstring-conversion -fdiagnostics-color -O3  -isysroot /Applications/Xcode.app/Contents/Developer/Platforms/MacOSX.platform/Developer/SDKs/MacOSX10.15.sdk    -fno-exceptions -fno-rtti -UNDEBUG -std=c++14 -MD -MT lib/ProfileData/CMakeFiles/LLVMProfileData.dir/SampleProfReader.cpp.o -MF lib/ProfileData/CMakeFiles/LLVMProfileData.dir/SampleProfReader.cpp.o.d -o lib/ProfileData/CMakeFiles/LLVMProfileData.dir/SampleProfReader.cpp.o -c /Users/buildslave/jenkins/workspace/lldb-cmake/llvm-project/llvm/lib/ProfileData/SampleProfReader.cpp
[525/3225] : && /Users/buildslave/jenkins/workspace/lldb-cmake/host-compiler/bin/clang++ -Wdocumentation -fPIC -fvisibility-inlines-hidden -Werror=date-time -Werror=unguarded-availability-new -fmodules -fmodules-cache-path=/Users/buildslave/jenkins/workspace/lldb-cmake/lldb-build/module.cache -fcxx-modules -Xclang -fmodules-local-submodule-visibility -Wall -Wextra -Wno-unused-parameter -Wwrite-strings -Wcast-qual -Wmissing-field-initializers  -Wno-long-long -Wimplicit-fallthrough -Wcovered-switch-default -Wno-noexcept-type -Wnon-virtual-dtor -Wdelete-non-virtual-dtor -Wsuggest-override -Wstring-conversion -fdiagnostics-color -O3 -isysroot /Applications/Xcode.app/Contents/Developer/Platforms/MacOSX.platform/Developer/SDKs/MacOSX10.15.sdk -dynamiclib -Wl,-headerpad_max_install_names -compatibility_version 1.0.0 -current_version 1.0.0 -o lib/libc++.1.0.dylib -install_name @rpath/libc++.1.dylib projects/libcxx/src/CMakeFiles/cxx_shared.dir/algorithm.cpp.o projects/libcxx/src/CMakeFiles/cxx_shared.dir/any.cpp.o projects/libcxx/src/CMakeFiles/cxx_shared.dir/atomic.cpp.o projects/libcxx/src/CMakeFiles/cxx_shared.dir/barrier.cpp.o projects/libcxx/src/CMakeFiles/cxx_shared.dir/bind.cpp.o projects/libcxx/src/CMakeFiles/cxx_shared.dir/charconv.cpp.o projects/libcxx/src/CMakeFiles/cxx_shared.dir/chrono.cpp.o projects/libcxx/src/CMakeFiles/cxx_shared.dir/condition_variable.cpp.o projects/libcxx/src/CMakeFiles/cxx_shared.dir/condition_variable_destructor.cpp.o projects/libcxx/src/CMakeFiles/cxx_shared.dir/debug.cpp.o projects/libcxx/src/CMakeFiles/cxx_shared.dir/exception.cpp.o projects/libcxx/src/CMakeFiles/cxx_shared.dir/functional.cpp.o projects/libcxx/src/CMakeFiles/cxx_shared.dir/future.cpp.o projects/libcxx/src/CMakeFiles/cxx_shared.dir/hash.cpp.o projects/libcxx/src/CMakeFiles/cxx_shared.dir/ios.cpp.o projects/libcxx/src/CMakeFiles/cxx_shared.dir/iostream.cpp.o projects/libcxx/src/CMakeFiles/cxx_shared.dir/locale.cpp.o projects/libcxx/src/CMakeFiles/cxx_shared.dir/memory.cpp.o projects/libcxx/src/CMakeFiles/cxx_shared.dir/mutex.cpp.o projects/libcxx/src/CMakeFiles/cxx_shared.dir/mutex_destructor.cpp.o projects/libcxx/src/CMakeFiles/cxx_shared.dir/new.cpp.o projects/libcxx/src/CMakeFiles/cxx_shared.dir/optional.cpp.o projects/libcxx/src/CMakeFiles/cxx_shared.dir/random.cpp.o projects/libcxx/src/CMakeFiles/cxx_shared.dir/random_shuffle.cpp.o projects/libcxx/src/CMakeFiles/cxx_shared.dir/regex.cpp.o projects/libcxx/src/CMakeFiles/cxx_shared.dir/shared_mutex.cpp.o projects/libcxx/src/CMakeFiles/cxx_shared.dir/stdexcept.cpp.o projects/libcxx/src/CMakeFiles/cxx_shared.dir/string.cpp.o projects/libcxx/src/CMakeFiles/cxx_shared.dir/strstream.cpp.o projects/libcxx/src/CMakeFiles/cxx_shared.dir/system_error.cpp.o projects/libcxx/src/CMakeFiles/cxx_shared.dir/thread.cpp.o projects/libcxx/src/CMakeFiles/cxx_shared.dir/typeinfo.cpp.o projects/libcxx/src/CMakeFiles/cxx_shared.dir/utility.cpp.o projects/libcxx/src/CMakeFiles/cxx_shared.dir/valarray.cpp.o projects/libcxx/src/CMakeFiles/cxx_shared.dir/variant.cpp.o projects/libcxx/src/CMakeFiles/cxx_shared.dir/vector.cpp.o projects/libcxx/src/CMakeFiles/cxx_shared.dir/filesystem/operations.cpp.o projects/libcxx/src/CMakeFiles/cxx_shared.dir/filesystem/directory_iterator.cpp.o projects/libcxx/src/CMakeFiles/cxx_shared.dir/filesystem/int128_builtins.cpp.o  -Wl,-rpath,@loader_path/../lib  -nodefaultlibs  -lSystem  -lc  lib/libc++abi.1.0.dylib  -Wl,-unexported_symbols_list,/Users/buildslave/jenkins/workspace/lldb-cmake/llvm-project/libcxx/src/../lib/libc++unexp.exp  -Wl,-reexported_symbols_list,/Users/buildslave/jenkins/workspace/lldb-cmake/llvm-project/libcxx/src/../lib/libc++abi.v2.exp  -Wl,-force_symbols_not_weak_list,/Users/buildslave/jenkins/workspace/lldb-cmake/llvm-project/libcxx/src/../lib/notweak.exp  -Wl,-force_symbols_weak_list,/Users/buildslave/jenkins/workspace/lldb-cmake/llvm-project/libcxx/src/../lib/weak.exp  -Wl,-reexported_symbols_list,/Users/buildslave/jenkins/workspace/lldb-cmake/llvm-project/libcxxabi/src/../lib/new-delete.exp  -Wl,-reexported_symbols_list,/Users/buildslave/jenkins/workspace/lldb-cmake/llvm-project/libcxxabi/src/../lib/exceptions.exp  -Wl,-reexported_symbols_list,/Users/buildslave/jenkins/workspace/lldb-cmake/llvm-project/libcxxabi/src/../lib/personality-v0.exp && :
FAILED: lib/libc++.1.0.dylib 
: && /Users/buildslave/jenkins/workspace/lldb-cmake/host-compiler/bin/clang++ -Wdocumentation -fPIC -fvisibility-inlines-hidden -Werror=date-time -Werror=unguarded-availability-new -fmodules -fmodules-cache-path=/Users/buildslave/jenkins/workspace/lldb-cmake/lldb-build/module.cache -fcxx-modules -Xclang -fmodules-local-submodule-visibility -Wall -Wextra -Wno-unused-parameter -Wwrite-strings -Wcast-qual -Wmissing-field-initializers  -Wno-long-long -Wimplicit-fallthrough -Wcovered-switch-default -Wno-noexcept-type -Wnon-virtual-dtor -Wdelete-non-virtual-dtor -Wsuggest-override -Wstring-conversion -fdiagnostics-color -O3 -isysroot /Applications/Xcode.app/Contents/Developer/Platforms/MacOSX.platform/Developer/SDKs/MacOSX10.15.sdk -dynamiclib -Wl,-headerpad_max_install_names -compatibility_version 1.0.0 -current_version 1.0.0 -o lib/libc++.1.0.dylib -install_name @rpath/libc++.1.dylib projects/libcxx/src/CMakeFiles/cxx_shared.dir/algorithm.cpp.o projects/libcxx/src/CMakeFiles/cxx_shared.dir/any.cpp.o projects/libcxx/src/CMakeFiles/cxx_shared.dir/atomic.cpp.o projects/libcxx/src/CMakeFiles/cxx_shared.dir/barrier.cpp.o projects/libcxx/src/CMakeFiles/cxx_shared.dir/bind.cpp.o projects/libcxx/src/CMakeFiles/cxx_shared.dir/charconv.cpp.o projects/libcxx/src/CMakeFiles/cxx_shared.dir/chrono.cpp.o projects/libcxx/src/CMakeFiles/cxx_shared.dir/condition_variable.cpp.o projects/libcxx/src/CMakeFiles/cxx_shared.dir/condition_variable_destructor.cpp.o projects/libcxx/src/CMakeFiles/cxx_shared.dir/debug.cpp.o projects/libcxx/src/CMakeFiles/cxx_shared.dir/exception.cpp.o projects/libcxx/src/CMakeFiles/cxx_shared.dir/functional.cpp.o projects/libcxx/src/CMakeFiles/cxx_shared.dir/future.cpp.o projects/libcxx/src/CMakeFiles/cxx_shared.dir/hash.cpp.o projects/libcxx/src/CMakeFiles/cxx_shared.dir/ios.cpp.o projects/libcxx/src/CMakeFiles/cxx_shared.dir/iostream.cpp.o projects/libcxx/src/CMakeFiles/cxx_shared.dir/locale.cpp.o projects/libcxx/src/CMakeFiles/cxx_shared.dir/memory.cpp.o projects/libcxx/src/CMakeFiles/cxx_shared.dir/mutex.cpp.o projects/libcxx/src/CMakeFiles/cxx_shared.dir/mutex_destructor.cpp.o projects/libcxx/src/CMakeFiles/cxx_shared.dir/new.cpp.o projects/libcxx/src/CMakeFiles/cxx_shared.dir/optional.cpp.o projects/libcxx/src/CMakeFiles/cxx_shared.dir/random.cpp.o projects/libcxx/src/CMakeFiles/cxx_shared.dir/random_shuffle.cpp.o projects/libcxx/src/CMakeFiles/cxx_shared.dir/regex.cpp.o projects/libcxx/src/CMakeFiles/cxx_shared.dir/shared_mutex.cpp.o projects/libcxx/src/CMakeFiles/cxx_shared.dir/stdexcept.cpp.o projects/libcxx/src/CMakeFiles/cxx_shared.dir/string.cpp.o projects/libcxx/src/CMakeFiles/cxx_shared.dir/strstream.cpp.o projects/libcxx/src/CMakeFiles/cxx_shared.dir/system_error.cpp.o projects/libcxx/src/CMakeFiles/cxx_shared.dir/thread.cpp.o projects/libcxx/src/CMakeFiles/cxx_shared.dir/typeinfo.cpp.o projects/libcxx/src/CMakeFiles/cxx_shared.dir/utility.cpp.o projects/libcxx/src/CMakeFiles/cxx_shared.dir/valarray.cpp.o projects/libcxx/src/CMakeFiles/cxx_shared.dir/variant.cpp.o projects/libcxx/src/CMakeFiles/cxx_shared.dir/vector.cpp.o projects/libcxx/src/CMakeFiles/cxx_shared.dir/filesystem/operations.cpp.o projects/libcxx/src/CMakeFiles/cxx_shared.dir/filesystem/directory_iterator.cpp.o projects/libcxx/src/CMakeFiles/cxx_shared.dir/filesystem/int128_builtins.cpp.o  -Wl,-rpath,@loader_path/../lib  -nodefaultlibs  -lSystem  -lc  lib/libc++abi.1.0.dylib  -Wl,-unexported_symbols_list,/Users/buildslave/jenkins/workspace/lldb-cmake/llvm-project/libcxx/src/../lib/libc++unexp.exp  -Wl,-reexported_symbols_list,/Users/buildslave/jenkins/workspace/lldb-cmake/llvm-project/libcxx/src/../lib/libc++abi.v2.exp  -Wl,-force_symbols_not_weak_list,/Users/buildslave/jenkins/workspace/lldb-cmake/llvm-project/libcxx/src/../lib/notweak.exp  -Wl,-force_symbols_weak_list,/Users/buildslave/jenkins/workspace/lldb-cmake/llvm-project/libcxx/src/../lib/weak.exp  -Wl,-reexported_symbols_list,/Users/buildslave/jenkins/workspace/lldb-cmake/llvm-project/libcxxabi/src/../lib/new-delete.exp  -Wl,-reexported_symbols_list,/Users/buildslave/jenkins/workspace/lldb-cmake/llvm-project/libcxxabi/src/../lib/exceptions.exp  -Wl,-reexported_symbols_list,/Users/buildslave/jenkins/workspace/lldb-cmake/llvm-project/libcxxabi/src/../lib/personality-v0.exp && :
ld: requested re-export symbol operator new(unsigned long) is not from a dylib, but from projects/libcxx/src/CMakeFiles/cxx_shared.dir/new.cpp.o
 file 'projects/libcxx/src/CMakeFiles/cxx_shared.dir/new.cpp.o' for architecture x86_64
clang-12: error: linker command failed with exit code 1 (use -v to see invocation)
[526/3225] /Users/buildslave/jenkins/workspace/lldb-cmake/host-compiler/bin/clang++  -DHAVE_RPC_XDR_H=0 -D_DEBUG -D__STDC_CONSTANT_MACROS -D__STDC_FORMAT_MACROS -D__STDC_LIMIT_MACROS -Iprojects/compiler-rt/lib/sanitizer_common -I/Users/buildslave/jenkins/workspace/lldb-cmake/llvm-project/compiler-rt/lib/sanitizer_common -Iinclude -I/Users/buildslave/jenkins/workspace/lldb-cmake/llvm-project/llvm/include -I/Users/buildslave/jenkins/workspace/lldb-cmake/llvm-project/compiler-rt/lib/sanitizer_common/.. -Wdocumentation -fPIC -fvisibility-inlines-hidden -Werror=date-time -Werror=unguarded-availability-new -fmodules -fmodules-cache-path=/Users/buildslave/jenkins/workspace/lldb-cmake/lldb-build/module.cache -fcxx-modules -Xclang -fmodules-local-submodule-visibility -Wall -Wextra -Wno-unused-parameter -Wwrite-strings -Wcast-qual -Wmissing-field-initializers -pedantic -Wno-long-long -Wimplicit-fallthrough -Wcovered-switch-default -Wno-noexcept-type -Wnon-virtual-dtor -Wdelete-non-virtual-dtor -Wsuggest-override -Wstring-conversion -fdiagnostics-color -Wall -std=c++14 -Wno-unused-parameter -O3  -arch x86_64 -arch x86_64h -isysroot /Applications/Xcode.app/Contents/Developer/Platforms/MacOSX.platform/Developer/SDKs/MacOSX10.15.sdk    -stdlib=libc++ -mmacosx-version-min=10.10 -isysroot /Applications/Xcode.app/Contents/Developer/Platforms/MacOSX.platform/Developer/SDKs/MacOSX10.15.sdk -fPIC -fno-builtin -fno-exceptions -funwind-tables -fno-stack-protector -fno-sanitize=safe-stack -fvisibility=hidden -fno-lto -O3 -gline-tables-only -fno-modules -Wno-gnu -Wno-variadic-macros -Wno-c99-extensions -Wno-non-virtual-dtor -fno-rtti -Wframe-larger-than=570 -Wglobal-constructors -DSANITIZER_SUPPORTS_WEAK_HOOKS=0 -UNDEBUG -std=c++14 -MD -MT projects/compiler-rt/lib/sanitizer_common/CMakeFiles/RTSanitizerCommonNoHooks.osx.dir/sanitizer_platform_limits_posix.cpp.o -MF projects/compiler-rt/lib/sanitizer_common/CMakeFiles/RTSanitizerCommonNoHooks.osx.dir/sanitizer_platform_limits_posix.cpp.o.d -o projects/compiler-rt/lib/sanitizer_common/CMakeFiles/RTSanitizerCommonNoHooks.osx.dir/sanitizer_platform_limits_posix.cpp.o -c /Users/buildslave/jenkins/workspace/lldb-cmake/llvm-project/compiler-rt/lib/sanitizer_common/sanitizer_platform_limits_posix.cpp
clang-12: warning: argument unused during compilation: '-fmodules-cache-path=/Users/buildslave/jenkins/workspace/lldb-cmake/lldb-build/module.cache' [-Wunused-command-line-argument]
clang-12: warning: argument unused during compilation: '-fcxx-modules' [-Wunused-command-line-argument]
[527/3225] /Users/buildslave/jenkins/workspace/lldb-cmake/host-compiler/bin/clang++  -DGTEST_HAS_RTTI=0 -D_DEBUG -D__STDC_CONSTANT_MACROS -D__STDC_FORMAT_MACROS -D__STDC_LIMIT_MACROS -Ilib/ProfileData -I/Users/buildslave/jenkins/workspace/lldb-cmake/llvm-project/llvm/lib/ProfileData -Iinclude -I/Users/buildslave/jenkins/workspace/lldb-cmake/llvm-project/llvm/include -Wdocumentation -fPIC -fvisibility-inlines-hidden -Werror=date-time -Werror=unguarded-availability-new -fmodules -fmodules-cache-path=/Users/buildslave/jenkins/workspace/lldb-cmake/lldb-build/module.cache -fcxx-modules -Xclang -fmodules-local-submodule-visibility -Wall -Wextra -Wno-unused-parameter -Wwrite-strings -Wcast-qual -Wmissing-field-initializers -pedantic -Wno-long-long -Wimplicit-fallthrough -Wcovered-switch-default -Wno-noexcept-type -Wnon-virtual-dtor -Wdelete-non-virtual-dtor -Wsuggest-override -Wstring-conversion -fdiagnostics-color -O3  -isysroot /Applications/Xcode.app/Contents/Developer/Platforms/MacOSX.platform/Developer/SDKs/MacOSX10.15.sdk    -fno-exceptions -fno-rtti -UNDEBUG -std=c++14 -MD -MT lib/ProfileData/CMakeFiles/LLVMProfileData.dir/SampleProfWriter.cpp.o -MF lib/ProfileData/CMakeFiles/LLVMProfileData.dir/SampleProfWriter.cpp.o.d -o lib/ProfileData/CMakeFiles/LLVMProfileData.dir/SampleProfWriter.cpp.o -c /Users/buildslave/jenkins/workspace/lldb-cmake/llvm-project/llvm/lib/ProfileData/SampleProfWriter.cpp
[528/3225] /Users/buildslave/jenkins/workspace/lldb-cmake/host-compiler/bin/clang++  -DHAVE_RPC_XDR_H=0 -D_DEBUG -D__STDC_CONSTANT_MACROS -D__STDC_FORMAT_MACROS -D__STDC_LIMIT_MACROS -Iprojects/compiler-rt/lib/sanitizer_common -I/Users/buildslave/jenkins/workspace/lldb-cmake/llvm-project/compiler-rt/lib/sanitizer_common -Iinclude -I/Users/buildslave/jenkins/workspace/lldb-cmake/llvm-project/llvm/include -I/Users/buildslave/jenkins/workspace/lldb-cmake/llvm-project/compiler-rt/lib/sanitizer_common/.. -Wdocumentation -fPIC -fvisibility-inlines-hidden -Werror=date-time -Werror=unguarded-availability-new -fmodules -fmodules-cache-path=/Users/buildslave/jenkins/workspace/lldb-cmake/lldb-build/module.cache -fcxx-modules -Xclang -fmodules-local-submodule-visibility -Wall -Wextra -Wno-unused-parameter -Wwrite-strings -Wcast-qual -Wmissing-field-initializers -pedantic -Wno-long-long -Wimplicit-fallthrough -Wcovered-switch-default -Wno-noexcept-type -Wnon-virtual-dtor -Wdelete-non-virtual-dtor -Wsuggest-override -Wstring-conversion -fdiagnostics-color -Wall -std=c++14 -Wno-unused-parameter -O3  -arch x86_64 -arch x86_64h -isysroot /Applications/Xcode.app/Contents/Developer/Platforms/MacOSX.platform/Developer/SDKs/MacOSX10.15.sdk    -stdlib=libc++ -mmacosx-version-min=10.10 -isysroot /Applications/Xcode.app/Contents/Developer/Platforms/MacOSX.platform/Developer/SDKs/MacOSX10.15.sdk -fPIC -fno-builtin -fno-exceptions -funwind-tables -fno-stack-protector -fno-sanitize=safe-stack -fvisibility=hidden -fno-lto -O3 -gline-tables-only -fno-modules -Wno-gnu -Wno-variadic-macros -Wno-c99-extensions -Wno-non-virtual-dtor -fno-rtti -Wframe-larger-than=570 -Wglobal-constructors -DSANITIZER_SUPPORTS_WEAK_HOOKS=0 -UNDEBUG -std=c++14 -MD -MT projects/compiler-rt/lib/sanitizer_common/CMakeFiles/RTSanitizerCommonNoHooks.osx.dir/sanitizer_posix.cpp.o -MF projects/compiler-rt/lib/sanitizer_common/CMakeFiles/RTSanitizerCommonNoHooks.osx.dir/sanitizer_posix.cpp.o.d -o projects/compiler-rt/lib/sanitizer_common/CMakeFiles/RTSanitizerCommonNoHooks.osx.dir/sanitizer_posix.cpp.o -c /Users/buildslave/jenkins/workspace/lldb-cmake/llvm-project/compiler-rt/lib/sanitizer_common/sanitizer_posix.cpp
clang-12: warning: argument unused during compilation: '-fmodules-cache-path=/Users/buildslave/jenkins/workspace/lldb-cmake/lldb-build/module.cache' [-Wunused-command-line-argument]
clang-12: warning: argument unused during compilation: '-fcxx-modules' [-Wunused-command-line-argument]
[529/3225] /Users/buildslave/jenkins/workspace/lldb-cmake/host-compiler/bin/clang++  -DGTEST_HAS_RTTI=0 -D_DEBUG -D__STDC_CONSTANT_MACROS -D__STDC_FORMAT_MACROS -D__STDC_LIMIT_MACROS -Ilib/Target/NVPTX/MCTargetDesc -I/Users/buildslave/jenkins/workspace/lldb-cmake/llvm-project/llvm/lib/Target/NVPTX/MCTargetDesc -I/Users/buildslave/jenkins/workspace/lldb-cmake/llvm-project/llvm/lib/Target/NVPTX -Ilib/Target/NVPTX -Iinclude -I/Users/buildslave/jenkins/workspace/lldb-cmake/llvm-project/llvm/include -Wdocumentation -fPIC -fvisibility-inlines-hidden -Werror=date-time -Werror=unguarded-availability-new -fmodules -fmodules-cache-path=/Users/buildslave/jenkins/workspace/lldb-cmake/lldb-build/module.cache -fcxx-modules -Xclang -fmodules-local-submodule-visibility -Wall -Wextra -Wno-unused-parameter -Wwrite-strings -Wcast-qual -Wmissing-field-initializers -pedantic -Wno-long-long -Wimplicit-fallthrough -Wcovered-switch-default -Wno-noexcept-type -Wnon-virtual-dtor -Wdelete-non-virtual-dtor -Wsuggest-override -Wstring-conversion -fdiagnostics-color -O3  -isysroot /Applications/Xcode.app/Contents/Developer/Platforms/MacOSX.platform/Developer/SDKs/MacOSX10.15.sdk    -fno-exceptions -fno-rtti -UNDEBUG -std=c++14 -MD -MT lib/Target/NVPTX/MCTargetDesc/CMakeFiles/LLVMNVPTXDesc.dir/NVPTXInstPrinter.cpp.o -MF lib/Target/NVPTX/MCTargetDesc/CMakeFiles/LLVMNVPTXDesc.dir/NVPTXInstPrinter.cpp.o.d -o lib/Target/NVPTX/MCTargetDesc/CMakeFiles/LLVMNVPTXDesc.dir/NVPTXInstPrinter.cpp.o -c /Users/buildslave/jenkins/workspace/lldb-cmake/llvm-project/llvm/lib/Target/NVPTX/MCTargetDesc/NVPTXInstPrinter.cpp
[530/3225] /Users/buildslave/jenkins/workspace/lldb-cmake/host-compiler/bin/clang++  -DHAVE_RPC_XDR_H=0 -D_DEBUG -D__STDC_CONSTANT_MACROS -D__STDC_FORMAT_MACROS -D__STDC_LIMIT_MACROS -Iprojects/compiler-rt/lib/sanitizer_common -I/Users/buildslave/jenkins/workspace/lldb-cmake/llvm-project/compiler-rt/lib/sanitizer_common -Iinclude -I/Users/buildslave/jenkins/workspace/lldb-cmake/llvm-project/llvm/include -I/Users/buildslave/jenkins/workspace/lldb-cmake/llvm-project/compiler-rt/lib/sanitizer_common/.. -Wdocumentation -fPIC -fvisibility-inlines-hidden -Werror=date-time -Werror=unguarded-availability-new -fmodules -fmodules-cache-path=/Users/buildslave/jenkins/workspace/lldb-cmake/lldb-build/module.cache -fcxx-modules -Xclang -fmodules-local-submodule-visibility -Wall -Wextra -Wno-unused-parameter -Wwrite-strings -Wcast-qual -Wmissing-field-initializers -pedantic -Wno-long-long -Wimplicit-fallthrough -Wcovered-switch-default -Wno-noexcept-type -Wnon-virtual-dtor -Wdelete-non-virtual-dtor -Wsuggest-override -Wstring-conversion -fdiagnostics-color -Wall -std=c++14 -Wno-unused-parameter -O3  -arch x86_64 -arch x86_64h -isysroot /Applications/Xcode.app/Contents/Developer/Platforms/MacOSX.platform/Developer/SDKs/MacOSX10.15.sdk    -stdlib=libc++ -mmacosx-version-min=10.10 -isysroot /Applications/Xcode.app/Contents/Developer/Platforms/MacOSX.platform/Developer/SDKs/MacOSX10.15.sdk -fPIC -fno-builtin -fno-exceptions -funwind-tables -fno-stack-protector -fno-sanitize=safe-stack -fvisibility=hidden -fno-lto -O3 -gline-tables-only -fno-modules -Wno-gnu -Wno-variadic-macros -Wno-c99-extensions -Wno-non-virtual-dtor -fno-rtti -Wframe-larger-than=570 -Wglobal-constructors -DSANITIZER_SUPPORTS_WEAK_HOOKS=0 -UNDEBUG -std=c++14 -MD -MT projects/compiler-rt/lib/sanitizer_common/CMakeFiles/RTSanitizerCommonNoHooks.osx.dir/sanitizer_mac.cpp.o -MF projects/compiler-rt/lib/sanitizer_common/CMakeFiles/RTSanitizerCommonNoHooks.osx.dir/sanitizer_mac.cpp.o.d -o projects/compiler-rt/lib/sanitizer_common/CMakeFiles/RTSanitizerCommonNoHooks.osx.dir/sanitizer_mac.cpp.o -c /Users/buildslave/jenkins/workspace/lldb-cmake/llvm-project/compiler-rt/lib/sanitizer_common/sanitizer_mac.cpp
clang-12: warning: argument unused during compilation: '-fmodules-cache-path=/Users/buildslave/jenkins/workspace/lldb-cmake/lldb-build/module.cache' [-Wunused-command-line-argument]
clang-12: warning: argument unused during compilation: '-fcxx-modules' [-Wunused-command-line-argument]
[531/3225] /Users/buildslave/jenkins/workspace/lldb-cmake/host-compiler/bin/clang++  -DGTEST_HAS_RTTI=0 -D_DEBUG -D__STDC_CONSTANT_MACROS -D__STDC_FORMAT_MACROS -D__STDC_LIMIT_MACROS -Ilib/Passes -I/Users/buildslave/jenkins/workspace/lldb-cmake/llvm-project/llvm/lib/Passes -Iinclude -I/Users/buildslave/jenkins/workspace/lldb-cmake/llvm-project/llvm/include -Wdocumentation -fPIC -fvisibility-inlines-hidden -Werror=date-time -Werror=unguarded-availability-new -fmodules -fmodules-cache-path=/Users/buildslave/jenkins/workspace/lldb-cmake/lldb-build/module.cache -fcxx-modules -Xclang -fmodules-local-submodule-visibility -Wall -Wextra -Wno-unused-parameter -Wwrite-strings -Wcast-qual -Wmissing-field-initializers -pedantic -Wno-long-long -Wimplicit-fallthrough -Wcovered-switch-default -Wno-noexcept-type -Wnon-virtual-dtor -Wdelete-non-virtual-dtor -Wsuggest-override -Wstring-conversion -fdiagnostics-color -O3  -isysroot /Applications/Xcode.app/Contents/Developer/Platforms/MacOSX.platform/Developer/SDKs/MacOSX10.15.sdk    -fno-exceptions -fno-rtti -UNDEBUG -std=c++14 -MD -MT lib/Passes/CMakeFiles/LLVMPasses.dir/StandardInstrumentations.cpp.o -MF lib/Passes/CMakeFiles/LLVMPasses.dir/StandardInstrumentations.cpp.o.d -o lib/Passes/CMakeFiles/LLVMPasses.dir/StandardInstrumentations.cpp.o -c /Users/buildslave/jenkins/workspace/lldb-cmake/llvm-project/llvm/lib/Passes/StandardInstrumentations.cpp
[532/3225] /Users/buildslave/jenkins/workspace/lldb-cmake/host-compiler/bin/clang++  -DGTEST_HAS_RTTI=0 -D_DEBUG -D__STDC_CONSTANT_MACROS -D__STDC_FORMAT_MACROS -D__STDC_LIMIT_MACROS -Ilib/ProfileData/Coverage -I/Users/buildslave/jenkins/workspace/lldb-cmake/llvm-project/llvm/lib/ProfileData/Coverage -Iinclude -I/Users/buildslave/jenkins/workspace/lldb-cmake/llvm-project/llvm/include -Wdocumentation -fPIC -fvisibility-inlines-hidden -Werror=date-time -Werror=unguarded-availability-new -fmodules -fmodules-cache-path=/Users/buildslave/jenkins/workspace/lldb-cmake/lldb-build/module.cache -fcxx-modules -Xclang -fmodules-local-submodule-visibility -Wall -Wextra -Wno-unused-parameter -Wwrite-strings -Wcast-qual -Wmissing-field-initializers -pedantic -Wno-long-long -Wimplicit-fallthrough -Wcovered-switch-default -Wno-noexcept-type -Wnon-virtual-dtor -Wdelete-non-virtual-dtor -Wsuggest-override -Wstring-conversion -fdiagnostics-color -O3  -isysroot /Applications/Xcode.app/Contents/Developer/Platforms/MacOSX.platform/Developer/SDKs/MacOSX10.15.sdk    -fno-exceptions -fno-rtti -UNDEBUG -std=c++14 -MD -MT lib/ProfileData/Coverage/CMakeFiles/LLVMCoverage.dir/CoverageMapping.cpp.o -MF lib/ProfileData/Coverage/CMakeFiles/LLVMCoverage.dir/CoverageMapping.cpp.o.d -o lib/ProfileData/Coverage/CMakeFiles/LLVMCoverage.dir/CoverageMapping.cpp.o -c /Users/buildslave/jenkins/workspace/lldb-cmake/llvm-project/llvm/lib/ProfileData/Coverage/CoverageMapping.cpp
[533/3225] /Users/buildslave/jenkins/workspace/lldb-cmake/host-compiler/bin/clang++  -DGTEST_HAS_RTTI=0 -D_DEBUG -D__STDC_CONSTANT_MACROS -D__STDC_FORMAT_MACROS -D__STDC_LIMIT_MACROS -Ilib/ProfileData/Coverage -I/Users/buildslave/jenkins/workspace/lldb-cmake/llvm-project/llvm/lib/ProfileData/Coverage -Iinclude -I/Users/buildslave/jenkins/workspace/lldb-cmake/llvm-project/llvm/include -Wdocumentation -fPIC -fvisibility-inlines-hidden -Werror=date-time -Werror=unguarded-availability-new -fmodules -fmodules-cache-path=/Users/buildslave/jenkins/workspace/lldb-cmake/lldb-build/module.cache -fcxx-modules -Xclang -fmodules-local-submodule-visibility -Wall -Wextra -Wno-unused-parameter -Wwrite-strings -Wcast-qual -Wmissing-field-initializers -pedantic -Wno-long-long -Wimplicit-fallthrough -Wcovered-switch-default -Wno-noexcept-type -Wnon-virtual-dtor -Wdelete-non-virtual-dtor -Wsuggest-override -Wstring-conversion -fdiagnostics-color -O3  -isysroot /Applications/Xcode.app/Contents/Developer/Platforms/MacOSX.platform/Developer/SDKs/MacOSX10.15.sdk    -fno-exceptions -fno-rtti -UNDEBUG -std=c++14 -MD -MT lib/ProfileData/Coverage/CMakeFiles/LLVMCoverage.dir/CoverageMappingReader.cpp.o -MF lib/ProfileData/Coverage/CMakeFiles/LLVMCoverage.dir/CoverageMappingReader.cpp.o.d -o lib/ProfileData/Coverage/CMakeFiles/LLVMCoverage.dir/CoverageMappingReader.cpp.o -c /Users/buildslave/jenkins/workspace/lldb-cmake/llvm-project/llvm/lib/ProfileData/Coverage/CoverageMappingReader.cpp
[534/3225] /Users/buildslave/jenkins/workspace/lldb-cmake/host-compiler/bin/clang++  -DGTEST_HAS_RTTI=0 -D_DEBUG -D__STDC_CONSTANT_MACROS -D__STDC_FORMAT_MACROS -D__STDC_LIMIT_MACROS -Ilib/AsmParser -I/Users/buildslave/jenkins/workspace/lldb-cmake/llvm-project/llvm/lib/AsmParser -Iinclude -I/Users/buildslave/jenkins/workspace/lldb-cmake/llvm-project/llvm/include -Wdocumentation -fPIC -fvisibility-inlines-hidden -Werror=date-time -Werror=unguarded-availability-new -fmodules -fmodules-cache-path=/Users/buildslave/jenkins/workspace/lldb-cmake/lldb-build/module.cache -fcxx-modules -Xclang -fmodules-local-submodule-visibility -Wall -Wextra -Wno-unused-parameter -Wwrite-strings -Wcast-qual -Wmissing-field-initializers -pedantic -Wno-long-long -Wimplicit-fallthrough -Wcovered-switch-default -Wno-noexcept-type -Wnon-virtual-dtor -Wdelete-non-virtual-dtor -Wsuggest-override -Wstring-conversion -fdiagnostics-color -O3  -isysroot /Applications/Xcode.app/Contents/Developer/Platforms/MacOSX.platform/Developer/SDKs/MacOSX10.15.sdk    -fno-exceptions -fno-rtti -UNDEBUG -std=c++14 -MD -MT lib/AsmParser/CMakeFiles/LLVMAsmParser.dir/LLParser.cpp.o -MF lib/AsmParser/CMakeFiles/LLVMAsmParser.dir/LLParser.cpp.o.d -o lib/AsmParser/CMakeFiles/LLVMAsmParser.dir/LLParser.cpp.o -c /Users/buildslave/jenkins/workspace/lldb-cmake/llvm-project/llvm/lib/AsmParser/LLParser.cpp
ninja: build stopped: subcommand failed.
Command failed: Command '['/usr/local/bin/ninja', '-v']' returned non-zero exit status 1
Command: ['/usr/local/bin/ninja', '-v']
[Pipeline] }
[Pipeline] // timeout
[Pipeline] }
[Pipeline] // stage
[Pipeline] stage
[Pipeline] { (Test)
Stage "Test" skipped due to earlier failure(s)
[Pipeline] }
[Pipeline] // stage
[Pipeline] stage
[Pipeline] { (Declarative: Post Actions)
[Pipeline] scanForIssues
[Clang (LLVM based)] Sleeping for 5 seconds due to JENKINS-32191...
[Clang (LLVM based)] Parsing console log (workspace: '/Users/buildslave/jenkins/workspace/lldb-cmake')
[Clang (LLVM based)] Successfully parsed console log
[Clang (LLVM based)] -> found 1 issue (skipped 2 duplicates)
[Clang (LLVM based)] Post processing issues on 'green-dragon-10' with source code encoding 'UTF-8'
[Clang (LLVM based)] Creating SCM blamer to obtain author and commit information for affected files
[Clang (LLVM based)] Creating SCM miner to obtain statistics for affected repository files
[Clang (LLVM based)] Resolving file names for all issues in source directory '/Users/buildslave/jenkins/workspace/lldb-cmake'
[Clang (LLVM based)] -> resolved paths in source directory (1 found, 0 not found)
[Clang (LLVM based)] Resolving module names from module definitions (build.xml, pom.xml, or Manifest.mf files)
[Clang (LLVM based)] -> resolved module names for 1 issues
[Clang (LLVM based)] Resolving package names (or namespaces) by parsing the affected files
[Clang (LLVM based)] -> resolved package names of 1 affected files
[Clang (LLVM based)] No filter has been set, publishing all 1 issues
[Clang (LLVM based)] Creating fingerprints for all affected code blocks to track issues over different builds
[Clang (LLVM based)] -> created fingerprints for 1 issues (skipped 0 issues)
[Clang (LLVM based)] Copying affected files to Jenkins' build folder '/Users/Shared/Jenkins/Home/jobs/lldb-cmake/builds/24037/files-with-issues'
[Clang (LLVM based)] -> 1 copied, 0 not in workspace, 0 not-found, 0 with I/O error
[Pipeline] junit
Recording test results
Test reports were found but none of them are new. Did leafNodes run? 
For example, /Users/buildslave/jenkins/workspace/lldb-cmake/test/results.xml is 2 hr 20 min old

Hide Details

Error when executing always post condition: Also: hudson.remoting.Channel$CallSiteStackTrace: Remote call to green-dragon-10 at hudson.remoting.Channel.attachCallSiteStackTrace(Channel.java:1788) at hudson.remoting.UserRequest$ExceptionResponse.retrieve(UserRequest.java:356) at hudson.remoting.Channel.call(Channel.java:998) at hudson.FilePath.act(FilePath.java:1069) at hudson.FilePath.act(FilePath.java:1058) at hudson.tasks.junit.JUnitParser.parseResult(JUnitParser.java:114) at hudson.tasks.junit.JUnitResultArchiver.parse(JUnitResultArchiver.java:137) at hudson.tasks.junit.JUnitResultArchiver.parseAndAttach(JUnitResultArchiver.java:167) at hudson.tasks.junit.pipeline.JUnitResultsStepExecution.run(JUnitResultsStepExecution.java:52) at hudson.tasks.junit.pipeline.JUnitResultsStepExecution.run(JUnitResultsStepExecution.java:25) at org.jenkinsci.plugins.workflow.steps.SynchronousNonBlockingStepExecution.lambda$start$0(SynchronousNonBlockingStepExecution.java:47) at java.util.concurrent.Executors$RunnableAdapter.call(Executors.java:511) at java.util.concurrent.FutureTask.run(FutureTask.java:266) at java.util.concurrent.ThreadPoolExecutor.runWorker(ThreadPoolExecutor.java:1149) at java.util.concurrent.ThreadPoolExecutor$Worker.run(ThreadPoolExecutor.java:624) at java.lang.Thread.run(Thread.java:748) hudson.AbortException: Test reports were found but none of them are new. Did leafNodes run? For example, /Users/buildslave/jenkins/workspace/lldb-cmake/test/results.xml is 2 hr 20 min old

Hide Details

at hudson.tasks.junit.TestResult.parse(TestResult.java:222) at hudson.tasks.junit.TestResult.parse(TestResult.java:178) at hudson.tasks.junit.TestResult.<init>(TestResult.java:143) at hudson.tasks.junit.JUnitParser$ParseResultCallable.invoke(JUnitParser.java:146) at hudson.tasks.junit.JUnitParser$ParseResultCallable.invoke(JUnitParser.java:118) at hudson.FilePath$FileCallableWrapper.call(FilePath.java:3073) at hudson.remoting.UserRequest.perform(UserRequest.java:211) at hudson.remoting.UserRequest.perform(UserRequest.java:54) at hudson.remoting.Request$2.run(Request.java:369) at hudson.remoting.InterceptingExecutorService$1.call(InterceptingExecutorService.java:72) at java.util.concurrent.FutureTask.run(Unknown Source) at java.util.concurrent.ThreadPoolExecutor.runWorker(Unknown Source) at java.util.concurrent.ThreadPoolExecutor$Worker.run(Unknown Source) at java.lang.Thread.run(Unknown Source)

Hide Details

[Pipeline] } [Pipeline] // stage [Pipeline] } [Pipeline] // withEnv [Pipeline] } [Pipeline] // node [Pipeline] End of Pipeline ERROR: script returned exit code 1 Finished: FAILURE