FailedConsole Output

Skipping 2,536 KB.. Full Log
rkspace/lldb-cmake/host-compiler/bin/clang++  -DGTEST_HAS_RTTI=0 -D_DEBUG -D__STDC_CONSTANT_MACROS -D__STDC_FORMAT_MACROS -D__STDC_LIMIT_MACROS -Ilib/MC -I/Users/buildslave/jenkins/workspace/lldb-cmake/llvm-project/llvm/lib/MC -Iinclude -I/Users/buildslave/jenkins/workspace/lldb-cmake/llvm-project/llvm/include -Wdocumentation -fPIC -fvisibility-inlines-hidden -Werror=date-time -Werror=unguarded-availability-new -fmodules -fmodules-cache-path=/Users/buildslave/jenkins/workspace/lldb-cmake/lldb-build/module.cache -fcxx-modules -Xclang -fmodules-local-submodule-visibility -Wall -Wextra -Wno-unused-parameter -Wwrite-strings -Wcast-qual -Wmissing-field-initializers -pedantic -Wno-long-long -Wimplicit-fallthrough -Wcovered-switch-default -Wno-noexcept-type -Wnon-virtual-dtor -Wdelete-non-virtual-dtor -Wsuggest-override -Wstring-conversion -fdiagnostics-color -O3  -isysroot /Applications/Xcode.app/Contents/Developer/Platforms/MacOSX.platform/Developer/SDKs/MacOSX10.15.sdk    -fno-exceptions -fno-rtti -UNDEBUG -std=c++14 -MD -MT lib/MC/CMakeFiles/LLVMMC.dir/MCCodeEmitter.cpp.o -MF lib/MC/CMakeFiles/LLVMMC.dir/MCCodeEmitter.cpp.o.d -o lib/MC/CMakeFiles/LLVMMC.dir/MCCodeEmitter.cpp.o -c /Users/buildslave/jenkins/workspace/lldb-cmake/llvm-project/llvm/lib/MC/MCCodeEmitter.cpp
[246/3090] /Users/buildslave/jenkins/workspace/lldb-cmake/host-compiler/bin/clang++  -DGTEST_HAS_RTTI=0 -D_DEBUG -D__STDC_CONSTANT_MACROS -D__STDC_FORMAT_MACROS -D__STDC_LIMIT_MACROS -Ilib/Analysis -I/Users/buildslave/jenkins/workspace/lldb-cmake/llvm-project/llvm/lib/Analysis -Iinclude -I/Users/buildslave/jenkins/workspace/lldb-cmake/llvm-project/llvm/include -Wdocumentation -fPIC -fvisibility-inlines-hidden -Werror=date-time -Werror=unguarded-availability-new -fmodules -fmodules-cache-path=/Users/buildslave/jenkins/workspace/lldb-cmake/lldb-build/module.cache -fcxx-modules -Xclang -fmodules-local-submodule-visibility -Wall -Wextra -Wno-unused-parameter -Wwrite-strings -Wcast-qual -Wmissing-field-initializers -pedantic -Wno-long-long -Wimplicit-fallthrough -Wcovered-switch-default -Wno-noexcept-type -Wnon-virtual-dtor -Wdelete-non-virtual-dtor -Wsuggest-override -Wstring-conversion -fdiagnostics-color -O3  -isysroot /Applications/Xcode.app/Contents/Developer/Platforms/MacOSX.platform/Developer/SDKs/MacOSX10.15.sdk    -fno-exceptions -fno-rtti -UNDEBUG -std=c++14 -MD -MT lib/Analysis/CMakeFiles/LLVMAnalysis.dir/ValueTracking.cpp.o -MF lib/Analysis/CMakeFiles/LLVMAnalysis.dir/ValueTracking.cpp.o.d -o lib/Analysis/CMakeFiles/LLVMAnalysis.dir/ValueTracking.cpp.o -c /Users/buildslave/jenkins/workspace/lldb-cmake/llvm-project/llvm/lib/Analysis/ValueTracking.cpp
[247/3090] /Users/buildslave/jenkins/workspace/lldb-cmake/host-compiler/bin/clang++  -DGTEST_HAS_RTTI=0 -D_DEBUG -D__STDC_CONSTANT_MACROS -D__STDC_FORMAT_MACROS -D__STDC_LIMIT_MACROS -Ilib/LTO -I/Users/buildslave/jenkins/workspace/lldb-cmake/llvm-project/llvm/lib/LTO -Iinclude -I/Users/buildslave/jenkins/workspace/lldb-cmake/llvm-project/llvm/include -Wdocumentation -fPIC -fvisibility-inlines-hidden -Werror=date-time -Werror=unguarded-availability-new -fmodules -fmodules-cache-path=/Users/buildslave/jenkins/workspace/lldb-cmake/lldb-build/module.cache -fcxx-modules -Xclang -fmodules-local-submodule-visibility -Wall -Wextra -Wno-unused-parameter -Wwrite-strings -Wcast-qual -Wmissing-field-initializers -pedantic -Wno-long-long -Wimplicit-fallthrough -Wcovered-switch-default -Wno-noexcept-type -Wnon-virtual-dtor -Wdelete-non-virtual-dtor -Wsuggest-override -Wstring-conversion -fdiagnostics-color -O3  -isysroot /Applications/Xcode.app/Contents/Developer/Platforms/MacOSX.platform/Developer/SDKs/MacOSX10.15.sdk    -fno-exceptions -fno-rtti -UNDEBUG -std=c++14 -MD -MT lib/LTO/CMakeFiles/LLVMLTO.dir/ThinLTOCodeGenerator.cpp.o -MF lib/LTO/CMakeFiles/LLVMLTO.dir/ThinLTOCodeGenerator.cpp.o.d -o lib/LTO/CMakeFiles/LLVMLTO.dir/ThinLTOCodeGenerator.cpp.o -c /Users/buildslave/jenkins/workspace/lldb-cmake/llvm-project/llvm/lib/LTO/ThinLTOCodeGenerator.cpp
[248/3090] /Users/buildslave/jenkins/workspace/lldb-cmake/host-compiler/bin/clang++  -DGTEST_HAS_RTTI=0 -D_DEBUG -D__STDC_CONSTANT_MACROS -D__STDC_FORMAT_MACROS -D__STDC_LIMIT_MACROS -Ilib/MC -I/Users/buildslave/jenkins/workspace/lldb-cmake/llvm-project/llvm/lib/MC -Iinclude -I/Users/buildslave/jenkins/workspace/lldb-cmake/llvm-project/llvm/include -Wdocumentation -fPIC -fvisibility-inlines-hidden -Werror=date-time -Werror=unguarded-availability-new -fmodules -fmodules-cache-path=/Users/buildslave/jenkins/workspace/lldb-cmake/lldb-build/module.cache -fcxx-modules -Xclang -fmodules-local-submodule-visibility -Wall -Wextra -Wno-unused-parameter -Wwrite-strings -Wcast-qual -Wmissing-field-initializers -pedantic -Wno-long-long -Wimplicit-fallthrough -Wcovered-switch-default -Wno-noexcept-type -Wnon-virtual-dtor -Wdelete-non-virtual-dtor -Wsuggest-override -Wstring-conversion -fdiagnostics-color -O3  -isysroot /Applications/Xcode.app/Contents/Developer/Platforms/MacOSX.platform/Developer/SDKs/MacOSX10.15.sdk    -fno-exceptions -fno-rtti -UNDEBUG -std=c++14 -MD -MT lib/MC/CMakeFiles/LLVMMC.dir/MCAssembler.cpp.o -MF lib/MC/CMakeFiles/LLVMMC.dir/MCAssembler.cpp.o.d -o lib/MC/CMakeFiles/LLVMMC.dir/MCAssembler.cpp.o -c /Users/buildslave/jenkins/workspace/lldb-cmake/llvm-project/llvm/lib/MC/MCAssembler.cpp
[249/3090] /Users/buildslave/jenkins/workspace/lldb-cmake/host-compiler/bin/clang++  -DGTEST_HAS_RTTI=0 -D_DEBUG -D__STDC_CONSTANT_MACROS -D__STDC_FORMAT_MACROS -D__STDC_LIMIT_MACROS -Ilib/MC -I/Users/buildslave/jenkins/workspace/lldb-cmake/llvm-project/llvm/lib/MC -Iinclude -I/Users/buildslave/jenkins/workspace/lldb-cmake/llvm-project/llvm/include -Wdocumentation -fPIC -fvisibility-inlines-hidden -Werror=date-time -Werror=unguarded-availability-new -fmodules -fmodules-cache-path=/Users/buildslave/jenkins/workspace/lldb-cmake/lldb-build/module.cache -fcxx-modules -Xclang -fmodules-local-submodule-visibility -Wall -Wextra -Wno-unused-parameter -Wwrite-strings -Wcast-qual -Wmissing-field-initializers -pedantic -Wno-long-long -Wimplicit-fallthrough -Wcovered-switch-default -Wno-noexcept-type -Wnon-virtual-dtor -Wdelete-non-virtual-dtor -Wsuggest-override -Wstring-conversion -fdiagnostics-color -O3  -isysroot /Applications/Xcode.app/Contents/Developer/Platforms/MacOSX.platform/Developer/SDKs/MacOSX10.15.sdk    -fno-exceptions -fno-rtti -UNDEBUG -std=c++14 -MD -MT lib/MC/CMakeFiles/LLVMMC.dir/MCAsmStreamer.cpp.o -MF lib/MC/CMakeFiles/LLVMMC.dir/MCAsmStreamer.cpp.o.d -o lib/MC/CMakeFiles/LLVMMC.dir/MCAsmStreamer.cpp.o -c /Users/buildslave/jenkins/workspace/lldb-cmake/llvm-project/llvm/lib/MC/MCAsmStreamer.cpp
[250/3090] /Users/buildslave/jenkins/workspace/lldb-cmake/host-compiler/bin/clang++  -DGTEST_HAS_RTTI=0 -D_DEBUG -D__STDC_CONSTANT_MACROS -D__STDC_FORMAT_MACROS -D__STDC_LIMIT_MACROS -Ilib/MC -I/Users/buildslave/jenkins/workspace/lldb-cmake/llvm-project/llvm/lib/MC -Iinclude -I/Users/buildslave/jenkins/workspace/lldb-cmake/llvm-project/llvm/include -Wdocumentation -fPIC -fvisibility-inlines-hidden -Werror=date-time -Werror=unguarded-availability-new -fmodules -fmodules-cache-path=/Users/buildslave/jenkins/workspace/lldb-cmake/lldb-build/module.cache -fcxx-modules -Xclang -fmodules-local-submodule-visibility -Wall -Wextra -Wno-unused-parameter -Wwrite-strings -Wcast-qual -Wmissing-field-initializers -pedantic -Wno-long-long -Wimplicit-fallthrough -Wcovered-switch-default -Wno-noexcept-type -Wnon-virtual-dtor -Wdelete-non-virtual-dtor -Wsuggest-override -Wstring-conversion -fdiagnostics-color -O3  -isysroot /Applications/Xcode.app/Contents/Developer/Platforms/MacOSX.platform/Developer/SDKs/MacOSX10.15.sdk    -fno-exceptions -fno-rtti -UNDEBUG -std=c++14 -MD -MT lib/MC/CMakeFiles/LLVMMC.dir/MCELFObjectTargetWriter.cpp.o -MF lib/MC/CMakeFiles/LLVMMC.dir/MCELFObjectTargetWriter.cpp.o.d -o lib/MC/CMakeFiles/LLVMMC.dir/MCELFObjectTargetWriter.cpp.o -c /Users/buildslave/jenkins/workspace/lldb-cmake/llvm-project/llvm/lib/MC/MCELFObjectTargetWriter.cpp
[251/3090] /Users/buildslave/jenkins/workspace/lldb-cmake/host-compiler/bin/clang++  -DGTEST_HAS_RTTI=0 -D_DEBUG -D__STDC_CONSTANT_MACROS -D__STDC_FORMAT_MACROS -D__STDC_LIMIT_MACROS -Ilib/MC -I/Users/buildslave/jenkins/workspace/lldb-cmake/llvm-project/llvm/lib/MC -Iinclude -I/Users/buildslave/jenkins/workspace/lldb-cmake/llvm-project/llvm/include -Wdocumentation -fPIC -fvisibility-inlines-hidden -Werror=date-time -Werror=unguarded-availability-new -fmodules -fmodules-cache-path=/Users/buildslave/jenkins/workspace/lldb-cmake/lldb-build/module.cache -fcxx-modules -Xclang -fmodules-local-submodule-visibility -Wall -Wextra -Wno-unused-parameter -Wwrite-strings -Wcast-qual -Wmissing-field-initializers -pedantic -Wno-long-long -Wimplicit-fallthrough -Wcovered-switch-default -Wno-noexcept-type -Wnon-virtual-dtor -Wdelete-non-virtual-dtor -Wsuggest-override -Wstring-conversion -fdiagnostics-color -O3  -isysroot /Applications/Xcode.app/Contents/Developer/Platforms/MacOSX.platform/Developer/SDKs/MacOSX10.15.sdk    -fno-exceptions -fno-rtti -UNDEBUG -std=c++14 -MD -MT lib/MC/CMakeFiles/LLVMMC.dir/MCCodeView.cpp.o -MF lib/MC/CMakeFiles/LLVMMC.dir/MCCodeView.cpp.o.d -o lib/MC/CMakeFiles/LLVMMC.dir/MCCodeView.cpp.o -c /Users/buildslave/jenkins/workspace/lldb-cmake/llvm-project/llvm/lib/MC/MCCodeView.cpp
[252/3090] /Users/buildslave/jenkins/workspace/lldb-cmake/host-compiler/bin/clang++  -DGTEST_HAS_RTTI=0 -D_DEBUG -D__STDC_CONSTANT_MACROS -D__STDC_FORMAT_MACROS -D__STDC_LIMIT_MACROS -Ilib/MC -I/Users/buildslave/jenkins/workspace/lldb-cmake/llvm-project/llvm/lib/MC -Iinclude -I/Users/buildslave/jenkins/workspace/lldb-cmake/llvm-project/llvm/include -Wdocumentation -fPIC -fvisibility-inlines-hidden -Werror=date-time -Werror=unguarded-availability-new -fmodules -fmodules-cache-path=/Users/buildslave/jenkins/workspace/lldb-cmake/lldb-build/module.cache -fcxx-modules -Xclang -fmodules-local-submodule-visibility -Wall -Wextra -Wno-unused-parameter -Wwrite-strings -Wcast-qual -Wmissing-field-initializers -pedantic -Wno-long-long -Wimplicit-fallthrough -Wcovered-switch-default -Wno-noexcept-type -Wnon-virtual-dtor -Wdelete-non-virtual-dtor -Wsuggest-override -Wstring-conversion -fdiagnostics-color -O3  -isysroot /Applications/Xcode.app/Contents/Developer/Platforms/MacOSX.platform/Developer/SDKs/MacOSX10.15.sdk    -fno-exceptions -fno-rtti -UNDEBUG -std=c++14 -MD -MT lib/MC/CMakeFiles/LLVMMC.dir/MCExpr.cpp.o -MF lib/MC/CMakeFiles/LLVMMC.dir/MCExpr.cpp.o.d -o lib/MC/CMakeFiles/LLVMMC.dir/MCExpr.cpp.o -c /Users/buildslave/jenkins/workspace/lldb-cmake/llvm-project/llvm/lib/MC/MCExpr.cpp
[253/3090] /Users/buildslave/jenkins/workspace/lldb-cmake/host-compiler/bin/clang++  -DGTEST_HAS_RTTI=0 -D_DEBUG -D__STDC_CONSTANT_MACROS -D__STDC_FORMAT_MACROS -D__STDC_LIMIT_MACROS -Ilib/MC -I/Users/buildslave/jenkins/workspace/lldb-cmake/llvm-project/llvm/lib/MC -Iinclude -I/Users/buildslave/jenkins/workspace/lldb-cmake/llvm-project/llvm/include -Wdocumentation -fPIC -fvisibility-inlines-hidden -Werror=date-time -Werror=unguarded-availability-new -fmodules -fmodules-cache-path=/Users/buildslave/jenkins/workspace/lldb-cmake/lldb-build/module.cache -fcxx-modules -Xclang -fmodules-local-submodule-visibility -Wall -Wextra -Wno-unused-parameter -Wwrite-strings -Wcast-qual -Wmissing-field-initializers -pedantic -Wno-long-long -Wimplicit-fallthrough -Wcovered-switch-default -Wno-noexcept-type -Wnon-virtual-dtor -Wdelete-non-virtual-dtor -Wsuggest-override -Wstring-conversion -fdiagnostics-color -O3  -isysroot /Applications/Xcode.app/Contents/Developer/Platforms/MacOSX.platform/Developer/SDKs/MacOSX10.15.sdk    -fno-exceptions -fno-rtti -UNDEBUG -std=c++14 -MD -MT lib/MC/CMakeFiles/LLVMMC.dir/MCELFStreamer.cpp.o -MF lib/MC/CMakeFiles/LLVMMC.dir/MCELFStreamer.cpp.o.d -o lib/MC/CMakeFiles/LLVMMC.dir/MCELFStreamer.cpp.o -c /Users/buildslave/jenkins/workspace/lldb-cmake/llvm-project/llvm/lib/MC/MCELFStreamer.cpp
[254/3090] /Users/buildslave/jenkins/workspace/lldb-cmake/host-compiler/bin/clang++  -DGTEST_HAS_RTTI=0 -D_DEBUG -D__STDC_CONSTANT_MACROS -D__STDC_FORMAT_MACROS -D__STDC_LIMIT_MACROS -Ilib/MC -I/Users/buildslave/jenkins/workspace/lldb-cmake/llvm-project/llvm/lib/MC -Iinclude -I/Users/buildslave/jenkins/workspace/lldb-cmake/llvm-project/llvm/include -Wdocumentation -fPIC -fvisibility-inlines-hidden -Werror=date-time -Werror=unguarded-availability-new -fmodules -fmodules-cache-path=/Users/buildslave/jenkins/workspace/lldb-cmake/lldb-build/module.cache -fcxx-modules -Xclang -fmodules-local-submodule-visibility -Wall -Wextra -Wno-unused-parameter -Wwrite-strings -Wcast-qual -Wmissing-field-initializers -pedantic -Wno-long-long -Wimplicit-fallthrough -Wcovered-switch-default -Wno-noexcept-type -Wnon-virtual-dtor -Wdelete-non-virtual-dtor -Wsuggest-override -Wstring-conversion -fdiagnostics-color -O3  -isysroot /Applications/Xcode.app/Contents/Developer/Platforms/MacOSX.platform/Developer/SDKs/MacOSX10.15.sdk    -fno-exceptions -fno-rtti -UNDEBUG -std=c++14 -MD -MT lib/MC/CMakeFiles/LLVMMC.dir/MCInst.cpp.o -MF lib/MC/CMakeFiles/LLVMMC.dir/MCInst.cpp.o.d -o lib/MC/CMakeFiles/LLVMMC.dir/MCInst.cpp.o -c /Users/buildslave/jenkins/workspace/lldb-cmake/llvm-project/llvm/lib/MC/MCInst.cpp
[255/3090] /Users/buildslave/jenkins/workspace/lldb-cmake/host-compiler/bin/clang++  -DGTEST_HAS_RTTI=0 -D_DEBUG -D__STDC_CONSTANT_MACROS -D__STDC_FORMAT_MACROS -D__STDC_LIMIT_MACROS -Ilib/MC -I/Users/buildslave/jenkins/workspace/lldb-cmake/llvm-project/llvm/lib/MC -Iinclude -I/Users/buildslave/jenkins/workspace/lldb-cmake/llvm-project/llvm/include -Wdocumentation -fPIC -fvisibility-inlines-hidden -Werror=date-time -Werror=unguarded-availability-new -fmodules -fmodules-cache-path=/Users/buildslave/jenkins/workspace/lldb-cmake/lldb-build/module.cache -fcxx-modules -Xclang -fmodules-local-submodule-visibility -Wall -Wextra -Wno-unused-parameter -Wwrite-strings -Wcast-qual -Wmissing-field-initializers -pedantic -Wno-long-long -Wimplicit-fallthrough -Wcovered-switch-default -Wno-noexcept-type -Wnon-virtual-dtor -Wdelete-non-virtual-dtor -Wsuggest-override -Wstring-conversion -fdiagnostics-color -O3  -isysroot /Applications/Xcode.app/Contents/Developer/Platforms/MacOSX.platform/Developer/SDKs/MacOSX10.15.sdk    -fno-exceptions -fno-rtti -UNDEBUG -std=c++14 -MD -MT lib/MC/CMakeFiles/LLVMMC.dir/MCInstrAnalysis.cpp.o -MF lib/MC/CMakeFiles/LLVMMC.dir/MCInstrAnalysis.cpp.o.d -o lib/MC/CMakeFiles/LLVMMC.dir/MCInstrAnalysis.cpp.o -c /Users/buildslave/jenkins/workspace/lldb-cmake/llvm-project/llvm/lib/MC/MCInstrAnalysis.cpp
[256/3090] /Users/buildslave/jenkins/workspace/lldb-cmake/host-compiler/bin/clang++  -DGTEST_HAS_RTTI=0 -D_DEBUG -D__STDC_CONSTANT_MACROS -D__STDC_FORMAT_MACROS -D__STDC_LIMIT_MACROS -Ilib/MC -I/Users/buildslave/jenkins/workspace/lldb-cmake/llvm-project/llvm/lib/MC -Iinclude -I/Users/buildslave/jenkins/workspace/lldb-cmake/llvm-project/llvm/include -Wdocumentation -fPIC -fvisibility-inlines-hidden -Werror=date-time -Werror=unguarded-availability-new -fmodules -fmodules-cache-path=/Users/buildslave/jenkins/workspace/lldb-cmake/lldb-build/module.cache -fcxx-modules -Xclang -fmodules-local-submodule-visibility -Wall -Wextra -Wno-unused-parameter -Wwrite-strings -Wcast-qual -Wmissing-field-initializers -pedantic -Wno-long-long -Wimplicit-fallthrough -Wcovered-switch-default -Wno-noexcept-type -Wnon-virtual-dtor -Wdelete-non-virtual-dtor -Wsuggest-override -Wstring-conversion -fdiagnostics-color -O3  -isysroot /Applications/Xcode.app/Contents/Developer/Platforms/MacOSX.platform/Developer/SDKs/MacOSX10.15.sdk    -fno-exceptions -fno-rtti -UNDEBUG -std=c++14 -MD -MT lib/MC/CMakeFiles/LLVMMC.dir/MCInstrDesc.cpp.o -MF lib/MC/CMakeFiles/LLVMMC.dir/MCInstrDesc.cpp.o.d -o lib/MC/CMakeFiles/LLVMMC.dir/MCInstrDesc.cpp.o -c /Users/buildslave/jenkins/workspace/lldb-cmake/llvm-project/llvm/lib/MC/MCInstrDesc.cpp
[257/3090] /Users/buildslave/jenkins/workspace/lldb-cmake/host-compiler/bin/clang++  -DGTEST_HAS_RTTI=0 -D_DEBUG -D__STDC_CONSTANT_MACROS -D__STDC_FORMAT_MACROS -D__STDC_LIMIT_MACROS -Ilib/MC -I/Users/buildslave/jenkins/workspace/lldb-cmake/llvm-project/llvm/lib/MC -Iinclude -I/Users/buildslave/jenkins/workspace/lldb-cmake/llvm-project/llvm/include -Wdocumentation -fPIC -fvisibility-inlines-hidden -Werror=date-time -Werror=unguarded-availability-new -fmodules -fmodules-cache-path=/Users/buildslave/jenkins/workspace/lldb-cmake/lldb-build/module.cache -fcxx-modules -Xclang -fmodules-local-submodule-visibility -Wall -Wextra -Wno-unused-parameter -Wwrite-strings -Wcast-qual -Wmissing-field-initializers -pedantic -Wno-long-long -Wimplicit-fallthrough -Wcovered-switch-default -Wno-noexcept-type -Wnon-virtual-dtor -Wdelete-non-virtual-dtor -Wsuggest-override -Wstring-conversion -fdiagnostics-color -O3  -isysroot /Applications/Xcode.app/Contents/Developer/Platforms/MacOSX.platform/Developer/SDKs/MacOSX10.15.sdk    -fno-exceptions -fno-rtti -UNDEBUG -std=c++14 -MD -MT lib/MC/CMakeFiles/LLVMMC.dir/MCFragment.cpp.o -MF lib/MC/CMakeFiles/LLVMMC.dir/MCFragment.cpp.o.d -o lib/MC/CMakeFiles/LLVMMC.dir/MCFragment.cpp.o -c /Users/buildslave/jenkins/workspace/lldb-cmake/llvm-project/llvm/lib/MC/MCFragment.cpp
[258/3090] /Users/buildslave/jenkins/workspace/lldb-cmake/host-compiler/bin/clang++  -DGTEST_HAS_RTTI=0 -D_DEBUG -D__STDC_CONSTANT_MACROS -D__STDC_FORMAT_MACROS -D__STDC_LIMIT_MACROS -Ilib/MC -I/Users/buildslave/jenkins/workspace/lldb-cmake/llvm-project/llvm/lib/MC -Iinclude -I/Users/buildslave/jenkins/workspace/lldb-cmake/llvm-project/llvm/include -Wdocumentation -fPIC -fvisibility-inlines-hidden -Werror=date-time -Werror=unguarded-availability-new -fmodules -fmodules-cache-path=/Users/buildslave/jenkins/workspace/lldb-cmake/lldb-build/module.cache -fcxx-modules -Xclang -fmodules-local-submodule-visibility -Wall -Wextra -Wno-unused-parameter -Wwrite-strings -Wcast-qual -Wmissing-field-initializers -pedantic -Wno-long-long -Wimplicit-fallthrough -Wcovered-switch-default -Wno-noexcept-type -Wnon-virtual-dtor -Wdelete-non-virtual-dtor -Wsuggest-override -Wstring-conversion -fdiagnostics-color -O3  -isysroot /Applications/Xcode.app/Contents/Developer/Platforms/MacOSX.platform/Developer/SDKs/MacOSX10.15.sdk    -fno-exceptions -fno-rtti -UNDEBUG -std=c++14 -MD -MT lib/MC/CMakeFiles/LLVMMC.dir/MCInstrInfo.cpp.o -MF lib/MC/CMakeFiles/LLVMMC.dir/MCInstrInfo.cpp.o.d -o lib/MC/CMakeFiles/LLVMMC.dir/MCInstrInfo.cpp.o -c /Users/buildslave/jenkins/workspace/lldb-cmake/llvm-project/llvm/lib/MC/MCInstrInfo.cpp
[259/3090] /Users/buildslave/jenkins/workspace/lldb-cmake/host-compiler/bin/clang++  -DGTEST_HAS_RTTI=0 -D_DEBUG -D__STDC_CONSTANT_MACROS -D__STDC_FORMAT_MACROS -D__STDC_LIMIT_MACROS -Ilib/MC -I/Users/buildslave/jenkins/workspace/lldb-cmake/llvm-project/llvm/lib/MC -Iinclude -I/Users/buildslave/jenkins/workspace/lldb-cmake/llvm-project/llvm/include -Wdocumentation -fPIC -fvisibility-inlines-hidden -Werror=date-time -Werror=unguarded-availability-new -fmodules -fmodules-cache-path=/Users/buildslave/jenkins/workspace/lldb-cmake/lldb-build/module.cache -fcxx-modules -Xclang -fmodules-local-submodule-visibility -Wall -Wextra -Wno-unused-parameter -Wwrite-strings -Wcast-qual -Wmissing-field-initializers -pedantic -Wno-long-long -Wimplicit-fallthrough -Wcovered-switch-default -Wno-noexcept-type -Wnon-virtual-dtor -Wdelete-non-virtual-dtor -Wsuggest-override -Wstring-conversion -fdiagnostics-color -O3  -isysroot /Applications/Xcode.app/Contents/Developer/Platforms/MacOSX.platform/Developer/SDKs/MacOSX10.15.sdk    -fno-exceptions -fno-rtti -UNDEBUG -std=c++14 -MD -MT lib/MC/CMakeFiles/LLVMMC.dir/MCInstPrinter.cpp.o -MF lib/MC/CMakeFiles/LLVMMC.dir/MCInstPrinter.cpp.o.d -o lib/MC/CMakeFiles/LLVMMC.dir/MCInstPrinter.cpp.o -c /Users/buildslave/jenkins/workspace/lldb-cmake/llvm-project/llvm/lib/MC/MCInstPrinter.cpp
[260/3090] /Users/buildslave/jenkins/workspace/lldb-cmake/host-compiler/bin/clang++  -DGTEST_HAS_RTTI=0 -D_DEBUG -D__STDC_CONSTANT_MACROS -D__STDC_FORMAT_MACROS -D__STDC_LIMIT_MACROS -Ilib/MC -I/Users/buildslave/jenkins/workspace/lldb-cmake/llvm-project/llvm/lib/MC -Iinclude -I/Users/buildslave/jenkins/workspace/lldb-cmake/llvm-project/llvm/include -Wdocumentation -fPIC -fvisibility-inlines-hidden -Werror=date-time -Werror=unguarded-availability-new -fmodules -fmodules-cache-path=/Users/buildslave/jenkins/workspace/lldb-cmake/lldb-build/module.cache -fcxx-modules -Xclang -fmodules-local-submodule-visibility -Wall -Wextra -Wno-unused-parameter -Wwrite-strings -Wcast-qual -Wmissing-field-initializers -pedantic -Wno-long-long -Wimplicit-fallthrough -Wcovered-switch-default -Wno-noexcept-type -Wnon-virtual-dtor -Wdelete-non-virtual-dtor -Wsuggest-override -Wstring-conversion -fdiagnostics-color -O3  -isysroot /Applications/Xcode.app/Contents/Developer/Platforms/MacOSX.platform/Developer/SDKs/MacOSX10.15.sdk    -fno-exceptions -fno-rtti -UNDEBUG -std=c++14 -MD -MT lib/MC/CMakeFiles/LLVMMC.dir/MCLabel.cpp.o -MF lib/MC/CMakeFiles/LLVMMC.dir/MCLabel.cpp.o.d -o lib/MC/CMakeFiles/LLVMMC.dir/MCLabel.cpp.o -c /Users/buildslave/jenkins/workspace/lldb-cmake/llvm-project/llvm/lib/MC/MCLabel.cpp
[261/3090] /Users/buildslave/jenkins/workspace/lldb-cmake/host-compiler/bin/clang++  -DGTEST_HAS_RTTI=0 -D_DEBUG -D__STDC_CONSTANT_MACROS -D__STDC_FORMAT_MACROS -D__STDC_LIMIT_MACROS -Ilib/MC -I/Users/buildslave/jenkins/workspace/lldb-cmake/llvm-project/llvm/lib/MC -Iinclude -I/Users/buildslave/jenkins/workspace/lldb-cmake/llvm-project/llvm/include -Wdocumentation -fPIC -fvisibility-inlines-hidden -Werror=date-time -Werror=unguarded-availability-new -fmodules -fmodules-cache-path=/Users/buildslave/jenkins/workspace/lldb-cmake/lldb-build/module.cache -fcxx-modules -Xclang -fmodules-local-submodule-visibility -Wall -Wextra -Wno-unused-parameter -Wwrite-strings -Wcast-qual -Wmissing-field-initializers -pedantic -Wno-long-long -Wimplicit-fallthrough -Wcovered-switch-default -Wno-noexcept-type -Wnon-virtual-dtor -Wdelete-non-virtual-dtor -Wsuggest-override -Wstring-conversion -fdiagnostics-color -O3  -isysroot /Applications/Xcode.app/Contents/Developer/Platforms/MacOSX.platform/Developer/SDKs/MacOSX10.15.sdk    -fno-exceptions -fno-rtti -UNDEBUG -std=c++14 -MD -MT lib/MC/CMakeFiles/LLVMMC.dir/MCMachObjectTargetWriter.cpp.o -MF lib/MC/CMakeFiles/LLVMMC.dir/MCMachObjectTargetWriter.cpp.o.d -o lib/MC/CMakeFiles/LLVMMC.dir/MCMachObjectTargetWriter.cpp.o -c /Users/buildslave/jenkins/workspace/lldb-cmake/llvm-project/llvm/lib/MC/MCMachObjectTargetWriter.cpp
[262/3090] /Users/buildslave/jenkins/workspace/lldb-cmake/host-compiler/bin/clang++  -DGTEST_HAS_RTTI=0 -D_DEBUG -D__STDC_CONSTANT_MACROS -D__STDC_FORMAT_MACROS -D__STDC_LIMIT_MACROS -Ilib/MC -I/Users/buildslave/jenkins/workspace/lldb-cmake/llvm-project/llvm/lib/MC -Iinclude -I/Users/buildslave/jenkins/workspace/lldb-cmake/llvm-project/llvm/include -Wdocumentation -fPIC -fvisibility-inlines-hidden -Werror=date-time -Werror=unguarded-availability-new -fmodules -fmodules-cache-path=/Users/buildslave/jenkins/workspace/lldb-cmake/lldb-build/module.cache -fcxx-modules -Xclang -fmodules-local-submodule-visibility -Wall -Wextra -Wno-unused-parameter -Wwrite-strings -Wcast-qual -Wmissing-field-initializers -pedantic -Wno-long-long -Wimplicit-fallthrough -Wcovered-switch-default -Wno-noexcept-type -Wnon-virtual-dtor -Wdelete-non-virtual-dtor -Wsuggest-override -Wstring-conversion -fdiagnostics-color -O3  -isysroot /Applications/Xcode.app/Contents/Developer/Platforms/MacOSX.platform/Developer/SDKs/MacOSX10.15.sdk    -fno-exceptions -fno-rtti -UNDEBUG -std=c++14 -MD -MT lib/MC/CMakeFiles/LLVMMC.dir/MCLinkerOptimizationHint.cpp.o -MF lib/MC/CMakeFiles/LLVMMC.dir/MCLinkerOptimizationHint.cpp.o.d -o lib/MC/CMakeFiles/LLVMMC.dir/MCLinkerOptimizationHint.cpp.o -c /Users/buildslave/jenkins/workspace/lldb-cmake/llvm-project/llvm/lib/MC/MCLinkerOptimizationHint.cpp
[263/3090] /Users/buildslave/jenkins/workspace/lldb-cmake/host-compiler/bin/clang++  -DGTEST_HAS_RTTI=0 -D_DEBUG -D__STDC_CONSTANT_MACROS -D__STDC_FORMAT_MACROS -D__STDC_LIMIT_MACROS -Ilib/MC -I/Users/buildslave/jenkins/workspace/lldb-cmake/llvm-project/llvm/lib/MC -Iinclude -I/Users/buildslave/jenkins/workspace/lldb-cmake/llvm-project/llvm/include -Wdocumentation -fPIC -fvisibility-inlines-hidden -Werror=date-time -Werror=unguarded-availability-new -fmodules -fmodules-cache-path=/Users/buildslave/jenkins/workspace/lldb-cmake/lldb-build/module.cache -fcxx-modules -Xclang -fmodules-local-submodule-visibility -Wall -Wextra -Wno-unused-parameter -Wwrite-strings -Wcast-qual -Wmissing-field-initializers -pedantic -Wno-long-long -Wimplicit-fallthrough -Wcovered-switch-default -Wno-noexcept-type -Wnon-virtual-dtor -Wdelete-non-virtual-dtor -Wsuggest-override -Wstring-conversion -fdiagnostics-color -O3  -isysroot /Applications/Xcode.app/Contents/Developer/Platforms/MacOSX.platform/Developer/SDKs/MacOSX10.15.sdk    -fno-exceptions -fno-rtti -UNDEBUG -std=c++14 -MD -MT lib/MC/CMakeFiles/LLVMMC.dir/MCNullStreamer.cpp.o -MF lib/MC/CMakeFiles/LLVMMC.dir/MCNullStreamer.cpp.o.d -o lib/MC/CMakeFiles/LLVMMC.dir/MCNullStreamer.cpp.o -c /Users/buildslave/jenkins/workspace/lldb-cmake/llvm-project/llvm/lib/MC/MCNullStreamer.cpp
[264/3090] /Users/buildslave/jenkins/workspace/lldb-cmake/host-compiler/bin/clang++  -DGTEST_HAS_RTTI=0 -D_DEBUG -D__STDC_CONSTANT_MACROS -D__STDC_FORMAT_MACROS -D__STDC_LIMIT_MACROS -Ilib/MC -I/Users/buildslave/jenkins/workspace/lldb-cmake/llvm-project/llvm/lib/MC -Iinclude -I/Users/buildslave/jenkins/workspace/lldb-cmake/llvm-project/llvm/include -Wdocumentation -fPIC -fvisibility-inlines-hidden -Werror=date-time -Werror=unguarded-availability-new -fmodules -fmodules-cache-path=/Users/buildslave/jenkins/workspace/lldb-cmake/lldb-build/module.cache -fcxx-modules -Xclang -fmodules-local-submodule-visibility -Wall -Wextra -Wno-unused-parameter -Wwrite-strings -Wcast-qual -Wmissing-field-initializers -pedantic -Wno-long-long -Wimplicit-fallthrough -Wcovered-switch-default -Wno-noexcept-type -Wnon-virtual-dtor -Wdelete-non-virtual-dtor -Wsuggest-override -Wstring-conversion -fdiagnostics-color -O3  -isysroot /Applications/Xcode.app/Contents/Developer/Platforms/MacOSX.platform/Developer/SDKs/MacOSX10.15.sdk    -fno-exceptions -fno-rtti -UNDEBUG -std=c++14 -MD -MT lib/MC/CMakeFiles/LLVMMC.dir/MCObjectFileInfo.cpp.o -MF lib/MC/CMakeFiles/LLVMMC.dir/MCObjectFileInfo.cpp.o.d -o lib/MC/CMakeFiles/LLVMMC.dir/MCObjectFileInfo.cpp.o -c /Users/buildslave/jenkins/workspace/lldb-cmake/llvm-project/llvm/lib/MC/MCObjectFileInfo.cpp
[265/3090] /Users/buildslave/jenkins/workspace/lldb-cmake/host-compiler/bin/clang++  -DGTEST_HAS_RTTI=0 -D_DEBUG -D__STDC_CONSTANT_MACROS -D__STDC_FORMAT_MACROS -D__STDC_LIMIT_MACROS -Ilib/MC -I/Users/buildslave/jenkins/workspace/lldb-cmake/llvm-project/llvm/lib/MC -Iinclude -I/Users/buildslave/jenkins/workspace/lldb-cmake/llvm-project/llvm/include -Wdocumentation -fPIC -fvisibility-inlines-hidden -Werror=date-time -Werror=unguarded-availability-new -fmodules -fmodules-cache-path=/Users/buildslave/jenkins/workspace/lldb-cmake/lldb-build/module.cache -fcxx-modules -Xclang -fmodules-local-submodule-visibility -Wall -Wextra -Wno-unused-parameter -Wwrite-strings -Wcast-qual -Wmissing-field-initializers -pedantic -Wno-long-long -Wimplicit-fallthrough -Wcovered-switch-default -Wno-noexcept-type -Wnon-virtual-dtor -Wdelete-non-virtual-dtor -Wsuggest-override -Wstring-conversion -fdiagnostics-color -O3  -isysroot /Applications/Xcode.app/Contents/Developer/Platforms/MacOSX.platform/Developer/SDKs/MacOSX10.15.sdk    -fno-exceptions -fno-rtti -UNDEBUG -std=c++14 -MD -MT lib/MC/CMakeFiles/LLVMMC.dir/MCObjectWriter.cpp.o -MF lib/MC/CMakeFiles/LLVMMC.dir/MCObjectWriter.cpp.o.d -o lib/MC/CMakeFiles/LLVMMC.dir/MCObjectWriter.cpp.o -c /Users/buildslave/jenkins/workspace/lldb-cmake/llvm-project/llvm/lib/MC/MCObjectWriter.cpp
[266/3090] /Users/buildslave/jenkins/workspace/lldb-cmake/host-compiler/bin/clang++  -DGTEST_HAS_RTTI=0 -D_DEBUG -D__STDC_CONSTANT_MACROS -D__STDC_FORMAT_MACROS -D__STDC_LIMIT_MACROS -Ilib/MC -I/Users/buildslave/jenkins/workspace/lldb-cmake/llvm-project/llvm/lib/MC -Iinclude -I/Users/buildslave/jenkins/workspace/lldb-cmake/llvm-project/llvm/include -Wdocumentation -fPIC -fvisibility-inlines-hidden -Werror=date-time -Werror=unguarded-availability-new -fmodules -fmodules-cache-path=/Users/buildslave/jenkins/workspace/lldb-cmake/lldb-build/module.cache -fcxx-modules -Xclang -fmodules-local-submodule-visibility -Wall -Wextra -Wno-unused-parameter -Wwrite-strings -Wcast-qual -Wmissing-field-initializers -pedantic -Wno-long-long -Wimplicit-fallthrough -Wcovered-switch-default -Wno-noexcept-type -Wnon-virtual-dtor -Wdelete-non-virtual-dtor -Wsuggest-override -Wstring-conversion -fdiagnostics-color -O3  -isysroot /Applications/Xcode.app/Contents/Developer/Platforms/MacOSX.platform/Developer/SDKs/MacOSX10.15.sdk    -fno-exceptions -fno-rtti -UNDEBUG -std=c++14 -MD -MT lib/MC/CMakeFiles/LLVMMC.dir/MCRegisterInfo.cpp.o -MF lib/MC/CMakeFiles/LLVMMC.dir/MCRegisterInfo.cpp.o.d -o lib/MC/CMakeFiles/LLVMMC.dir/MCRegisterInfo.cpp.o -c /Users/buildslave/jenkins/workspace/lldb-cmake/llvm-project/llvm/lib/MC/MCRegisterInfo.cpp
[267/3090] /Users/buildslave/jenkins/workspace/lldb-cmake/host-compiler/bin/clang++  -DGTEST_HAS_RTTI=0 -D_DEBUG -D__STDC_CONSTANT_MACROS -D__STDC_FORMAT_MACROS -D__STDC_LIMIT_MACROS -Ilib/MC -I/Users/buildslave/jenkins/workspace/lldb-cmake/llvm-project/llvm/lib/MC -Iinclude -I/Users/buildslave/jenkins/workspace/lldb-cmake/llvm-project/llvm/include -Wdocumentation -fPIC -fvisibility-inlines-hidden -Werror=date-time -Werror=unguarded-availability-new -fmodules -fmodules-cache-path=/Users/buildslave/jenkins/workspace/lldb-cmake/lldb-build/module.cache -fcxx-modules -Xclang -fmodules-local-submodule-visibility -Wall -Wextra -Wno-unused-parameter -Wwrite-strings -Wcast-qual -Wmissing-field-initializers -pedantic -Wno-long-long -Wimplicit-fallthrough -Wcovered-switch-default -Wno-noexcept-type -Wnon-virtual-dtor -Wdelete-non-virtual-dtor -Wsuggest-override -Wstring-conversion -fdiagnostics-color -O3  -isysroot /Applications/Xcode.app/Contents/Developer/Platforms/MacOSX.platform/Developer/SDKs/MacOSX10.15.sdk    -fno-exceptions -fno-rtti -UNDEBUG -std=c++14 -MD -MT lib/MC/CMakeFiles/LLVMMC.dir/MCDwarf.cpp.o -MF lib/MC/CMakeFiles/LLVMMC.dir/MCDwarf.cpp.o.d -o lib/MC/CMakeFiles/LLVMMC.dir/MCDwarf.cpp.o -c /Users/buildslave/jenkins/workspace/lldb-cmake/llvm-project/llvm/lib/MC/MCDwarf.cpp
[268/3090] /Users/buildslave/jenkins/workspace/lldb-cmake/host-compiler/bin/clang++  -DGTEST_HAS_RTTI=0 -D_DEBUG -D__STDC_CONSTANT_MACROS -D__STDC_FORMAT_MACROS -D__STDC_LIMIT_MACROS -Ilib/MC -I/Users/buildslave/jenkins/workspace/lldb-cmake/llvm-project/llvm/lib/MC -Iinclude -I/Users/buildslave/jenkins/workspace/lldb-cmake/llvm-project/llvm/include -Wdocumentation -fPIC -fvisibility-inlines-hidden -Werror=date-time -Werror=unguarded-availability-new -fmodules -fmodules-cache-path=/Users/buildslave/jenkins/workspace/lldb-cmake/lldb-build/module.cache -fcxx-modules -Xclang -fmodules-local-submodule-visibility -Wall -Wextra -Wno-unused-parameter -Wwrite-strings -Wcast-qual -Wmissing-field-initializers -pedantic -Wno-long-long -Wimplicit-fallthrough -Wcovered-switch-default -Wno-noexcept-type -Wnon-virtual-dtor -Wdelete-non-virtual-dtor -Wsuggest-override -Wstring-conversion -fdiagnostics-color -O3  -isysroot /Applications/Xcode.app/Contents/Developer/Platforms/MacOSX.platform/Developer/SDKs/MacOSX10.15.sdk    -fno-exceptions -fno-rtti -UNDEBUG -std=c++14 -MD -MT lib/MC/CMakeFiles/LLVMMC.dir/MCSchedule.cpp.o -MF lib/MC/CMakeFiles/LLVMMC.dir/MCSchedule.cpp.o.d -o lib/MC/CMakeFiles/LLVMMC.dir/MCSchedule.cpp.o -c /Users/buildslave/jenkins/workspace/lldb-cmake/llvm-project/llvm/lib/MC/MCSchedule.cpp
[269/3090] /Users/buildslave/jenkins/workspace/lldb-cmake/host-compiler/bin/clang++  -DGTEST_HAS_RTTI=0 -D_DEBUG -D__STDC_CONSTANT_MACROS -D__STDC_FORMAT_MACROS -D__STDC_LIMIT_MACROS -Ilib/LTO -I/Users/buildslave/jenkins/workspace/lldb-cmake/llvm-project/llvm/lib/LTO -Iinclude -I/Users/buildslave/jenkins/workspace/lldb-cmake/llvm-project/llvm/include -Wdocumentation -fPIC -fvisibility-inlines-hidden -Werror=date-time -Werror=unguarded-availability-new -fmodules -fmodules-cache-path=/Users/buildslave/jenkins/workspace/lldb-cmake/lldb-build/module.cache -fcxx-modules -Xclang -fmodules-local-submodule-visibility -Wall -Wextra -Wno-unused-parameter -Wwrite-strings -Wcast-qual -Wmissing-field-initializers -pedantic -Wno-long-long -Wimplicit-fallthrough -Wcovered-switch-default -Wno-noexcept-type -Wnon-virtual-dtor -Wdelete-non-virtual-dtor -Wsuggest-override -Wstring-conversion -fdiagnostics-color -O3  -isysroot /Applications/Xcode.app/Contents/Developer/Platforms/MacOSX.platform/Developer/SDKs/MacOSX10.15.sdk    -fno-exceptions -fno-rtti -UNDEBUG -std=c++14 -MD -MT lib/LTO/CMakeFiles/LLVMLTO.dir/UpdateCompilerUsed.cpp.o -MF lib/LTO/CMakeFiles/LLVMLTO.dir/UpdateCompilerUsed.cpp.o.d -o lib/LTO/CMakeFiles/LLVMLTO.dir/UpdateCompilerUsed.cpp.o -c /Users/buildslave/jenkins/workspace/lldb-cmake/llvm-project/llvm/lib/LTO/UpdateCompilerUsed.cpp
[270/3090] /Users/buildslave/jenkins/workspace/lldb-cmake/host-compiler/bin/clang++  -DGTEST_HAS_RTTI=0 -D_DEBUG -D__STDC_CONSTANT_MACROS -D__STDC_FORMAT_MACROS -D__STDC_LIMIT_MACROS -Ilib/MC -I/Users/buildslave/jenkins/workspace/lldb-cmake/llvm-project/llvm/lib/MC -Iinclude -I/Users/buildslave/jenkins/workspace/lldb-cmake/llvm-project/llvm/include -Wdocumentation -fPIC -fvisibility-inlines-hidden -Werror=date-time -Werror=unguarded-availability-new -fmodules -fmodules-cache-path=/Users/buildslave/jenkins/workspace/lldb-cmake/lldb-build/module.cache -fcxx-modules -Xclang -fmodules-local-submodule-visibility -Wall -Wextra -Wno-unused-parameter -Wwrite-strings -Wcast-qual -Wmissing-field-initializers -pedantic -Wno-long-long -Wimplicit-fallthrough -Wcovered-switch-default -Wno-noexcept-type -Wnon-virtual-dtor -Wdelete-non-virtual-dtor -Wsuggest-override -Wstring-conversion -fdiagnostics-color -O3  -isysroot /Applications/Xcode.app/Contents/Developer/Platforms/MacOSX.platform/Developer/SDKs/MacOSX10.15.sdk    -fno-exceptions -fno-rtti -UNDEBUG -std=c++14 -MD -MT lib/MC/CMakeFiles/LLVMMC.dir/MCSectionCOFF.cpp.o -MF lib/MC/CMakeFiles/LLVMMC.dir/MCSectionCOFF.cpp.o.d -o lib/MC/CMakeFiles/LLVMMC.dir/MCSectionCOFF.cpp.o -c /Users/buildslave/jenkins/workspace/lldb-cmake/llvm-project/llvm/lib/MC/MCSectionCOFF.cpp
[271/3090] /Users/buildslave/jenkins/workspace/lldb-cmake/host-compiler/bin/clang++  -DGTEST_HAS_RTTI=0 -D_DEBUG -D__STDC_CONSTANT_MACROS -D__STDC_FORMAT_MACROS -D__STDC_LIMIT_MACROS -Ilib/MC -I/Users/buildslave/jenkins/workspace/lldb-cmake/llvm-project/llvm/lib/MC -Iinclude -I/Users/buildslave/jenkins/workspace/lldb-cmake/llvm-project/llvm/include -Wdocumentation -fPIC -fvisibility-inlines-hidden -Werror=date-time -Werror=unguarded-availability-new -fmodules -fmodules-cache-path=/Users/buildslave/jenkins/workspace/lldb-cmake/lldb-build/module.cache -fcxx-modules -Xclang -fmodules-local-submodule-visibility -Wall -Wextra -Wno-unused-parameter -Wwrite-strings -Wcast-qual -Wmissing-field-initializers -pedantic -Wno-long-long -Wimplicit-fallthrough -Wcovered-switch-default -Wno-noexcept-type -Wnon-virtual-dtor -Wdelete-non-virtual-dtor -Wsuggest-override -Wstring-conversion -fdiagnostics-color -O3  -isysroot /Applications/Xcode.app/Contents/Developer/Platforms/MacOSX.platform/Developer/SDKs/MacOSX10.15.sdk    -fno-exceptions -fno-rtti -UNDEBUG -std=c++14 -MD -MT lib/MC/CMakeFiles/LLVMMC.dir/MCContext.cpp.o -MF lib/MC/CMakeFiles/LLVMMC.dir/MCContext.cpp.o.d -o lib/MC/CMakeFiles/LLVMMC.dir/MCContext.cpp.o -c /Users/buildslave/jenkins/workspace/lldb-cmake/llvm-project/llvm/lib/MC/MCContext.cpp
[272/3090] /Users/buildslave/jenkins/workspace/lldb-cmake/host-compiler/bin/clang++  -DGTEST_HAS_RTTI=0 -D_DEBUG -D__STDC_CONSTANT_MACROS -D__STDC_FORMAT_MACROS -D__STDC_LIMIT_MACROS -Ilib/MC -I/Users/buildslave/jenkins/workspace/lldb-cmake/llvm-project/llvm/lib/MC -Iinclude -I/Users/buildslave/jenkins/workspace/lldb-cmake/llvm-project/llvm/include -Wdocumentation -fPIC -fvisibility-inlines-hidden -Werror=date-time -Werror=unguarded-availability-new -fmodules -fmodules-cache-path=/Users/buildslave/jenkins/workspace/lldb-cmake/lldb-build/module.cache -fcxx-modules -Xclang -fmodules-local-submodule-visibility -Wall -Wextra -Wno-unused-parameter -Wwrite-strings -Wcast-qual -Wmissing-field-initializers -pedantic -Wno-long-long -Wimplicit-fallthrough -Wcovered-switch-default -Wno-noexcept-type -Wnon-virtual-dtor -Wdelete-non-virtual-dtor -Wsuggest-override -Wstring-conversion -fdiagnostics-color -O3  -isysroot /Applications/Xcode.app/Contents/Developer/Platforms/MacOSX.platform/Developer/SDKs/MacOSX10.15.sdk    -fno-exceptions -fno-rtti -UNDEBUG -std=c++14 -MD -MT lib/MC/CMakeFiles/LLVMMC.dir/MCMachOStreamer.cpp.o -MF lib/MC/CMakeFiles/LLVMMC.dir/MCMachOStreamer.cpp.o.d -o lib/MC/CMakeFiles/LLVMMC.dir/MCMachOStreamer.cpp.o -c /Users/buildslave/jenkins/workspace/lldb-cmake/llvm-project/llvm/lib/MC/MCMachOStreamer.cpp
[273/3090] /Users/buildslave/jenkins/workspace/lldb-cmake/host-compiler/bin/clang++  -DGTEST_HAS_RTTI=0 -D_DEBUG -D__STDC_CONSTANT_MACROS -D__STDC_FORMAT_MACROS -D__STDC_LIMIT_MACROS -Ilib/MC -I/Users/buildslave/jenkins/workspace/lldb-cmake/llvm-project/llvm/lib/MC -Iinclude -I/Users/buildslave/jenkins/workspace/lldb-cmake/llvm-project/llvm/include -Wdocumentation -fPIC -fvisibility-inlines-hidden -Werror=date-time -Werror=unguarded-availability-new -fmodules -fmodules-cache-path=/Users/buildslave/jenkins/workspace/lldb-cmake/lldb-build/module.cache -fcxx-modules -Xclang -fmodules-local-submodule-visibility -Wall -Wextra -Wno-unused-parameter -Wwrite-strings -Wcast-qual -Wmissing-field-initializers -pedantic -Wno-long-long -Wimplicit-fallthrough -Wcovered-switch-default -Wno-noexcept-type -Wnon-virtual-dtor -Wdelete-non-virtual-dtor -Wsuggest-override -Wstring-conversion -fdiagnostics-color -O3  -isysroot /Applications/Xcode.app/Contents/Developer/Platforms/MacOSX.platform/Developer/SDKs/MacOSX10.15.sdk    -fno-exceptions -fno-rtti -UNDEBUG -std=c++14 -MD -MT lib/MC/CMakeFiles/LLVMMC.dir/MCSectionELF.cpp.o -MF lib/MC/CMakeFiles/LLVMMC.dir/MCSectionELF.cpp.o.d -o lib/MC/CMakeFiles/LLVMMC.dir/MCSectionELF.cpp.o -c /Users/buildslave/jenkins/workspace/lldb-cmake/llvm-project/llvm/lib/MC/MCSectionELF.cpp
[274/3090] /Users/buildslave/jenkins/workspace/lldb-cmake/host-compiler/bin/clang++  -DGTEST_HAS_RTTI=0 -D_DEBUG -D__STDC_CONSTANT_MACROS -D__STDC_FORMAT_MACROS -D__STDC_LIMIT_MACROS -Ilib/MC -I/Users/buildslave/jenkins/workspace/lldb-cmake/llvm-project/llvm/lib/MC -Iinclude -I/Users/buildslave/jenkins/workspace/lldb-cmake/llvm-project/llvm/include -Wdocumentation -fPIC -fvisibility-inlines-hidden -Werror=date-time -Werror=unguarded-availability-new -fmodules -fmodules-cache-path=/Users/buildslave/jenkins/workspace/lldb-cmake/lldb-build/module.cache -fcxx-modules -Xclang -fmodules-local-submodule-visibility -Wall -Wextra -Wno-unused-parameter -Wwrite-strings -Wcast-qual -Wmissing-field-initializers -pedantic -Wno-long-long -Wimplicit-fallthrough -Wcovered-switch-default -Wno-noexcept-type -Wnon-virtual-dtor -Wdelete-non-virtual-dtor -Wsuggest-override -Wstring-conversion -fdiagnostics-color -O3  -isysroot /Applications/Xcode.app/Contents/Developer/Platforms/MacOSX.platform/Developer/SDKs/MacOSX10.15.sdk    -fno-exceptions -fno-rtti -UNDEBUG -std=c++14 -MD -MT lib/MC/CMakeFiles/LLVMMC.dir/MCSectionWasm.cpp.o -MF lib/MC/CMakeFiles/LLVMMC.dir/MCSectionWasm.cpp.o.d -o lib/MC/CMakeFiles/LLVMMC.dir/MCSectionWasm.cpp.o -c /Users/buildslave/jenkins/workspace/lldb-cmake/llvm-project/llvm/lib/MC/MCSectionWasm.cpp
[275/3090] /Users/buildslave/jenkins/workspace/lldb-cmake/host-compiler/bin/clang++  -DGTEST_HAS_RTTI=0 -D_DEBUG -D__STDC_CONSTANT_MACROS -D__STDC_FORMAT_MACROS -D__STDC_LIMIT_MACROS -Ilib/MC -I/Users/buildslave/jenkins/workspace/lldb-cmake/llvm-project/llvm/lib/MC -Iinclude -I/Users/buildslave/jenkins/workspace/lldb-cmake/llvm-project/llvm/include -Wdocumentation -fPIC -fvisibility-inlines-hidden -Werror=date-time -Werror=unguarded-availability-new -fmodules -fmodules-cache-path=/Users/buildslave/jenkins/workspace/lldb-cmake/lldb-build/module.cache -fcxx-modules -Xclang -fmodules-local-submodule-visibility -Wall -Wextra -Wno-unused-parameter -Wwrite-strings -Wcast-qual -Wmissing-field-initializers -pedantic -Wno-long-long -Wimplicit-fallthrough -Wcovered-switch-default -Wno-noexcept-type -Wnon-virtual-dtor -Wdelete-non-virtual-dtor -Wsuggest-override -Wstring-conversion -fdiagnostics-color -O3  -isysroot /Applications/Xcode.app/Contents/Developer/Platforms/MacOSX.platform/Developer/SDKs/MacOSX10.15.sdk    -fno-exceptions -fno-rtti -UNDEBUG -std=c++14 -MD -MT lib/MC/CMakeFiles/LLVMMC.dir/MCSectionXCOFF.cpp.o -MF lib/MC/CMakeFiles/LLVMMC.dir/MCSectionXCOFF.cpp.o.d -o lib/MC/CMakeFiles/LLVMMC.dir/MCSectionXCOFF.cpp.o -c /Users/buildslave/jenkins/workspace/lldb-cmake/llvm-project/llvm/lib/MC/MCSectionXCOFF.cpp
[276/3090] /Users/buildslave/jenkins/workspace/lldb-cmake/host-compiler/bin/clang++  -DGTEST_HAS_RTTI=0 -D_DEBUG -D__STDC_CONSTANT_MACROS -D__STDC_FORMAT_MACROS -D__STDC_LIMIT_MACROS -Ilib/MC -I/Users/buildslave/jenkins/workspace/lldb-cmake/llvm-project/llvm/lib/MC -Iinclude -I/Users/buildslave/jenkins/workspace/lldb-cmake/llvm-project/llvm/include -Wdocumentation -fPIC -fvisibility-inlines-hidden -Werror=date-time -Werror=unguarded-availability-new -fmodules -fmodules-cache-path=/Users/buildslave/jenkins/workspace/lldb-cmake/lldb-build/module.cache -fcxx-modules -Xclang -fmodules-local-submodule-visibility -Wall -Wextra -Wno-unused-parameter -Wwrite-strings -Wcast-qual -Wmissing-field-initializers -pedantic -Wno-long-long -Wimplicit-fallthrough -Wcovered-switch-default -Wno-noexcept-type -Wnon-virtual-dtor -Wdelete-non-virtual-dtor -Wsuggest-override -Wstring-conversion -fdiagnostics-color -O3  -isysroot /Applications/Xcode.app/Contents/Developer/Platforms/MacOSX.platform/Developer/SDKs/MacOSX10.15.sdk    -fno-exceptions -fno-rtti -UNDEBUG -std=c++14 -MD -MT lib/MC/CMakeFiles/LLVMMC.dir/MCSection.cpp.o -MF lib/MC/CMakeFiles/LLVMMC.dir/MCSection.cpp.o.d -o lib/MC/CMakeFiles/LLVMMC.dir/MCSection.cpp.o -c /Users/buildslave/jenkins/workspace/lldb-cmake/llvm-project/llvm/lib/MC/MCSection.cpp
[277/3090] /Users/buildslave/jenkins/workspace/lldb-cmake/host-compiler/bin/clang++  -DGTEST_HAS_RTTI=0 -D_DEBUG -D__STDC_CONSTANT_MACROS -D__STDC_FORMAT_MACROS -D__STDC_LIMIT_MACROS -Ilib/MC -I/Users/buildslave/jenkins/workspace/lldb-cmake/llvm-project/llvm/lib/MC -Iinclude -I/Users/buildslave/jenkins/workspace/lldb-cmake/llvm-project/llvm/include -Wdocumentation -fPIC -fvisibility-inlines-hidden -Werror=date-time -Werror=unguarded-availability-new -fmodules -fmodules-cache-path=/Users/buildslave/jenkins/workspace/lldb-cmake/lldb-build/module.cache -fcxx-modules -Xclang -fmodules-local-submodule-visibility -Wall -Wextra -Wno-unused-parameter -Wwrite-strings -Wcast-qual -Wmissing-field-initializers -pedantic -Wno-long-long -Wimplicit-fallthrough -Wcovered-switch-default -Wno-noexcept-type -Wnon-virtual-dtor -Wdelete-non-virtual-dtor -Wsuggest-override -Wstring-conversion -fdiagnostics-color -O3  -isysroot /Applications/Xcode.app/Contents/Developer/Platforms/MacOSX.platform/Developer/SDKs/MacOSX10.15.sdk    -fno-exceptions -fno-rtti -UNDEBUG -std=c++14 -MD -MT lib/MC/CMakeFiles/LLVMMC.dir/MCSectionMachO.cpp.o -MF lib/MC/CMakeFiles/LLVMMC.dir/MCSectionMachO.cpp.o.d -o lib/MC/CMakeFiles/LLVMMC.dir/MCSectionMachO.cpp.o -c /Users/buildslave/jenkins/workspace/lldb-cmake/llvm-project/llvm/lib/MC/MCSectionMachO.cpp
[278/3090] /Users/buildslave/jenkins/workspace/lldb-cmake/host-compiler/bin/clang++  -DGTEST_HAS_RTTI=0 -D_DEBUG -D__STDC_CONSTANT_MACROS -D__STDC_FORMAT_MACROS -D__STDC_LIMIT_MACROS -Ilib/MC -I/Users/buildslave/jenkins/workspace/lldb-cmake/llvm-project/llvm/lib/MC -Iinclude -I/Users/buildslave/jenkins/workspace/lldb-cmake/llvm-project/llvm/include -Wdocumentation -fPIC -fvisibility-inlines-hidden -Werror=date-time -Werror=unguarded-availability-new -fmodules -fmodules-cache-path=/Users/buildslave/jenkins/workspace/lldb-cmake/lldb-build/module.cache -fcxx-modules -Xclang -fmodules-local-submodule-visibility -Wall -Wextra -Wno-unused-parameter -Wwrite-strings -Wcast-qual -Wmissing-field-initializers -pedantic -Wno-long-long -Wimplicit-fallthrough -Wcovered-switch-default -Wno-noexcept-type -Wnon-virtual-dtor -Wdelete-non-virtual-dtor -Wsuggest-override -Wstring-conversion -fdiagnostics-color -O3  -isysroot /Applications/Xcode.app/Contents/Developer/Platforms/MacOSX.platform/Developer/SDKs/MacOSX10.15.sdk    -fno-exceptions -fno-rtti -UNDEBUG -std=c++14 -MD -MT lib/MC/CMakeFiles/LLVMMC.dir/MCSymbol.cpp.o -MF lib/MC/CMakeFiles/LLVMMC.dir/MCSymbol.cpp.o.d -o lib/MC/CMakeFiles/LLVMMC.dir/MCSymbol.cpp.o -c /Users/buildslave/jenkins/workspace/lldb-cmake/llvm-project/llvm/lib/MC/MCSymbol.cpp
[279/3090] /Users/buildslave/jenkins/workspace/lldb-cmake/host-compiler/bin/clang++  -DGTEST_HAS_RTTI=0 -D_DEBUG -D__STDC_CONSTANT_MACROS -D__STDC_FORMAT_MACROS -D__STDC_LIMIT_MACROS -Ilib/MC -I/Users/buildslave/jenkins/workspace/lldb-cmake/llvm-project/llvm/lib/MC -Iinclude -I/Users/buildslave/jenkins/workspace/lldb-cmake/llvm-project/llvm/include -Wdocumentation -fPIC -fvisibility-inlines-hidden -Werror=date-time -Werror=unguarded-availability-new -fmodules -fmodules-cache-path=/Users/buildslave/jenkins/workspace/lldb-cmake/lldb-build/module.cache -fcxx-modules -Xclang -fmodules-local-submodule-visibility -Wall -Wextra -Wno-unused-parameter -Wwrite-strings -Wcast-qual -Wmissing-field-initializers -pedantic -Wno-long-long -Wimplicit-fallthrough -Wcovered-switch-default -Wno-noexcept-type -Wnon-virtual-dtor -Wdelete-non-virtual-dtor -Wsuggest-override -Wstring-conversion -fdiagnostics-color -O3  -isysroot /Applications/Xcode.app/Contents/Developer/Platforms/MacOSX.platform/Developer/SDKs/MacOSX10.15.sdk    -fno-exceptions -fno-rtti -UNDEBUG -std=c++14 -MD -MT lib/MC/CMakeFiles/LLVMMC.dir/MCSymbolELF.cpp.o -MF lib/MC/CMakeFiles/LLVMMC.dir/MCSymbolELF.cpp.o.d -o lib/MC/CMakeFiles/LLVMMC.dir/MCSymbolELF.cpp.o -c /Users/buildslave/jenkins/workspace/lldb-cmake/llvm-project/llvm/lib/MC/MCSymbolELF.cpp
[280/3090] /Users/buildslave/jenkins/workspace/lldb-cmake/host-compiler/bin/clang++  -DGTEST_HAS_RTTI=0 -D_DEBUG -D__STDC_CONSTANT_MACROS -D__STDC_FORMAT_MACROS -D__STDC_LIMIT_MACROS -Ilib/MC -I/Users/buildslave/jenkins/workspace/lldb-cmake/llvm-project/llvm/lib/MC -Iinclude -I/Users/buildslave/jenkins/workspace/lldb-cmake/llvm-project/llvm/include -Wdocumentation -fPIC -fvisibility-inlines-hidden -Werror=date-time -Werror=unguarded-availability-new -fmodules -fmodules-cache-path=/Users/buildslave/jenkins/workspace/lldb-cmake/lldb-build/module.cache -fcxx-modules -Xclang -fmodules-local-submodule-visibility -Wall -Wextra -Wno-unused-parameter -Wwrite-strings -Wcast-qual -Wmissing-field-initializers -pedantic -Wno-long-long -Wimplicit-fallthrough -Wcovered-switch-default -Wno-noexcept-type -Wnon-virtual-dtor -Wdelete-non-virtual-dtor -Wsuggest-override -Wstring-conversion -fdiagnostics-color -O3  -isysroot /Applications/Xcode.app/Contents/Developer/Platforms/MacOSX.platform/Developer/SDKs/MacOSX10.15.sdk    -fno-exceptions -fno-rtti -UNDEBUG -std=c++14 -MD -MT lib/MC/CMakeFiles/LLVMMC.dir/MCObjectStreamer.cpp.o -MF lib/MC/CMakeFiles/LLVMMC.dir/MCObjectStreamer.cpp.o.d -o lib/MC/CMakeFiles/LLVMMC.dir/MCObjectStreamer.cpp.o -c /Users/buildslave/jenkins/workspace/lldb-cmake/llvm-project/llvm/lib/MC/MCObjectStreamer.cpp
[281/3090] /Users/buildslave/jenkins/workspace/lldb-cmake/host-compiler/bin/clang++  -DGTEST_HAS_RTTI=0 -D_DEBUG -D__STDC_CONSTANT_MACROS -D__STDC_FORMAT_MACROS -D__STDC_LIMIT_MACROS -Ilib/MC -I/Users/buildslave/jenkins/workspace/lldb-cmake/llvm-project/llvm/lib/MC -Iinclude -I/Users/buildslave/jenkins/workspace/lldb-cmake/llvm-project/llvm/include -Wdocumentation -fPIC -fvisibility-inlines-hidden -Werror=date-time -Werror=unguarded-availability-new -fmodules -fmodules-cache-path=/Users/buildslave/jenkins/workspace/lldb-cmake/lldb-build/module.cache -fcxx-modules -Xclang -fmodules-local-submodule-visibility -Wall -Wextra -Wno-unused-parameter -Wwrite-strings -Wcast-qual -Wmissing-field-initializers -pedantic -Wno-long-long -Wimplicit-fallthrough -Wcovered-switch-default -Wno-noexcept-type -Wnon-virtual-dtor -Wdelete-non-virtual-dtor -Wsuggest-override -Wstring-conversion -fdiagnostics-color -O3  -isysroot /Applications/Xcode.app/Contents/Developer/Platforms/MacOSX.platform/Developer/SDKs/MacOSX10.15.sdk    -fno-exceptions -fno-rtti -UNDEBUG -std=c++14 -MD -MT lib/MC/CMakeFiles/LLVMMC.dir/MCSymbolXCOFF.cpp.o -MF lib/MC/CMakeFiles/LLVMMC.dir/MCSymbolXCOFF.cpp.o.d -o lib/MC/CMakeFiles/LLVMMC.dir/MCSymbolXCOFF.cpp.o -c /Users/buildslave/jenkins/workspace/lldb-cmake/llvm-project/llvm/lib/MC/MCSymbolXCOFF.cpp
[282/3090] /Users/buildslave/jenkins/workspace/lldb-cmake/host-compiler/bin/clang++  -DGTEST_HAS_RTTI=0 -D_DEBUG -D__STDC_CONSTANT_MACROS -D__STDC_FORMAT_MACROS -D__STDC_LIMIT_MACROS -Ilib/MC -I/Users/buildslave/jenkins/workspace/lldb-cmake/llvm-project/llvm/lib/MC -Iinclude -I/Users/buildslave/jenkins/workspace/lldb-cmake/llvm-project/llvm/include -Wdocumentation -fPIC -fvisibility-inlines-hidden -Werror=date-time -Werror=unguarded-availability-new -fmodules -fmodules-cache-path=/Users/buildslave/jenkins/workspace/lldb-cmake/lldb-build/module.cache -fcxx-modules -Xclang -fmodules-local-submodule-visibility -Wall -Wextra -Wno-unused-parameter -Wwrite-strings -Wcast-qual -Wmissing-field-initializers -pedantic -Wno-long-long -Wimplicit-fallthrough -Wcovered-switch-default -Wno-noexcept-type -Wnon-virtual-dtor -Wdelete-non-virtual-dtor -Wsuggest-override -Wstring-conversion -fdiagnostics-color -O3  -isysroot /Applications/Xcode.app/Contents/Developer/Platforms/MacOSX.platform/Developer/SDKs/MacOSX10.15.sdk    -fno-exceptions -fno-rtti -UNDEBUG -std=c++14 -MD -MT lib/MC/CMakeFiles/LLVMMC.dir/MCTargetOptions.cpp.o -MF lib/MC/CMakeFiles/LLVMMC.dir/MCTargetOptions.cpp.o.d -o lib/MC/CMakeFiles/LLVMMC.dir/MCTargetOptions.cpp.o -c /Users/buildslave/jenkins/workspace/lldb-cmake/llvm-project/llvm/lib/MC/MCTargetOptions.cpp
[283/3090] /Users/buildslave/jenkins/workspace/lldb-cmake/host-compiler/bin/clang++  -DGTEST_HAS_RTTI=0 -D_DEBUG -D__STDC_CONSTANT_MACROS -D__STDC_FORMAT_MACROS -D__STDC_LIMIT_MACROS -Ilib/MC -I/Users/buildslave/jenkins/workspace/lldb-cmake/llvm-project/llvm/lib/MC -Iinclude -I/Users/buildslave/jenkins/workspace/lldb-cmake/llvm-project/llvm/include -Wdocumentation -fPIC -fvisibility-inlines-hidden -Werror=date-time -Werror=unguarded-availability-new -fmodules -fmodules-cache-path=/Users/buildslave/jenkins/workspace/lldb-cmake/lldb-build/module.cache -fcxx-modules -Xclang -fmodules-local-submodule-visibility -Wall -Wextra -Wno-unused-parameter -Wwrite-strings -Wcast-qual -Wmissing-field-initializers -pedantic -Wno-long-long -Wimplicit-fallthrough -Wcovered-switch-default -Wno-noexcept-type -Wnon-virtual-dtor -Wdelete-non-virtual-dtor -Wsuggest-override -Wstring-conversion -fdiagnostics-color -O3  -isysroot /Applications/Xcode.app/Contents/Developer/Platforms/MacOSX.platform/Developer/SDKs/MacOSX10.15.sdk    -fno-exceptions -fno-rtti -UNDEBUG -std=c++14 -MD -MT lib/MC/CMakeFiles/LLVMMC.dir/MCValue.cpp.o -MF lib/MC/CMakeFiles/LLVMMC.dir/MCValue.cpp.o.d -o lib/MC/CMakeFiles/LLVMMC.dir/MCValue.cpp.o -c /Users/buildslave/jenkins/workspace/lldb-cmake/llvm-project/llvm/lib/MC/MCValue.cpp
[284/3090] /Users/buildslave/jenkins/workspace/lldb-cmake/host-compiler/bin/clang++  -DGTEST_HAS_RTTI=0 -D_DEBUG -D__STDC_CONSTANT_MACROS -D__STDC_FORMAT_MACROS -D__STDC_LIMIT_MACROS -Ilib/MC -I/Users/buildslave/jenkins/workspace/lldb-cmake/llvm-project/llvm/lib/MC -Iinclude -I/Users/buildslave/jenkins/workspace/lldb-cmake/llvm-project/llvm/include -Wdocumentation -fPIC -fvisibility-inlines-hidden -Werror=date-time -Werror=unguarded-availability-new -fmodules -fmodules-cache-path=/Users/buildslave/jenkins/workspace/lldb-cmake/lldb-build/module.cache -fcxx-modules -Xclang -fmodules-local-submodule-visibility -Wall -Wextra -Wno-unused-parameter -Wwrite-strings -Wcast-qual -Wmissing-field-initializers -pedantic -Wno-long-long -Wimplicit-fallthrough -Wcovered-switch-default -Wno-noexcept-type -Wnon-virtual-dtor -Wdelete-non-virtual-dtor -Wsuggest-override -Wstring-conversion -fdiagnostics-color -O3  -isysroot /Applications/Xcode.app/Contents/Developer/Platforms/MacOSX.platform/Developer/SDKs/MacOSX10.15.sdk    -fno-exceptions -fno-rtti -UNDEBUG -std=c++14 -MD -MT lib/MC/CMakeFiles/LLVMMC.dir/MCWasmObjectTargetWriter.cpp.o -MF lib/MC/CMakeFiles/LLVMMC.dir/MCWasmObjectTargetWriter.cpp.o.d -o lib/MC/CMakeFiles/LLVMMC.dir/MCWasmObjectTargetWriter.cpp.o -c /Users/buildslave/jenkins/workspace/lldb-cmake/llvm-project/llvm/lib/MC/MCWasmObjectTargetWriter.cpp
[285/3090] /Users/buildslave/jenkins/workspace/lldb-cmake/host-compiler/bin/clang++  -DGTEST_HAS_RTTI=0 -D_DEBUG -D__STDC_CONSTANT_MACROS -D__STDC_FORMAT_MACROS -D__STDC_LIMIT_MACROS -Ilib/MC -I/Users/buildslave/jenkins/workspace/lldb-cmake/llvm-project/llvm/lib/MC -Iinclude -I/Users/buildslave/jenkins/workspace/lldb-cmake/llvm-project/llvm/include -Wdocumentation -fPIC -fvisibility-inlines-hidden -Werror=date-time -Werror=unguarded-availability-new -fmodules -fmodules-cache-path=/Users/buildslave/jenkins/workspace/lldb-cmake/lldb-build/module.cache -fcxx-modules -Xclang -fmodules-local-submodule-visibility -Wall -Wextra -Wno-unused-parameter -Wwrite-strings -Wcast-qual -Wmissing-field-initializers -pedantic -Wno-long-long -Wimplicit-fallthrough -Wcovered-switch-default -Wno-noexcept-type -Wnon-virtual-dtor -Wdelete-non-virtual-dtor -Wsuggest-override -Wstring-conversion -fdiagnostics-color -O3  -isysroot /Applications/Xcode.app/Contents/Developer/Platforms/MacOSX.platform/Developer/SDKs/MacOSX10.15.sdk    -fno-exceptions -fno-rtti -UNDEBUG -std=c++14 -MD -MT lib/MC/CMakeFiles/LLVMMC.dir/MCWasmStreamer.cpp.o -MF lib/MC/CMakeFiles/LLVMMC.dir/MCWasmStreamer.cpp.o.d -o lib/MC/CMakeFiles/LLVMMC.dir/MCWasmStreamer.cpp.o -c /Users/buildslave/jenkins/workspace/lldb-cmake/llvm-project/llvm/lib/MC/MCWasmStreamer.cpp
[286/3090] /Users/buildslave/jenkins/workspace/lldb-cmake/host-compiler/bin/clang++  -DGTEST_HAS_RTTI=0 -D_DEBUG -D__STDC_CONSTANT_MACROS -D__STDC_FORMAT_MACROS -D__STDC_LIMIT_MACROS -Ilib/MC -I/Users/buildslave/jenkins/workspace/lldb-cmake/llvm-project/llvm/lib/MC -Iinclude -I/Users/buildslave/jenkins/workspace/lldb-cmake/llvm-project/llvm/include -Wdocumentation -fPIC -fvisibility-inlines-hidden -Werror=date-time -Werror=unguarded-availability-new -fmodules -fmodules-cache-path=/Users/buildslave/jenkins/workspace/lldb-cmake/lldb-build/module.cache -fcxx-modules -Xclang -fmodules-local-submodule-visibility -Wall -Wextra -Wno-unused-parameter -Wwrite-strings -Wcast-qual -Wmissing-field-initializers -pedantic -Wno-long-long -Wimplicit-fallthrough -Wcovered-switch-default -Wno-noexcept-type -Wnon-virtual-dtor -Wdelete-non-virtual-dtor -Wsuggest-override -Wstring-conversion -fdiagnostics-color -O3  -isysroot /Applications/Xcode.app/Contents/Developer/Platforms/MacOSX.platform/Developer/SDKs/MacOSX10.15.sdk    -fno-exceptions -fno-rtti -UNDEBUG -std=c++14 -MD -MT lib/MC/CMakeFiles/LLVMMC.dir/MCWinEH.cpp.o -MF lib/MC/CMakeFiles/LLVMMC.dir/MCWinEH.cpp.o.d -o lib/MC/CMakeFiles/LLVMMC.dir/MCWinEH.cpp.o -c /Users/buildslave/jenkins/workspace/lldb-cmake/llvm-project/llvm/lib/MC/MCWinEH.cpp
[287/3090] /Users/buildslave/jenkins/workspace/lldb-cmake/host-compiler/bin/clang++  -DGTEST_HAS_RTTI=0 -D_DEBUG -D__STDC_CONSTANT_MACROS -D__STDC_FORMAT_MACROS -D__STDC_LIMIT_MACROS -Ilib/MC -I/Users/buildslave/jenkins/workspace/lldb-cmake/llvm-project/llvm/lib/MC -Iinclude -I/Users/buildslave/jenkins/workspace/lldb-cmake/llvm-project/llvm/include -Wdocumentation -fPIC -fvisibility-inlines-hidden -Werror=date-time -Werror=unguarded-availability-new -fmodules -fmodules-cache-path=/Users/buildslave/jenkins/workspace/lldb-cmake/lldb-build/module.cache -fcxx-modules -Xclang -fmodules-local-submodule-visibility -Wall -Wextra -Wno-unused-parameter -Wwrite-strings -Wcast-qual -Wmissing-field-initializers -pedantic -Wno-long-long -Wimplicit-fallthrough -Wcovered-switch-default -Wno-noexcept-type -Wnon-virtual-dtor -Wdelete-non-virtual-dtor -Wsuggest-override -Wstring-conversion -fdiagnostics-color -O3  -isysroot /Applications/Xcode.app/Contents/Developer/Platforms/MacOSX.platform/Developer/SDKs/MacOSX10.15.sdk    -fno-exceptions -fno-rtti -UNDEBUG -std=c++14 -MD -MT lib/MC/CMakeFiles/LLVMMC.dir/MCSubtargetInfo.cpp.o -MF lib/MC/CMakeFiles/LLVMMC.dir/MCSubtargetInfo.cpp.o.d -o lib/MC/CMakeFiles/LLVMMC.dir/MCSubtargetInfo.cpp.o -c /Users/buildslave/jenkins/workspace/lldb-cmake/llvm-project/llvm/lib/MC/MCSubtargetInfo.cpp
[288/3090] /Users/buildslave/jenkins/workspace/lldb-cmake/host-compiler/bin/clang++  -DGTEST_HAS_RTTI=0 -D_DEBUG -D__STDC_CONSTANT_MACROS -D__STDC_FORMAT_MACROS -D__STDC_LIMIT_MACROS -Ilib/MC -I/Users/buildslave/jenkins/workspace/lldb-cmake/llvm-project/llvm/lib/MC -Iinclude -I/Users/buildslave/jenkins/workspace/lldb-cmake/llvm-project/llvm/include -Wdocumentation -fPIC -fvisibility-inlines-hidden -Werror=date-time -Werror=unguarded-availability-new -fmodules -fmodules-cache-path=/Users/buildslave/jenkins/workspace/lldb-cmake/lldb-build/module.cache -fcxx-modules -Xclang -fmodules-local-submodule-visibility -Wall -Wextra -Wno-unused-parameter -Wwrite-strings -Wcast-qual -Wmissing-field-initializers -pedantic -Wno-long-long -Wimplicit-fallthrough -Wcovered-switch-default -Wno-noexcept-type -Wnon-virtual-dtor -Wdelete-non-virtual-dtor -Wsuggest-override -Wstring-conversion -fdiagnostics-color -O3  -isysroot /Applications/Xcode.app/Contents/Developer/Platforms/MacOSX.platform/Developer/SDKs/MacOSX10.15.sdk    -fno-exceptions -fno-rtti -UNDEBUG -std=c++14 -MD -MT lib/MC/CMakeFiles/LLVMMC.dir/MCXCOFFObjectTargetWriter.cpp.o -MF lib/MC/CMakeFiles/LLVMMC.dir/MCXCOFFObjectTargetWriter.cpp.o.d -o lib/MC/CMakeFiles/LLVMMC.dir/MCXCOFFObjectTargetWriter.cpp.o -c /Users/buildslave/jenkins/workspace/lldb-cmake/llvm-project/llvm/lib/MC/MCXCOFFObjectTargetWriter.cpp
[289/3090] /Users/buildslave/jenkins/workspace/lldb-cmake/host-compiler/bin/clang++  -DGTEST_HAS_RTTI=0 -D_DEBUG -D__STDC_CONSTANT_MACROS -D__STDC_FORMAT_MACROS -D__STDC_LIMIT_MACROS -Ilib/MC -I/Users/buildslave/jenkins/workspace/lldb-cmake/llvm-project/llvm/lib/MC -Iinclude -I/Users/buildslave/jenkins/workspace/lldb-cmake/llvm-project/llvm/include -Wdocumentation -fPIC -fvisibility-inlines-hidden -Werror=date-time -Werror=unguarded-availability-new -fmodules -fmodules-cache-path=/Users/buildslave/jenkins/workspace/lldb-cmake/lldb-build/module.cache -fcxx-modules -Xclang -fmodules-local-submodule-visibility -Wall -Wextra -Wno-unused-parameter -Wwrite-strings -Wcast-qual -Wmissing-field-initializers -pedantic -Wno-long-long -Wimplicit-fallthrough -Wcovered-switch-default -Wno-noexcept-type -Wnon-virtual-dtor -Wdelete-non-virtual-dtor -Wsuggest-override -Wstring-conversion -fdiagnostics-color -O3  -isysroot /Applications/Xcode.app/Contents/Developer/Platforms/MacOSX.platform/Developer/SDKs/MacOSX10.15.sdk    -fno-exceptions -fno-rtti -UNDEBUG -std=c++14 -MD -MT lib/MC/CMakeFiles/LLVMMC.dir/MCXCOFFStreamer.cpp.o -MF lib/MC/CMakeFiles/LLVMMC.dir/MCXCOFFStreamer.cpp.o.d -o lib/MC/CMakeFiles/LLVMMC.dir/MCXCOFFStreamer.cpp.o -c /Users/buildslave/jenkins/workspace/lldb-cmake/llvm-project/llvm/lib/MC/MCXCOFFStreamer.cpp
[290/3090] /Users/buildslave/jenkins/workspace/lldb-cmake/host-compiler/bin/clang++  -DGTEST_HAS_RTTI=0 -D_DEBUG -D__STDC_CONSTANT_MACROS -D__STDC_FORMAT_MACROS -D__STDC_LIMIT_MACROS -Ilib/LTO -I/Users/buildslave/jenkins/workspace/lldb-cmake/llvm-project/llvm/lib/LTO -Iinclude -I/Users/buildslave/jenkins/workspace/lldb-cmake/llvm-project/llvm/include -Wdocumentation -fPIC -fvisibility-inlines-hidden -Werror=date-time -Werror=unguarded-availability-new -fmodules -fmodules-cache-path=/Users/buildslave/jenkins/workspace/lldb-cmake/lldb-build/module.cache -fcxx-modules -Xclang -fmodules-local-submodule-visibility -Wall -Wextra -Wno-unused-parameter -Wwrite-strings -Wcast-qual -Wmissing-field-initializers -pedantic -Wno-long-long -Wimplicit-fallthrough -Wcovered-switch-default -Wno-noexcept-type -Wnon-virtual-dtor -Wdelete-non-virtual-dtor -Wsuggest-override -Wstring-conversion -fdiagnostics-color -O3  -isysroot /Applications/Xcode.app/Contents/Developer/Platforms/MacOSX.platform/Developer/SDKs/MacOSX10.15.sdk    -fno-exceptions -fno-rtti -UNDEBUG -std=c++14 -MD -MT lib/LTO/CMakeFiles/LLVMLTO.dir/LTOModule.cpp.o -MF lib/LTO/CMakeFiles/LLVMLTO.dir/LTOModule.cpp.o.d -o lib/LTO/CMakeFiles/LLVMLTO.dir/LTOModule.cpp.o -c /Users/buildslave/jenkins/workspace/lldb-cmake/llvm-project/llvm/lib/LTO/LTOModule.cpp
While building module 'LLVM_Backend' imported from /Users/buildslave/jenkins/workspace/lldb-cmake/llvm-project/llvm/lib/LTO/LTOModule.cpp:17:
In file included from <module-includes>:106:
/Users/buildslave/jenkins/workspace/lldb-cmake/llvm-project/llvm/include/llvm/CodeGen/MachinePassManager.h:94:8: warning: '\returns' command used in a comment that is not attached to a function or method declaration [-Wdocumentation]
  /// \returns null if there is no cached result.
      ~^~~~~~~~~~~~~~~~~~~~~~~~~~~~~~~~~~~~~~~~~~
1 warning generated.
[291/3090] /Users/buildslave/jenkins/workspace/lldb-cmake/host-compiler/bin/clang++  -DGTEST_HAS_RTTI=0 -D_DEBUG -D__STDC_CONSTANT_MACROS -D__STDC_FORMAT_MACROS -D__STDC_LIMIT_MACROS -Ilib/MC -I/Users/buildslave/jenkins/workspace/lldb-cmake/llvm-project/llvm/lib/MC -Iinclude -I/Users/buildslave/jenkins/workspace/lldb-cmake/llvm-project/llvm/include -Wdocumentation -fPIC -fvisibility-inlines-hidden -Werror=date-time -Werror=unguarded-availability-new -fmodules -fmodules-cache-path=/Users/buildslave/jenkins/workspace/lldb-cmake/lldb-build/module.cache -fcxx-modules -Xclang -fmodules-local-submodule-visibility -Wall -Wextra -Wno-unused-parameter -Wwrite-strings -Wcast-qual -Wmissing-field-initializers -pedantic -Wno-long-long -Wimplicit-fallthrough -Wcovered-switch-default -Wno-noexcept-type -Wnon-virtual-dtor -Wdelete-non-virtual-dtor -Wsuggest-override -Wstring-conversion -fdiagnostics-color -O3  -isysroot /Applications/Xcode.app/Contents/Developer/Platforms/MacOSX.platform/Developer/SDKs/MacOSX10.15.sdk    -fno-exceptions -fno-rtti -UNDEBUG -std=c++14 -MD -MT lib/MC/CMakeFiles/LLVMMC.dir/MCWinCOFFStreamer.cpp.o -MF lib/MC/CMakeFiles/LLVMMC.dir/MCWinCOFFStreamer.cpp.o.d -o lib/MC/CMakeFiles/LLVMMC.dir/MCWinCOFFStreamer.cpp.o -c /Users/buildslave/jenkins/workspace/lldb-cmake/llvm-project/llvm/lib/MC/MCWinCOFFStreamer.cpp
[292/3090] /Users/buildslave/jenkins/workspace/lldb-cmake/host-compiler/bin/clang++  -DGTEST_HAS_RTTI=0 -D_DEBUG -D__STDC_CONSTANT_MACROS -D__STDC_FORMAT_MACROS -D__STDC_LIMIT_MACROS -Ilib/MC -I/Users/buildslave/jenkins/workspace/lldb-cmake/llvm-project/llvm/lib/MC -Iinclude -I/Users/buildslave/jenkins/workspace/lldb-cmake/llvm-project/llvm/include -Wdocumentation -fPIC -fvisibility-inlines-hidden -Werror=date-time -Werror=unguarded-availability-new -fmodules -fmodules-cache-path=/Users/buildslave/jenkins/workspace/lldb-cmake/lldb-build/module.cache -fcxx-modules -Xclang -fmodules-local-submodule-visibility -Wall -Wextra -Wno-unused-parameter -Wwrite-strings -Wcast-qual -Wmissing-field-initializers -pedantic -Wno-long-long -Wimplicit-fallthrough -Wcovered-switch-default -Wno-noexcept-type -Wnon-virtual-dtor -Wdelete-non-virtual-dtor -Wsuggest-override -Wstring-conversion -fdiagnostics-color -O3  -isysroot /Applications/Xcode.app/Contents/Developer/Platforms/MacOSX.platform/Developer/SDKs/MacOSX10.15.sdk    -fno-exceptions -fno-rtti -UNDEBUG -std=c++14 -MD -MT lib/MC/CMakeFiles/LLVMMC.dir/MCTargetOptionsCommandFlags.cpp.o -MF lib/MC/CMakeFiles/LLVMMC.dir/MCTargetOptionsCommandFlags.cpp.o.d -o lib/MC/CMakeFiles/LLVMMC.dir/MCTargetOptionsCommandFlags.cpp.o -c /Users/buildslave/jenkins/workspace/lldb-cmake/llvm-project/llvm/lib/MC/MCTargetOptionsCommandFlags.cpp
[293/3090] /Users/buildslave/jenkins/workspace/lldb-cmake/host-compiler/bin/clang++  -DGTEST_HAS_RTTI=0 -D_DEBUG -D__STDC_CONSTANT_MACROS -D__STDC_FORMAT_MACROS -D__STDC_LIMIT_MACROS -Ilib/MC -I/Users/buildslave/jenkins/workspace/lldb-cmake/llvm-project/llvm/lib/MC -Iinclude -I/Users/buildslave/jenkins/workspace/lldb-cmake/llvm-project/llvm/include -Wdocumentation -fPIC -fvisibility-inlines-hidden -Werror=date-time -Werror=unguarded-availability-new -fmodules -fmodules-cache-path=/Users/buildslave/jenkins/workspace/lldb-cmake/lldb-build/module.cache -fcxx-modules -Xclang -fmodules-local-submodule-visibility -Wall -Wextra -Wno-unused-parameter -Wwrite-strings -Wcast-qual -Wmissing-field-initializers -pedantic -Wno-long-long -Wimplicit-fallthrough -Wcovered-switch-default -Wno-noexcept-type -Wnon-virtual-dtor -Wdelete-non-virtual-dtor -Wsuggest-override -Wstring-conversion -fdiagnostics-color -O3  -isysroot /Applications/Xcode.app/Contents/Developer/Platforms/MacOSX.platform/Developer/SDKs/MacOSX10.15.sdk    -fno-exceptions -fno-rtti -UNDEBUG -std=c++14 -MD -MT lib/MC/CMakeFiles/LLVMMC.dir/SubtargetFeature.cpp.o -MF lib/MC/CMakeFiles/LLVMMC.dir/SubtargetFeature.cpp.o.d -o lib/MC/CMakeFiles/LLVMMC.dir/SubtargetFeature.cpp.o -c /Users/buildslave/jenkins/workspace/lldb-cmake/llvm-project/llvm/lib/MC/SubtargetFeature.cpp
[294/3090] /Users/buildslave/jenkins/workspace/lldb-cmake/host-compiler/bin/clang++  -DGTEST_HAS_RTTI=0 -D_DEBUG -D__STDC_CONSTANT_MACROS -D__STDC_FORMAT_MACROS -D__STDC_LIMIT_MACROS -Ilib/MC -I/Users/buildslave/jenkins/workspace/lldb-cmake/llvm-project/llvm/lib/MC -Iinclude -I/Users/buildslave/jenkins/workspace/lldb-cmake/llvm-project/llvm/include -Wdocumentation -fPIC -fvisibility-inlines-hidden -Werror=date-time -Werror=unguarded-availability-new -fmodules -fmodules-cache-path=/Users/buildslave/jenkins/workspace/lldb-cmake/lldb-build/module.cache -fcxx-modules -Xclang -fmodules-local-submodule-visibility -Wall -Wextra -Wno-unused-parameter -Wwrite-strings -Wcast-qual -Wmissing-field-initializers -pedantic -Wno-long-long -Wimplicit-fallthrough -Wcovered-switch-default -Wno-noexcept-type -Wnon-virtual-dtor -Wdelete-non-virtual-dtor -Wsuggest-override -Wstring-conversion -fdiagnostics-color -O3  -isysroot /Applications/Xcode.app/Contents/Developer/Platforms/MacOSX.platform/Developer/SDKs/MacOSX10.15.sdk    -fno-exceptions -fno-rtti -UNDEBUG -std=c++14 -MD -MT lib/MC/CMakeFiles/LLVMMC.dir/MCWin64EH.cpp.o -MF lib/MC/CMakeFiles/LLVMMC.dir/MCWin64EH.cpp.o.d -o lib/MC/CMakeFiles/LLVMMC.dir/MCWin64EH.cpp.o -c /Users/buildslave/jenkins/workspace/lldb-cmake/llvm-project/llvm/lib/MC/MCWin64EH.cpp
[295/3090] /Users/buildslave/jenkins/workspace/lldb-cmake/host-compiler/bin/clang++  -DGTEST_HAS_RTTI=0 -D_DEBUG -D__STDC_CONSTANT_MACROS -D__STDC_FORMAT_MACROS -D__STDC_LIMIT_MACROS -Ilib/MC -I/Users/buildslave/jenkins/workspace/lldb-cmake/llvm-project/llvm/lib/MC -Iinclude -I/Users/buildslave/jenkins/workspace/lldb-cmake/llvm-project/llvm/include -Wdocumentation -fPIC -fvisibility-inlines-hidden -Werror=date-time -Werror=unguarded-availability-new -fmodules -fmodules-cache-path=/Users/buildslave/jenkins/workspace/lldb-cmake/lldb-build/module.cache -fcxx-modules -Xclang -fmodules-local-submodule-visibility -Wall -Wextra -Wno-unused-parameter -Wwrite-strings -Wcast-qual -Wmissing-field-initializers -pedantic -Wno-long-long -Wimplicit-fallthrough -Wcovered-switch-default -Wno-noexcept-type -Wnon-virtual-dtor -Wdelete-non-virtual-dtor -Wsuggest-override -Wstring-conversion -fdiagnostics-color -O3  -isysroot /Applications/Xcode.app/Contents/Developer/Platforms/MacOSX.platform/Developer/SDKs/MacOSX10.15.sdk    -fno-exceptions -fno-rtti -UNDEBUG -std=c++14 -MD -MT lib/MC/CMakeFiles/LLVMMC.dir/StringTableBuilder.cpp.o -MF lib/MC/CMakeFiles/LLVMMC.dir/StringTableBuilder.cpp.o.d -o lib/MC/CMakeFiles/LLVMMC.dir/StringTableBuilder.cpp.o -c /Users/buildslave/jenkins/workspace/lldb-cmake/llvm-project/llvm/lib/MC/StringTableBuilder.cpp
[296/3090] /Users/buildslave/jenkins/workspace/lldb-cmake/host-compiler/bin/clang++  -DGTEST_HAS_RTTI=0 -D_DEBUG -D__STDC_CONSTANT_MACROS -D__STDC_FORMAT_MACROS -D__STDC_LIMIT_MACROS -Ilib/LTO -I/Users/buildslave/jenkins/workspace/lldb-cmake/llvm-project/llvm/lib/LTO -Iinclude -I/Users/buildslave/jenkins/workspace/lldb-cmake/llvm-project/llvm/include -Wdocumentation -fPIC -fvisibility-inlines-hidden -Werror=date-time -Werror=unguarded-availability-new -fmodules -fmodules-cache-path=/Users/buildslave/jenkins/workspace/lldb-cmake/lldb-build/module.cache -fcxx-modules -Xclang -fmodules-local-submodule-visibility -Wall -Wextra -Wno-unused-parameter -Wwrite-strings -Wcast-qual -Wmissing-field-initializers -pedantic -Wno-long-long -Wimplicit-fallthrough -Wcovered-switch-default -Wno-noexcept-type -Wnon-virtual-dtor -Wdelete-non-virtual-dtor -Wsuggest-override -Wstring-conversion -fdiagnostics-color -O3  -isysroot /Applications/Xcode.app/Contents/Developer/Platforms/MacOSX.platform/Developer/SDKs/MacOSX10.15.sdk    -fno-exceptions -fno-rtti -UNDEBUG -std=c++14 -MD -MT lib/LTO/CMakeFiles/LLVMLTO.dir/LTOCodeGenerator.cpp.o -MF lib/LTO/CMakeFiles/LLVMLTO.dir/LTOCodeGenerator.cpp.o.d -o lib/LTO/CMakeFiles/LLVMLTO.dir/LTOCodeGenerator.cpp.o -c /Users/buildslave/jenkins/workspace/lldb-cmake/llvm-project/llvm/lib/LTO/LTOCodeGenerator.cpp
[297/3090] /Users/buildslave/jenkins/workspace/lldb-cmake/host-compiler/bin/clang++  -DGTEST_HAS_RTTI=0 -D_DEBUG -D__STDC_CONSTANT_MACROS -D__STDC_FORMAT_MACROS -D__STDC_LIMIT_MACROS -Ilib/MC -I/Users/buildslave/jenkins/workspace/lldb-cmake/llvm-project/llvm/lib/MC -Iinclude -I/Users/buildslave/jenkins/workspace/lldb-cmake/llvm-project/llvm/include -Wdocumentation -fPIC -fvisibility-inlines-hidden -Werror=date-time -Werror=unguarded-availability-new -fmodules -fmodules-cache-path=/Users/buildslave/jenkins/workspace/lldb-cmake/lldb-build/module.cache -fcxx-modules -Xclang -fmodules-local-submodule-visibility -Wall -Wextra -Wno-unused-parameter -Wwrite-strings -Wcast-qual -Wmissing-field-initializers -pedantic -Wno-long-long -Wimplicit-fallthrough -Wcovered-switch-default -Wno-noexcept-type -Wnon-virtual-dtor -Wdelete-non-virtual-dtor -Wsuggest-override -Wstring-conversion -fdiagnostics-color -O3  -isysroot /Applications/Xcode.app/Contents/Developer/Platforms/MacOSX.platform/Developer/SDKs/MacOSX10.15.sdk    -fno-exceptions -fno-rtti -UNDEBUG -std=c++14 -MD -MT lib/MC/CMakeFiles/LLVMMC.dir/MCStreamer.cpp.o -MF lib/MC/CMakeFiles/LLVMMC.dir/MCStreamer.cpp.o.d -o lib/MC/CMakeFiles/LLVMMC.dir/MCStreamer.cpp.o -c /Users/buildslave/jenkins/workspace/lldb-cmake/llvm-project/llvm/lib/MC/MCStreamer.cpp
[298/3090] /Users/buildslave/jenkins/workspace/lldb-cmake/host-compiler/bin/clang++  -DGTEST_HAS_RTTI=0 -D_DEBUG -D__STDC_CONSTANT_MACROS -D__STDC_FORMAT_MACROS -D__STDC_LIMIT_MACROS -Ilib/MC/MCParser -I/Users/buildslave/jenkins/workspace/lldb-cmake/llvm-project/llvm/lib/MC/MCParser -Iinclude -I/Users/buildslave/jenkins/workspace/lldb-cmake/llvm-project/llvm/include -Wdocumentation -fPIC -fvisibility-inlines-hidden -Werror=date-time -Werror=unguarded-availability-new -fmodules -fmodules-cache-path=/Users/buildslave/jenkins/workspace/lldb-cmake/lldb-build/module.cache -fcxx-modules -Xclang -fmodules-local-submodule-visibility -Wall -Wextra -Wno-unused-parameter -Wwrite-strings -Wcast-qual -Wmissing-field-initializers -pedantic -Wno-long-long -Wimplicit-fallthrough -Wcovered-switch-default -Wno-noexcept-type -Wnon-virtual-dtor -Wdelete-non-virtual-dtor -Wsuggest-override -Wstring-conversion -fdiagnostics-color -O3  -isysroot /Applications/Xcode.app/Contents/Developer/Platforms/MacOSX.platform/Developer/SDKs/MacOSX10.15.sdk    -fno-exceptions -fno-rtti -UNDEBUG -std=c++14 -MD -MT lib/MC/MCParser/CMakeFiles/LLVMMCParser.dir/AsmLexer.cpp.o -MF lib/MC/MCParser/CMakeFiles/LLVMMCParser.dir/AsmLexer.cpp.o.d -o lib/MC/MCParser/CMakeFiles/LLVMMCParser.dir/AsmLexer.cpp.o -c /Users/buildslave/jenkins/workspace/lldb-cmake/llvm-project/llvm/lib/MC/MCParser/AsmLexer.cpp
[299/3090] /Users/buildslave/jenkins/workspace/lldb-cmake/host-compiler/bin/clang++  -DGTEST_HAS_RTTI=0 -D_DEBUG -D__STDC_CONSTANT_MACROS -D__STDC_FORMAT_MACROS -D__STDC_LIMIT_MACROS -Ilib/MC -I/Users/buildslave/jenkins/workspace/lldb-cmake/llvm-project/llvm/lib/MC -Iinclude -I/Users/buildslave/jenkins/workspace/lldb-cmake/llvm-project/llvm/include -Wdocumentation -fPIC -fvisibility-inlines-hidden -Werror=date-time -Werror=unguarded-availability-new -fmodules -fmodules-cache-path=/Users/buildslave/jenkins/workspace/lldb-cmake/lldb-build/module.cache -fcxx-modules -Xclang -fmodules-local-submodule-visibility -Wall -Wextra -Wno-unused-parameter -Wwrite-strings -Wcast-qual -Wmissing-field-initializers -pedantic -Wno-long-long -Wimplicit-fallthrough -Wcovered-switch-default -Wno-noexcept-type -Wnon-virtual-dtor -Wdelete-non-virtual-dtor -Wsuggest-override -Wstring-conversion -fdiagnostics-color -O3  -isysroot /Applications/Xcode.app/Contents/Developer/Platforms/MacOSX.platform/Developer/SDKs/MacOSX10.15.sdk    -fno-exceptions -fno-rtti -UNDEBUG -std=c++14 -MD -MT lib/MC/CMakeFiles/LLVMMC.dir/MachObjectWriter.cpp.o -MF lib/MC/CMakeFiles/LLVMMC.dir/MachObjectWriter.cpp.o.d -o lib/MC/CMakeFiles/LLVMMC.dir/MachObjectWriter.cpp.o -c /Users/buildslave/jenkins/workspace/lldb-cmake/llvm-project/llvm/lib/MC/MachObjectWriter.cpp
[300/3090] /Users/buildslave/jenkins/workspace/lldb-cmake/host-compiler/bin/clang++  -DGTEST_HAS_RTTI=0 -D_DEBUG -D__STDC_CONSTANT_MACROS -D__STDC_FORMAT_MACROS -D__STDC_LIMIT_MACROS -Ilib/MC/MCParser -I/Users/buildslave/jenkins/workspace/lldb-cmake/llvm-project/llvm/lib/MC/MCParser -Iinclude -I/Users/buildslave/jenkins/workspace/lldb-cmake/llvm-project/llvm/include -Wdocumentation -fPIC -fvisibility-inlines-hidden -Werror=date-time -Werror=unguarded-availability-new -fmodules -fmodules-cache-path=/Users/buildslave/jenkins/workspace/lldb-cmake/lldb-build/module.cache -fcxx-modules -Xclang -fmodules-local-submodule-visibility -Wall -Wextra -Wno-unused-parameter -Wwrite-strings -Wcast-qual -Wmissing-field-initializers -pedantic -Wno-long-long -Wimplicit-fallthrough -Wcovered-switch-default -Wno-noexcept-type -Wnon-virtual-dtor -Wdelete-non-virtual-dtor -Wsuggest-override -Wstring-conversion -fdiagnostics-color -O3  -isysroot /Applications/Xcode.app/Contents/Developer/Platforms/MacOSX.platform/Developer/SDKs/MacOSX10.15.sdk    -fno-exceptions -fno-rtti -UNDEBUG -std=c++14 -MD -MT lib/MC/MCParser/CMakeFiles/LLVMMCParser.dir/COFFAsmParser.cpp.o -MF lib/MC/MCParser/CMakeFiles/LLVMMCParser.dir/COFFAsmParser.cpp.o.d -o lib/MC/MCParser/CMakeFiles/LLVMMCParser.dir/COFFAsmParser.cpp.o -c /Users/buildslave/jenkins/workspace/lldb-cmake/llvm-project/llvm/lib/MC/MCParser/COFFAsmParser.cpp
[301/3090] /Users/buildslave/jenkins/workspace/lldb-cmake/host-compiler/bin/clang++  -DGTEST_HAS_RTTI=0 -D_DEBUG -D__STDC_CONSTANT_MACROS -D__STDC_FORMAT_MACROS -D__STDC_LIMIT_MACROS -Ilib/MC/MCParser -I/Users/buildslave/jenkins/workspace/lldb-cmake/llvm-project/llvm/lib/MC/MCParser -Iinclude -I/Users/buildslave/jenkins/workspace/lldb-cmake/llvm-project/llvm/include -Wdocumentation -fPIC -fvisibility-inlines-hidden -Werror=date-time -Werror=unguarded-availability-new -fmodules -fmodules-cache-path=/Users/buildslave/jenkins/workspace/lldb-cmake/lldb-build/module.cache -fcxx-modules -Xclang -fmodules-local-submodule-visibility -Wall -Wextra -Wno-unused-parameter -Wwrite-strings -Wcast-qual -Wmissing-field-initializers -pedantic -Wno-long-long -Wimplicit-fallthrough -Wcovered-switch-default -Wno-noexcept-type -Wnon-virtual-dtor -Wdelete-non-virtual-dtor -Wsuggest-override -Wstring-conversion -fdiagnostics-color -O3  -isysroot /Applications/Xcode.app/Contents/Developer/Platforms/MacOSX.platform/Developer/SDKs/MacOSX10.15.sdk    -fno-exceptions -fno-rtti -UNDEBUG -std=c++14 -MD -MT lib/MC/MCParser/CMakeFiles/LLVMMCParser.dir/COFFMasmParser.cpp.o -MF lib/MC/MCParser/CMakeFiles/LLVMMCParser.dir/COFFMasmParser.cpp.o.d -o lib/MC/MCParser/CMakeFiles/LLVMMCParser.dir/COFFMasmParser.cpp.o -c /Users/buildslave/jenkins/workspace/lldb-cmake/llvm-project/llvm/lib/MC/MCParser/COFFMasmParser.cpp
[302/3090] /Users/buildslave/jenkins/workspace/lldb-cmake/host-compiler/bin/clang++  -DGTEST_HAS_RTTI=0 -D_DEBUG -D__STDC_CONSTANT_MACROS -D__STDC_FORMAT_MACROS -D__STDC_LIMIT_MACROS -Ilib/Analysis -I/Users/buildslave/jenkins/workspace/lldb-cmake/llvm-project/llvm/lib/Analysis -Iinclude -I/Users/buildslave/jenkins/workspace/lldb-cmake/llvm-project/llvm/include -Wdocumentation -fPIC -fvisibility-inlines-hidden -Werror=date-time -Werror=unguarded-availability-new -fmodules -fmodules-cache-path=/Users/buildslave/jenkins/workspace/lldb-cmake/lldb-build/module.cache -fcxx-modules -Xclang -fmodules-local-submodule-visibility -Wall -Wextra -Wno-unused-parameter -Wwrite-strings -Wcast-qual -Wmissing-field-initializers -pedantic -Wno-long-long -Wimplicit-fallthrough -Wcovered-switch-default -Wno-noexcept-type -Wnon-virtual-dtor -Wdelete-non-virtual-dtor -Wsuggest-override -Wstring-conversion -fdiagnostics-color -O3  -isysroot /Applications/Xcode.app/Contents/Developer/Platforms/MacOSX.platform/Developer/SDKs/MacOSX10.15.sdk    -fno-exceptions -fno-rtti -UNDEBUG -std=c++14 -MD -MT lib/Analysis/CMakeFiles/LLVMAnalysis.dir/ScalarEvolution.cpp.o -MF lib/Analysis/CMakeFiles/LLVMAnalysis.dir/ScalarEvolution.cpp.o.d -o lib/Analysis/CMakeFiles/LLVMAnalysis.dir/ScalarEvolution.cpp.o -c /Users/buildslave/jenkins/workspace/lldb-cmake/llvm-project/llvm/lib/Analysis/ScalarEvolution.cpp
[303/3090] /Users/buildslave/jenkins/workspace/lldb-cmake/host-compiler/bin/clang++  -DGTEST_HAS_RTTI=0 -D_DEBUG -D__STDC_CONSTANT_MACROS -D__STDC_FORMAT_MACROS -D__STDC_LIMIT_MACROS -Ilib/MC/MCParser -I/Users/buildslave/jenkins/workspace/lldb-cmake/llvm-project/llvm/lib/MC/MCParser -Iinclude -I/Users/buildslave/jenkins/workspace/lldb-cmake/llvm-project/llvm/include -Wdocumentation -fPIC -fvisibility-inlines-hidden -Werror=date-time -Werror=unguarded-availability-new -fmodules -fmodules-cache-path=/Users/buildslave/jenkins/workspace/lldb-cmake/lldb-build/module.cache -fcxx-modules -Xclang -fmodules-local-submodule-visibility -Wall -Wextra -Wno-unused-parameter -Wwrite-strings -Wcast-qual -Wmissing-field-initializers -pedantic -Wno-long-long -Wimplicit-fallthrough -Wcovered-switch-default -Wno-noexcept-type -Wnon-virtual-dtor -Wdelete-non-virtual-dtor -Wsuggest-override -Wstring-conversion -fdiagnostics-color -O3  -isysroot /Applications/Xcode.app/Contents/Developer/Platforms/MacOSX.platform/Developer/SDKs/MacOSX10.15.sdk    -fno-exceptions -fno-rtti -UNDEBUG -std=c++14 -MD -MT lib/MC/MCParser/CMakeFiles/LLVMMCParser.dir/MCAsmLexer.cpp.o -MF lib/MC/MCParser/CMakeFiles/LLVMMCParser.dir/MCAsmLexer.cpp.o.d -o lib/MC/MCParser/CMakeFiles/LLVMMCParser.dir/MCAsmLexer.cpp.o -c /Users/buildslave/jenkins/workspace/lldb-cmake/llvm-project/llvm/lib/MC/MCParser/MCAsmLexer.cpp
[304/3090] /Users/buildslave/jenkins/workspace/lldb-cmake/host-compiler/bin/clang++  -DGTEST_HAS_RTTI=0 -D_DEBUG -D__STDC_CONSTANT_MACROS -D__STDC_FORMAT_MACROS -D__STDC_LIMIT_MACROS -Ilib/MC/MCParser -I/Users/buildslave/jenkins/workspace/lldb-cmake/llvm-project/llvm/lib/MC/MCParser -Iinclude -I/Users/buildslave/jenkins/workspace/lldb-cmake/llvm-project/llvm/include -Wdocumentation -fPIC -fvisibility-inlines-hidden -Werror=date-time -Werror=unguarded-availability-new -fmodules -fmodules-cache-path=/Users/buildslave/jenkins/workspace/lldb-cmake/lldb-build/module.cache -fcxx-modules -Xclang -fmodules-local-submodule-visibility -Wall -Wextra -Wno-unused-parameter -Wwrite-strings -Wcast-qual -Wmissing-field-initializers -pedantic -Wno-long-long -Wimplicit-fallthrough -Wcovered-switch-default -Wno-noexcept-type -Wnon-virtual-dtor -Wdelete-non-virtual-dtor -Wsuggest-override -Wstring-conversion -fdiagnostics-color -O3  -isysroot /Applications/Xcode.app/Contents/Developer/Platforms/MacOSX.platform/Developer/SDKs/MacOSX10.15.sdk    -fno-exceptions -fno-rtti -UNDEBUG -std=c++14 -MD -MT lib/MC/MCParser/CMakeFiles/LLVMMCParser.dir/MCAsmParserExtension.cpp.o -MF lib/MC/MCParser/CMakeFiles/LLVMMCParser.dir/MCAsmParserExtension.cpp.o.d -o lib/MC/MCParser/CMakeFiles/LLVMMCParser.dir/MCAsmParserExtension.cpp.o -c /Users/buildslave/jenkins/workspace/lldb-cmake/llvm-project/llvm/lib/MC/MCParser/MCAsmParserExtension.cpp
[305/3090] /Users/buildslave/jenkins/workspace/lldb-cmake/host-compiler/bin/clang++  -DGTEST_HAS_RTTI=0 -D_DEBUG -D__STDC_CONSTANT_MACROS -D__STDC_FORMAT_MACROS -D__STDC_LIMIT_MACROS -Ilib/MC/MCParser -I/Users/buildslave/jenkins/workspace/lldb-cmake/llvm-project/llvm/lib/MC/MCParser -Iinclude -I/Users/buildslave/jenkins/workspace/lldb-cmake/llvm-project/llvm/include -Wdocumentation -fPIC -fvisibility-inlines-hidden -Werror=date-time -Werror=unguarded-availability-new -fmodules -fmodules-cache-path=/Users/buildslave/jenkins/workspace/lldb-cmake/lldb-build/module.cache -fcxx-modules -Xclang -fmodules-local-submodule-visibility -Wall -Wextra -Wno-unused-parameter -Wwrite-strings -Wcast-qual -Wmissing-field-initializers -pedantic -Wno-long-long -Wimplicit-fallthrough -Wcovered-switch-default -Wno-noexcept-type -Wnon-virtual-dtor -Wdelete-non-virtual-dtor -Wsuggest-override -Wstring-conversion -fdiagnostics-color -O3  -isysroot /Applications/Xcode.app/Contents/Developer/Platforms/MacOSX.platform/Developer/SDKs/MacOSX10.15.sdk    -fno-exceptions -fno-rtti -UNDEBUG -std=c++14 -MD -MT lib/MC/MCParser/CMakeFiles/LLVMMCParser.dir/MCTargetAsmParser.cpp.o -MF lib/MC/MCParser/CMakeFiles/LLVMMCParser.dir/MCTargetAsmParser.cpp.o.d -o lib/MC/MCParser/CMakeFiles/LLVMMCParser.dir/MCTargetAsmParser.cpp.o -c /Users/buildslave/jenkins/workspace/lldb-cmake/llvm-project/llvm/lib/MC/MCParser/MCTargetAsmParser.cpp
[306/3090] /Users/buildslave/jenkins/workspace/lldb-cmake/host-compiler/bin/clang++  -DGTEST_HAS_RTTI=0 -D_DEBUG -D__STDC_CONSTANT_MACROS -D__STDC_FORMAT_MACROS -D__STDC_LIMIT_MACROS -Ilib/MC/MCParser -I/Users/buildslave/jenkins/workspace/lldb-cmake/llvm-project/llvm/lib/MC/MCParser -Iinclude -I/Users/buildslave/jenkins/workspace/lldb-cmake/llvm-project/llvm/include -Wdocumentation -fPIC -fvisibility-inlines-hidden -Werror=date-time -Werror=unguarded-availability-new -fmodules -fmodules-cache-path=/Users/buildslave/jenkins/workspace/lldb-cmake/lldb-build/module.cache -fcxx-modules -Xclang -fmodules-local-submodule-visibility -Wall -Wextra -Wno-unused-parameter -Wwrite-strings -Wcast-qual -Wmissing-field-initializers -pedantic -Wno-long-long -Wimplicit-fallthrough -Wcovered-switch-default -Wno-noexcept-type -Wnon-virtual-dtor -Wdelete-non-virtual-dtor -Wsuggest-override -Wstring-conversion -fdiagnostics-color -O3  -isysroot /Applications/Xcode.app/Contents/Developer/Platforms/MacOSX.platform/Developer/SDKs/MacOSX10.15.sdk    -fno-exceptions -fno-rtti -UNDEBUG -std=c++14 -MD -MT lib/MC/MCParser/CMakeFiles/LLVMMCParser.dir/MCAsmParser.cpp.o -MF lib/MC/MCParser/CMakeFiles/LLVMMCParser.dir/MCAsmParser.cpp.o.d -o lib/MC/MCParser/CMakeFiles/LLVMMCParser.dir/MCAsmParser.cpp.o -c /Users/buildslave/jenkins/workspace/lldb-cmake/llvm-project/llvm/lib/MC/MCParser/MCAsmParser.cpp
[307/3090] /Users/buildslave/jenkins/workspace/lldb-cmake/host-compiler/bin/clang++  -DGTEST_HAS_RTTI=0 -D_DEBUG -D__STDC_CONSTANT_MACROS -D__STDC_FORMAT_MACROS -D__STDC_LIMIT_MACROS -Ilib/MC -I/Users/buildslave/jenkins/workspace/lldb-cmake/llvm-project/llvm/lib/MC -Iinclude -I/Users/buildslave/jenkins/workspace/lldb-cmake/llvm-project/llvm/include -Wdocumentation -fPIC -fvisibility-inlines-hidden -Werror=date-time -Werror=unguarded-availability-new -fmodules -fmodules-cache-path=/Users/buildslave/jenkins/workspace/lldb-cmake/lldb-build/module.cache -fcxx-modules -Xclang -fmodules-local-submodule-visibility -Wall -Wextra -Wno-unused-parameter -Wwrite-strings -Wcast-qual -Wmissing-field-initializers -pedantic -Wno-long-long -Wimplicit-fallthrough -Wcovered-switch-default -Wno-noexcept-type -Wnon-virtual-dtor -Wdelete-non-virtual-dtor -Wsuggest-override -Wstring-conversion -fdiagnostics-color -O3  -isysroot /Applications/Xcode.app/Contents/Developer/Platforms/MacOSX.platform/Developer/SDKs/MacOSX10.15.sdk    -fno-exceptions -fno-rtti -UNDEBUG -std=c++14 -MD -MT lib/MC/CMakeFiles/LLVMMC.dir/XCOFFObjectWriter.cpp.o -MF lib/MC/CMakeFiles/LLVMMC.dir/XCOFFObjectWriter.cpp.o.d -o lib/MC/CMakeFiles/LLVMMC.dir/XCOFFObjectWriter.cpp.o -c /Users/buildslave/jenkins/workspace/lldb-cmake/llvm-project/llvm/lib/MC/XCOFFObjectWriter.cpp
[308/3090] /Users/buildslave/jenkins/workspace/lldb-cmake/host-compiler/bin/clang++  -DGTEST_HAS_RTTI=0 -D_DEBUG -D__STDC_CONSTANT_MACROS -D__STDC_FORMAT_MACROS -D__STDC_LIMIT_MACROS -Ilib/MC/MCParser -I/Users/buildslave/jenkins/workspace/lldb-cmake/llvm-project/llvm/lib/MC/MCParser -Iinclude -I/Users/buildslave/jenkins/workspace/lldb-cmake/llvm-project/llvm/include -Wdocumentation -fPIC -fvisibility-inlines-hidden -Werror=date-time -Werror=unguarded-availability-new -fmodules -fmodules-cache-path=/Users/buildslave/jenkins/workspace/lldb-cmake/lldb-build/module.cache -fcxx-modules -Xclang -fmodules-local-submodule-visibility -Wall -Wextra -Wno-unused-parameter -Wwrite-strings -Wcast-qual -Wmissing-field-initializers -pedantic -Wno-long-long -Wimplicit-fallthrough -Wcovered-switch-default -Wno-noexcept-type -Wnon-virtual-dtor -Wdelete-non-virtual-dtor -Wsuggest-override -Wstring-conversion -fdiagnostics-color -O3  -isysroot /Applications/Xcode.app/Contents/Developer/Platforms/MacOSX.platform/Developer/SDKs/MacOSX10.15.sdk    -fno-exceptions -fno-rtti -UNDEBUG -std=c++14 -MD -MT lib/MC/MCParser/CMakeFiles/LLVMMCParser.dir/DarwinAsmParser.cpp.o -MF lib/MC/MCParser/CMakeFiles/LLVMMCParser.dir/DarwinAsmParser.cpp.o.d -o lib/MC/MCParser/CMakeFiles/LLVMMCParser.dir/DarwinAsmParser.cpp.o -c /Users/buildslave/jenkins/workspace/lldb-cmake/llvm-project/llvm/lib/MC/MCParser/DarwinAsmParser.cpp
[309/3090] /Users/buildslave/jenkins/workspace/lldb-cmake/host-compiler/bin/clang++  -DGTEST_HAS_RTTI=0 -D_DEBUG -D__STDC_CONSTANT_MACROS -D__STDC_FORMAT_MACROS -D__STDC_LIMIT_MACROS -Ilib/MC -I/Users/buildslave/jenkins/workspace/lldb-cmake/llvm-project/llvm/lib/MC -Iinclude -I/Users/buildslave/jenkins/workspace/lldb-cmake/llvm-project/llvm/include -Wdocumentation -fPIC -fvisibility-inlines-hidden -Werror=date-time -Werror=unguarded-availability-new -fmodules -fmodules-cache-path=/Users/buildslave/jenkins/workspace/lldb-cmake/lldb-build/module.cache -fcxx-modules -Xclang -fmodules-local-submodule-visibility -Wall -Wextra -Wno-unused-parameter -Wwrite-strings -Wcast-qual -Wmissing-field-initializers -pedantic -Wno-long-long -Wimplicit-fallthrough -Wcovered-switch-default -Wno-noexcept-type -Wnon-virtual-dtor -Wdelete-non-virtual-dtor -Wsuggest-override -Wstring-conversion -fdiagnostics-color -O3  -isysroot /Applications/Xcode.app/Contents/Developer/Platforms/MacOSX.platform/Developer/SDKs/MacOSX10.15.sdk    -fno-exceptions -fno-rtti -UNDEBUG -std=c++14 -MD -MT lib/MC/CMakeFiles/LLVMMC.dir/WinCOFFObjectWriter.cpp.o -MF lib/MC/CMakeFiles/LLVMMC.dir/WinCOFFObjectWriter.cpp.o.d -o lib/MC/CMakeFiles/LLVMMC.dir/WinCOFFObjectWriter.cpp.o -c /Users/buildslave/jenkins/workspace/lldb-cmake/llvm-project/llvm/lib/MC/WinCOFFObjectWriter.cpp
[310/3090] /Users/buildslave/jenkins/workspace/lldb-cmake/host-compiler/bin/clang++  -DGTEST_HAS_RTTI=0 -D_DEBUG -D__STDC_CONSTANT_MACROS -D__STDC_FORMAT_MACROS -D__STDC_LIMIT_MACROS -Ilib/MC/MCDisassembler -I/Users/buildslave/jenkins/workspace/lldb-cmake/llvm-project/llvm/lib/MC/MCDisassembler -Iinclude -I/Users/buildslave/jenkins/workspace/lldb-cmake/llvm-project/llvm/include -Wdocumentation -fPIC -fvisibility-inlines-hidden -Werror=date-time -Werror=unguarded-availability-new -fmodules -fmodules-cache-path=/Users/buildslave/jenkins/workspace/lldb-cmake/lldb-build/module.cache -fcxx-modules -Xclang -fmodules-local-submodule-visibility -Wall -Wextra -Wno-unused-parameter -Wwrite-strings -Wcast-qual -Wmissing-field-initializers -pedantic -Wno-long-long -Wimplicit-fallthrough -Wcovered-switch-default -Wno-noexcept-type -Wnon-virtual-dtor -Wdelete-non-virtual-dtor -Wsuggest-override -Wstring-conversion -fdiagnostics-color -O3  -isysroot /Applications/Xcode.app/Contents/Developer/Platforms/MacOSX.platform/Developer/SDKs/MacOSX10.15.sdk    -fno-exceptions -fno-rtti -UNDEBUG -std=c++14 -MD -MT lib/MC/MCDisassembler/CMakeFiles/LLVMMCDisassembler.dir/MCRelocationInfo.cpp.o -MF lib/MC/MCDisassembler/CMakeFiles/LLVMMCDisassembler.dir/MCRelocationInfo.cpp.o.d -o lib/MC/MCDisassembler/CMakeFiles/LLVMMCDisassembler.dir/MCRelocationInfo.cpp.o -c /Users/buildslave/jenkins/workspace/lldb-cmake/llvm-project/llvm/lib/MC/MCDisassembler/MCRelocationInfo.cpp
[311/3090] /Users/buildslave/jenkins/workspace/lldb-cmake/host-compiler/bin/clang++  -DGTEST_HAS_RTTI=0 -D_DEBUG -D__STDC_CONSTANT_MACROS -D__STDC_FORMAT_MACROS -D__STDC_LIMIT_MACROS -Ilib/MC/MCDisassembler -I/Users/buildslave/jenkins/workspace/lldb-cmake/llvm-project/llvm/lib/MC/MCDisassembler -Iinclude -I/Users/buildslave/jenkins/workspace/lldb-cmake/llvm-project/llvm/include -Wdocumentation -fPIC -fvisibility-inlines-hidden -Werror=date-time -Werror=unguarded-availability-new -fmodules -fmodules-cache-path=/Users/buildslave/jenkins/workspace/lldb-cmake/lldb-build/module.cache -fcxx-modules -Xclang -fmodules-local-submodule-visibility -Wall -Wextra -Wno-unused-parameter -Wwrite-strings -Wcast-qual -Wmissing-field-initializers -pedantic -Wno-long-long -Wimplicit-fallthrough -Wcovered-switch-default -Wno-noexcept-type -Wnon-virtual-dtor -Wdelete-non-virtual-dtor -Wsuggest-override -Wstring-conversion -fdiagnostics-color -O3  -isysroot /Applications/Xcode.app/Contents/Developer/Platforms/MacOSX.platform/Developer/SDKs/MacOSX10.15.sdk    -fno-exceptions -fno-rtti -UNDEBUG -std=c++14 -MD -MT lib/MC/MCDisassembler/CMakeFiles/LLVMMCDisassembler.dir/MCDisassembler.cpp.o -MF lib/MC/MCDisassembler/CMakeFiles/LLVMMCDisassembler.dir/MCDisassembler.cpp.o.d -o lib/MC/MCDisassembler/CMakeFiles/LLVMMCDisassembler.dir/MCDisassembler.cpp.o -c /Users/buildslave/jenkins/workspace/lldb-cmake/llvm-project/llvm/lib/MC/MCDisassembler/MCDisassembler.cpp
[312/3090] /Users/buildslave/jenkins/workspace/lldb-cmake/host-compiler/bin/clang++  -DGTEST_HAS_RTTI=0 -D_DEBUG -D__STDC_CONSTANT_MACROS -D__STDC_FORMAT_MACROS -D__STDC_LIMIT_MACROS -Ilib/MC/MCDisassembler -I/Users/buildslave/jenkins/workspace/lldb-cmake/llvm-project/llvm/lib/MC/MCDisassembler -Iinclude -I/Users/buildslave/jenkins/workspace/lldb-cmake/llvm-project/llvm/include -Wdocumentation -fPIC -fvisibility-inlines-hidden -Werror=date-time -Werror=unguarded-availability-new -fmodules -fmodules-cache-path=/Users/buildslave/jenkins/workspace/lldb-cmake/lldb-build/module.cache -fcxx-modules -Xclang -fmodules-local-submodule-visibility -Wall -Wextra -Wno-unused-parameter -Wwrite-strings -Wcast-qual -Wmissing-field-initializers -pedantic -Wno-long-long -Wimplicit-fallthrough -Wcovered-switch-default -Wno-noexcept-type -Wnon-virtual-dtor -Wdelete-non-virtual-dtor -Wsuggest-override -Wstring-conversion -fdiagnostics-color -O3  -isysroot /Applications/Xcode.app/Contents/Developer/Platforms/MacOSX.platform/Developer/SDKs/MacOSX10.15.sdk    -fno-exceptions -fno-rtti -UNDEBUG -std=c++14 -MD -MT lib/MC/MCDisassembler/CMakeFiles/LLVMMCDisassembler.dir/MCSymbolizer.cpp.o -MF lib/MC/MCDisassembler/CMakeFiles/LLVMMCDisassembler.dir/MCSymbolizer.cpp.o.d -o lib/MC/MCDisassembler/CMakeFiles/LLVMMCDisassembler.dir/MCSymbolizer.cpp.o -c /Users/buildslave/jenkins/workspace/lldb-cmake/llvm-project/llvm/lib/MC/MCDisassembler/MCSymbolizer.cpp
[313/3090] /Users/buildslave/jenkins/workspace/lldb-cmake/host-compiler/bin/clang++  -DGTEST_HAS_RTTI=0 -D_DEBUG -D__STDC_CONSTANT_MACROS -D__STDC_FORMAT_MACROS -D__STDC_LIMIT_MACROS -Ilib/MC/MCParser -I/Users/buildslave/jenkins/workspace/lldb-cmake/llvm-project/llvm/lib/MC/MCParser -Iinclude -I/Users/buildslave/jenkins/workspace/lldb-cmake/llvm-project/llvm/include -Wdocumentation -fPIC -fvisibility-inlines-hidden -Werror=date-time -Werror=unguarded-availability-new -fmodules -fmodules-cache-path=/Users/buildslave/jenkins/workspace/lldb-cmake/lldb-build/module.cache -fcxx-modules -Xclang -fmodules-local-submodule-visibility -Wall -Wextra -Wno-unused-parameter -Wwrite-strings -Wcast-qual -Wmissing-field-initializers -pedantic -Wno-long-long -Wimplicit-fallthrough -Wcovered-switch-default -Wno-noexcept-type -Wnon-virtual-dtor -Wdelete-non-virtual-dtor -Wsuggest-override -Wstring-conversion -fdiagnostics-color -O3  -isysroot /Applications/Xcode.app/Contents/Developer/Platforms/MacOSX.platform/Developer/SDKs/MacOSX10.15.sdk    -fno-exceptions -fno-rtti -UNDEBUG -std=c++14 -MD -MT lib/MC/MCParser/CMakeFiles/LLVMMCParser.dir/ELFAsmParser.cpp.o -MF lib/MC/MCParser/CMakeFiles/LLVMMCParser.dir/ELFAsmParser.cpp.o.d -o lib/MC/MCParser/CMakeFiles/LLVMMCParser.dir/ELFAsmParser.cpp.o -c /Users/buildslave/jenkins/workspace/lldb-cmake/llvm-project/llvm/lib/MC/MCParser/ELFAsmParser.cpp
[314/3090] /Users/buildslave/jenkins/workspace/lldb-cmake/host-compiler/bin/clang++  -DGTEST_HAS_RTTI=0 -D_DEBUG -D__STDC_CONSTANT_MACROS -D__STDC_FORMAT_MACROS -D__STDC_LIMIT_MACROS -Ilib/MC/MCParser -I/Users/buildslave/jenkins/workspace/lldb-cmake/llvm-project/llvm/lib/MC/MCParser -Iinclude -I/Users/buildslave/jenkins/workspace/lldb-cmake/llvm-project/llvm/include -Wdocumentation -fPIC -fvisibility-inlines-hidden -Werror=date-time -Werror=unguarded-availability-new -fmodules -fmodules-cache-path=/Users/buildslave/jenkins/workspace/lldb-cmake/lldb-build/module.cache -fcxx-modules -Xclang -fmodules-local-submodule-visibility -Wall -Wextra -Wno-unused-parameter -Wwrite-strings -Wcast-qual -Wmissing-field-initializers -pedantic -Wno-long-long -Wimplicit-fallthrough -Wcovered-switch-default -Wno-noexcept-type -Wnon-virtual-dtor -Wdelete-non-virtual-dtor -Wsuggest-override -Wstring-conversion -fdiagnostics-color -O3  -isysroot /Applications/Xcode.app/Contents/Developer/Platforms/MacOSX.platform/Developer/SDKs/MacOSX10.15.sdk    -fno-exceptions -fno-rtti -UNDEBUG -std=c++14 -MD -MT lib/MC/MCParser/CMakeFiles/LLVMMCParser.dir/WasmAsmParser.cpp.o -MF lib/MC/MCParser/CMakeFiles/LLVMMCParser.dir/WasmAsmParser.cpp.o.d -o lib/MC/MCParser/CMakeFiles/LLVMMCParser.dir/WasmAsmParser.cpp.o -c /Users/buildslave/jenkins/workspace/lldb-cmake/llvm-project/llvm/lib/MC/MCParser/WasmAsmParser.cpp
[315/3090] /Users/buildslave/jenkins/workspace/lldb-cmake/host-compiler/bin/clang++  -DGTEST_HAS_RTTI=0 -D_DEBUG -D__STDC_CONSTANT_MACROS -D__STDC_FORMAT_MACROS -D__STDC_LIMIT_MACROS -Ilib/MC/MCDisassembler -I/Users/buildslave/jenkins/workspace/lldb-cmake/llvm-project/llvm/lib/MC/MCDisassembler -Iinclude -I/Users/buildslave/jenkins/workspace/lldb-cmake/llvm-project/llvm/include -Wdocumentation -fPIC -fvisibility-inlines-hidden -Werror=date-time -Werror=unguarded-availability-new -fmodules -fmodules-cache-path=/Users/buildslave/jenkins/workspace/lldb-cmake/lldb-build/module.cache -fcxx-modules -Xclang -fmodules-local-submodule-visibility -Wall -Wextra -Wno-unused-parameter -Wwrite-strings -Wcast-qual -Wmissing-field-initializers -pedantic -Wno-long-long -Wimplicit-fallthrough -Wcovered-switch-default -Wno-noexcept-type -Wnon-virtual-dtor -Wdelete-non-virtual-dtor -Wsuggest-override -Wstring-conversion -fdiagnostics-color -O3  -isysroot /Applications/Xcode.app/Contents/Developer/Platforms/MacOSX.platform/Developer/SDKs/MacOSX10.15.sdk    -fno-exceptions -fno-rtti -UNDEBUG -std=c++14 -MD -MT lib/MC/MCDisassembler/CMakeFiles/LLVMMCDisassembler.dir/MCExternalSymbolizer.cpp.o -MF lib/MC/MCDisassembler/CMakeFiles/LLVMMCDisassembler.dir/MCExternalSymbolizer.cpp.o.d -o lib/MC/MCDisassembler/CMakeFiles/LLVMMCDisassembler.dir/MCExternalSymbolizer.cpp.o -c /Users/buildslave/jenkins/workspace/lldb-cmake/llvm-project/llvm/lib/MC/MCDisassembler/MCExternalSymbolizer.cpp
[316/3090] /Users/buildslave/jenkins/workspace/lldb-cmake/host-compiler/bin/clang++  -DGTEST_HAS_RTTI=0 -D_DEBUG -D__STDC_CONSTANT_MACROS -D__STDC_FORMAT_MACROS -D__STDC_LIMIT_MACROS -Ilib/MCA -I/Users/buildslave/jenkins/workspace/lldb-cmake/llvm-project/llvm/lib/MCA -Iinclude -I/Users/buildslave/jenkins/workspace/lldb-cmake/llvm-project/llvm/include -Wdocumentation -fPIC -fvisibility-inlines-hidden -Werror=date-time -Werror=unguarded-availability-new -fmodules -fmodules-cache-path=/Users/buildslave/jenkins/workspace/lldb-cmake/lldb-build/module.cache -fcxx-modules -Xclang -fmodules-local-submodule-visibility -Wall -Wextra -Wno-unused-parameter -Wwrite-strings -Wcast-qual -Wmissing-field-initializers -pedantic -Wno-long-long -Wimplicit-fallthrough -Wcovered-switch-default -Wno-noexcept-type -Wnon-virtual-dtor -Wdelete-non-virtual-dtor -Wsuggest-override -Wstring-conversion -fdiagnostics-color -O3  -isysroot /Applications/Xcode.app/Contents/Developer/Platforms/MacOSX.platform/Developer/SDKs/MacOSX10.15.sdk    -fno-exceptions -fno-rtti -UNDEBUG -std=c++14 -MD -MT lib/MCA/CMakeFiles/LLVMMCA.dir/CodeEmitter.cpp.o -MF lib/MCA/CMakeFiles/LLVMMCA.dir/CodeEmitter.cpp.o.d -o lib/MCA/CMakeFiles/LLVMMCA.dir/CodeEmitter.cpp.o -c /Users/buildslave/jenkins/workspace/lldb-cmake/llvm-project/llvm/lib/MCA/CodeEmitter.cpp
[317/3090] /Users/buildslave/jenkins/workspace/lldb-cmake/host-compiler/bin/clang++  -DGTEST_HAS_RTTI=0 -D_DEBUG -D__STDC_CONSTANT_MACROS -D__STDC_FORMAT_MACROS -D__STDC_LIMIT_MACROS -Ilib/MCA -I/Users/buildslave/jenkins/workspace/lldb-cmake/llvm-project/llvm/lib/MCA -Iinclude -I/Users/buildslave/jenkins/workspace/lldb-cmake/llvm-project/llvm/include -Wdocumentation -fPIC -fvisibility-inlines-hidden -Werror=date-time -Werror=unguarded-availability-new -fmodules -fmodules-cache-path=/Users/buildslave/jenkins/workspace/lldb-cmake/lldb-build/module.cache -fcxx-modules -Xclang -fmodules-local-submodule-visibility -Wall -Wextra -Wno-unused-parameter -Wwrite-strings -Wcast-qual -Wmissing-field-initializers -pedantic -Wno-long-long -Wimplicit-fallthrough -Wcovered-switch-default -Wno-noexcept-type -Wnon-virtual-dtor -Wdelete-non-virtual-dtor -Wsuggest-override -Wstring-conversion -fdiagnostics-color -O3  -isysroot /Applications/Xcode.app/Contents/Developer/Platforms/MacOSX.platform/Developer/SDKs/MacOSX10.15.sdk    -fno-exceptions -fno-rtti -UNDEBUG -std=c++14 -MD -MT lib/MCA/CMakeFiles/LLVMMCA.dir/Instruction.cpp.o -MF lib/MCA/CMakeFiles/LLVMMCA.dir/Instruction.cpp.o.d -o lib/MCA/CMakeFiles/LLVMMCA.dir/Instruction.cpp.o -c /Users/buildslave/jenkins/workspace/lldb-cmake/llvm-project/llvm/lib/MCA/Instruction.cpp
[318/3090] /Users/buildslave/jenkins/workspace/lldb-cmake/host-compiler/bin/clang++  -DGTEST_HAS_RTTI=0 -D_DEBUG -D__STDC_CONSTANT_MACROS -D__STDC_FORMAT_MACROS -D__STDC_LIMIT_MACROS -Ilib/MC/MCDisassembler -I/Users/buildslave/jenkins/workspace/lldb-cmake/llvm-project/llvm/lib/MC/MCDisassembler -Iinclude -I/Users/buildslave/jenkins/workspace/lldb-cmake/llvm-project/llvm/include -Wdocumentation -fPIC -fvisibility-inlines-hidden -Werror=date-time -Werror=unguarded-availability-new -fmodules -fmodules-cache-path=/Users/buildslave/jenkins/workspace/lldb-cmake/lldb-build/module.cache -fcxx-modules -Xclang -fmodules-local-submodule-visibility -Wall -Wextra -Wno-unused-parameter -Wwrite-strings -Wcast-qual -Wmissing-field-initializers -pedantic -Wno-long-long -Wimplicit-fallthrough -Wcovered-switch-default -Wno-noexcept-type -Wnon-virtual-dtor -Wdelete-non-virtual-dtor -Wsuggest-override -Wstring-conversion -fdiagnostics-color -O3  -isysroot /Applications/Xcode.app/Contents/Developer/Platforms/MacOSX.platform/Developer/SDKs/MacOSX10.15.sdk    -fno-exceptions -fno-rtti -UNDEBUG -std=c++14 -MD -MT lib/MC/MCDisassembler/CMakeFiles/LLVMMCDisassembler.dir/Disassembler.cpp.o -MF lib/MC/MCDisassembler/CMakeFiles/LLVMMCDisassembler.dir/Disassembler.cpp.o.d -o lib/MC/MCDisassembler/CMakeFiles/LLVMMCDisassembler.dir/Disassembler.cpp.o -c /Users/buildslave/jenkins/workspace/lldb-cmake/llvm-project/llvm/lib/MC/MCDisassembler/Disassembler.cpp
[319/3090] /Users/buildslave/jenkins/workspace/lldb-cmake/host-compiler/bin/clang++  -DGTEST_HAS_RTTI=0 -D_DEBUG -D__STDC_CONSTANT_MACROS -D__STDC_FORMAT_MACROS -D__STDC_LIMIT_MACROS -Ilib/MCA -I/Users/buildslave/jenkins/workspace/lldb-cmake/llvm-project/llvm/lib/MCA -Iinclude -I/Users/buildslave/jenkins/workspace/lldb-cmake/llvm-project/llvm/include -Wdocumentation -fPIC -fvisibility-inlines-hidden -Werror=date-time -Werror=unguarded-availability-new -fmodules -fmodules-cache-path=/Users/buildslave/jenkins/workspace/lldb-cmake/lldb-build/module.cache -fcxx-modules -Xclang -fmodules-local-submodule-visibility -Wall -Wextra -Wno-unused-parameter -Wwrite-strings -Wcast-qual -Wmissing-field-initializers -pedantic -Wno-long-long -Wimplicit-fallthrough -Wcovered-switch-default -Wno-noexcept-type -Wnon-virtual-dtor -Wdelete-non-virtual-dtor -Wsuggest-override -Wstring-conversion -fdiagnostics-color -O3  -isysroot /Applications/Xcode.app/Contents/Developer/Platforms/MacOSX.platform/Developer/SDKs/MacOSX10.15.sdk    -fno-exceptions -fno-rtti -UNDEBUG -std=c++14 -MD -MT lib/MCA/CMakeFiles/LLVMMCA.dir/Pipeline.cpp.o -MF lib/MCA/CMakeFiles/LLVMMCA.dir/Pipeline.cpp.o.d -o lib/MCA/CMakeFiles/LLVMMCA.dir/Pipeline.cpp.o -c /Users/buildslave/jenkins/workspace/lldb-cmake/llvm-project/llvm/lib/MCA/Pipeline.cpp
[320/3090] /Users/buildslave/jenkins/workspace/lldb-cmake/host-compiler/bin/clang++  -DGTEST_HAS_RTTI=0 -D_DEBUG -D__STDC_CONSTANT_MACROS -D__STDC_FORMAT_MACROS -D__STDC_LIMIT_MACROS -Ilib/MCA -I/Users/buildslave/jenkins/workspace/lldb-cmake/llvm-project/llvm/lib/MCA -Iinclude -I/Users/buildslave/jenkins/workspace/lldb-cmake/llvm-project/llvm/include -Wdocumentation -fPIC -fvisibility-inlines-hidden -Werror=date-time -Werror=unguarded-availability-new -fmodules -fmodules-cache-path=/Users/buildslave/jenkins/workspace/lldb-cmake/lldb-build/module.cache -fcxx-modules -Xclang -fmodules-local-submodule-visibility -Wall -Wextra -Wno-unused-parameter -Wwrite-strings -Wcast-qual -Wmissing-field-initializers -pedantic -Wno-long-long -Wimplicit-fallthrough -Wcovered-switch-default -Wno-noexcept-type -Wnon-virtual-dtor -Wdelete-non-virtual-dtor -Wsuggest-override -Wstring-conversion -fdiagnostics-color -O3  -isysroot /Applications/Xcode.app/Contents/Developer/Platforms/MacOSX.platform/Developer/SDKs/MacOSX10.15.sdk    -fno-exceptions -fno-rtti -UNDEBUG -std=c++14 -MD -MT lib/MCA/CMakeFiles/LLVMMCA.dir/Stages/DispatchStage.cpp.o -MF lib/MCA/CMakeFiles/LLVMMCA.dir/Stages/DispatchStage.cpp.o.d -o lib/MCA/CMakeFiles/LLVMMCA.dir/Stages/DispatchStage.cpp.o -c /Users/buildslave/jenkins/workspace/lldb-cmake/llvm-project/llvm/lib/MCA/Stages/DispatchStage.cpp
[321/3090] /Users/buildslave/jenkins/workspace/lldb-cmake/host-compiler/bin/clang++  -DGTEST_HAS_RTTI=0 -D_DEBUG -D__STDC_CONSTANT_MACROS -D__STDC_FORMAT_MACROS -D__STDC_LIMIT_MACROS -Ilib/MCA -I/Users/buildslave/jenkins/workspace/lldb-cmake/llvm-project/llvm/lib/MCA -Iinclude -I/Users/buildslave/jenkins/workspace/lldb-cmake/llvm-project/llvm/include -Wdocumentation -fPIC -fvisibility-inlines-hidden -Werror=date-time -Werror=unguarded-availability-new -fmodules -fmodules-cache-path=/Users/buildslave/jenkins/workspace/lldb-cmake/lldb-build/module.cache -fcxx-modules -Xclang -fmodules-local-submodule-visibility -Wall -Wextra -Wno-unused-parameter -Wwrite-strings -Wcast-qual -Wmissing-field-initializers -pedantic -Wno-long-long -Wimplicit-fallthrough -Wcovered-switch-default -Wno-noexcept-type -Wnon-virtual-dtor -Wdelete-non-virtual-dtor -Wsuggest-override -Wstring-conversion -fdiagnostics-color -O3  -isysroot /Applications/Xcode.app/Contents/Developer/Platforms/MacOSX.platform/Developer/SDKs/MacOSX10.15.sdk    -fno-exceptions -fno-rtti -UNDEBUG -std=c++14 -MD -MT lib/MCA/CMakeFiles/LLVMMCA.dir/Stages/EntryStage.cpp.o -MF lib/MCA/CMakeFiles/LLVMMCA.dir/Stages/EntryStage.cpp.o.d -o lib/MCA/CMakeFiles/LLVMMCA.dir/Stages/EntryStage.cpp.o -c /Users/buildslave/jenkins/workspace/lldb-cmake/llvm-project/llvm/lib/MCA/Stages/EntryStage.cpp
[322/3090] /Users/buildslave/jenkins/workspace/lldb-cmake/host-compiler/bin/clang++  -DGTEST_HAS_RTTI=0 -D_DEBUG -D__STDC_CONSTANT_MACROS -D__STDC_FORMAT_MACROS -D__STDC_LIMIT_MACROS -Ilib/MCA -I/Users/buildslave/jenkins/workspace/lldb-cmake/llvm-project/llvm/lib/MCA -Iinclude -I/Users/buildslave/jenkins/workspace/lldb-cmake/llvm-project/llvm/include -Wdocumentation -fPIC -fvisibility-inlines-hidden -Werror=date-time -Werror=unguarded-availability-new -fmodules -fmodules-cache-path=/Users/buildslave/jenkins/workspace/lldb-cmake/lldb-build/module.cache -fcxx-modules -Xclang -fmodules-local-submodule-visibility -Wall -Wextra -Wno-unused-parameter -Wwrite-strings -Wcast-qual -Wmissing-field-initializers -pedantic -Wno-long-long -Wimplicit-fallthrough -Wcovered-switch-default -Wno-noexcept-type -Wnon-virtual-dtor -Wdelete-non-virtual-dtor -Wsuggest-override -Wstring-conversion -fdiagnostics-color -O3  -isysroot /Applications/Xcode.app/Contents/Developer/Platforms/MacOSX.platform/Developer/SDKs/MacOSX10.15.sdk    -fno-exceptions -fno-rtti -UNDEBUG -std=c++14 -MD -MT lib/MCA/CMakeFiles/LLVMMCA.dir/Context.cpp.o -MF lib/MCA/CMakeFiles/LLVMMCA.dir/Context.cpp.o.d -o lib/MCA/CMakeFiles/LLVMMCA.dir/Context.cpp.o -c /Users/buildslave/jenkins/workspace/lldb-cmake/llvm-project/llvm/lib/MCA/Context.cpp
[323/3090] /Users/buildslave/jenkins/workspace/lldb-cmake/host-compiler/bin/clang++  -DGTEST_HAS_RTTI=0 -D_DEBUG -D__STDC_CONSTANT_MACROS -D__STDC_FORMAT_MACROS -D__STDC_LIMIT_MACROS -Ilib/MCA -I/Users/buildslave/jenkins/workspace/lldb-cmake/llvm-project/llvm/lib/MCA -Iinclude -I/Users/buildslave/jenkins/workspace/lldb-cmake/llvm-project/llvm/include -Wdocumentation -fPIC -fvisibility-inlines-hidden -Werror=date-time -Werror=unguarded-availability-new -fmodules -fmodules-cache-path=/Users/buildslave/jenkins/workspace/lldb-cmake/lldb-build/module.cache -fcxx-modules -Xclang -fmodules-local-submodule-visibility -Wall -Wextra -Wno-unused-parameter -Wwrite-strings -Wcast-qual -Wmissing-field-initializers -pedantic -Wno-long-long -Wimplicit-fallthrough -Wcovered-switch-default -Wno-noexcept-type -Wnon-virtual-dtor -Wdelete-non-virtual-dtor -Wsuggest-override -Wstring-conversion -fdiagnostics-color -O3  -isysroot /Applications/Xcode.app/Contents/Developer/Platforms/MacOSX.platform/Developer/SDKs/MacOSX10.15.sdk    -fno-exceptions -fno-rtti -UNDEBUG -std=c++14 -MD -MT lib/MCA/CMakeFiles/LLVMMCA.dir/Support.cpp.o -MF lib/MCA/CMakeFiles/LLVMMCA.dir/Support.cpp.o.d -o lib/MCA/CMakeFiles/LLVMMCA.dir/Support.cpp.o -c /Users/buildslave/jenkins/workspace/lldb-cmake/llvm-project/llvm/lib/MCA/Support.cpp
[324/3090] /Users/buildslave/jenkins/workspace/lldb-cmake/host-compiler/bin/clang++  -DGTEST_HAS_RTTI=0 -D_DEBUG -D__STDC_CONSTANT_MACROS -D__STDC_FORMAT_MACROS -D__STDC_LIMIT_MACROS -Ilib/MCA -I/Users/buildslave/jenkins/workspace/lldb-cmake/llvm-project/llvm/lib/MCA -Iinclude -I/Users/buildslave/jenkins/workspace/lldb-cmake/llvm-project/llvm/include -Wdocumentation -fPIC -fvisibility-inlines-hidden -Werror=date-time -Werror=unguarded-availability-new -fmodules -fmodules-cache-path=/Users/buildslave/jenkins/workspace/lldb-cmake/lldb-build/module.cache -fcxx-modules -Xclang -fmodules-local-submodule-visibility -Wall -Wextra -Wno-unused-parameter -Wwrite-strings -Wcast-qual -Wmissing-field-initializers -pedantic -Wno-long-long -Wimplicit-fallthrough -Wcovered-switch-default -Wno-noexcept-type -Wnon-virtual-dtor -Wdelete-non-virtual-dtor -Wsuggest-override -Wstring-conversion -fdiagnostics-color -O3  -isysroot /Applications/Xcode.app/Contents/Developer/Platforms/MacOSX.platform/Developer/SDKs/MacOSX10.15.sdk    -fno-exceptions -fno-rtti -UNDEBUG -std=c++14 -MD -MT lib/MCA/CMakeFiles/LLVMMCA.dir/Stages/InstructionTables.cpp.o -MF lib/MCA/CMakeFiles/LLVMMCA.dir/Stages/InstructionTables.cpp.o.d -o lib/MCA/CMakeFiles/LLVMMCA.dir/Stages/InstructionTables.cpp.o -c /Users/buildslave/jenkins/workspace/lldb-cmake/llvm-project/llvm/lib/MCA/Stages/InstructionTables.cpp
[325/3090] /Users/buildslave/jenkins/workspace/lldb-cmake/host-compiler/bin/clang++  -DGTEST_HAS_RTTI=0 -D_DEBUG -D__STDC_CONSTANT_MACROS -D__STDC_FORMAT_MACROS -D__STDC_LIMIT_MACROS -Ilib/MCA -I/Users/buildslave/jenkins/workspace/lldb-cmake/llvm-project/llvm/lib/MCA -Iinclude -I/Users/buildslave/jenkins/workspace/lldb-cmake/llvm-project/llvm/include -Wdocumentation -fPIC -fvisibility-inlines-hidden -Werror=date-time -Werror=unguarded-availability-new -fmodules -fmodules-cache-path=/Users/buildslave/jenkins/workspace/lldb-cmake/lldb-build/module.cache -fcxx-modules -Xclang -fmodules-local-submodule-visibility -Wall -Wextra -Wno-unused-parameter -Wwrite-strings -Wcast-qual -Wmissing-field-initializers -pedantic -Wno-long-long -Wimplicit-fallthrough -Wcovered-switch-default -Wno-noexcept-type -Wnon-virtual-dtor -Wdelete-non-virtual-dtor -Wsuggest-override -Wstring-conversion -fdiagnostics-color -O3  -isysroot /Applications/Xcode.app/Contents/Developer/Platforms/MacOSX.platform/Developer/SDKs/MacOSX10.15.sdk    -fno-exceptions -fno-rtti -UNDEBUG -std=c++14 -MD -MT lib/MCA/CMakeFiles/LLVMMCA.dir/Stages/MicroOpQueueStage.cpp.o -MF lib/MCA/CMakeFiles/LLVMMCA.dir/Stages/MicroOpQueueStage.cpp.o.d -o lib/MCA/CMakeFiles/LLVMMCA.dir/Stages/MicroOpQueueStage.cpp.o -c /Users/buildslave/jenkins/workspace/lldb-cmake/llvm-project/llvm/lib/MCA/Stages/MicroOpQueueStage.cpp
[326/3090] /Users/buildslave/jenkins/workspace/lldb-cmake/host-compiler/bin/clang++  -DGTEST_HAS_RTTI=0 -D_DEBUG -D__STDC_CONSTANT_MACROS -D__STDC_FORMAT_MACROS -D__STDC_LIMIT_MACROS -Ilib/MCA -I/Users/buildslave/jenkins/workspace/lldb-cmake/llvm-project/llvm/lib/MCA -Iinclude -I/Users/buildslave/jenkins/workspace/lldb-cmake/llvm-project/llvm/include -Wdocumentation -fPIC -fvisibility-inlines-hidden -Werror=date-time -Werror=unguarded-availability-new -fmodules -fmodules-cache-path=/Users/buildslave/jenkins/workspace/lldb-cmake/lldb-build/module.cache -fcxx-modules -Xclang -fmodules-local-submodule-visibility -Wall -Wextra -Wno-unused-parameter -Wwrite-strings -Wcast-qual -Wmissing-field-initializers -pedantic -Wno-long-long -Wimplicit-fallthrough -Wcovered-switch-default -Wno-noexcept-type -Wnon-virtual-dtor -Wdelete-non-virtual-dtor -Wsuggest-override -Wstring-conversion -fdiagnostics-color -O3  -isysroot /Applications/Xcode.app/Contents/Developer/Platforms/MacOSX.platform/Developer/SDKs/MacOSX10.15.sdk    -fno-exceptions -fno-rtti -UNDEBUG -std=c++14 -MD -MT lib/MCA/CMakeFiles/LLVMMCA.dir/Stages/ExecuteStage.cpp.o -MF lib/MCA/CMakeFiles/LLVMMCA.dir/Stages/ExecuteStage.cpp.o.d -o lib/MCA/CMakeFiles/LLVMMCA.dir/Stages/ExecuteStage.cpp.o -c /Users/buildslave/jenkins/workspace/lldb-cmake/llvm-project/llvm/lib/MCA/Stages/ExecuteStage.cpp
[327/3090] /Users/buildslave/jenkins/workspace/lldb-cmake/host-compiler/bin/clang++  -DGTEST_HAS_RTTI=0 -D_DEBUG -D__STDC_CONSTANT_MACROS -D__STDC_FORMAT_MACROS -D__STDC_LIMIT_MACROS -Ilib/MCA -I/Users/buildslave/jenkins/workspace/lldb-cmake/llvm-project/llvm/lib/MCA -Iinclude -I/Users/buildslave/jenkins/workspace/lldb-cmake/llvm-project/llvm/include -Wdocumentation -fPIC -fvisibility-inlines-hidden -Werror=date-time -Werror=unguarded-availability-new -fmodules -fmodules-cache-path=/Users/buildslave/jenkins/workspace/lldb-cmake/lldb-build/module.cache -fcxx-modules -Xclang -fmodules-local-submodule-visibility -Wall -Wextra -Wno-unused-parameter -Wwrite-strings -Wcast-qual -Wmissing-field-initializers -pedantic -Wno-long-long -Wimplicit-fallthrough -Wcovered-switch-default -Wno-noexcept-type -Wnon-virtual-dtor -Wdelete-non-virtual-dtor -Wsuggest-override -Wstring-conversion -fdiagnostics-color -O3  -isysroot /Applications/Xcode.app/Contents/Developer/Platforms/MacOSX.platform/Developer/SDKs/MacOSX10.15.sdk    -fno-exceptions -fno-rtti -UNDEBUG -std=c++14 -MD -MT lib/MCA/CMakeFiles/LLVMMCA.dir/Stages/RetireStage.cpp.o -MF lib/MCA/CMakeFiles/LLVMMCA.dir/Stages/RetireStage.cpp.o.d -o lib/MCA/CMakeFiles/LLVMMCA.dir/Stages/RetireStage.cpp.o -c /Users/buildslave/jenkins/workspace/lldb-cmake/llvm-project/llvm/lib/MCA/Stages/RetireStage.cpp
[328/3090] /Users/buildslave/jenkins/workspace/lldb-cmake/host-compiler/bin/clang++  -DGTEST_HAS_RTTI=0 -D_DEBUG -D__STDC_CONSTANT_MACROS -D__STDC_FORMAT_MACROS -D__STDC_LIMIT_MACROS -Ilib/MCA -I/Users/buildslave/jenkins/workspace/lldb-cmake/llvm-project/llvm/lib/MCA -Iinclude -I/Users/buildslave/jenkins/workspace/lldb-cmake/llvm-project/llvm/include -Wdocumentation -fPIC -fvisibility-inlines-hidden -Werror=date-time -Werror=unguarded-availability-new -fmodules -fmodules-cache-path=/Users/buildslave/jenkins/workspace/lldb-cmake/lldb-build/module.cache -fcxx-modules -Xclang -fmodules-local-submodule-visibility -Wall -Wextra -Wno-unused-parameter -Wwrite-strings -Wcast-qual -Wmissing-field-initializers -pedantic -Wno-long-long -Wimplicit-fallthrough -Wcovered-switch-default -Wno-noexcept-type -Wnon-virtual-dtor -Wdelete-non-virtual-dtor -Wsuggest-override -Wstring-conversion -fdiagnostics-color -O3  -isysroot /Applications/Xcode.app/Contents/Developer/Platforms/MacOSX.platform/Developer/SDKs/MacOSX10.15.sdk    -fno-exceptions -fno-rtti -UNDEBUG -std=c++14 -MD -MT lib/MCA/CMakeFiles/LLVMMCA.dir/Stages/Stage.cpp.o -MF lib/MCA/CMakeFiles/LLVMMCA.dir/Stages/Stage.cpp.o.d -o lib/MCA/CMakeFiles/LLVMMCA.dir/Stages/Stage.cpp.o -c /Users/buildslave/jenkins/workspace/lldb-cmake/llvm-project/llvm/lib/MCA/Stages/Stage.cpp
[329/3090] /Users/buildslave/jenkins/workspace/lldb-cmake/host-compiler/bin/clang++  -DGTEST_HAS_RTTI=0 -D_DEBUG -D__STDC_CONSTANT_MACROS -D__STDC_FORMAT_MACROS -D__STDC_LIMIT_MACROS -Ilib/MC -I/Users/buildslave/jenkins/workspace/lldb-cmake/llvm-project/llvm/lib/MC -Iinclude -I/Users/buildslave/jenkins/workspace/lldb-cmake/llvm-project/llvm/include -Wdocumentation -fPIC -fvisibility-inlines-hidden -Werror=date-time -Werror=unguarded-availability-new -fmodules -fmodules-cache-path=/Users/buildslave/jenkins/workspace/lldb-cmake/lldb-build/module.cache -fcxx-modules -Xclang -fmodules-local-submodule-visibility -Wall -Wextra -Wno-unused-parameter -Wwrite-strings -Wcast-qual -Wmissing-field-initializers -pedantic -Wno-long-long -Wimplicit-fallthrough -Wcovered-switch-default -Wno-noexcept-type -Wnon-virtual-dtor -Wdelete-non-virtual-dtor -Wsuggest-override -Wstring-conversion -fdiagnostics-color -O3  -isysroot /Applications/Xcode.app/Contents/Developer/Platforms/MacOSX.platform/Developer/SDKs/MacOSX10.15.sdk    -fno-exceptions -fno-rtti -UNDEBUG -std=c++14 -MD -MT lib/MC/CMakeFiles/LLVMMC.dir/WasmObjectWriter.cpp.o -MF lib/MC/CMakeFiles/LLVMMC.dir/WasmObjectWriter.cpp.o.d -o lib/MC/CMakeFiles/LLVMMC.dir/WasmObjectWriter.cpp.o -c /Users/buildslave/jenkins/workspace/lldb-cmake/llvm-project/llvm/lib/MC/WasmObjectWriter.cpp
[330/3090] : && "/Applications/Xcode.app/Contents/Developer/Toolchains/XcodeDefault.xctoolchain/usr/bin/libtool" -static -no_warning_for_no_symbols -o lib/libLLVMMC.a  lib/MC/CMakeFiles/LLVMMC.dir/ConstantPools.cpp.o lib/MC/CMakeFiles/LLVMMC.dir/ELFObjectWriter.cpp.o lib/MC/CMakeFiles/LLVMMC.dir/MCAsmBackend.cpp.o lib/MC/CMakeFiles/LLVMMC.dir/MCAsmInfo.cpp.o lib/MC/CMakeFiles/LLVMMC.dir/MCAsmInfoCOFF.cpp.o lib/MC/CMakeFiles/LLVMMC.dir/MCAsmInfoDarwin.cpp.o lib/MC/CMakeFiles/LLVMMC.dir/MCAsmInfoELF.cpp.o lib/MC/CMakeFiles/LLVMMC.dir/MCAsmInfoWasm.cpp.o lib/MC/CMakeFiles/LLVMMC.dir/MCAsmInfoXCOFF.cpp.o lib/MC/CMakeFiles/LLVMMC.dir/MCAsmMacro.cpp.o lib/MC/CMakeFiles/LLVMMC.dir/MCAsmStreamer.cpp.o lib/MC/CMakeFiles/LLVMMC.dir/MCAssembler.cpp.o lib/MC/CMakeFiles/LLVMMC.dir/MCCodeEmitter.cpp.o lib/MC/CMakeFiles/LLVMMC.dir/MCCodeView.cpp.o lib/MC/CMakeFiles/LLVMMC.dir/MCContext.cpp.o lib/MC/CMakeFiles/LLVMMC.dir/MCDwarf.cpp.o lib/MC/CMakeFiles/LLVMMC.dir/MCELFObjectTargetWriter.cpp.o lib/MC/CMakeFiles/LLVMMC.dir/MCELFStreamer.cpp.o lib/MC/CMakeFiles/LLVMMC.dir/MCExpr.cpp.o lib/MC/CMakeFiles/LLVMMC.dir/MCFragment.cpp.o lib/MC/CMakeFiles/LLVMMC.dir/MCInst.cpp.o lib/MC/CMakeFiles/LLVMMC.dir/MCInstPrinter.cpp.o lib/MC/CMakeFiles/LLVMMC.dir/MCInstrAnalysis.cpp.o lib/MC/CMakeFiles/LLVMMC.dir/MCInstrDesc.cpp.o lib/MC/CMakeFiles/LLVMMC.dir/MCInstrInfo.cpp.o lib/MC/CMakeFiles/LLVMMC.dir/MCLabel.cpp.o lib/MC/CMakeFiles/LLVMMC.dir/MCLinkerOptimizationHint.cpp.o lib/MC/CMakeFiles/LLVMMC.dir/MCMachOStreamer.cpp.o lib/MC/CMakeFiles/LLVMMC.dir/MCMachObjectTargetWriter.cpp.o lib/MC/CMakeFiles/LLVMMC.dir/MCNullStreamer.cpp.o lib/MC/CMakeFiles/LLVMMC.dir/MCObjectFileInfo.cpp.o lib/MC/CMakeFiles/LLVMMC.dir/MCObjectStreamer.cpp.o lib/MC/CMakeFiles/LLVMMC.dir/MCObjectWriter.cpp.o lib/MC/CMakeFiles/LLVMMC.dir/MCRegisterInfo.cpp.o lib/MC/CMakeFiles/LLVMMC.dir/MCSchedule.cpp.o lib/MC/CMakeFiles/LLVMMC.dir/MCSection.cpp.o lib/MC/CMakeFiles/LLVMMC.dir/MCSectionCOFF.cpp.o lib/MC/CMakeFiles/LLVMMC.dir/MCSectionELF.cpp.o lib/MC/CMakeFiles/LLVMMC.dir/MCSectionMachO.cpp.o lib/MC/CMakeFiles/LLVMMC.dir/MCSectionWasm.cpp.o lib/MC/CMakeFiles/LLVMMC.dir/MCSectionXCOFF.cpp.o lib/MC/CMakeFiles/LLVMMC.dir/MCStreamer.cpp.o lib/MC/CMakeFiles/LLVMMC.dir/MCSubtargetInfo.cpp.o lib/MC/CMakeFiles/LLVMMC.dir/MCSymbol.cpp.o lib/MC/CMakeFiles/LLVMMC.dir/MCSymbolELF.cpp.o lib/MC/CMakeFiles/LLVMMC.dir/MCSymbolXCOFF.cpp.o lib/MC/CMakeFiles/LLVMMC.dir/MCTargetOptions.cpp.o lib/MC/CMakeFiles/LLVMMC.dir/MCTargetOptionsCommandFlags.cpp.o lib/MC/CMakeFiles/LLVMMC.dir/MCValue.cpp.o lib/MC/CMakeFiles/LLVMMC.dir/MCWasmObjectTargetWriter.cpp.o lib/MC/CMakeFiles/LLVMMC.dir/MCWasmStreamer.cpp.o lib/MC/CMakeFiles/LLVMMC.dir/MCWin64EH.cpp.o lib/MC/CMakeFiles/LLVMMC.dir/MCWinCOFFStreamer.cpp.o lib/MC/CMakeFiles/LLVMMC.dir/MCWinEH.cpp.o lib/MC/CMakeFiles/LLVMMC.dir/MCXCOFFObjectTargetWriter.cpp.o lib/MC/CMakeFiles/LLVMMC.dir/MCXCOFFStreamer.cpp.o lib/MC/CMakeFiles/LLVMMC.dir/MachObjectWriter.cpp.o lib/MC/CMakeFiles/LLVMMC.dir/StringTableBuilder.cpp.o lib/MC/CMakeFiles/LLVMMC.dir/SubtargetFeature.cpp.o lib/MC/CMakeFiles/LLVMMC.dir/WasmObjectWriter.cpp.o lib/MC/CMakeFiles/LLVMMC.dir/WinCOFFObjectWriter.cpp.o lib/MC/CMakeFiles/LLVMMC.dir/XCOFFObjectWriter.cpp.o && :
[331/3090] : && "/Applications/Xcode.app/Contents/Developer/Toolchains/XcodeDefault.xctoolchain/usr/bin/libtool" -static -no_warning_for_no_symbols -o lib/libLLVMMCDisassembler.a  lib/MC/MCDisassembler/CMakeFiles/LLVMMCDisassembler.dir/Disassembler.cpp.o lib/MC/MCDisassembler/CMakeFiles/LLVMMCDisassembler.dir/MCDisassembler.cpp.o lib/MC/MCDisassembler/CMakeFiles/LLVMMCDisassembler.dir/MCExternalSymbolizer.cpp.o lib/MC/MCDisassembler/CMakeFiles/LLVMMCDisassembler.dir/MCRelocationInfo.cpp.o lib/MC/MCDisassembler/CMakeFiles/LLVMMCDisassembler.dir/MCSymbolizer.cpp.o && :
[332/3090] : && "/Applications/Xcode.app/Contents/Developer/Toolchains/XcodeDefault.xctoolchain/usr/bin/libtool" -static -no_warning_for_no_symbols -o lib/libLLVMMCA.a  lib/MCA/CMakeFiles/LLVMMCA.dir/CodeEmitter.cpp.o lib/MCA/CMakeFiles/LLVMMCA.dir/Context.cpp.o lib/MCA/CMakeFiles/LLVMMCA.dir/HWEventListener.cpp.o lib/MCA/CMakeFiles/LLVMMCA.dir/HardwareUnits/HardwareUnit.cpp.o lib/MCA/CMakeFiles/LLVMMCA.dir/HardwareUnits/LSUnit.cpp.o lib/MCA/CMakeFiles/LLVMMCA.dir/HardwareUnits/RegisterFile.cpp.o lib/MCA/CMakeFiles/LLVMMCA.dir/HardwareUnits/ResourceManager.cpp.o lib/MCA/CMakeFiles/LLVMMCA.dir/HardwareUnits/RetireControlUnit.cpp.o lib/MCA/CMakeFiles/LLVMMCA.dir/HardwareUnits/Scheduler.cpp.o lib/MCA/CMakeFiles/LLVMMCA.dir/InstrBuilder.cpp.o lib/MCA/CMakeFiles/LLVMMCA.dir/Instruction.cpp.o lib/MCA/CMakeFiles/LLVMMCA.dir/Pipeline.cpp.o lib/MCA/CMakeFiles/LLVMMCA.dir/Stages/DispatchStage.cpp.o lib/MCA/CMakeFiles/LLVMMCA.dir/Stages/EntryStage.cpp.o lib/MCA/CMakeFiles/LLVMMCA.dir/Stages/ExecuteStage.cpp.o lib/MCA/CMakeFiles/LLVMMCA.dir/Stages/InstructionTables.cpp.o lib/MCA/CMakeFiles/LLVMMCA.dir/Stages/MicroOpQueueStage.cpp.o lib/MCA/CMakeFiles/LLVMMCA.dir/Stages/RetireStage.cpp.o lib/MCA/CMakeFiles/LLVMMCA.dir/Stages/Stage.cpp.o lib/MCA/CMakeFiles/LLVMMCA.dir/Support.cpp.o && :
[333/3090] cd /Users/buildslave/jenkins/workspace/lldb-cmake/lldb-build && /Users/buildslave/jenkins/workspace/lldb-cmake/lldb-build/bin/llvm-tblgen -gen-asm-matcher -I /Users/buildslave/jenkins/workspace/lldb-cmake/llvm-project/llvm/lib/Target/Hexagon -I/Users/buildslave/jenkins/workspace/lldb-cmake/lldb-build/include -I/Users/buildslave/jenkins/workspace/lldb-cmake/llvm-project/llvm/include -I /Users/buildslave/jenkins/workspace/lldb-cmake/llvm-project/llvm/lib/Target /Users/buildslave/jenkins/workspace/lldb-cmake/llvm-project/llvm/lib/Target/Hexagon/Hexagon.td --write-if-changed -o lib/Target/Hexagon/HexagonGenAsmMatcher.inc -d lib/Target/Hexagon/HexagonGenAsmMatcher.inc.d
[334/3090] : && "/Applications/Xcode.app/Contents/Developer/Toolchains/XcodeDefault.xctoolchain/usr/bin/libtool" -static -no_warning_for_no_symbols -o lib/libLLVMAArch64Desc.a  lib/Target/AArch64/MCTargetDesc/CMakeFiles/LLVMAArch64Desc.dir/AArch64AsmBackend.cpp.o lib/Target/AArch64/MCTargetDesc/CMakeFiles/LLVMAArch64Desc.dir/AArch64ELFObjectWriter.cpp.o lib/Target/AArch64/MCTargetDesc/CMakeFiles/LLVMAArch64Desc.dir/AArch64ELFStreamer.cpp.o lib/Target/AArch64/MCTargetDesc/CMakeFiles/LLVMAArch64Desc.dir/AArch64InstPrinter.cpp.o lib/Target/AArch64/MCTargetDesc/CMakeFiles/LLVMAArch64Desc.dir/AArch64MCAsmInfo.cpp.o lib/Target/AArch64/MCTargetDesc/CMakeFiles/LLVMAArch64Desc.dir/AArch64MCCodeEmitter.cpp.o lib/Target/AArch64/MCTargetDesc/CMakeFiles/LLVMAArch64Desc.dir/AArch64MCExpr.cpp.o lib/Target/AArch64/MCTargetDesc/CMakeFiles/LLVMAArch64Desc.dir/AArch64MCTargetDesc.cpp.o lib/Target/AArch64/MCTargetDesc/CMakeFiles/LLVMAArch64Desc.dir/AArch64MachObjectWriter.cpp.o lib/Target/AArch64/MCTargetDesc/CMakeFiles/LLVMAArch64Desc.dir/AArch64TargetStreamer.cpp.o lib/Target/AArch64/MCTargetDesc/CMakeFiles/LLVMAArch64Desc.dir/AArch64WinCOFFObjectWriter.cpp.o lib/Target/AArch64/MCTargetDesc/CMakeFiles/LLVMAArch64Desc.dir/AArch64WinCOFFStreamer.cpp.o && :
[335/3090] : && /Users/buildslave/jenkins/workspace/lldb-cmake/host-compiler/bin/clang++ -Wdocumentation -fPIC -fvisibility-inlines-hidden -Werror=date-time -Werror=unguarded-availability-new -fmodules -fmodules-cache-path=/Users/buildslave/jenkins/workspace/lldb-cmake/lldb-build/module.cache -fcxx-modules -Xclang -fmodules-local-submodule-visibility -Wall -Wextra -Wno-unused-parameter -Wwrite-strings -Wcast-qual -Wmissing-field-initializers  -Wno-long-long -Wimplicit-fallthrough -Wcovered-switch-default -Wno-noexcept-type -Wnon-virtual-dtor -Wdelete-non-virtual-dtor -Wsuggest-override -Wstring-conversion -fdiagnostics-color -O3 -isysroot /Applications/Xcode.app/Contents/Developer/Platforms/MacOSX.platform/Developer/SDKs/MacOSX10.15.sdk -dynamiclib -Wl,-headerpad_max_install_names -compatibility_version 1.0.0 -current_version 1.0.0 -o lib/libc++.1.0.dylib -install_name @rpath/libc++.1.dylib projects/libcxx/src/CMakeFiles/cxx_shared.dir/algorithm.cpp.o projects/libcxx/src/CMakeFiles/cxx_shared.dir/any.cpp.o projects/libcxx/src/CMakeFiles/cxx_shared.dir/atomic.cpp.o projects/libcxx/src/CMakeFiles/cxx_shared.dir/barrier.cpp.o projects/libcxx/src/CMakeFiles/cxx_shared.dir/bind.cpp.o projects/libcxx/src/CMakeFiles/cxx_shared.dir/charconv.cpp.o projects/libcxx/src/CMakeFiles/cxx_shared.dir/chrono.cpp.o projects/libcxx/src/CMakeFiles/cxx_shared.dir/condition_variable.cpp.o projects/libcxx/src/CMakeFiles/cxx_shared.dir/condition_variable_destructor.cpp.o projects/libcxx/src/CMakeFiles/cxx_shared.dir/debug.cpp.o projects/libcxx/src/CMakeFiles/cxx_shared.dir/exception.cpp.o projects/libcxx/src/CMakeFiles/cxx_shared.dir/functional.cpp.o projects/libcxx/src/CMakeFiles/cxx_shared.dir/future.cpp.o projects/libcxx/src/CMakeFiles/cxx_shared.dir/hash.cpp.o projects/libcxx/src/CMakeFiles/cxx_shared.dir/ios.cpp.o projects/libcxx/src/CMakeFiles/cxx_shared.dir/iostream.cpp.o projects/libcxx/src/CMakeFiles/cxx_shared.dir/locale.cpp.o projects/libcxx/src/CMakeFiles/cxx_shared.dir/memory.cpp.o projects/libcxx/src/CMakeFiles/cxx_shared.dir/mutex.cpp.o projects/libcxx/src/CMakeFiles/cxx_shared.dir/mutex_destructor.cpp.o projects/libcxx/src/CMakeFiles/cxx_shared.dir/new.cpp.o projects/libcxx/src/CMakeFiles/cxx_shared.dir/optional.cpp.o projects/libcxx/src/CMakeFiles/cxx_shared.dir/random.cpp.o projects/libcxx/src/CMakeFiles/cxx_shared.dir/random_shuffle.cpp.o projects/libcxx/src/CMakeFiles/cxx_shared.dir/regex.cpp.o projects/libcxx/src/CMakeFiles/cxx_shared.dir/shared_mutex.cpp.o projects/libcxx/src/CMakeFiles/cxx_shared.dir/stdexcept.cpp.o projects/libcxx/src/CMakeFiles/cxx_shared.dir/string.cpp.o projects/libcxx/src/CMakeFiles/cxx_shared.dir/strstream.cpp.o projects/libcxx/src/CMakeFiles/cxx_shared.dir/system_error.cpp.o projects/libcxx/src/CMakeFiles/cxx_shared.dir/thread.cpp.o projects/libcxx/src/CMakeFiles/cxx_shared.dir/typeinfo.cpp.o projects/libcxx/src/CMakeFiles/cxx_shared.dir/utility.cpp.o projects/libcxx/src/CMakeFiles/cxx_shared.dir/valarray.cpp.o projects/libcxx/src/CMakeFiles/cxx_shared.dir/variant.cpp.o projects/libcxx/src/CMakeFiles/cxx_shared.dir/vector.cpp.o projects/libcxx/src/CMakeFiles/cxx_shared.dir/filesystem/operations.cpp.o projects/libcxx/src/CMakeFiles/cxx_shared.dir/filesystem/directory_iterator.cpp.o projects/libcxx/src/CMakeFiles/cxx_shared.dir/filesystem/int128_builtins.cpp.o  -Wl,-rpath,@loader_path/../lib  -nodefaultlibs  -lSystem  -lc  lib/libc++abi.1.0.dylib  -Wl,-unexported_symbols_list,/Users/buildslave/jenkins/workspace/lldb-cmake/llvm-project/libcxx/src/../lib/libc++unexp.exp  -Wl,-reexported_symbols_list,/Users/buildslave/jenkins/workspace/lldb-cmake/llvm-project/libcxx/src/../lib/libc++abi.v2.exp  -Wl,-force_symbols_not_weak_list,/Users/buildslave/jenkins/workspace/lldb-cmake/llvm-project/libcxx/src/../lib/notweak.exp  -Wl,-force_symbols_weak_list,/Users/buildslave/jenkins/workspace/lldb-cmake/llvm-project/libcxx/src/../lib/weak.exp  -Wl,-reexported_symbols_list,/Users/buildslave/jenkins/workspace/lldb-cmake/llvm-project/libcxxabi/src/../lib/new-delete.exp  -Wl,-reexported_symbols_list,/Users/buildslave/jenkins/workspace/lldb-cmake/llvm-project/libcxxabi/src/../lib/exceptions.exp  -Wl,-reexported_symbols_list,/Users/buildslave/jenkins/workspace/lldb-cmake/llvm-project/libcxxabi/src/../lib/personality-v0.exp && :
FAILED: lib/libc++.1.0.dylib 
: && /Users/buildslave/jenkins/workspace/lldb-cmake/host-compiler/bin/clang++ -Wdocumentation -fPIC -fvisibility-inlines-hidden -Werror=date-time -Werror=unguarded-availability-new -fmodules -fmodules-cache-path=/Users/buildslave/jenkins/workspace/lldb-cmake/lldb-build/module.cache -fcxx-modules -Xclang -fmodules-local-submodule-visibility -Wall -Wextra -Wno-unused-parameter -Wwrite-strings -Wcast-qual -Wmissing-field-initializers  -Wno-long-long -Wimplicit-fallthrough -Wcovered-switch-default -Wno-noexcept-type -Wnon-virtual-dtor -Wdelete-non-virtual-dtor -Wsuggest-override -Wstring-conversion -fdiagnostics-color -O3 -isysroot /Applications/Xcode.app/Contents/Developer/Platforms/MacOSX.platform/Developer/SDKs/MacOSX10.15.sdk -dynamiclib -Wl,-headerpad_max_install_names -compatibility_version 1.0.0 -current_version 1.0.0 -o lib/libc++.1.0.dylib -install_name @rpath/libc++.1.dylib projects/libcxx/src/CMakeFiles/cxx_shared.dir/algorithm.cpp.o projects/libcxx/src/CMakeFiles/cxx_shared.dir/any.cpp.o projects/libcxx/src/CMakeFiles/cxx_shared.dir/atomic.cpp.o projects/libcxx/src/CMakeFiles/cxx_shared.dir/barrier.cpp.o projects/libcxx/src/CMakeFiles/cxx_shared.dir/bind.cpp.o projects/libcxx/src/CMakeFiles/cxx_shared.dir/charconv.cpp.o projects/libcxx/src/CMakeFiles/cxx_shared.dir/chrono.cpp.o projects/libcxx/src/CMakeFiles/cxx_shared.dir/condition_variable.cpp.o projects/libcxx/src/CMakeFiles/cxx_shared.dir/condition_variable_destructor.cpp.o projects/libcxx/src/CMakeFiles/cxx_shared.dir/debug.cpp.o projects/libcxx/src/CMakeFiles/cxx_shared.dir/exception.cpp.o projects/libcxx/src/CMakeFiles/cxx_shared.dir/functional.cpp.o projects/libcxx/src/CMakeFiles/cxx_shared.dir/future.cpp.o projects/libcxx/src/CMakeFiles/cxx_shared.dir/hash.cpp.o projects/libcxx/src/CMakeFiles/cxx_shared.dir/ios.cpp.o projects/libcxx/src/CMakeFiles/cxx_shared.dir/iostream.cpp.o projects/libcxx/src/CMakeFiles/cxx_shared.dir/locale.cpp.o projects/libcxx/src/CMakeFiles/cxx_shared.dir/memory.cpp.o projects/libcxx/src/CMakeFiles/cxx_shared.dir/mutex.cpp.o projects/libcxx/src/CMakeFiles/cxx_shared.dir/mutex_destructor.cpp.o projects/libcxx/src/CMakeFiles/cxx_shared.dir/new.cpp.o projects/libcxx/src/CMakeFiles/cxx_shared.dir/optional.cpp.o projects/libcxx/src/CMakeFiles/cxx_shared.dir/random.cpp.o projects/libcxx/src/CMakeFiles/cxx_shared.dir/random_shuffle.cpp.o projects/libcxx/src/CMakeFiles/cxx_shared.dir/regex.cpp.o projects/libcxx/src/CMakeFiles/cxx_shared.dir/shared_mutex.cpp.o projects/libcxx/src/CMakeFiles/cxx_shared.dir/stdexcept.cpp.o projects/libcxx/src/CMakeFiles/cxx_shared.dir/string.cpp.o projects/libcxx/src/CMakeFiles/cxx_shared.dir/strstream.cpp.o projects/libcxx/src/CMakeFiles/cxx_shared.dir/system_error.cpp.o projects/libcxx/src/CMakeFiles/cxx_shared.dir/thread.cpp.o projects/libcxx/src/CMakeFiles/cxx_shared.dir/typeinfo.cpp.o projects/libcxx/src/CMakeFiles/cxx_shared.dir/utility.cpp.o projects/libcxx/src/CMakeFiles/cxx_shared.dir/valarray.cpp.o projects/libcxx/src/CMakeFiles/cxx_shared.dir/variant.cpp.o projects/libcxx/src/CMakeFiles/cxx_shared.dir/vector.cpp.o projects/libcxx/src/CMakeFiles/cxx_shared.dir/filesystem/operations.cpp.o projects/libcxx/src/CMakeFiles/cxx_shared.dir/filesystem/directory_iterator.cpp.o projects/libcxx/src/CMakeFiles/cxx_shared.dir/filesystem/int128_builtins.cpp.o  -Wl,-rpath,@loader_path/../lib  -nodefaultlibs  -lSystem  -lc  lib/libc++abi.1.0.dylib  -Wl,-unexported_symbols_list,/Users/buildslave/jenkins/workspace/lldb-cmake/llvm-project/libcxx/src/../lib/libc++unexp.exp  -Wl,-reexported_symbols_list,/Users/buildslave/jenkins/workspace/lldb-cmake/llvm-project/libcxx/src/../lib/libc++abi.v2.exp  -Wl,-force_symbols_not_weak_list,/Users/buildslave/jenkins/workspace/lldb-cmake/llvm-project/libcxx/src/../lib/notweak.exp  -Wl,-force_symbols_weak_list,/Users/buildslave/jenkins/workspace/lldb-cmake/llvm-project/libcxx/src/../lib/weak.exp  -Wl,-reexported_symbols_list,/Users/buildslave/jenkins/workspace/lldb-cmake/llvm-project/libcxxabi/src/../lib/new-delete.exp  -Wl,-reexported_symbols_list,/Users/buildslave/jenkins/workspace/lldb-cmake/llvm-project/libcxxabi/src/../lib/exceptions.exp  -Wl,-reexported_symbols_list,/Users/buildslave/jenkins/workspace/lldb-cmake/llvm-project/libcxxabi/src/../lib/personality-v0.exp && :
ld: requested re-export symbol operator new(unsigned long) is not from a dylib, but from projects/libcxx/src/CMakeFiles/cxx_shared.dir/new.cpp.o
 file 'projects/libcxx/src/CMakeFiles/cxx_shared.dir/new.cpp.o' for architecture x86_64
clang-12: error: linker command failed with exit code 1 (use -v to see invocation)
[336/3090] /Users/buildslave/jenkins/workspace/lldb-cmake/host-compiler/bin/clang++  -DGTEST_HAS_RTTI=0 -D_DEBUG -D__STDC_CONSTANT_MACROS -D__STDC_FORMAT_MACROS -D__STDC_LIMIT_MACROS -Itools/opt -I/Users/buildslave/jenkins/workspace/lldb-cmake/llvm-project/llvm/tools/opt -Iinclude -I/Users/buildslave/jenkins/workspace/lldb-cmake/llvm-project/llvm/include -Wdocumentation -fPIC -fvisibility-inlines-hidden -Werror=date-time -Werror=unguarded-availability-new -fmodules -fmodules-cache-path=/Users/buildslave/jenkins/workspace/lldb-cmake/lldb-build/module.cache -fcxx-modules -Xclang -fmodules-local-submodule-visibility -Wall -Wextra -Wno-unused-parameter -Wwrite-strings -Wcast-qual -Wmissing-field-initializers -pedantic -Wno-long-long -Wimplicit-fallthrough -Wcovered-switch-default -Wno-noexcept-type -Wnon-virtual-dtor -Wdelete-non-virtual-dtor -Wsuggest-override -Wstring-conversion -fdiagnostics-color -O3  -isysroot /Applications/Xcode.app/Contents/Developer/Platforms/MacOSX.platform/Developer/SDKs/MacOSX10.15.sdk    -fno-exceptions -fno-rtti -UNDEBUG -std=c++14 -MD -MT tools/opt/CMakeFiles/opt.dir/AnalysisWrappers.cpp.o -MF tools/opt/CMakeFiles/opt.dir/AnalysisWrappers.cpp.o.d -o tools/opt/CMakeFiles/opt.dir/AnalysisWrappers.cpp.o -c /Users/buildslave/jenkins/workspace/lldb-cmake/llvm-project/llvm/tools/opt/AnalysisWrappers.cpp
[337/3090] /Users/buildslave/jenkins/workspace/lldb-cmake/host-compiler/bin/clang++  -DGTEST_HAS_RTTI=0 -D_DEBUG -D__STDC_CONSTANT_MACROS -D__STDC_FORMAT_MACROS -D__STDC_LIMIT_MACROS -Itools/opt -I/Users/buildslave/jenkins/workspace/lldb-cmake/llvm-project/llvm/tools/opt -Iinclude -I/Users/buildslave/jenkins/workspace/lldb-cmake/llvm-project/llvm/include -Wdocumentation -fPIC -fvisibility-inlines-hidden -Werror=date-time -Werror=unguarded-availability-new -fmodules -fmodules-cache-path=/Users/buildslave/jenkins/workspace/lldb-cmake/lldb-build/module.cache -fcxx-modules -Xclang -fmodules-local-submodule-visibility -Wall -Wextra -Wno-unused-parameter -Wwrite-strings -Wcast-qual -Wmissing-field-initializers -pedantic -Wno-long-long -Wimplicit-fallthrough -Wcovered-switch-default -Wno-noexcept-type -Wnon-virtual-dtor -Wdelete-non-virtual-dtor -Wsuggest-override -Wstring-conversion -fdiagnostics-color -O3  -isysroot /Applications/Xcode.app/Contents/Developer/Platforms/MacOSX.platform/Developer/SDKs/MacOSX10.15.sdk    -fno-exceptions -fno-rtti -UNDEBUG -std=c++14 -MD -MT tools/opt/CMakeFiles/opt.dir/BreakpointPrinter.cpp.o -MF tools/opt/CMakeFiles/opt.dir/BreakpointPrinter.cpp.o.d -o tools/opt/CMakeFiles/opt.dir/BreakpointPrinter.cpp.o -c /Users/buildslave/jenkins/workspace/lldb-cmake/llvm-project/llvm/tools/opt/BreakpointPrinter.cpp
[338/3090] /Users/buildslave/jenkins/workspace/lldb-cmake/host-compiler/bin/clang++  -DGTEST_HAS_RTTI=0 -D_DEBUG -D__STDC_CONSTANT_MACROS -D__STDC_FORMAT_MACROS -D__STDC_LIMIT_MACROS -Ilib/Object -I/Users/buildslave/jenkins/workspace/lldb-cmake/llvm-project/llvm/lib/Object -Iinclude -I/Users/buildslave/jenkins/workspace/lldb-cmake/llvm-project/llvm/include -Wdocumentation -fPIC -fvisibility-inlines-hidden -Werror=date-time -Werror=unguarded-availability-new -fmodules -fmodules-cache-path=/Users/buildslave/jenkins/workspace/lldb-cmake/lldb-build/module.cache -fcxx-modules -Xclang -fmodules-local-submodule-visibility -Wall -Wextra -Wno-unused-parameter -Wwrite-strings -Wcast-qual -Wmissing-field-initializers -pedantic -Wno-long-long -Wimplicit-fallthrough -Wcovered-switch-default -Wno-noexcept-type -Wnon-virtual-dtor -Wdelete-non-virtual-dtor -Wsuggest-override -Wstring-conversion -fdiagnostics-color -O3  -isysroot /Applications/Xcode.app/Contents/Developer/Platforms/MacOSX.platform/Developer/SDKs/MacOSX10.15.sdk    -fno-exceptions -fno-rtti -UNDEBUG -std=c++14 -MD -MT lib/Object/CMakeFiles/LLVMObject.dir/IRObjectFile.cpp.o -MF lib/Object/CMakeFiles/LLVMObject.dir/IRObjectFile.cpp.o.d -o lib/Object/CMakeFiles/LLVMObject.dir/IRObjectFile.cpp.o -c /Users/buildslave/jenkins/workspace/lldb-cmake/llvm-project/llvm/lib/Object/IRObjectFile.cpp
[339/3090] /Users/buildslave/jenkins/workspace/lldb-cmake/host-compiler/bin/clang++  -DGTEST_HAS_RTTI=0 -D_DEBUG -D__STDC_CONSTANT_MACROS -D__STDC_FORMAT_MACROS -D__STDC_LIMIT_MACROS -Ilib/Object -I/Users/buildslave/jenkins/workspace/lldb-cmake/llvm-project/llvm/lib/Object -Iinclude -I/Users/buildslave/jenkins/workspace/lldb-cmake/llvm-project/llvm/include -Wdocumentation -fPIC -fvisibility-inlines-hidden -Werror=date-time -Werror=unguarded-availability-new -fmodules -fmodules-cache-path=/Users/buildslave/jenkins/workspace/lldb-cmake/lldb-build/module.cache -fcxx-modules -Xclang -fmodules-local-submodule-visibility -Wall -Wextra -Wno-unused-parameter -Wwrite-strings -Wcast-qual -Wmissing-field-initializers -pedantic -Wno-long-long -Wimplicit-fallthrough -Wcovered-switch-default -Wno-noexcept-type -Wnon-virtual-dtor -Wdelete-non-virtual-dtor -Wsuggest-override -Wstring-conversion -fdiagnostics-color -O3  -isysroot /Applications/Xcode.app/Contents/Developer/Platforms/MacOSX.platform/Developer/SDKs/MacOSX10.15.sdk    -fno-exceptions -fno-rtti -UNDEBUG -std=c++14 -MD -MT lib/Object/CMakeFiles/LLVMObject.dir/RecordStreamer.cpp.o -MF lib/Object/CMakeFiles/LLVMObject.dir/RecordStreamer.cpp.o.d -o lib/Object/CMakeFiles/LLVMObject.dir/RecordStreamer.cpp.o -c /Users/buildslave/jenkins/workspace/lldb-cmake/llvm-project/llvm/lib/Object/RecordStreamer.cpp
[340/3090] /Users/buildslave/jenkins/workspace/lldb-cmake/host-compiler/bin/clang++  -DGTEST_HAS_RTTI=0 -D_DEBUG -D__STDC_CONSTANT_MACROS -D__STDC_FORMAT_MACROS -D__STDC_LIMIT_MACROS -Ilib/Object -I/Users/buildslave/jenkins/workspace/lldb-cmake/llvm-project/llvm/lib/Object -Iinclude -I/Users/buildslave/jenkins/workspace/lldb-cmake/llvm-project/llvm/include -Wdocumentation -fPIC -fvisibility-inlines-hidden -Werror=date-time -Werror=unguarded-availability-new -fmodules -fmodules-cache-path=/Users/buildslave/jenkins/workspace/lldb-cmake/lldb-build/module.cache -fcxx-modules -Xclang -fmodules-local-submodule-visibility -Wall -Wextra -Wno-unused-parameter -Wwrite-strings -Wcast-qual -Wmissing-field-initializers -pedantic -Wno-long-long -Wimplicit-fallthrough -Wcovered-switch-default -Wno-noexcept-type -Wnon-virtual-dtor -Wdelete-non-virtual-dtor -Wsuggest-override -Wstring-conversion -fdiagnostics-color -O3  -isysroot /Applications/Xcode.app/Contents/Developer/Platforms/MacOSX.platform/Developer/SDKs/MacOSX10.15.sdk    -fno-exceptions -fno-rtti -UNDEBUG -std=c++14 -MD -MT lib/Object/CMakeFiles/LLVMObject.dir/ModuleSymbolTable.cpp.o -MF lib/Object/CMakeFiles/LLVMObject.dir/ModuleSymbolTable.cpp.o.d -o lib/Object/CMakeFiles/LLVMObject.dir/ModuleSymbolTable.cpp.o -c /Users/buildslave/jenkins/workspace/lldb-cmake/llvm-project/llvm/lib/Object/ModuleSymbolTable.cpp
[341/3090] /Users/buildslave/jenkins/workspace/lldb-cmake/host-compiler/bin/clang++  -DGTEST_HAS_RTTI=0 -D_DEBUG -D__STDC_CONSTANT_MACROS -D__STDC_FORMAT_MACROS -D__STDC_LIMIT_MACROS -Ilib/LTO -I/Users/buildslave/jenkins/workspace/lldb-cmake/llvm-project/llvm/lib/LTO -Iinclude -I/Users/buildslave/jenkins/workspace/lldb-cmake/llvm-project/llvm/include -Wdocumentation -fPIC -fvisibility-inlines-hidden -Werror=date-time -Werror=unguarded-availability-new -fmodules -fmodules-cache-path=/Users/buildslave/jenkins/workspace/lldb-cmake/lldb-build/module.cache -fcxx-modules -Xclang -fmodules-local-submodule-visibility -Wall -Wextra -Wno-unused-parameter -Wwrite-strings -Wcast-qual -Wmissing-field-initializers -pedantic -Wno-long-long -Wimplicit-fallthrough -Wcovered-switch-default -Wno-noexcept-type -Wnon-virtual-dtor -Wdelete-non-virtual-dtor -Wsuggest-override -Wstring-conversion -fdiagnostics-color -O3  -isysroot /Applications/Xcode.app/Contents/Developer/Platforms/MacOSX.platform/Developer/SDKs/MacOSX10.15.sdk    -fno-exceptions -fno-rtti -UNDEBUG -std=c++14 -MD -MT lib/LTO/CMakeFiles/LLVMLTO.dir/LTO.cpp.o -MF lib/LTO/CMakeFiles/LLVMLTO.dir/LTO.cpp.o.d -o lib/LTO/CMakeFiles/LLVMLTO.dir/LTO.cpp.o -c /Users/buildslave/jenkins/workspace/lldb-cmake/llvm-project/llvm/lib/LTO/LTO.cpp
[342/3090] /Users/buildslave/jenkins/workspace/lldb-cmake/host-compiler/bin/clang++  -DGTEST_HAS_RTTI=0 -D_DEBUG -D__STDC_CONSTANT_MACROS -D__STDC_FORMAT_MACROS -D__STDC_LIMIT_MACROS -Ilib/Object -I/Users/buildslave/jenkins/workspace/lldb-cmake/llvm-project/llvm/lib/Object -Iinclude -I/Users/buildslave/jenkins/workspace/lldb-cmake/llvm-project/llvm/include -Wdocumentation -fPIC -fvisibility-inlines-hidden -Werror=date-time -Werror=unguarded-availability-new -fmodules -fmodules-cache-path=/Users/buildslave/jenkins/workspace/lldb-cmake/lldb-build/module.cache -fcxx-modules -Xclang -fmodules-local-submodule-visibility -Wall -Wextra -Wno-unused-parameter -Wwrite-strings -Wcast-qual -Wmissing-field-initializers -pedantic -Wno-long-long -Wimplicit-fallthrough -Wcovered-switch-default -Wno-noexcept-type -Wnon-virtual-dtor -Wdelete-non-virtual-dtor -Wsuggest-override -Wstring-conversion -fdiagnostics-color -O3  -isysroot /Applications/Xcode.app/Contents/Developer/Platforms/MacOSX.platform/Developer/SDKs/MacOSX10.15.sdk    -fno-exceptions -fno-rtti -UNDEBUG -std=c++14 -MD -MT lib/Object/CMakeFiles/LLVMObject.dir/IRSymtab.cpp.o -MF lib/Object/CMakeFiles/LLVMObject.dir/IRSymtab.cpp.o.d -o lib/Object/CMakeFiles/LLVMObject.dir/IRSymtab.cpp.o -c /Users/buildslave/jenkins/workspace/lldb-cmake/llvm-project/llvm/lib/Object/IRSymtab.cpp
[343/3090] /Users/buildslave/jenkins/workspace/lldb-cmake/host-compiler/bin/clang++  -DGTEST_HAS_RTTI=0 -D_DEBUG -D__STDC_CONSTANT_MACROS -D__STDC_FORMAT_MACROS -D__STDC_LIMIT_MACROS -Ilib/MC/MCParser -I/Users/buildslave/jenkins/workspace/lldb-cmake/llvm-project/llvm/lib/MC/MCParser -Iinclude -I/Users/buildslave/jenkins/workspace/lldb-cmake/llvm-project/llvm/include -Wdocumentation -fPIC -fvisibility-inlines-hidden -Werror=date-time -Werror=unguarded-availability-new -fmodules -fmodules-cache-path=/Users/buildslave/jenkins/workspace/lldb-cmake/lldb-build/module.cache -fcxx-modules -Xclang -fmodules-local-submodule-visibility -Wall -Wextra -Wno-unused-parameter -Wwrite-strings -Wcast-qual -Wmissing-field-initializers -pedantic -Wno-long-long -Wimplicit-fallthrough -Wcovered-switch-default -Wno-noexcept-type -Wnon-virtual-dtor -Wdelete-non-virtual-dtor -Wsuggest-override -Wstring-conversion -fdiagnostics-color -O3  -isysroot /Applications/Xcode.app/Contents/Developer/Platforms/MacOSX.platform/Developer/SDKs/MacOSX10.15.sdk    -fno-exceptions -fno-rtti -UNDEBUG -std=c++14 -MD -MT lib/MC/MCParser/CMakeFiles/LLVMMCParser.dir/AsmParser.cpp.o -MF lib/MC/MCParser/CMakeFiles/LLVMMCParser.dir/AsmParser.cpp.o.d -o lib/MC/MCParser/CMakeFiles/LLVMMCParser.dir/AsmParser.cpp.o -c /Users/buildslave/jenkins/workspace/lldb-cmake/llvm-project/llvm/lib/MC/MCParser/AsmParser.cpp
[344/3090] /Users/buildslave/jenkins/workspace/lldb-cmake/host-compiler/bin/clang++  -DGTEST_HAS_RTTI=0 -D_DEBUG -D__STDC_CONSTANT_MACROS -D__STDC_FORMAT_MACROS -D__STDC_LIMIT_MACROS -Ilib/MC/MCParser -I/Users/buildslave/jenkins/workspace/lldb-cmake/llvm-project/llvm/lib/MC/MCParser -Iinclude -I/Users/buildslave/jenkins/workspace/lldb-cmake/llvm-project/llvm/include -Wdocumentation -fPIC -fvisibility-inlines-hidden -Werror=date-time -Werror=unguarded-availability-new -fmodules -fmodules-cache-path=/Users/buildslave/jenkins/workspace/lldb-cmake/lldb-build/module.cache -fcxx-modules -Xclang -fmodules-local-submodule-visibility -Wall -Wextra -Wno-unused-parameter -Wwrite-strings -Wcast-qual -Wmissing-field-initializers -pedantic -Wno-long-long -Wimplicit-fallthrough -Wcovered-switch-default -Wno-noexcept-type -Wnon-virtual-dtor -Wdelete-non-virtual-dtor -Wsuggest-override -Wstring-conversion -fdiagnostics-color -O3  -isysroot /Applications/Xcode.app/Contents/Developer/Platforms/MacOSX.platform/Developer/SDKs/MacOSX10.15.sdk    -fno-exceptions -fno-rtti -UNDEBUG -std=c++14 -MD -MT lib/MC/MCParser/CMakeFiles/LLVMMCParser.dir/MasmParser.cpp.o -MF lib/MC/MCParser/CMakeFiles/LLVMMCParser.dir/MasmParser.cpp.o.d -o lib/MC/MCParser/CMakeFiles/LLVMMCParser.dir/MasmParser.cpp.o -c /Users/buildslave/jenkins/workspace/lldb-cmake/llvm-project/llvm/lib/MC/MCParser/MasmParser.cpp
ninja: build stopped: subcommand failed.
Command failed: Command '['/usr/local/bin/ninja', '-v']' returned non-zero exit status 1
Command: ['/usr/local/bin/ninja', '-v']
[Pipeline] }
[Pipeline] // timeout
[Pipeline] }
[Pipeline] // stage
[Pipeline] stage
[Pipeline] { (Test)
Stage "Test" skipped due to earlier failure(s)
[Pipeline] }
[Pipeline] // stage
[Pipeline] stage
[Pipeline] { (Declarative: Post Actions)
[Pipeline] scanForIssues
[Clang (LLVM based)] Sleeping for 5 seconds due to JENKINS-32191...
[Clang (LLVM based)] Parsing console log (workspace: '/Users/buildslave/jenkins/workspace/lldb-cmake')
[Clang (LLVM based)] Successfully parsed console log
[Clang (LLVM based)] -> found 1 issue (skipped 1 duplicate)
[Clang (LLVM based)] Post processing issues on 'green-dragon-10' with source code encoding 'UTF-8'
[Clang (LLVM based)] Creating SCM blamer to obtain author and commit information for affected files
[Clang (LLVM based)] Creating SCM miner to obtain statistics for affected repository files
[Clang (LLVM based)] Resolving file names for all issues in source directory '/Users/buildslave/jenkins/workspace/lldb-cmake'
[Clang (LLVM based)] -> resolved paths in source directory (1 found, 0 not found)
[Clang (LLVM based)] Resolving module names from module definitions (build.xml, pom.xml, or Manifest.mf files)
[Clang (LLVM based)] -> resolved module names for 1 issues
[Clang (LLVM based)] Resolving package names (or namespaces) by parsing the affected files
[Clang (LLVM based)] -> resolved package names of 1 affected files
[Clang (LLVM based)] No filter has been set, publishing all 1 issues
[Clang (LLVM based)] Creating fingerprints for all affected code blocks to track issues over different builds
[Clang (LLVM based)] -> created fingerprints for 1 issues (skipped 0 issues)
[Clang (LLVM based)] Copying affected files to Jenkins' build folder '/Users/Shared/Jenkins/Home/jobs/lldb-cmake/builds/24038/files-with-issues'
[Clang (LLVM based)] -> 1 copied, 0 not in workspace, 0 not-found, 0 with I/O error
[Pipeline] junit
Recording test results
Test reports were found but none of them are new. Did leafNodes run? 
For example, /Users/buildslave/jenkins/workspace/lldb-cmake/test/results.xml is 2 hr 51 min old

Hide Details

Error when executing always post condition: Also: hudson.remoting.Channel$CallSiteStackTrace: Remote call to green-dragon-10 at hudson.remoting.Channel.attachCallSiteStackTrace(Channel.java:1788) at hudson.remoting.UserRequest$ExceptionResponse.retrieve(UserRequest.java:356) at hudson.remoting.Channel.call(Channel.java:998) at hudson.FilePath.act(FilePath.java:1069) at hudson.FilePath.act(FilePath.java:1058) at hudson.tasks.junit.JUnitParser.parseResult(JUnitParser.java:114) at hudson.tasks.junit.JUnitResultArchiver.parse(JUnitResultArchiver.java:137) at hudson.tasks.junit.JUnitResultArchiver.parseAndAttach(JUnitResultArchiver.java:167) at hudson.tasks.junit.pipeline.JUnitResultsStepExecution.run(JUnitResultsStepExecution.java:52) at hudson.tasks.junit.pipeline.JUnitResultsStepExecution.run(JUnitResultsStepExecution.java:25) at org.jenkinsci.plugins.workflow.steps.SynchronousNonBlockingStepExecution.lambda$start$0(SynchronousNonBlockingStepExecution.java:47) at java.util.concurrent.Executors$RunnableAdapter.call(Executors.java:511) at java.util.concurrent.FutureTask.run(FutureTask.java:266) at java.util.concurrent.ThreadPoolExecutor.runWorker(ThreadPoolExecutor.java:1149) at java.util.concurrent.ThreadPoolExecutor$Worker.run(ThreadPoolExecutor.java:624) at java.lang.Thread.run(Thread.java:748) hudson.AbortException: Test reports were found but none of them are new. Did leafNodes run? For example, /Users/buildslave/jenkins/workspace/lldb-cmake/test/results.xml is 2 hr 51 min old

Hide Details

at hudson.tasks.junit.TestResult.parse(TestResult.java:222) at hudson.tasks.junit.TestResult.parse(TestResult.java:178) at hudson.tasks.junit.TestResult.<init>(TestResult.java:143) at hudson.tasks.junit.JUnitParser$ParseResultCallable.invoke(JUnitParser.java:146) at hudson.tasks.junit.JUnitParser$ParseResultCallable.invoke(JUnitParser.java:118) at hudson.FilePath$FileCallableWrapper.call(FilePath.java:3073) at hudson.remoting.UserRequest.perform(UserRequest.java:211) at hudson.remoting.UserRequest.perform(UserRequest.java:54) at hudson.remoting.Request$2.run(Request.java:369) at hudson.remoting.InterceptingExecutorService$1.call(InterceptingExecutorService.java:72) at java.util.concurrent.FutureTask.run(Unknown Source) at java.util.concurrent.ThreadPoolExecutor.runWorker(Unknown Source) at java.util.concurrent.ThreadPoolExecutor$Worker.run(Unknown Source) at java.lang.Thread.run(Unknown Source)

Hide Details

[Pipeline] } [Pipeline] // stage [Pipeline] } [Pipeline] // withEnv [Pipeline] } [Pipeline] // node [Pipeline] End of Pipeline ERROR: script returned exit code 1 Finished: FAILURE