FailedConsole Output

Skipping 353 KB.. Full Log
MACROS -Ilib/Target/Hexagon/TargetInfo -I/Users/buildslave/jenkins/workspace/lldb-cmake/llvm-project/llvm/lib/Target/Hexagon/TargetInfo -I/Users/buildslave/jenkins/workspace/lldb-cmake/llvm-project/llvm/lib/Target/Hexagon -Ilib/Target/Hexagon -Iinclude -I/Users/buildslave/jenkins/workspace/lldb-cmake/llvm-project/llvm/include -Wdocumentation -fPIC -fvisibility-inlines-hidden -Werror=date-time -Werror=unguarded-availability-new -fmodules -fmodules-cache-path=/Users/buildslave/jenkins/workspace/lldb-cmake/lldb-build/module.cache -fcxx-modules -Xclang -fmodules-local-submodule-visibility -Wall -Wextra -Wno-unused-parameter -Wwrite-strings -Wcast-qual -Wmissing-field-initializers -pedantic -Wno-long-long -Wimplicit-fallthrough -Wcovered-switch-default -Wno-noexcept-type -Wnon-virtual-dtor -Wdelete-non-virtual-dtor -Wsuggest-override -Wstring-conversion -fdiagnostics-color -O3  -isysroot /Applications/Xcode.app/Contents/Developer/Platforms/MacOSX.platform/Developer/SDKs/MacOSX10.15.sdk    -fno-exceptions -fno-rtti -UNDEBUG -std=c++14 -MD -MT lib/Target/Hexagon/TargetInfo/CMakeFiles/LLVMHexagonInfo.dir/HexagonTargetInfo.cpp.o -MF lib/Target/Hexagon/TargetInfo/CMakeFiles/LLVMHexagonInfo.dir/HexagonTargetInfo.cpp.o.d -o lib/Target/Hexagon/TargetInfo/CMakeFiles/LLVMHexagonInfo.dir/HexagonTargetInfo.cpp.o -c /Users/buildslave/jenkins/workspace/lldb-cmake/llvm-project/llvm/lib/Target/Hexagon/TargetInfo/HexagonTargetInfo.cpp
[219/2753] : && "/Applications/Xcode.app/Contents/Developer/Toolchains/XcodeDefault.xctoolchain/usr/bin/libtool" -static -no_warning_for_no_symbols -o lib/libLLVMHexagonInfo.a  lib/Target/Hexagon/TargetInfo/CMakeFiles/LLVMHexagonInfo.dir/HexagonTargetInfo.cpp.o && :
[220/2753] /Users/buildslave/jenkins/workspace/lldb-cmake/host-compiler/bin/clang++  -DGTEST_HAS_RTTI=0 -D_DEBUG -D__STDC_CONSTANT_MACROS -D__STDC_FORMAT_MACROS -D__STDC_LIMIT_MACROS -Ilib/Target/Hexagon/MCTargetDesc -I/Users/buildslave/jenkins/workspace/lldb-cmake/llvm-project/llvm/lib/Target/Hexagon/MCTargetDesc -I/Users/buildslave/jenkins/workspace/lldb-cmake/llvm-project/llvm/lib/Target/Hexagon -Ilib/Target/Hexagon -Iinclude -I/Users/buildslave/jenkins/workspace/lldb-cmake/llvm-project/llvm/include -Wdocumentation -fPIC -fvisibility-inlines-hidden -Werror=date-time -Werror=unguarded-availability-new -fmodules -fmodules-cache-path=/Users/buildslave/jenkins/workspace/lldb-cmake/lldb-build/module.cache -fcxx-modules -Xclang -fmodules-local-submodule-visibility -Wall -Wextra -Wno-unused-parameter -Wwrite-strings -Wcast-qual -Wmissing-field-initializers -pedantic -Wno-long-long -Wimplicit-fallthrough -Wcovered-switch-default -Wno-noexcept-type -Wnon-virtual-dtor -Wdelete-non-virtual-dtor -Wsuggest-override -Wstring-conversion -fdiagnostics-color -O3  -isysroot /Applications/Xcode.app/Contents/Developer/Platforms/MacOSX.platform/Developer/SDKs/MacOSX10.15.sdk    -fno-exceptions -fno-rtti -UNDEBUG -std=c++14 -MD -MT lib/Target/Hexagon/MCTargetDesc/CMakeFiles/LLVMHexagonDesc.dir/HexagonMCShuffler.cpp.o -MF lib/Target/Hexagon/MCTargetDesc/CMakeFiles/LLVMHexagonDesc.dir/HexagonMCShuffler.cpp.o.d -o lib/Target/Hexagon/MCTargetDesc/CMakeFiles/LLVMHexagonDesc.dir/HexagonMCShuffler.cpp.o -c /Users/buildslave/jenkins/workspace/lldb-cmake/llvm-project/llvm/lib/Target/Hexagon/MCTargetDesc/HexagonMCShuffler.cpp
[221/2753] : && "/Applications/Xcode.app/Contents/Developer/Toolchains/XcodeDefault.xctoolchain/usr/bin/libtool" -static -no_warning_for_no_symbols -o lib/libLLVMLanaiDesc.a  lib/Target/Lanai/MCTargetDesc/CMakeFiles/LLVMLanaiDesc.dir/LanaiAsmBackend.cpp.o lib/Target/Lanai/MCTargetDesc/CMakeFiles/LLVMLanaiDesc.dir/LanaiELFObjectWriter.cpp.o lib/Target/Lanai/MCTargetDesc/CMakeFiles/LLVMLanaiDesc.dir/LanaiInstPrinter.cpp.o lib/Target/Lanai/MCTargetDesc/CMakeFiles/LLVMLanaiDesc.dir/LanaiMCAsmInfo.cpp.o lib/Target/Lanai/MCTargetDesc/CMakeFiles/LLVMLanaiDesc.dir/LanaiMCCodeEmitter.cpp.o lib/Target/Lanai/MCTargetDesc/CMakeFiles/LLVMLanaiDesc.dir/LanaiMCExpr.cpp.o lib/Target/Lanai/MCTargetDesc/CMakeFiles/LLVMLanaiDesc.dir/LanaiMCTargetDesc.cpp.o && :
[222/2753] : && "/Applications/Xcode.app/Contents/Developer/Toolchains/XcodeDefault.xctoolchain/usr/bin/libtool" -static -no_warning_for_no_symbols -o lib/libLLVMLanaiAsmParser.a  lib/Target/Lanai/AsmParser/CMakeFiles/LLVMLanaiAsmParser.dir/LanaiAsmParser.cpp.o && :
[223/2753] : && "/Applications/Xcode.app/Contents/Developer/Toolchains/XcodeDefault.xctoolchain/usr/bin/libtool" -static -no_warning_for_no_symbols -o lib/libLLVMLanaiCodeGen.a  lib/Target/Lanai/CMakeFiles/LLVMLanaiCodeGen.dir/LanaiAsmPrinter.cpp.o lib/Target/Lanai/CMakeFiles/LLVMLanaiCodeGen.dir/LanaiDelaySlotFiller.cpp.o lib/Target/Lanai/CMakeFiles/LLVMLanaiCodeGen.dir/LanaiFrameLowering.cpp.o lib/Target/Lanai/CMakeFiles/LLVMLanaiCodeGen.dir/LanaiInstrInfo.cpp.o lib/Target/Lanai/CMakeFiles/LLVMLanaiCodeGen.dir/LanaiISelDAGToDAG.cpp.o lib/Target/Lanai/CMakeFiles/LLVMLanaiCodeGen.dir/LanaiISelLowering.cpp.o lib/Target/Lanai/CMakeFiles/LLVMLanaiCodeGen.dir/LanaiMachineFunctionInfo.cpp.o lib/Target/Lanai/CMakeFiles/LLVMLanaiCodeGen.dir/LanaiMCInstLower.cpp.o lib/Target/Lanai/CMakeFiles/LLVMLanaiCodeGen.dir/LanaiMemAluCombiner.cpp.o lib/Target/Lanai/CMakeFiles/LLVMLanaiCodeGen.dir/LanaiRegisterInfo.cpp.o lib/Target/Lanai/CMakeFiles/LLVMLanaiCodeGen.dir/LanaiSelectionDAGInfo.cpp.o lib/Target/Lanai/CMakeFiles/LLVMLanaiCodeGen.dir/LanaiSubtarget.cpp.o lib/Target/Lanai/CMakeFiles/LLVMLanaiCodeGen.dir/LanaiTargetMachine.cpp.o lib/Target/Lanai/CMakeFiles/LLVMLanaiCodeGen.dir/LanaiTargetObjectFile.cpp.o && :
[224/2753] : && "/Applications/Xcode.app/Contents/Developer/Toolchains/XcodeDefault.xctoolchain/usr/bin/libtool" -static -no_warning_for_no_symbols -o lib/libLLVMLanaiDisassembler.a  lib/Target/Lanai/Disassembler/CMakeFiles/LLVMLanaiDisassembler.dir/LanaiDisassembler.cpp.o && :
[225/2753] : && /Users/buildslave/jenkins/workspace/lldb-cmake/host-compiler/bin/clang++  -Wdocumentation -fPIC -fvisibility-inlines-hidden -Werror=date-time -Werror=unguarded-availability-new -fmodules -fmodules-cache-path=/Users/buildslave/jenkins/workspace/lldb-cmake/lldb-build/module.cache -fcxx-modules -Xclang -fmodules-local-submodule-visibility -Wall -Wextra -Wno-unused-parameter -Wwrite-strings -Wcast-qual -Wmissing-field-initializers -pedantic -Wno-long-long -Wimplicit-fallthrough -Wcovered-switch-default -Wno-noexcept-type -Wnon-virtual-dtor -Wdelete-non-virtual-dtor -Wsuggest-override -Wstring-conversion -fdiagnostics-color -O3  -isysroot /Applications/Xcode.app/Contents/Developer/Platforms/MacOSX.platform/Developer/SDKs/MacOSX10.15.sdk -Wl,-search_paths_first -Wl,-headerpad_max_install_names -Wl,-dead_strip tools/llvm-cxxdump/CMakeFiles/llvm-cxxdump.dir/llvm-cxxdump.cpp.o tools/llvm-cxxdump/CMakeFiles/llvm-cxxdump.dir/Error.cpp.o  -o bin/llvm-cxxdump  -Wl,-rpath,@loader_path/../lib  lib/libLLVMAArch64Info.a  lib/libLLVMAMDGPUInfo.a  lib/libLLVMARMInfo.a  lib/libLLVMAVRInfo.a  lib/libLLVMBPFInfo.a  lib/libLLVMHexagonInfo.a  lib/libLLVMLanaiInfo.a  lib/libLLVMMipsInfo.a  lib/libLLVMMSP430Info.a  lib/libLLVMNVPTXInfo.a  lib/libLLVMPowerPCInfo.a  lib/libLLVMRISCVInfo.a  lib/libLLVMSparcInfo.a  lib/libLLVMSystemZInfo.a  lib/libLLVMWebAssemblyInfo.a  lib/libLLVMX86Info.a  lib/libLLVMXCoreInfo.a  lib/libLLVMObject.a  lib/libLLVMSupport.a  lib/libLLVMBitReader.a  lib/libLLVMCore.a  lib/libLLVMRemarks.a  lib/libLLVMBitstreamReader.a  lib/libLLVMMCParser.a  lib/libLLVMMC.a  lib/libLLVMDebugInfoCodeView.a  lib/libLLVMDebugInfoMSF.a  lib/libLLVMTextAPI.a  lib/libLLVMBinaryFormat.a  lib/libLLVMSupport.a  -lm  /usr/lib/libz.dylib  /usr/lib/libcurses.dylib  lib/libLLVMDemangle.a && :
[226/2753] : && "/Applications/Xcode.app/Contents/Developer/Toolchains/XcodeDefault.xctoolchain/usr/bin/libtool" -static -no_warning_for_no_symbols -o lib/libLLVMMSP430Desc.a  lib/Target/MSP430/MCTargetDesc/CMakeFiles/LLVMMSP430Desc.dir/MSP430AsmBackend.cpp.o lib/Target/MSP430/MCTargetDesc/CMakeFiles/LLVMMSP430Desc.dir/MSP430ELFObjectWriter.cpp.o lib/Target/MSP430/MCTargetDesc/CMakeFiles/LLVMMSP430Desc.dir/MSP430ELFStreamer.cpp.o lib/Target/MSP430/MCTargetDesc/CMakeFiles/LLVMMSP430Desc.dir/MSP430InstPrinter.cpp.o lib/Target/MSP430/MCTargetDesc/CMakeFiles/LLVMMSP430Desc.dir/MSP430MCAsmInfo.cpp.o lib/Target/MSP430/MCTargetDesc/CMakeFiles/LLVMMSP430Desc.dir/MSP430MCCodeEmitter.cpp.o lib/Target/MSP430/MCTargetDesc/CMakeFiles/LLVMMSP430Desc.dir/MSP430MCTargetDesc.cpp.o && :
[227/2753] /Users/buildslave/jenkins/workspace/lldb-cmake/host-compiler/bin/clang++  -DGTEST_HAS_RTTI=0 -D_DEBUG -D__STDC_CONSTANT_MACROS -D__STDC_FORMAT_MACROS -D__STDC_LIMIT_MACROS -Ilib/Target/Hexagon/MCTargetDesc -I/Users/buildslave/jenkins/workspace/lldb-cmake/llvm-project/llvm/lib/Target/Hexagon/MCTargetDesc -I/Users/buildslave/jenkins/workspace/lldb-cmake/llvm-project/llvm/lib/Target/Hexagon -Ilib/Target/Hexagon -Iinclude -I/Users/buildslave/jenkins/workspace/lldb-cmake/llvm-project/llvm/include -Wdocumentation -fPIC -fvisibility-inlines-hidden -Werror=date-time -Werror=unguarded-availability-new -fmodules -fmodules-cache-path=/Users/buildslave/jenkins/workspace/lldb-cmake/lldb-build/module.cache -fcxx-modules -Xclang -fmodules-local-submodule-visibility -Wall -Wextra -Wno-unused-parameter -Wwrite-strings -Wcast-qual -Wmissing-field-initializers -pedantic -Wno-long-long -Wimplicit-fallthrough -Wcovered-switch-default -Wno-noexcept-type -Wnon-virtual-dtor -Wdelete-non-virtual-dtor -Wsuggest-override -Wstring-conversion -fdiagnostics-color -O3  -isysroot /Applications/Xcode.app/Contents/Developer/Platforms/MacOSX.platform/Developer/SDKs/MacOSX10.15.sdk    -fno-exceptions -fno-rtti -UNDEBUG -std=c++14 -MD -MT lib/Target/Hexagon/MCTargetDesc/CMakeFiles/LLVMHexagonDesc.dir/HexagonMCInstrInfo.cpp.o -MF lib/Target/Hexagon/MCTargetDesc/CMakeFiles/LLVMHexagonDesc.dir/HexagonMCInstrInfo.cpp.o.d -o lib/Target/Hexagon/MCTargetDesc/CMakeFiles/LLVMHexagonDesc.dir/HexagonMCInstrInfo.cpp.o -c /Users/buildslave/jenkins/workspace/lldb-cmake/llvm-project/llvm/lib/Target/Hexagon/MCTargetDesc/HexagonMCInstrInfo.cpp
[228/2753] : && "/Applications/Xcode.app/Contents/Developer/Toolchains/XcodeDefault.xctoolchain/usr/bin/libtool" -static -no_warning_for_no_symbols -o lib/libLLVMMSP430AsmParser.a  lib/Target/MSP430/AsmParser/CMakeFiles/LLVMMSP430AsmParser.dir/MSP430AsmParser.cpp.o && :
[229/2753] : && "/Applications/Xcode.app/Contents/Developer/Toolchains/XcodeDefault.xctoolchain/usr/bin/libtool" -static -no_warning_for_no_symbols -o lib/libLLVMMipsDesc.a  lib/Target/Mips/MCTargetDesc/CMakeFiles/LLVMMipsDesc.dir/MipsABIInfo.cpp.o lib/Target/Mips/MCTargetDesc/CMakeFiles/LLVMMipsDesc.dir/MipsABIFlagsSection.cpp.o lib/Target/Mips/MCTargetDesc/CMakeFiles/LLVMMipsDesc.dir/MipsAsmBackend.cpp.o lib/Target/Mips/MCTargetDesc/CMakeFiles/LLVMMipsDesc.dir/MipsELFObjectWriter.cpp.o lib/Target/Mips/MCTargetDesc/CMakeFiles/LLVMMipsDesc.dir/MipsELFStreamer.cpp.o lib/Target/Mips/MCTargetDesc/CMakeFiles/LLVMMipsDesc.dir/MipsInstPrinter.cpp.o lib/Target/Mips/MCTargetDesc/CMakeFiles/LLVMMipsDesc.dir/MipsMCAsmInfo.cpp.o lib/Target/Mips/MCTargetDesc/CMakeFiles/LLVMMipsDesc.dir/MipsMCCodeEmitter.cpp.o lib/Target/Mips/MCTargetDesc/CMakeFiles/LLVMMipsDesc.dir/MipsMCExpr.cpp.o lib/Target/Mips/MCTargetDesc/CMakeFiles/LLVMMipsDesc.dir/MipsMCTargetDesc.cpp.o lib/Target/Mips/MCTargetDesc/CMakeFiles/LLVMMipsDesc.dir/MipsNaClELFStreamer.cpp.o lib/Target/Mips/MCTargetDesc/CMakeFiles/LLVMMipsDesc.dir/MipsOptionRecord.cpp.o lib/Target/Mips/MCTargetDesc/CMakeFiles/LLVMMipsDesc.dir/MipsTargetStreamer.cpp.o && :
[230/2753] : && "/Applications/Xcode.app/Contents/Developer/Toolchains/XcodeDefault.xctoolchain/usr/bin/libtool" -static -no_warning_for_no_symbols -o lib/libLLVMNVPTXDesc.a  lib/Target/NVPTX/MCTargetDesc/CMakeFiles/LLVMNVPTXDesc.dir/NVPTXInstPrinter.cpp.o lib/Target/NVPTX/MCTargetDesc/CMakeFiles/LLVMNVPTXDesc.dir/NVPTXMCAsmInfo.cpp.o lib/Target/NVPTX/MCTargetDesc/CMakeFiles/LLVMNVPTXDesc.dir/NVPTXMCTargetDesc.cpp.o lib/Target/NVPTX/MCTargetDesc/CMakeFiles/LLVMNVPTXDesc.dir/NVPTXTargetStreamer.cpp.o && :
[231/2753] /Users/buildslave/jenkins/workspace/lldb-cmake/host-compiler/bin/clang++  -DGTEST_HAS_RTTI=0 -D_DEBUG -D__STDC_CONSTANT_MACROS -D__STDC_FORMAT_MACROS -D__STDC_LIMIT_MACROS -Ilib/Target/Hexagon/MCTargetDesc -I/Users/buildslave/jenkins/workspace/lldb-cmake/llvm-project/llvm/lib/Target/Hexagon/MCTargetDesc -I/Users/buildslave/jenkins/workspace/lldb-cmake/llvm-project/llvm/lib/Target/Hexagon -Ilib/Target/Hexagon -Iinclude -I/Users/buildslave/jenkins/workspace/lldb-cmake/llvm-project/llvm/include -Wdocumentation -fPIC -fvisibility-inlines-hidden -Werror=date-time -Werror=unguarded-availability-new -fmodules -fmodules-cache-path=/Users/buildslave/jenkins/workspace/lldb-cmake/lldb-build/module.cache -fcxx-modules -Xclang -fmodules-local-submodule-visibility -Wall -Wextra -Wno-unused-parameter -Wwrite-strings -Wcast-qual -Wmissing-field-initializers -pedantic -Wno-long-long -Wimplicit-fallthrough -Wcovered-switch-default -Wno-noexcept-type -Wnon-virtual-dtor -Wdelete-non-virtual-dtor -Wsuggest-override -Wstring-conversion -fdiagnostics-color -O3  -isysroot /Applications/Xcode.app/Contents/Developer/Platforms/MacOSX.platform/Developer/SDKs/MacOSX10.15.sdk    -fno-exceptions -fno-rtti -UNDEBUG -std=c++14 -MD -MT lib/Target/Hexagon/MCTargetDesc/CMakeFiles/LLVMHexagonDesc.dir/HexagonShuffler.cpp.o -MF lib/Target/Hexagon/MCTargetDesc/CMakeFiles/LLVMHexagonDesc.dir/HexagonShuffler.cpp.o.d -o lib/Target/Hexagon/MCTargetDesc/CMakeFiles/LLVMHexagonDesc.dir/HexagonShuffler.cpp.o -c /Users/buildslave/jenkins/workspace/lldb-cmake/llvm-project/llvm/lib/Target/Hexagon/MCTargetDesc/HexagonShuffler.cpp
[232/2753] : && "/Applications/Xcode.app/Contents/Developer/Toolchains/XcodeDefault.xctoolchain/usr/bin/libtool" -static -no_warning_for_no_symbols -o lib/libLLVMPowerPCDisassembler.a  lib/Target/PowerPC/Disassembler/CMakeFiles/LLVMPowerPCDisassembler.dir/PPCDisassembler.cpp.o && :
[233/2753] : && "/Applications/Xcode.app/Contents/Developer/Toolchains/XcodeDefault.xctoolchain/usr/bin/libtool" -static -no_warning_for_no_symbols -o lib/libLLVMMSP430CodeGen.a  lib/Target/MSP430/CMakeFiles/LLVMMSP430CodeGen.dir/MSP430BranchSelector.cpp.o lib/Target/MSP430/CMakeFiles/LLVMMSP430CodeGen.dir/MSP430ISelDAGToDAG.cpp.o lib/Target/MSP430/CMakeFiles/LLVMMSP430CodeGen.dir/MSP430ISelLowering.cpp.o lib/Target/MSP430/CMakeFiles/LLVMMSP430CodeGen.dir/MSP430InstrInfo.cpp.o lib/Target/MSP430/CMakeFiles/LLVMMSP430CodeGen.dir/MSP430FrameLowering.cpp.o lib/Target/MSP430/CMakeFiles/LLVMMSP430CodeGen.dir/MSP430MachineFunctionInfo.cpp.o lib/Target/MSP430/CMakeFiles/LLVMMSP430CodeGen.dir/MSP430RegisterInfo.cpp.o lib/Target/MSP430/CMakeFiles/LLVMMSP430CodeGen.dir/MSP430Subtarget.cpp.o lib/Target/MSP430/CMakeFiles/LLVMMSP430CodeGen.dir/MSP430TargetMachine.cpp.o lib/Target/MSP430/CMakeFiles/LLVMMSP430CodeGen.dir/MSP430AsmPrinter.cpp.o lib/Target/MSP430/CMakeFiles/LLVMMSP430CodeGen.dir/MSP430MCInstLower.cpp.o && :
[234/2753] /Users/buildslave/jenkins/workspace/lldb-cmake/host-compiler/bin/clang++  -DGTEST_HAS_RTTI=0 -D_DEBUG -D__STDC_CONSTANT_MACROS -D__STDC_FORMAT_MACROS -D__STDC_LIMIT_MACROS -Ilib/Target/Hexagon/MCTargetDesc -I/Users/buildslave/jenkins/workspace/lldb-cmake/llvm-project/llvm/lib/Target/Hexagon/MCTargetDesc -I/Users/buildslave/jenkins/workspace/lldb-cmake/llvm-project/llvm/lib/Target/Hexagon -Ilib/Target/Hexagon -Iinclude -I/Users/buildslave/jenkins/workspace/lldb-cmake/llvm-project/llvm/include -Wdocumentation -fPIC -fvisibility-inlines-hidden -Werror=date-time -Werror=unguarded-availability-new -fmodules -fmodules-cache-path=/Users/buildslave/jenkins/workspace/lldb-cmake/lldb-build/module.cache -fcxx-modules -Xclang -fmodules-local-submodule-visibility -Wall -Wextra -Wno-unused-parameter -Wwrite-strings -Wcast-qual -Wmissing-field-initializers -pedantic -Wno-long-long -Wimplicit-fallthrough -Wcovered-switch-default -Wno-noexcept-type -Wnon-virtual-dtor -Wdelete-non-virtual-dtor -Wsuggest-override -Wstring-conversion -fdiagnostics-color -O3  -isysroot /Applications/Xcode.app/Contents/Developer/Platforms/MacOSX.platform/Developer/SDKs/MacOSX10.15.sdk    -fno-exceptions -fno-rtti -UNDEBUG -std=c++14 -MD -MT lib/Target/Hexagon/MCTargetDesc/CMakeFiles/LLVMHexagonDesc.dir/HexagonInstPrinter.cpp.o -MF lib/Target/Hexagon/MCTargetDesc/CMakeFiles/LLVMHexagonDesc.dir/HexagonInstPrinter.cpp.o.d -o lib/Target/Hexagon/MCTargetDesc/CMakeFiles/LLVMHexagonDesc.dir/HexagonInstPrinter.cpp.o -c /Users/buildslave/jenkins/workspace/lldb-cmake/llvm-project/llvm/lib/Target/Hexagon/MCTargetDesc/HexagonInstPrinter.cpp
[235/2753] : && "/Applications/Xcode.app/Contents/Developer/Toolchains/XcodeDefault.xctoolchain/usr/bin/libtool" -static -no_warning_for_no_symbols -o lib/libLLVMRISCVDisassembler.a  lib/Target/RISCV/Disassembler/CMakeFiles/LLVMRISCVDisassembler.dir/RISCVDisassembler.cpp.o && :
[236/2753] /Users/buildslave/jenkins/workspace/lldb-cmake/host-compiler/bin/clang++  -DGTEST_HAS_RTTI=0 -D_DEBUG -D__STDC_CONSTANT_MACROS -D__STDC_FORMAT_MACROS -D__STDC_LIMIT_MACROS -Ilib/Target/Hexagon/AsmParser -I/Users/buildslave/jenkins/workspace/lldb-cmake/llvm-project/llvm/lib/Target/Hexagon/AsmParser -I/Users/buildslave/jenkins/workspace/lldb-cmake/llvm-project/llvm/lib/Target/Hexagon -Ilib/Target/Hexagon -Iinclude -I/Users/buildslave/jenkins/workspace/lldb-cmake/llvm-project/llvm/include -Ilib/Target/Hexagon/AsmParser/.. -I/Users/buildslave/jenkins/workspace/lldb-cmake/llvm-project/llvm/lib/Target/Hexagon/AsmParser/.. -Wdocumentation -fPIC -fvisibility-inlines-hidden -Werror=date-time -Werror=unguarded-availability-new -fmodules -fmodules-cache-path=/Users/buildslave/jenkins/workspace/lldb-cmake/lldb-build/module.cache -fcxx-modules -Xclang -fmodules-local-submodule-visibility -Wall -Wextra -Wno-unused-parameter -Wwrite-strings -Wcast-qual -Wmissing-field-initializers -pedantic -Wno-long-long -Wimplicit-fallthrough -Wcovered-switch-default -Wno-noexcept-type -Wnon-virtual-dtor -Wdelete-non-virtual-dtor -Wsuggest-override -Wstring-conversion -fdiagnostics-color -O3  -isysroot /Applications/Xcode.app/Contents/Developer/Platforms/MacOSX.platform/Developer/SDKs/MacOSX10.15.sdk    -fno-exceptions -fno-rtti -UNDEBUG -std=c++14 -MD -MT lib/Target/Hexagon/AsmParser/CMakeFiles/LLVMHexagonAsmParser.dir/HexagonAsmParser.cpp.o -MF lib/Target/Hexagon/AsmParser/CMakeFiles/LLVMHexagonAsmParser.dir/HexagonAsmParser.cpp.o.d -o lib/Target/Hexagon/AsmParser/CMakeFiles/LLVMHexagonAsmParser.dir/HexagonAsmParser.cpp.o -c /Users/buildslave/jenkins/workspace/lldb-cmake/llvm-project/llvm/lib/Target/Hexagon/AsmParser/HexagonAsmParser.cpp
[237/2753] : && "/Applications/Xcode.app/Contents/Developer/Toolchains/XcodeDefault.xctoolchain/usr/bin/libtool" -static -no_warning_for_no_symbols -o lib/libLLVMSparcDisassembler.a  lib/Target/Sparc/Disassembler/CMakeFiles/LLVMSparcDisassembler.dir/SparcDisassembler.cpp.o && :
[238/2753] /Users/buildslave/jenkins/workspace/lldb-cmake/host-compiler/bin/clang++  -DGTEST_HAS_RTTI=0 -D_DEBUG -D__STDC_CONSTANT_MACROS -D__STDC_FORMAT_MACROS -D__STDC_LIMIT_MACROS -Ilib/Target/Hexagon/MCTargetDesc -I/Users/buildslave/jenkins/workspace/lldb-cmake/llvm-project/llvm/lib/Target/Hexagon/MCTargetDesc -I/Users/buildslave/jenkins/workspace/lldb-cmake/llvm-project/llvm/lib/Target/Hexagon -Ilib/Target/Hexagon -Iinclude -I/Users/buildslave/jenkins/workspace/lldb-cmake/llvm-project/llvm/include -Wdocumentation -fPIC -fvisibility-inlines-hidden -Werror=date-time -Werror=unguarded-availability-new -fmodules -fmodules-cache-path=/Users/buildslave/jenkins/workspace/lldb-cmake/lldb-build/module.cache -fcxx-modules -Xclang -fmodules-local-submodule-visibility -Wall -Wextra -Wno-unused-parameter -Wwrite-strings -Wcast-qual -Wmissing-field-initializers -pedantic -Wno-long-long -Wimplicit-fallthrough -Wcovered-switch-default -Wno-noexcept-type -Wnon-virtual-dtor -Wdelete-non-virtual-dtor -Wsuggest-override -Wstring-conversion -fdiagnostics-color -O3  -isysroot /Applications/Xcode.app/Contents/Developer/Platforms/MacOSX.platform/Developer/SDKs/MacOSX10.15.sdk    -fno-exceptions -fno-rtti -UNDEBUG -std=c++14 -MD -MT lib/Target/Hexagon/MCTargetDesc/CMakeFiles/LLVMHexagonDesc.dir/HexagonMCCodeEmitter.cpp.o -MF lib/Target/Hexagon/MCTargetDesc/CMakeFiles/LLVMHexagonDesc.dir/HexagonMCCodeEmitter.cpp.o.d -o lib/Target/Hexagon/MCTargetDesc/CMakeFiles/LLVMHexagonDesc.dir/HexagonMCCodeEmitter.cpp.o -c /Users/buildslave/jenkins/workspace/lldb-cmake/llvm-project/llvm/lib/Target/Hexagon/MCTargetDesc/HexagonMCCodeEmitter.cpp
[239/2753] : && "/Applications/Xcode.app/Contents/Developer/Toolchains/XcodeDefault.xctoolchain/usr/bin/libtool" -static -no_warning_for_no_symbols -o lib/libLLVMWebAssemblyAsmParser.a  lib/Target/WebAssembly/AsmParser/CMakeFiles/LLVMWebAssemblyAsmParser.dir/WebAssemblyAsmParser.cpp.o && :
[240/2753] : && "/Applications/Xcode.app/Contents/Developer/Toolchains/XcodeDefault.xctoolchain/usr/bin/libtool" -static -no_warning_for_no_symbols -o lib/libLLVMPowerPCDesc.a  lib/Target/PowerPC/MCTargetDesc/CMakeFiles/LLVMPowerPCDesc.dir/PPCAsmBackend.cpp.o lib/Target/PowerPC/MCTargetDesc/CMakeFiles/LLVMPowerPCDesc.dir/PPCInstPrinter.cpp.o lib/Target/PowerPC/MCTargetDesc/CMakeFiles/LLVMPowerPCDesc.dir/PPCMCTargetDesc.cpp.o lib/Target/PowerPC/MCTargetDesc/CMakeFiles/LLVMPowerPCDesc.dir/PPCMCAsmInfo.cpp.o lib/Target/PowerPC/MCTargetDesc/CMakeFiles/LLVMPowerPCDesc.dir/PPCMCCodeEmitter.cpp.o lib/Target/PowerPC/MCTargetDesc/CMakeFiles/LLVMPowerPCDesc.dir/PPCMCExpr.cpp.o lib/Target/PowerPC/MCTargetDesc/CMakeFiles/LLVMPowerPCDesc.dir/PPCPredicates.cpp.o lib/Target/PowerPC/MCTargetDesc/CMakeFiles/LLVMPowerPCDesc.dir/PPCELFObjectWriter.cpp.o lib/Target/PowerPC/MCTargetDesc/CMakeFiles/LLVMPowerPCDesc.dir/PPCXCOFFObjectWriter.cpp.o lib/Target/PowerPC/MCTargetDesc/CMakeFiles/LLVMPowerPCDesc.dir/PPCELFStreamer.cpp.o && :
[241/2753] : && "/Applications/Xcode.app/Contents/Developer/Toolchains/XcodeDefault.xctoolchain/usr/bin/libtool" -static -no_warning_for_no_symbols -o lib/libLLVMRISCVDesc.a  lib/Target/RISCV/MCTargetDesc/CMakeFiles/LLVMRISCVDesc.dir/RISCVAsmBackend.cpp.o lib/Target/RISCV/MCTargetDesc/CMakeFiles/LLVMRISCVDesc.dir/RISCVELFObjectWriter.cpp.o lib/Target/RISCV/MCTargetDesc/CMakeFiles/LLVMRISCVDesc.dir/RISCVInstPrinter.cpp.o lib/Target/RISCV/MCTargetDesc/CMakeFiles/LLVMRISCVDesc.dir/RISCVMCAsmInfo.cpp.o lib/Target/RISCV/MCTargetDesc/CMakeFiles/LLVMRISCVDesc.dir/RISCVMCCodeEmitter.cpp.o lib/Target/RISCV/MCTargetDesc/CMakeFiles/LLVMRISCVDesc.dir/RISCVMCExpr.cpp.o lib/Target/RISCV/MCTargetDesc/CMakeFiles/LLVMRISCVDesc.dir/RISCVMCTargetDesc.cpp.o lib/Target/RISCV/MCTargetDesc/CMakeFiles/LLVMRISCVDesc.dir/RISCVTargetStreamer.cpp.o lib/Target/RISCV/MCTargetDesc/CMakeFiles/LLVMRISCVDesc.dir/RISCVELFStreamer.cpp.o && :
[242/2753] : && "/Applications/Xcode.app/Contents/Developer/Toolchains/XcodeDefault.xctoolchain/usr/bin/libtool" -static -no_warning_for_no_symbols -o lib/libLLVMSparcDesc.a  lib/Target/Sparc/MCTargetDesc/CMakeFiles/LLVMSparcDesc.dir/SparcAsmBackend.cpp.o lib/Target/Sparc/MCTargetDesc/CMakeFiles/LLVMSparcDesc.dir/SparcELFObjectWriter.cpp.o lib/Target/Sparc/MCTargetDesc/CMakeFiles/LLVMSparcDesc.dir/SparcInstPrinter.cpp.o lib/Target/Sparc/MCTargetDesc/CMakeFiles/LLVMSparcDesc.dir/SparcMCAsmInfo.cpp.o lib/Target/Sparc/MCTargetDesc/CMakeFiles/LLVMSparcDesc.dir/SparcMCCodeEmitter.cpp.o lib/Target/Sparc/MCTargetDesc/CMakeFiles/LLVMSparcDesc.dir/SparcMCTargetDesc.cpp.o lib/Target/Sparc/MCTargetDesc/CMakeFiles/LLVMSparcDesc.dir/SparcMCExpr.cpp.o lib/Target/Sparc/MCTargetDesc/CMakeFiles/LLVMSparcDesc.dir/SparcTargetStreamer.cpp.o && :
[243/2753] /Users/buildslave/jenkins/workspace/lldb-cmake/host-compiler/bin/clang++  -DGTEST_HAS_RTTI=0 -D_DEBUG -D__STDC_CONSTANT_MACROS -D__STDC_FORMAT_MACROS -D__STDC_LIMIT_MACROS -Itools/llvm-exegesis -I/Users/buildslave/jenkins/workspace/lldb-cmake/llvm-project/llvm/tools/llvm-exegesis -Iinclude -I/Users/buildslave/jenkins/workspace/lldb-cmake/llvm-project/llvm/include -Wdocumentation -fPIC -fvisibility-inlines-hidden -Werror=date-time -Werror=unguarded-availability-new -fmodules -fmodules-cache-path=/Users/buildslave/jenkins/workspace/lldb-cmake/lldb-build/module.cache -fcxx-modules -Xclang -fmodules-local-submodule-visibility -Wall -Wextra -Wno-unused-parameter -Wwrite-strings -Wcast-qual -Wmissing-field-initializers -pedantic -Wno-long-long -Wimplicit-fallthrough -Wcovered-switch-default -Wno-noexcept-type -Wnon-virtual-dtor -Wdelete-non-virtual-dtor -Wsuggest-override -Wstring-conversion -fdiagnostics-color -O3  -isysroot /Applications/Xcode.app/Contents/Developer/Platforms/MacOSX.platform/Developer/SDKs/MacOSX10.15.sdk    -fno-exceptions -fno-rtti -UNDEBUG -std=c++14 -DLLVM_EXEGESIS_INITIALIZE_NATIVE_TARGET=InitializeX86ExegesisTarget -MD -MT tools/llvm-exegesis/CMakeFiles/llvm-exegesis.dir/llvm-exegesis.cpp.o -MF tools/llvm-exegesis/CMakeFiles/llvm-exegesis.dir/llvm-exegesis.cpp.o.d -o tools/llvm-exegesis/CMakeFiles/llvm-exegesis.dir/llvm-exegesis.cpp.o -c /Users/buildslave/jenkins/workspace/lldb-cmake/llvm-project/llvm/tools/llvm-exegesis/llvm-exegesis.cpp
While building module 'LLVM_Backend' imported from /Users/buildslave/jenkins/workspace/lldb-cmake/llvm-project/llvm/tools/llvm-exegesis/lib/Assembler.h:24:
In file included from <module-includes>:106:
/Users/buildslave/jenkins/workspace/lldb-cmake/llvm-project/llvm/include/llvm/CodeGen/MachinePassManager.h:94:8: warning: '\returns' command used in a comment that is not attached to a function or method declaration [-Wdocumentation]
  /// \returns null if there is no cached result.
      ~^~~~~~~~~~~~~~~~~~~~~~~~~~~~~~~~~~~~~~~~~~
1 warning generated.
[244/2753] : && "/Applications/Xcode.app/Contents/Developer/Toolchains/XcodeDefault.xctoolchain/usr/bin/libtool" -static -no_warning_for_no_symbols -o lib/libLLVMNVPTXCodeGen.a  lib/Target/NVPTX/CMakeFiles/LLVMNVPTXCodeGen.dir/NVPTXAllocaHoisting.cpp.o lib/Target/NVPTX/CMakeFiles/LLVMNVPTXCodeGen.dir/NVPTXAsmPrinter.cpp.o lib/Target/NVPTX/CMakeFiles/LLVMNVPTXCodeGen.dir/NVPTXAssignValidGlobalNames.cpp.o lib/Target/NVPTX/CMakeFiles/LLVMNVPTXCodeGen.dir/NVPTXFrameLowering.cpp.o lib/Target/NVPTX/CMakeFiles/LLVMNVPTXCodeGen.dir/NVPTXGenericToNVVM.cpp.o lib/Target/NVPTX/CMakeFiles/LLVMNVPTXCodeGen.dir/NVPTXISelDAGToDAG.cpp.o lib/Target/NVPTX/CMakeFiles/LLVMNVPTXCodeGen.dir/NVPTXISelLowering.cpp.o lib/Target/NVPTX/CMakeFiles/LLVMNVPTXCodeGen.dir/NVPTXImageOptimizer.cpp.o lib/Target/NVPTX/CMakeFiles/LLVMNVPTXCodeGen.dir/NVPTXInstrInfo.cpp.o lib/Target/NVPTX/CMakeFiles/LLVMNVPTXCodeGen.dir/NVPTXLowerAggrCopies.cpp.o lib/Target/NVPTX/CMakeFiles/LLVMNVPTXCodeGen.dir/NVPTXLowerArgs.cpp.o lib/Target/NVPTX/CMakeFiles/LLVMNVPTXCodeGen.dir/NVPTXLowerAlloca.cpp.o lib/Target/NVPTX/CMakeFiles/LLVMNVPTXCodeGen.dir/NVPTXPeephole.cpp.o lib/Target/NVPTX/CMakeFiles/LLVMNVPTXCodeGen.dir/NVPTXMCExpr.cpp.o lib/Target/NVPTX/CMakeFiles/LLVMNVPTXCodeGen.dir/NVPTXPrologEpilogPass.cpp.o lib/Target/NVPTX/CMakeFiles/LLVMNVPTXCodeGen.dir/NVPTXRegisterInfo.cpp.o lib/Target/NVPTX/CMakeFiles/LLVMNVPTXCodeGen.dir/NVPTXReplaceImageHandles.cpp.o lib/Target/NVPTX/CMakeFiles/LLVMNVPTXCodeGen.dir/NVPTXSubtarget.cpp.o lib/Target/NVPTX/CMakeFiles/LLVMNVPTXCodeGen.dir/NVPTXTargetMachine.cpp.o lib/Target/NVPTX/CMakeFiles/LLVMNVPTXCodeGen.dir/NVPTXTargetTransformInfo.cpp.o lib/Target/NVPTX/CMakeFiles/LLVMNVPTXCodeGen.dir/NVPTXUtilities.cpp.o lib/Target/NVPTX/CMakeFiles/LLVMNVPTXCodeGen.dir/NVVMIntrRange.cpp.o lib/Target/NVPTX/CMakeFiles/LLVMNVPTXCodeGen.dir/NVVMReflect.cpp.o lib/Target/NVPTX/CMakeFiles/LLVMNVPTXCodeGen.dir/NVPTXProxyRegErasure.cpp.o && :
[245/2753] : && "/Applications/Xcode.app/Contents/Developer/Toolchains/XcodeDefault.xctoolchain/usr/bin/libtool" -static -no_warning_for_no_symbols -o lib/libLLVMSystemZDesc.a  lib/Target/SystemZ/MCTargetDesc/CMakeFiles/LLVMSystemZDesc.dir/SystemZInstPrinter.cpp.o lib/Target/SystemZ/MCTargetDesc/CMakeFiles/LLVMSystemZDesc.dir/SystemZMCAsmBackend.cpp.o lib/Target/SystemZ/MCTargetDesc/CMakeFiles/LLVMSystemZDesc.dir/SystemZMCAsmInfo.cpp.o lib/Target/SystemZ/MCTargetDesc/CMakeFiles/LLVMSystemZDesc.dir/SystemZMCCodeEmitter.cpp.o lib/Target/SystemZ/MCTargetDesc/CMakeFiles/LLVMSystemZDesc.dir/SystemZMCObjectWriter.cpp.o lib/Target/SystemZ/MCTargetDesc/CMakeFiles/LLVMSystemZDesc.dir/SystemZMCTargetDesc.cpp.o && :
[246/2753] : && "/Applications/Xcode.app/Contents/Developer/Toolchains/XcodeDefault.xctoolchain/usr/bin/libtool" -static -no_warning_for_no_symbols -o lib/libLLVMWebAssemblyDesc.a  lib/Target/WebAssembly/MCTargetDesc/CMakeFiles/LLVMWebAssemblyDesc.dir/WebAssemblyAsmBackend.cpp.o lib/Target/WebAssembly/MCTargetDesc/CMakeFiles/LLVMWebAssemblyDesc.dir/WebAssemblyInstPrinter.cpp.o lib/Target/WebAssembly/MCTargetDesc/CMakeFiles/LLVMWebAssemblyDesc.dir/WebAssemblyMCAsmInfo.cpp.o lib/Target/WebAssembly/MCTargetDesc/CMakeFiles/LLVMWebAssemblyDesc.dir/WebAssemblyMCCodeEmitter.cpp.o lib/Target/WebAssembly/MCTargetDesc/CMakeFiles/LLVMWebAssemblyDesc.dir/WebAssemblyMCTargetDesc.cpp.o lib/Target/WebAssembly/MCTargetDesc/CMakeFiles/LLVMWebAssemblyDesc.dir/WebAssemblyTargetStreamer.cpp.o lib/Target/WebAssembly/MCTargetDesc/CMakeFiles/LLVMWebAssemblyDesc.dir/WebAssemblyWasmObjectWriter.cpp.o && :
[247/2753] : && "/Applications/Xcode.app/Contents/Developer/Toolchains/XcodeDefault.xctoolchain/usr/bin/libtool" -static -no_warning_for_no_symbols -o lib/libLLVMPowerPCAsmParser.a  lib/Target/PowerPC/AsmParser/CMakeFiles/LLVMPowerPCAsmParser.dir/PPCAsmParser.cpp.o && :
[248/2753] : && "/Applications/Xcode.app/Contents/Developer/Toolchains/XcodeDefault.xctoolchain/usr/bin/libtool" -static -no_warning_for_no_symbols -o lib/libLLVMSparcAsmParser.a  lib/Target/Sparc/AsmParser/CMakeFiles/LLVMSparcAsmParser.dir/SparcAsmParser.cpp.o && :
[249/2753] : && "/Applications/Xcode.app/Contents/Developer/Toolchains/XcodeDefault.xctoolchain/usr/bin/libtool" -static -no_warning_for_no_symbols -o lib/libLLVMRISCVAsmParser.a  lib/Target/RISCV/AsmParser/CMakeFiles/LLVMRISCVAsmParser.dir/RISCVAsmParser.cpp.o && :
[250/2753] : && "/Applications/Xcode.app/Contents/Developer/Toolchains/XcodeDefault.xctoolchain/usr/bin/libtool" -static -no_warning_for_no_symbols -o lib/libLLVMSystemZAsmParser.a  lib/Target/SystemZ/AsmParser/CMakeFiles/LLVMSystemZAsmParser.dir/SystemZAsmParser.cpp.o && :
[251/2753] : && "/Applications/Xcode.app/Contents/Developer/Toolchains/XcodeDefault.xctoolchain/usr/bin/libtool" -static -no_warning_for_no_symbols -o lib/libLLVMSystemZDisassembler.a  lib/Target/SystemZ/Disassembler/CMakeFiles/LLVMSystemZDisassembler.dir/SystemZDisassembler.cpp.o && :
[252/2753] : && "/Applications/Xcode.app/Contents/Developer/Toolchains/XcodeDefault.xctoolchain/usr/bin/libtool" -static -no_warning_for_no_symbols -o lib/libLLVMWebAssemblyDisassembler.a  lib/Target/WebAssembly/Disassembler/CMakeFiles/LLVMWebAssemblyDisassembler.dir/WebAssemblyDisassembler.cpp.o && :
[253/2753] /Users/buildslave/jenkins/workspace/lldb-cmake/host-compiler/bin/clang++  -DGTEST_HAS_RTTI=0 -D_DEBUG -D__STDC_CONSTANT_MACROS -D__STDC_FORMAT_MACROS -D__STDC_LIMIT_MACROS -Ilib/Target/Hexagon/Disassembler -I/Users/buildslave/jenkins/workspace/lldb-cmake/llvm-project/llvm/lib/Target/Hexagon/Disassembler -I/Users/buildslave/jenkins/workspace/lldb-cmake/llvm-project/llvm/lib/Target/Hexagon -Ilib/Target/Hexagon -Iinclude -I/Users/buildslave/jenkins/workspace/lldb-cmake/llvm-project/llvm/include -Wdocumentation -fPIC -fvisibility-inlines-hidden -Werror=date-time -Werror=unguarded-availability-new -fmodules -fmodules-cache-path=/Users/buildslave/jenkins/workspace/lldb-cmake/lldb-build/module.cache -fcxx-modules -Xclang -fmodules-local-submodule-visibility -Wall -Wextra -Wno-unused-parameter -Wwrite-strings -Wcast-qual -Wmissing-field-initializers -pedantic -Wno-long-long -Wimplicit-fallthrough -Wcovered-switch-default -Wno-noexcept-type -Wnon-virtual-dtor -Wdelete-non-virtual-dtor -Wsuggest-override -Wstring-conversion -fdiagnostics-color -O3  -isysroot /Applications/Xcode.app/Contents/Developer/Platforms/MacOSX.platform/Developer/SDKs/MacOSX10.15.sdk    -fno-exceptions -fno-rtti -UNDEBUG -std=c++14 -MD -MT lib/Target/Hexagon/Disassembler/CMakeFiles/LLVMHexagonDisassembler.dir/HexagonDisassembler.cpp.o -MF lib/Target/Hexagon/Disassembler/CMakeFiles/LLVMHexagonDisassembler.dir/HexagonDisassembler.cpp.o.d -o lib/Target/Hexagon/Disassembler/CMakeFiles/LLVMHexagonDisassembler.dir/HexagonDisassembler.cpp.o -c /Users/buildslave/jenkins/workspace/lldb-cmake/llvm-project/llvm/lib/Target/Hexagon/Disassembler/HexagonDisassembler.cpp
[254/2753] : && "/Applications/Xcode.app/Contents/Developer/Toolchains/XcodeDefault.xctoolchain/usr/bin/libtool" -static -no_warning_for_no_symbols -o lib/libLLVMX86Disassembler.a  lib/Target/X86/Disassembler/CMakeFiles/LLVMX86Disassembler.dir/X86Disassembler.cpp.o && :
[255/2753] : && "/Applications/Xcode.app/Contents/Developer/Toolchains/XcodeDefault.xctoolchain/usr/bin/libtool" -static -no_warning_for_no_symbols -o lib/libLLVMXCoreDisassembler.a  lib/Target/XCore/Disassembler/CMakeFiles/LLVMXCoreDisassembler.dir/XCoreDisassembler.cpp.o && :
[256/2753] /Users/buildslave/jenkins/workspace/lldb-cmake/host-compiler/bin/clang++  -DGTEST_HAS_RTTI=0 -D_DEBUG -D__STDC_CONSTANT_MACROS -D__STDC_FORMAT_MACROS -D__STDC_LIMIT_MACROS -Ilib/Target/Hexagon/MCTargetDesc -I/Users/buildslave/jenkins/workspace/lldb-cmake/llvm-project/llvm/lib/Target/Hexagon/MCTargetDesc -I/Users/buildslave/jenkins/workspace/lldb-cmake/llvm-project/llvm/lib/Target/Hexagon -Ilib/Target/Hexagon -Iinclude -I/Users/buildslave/jenkins/workspace/lldb-cmake/llvm-project/llvm/include -Wdocumentation -fPIC -fvisibility-inlines-hidden -Werror=date-time -Werror=unguarded-availability-new -fmodules -fmodules-cache-path=/Users/buildslave/jenkins/workspace/lldb-cmake/lldb-build/module.cache -fcxx-modules -Xclang -fmodules-local-submodule-visibility -Wall -Wextra -Wno-unused-parameter -Wwrite-strings -Wcast-qual -Wmissing-field-initializers -pedantic -Wno-long-long -Wimplicit-fallthrough -Wcovered-switch-default -Wno-noexcept-type -Wnon-virtual-dtor -Wdelete-non-virtual-dtor -Wsuggest-override -Wstring-conversion -fdiagnostics-color -O3  -isysroot /Applications/Xcode.app/Contents/Developer/Platforms/MacOSX.platform/Developer/SDKs/MacOSX10.15.sdk    -fno-exceptions -fno-rtti -UNDEBUG -std=c++14 -MD -MT lib/Target/Hexagon/MCTargetDesc/CMakeFiles/LLVMHexagonDesc.dir/HexagonMCTargetDesc.cpp.o -MF lib/Target/Hexagon/MCTargetDesc/CMakeFiles/LLVMHexagonDesc.dir/HexagonMCTargetDesc.cpp.o.d -o lib/Target/Hexagon/MCTargetDesc/CMakeFiles/LLVMHexagonDesc.dir/HexagonMCTargetDesc.cpp.o -c /Users/buildslave/jenkins/workspace/lldb-cmake/llvm-project/llvm/lib/Target/Hexagon/MCTargetDesc/HexagonMCTargetDesc.cpp
[257/2753] : && "/Applications/Xcode.app/Contents/Developer/Toolchains/XcodeDefault.xctoolchain/usr/bin/libtool" -static -no_warning_for_no_symbols -o lib/libLLVMXCoreDesc.a  lib/Target/XCore/MCTargetDesc/CMakeFiles/LLVMXCoreDesc.dir/XCoreInstPrinter.cpp.o lib/Target/XCore/MCTargetDesc/CMakeFiles/LLVMXCoreDesc.dir/XCoreMCTargetDesc.cpp.o lib/Target/XCore/MCTargetDesc/CMakeFiles/LLVMXCoreDesc.dir/XCoreMCAsmInfo.cpp.o && :
[258/2753] : && "/Applications/Xcode.app/Contents/Developer/Toolchains/XcodeDefault.xctoolchain/usr/bin/libtool" -static -no_warning_for_no_symbols -o lib/libLLVMCoverage.a  lib/ProfileData/Coverage/CMakeFiles/LLVMCoverage.dir/CoverageMapping.cpp.o lib/ProfileData/Coverage/CMakeFiles/LLVMCoverage.dir/CoverageMappingWriter.cpp.o lib/ProfileData/Coverage/CMakeFiles/LLVMCoverage.dir/CoverageMappingReader.cpp.o && :
[259/2753] : && "/Applications/Xcode.app/Contents/Developer/Toolchains/XcodeDefault.xctoolchain/usr/bin/libtool" -static -no_warning_for_no_symbols -o lib/libLLVMMipsCodeGen.a  lib/Target/Mips/CMakeFiles/LLVMMipsCodeGen.dir/Mips16FrameLowering.cpp.o lib/Target/Mips/CMakeFiles/LLVMMipsCodeGen.dir/Mips16HardFloat.cpp.o lib/Target/Mips/CMakeFiles/LLVMMipsCodeGen.dir/Mips16HardFloatInfo.cpp.o lib/Target/Mips/CMakeFiles/LLVMMipsCodeGen.dir/Mips16InstrInfo.cpp.o lib/Target/Mips/CMakeFiles/LLVMMipsCodeGen.dir/Mips16ISelDAGToDAG.cpp.o lib/Target/Mips/CMakeFiles/LLVMMipsCodeGen.dir/Mips16ISelLowering.cpp.o lib/Target/Mips/CMakeFiles/LLVMMipsCodeGen.dir/Mips16RegisterInfo.cpp.o lib/Target/Mips/CMakeFiles/LLVMMipsCodeGen.dir/MipsAnalyzeImmediate.cpp.o lib/Target/Mips/CMakeFiles/LLVMMipsCodeGen.dir/MipsAsmPrinter.cpp.o lib/Target/Mips/CMakeFiles/LLVMMipsCodeGen.dir/MipsCallLowering.cpp.o lib/Target/Mips/CMakeFiles/LLVMMipsCodeGen.dir/MipsCCState.cpp.o lib/Target/Mips/CMakeFiles/LLVMMipsCodeGen.dir/MipsConstantIslandPass.cpp.o lib/Target/Mips/CMakeFiles/LLVMMipsCodeGen.dir/MipsDelaySlotFiller.cpp.o lib/Target/Mips/CMakeFiles/LLVMMipsCodeGen.dir/MipsExpandPseudo.cpp.o lib/Target/Mips/CMakeFiles/LLVMMipsCodeGen.dir/MipsFastISel.cpp.o lib/Target/Mips/CMakeFiles/LLVMMipsCodeGen.dir/MipsInstrInfo.cpp.o lib/Target/Mips/CMakeFiles/LLVMMipsCodeGen.dir/MipsInstructionSelector.cpp.o lib/Target/Mips/CMakeFiles/LLVMMipsCodeGen.dir/MipsISelDAGToDAG.cpp.o lib/Target/Mips/CMakeFiles/LLVMMipsCodeGen.dir/MipsISelLowering.cpp.o lib/Target/Mips/CMakeFiles/LLVMMipsCodeGen.dir/MipsFrameLowering.cpp.o lib/Target/Mips/CMakeFiles/LLVMMipsCodeGen.dir/MipsLegalizerInfo.cpp.o lib/Target/Mips/CMakeFiles/LLVMMipsCodeGen.dir/MipsBranchExpansion.cpp.o lib/Target/Mips/CMakeFiles/LLVMMipsCodeGen.dir/MipsMCInstLower.cpp.o lib/Target/Mips/CMakeFiles/LLVMMipsCodeGen.dir/MipsMachineFunction.cpp.o lib/Target/Mips/CMakeFiles/LLVMMipsCodeGen.dir/MipsModuleISelDAGToDAG.cpp.o lib/Target/Mips/CMakeFiles/LLVMMipsCodeGen.dir/MipsOptimizePICCall.cpp.o lib/Target/Mips/CMakeFiles/LLVMMipsCodeGen.dir/MipsOs16.cpp.o lib/Target/Mips/CMakeFiles/LLVMMipsCodeGen.dir/MipsPreLegalizerCombiner.cpp.o lib/Target/Mips/CMakeFiles/LLVMMipsCodeGen.dir/MipsRegisterBankInfo.cpp.o lib/Target/Mips/CMakeFiles/LLVMMipsCodeGen.dir/MipsRegisterInfo.cpp.o lib/Target/Mips/CMakeFiles/LLVMMipsCodeGen.dir/MipsSEFrameLowering.cpp.o lib/Target/Mips/CMakeFiles/LLVMMipsCodeGen.dir/MipsSEInstrInfo.cpp.o lib/Target/Mips/CMakeFiles/LLVMMipsCodeGen.dir/MipsSEISelDAGToDAG.cpp.o lib/Target/Mips/CMakeFiles/LLVMMipsCodeGen.dir/MipsSEISelLowering.cpp.o lib/Target/Mips/CMakeFiles/LLVMMipsCodeGen.dir/MipsSERegisterInfo.cpp.o lib/Target/Mips/CMakeFiles/LLVMMipsCodeGen.dir/MipsSubtarget.cpp.o lib/Target/Mips/CMakeFiles/LLVMMipsCodeGen.dir/MipsTargetMachine.cpp.o lib/Target/Mips/CMakeFiles/LLVMMipsCodeGen.dir/MipsTargetObjectFile.cpp.o lib/Target/Mips/CMakeFiles/LLVMMipsCodeGen.dir/MicroMipsSizeReduction.cpp.o && :
[260/2753] : && "/Applications/Xcode.app/Contents/Developer/Toolchains/XcodeDefault.xctoolchain/usr/bin/libtool" -static -no_warning_for_no_symbols -o lib/libLLVMSparcCodeGen.a  lib/Target/Sparc/CMakeFiles/LLVMSparcCodeGen.dir/DelaySlotFiller.cpp.o lib/Target/Sparc/CMakeFiles/LLVMSparcCodeGen.dir/LeonPasses.cpp.o lib/Target/Sparc/CMakeFiles/LLVMSparcCodeGen.dir/SparcAsmPrinter.cpp.o lib/Target/Sparc/CMakeFiles/LLVMSparcCodeGen.dir/SparcInstrInfo.cpp.o lib/Target/Sparc/CMakeFiles/LLVMSparcCodeGen.dir/SparcISelDAGToDAG.cpp.o lib/Target/Sparc/CMakeFiles/LLVMSparcCodeGen.dir/SparcISelLowering.cpp.o lib/Target/Sparc/CMakeFiles/LLVMSparcCodeGen.dir/SparcFrameLowering.cpp.o lib/Target/Sparc/CMakeFiles/LLVMSparcCodeGen.dir/SparcMachineFunctionInfo.cpp.o lib/Target/Sparc/CMakeFiles/LLVMSparcCodeGen.dir/SparcRegisterInfo.cpp.o lib/Target/Sparc/CMakeFiles/LLVMSparcCodeGen.dir/SparcSubtarget.cpp.o lib/Target/Sparc/CMakeFiles/LLVMSparcCodeGen.dir/SparcTargetMachine.cpp.o lib/Target/Sparc/CMakeFiles/LLVMSparcCodeGen.dir/SparcMCInstLower.cpp.o lib/Target/Sparc/CMakeFiles/LLVMSparcCodeGen.dir/SparcTargetObjectFile.cpp.o && :
[261/2753] : && "/Applications/Xcode.app/Contents/Developer/Toolchains/XcodeDefault.xctoolchain/usr/bin/libtool" -static -no_warning_for_no_symbols -o lib/libLLVMHexagonDesc.a  lib/Target/Hexagon/MCTargetDesc/CMakeFiles/LLVMHexagonDesc.dir/HexagonAsmBackend.cpp.o lib/Target/Hexagon/MCTargetDesc/CMakeFiles/LLVMHexagonDesc.dir/HexagonELFObjectWriter.cpp.o lib/Target/Hexagon/MCTargetDesc/CMakeFiles/LLVMHexagonDesc.dir/HexagonInstPrinter.cpp.o lib/Target/Hexagon/MCTargetDesc/CMakeFiles/LLVMHexagonDesc.dir/HexagonMCAsmInfo.cpp.o lib/Target/Hexagon/MCTargetDesc/CMakeFiles/LLVMHexagonDesc.dir/HexagonMCChecker.cpp.o lib/Target/Hexagon/MCTargetDesc/CMakeFiles/LLVMHexagonDesc.dir/HexagonMCCodeEmitter.cpp.o lib/Target/Hexagon/MCTargetDesc/CMakeFiles/LLVMHexagonDesc.dir/HexagonMCCompound.cpp.o lib/Target/Hexagon/MCTargetDesc/CMakeFiles/LLVMHexagonDesc.dir/HexagonMCDuplexInfo.cpp.o lib/Target/Hexagon/MCTargetDesc/CMakeFiles/LLVMHexagonDesc.dir/HexagonMCELFStreamer.cpp.o lib/Target/Hexagon/MCTargetDesc/CMakeFiles/LLVMHexagonDesc.dir/HexagonMCExpr.cpp.o lib/Target/Hexagon/MCTargetDesc/CMakeFiles/LLVMHexagonDesc.dir/HexagonMCInstrInfo.cpp.o lib/Target/Hexagon/MCTargetDesc/CMakeFiles/LLVMHexagonDesc.dir/HexagonMCShuffler.cpp.o lib/Target/Hexagon/MCTargetDesc/CMakeFiles/LLVMHexagonDesc.dir/HexagonMCTargetDesc.cpp.o lib/Target/Hexagon/MCTargetDesc/CMakeFiles/LLVMHexagonDesc.dir/HexagonShuffler.cpp.o && :
[262/2753] : && "/Applications/Xcode.app/Contents/Developer/Toolchains/XcodeDefault.xctoolchain/usr/bin/libtool" -static -no_warning_for_no_symbols -o lib/libLLVMExegesisMips.a  tools/llvm-exegesis/lib/Mips/CMakeFiles/LLVMExegesisMips.dir/Target.cpp.o && :
[263/2753] : && "/Applications/Xcode.app/Contents/Developer/Toolchains/XcodeDefault.xctoolchain/usr/bin/libtool" -static -no_warning_for_no_symbols -o lib/libLLVMHexagonAsmParser.a  lib/Target/Hexagon/AsmParser/CMakeFiles/LLVMHexagonAsmParser.dir/HexagonAsmParser.cpp.o && :
[264/2753] : && "/Applications/Xcode.app/Contents/Developer/Toolchains/XcodeDefault.xctoolchain/usr/bin/libtool" -static -no_warning_for_no_symbols -o lib/libLLVMHexagonDisassembler.a  lib/Target/Hexagon/Disassembler/CMakeFiles/LLVMHexagonDisassembler.dir/HexagonDisassembler.cpp.o && :
[265/2753] : && "/Applications/Xcode.app/Contents/Developer/Toolchains/XcodeDefault.xctoolchain/usr/bin/libtool" -static -no_warning_for_no_symbols -o lib/libLLVMRISCVCodeGen.a  lib/Target/RISCV/CMakeFiles/LLVMRISCVCodeGen.dir/RISCVAsmPrinter.cpp.o lib/Target/RISCV/CMakeFiles/LLVMRISCVCodeGen.dir/RISCVCallLowering.cpp.o lib/Target/RISCV/CMakeFiles/LLVMRISCVCodeGen.dir/RISCVExpandAtomicPseudoInsts.cpp.o lib/Target/RISCV/CMakeFiles/LLVMRISCVCodeGen.dir/RISCVExpandPseudoInsts.cpp.o lib/Target/RISCV/CMakeFiles/LLVMRISCVCodeGen.dir/RISCVFrameLowering.cpp.o lib/Target/RISCV/CMakeFiles/LLVMRISCVCodeGen.dir/RISCVInstrInfo.cpp.o lib/Target/RISCV/CMakeFiles/LLVMRISCVCodeGen.dir/RISCVInstructionSelector.cpp.o lib/Target/RISCV/CMakeFiles/LLVMRISCVCodeGen.dir/RISCVISelDAGToDAG.cpp.o lib/Target/RISCV/CMakeFiles/LLVMRISCVCodeGen.dir/RISCVISelLowering.cpp.o lib/Target/RISCV/CMakeFiles/LLVMRISCVCodeGen.dir/RISCVLegalizerInfo.cpp.o lib/Target/RISCV/CMakeFiles/LLVMRISCVCodeGen.dir/RISCVMCInstLower.cpp.o lib/Target/RISCV/CMakeFiles/LLVMRISCVCodeGen.dir/RISCVMergeBaseOffset.cpp.o lib/Target/RISCV/CMakeFiles/LLVMRISCVCodeGen.dir/RISCVRegisterBankInfo.cpp.o lib/Target/RISCV/CMakeFiles/LLVMRISCVCodeGen.dir/RISCVRegisterInfo.cpp.o lib/Target/RISCV/CMakeFiles/LLVMRISCVCodeGen.dir/RISCVSubtarget.cpp.o lib/Target/RISCV/CMakeFiles/LLVMRISCVCodeGen.dir/RISCVTargetMachine.cpp.o lib/Target/RISCV/CMakeFiles/LLVMRISCVCodeGen.dir/RISCVTargetObjectFile.cpp.o lib/Target/RISCV/CMakeFiles/LLVMRISCVCodeGen.dir/RISCVTargetTransformInfo.cpp.o && :
[266/2753] : && /Users/buildslave/jenkins/workspace/lldb-cmake/host-compiler/bin/clang++  -Wdocumentation -fPIC -fvisibility-inlines-hidden -Werror=date-time -Werror=unguarded-availability-new -fmodules -fmodules-cache-path=/Users/buildslave/jenkins/workspace/lldb-cmake/lldb-build/module.cache -fcxx-modules -Xclang -fmodules-local-submodule-visibility -Wall -Wextra -Wno-unused-parameter -Wwrite-strings -Wcast-qual -Wmissing-field-initializers -pedantic -Wno-long-long -Wimplicit-fallthrough -Wcovered-switch-default -Wno-noexcept-type -Wnon-virtual-dtor -Wdelete-non-virtual-dtor -Wsuggest-override -Wstring-conversion -fdiagnostics-color -O3  -isysroot /Applications/Xcode.app/Contents/Developer/Platforms/MacOSX.platform/Developer/SDKs/MacOSX10.15.sdk -Wl,-search_paths_first -Wl,-headerpad_max_install_names -Wl,-dead_strip tools/llvm-cov/CMakeFiles/llvm-cov.dir/llvm-cov.cpp.o tools/llvm-cov/CMakeFiles/llvm-cov.dir/gcov.cpp.o tools/llvm-cov/CMakeFiles/llvm-cov.dir/CodeCoverage.cpp.o tools/llvm-cov/CMakeFiles/llvm-cov.dir/CoverageExporterJson.cpp.o tools/llvm-cov/CMakeFiles/llvm-cov.dir/CoverageExporterLcov.cpp.o tools/llvm-cov/CMakeFiles/llvm-cov.dir/CoverageFilters.cpp.o tools/llvm-cov/CMakeFiles/llvm-cov.dir/CoverageReport.cpp.o tools/llvm-cov/CMakeFiles/llvm-cov.dir/CoverageSummaryInfo.cpp.o tools/llvm-cov/CMakeFiles/llvm-cov.dir/SourceCoverageView.cpp.o tools/llvm-cov/CMakeFiles/llvm-cov.dir/SourceCoverageViewHTML.cpp.o tools/llvm-cov/CMakeFiles/llvm-cov.dir/SourceCoverageViewText.cpp.o tools/llvm-cov/CMakeFiles/llvm-cov.dir/TestingSupport.cpp.o  -o bin/llvm-cov  -Wl,-rpath,@loader_path/../lib  lib/libLLVMCore.a  lib/libLLVMSupport.a  lib/libLLVMObject.a  lib/libLLVMCoverage.a  lib/libLLVMProfileData.a  lib/libLLVMObject.a  lib/libLLVMBitReader.a  lib/libLLVMMCParser.a  lib/libLLVMMC.a  lib/libLLVMDebugInfoCodeView.a  lib/libLLVMDebugInfoMSF.a  lib/libLLVMTextAPI.a  lib/libLLVMCore.a  lib/libLLVMBinaryFormat.a  lib/libLLVMRemarks.a  lib/libLLVMBitstreamReader.a  lib/libLLVMSupport.a  -lm  /usr/lib/libz.dylib  /usr/lib/libcurses.dylib  lib/libLLVMDemangle.a && :
[267/2753] : && "/Applications/Xcode.app/Contents/Developer/Toolchains/XcodeDefault.xctoolchain/usr/bin/libtool" -static -no_warning_for_no_symbols -o lib/libLLVMX86Desc.a  lib/Target/X86/MCTargetDesc/CMakeFiles/LLVMX86Desc.dir/X86ATTInstPrinter.cpp.o lib/Target/X86/MCTargetDesc/CMakeFiles/LLVMX86Desc.dir/X86IntelInstPrinter.cpp.o lib/Target/X86/MCTargetDesc/CMakeFiles/LLVMX86Desc.dir/X86InstComments.cpp.o lib/Target/X86/MCTargetDesc/CMakeFiles/LLVMX86Desc.dir/X86InstPrinterCommon.cpp.o lib/Target/X86/MCTargetDesc/CMakeFiles/LLVMX86Desc.dir/X86ShuffleDecode.cpp.o lib/Target/X86/MCTargetDesc/CMakeFiles/LLVMX86Desc.dir/X86AsmBackend.cpp.o lib/Target/X86/MCTargetDesc/CMakeFiles/LLVMX86Desc.dir/X86MCTargetDesc.cpp.o lib/Target/X86/MCTargetDesc/CMakeFiles/LLVMX86Desc.dir/X86MCAsmInfo.cpp.o lib/Target/X86/MCTargetDesc/CMakeFiles/LLVMX86Desc.dir/X86MCCodeEmitter.cpp.o lib/Target/X86/MCTargetDesc/CMakeFiles/LLVMX86Desc.dir/X86MachObjectWriter.cpp.o lib/Target/X86/MCTargetDesc/CMakeFiles/LLVMX86Desc.dir/X86ELFObjectWriter.cpp.o lib/Target/X86/MCTargetDesc/CMakeFiles/LLVMX86Desc.dir/X86WinCOFFObjectWriter.cpp.o lib/Target/X86/MCTargetDesc/CMakeFiles/LLVMX86Desc.dir/X86WinCOFFStreamer.cpp.o lib/Target/X86/MCTargetDesc/CMakeFiles/LLVMX86Desc.dir/X86WinCOFFTargetStreamer.cpp.o && :
[268/2753] : && "/Applications/Xcode.app/Contents/Developer/Toolchains/XcodeDefault.xctoolchain/usr/bin/libtool" -static -no_warning_for_no_symbols -o lib/libLLVMSystemZCodeGen.a  lib/Target/SystemZ/CMakeFiles/LLVMSystemZCodeGen.dir/SystemZAsmPrinter.cpp.o lib/Target/SystemZ/CMakeFiles/LLVMSystemZCodeGen.dir/SystemZCallingConv.cpp.o lib/Target/SystemZ/CMakeFiles/LLVMSystemZCodeGen.dir/SystemZConstantPoolValue.cpp.o lib/Target/SystemZ/CMakeFiles/LLVMSystemZCodeGen.dir/SystemZCopyPhysRegs.cpp.o lib/Target/SystemZ/CMakeFiles/LLVMSystemZCodeGen.dir/SystemZElimCompare.cpp.o lib/Target/SystemZ/CMakeFiles/LLVMSystemZCodeGen.dir/SystemZFrameLowering.cpp.o lib/Target/SystemZ/CMakeFiles/LLVMSystemZCodeGen.dir/SystemZHazardRecognizer.cpp.o lib/Target/SystemZ/CMakeFiles/LLVMSystemZCodeGen.dir/SystemZISelDAGToDAG.cpp.o lib/Target/SystemZ/CMakeFiles/LLVMSystemZCodeGen.dir/SystemZISelLowering.cpp.o lib/Target/SystemZ/CMakeFiles/LLVMSystemZCodeGen.dir/SystemZInstrInfo.cpp.o lib/Target/SystemZ/CMakeFiles/LLVMSystemZCodeGen.dir/SystemZLDCleanup.cpp.o lib/Target/SystemZ/CMakeFiles/LLVMSystemZCodeGen.dir/SystemZLongBranch.cpp.o lib/Target/SystemZ/CMakeFiles/LLVMSystemZCodeGen.dir/SystemZMachineFunctionInfo.cpp.o lib/Target/SystemZ/CMakeFiles/LLVMSystemZCodeGen.dir/SystemZMachineScheduler.cpp.o lib/Target/SystemZ/CMakeFiles/LLVMSystemZCodeGen.dir/SystemZMCInstLower.cpp.o lib/Target/SystemZ/CMakeFiles/LLVMSystemZCodeGen.dir/SystemZPostRewrite.cpp.o lib/Target/SystemZ/CMakeFiles/LLVMSystemZCodeGen.dir/SystemZRegisterInfo.cpp.o lib/Target/SystemZ/CMakeFiles/LLVMSystemZCodeGen.dir/SystemZSelectionDAGInfo.cpp.o lib/Target/SystemZ/CMakeFiles/LLVMSystemZCodeGen.dir/SystemZShortenInst.cpp.o lib/Target/SystemZ/CMakeFiles/LLVMSystemZCodeGen.dir/SystemZSubtarget.cpp.o lib/Target/SystemZ/CMakeFiles/LLVMSystemZCodeGen.dir/SystemZTargetMachine.cpp.o lib/Target/SystemZ/CMakeFiles/LLVMSystemZCodeGen.dir/SystemZTargetTransformInfo.cpp.o lib/Target/SystemZ/CMakeFiles/LLVMSystemZCodeGen.dir/SystemZTDC.cpp.o && :
[269/2753] : && "/Applications/Xcode.app/Contents/Developer/Toolchains/XcodeDefault.xctoolchain/usr/bin/libtool" -static -no_warning_for_no_symbols -o lib/libLLVMXCoreCodeGen.a  lib/Target/XCore/CMakeFiles/LLVMXCoreCodeGen.dir/XCoreAsmPrinter.cpp.o lib/Target/XCore/CMakeFiles/LLVMXCoreCodeGen.dir/XCoreFrameLowering.cpp.o lib/Target/XCore/CMakeFiles/LLVMXCoreCodeGen.dir/XCoreInstrInfo.cpp.o lib/Target/XCore/CMakeFiles/LLVMXCoreCodeGen.dir/XCoreISelDAGToDAG.cpp.o lib/Target/XCore/CMakeFiles/LLVMXCoreCodeGen.dir/XCoreISelLowering.cpp.o lib/Target/XCore/CMakeFiles/LLVMXCoreCodeGen.dir/XCoreLowerThreadLocal.cpp.o lib/Target/XCore/CMakeFiles/LLVMXCoreCodeGen.dir/XCoreMachineFunctionInfo.cpp.o lib/Target/XCore/CMakeFiles/LLVMXCoreCodeGen.dir/XCoreMCInstLower.cpp.o lib/Target/XCore/CMakeFiles/LLVMXCoreCodeGen.dir/XCoreRegisterInfo.cpp.o lib/Target/XCore/CMakeFiles/LLVMXCoreCodeGen.dir/XCoreSubtarget.cpp.o lib/Target/XCore/CMakeFiles/LLVMXCoreCodeGen.dir/XCoreTargetMachine.cpp.o lib/Target/XCore/CMakeFiles/LLVMXCoreCodeGen.dir/XCoreTargetObjectFile.cpp.o lib/Target/XCore/CMakeFiles/LLVMXCoreCodeGen.dir/XCoreSelectionDAGInfo.cpp.o lib/Target/XCore/CMakeFiles/LLVMXCoreCodeGen.dir/XCoreFrameToArgsOffsetElim.cpp.o && :
[270/2753] : && "/Applications/Xcode.app/Contents/Developer/Toolchains/XcodeDefault.xctoolchain/usr/bin/libtool" -static -no_warning_for_no_symbols -o lib/libLLVMPasses.a  lib/Passes/CMakeFiles/LLVMPasses.dir/PassBuilder.cpp.o lib/Passes/CMakeFiles/LLVMPasses.dir/PassPlugin.cpp.o lib/Passes/CMakeFiles/LLVMPasses.dir/StandardInstrumentations.cpp.o && :
[271/2753] : && "/Applications/Xcode.app/Contents/Developer/Toolchains/XcodeDefault.xctoolchain/usr/bin/libtool" -static -no_warning_for_no_symbols -o lib/libLLVMX86AsmParser.a  lib/Target/X86/AsmParser/CMakeFiles/LLVMX86AsmParser.dir/X86AsmParser.cpp.o && :
[272/2753] : && /Users/buildslave/jenkins/workspace/lldb-cmake/host-compiler/bin/clang++ -Wdocumentation -fPIC -fvisibility-inlines-hidden -Werror=date-time -Werror=unguarded-availability-new -fmodules -fmodules-cache-path=/Users/buildslave/jenkins/workspace/lldb-cmake/lldb-build/module.cache -fcxx-modules -Xclang -fmodules-local-submodule-visibility -Wall -Wextra -Wno-unused-parameter -Wwrite-strings -Wcast-qual -Wmissing-field-initializers  -Wno-long-long -Wimplicit-fallthrough -Wcovered-switch-default -Wno-noexcept-type -Wnon-virtual-dtor -Wdelete-non-virtual-dtor -Wsuggest-override -Wstring-conversion -fdiagnostics-color -O3 -isysroot /Applications/Xcode.app/Contents/Developer/Platforms/MacOSX.platform/Developer/SDKs/MacOSX10.15.sdk -dynamiclib -Wl,-headerpad_max_install_names -compatibility_version 1.0.0 -current_version 1.0.0 -o lib/libc++.1.0.dylib -install_name @rpath/libc++.1.dylib projects/libcxx/src/CMakeFiles/cxx_shared.dir/algorithm.cpp.o projects/libcxx/src/CMakeFiles/cxx_shared.dir/any.cpp.o projects/libcxx/src/CMakeFiles/cxx_shared.dir/atomic.cpp.o projects/libcxx/src/CMakeFiles/cxx_shared.dir/barrier.cpp.o projects/libcxx/src/CMakeFiles/cxx_shared.dir/bind.cpp.o projects/libcxx/src/CMakeFiles/cxx_shared.dir/charconv.cpp.o projects/libcxx/src/CMakeFiles/cxx_shared.dir/chrono.cpp.o projects/libcxx/src/CMakeFiles/cxx_shared.dir/condition_variable.cpp.o projects/libcxx/src/CMakeFiles/cxx_shared.dir/condition_variable_destructor.cpp.o projects/libcxx/src/CMakeFiles/cxx_shared.dir/debug.cpp.o projects/libcxx/src/CMakeFiles/cxx_shared.dir/exception.cpp.o projects/libcxx/src/CMakeFiles/cxx_shared.dir/functional.cpp.o projects/libcxx/src/CMakeFiles/cxx_shared.dir/future.cpp.o projects/libcxx/src/CMakeFiles/cxx_shared.dir/hash.cpp.o projects/libcxx/src/CMakeFiles/cxx_shared.dir/ios.cpp.o projects/libcxx/src/CMakeFiles/cxx_shared.dir/iostream.cpp.o projects/libcxx/src/CMakeFiles/cxx_shared.dir/locale.cpp.o projects/libcxx/src/CMakeFiles/cxx_shared.dir/memory.cpp.o projects/libcxx/src/CMakeFiles/cxx_shared.dir/mutex.cpp.o projects/libcxx/src/CMakeFiles/cxx_shared.dir/mutex_destructor.cpp.o projects/libcxx/src/CMakeFiles/cxx_shared.dir/new.cpp.o projects/libcxx/src/CMakeFiles/cxx_shared.dir/optional.cpp.o projects/libcxx/src/CMakeFiles/cxx_shared.dir/random.cpp.o projects/libcxx/src/CMakeFiles/cxx_shared.dir/random_shuffle.cpp.o projects/libcxx/src/CMakeFiles/cxx_shared.dir/regex.cpp.o projects/libcxx/src/CMakeFiles/cxx_shared.dir/shared_mutex.cpp.o projects/libcxx/src/CMakeFiles/cxx_shared.dir/stdexcept.cpp.o projects/libcxx/src/CMakeFiles/cxx_shared.dir/string.cpp.o projects/libcxx/src/CMakeFiles/cxx_shared.dir/strstream.cpp.o projects/libcxx/src/CMakeFiles/cxx_shared.dir/system_error.cpp.o projects/libcxx/src/CMakeFiles/cxx_shared.dir/thread.cpp.o projects/libcxx/src/CMakeFiles/cxx_shared.dir/typeinfo.cpp.o projects/libcxx/src/CMakeFiles/cxx_shared.dir/utility.cpp.o projects/libcxx/src/CMakeFiles/cxx_shared.dir/valarray.cpp.o projects/libcxx/src/CMakeFiles/cxx_shared.dir/variant.cpp.o projects/libcxx/src/CMakeFiles/cxx_shared.dir/vector.cpp.o projects/libcxx/src/CMakeFiles/cxx_shared.dir/filesystem/operations.cpp.o projects/libcxx/src/CMakeFiles/cxx_shared.dir/filesystem/directory_iterator.cpp.o projects/libcxx/src/CMakeFiles/cxx_shared.dir/filesystem/int128_builtins.cpp.o  -Wl,-rpath,@loader_path/../lib  -nodefaultlibs  -lSystem  -lc  lib/libc++abi.1.0.dylib  -Wl,-unexported_symbols_list,/Users/buildslave/jenkins/workspace/lldb-cmake/llvm-project/libcxx/src/../lib/libc++unexp.exp  -Wl,-reexported_symbols_list,/Users/buildslave/jenkins/workspace/lldb-cmake/llvm-project/libcxx/src/../lib/libc++abi.v2.exp  -Wl,-force_symbols_not_weak_list,/Users/buildslave/jenkins/workspace/lldb-cmake/llvm-project/libcxx/src/../lib/notweak.exp  -Wl,-force_symbols_weak_list,/Users/buildslave/jenkins/workspace/lldb-cmake/llvm-project/libcxx/src/../lib/weak.exp  -Wl,-reexported_symbols_list,/Users/buildslave/jenkins/workspace/lldb-cmake/llvm-project/libcxxabi/src/../lib/new-delete.exp  -Wl,-reexported_symbols_list,/Users/buildslave/jenkins/workspace/lldb-cmake/llvm-project/libcxxabi/src/../lib/exceptions.exp  -Wl,-reexported_symbols_list,/Users/buildslave/jenkins/workspace/lldb-cmake/llvm-project/libcxxabi/src/../lib/personality-v0.exp && :
FAILED: lib/libc++.1.0.dylib 
: && /Users/buildslave/jenkins/workspace/lldb-cmake/host-compiler/bin/clang++ -Wdocumentation -fPIC -fvisibility-inlines-hidden -Werror=date-time -Werror=unguarded-availability-new -fmodules -fmodules-cache-path=/Users/buildslave/jenkins/workspace/lldb-cmake/lldb-build/module.cache -fcxx-modules -Xclang -fmodules-local-submodule-visibility -Wall -Wextra -Wno-unused-parameter -Wwrite-strings -Wcast-qual -Wmissing-field-initializers  -Wno-long-long -Wimplicit-fallthrough -Wcovered-switch-default -Wno-noexcept-type -Wnon-virtual-dtor -Wdelete-non-virtual-dtor -Wsuggest-override -Wstring-conversion -fdiagnostics-color -O3 -isysroot /Applications/Xcode.app/Contents/Developer/Platforms/MacOSX.platform/Developer/SDKs/MacOSX10.15.sdk -dynamiclib -Wl,-headerpad_max_install_names -compatibility_version 1.0.0 -current_version 1.0.0 -o lib/libc++.1.0.dylib -install_name @rpath/libc++.1.dylib projects/libcxx/src/CMakeFiles/cxx_shared.dir/algorithm.cpp.o projects/libcxx/src/CMakeFiles/cxx_shared.dir/any.cpp.o projects/libcxx/src/CMakeFiles/cxx_shared.dir/atomic.cpp.o projects/libcxx/src/CMakeFiles/cxx_shared.dir/barrier.cpp.o projects/libcxx/src/CMakeFiles/cxx_shared.dir/bind.cpp.o projects/libcxx/src/CMakeFiles/cxx_shared.dir/charconv.cpp.o projects/libcxx/src/CMakeFiles/cxx_shared.dir/chrono.cpp.o projects/libcxx/src/CMakeFiles/cxx_shared.dir/condition_variable.cpp.o projects/libcxx/src/CMakeFiles/cxx_shared.dir/condition_variable_destructor.cpp.o projects/libcxx/src/CMakeFiles/cxx_shared.dir/debug.cpp.o projects/libcxx/src/CMakeFiles/cxx_shared.dir/exception.cpp.o projects/libcxx/src/CMakeFiles/cxx_shared.dir/functional.cpp.o projects/libcxx/src/CMakeFiles/cxx_shared.dir/future.cpp.o projects/libcxx/src/CMakeFiles/cxx_shared.dir/hash.cpp.o projects/libcxx/src/CMakeFiles/cxx_shared.dir/ios.cpp.o projects/libcxx/src/CMakeFiles/cxx_shared.dir/iostream.cpp.o projects/libcxx/src/CMakeFiles/cxx_shared.dir/locale.cpp.o projects/libcxx/src/CMakeFiles/cxx_shared.dir/memory.cpp.o projects/libcxx/src/CMakeFiles/cxx_shared.dir/mutex.cpp.o projects/libcxx/src/CMakeFiles/cxx_shared.dir/mutex_destructor.cpp.o projects/libcxx/src/CMakeFiles/cxx_shared.dir/new.cpp.o projects/libcxx/src/CMakeFiles/cxx_shared.dir/optional.cpp.o projects/libcxx/src/CMakeFiles/cxx_shared.dir/random.cpp.o projects/libcxx/src/CMakeFiles/cxx_shared.dir/random_shuffle.cpp.o projects/libcxx/src/CMakeFiles/cxx_shared.dir/regex.cpp.o projects/libcxx/src/CMakeFiles/cxx_shared.dir/shared_mutex.cpp.o projects/libcxx/src/CMakeFiles/cxx_shared.dir/stdexcept.cpp.o projects/libcxx/src/CMakeFiles/cxx_shared.dir/string.cpp.o projects/libcxx/src/CMakeFiles/cxx_shared.dir/strstream.cpp.o projects/libcxx/src/CMakeFiles/cxx_shared.dir/system_error.cpp.o projects/libcxx/src/CMakeFiles/cxx_shared.dir/thread.cpp.o projects/libcxx/src/CMakeFiles/cxx_shared.dir/typeinfo.cpp.o projects/libcxx/src/CMakeFiles/cxx_shared.dir/utility.cpp.o projects/libcxx/src/CMakeFiles/cxx_shared.dir/valarray.cpp.o projects/libcxx/src/CMakeFiles/cxx_shared.dir/variant.cpp.o projects/libcxx/src/CMakeFiles/cxx_shared.dir/vector.cpp.o projects/libcxx/src/CMakeFiles/cxx_shared.dir/filesystem/operations.cpp.o projects/libcxx/src/CMakeFiles/cxx_shared.dir/filesystem/directory_iterator.cpp.o projects/libcxx/src/CMakeFiles/cxx_shared.dir/filesystem/int128_builtins.cpp.o  -Wl,-rpath,@loader_path/../lib  -nodefaultlibs  -lSystem  -lc  lib/libc++abi.1.0.dylib  -Wl,-unexported_symbols_list,/Users/buildslave/jenkins/workspace/lldb-cmake/llvm-project/libcxx/src/../lib/libc++unexp.exp  -Wl,-reexported_symbols_list,/Users/buildslave/jenkins/workspace/lldb-cmake/llvm-project/libcxx/src/../lib/libc++abi.v2.exp  -Wl,-force_symbols_not_weak_list,/Users/buildslave/jenkins/workspace/lldb-cmake/llvm-project/libcxx/src/../lib/notweak.exp  -Wl,-force_symbols_weak_list,/Users/buildslave/jenkins/workspace/lldb-cmake/llvm-project/libcxx/src/../lib/weak.exp  -Wl,-reexported_symbols_list,/Users/buildslave/jenkins/workspace/lldb-cmake/llvm-project/libcxxabi/src/../lib/new-delete.exp  -Wl,-reexported_symbols_list,/Users/buildslave/jenkins/workspace/lldb-cmake/llvm-project/libcxxabi/src/../lib/exceptions.exp  -Wl,-reexported_symbols_list,/Users/buildslave/jenkins/workspace/lldb-cmake/llvm-project/libcxxabi/src/../lib/personality-v0.exp && :
ld: requested re-export symbol operator new(unsigned long) is not from a dylib, but from projects/libcxx/src/CMakeFiles/cxx_shared.dir/new.cpp.o
 file 'projects/libcxx/src/CMakeFiles/cxx_shared.dir/new.cpp.o' for architecture x86_64
clang-12: error: linker command failed with exit code 1 (use -v to see invocation)
[273/2753] /Users/buildslave/jenkins/workspace/lldb-cmake/host-compiler/bin/clang++  -DHAVE_RPC_XDR_H=0 -D_DEBUG -D__STDC_CONSTANT_MACROS -D__STDC_FORMAT_MACROS -D__STDC_LIMIT_MACROS -Iprojects/compiler-rt/lib/sanitizer_common -I/Users/buildslave/jenkins/workspace/lldb-cmake/llvm-project/compiler-rt/lib/sanitizer_common -Iinclude -I/Users/buildslave/jenkins/workspace/lldb-cmake/llvm-project/llvm/include -I/Users/buildslave/jenkins/workspace/lldb-cmake/llvm-project/compiler-rt/lib/sanitizer_common/.. -Wdocumentation -fPIC -fvisibility-inlines-hidden -Werror=date-time -Werror=unguarded-availability-new -fmodules -fmodules-cache-path=/Users/buildslave/jenkins/workspace/lldb-cmake/lldb-build/module.cache -fcxx-modules -Xclang -fmodules-local-submodule-visibility -Wall -Wextra -Wno-unused-parameter -Wwrite-strings -Wcast-qual -Wmissing-field-initializers -pedantic -Wno-long-long -Wimplicit-fallthrough -Wcovered-switch-default -Wno-noexcept-type -Wnon-virtual-dtor -Wdelete-non-virtual-dtor -Wsuggest-override -Wstring-conversion -fdiagnostics-color -Wall -std=c++14 -Wno-unused-parameter -O3  -arch x86_64 -arch x86_64h -isysroot /Applications/Xcode.app/Contents/Developer/Platforms/MacOSX.platform/Developer/SDKs/MacOSX10.15.sdk    -stdlib=libc++ -mmacosx-version-min=10.10 -isysroot /Applications/Xcode.app/Contents/Developer/Platforms/MacOSX.platform/Developer/SDKs/MacOSX10.15.sdk -fPIC -fno-builtin -fno-exceptions -funwind-tables -fno-stack-protector -fno-sanitize=safe-stack -fvisibility=hidden -fno-lto -O3 -gline-tables-only -fno-modules -Wno-gnu -Wno-variadic-macros -Wno-c99-extensions -Wno-non-virtual-dtor -fno-rtti -Wframe-larger-than=570 -Wglobal-constructors -DSANITIZER_SUPPORTS_WEAK_HOOKS=0 -UNDEBUG -std=c++14 -MD -MT projects/compiler-rt/lib/sanitizer_common/CMakeFiles/RTSanitizerCommonNoHooks.osx.dir/sanitizer_printf.cpp.o -MF projects/compiler-rt/lib/sanitizer_common/CMakeFiles/RTSanitizerCommonNoHooks.osx.dir/sanitizer_printf.cpp.o.d -o projects/compiler-rt/lib/sanitizer_common/CMakeFiles/RTSanitizerCommonNoHooks.osx.dir/sanitizer_printf.cpp.o -c /Users/buildslave/jenkins/workspace/lldb-cmake/llvm-project/compiler-rt/lib/sanitizer_common/sanitizer_printf.cpp
clang-12: warning: argument unused during compilation: '-fmodules-cache-path=/Users/buildslave/jenkins/workspace/lldb-cmake/lldb-build/module.cache' [-Wunused-command-line-argument]
clang-12: warning: argument unused during compilation: '-fcxx-modules' [-Wunused-command-line-argument]
[274/2753] : && "/Applications/Xcode.app/Contents/Developer/Toolchains/XcodeDefault.xctoolchain/usr/bin/libtool" -static -no_warning_for_no_symbols -o lib/libLLVMWebAssemblyCodeGen.a  lib/Target/WebAssembly/CMakeFiles/LLVMWebAssemblyCodeGen.dir/WebAssemblyAddMissingPrototypes.cpp.o lib/Target/WebAssembly/CMakeFiles/LLVMWebAssemblyCodeGen.dir/WebAssemblyArgumentMove.cpp.o lib/Target/WebAssembly/CMakeFiles/LLVMWebAssemblyCodeGen.dir/WebAssemblyAsmPrinter.cpp.o lib/Target/WebAssembly/CMakeFiles/LLVMWebAssemblyCodeGen.dir/WebAssemblyCFGStackify.cpp.o lib/Target/WebAssembly/CMakeFiles/LLVMWebAssemblyCodeGen.dir/WebAssemblyCFGSort.cpp.o lib/Target/WebAssembly/CMakeFiles/LLVMWebAssemblyCodeGen.dir/WebAssemblyDebugFixup.cpp.o lib/Target/WebAssembly/CMakeFiles/LLVMWebAssemblyCodeGen.dir/WebAssemblyDebugValueManager.cpp.o lib/Target/WebAssembly/CMakeFiles/LLVMWebAssemblyCodeGen.dir/WebAssemblyLateEHPrepare.cpp.o lib/Target/WebAssembly/CMakeFiles/LLVMWebAssemblyCodeGen.dir/WebAssemblyExceptionInfo.cpp.o lib/Target/WebAssembly/CMakeFiles/LLVMWebAssemblyCodeGen.dir/WebAssemblyExplicitLocals.cpp.o lib/Target/WebAssembly/CMakeFiles/LLVMWebAssemblyCodeGen.dir/WebAssemblyFastISel.cpp.o lib/Target/WebAssembly/CMakeFiles/LLVMWebAssemblyCodeGen.dir/WebAssemblyFixBrTableDefaults.cpp.o lib/Target/WebAssembly/CMakeFiles/LLVMWebAssemblyCodeGen.dir/WebAssemblyFixIrreducibleControlFlow.cpp.o lib/Target/WebAssembly/CMakeFiles/LLVMWebAssemblyCodeGen.dir/WebAssemblyFixFunctionBitcasts.cpp.o lib/Target/WebAssembly/CMakeFiles/LLVMWebAssemblyCodeGen.dir/WebAssemblyFrameLowering.cpp.o lib/Target/WebAssembly/CMakeFiles/LLVMWebAssemblyCodeGen.dir/WebAssemblyISelDAGToDAG.cpp.o lib/Target/WebAssembly/CMakeFiles/LLVMWebAssemblyCodeGen.dir/WebAssemblyISelLowering.cpp.o lib/Target/WebAssembly/CMakeFiles/LLVMWebAssemblyCodeGen.dir/WebAssemblyInstrInfo.cpp.o lib/Target/WebAssembly/CMakeFiles/LLVMWebAssemblyCodeGen.dir/WebAssemblyLowerBrUnless.cpp.o lib/Target/WebAssembly/CMakeFiles/LLVMWebAssemblyCodeGen.dir/WebAssemblyLowerEmscriptenEHSjLj.cpp.o lib/Target/WebAssembly/CMakeFiles/LLVMWebAssemblyCodeGen.dir/WebAssemblyLowerGlobalDtors.cpp.o lib/Target/WebAssembly/CMakeFiles/LLVMWebAssemblyCodeGen.dir/WebAssemblyMachineFunctionInfo.cpp.o lib/Target/WebAssembly/CMakeFiles/LLVMWebAssemblyCodeGen.dir/WebAssemblyMCInstLower.cpp.o lib/Target/WebAssembly/CMakeFiles/LLVMWebAssemblyCodeGen.dir/WebAssemblyOptimizeLiveIntervals.cpp.o lib/Target/WebAssembly/CMakeFiles/LLVMWebAssemblyCodeGen.dir/WebAssemblyOptimizeReturned.cpp.o lib/Target/WebAssembly/CMakeFiles/LLVMWebAssemblyCodeGen.dir/WebAssemblyPeephole.cpp.o lib/Target/WebAssembly/CMakeFiles/LLVMWebAssemblyCodeGen.dir/WebAssemblyPrepareForLiveIntervals.cpp.o lib/Target/WebAssembly/CMakeFiles/LLVMWebAssemblyCodeGen.dir/WebAssemblyRegisterInfo.cpp.o lib/Target/WebAssembly/CMakeFiles/LLVMWebAssemblyCodeGen.dir/WebAssemblyRegColoring.cpp.o lib/Target/WebAssembly/CMakeFiles/LLVMWebAssemblyCodeGen.dir/WebAssemblyRegNumbering.cpp.o lib/Target/WebAssembly/CMakeFiles/LLVMWebAssemblyCodeGen.dir/WebAssemblyRegStackify.cpp.o lib/Target/WebAssembly/CMakeFiles/LLVMWebAssemblyCodeGen.dir/WebAssemblyReplacePhysRegs.cpp.o lib/Target/WebAssembly/CMakeFiles/LLVMWebAssemblyCodeGen.dir/WebAssemblyRuntimeLibcallSignatures.cpp.o lib/Target/WebAssembly/CMakeFiles/LLVMWebAssemblyCodeGen.dir/WebAssemblySelectionDAGInfo.cpp.o lib/Target/WebAssembly/CMakeFiles/LLVMWebAssemblyCodeGen.dir/WebAssemblySetP2AlignOperands.cpp.o lib/Target/WebAssembly/CMakeFiles/LLVMWebAssemblyCodeGen.dir/WebAssemblySortRegion.cpp.o lib/Target/WebAssembly/CMakeFiles/LLVMWebAssemblyCodeGen.dir/WebAssemblyMemIntrinsicResults.cpp.o lib/Target/WebAssembly/CMakeFiles/LLVMWebAssemblyCodeGen.dir/WebAssemblySubtarget.cpp.o lib/Target/WebAssembly/CMakeFiles/LLVMWebAssemblyCodeGen.dir/WebAssemblyTargetMachine.cpp.o lib/Target/WebAssembly/CMakeFiles/LLVMWebAssemblyCodeGen.dir/WebAssemblyTargetObjectFile.cpp.o lib/Target/WebAssembly/CMakeFiles/LLVMWebAssemblyCodeGen.dir/WebAssemblyTargetTransformInfo.cpp.o lib/Target/WebAssembly/CMakeFiles/LLVMWebAssemblyCodeGen.dir/WebAssemblyUtilities.cpp.o && :
[275/2753] : && "/Applications/Xcode.app/Contents/Developer/Toolchains/XcodeDefault.xctoolchain/usr/bin/libtool" -static -no_warning_for_no_symbols -o lib/libLLVMLTO.a  lib/LTO/CMakeFiles/LLVMLTO.dir/Caching.cpp.o lib/LTO/CMakeFiles/LLVMLTO.dir/LTO.cpp.o lib/LTO/CMakeFiles/LLVMLTO.dir/LTOBackend.cpp.o lib/LTO/CMakeFiles/LLVMLTO.dir/LTOModule.cpp.o lib/LTO/CMakeFiles/LLVMLTO.dir/LTOCodeGenerator.cpp.o lib/LTO/CMakeFiles/LLVMLTO.dir/SummaryBasedOptimizations.cpp.o lib/LTO/CMakeFiles/LLVMLTO.dir/UpdateCompilerUsed.cpp.o lib/LTO/CMakeFiles/LLVMLTO.dir/ThinLTOCodeGenerator.cpp.o && :
[276/2753] : && "/Applications/Xcode.app/Contents/Developer/Toolchains/XcodeDefault.xctoolchain/usr/bin/libtool" -static -no_warning_for_no_symbols -o lib/libLLVMPowerPCCodeGen.a  lib/Target/PowerPC/CMakeFiles/LLVMPowerPCCodeGen.dir/GISel/PPCInstructionSelector.cpp.o lib/Target/PowerPC/CMakeFiles/LLVMPowerPCCodeGen.dir/PPCBoolRetToInt.cpp.o lib/Target/PowerPC/CMakeFiles/LLVMPowerPCCodeGen.dir/PPCAsmPrinter.cpp.o lib/Target/PowerPC/CMakeFiles/LLVMPowerPCCodeGen.dir/PPCBranchSelector.cpp.o lib/Target/PowerPC/CMakeFiles/LLVMPowerPCCodeGen.dir/PPCBranchCoalescing.cpp.o lib/Target/PowerPC/CMakeFiles/LLVMPowerPCCodeGen.dir/PPCCallingConv.cpp.o lib/Target/PowerPC/CMakeFiles/LLVMPowerPCCodeGen.dir/PPCCCState.cpp.o lib/Target/PowerPC/CMakeFiles/LLVMPowerPCCodeGen.dir/PPCCTRLoops.cpp.o lib/Target/PowerPC/CMakeFiles/LLVMPowerPCCodeGen.dir/PPCHazardRecognizers.cpp.o lib/Target/PowerPC/CMakeFiles/LLVMPowerPCCodeGen.dir/PPCInstrInfo.cpp.o lib/Target/PowerPC/CMakeFiles/LLVMPowerPCCodeGen.dir/PPCISelDAGToDAG.cpp.o lib/Target/PowerPC/CMakeFiles/LLVMPowerPCCodeGen.dir/PPCISelLowering.cpp.o lib/Target/PowerPC/CMakeFiles/LLVMPowerPCCodeGen.dir/PPCEarlyReturn.cpp.o lib/Target/PowerPC/CMakeFiles/LLVMPowerPCCodeGen.dir/PPCFastISel.cpp.o lib/Target/PowerPC/CMakeFiles/LLVMPowerPCCodeGen.dir/PPCFrameLowering.cpp.o lib/Target/PowerPC/CMakeFiles/LLVMPowerPCCodeGen.dir/PPCLoopInstrFormPrep.cpp.o lib/Target/PowerPC/CMakeFiles/LLVMPowerPCCodeGen.dir/PPCMCInstLower.cpp.o lib/Target/PowerPC/CMakeFiles/LLVMPowerPCCodeGen.dir/PPCMachineFunctionInfo.cpp.o lib/Target/PowerPC/CMakeFiles/LLVMPowerPCCodeGen.dir/PPCMachineScheduler.cpp.o lib/Target/PowerPC/CMakeFiles/LLVMPowerPCCodeGen.dir/PPCMacroFusion.cpp.o lib/Target/PowerPC/CMakeFiles/LLVMPowerPCCodeGen.dir/PPCMIPeephole.cpp.o lib/Target/PowerPC/CMakeFiles/LLVMPowerPCCodeGen.dir/PPCRegisterInfo.cpp.o lib/Target/PowerPC/CMakeFiles/LLVMPowerPCCodeGen.dir/PPCSubtarget.cpp.o lib/Target/PowerPC/CMakeFiles/LLVMPowerPCCodeGen.dir/PPCTargetMachine.cpp.o lib/Target/PowerPC/CMakeFiles/LLVMPowerPCCodeGen.dir/PPCTargetObjectFile.cpp.o lib/Target/PowerPC/CMakeFiles/LLVMPowerPCCodeGen.dir/PPCTargetTransformInfo.cpp.o lib/Target/PowerPC/CMakeFiles/LLVMPowerPCCodeGen.dir/PPCTOCRegDeps.cpp.o lib/Target/PowerPC/CMakeFiles/LLVMPowerPCCodeGen.dir/PPCTLSDynamicCall.cpp.o lib/Target/PowerPC/CMakeFiles/LLVMPowerPCCodeGen.dir/PPCVSXCopy.cpp.o lib/Target/PowerPC/CMakeFiles/LLVMPowerPCCodeGen.dir/PPCReduceCRLogicals.cpp.o lib/Target/PowerPC/CMakeFiles/LLVMPowerPCCodeGen.dir/PPCVSXFMAMutate.cpp.o lib/Target/PowerPC/CMakeFiles/LLVMPowerPCCodeGen.dir/PPCVSXSwapRemoval.cpp.o lib/Target/PowerPC/CMakeFiles/LLVMPowerPCCodeGen.dir/PPCExpandISEL.cpp.o lib/Target/PowerPC/CMakeFiles/LLVMPowerPCCodeGen.dir/PPCPreEmitPeephole.cpp.o lib/Target/PowerPC/CMakeFiles/LLVMPowerPCCodeGen.dir/PPCLowerMASSVEntries.cpp.o lib/Target/PowerPC/CMakeFiles/LLVMPowerPCCodeGen.dir/GISel/PPCCallLowering.cpp.o lib/Target/PowerPC/CMakeFiles/LLVMPowerPCCodeGen.dir/GISel/PPCRegisterBankInfo.cpp.o lib/Target/PowerPC/CMakeFiles/LLVMPowerPCCodeGen.dir/GISel/PPCLegalizerInfo.cpp.o && :
[277/2753] : && "/Applications/Xcode.app/Contents/Developer/Toolchains/XcodeDefault.xctoolchain/usr/bin/libtool" -static -no_warning_for_no_symbols -o lib/libLLVMHexagonCodeGen.a  lib/Target/Hexagon/CMakeFiles/LLVMHexagonCodeGen.dir/BitTracker.cpp.o lib/Target/Hexagon/CMakeFiles/LLVMHexagonCodeGen.dir/HexagonAsmPrinter.cpp.o lib/Target/Hexagon/CMakeFiles/LLVMHexagonCodeGen.dir/HexagonBitSimplify.cpp.o lib/Target/Hexagon/CMakeFiles/LLVMHexagonCodeGen.dir/HexagonBitTracker.cpp.o lib/Target/Hexagon/CMakeFiles/LLVMHexagonCodeGen.dir/HexagonBlockRanges.cpp.o lib/Target/Hexagon/CMakeFiles/LLVMHexagonCodeGen.dir/HexagonBranchRelaxation.cpp.o lib/Target/Hexagon/CMakeFiles/LLVMHexagonCodeGen.dir/HexagonCFGOptimizer.cpp.o lib/Target/Hexagon/CMakeFiles/LLVMHexagonCodeGen.dir/HexagonCommonGEP.cpp.o lib/Target/Hexagon/CMakeFiles/LLVMHexagonCodeGen.dir/HexagonConstExtenders.cpp.o lib/Target/Hexagon/CMakeFiles/LLVMHexagonCodeGen.dir/HexagonConstPropagation.cpp.o lib/Target/Hexagon/CMakeFiles/LLVMHexagonCodeGen.dir/HexagonCopyToCombine.cpp.o lib/Target/Hexagon/CMakeFiles/LLVMHexagonCodeGen.dir/HexagonEarlyIfConv.cpp.o lib/Target/Hexagon/CMakeFiles/LLVMHexagonCodeGen.dir/HexagonExpandCondsets.cpp.o lib/Target/Hexagon/CMakeFiles/LLVMHexagonCodeGen.dir/HexagonFixupHwLoops.cpp.o lib/Target/Hexagon/CMakeFiles/LLVMHexagonCodeGen.dir/HexagonFrameLowering.cpp.o lib/Target/Hexagon/CMakeFiles/LLVMHexagonCodeGen.dir/HexagonGenExtract.cpp.o lib/Target/Hexagon/CMakeFiles/LLVMHexagonCodeGen.dir/HexagonGenInsert.cpp.o lib/Target/Hexagon/CMakeFiles/LLVMHexagonCodeGen.dir/HexagonGenMux.cpp.o lib/Target/Hexagon/CMakeFiles/LLVMHexagonCodeGen.dir/HexagonGenPredicate.cpp.o lib/Target/Hexagon/CMakeFiles/LLVMHexagonCodeGen.dir/HexagonHardwareLoops.cpp.o lib/Target/Hexagon/CMakeFiles/LLVMHexagonCodeGen.dir/HexagonHazardRecognizer.cpp.o lib/Target/Hexagon/CMakeFiles/LLVMHexagonCodeGen.dir/HexagonInstrInfo.cpp.o lib/Target/Hexagon/CMakeFiles/LLVMHexagonCodeGen.dir/HexagonISelDAGToDAG.cpp.o lib/Target/Hexagon/CMakeFiles/LLVMHexagonCodeGen.dir/HexagonISelDAGToDAGHVX.cpp.o lib/Target/Hexagon/CMakeFiles/LLVMHexagonCodeGen.dir/HexagonISelLowering.cpp.o lib/Target/Hexagon/CMakeFiles/LLVMHexagonCodeGen.dir/HexagonISelLoweringHVX.cpp.o lib/Target/Hexagon/CMakeFiles/LLVMHexagonCodeGen.dir/HexagonLoopIdiomRecognition.cpp.o lib/Target/Hexagon/CMakeFiles/LLVMHexagonCodeGen.dir/HexagonMachineFunctionInfo.cpp.o lib/Target/Hexagon/CMakeFiles/LLVMHexagonCodeGen.dir/HexagonMachineScheduler.cpp.o lib/Target/Hexagon/CMakeFiles/LLVMHexagonCodeGen.dir/HexagonMCInstLower.cpp.o lib/Target/Hexagon/CMakeFiles/LLVMHexagonCodeGen.dir/HexagonNewValueJump.cpp.o lib/Target/Hexagon/CMakeFiles/LLVMHexagonCodeGen.dir/HexagonOptAddrMode.cpp.o lib/Target/Hexagon/CMakeFiles/LLVMHexagonCodeGen.dir/HexagonOptimizeSZextends.cpp.o lib/Target/Hexagon/CMakeFiles/LLVMHexagonCodeGen.dir/HexagonPeephole.cpp.o lib/Target/Hexagon/CMakeFiles/LLVMHexagonCodeGen.dir/HexagonRDFOpt.cpp.o lib/Target/Hexagon/CMakeFiles/LLVMHexagonCodeGen.dir/HexagonRegisterInfo.cpp.o lib/Target/Hexagon/CMakeFiles/LLVMHexagonCodeGen.dir/HexagonSelectionDAGInfo.cpp.o lib/Target/Hexagon/CMakeFiles/LLVMHexagonCodeGen.dir/HexagonSplitConst32AndConst64.cpp.o lib/Target/Hexagon/CMakeFiles/LLVMHexagonCodeGen.dir/HexagonSplitDouble.cpp.o lib/Target/Hexagon/CMakeFiles/LLVMHexagonCodeGen.dir/HexagonStoreWidening.cpp.o lib/Target/Hexagon/CMakeFiles/LLVMHexagonCodeGen.dir/HexagonSubtarget.cpp.o lib/Target/Hexagon/CMakeFiles/LLVMHexagonCodeGen.dir/HexagonTargetMachine.cpp.o lib/Target/Hexagon/CMakeFiles/LLVMHexagonCodeGen.dir/HexagonTargetObjectFile.cpp.o lib/Target/Hexagon/CMakeFiles/LLVMHexagonCodeGen.dir/HexagonTargetTransformInfo.cpp.o lib/Target/Hexagon/CMakeFiles/LLVMHexagonCodeGen.dir/HexagonVectorLoopCarriedReuse.cpp.o lib/Target/Hexagon/CMakeFiles/LLVMHexagonCodeGen.dir/HexagonVectorPrint.cpp.o lib/Target/Hexagon/CMakeFiles/LLVMHexagonCodeGen.dir/HexagonVExtract.cpp.o lib/Target/Hexagon/CMakeFiles/LLVMHexagonCodeGen.dir/HexagonVLIWPacketizer.cpp.o lib/Target/Hexagon/CMakeFiles/LLVMHexagonCodeGen.dir/RDFCopy.cpp.o lib/Target/Hexagon/CMakeFiles/LLVMHexagonCodeGen.dir/RDFDeadCode.cpp.o && :
[278/2753] : && "/Applications/Xcode.app/Contents/Developer/Toolchains/XcodeDefault.xctoolchain/usr/bin/libtool" -static -no_warning_for_no_symbols -o lib/libLLVMX86CodeGen.a  lib/Target/X86/CMakeFiles/LLVMX86CodeGen.dir/X86AsmPrinter.cpp.o lib/Target/X86/CMakeFiles/LLVMX86CodeGen.dir/X86AvoidTrailingCall.cpp.o lib/Target/X86/CMakeFiles/LLVMX86CodeGen.dir/X86CallFrameOptimization.cpp.o lib/Target/X86/CMakeFiles/LLVMX86CodeGen.dir/X86CallingConv.cpp.o lib/Target/X86/CMakeFiles/LLVMX86CodeGen.dir/X86CallLowering.cpp.o lib/Target/X86/CMakeFiles/LLVMX86CodeGen.dir/X86CmovConversion.cpp.o lib/Target/X86/CMakeFiles/LLVMX86CodeGen.dir/X86DomainReassignment.cpp.o lib/Target/X86/CMakeFiles/LLVMX86CodeGen.dir/X86DiscriminateMemOps.cpp.o lib/Target/X86/CMakeFiles/LLVMX86CodeGen.dir/X86ExpandPseudo.cpp.o lib/Target/X86/CMakeFiles/LLVMX86CodeGen.dir/X86FastISel.cpp.o lib/Target/X86/CMakeFiles/LLVMX86CodeGen.dir/X86FixupBWInsts.cpp.o lib/Target/X86/CMakeFiles/LLVMX86CodeGen.dir/X86FixupLEAs.cpp.o lib/Target/X86/CMakeFiles/LLVMX86CodeGen.dir/X86AvoidStoreForwardingBlocks.cpp.o lib/Target/X86/CMakeFiles/LLVMX86CodeGen.dir/X86FixupSetCC.cpp.o lib/Target/X86/CMakeFiles/LLVMX86CodeGen.dir/X86FlagsCopyLowering.cpp.o lib/Target/X86/CMakeFiles/LLVMX86CodeGen.dir/X86FloatingPoint.cpp.o lib/Target/X86/CMakeFiles/LLVMX86CodeGen.dir/X86FrameLowering.cpp.o lib/Target/X86/CMakeFiles/LLVMX86CodeGen.dir/X86InstructionSelector.cpp.o lib/Target/X86/CMakeFiles/LLVMX86CodeGen.dir/X86ISelDAGToDAG.cpp.o lib/Target/X86/CMakeFiles/LLVMX86CodeGen.dir/X86ISelLowering.cpp.o lib/Target/X86/CMakeFiles/LLVMX86CodeGen.dir/X86IndirectBranchTracking.cpp.o lib/Target/X86/CMakeFiles/LLVMX86CodeGen.dir/X86IndirectThunks.cpp.o lib/Target/X86/CMakeFiles/LLVMX86CodeGen.dir/X86InterleavedAccess.cpp.o lib/Target/X86/CMakeFiles/LLVMX86CodeGen.dir/X86InsertPrefetch.cpp.o lib/Target/X86/CMakeFiles/LLVMX86CodeGen.dir/X86InstCombineIntrinsic.cpp.o lib/Target/X86/CMakeFiles/LLVMX86CodeGen.dir/X86InstrFMA3Info.cpp.o lib/Target/X86/CMakeFiles/LLVMX86CodeGen.dir/X86InstrFoldTables.cpp.o lib/Target/X86/CMakeFiles/LLVMX86CodeGen.dir/X86InstrInfo.cpp.o lib/Target/X86/CMakeFiles/LLVMX86CodeGen.dir/X86EvexToVex.cpp.o lib/Target/X86/CMakeFiles/LLVMX86CodeGen.dir/X86LegalizerInfo.cpp.o lib/Target/X86/CMakeFiles/LLVMX86CodeGen.dir/X86LoadValueInjectionLoadHardening.cpp.o lib/Target/X86/CMakeFiles/LLVMX86CodeGen.dir/X86LoadValueInjectionRetHardening.cpp.o lib/Target/X86/CMakeFiles/LLVMX86CodeGen.dir/X86MCInstLower.cpp.o lib/Target/X86/CMakeFiles/LLVMX86CodeGen.dir/X86MachineFunctionInfo.cpp.o lib/Target/X86/CMakeFiles/LLVMX86CodeGen.dir/X86MacroFusion.cpp.o lib/Target/X86/CMakeFiles/LLVMX86CodeGen.dir/X86OptimizeLEAs.cpp.o lib/Target/X86/CMakeFiles/LLVMX86CodeGen.dir/X86PadShortFunction.cpp.o lib/Target/X86/CMakeFiles/LLVMX86CodeGen.dir/X86PartialReduction.cpp.o lib/Target/X86/CMakeFiles/LLVMX86CodeGen.dir/X86RegisterBankInfo.cpp.o lib/Target/X86/CMakeFiles/LLVMX86CodeGen.dir/X86RegisterInfo.cpp.o lib/Target/X86/CMakeFiles/LLVMX86CodeGen.dir/X86SelectionDAGInfo.cpp.o lib/Target/X86/CMakeFiles/LLVMX86CodeGen.dir/X86ShuffleDecodeConstantPool.cpp.o lib/Target/X86/CMakeFiles/LLVMX86CodeGen.dir/X86SpeculativeLoadHardening.cpp.o lib/Target/X86/CMakeFiles/LLVMX86CodeGen.dir/X86SpeculativeExecutionSideEffectSuppression.cpp.o lib/Target/X86/CMakeFiles/LLVMX86CodeGen.dir/X86Subtarget.cpp.o lib/Target/X86/CMakeFiles/LLVMX86CodeGen.dir/X86TargetMachine.cpp.o lib/Target/X86/CMakeFiles/LLVMX86CodeGen.dir/X86TargetObjectFile.cpp.o lib/Target/X86/CMakeFiles/LLVMX86CodeGen.dir/X86TargetTransformInfo.cpp.o lib/Target/X86/CMakeFiles/LLVMX86CodeGen.dir/X86VZeroUpper.cpp.o lib/Target/X86/CMakeFiles/LLVMX86CodeGen.dir/X86WinAllocaExpander.cpp.o lib/Target/X86/CMakeFiles/LLVMX86CodeGen.dir/X86WinEHState.cpp.o lib/Target/X86/CMakeFiles/LLVMX86CodeGen.dir/X86InsertWait.cpp.o && :
[279/2753] : && /Users/buildslave/jenkins/workspace/lldb-cmake/host-compiler/bin/clang++  -Wdocumentation -fPIC -fvisibility-inlines-hidden -Werror=date-time -Werror=unguarded-availability-new -fmodules -fmodules-cache-path=/Users/buildslave/jenkins/workspace/lldb-cmake/lldb-build/module.cache -fcxx-modules -Xclang -fmodules-local-submodule-visibility -Wall -Wextra -Wno-unused-parameter -Wwrite-strings -Wcast-qual -Wmissing-field-initializers -pedantic -Wno-long-long -Wimplicit-fallthrough -Wcovered-switch-default -Wno-noexcept-type -Wnon-virtual-dtor -Wdelete-non-virtual-dtor -Wsuggest-override -Wstring-conversion -fdiagnostics-color -O3  -isysroot /Applications/Xcode.app/Contents/Developer/Platforms/MacOSX.platform/Developer/SDKs/MacOSX10.15.sdk -Wl,-search_paths_first -Wl,-headerpad_max_install_names -Wl,-dead_strip tools/llvm-dwarfdump/CMakeFiles/llvm-dwarfdump.dir/SectionSizes.cpp.o tools/llvm-dwarfdump/CMakeFiles/llvm-dwarfdump.dir/Statistics.cpp.o tools/llvm-dwarfdump/CMakeFiles/llvm-dwarfdump.dir/llvm-dwarfdump.cpp.o  -o bin/llvm-dwarfdump  -Wl,-rpath,@loader_path/../lib  lib/libLLVMDebugInfoDWARF.a  lib/libLLVMAArch64Desc.a  lib/libLLVMAMDGPUDesc.a  lib/libLLVMARMDesc.a  lib/libLLVMAVRDesc.a  lib/libLLVMBPFDesc.a  lib/libLLVMHexagonDesc.a  lib/libLLVMLanaiDesc.a  lib/libLLVMMipsDesc.a  lib/libLLVMMSP430Desc.a  lib/libLLVMNVPTXDesc.a  lib/libLLVMPowerPCDesc.a  lib/libLLVMRISCVDesc.a  lib/libLLVMSparcDesc.a  lib/libLLVMSystemZDesc.a  lib/libLLVMWebAssemblyDesc.a  lib/libLLVMX86Desc.a  lib/libLLVMXCoreDesc.a  lib/libLLVMAArch64Info.a  lib/libLLVMAMDGPUInfo.a  lib/libLLVMARMInfo.a  lib/libLLVMAVRInfo.a  lib/libLLVMBPFInfo.a  lib/libLLVMHexagonInfo.a  lib/libLLVMLanaiInfo.a  lib/libLLVMMipsInfo.a  lib/libLLVMMSP430Info.a  lib/libLLVMNVPTXInfo.a  lib/libLLVMPowerPCInfo.a  lib/libLLVMRISCVInfo.a  lib/libLLVMSparcInfo.a  lib/libLLVMSystemZInfo.a  lib/libLLVMWebAssemblyInfo.a  lib/libLLVMX86Info.a  lib/libLLVMXCoreInfo.a  lib/libLLVMMC.a  lib/libLLVMObject.a  lib/libLLVMSupport.a  lib/libLLVMBitReader.a  lib/libLLVMMCParser.a  lib/libLLVMTextAPI.a  lib/libLLVMAArch64Utils.a  lib/libLLVMAMDGPUUtils.a  lib/libLLVMCore.a  lib/libLLVMRemarks.a  lib/libLLVMBitstreamReader.a  lib/libLLVMARMUtils.a  lib/libLLVMRISCVUtils.a  lib/libLLVMMCDisassembler.a  lib/libLLVMMC.a  lib/libLLVMBinaryFormat.a  lib/libLLVMDebugInfoCodeView.a  lib/libLLVMDebugInfoMSF.a  lib/libLLVMSupport.a  -lm  /usr/lib/libz.dylib  /usr/lib/libcurses.dylib  lib/libLLVMDemangle.a && :
[280/2753] /Users/buildslave/jenkins/workspace/lldb-cmake/host-compiler/bin/clang++  -DHAVE_RPC_XDR_H=0 -D_DEBUG -D__STDC_CONSTANT_MACROS -D__STDC_FORMAT_MACROS -D__STDC_LIMIT_MACROS -Iprojects/compiler-rt/lib/sanitizer_common -I/Users/buildslave/jenkins/workspace/lldb-cmake/llvm-project/compiler-rt/lib/sanitizer_common -Iinclude -I/Users/buildslave/jenkins/workspace/lldb-cmake/llvm-project/llvm/include -I/Users/buildslave/jenkins/workspace/lldb-cmake/llvm-project/compiler-rt/lib/sanitizer_common/.. -Wdocumentation -fPIC -fvisibility-inlines-hidden -Werror=date-time -Werror=unguarded-availability-new -fmodules -fmodules-cache-path=/Users/buildslave/jenkins/workspace/lldb-cmake/lldb-build/module.cache -fcxx-modules -Xclang -fmodules-local-submodule-visibility -Wall -Wextra -Wno-unused-parameter -Wwrite-strings -Wcast-qual -Wmissing-field-initializers -pedantic -Wno-long-long -Wimplicit-fallthrough -Wcovered-switch-default -Wno-noexcept-type -Wnon-virtual-dtor -Wdelete-non-virtual-dtor -Wsuggest-override -Wstring-conversion -fdiagnostics-color -Wall -std=c++14 -Wno-unused-parameter -O3  -arch armv7 -arch armv7s -arch arm64 -arch armv7k -isysroot /Applications/Xcode.app/Contents/Developer/Platforms/MacOSX.platform/Developer/SDKs/MacOSX10.15.sdk    -stdlib=libc++ -miphoneos-version-min=9.0 -isysroot /Applications/Xcode.app/Contents/Developer/Platforms/iPhoneOS.platform/Developer/SDKs/iPhoneOS13.5.sdk -fPIC -fno-builtin -fno-exceptions -funwind-tables -fno-stack-protector -fno-sanitize=safe-stack -fvisibility=hidden -fno-lto -O3 -gline-tables-only -fno-modules -Wno-gnu -Wno-variadic-macros -Wno-c99-extensions -Wno-non-virtual-dtor -fno-rtti -Wframe-larger-than=570 -Wglobal-constructors -DSANITIZER_SUPPORTS_WEAK_HOOKS=0 -UNDEBUG -std=c++14 -MD -MT projects/compiler-rt/lib/sanitizer_common/CMakeFiles/RTSanitizerCommonSymbolizerNoHooks.ios.dir/sanitizer_symbolizer_posix_libcdep.cpp.o -MF projects/compiler-rt/lib/sanitizer_common/CMakeFiles/RTSanitizerCommonSymbolizerNoHooks.ios.dir/sanitizer_symbolizer_posix_libcdep.cpp.o.d -o projects/compiler-rt/lib/sanitizer_common/CMakeFiles/RTSanitizerCommonSymbolizerNoHooks.ios.dir/sanitizer_symbolizer_posix_libcdep.cpp.o -c /Users/buildslave/jenkins/workspace/lldb-cmake/llvm-project/compiler-rt/lib/sanitizer_common/sanitizer_symbolizer_posix_libcdep.cpp
clang-12: warning: argument unused during compilation: '-fmodules-cache-path=/Users/buildslave/jenkins/workspace/lldb-cmake/lldb-build/module.cache' [-Wunused-command-line-argument]
clang-12: warning: argument unused during compilation: '-fcxx-modules' [-Wunused-command-line-argument]
[281/2753] : && /Users/buildslave/jenkins/workspace/lldb-cmake/host-compiler/bin/clang++  -Wdocumentation -fPIC -fvisibility-inlines-hidden -Werror=date-time -Werror=unguarded-availability-new -fmodules -fmodules-cache-path=/Users/buildslave/jenkins/workspace/lldb-cmake/lldb-build/module.cache -fcxx-modules -Xclang -fmodules-local-submodule-visibility -Wall -Wextra -Wno-unused-parameter -Wwrite-strings -Wcast-qual -Wmissing-field-initializers -pedantic -Wno-long-long -Wimplicit-fallthrough -Wcovered-switch-default -Wno-noexcept-type -Wnon-virtual-dtor -Wdelete-non-virtual-dtor -Wsuggest-override -Wstring-conversion -fdiagnostics-color -O3  -isysroot /Applications/Xcode.app/Contents/Developer/Platforms/MacOSX.platform/Developer/SDKs/MacOSX10.15.sdk -Wl,-search_paths_first -Wl,-headerpad_max_install_names -Wl,-dead_strip tools/llvm-cfi-verify/CMakeFiles/llvm-cfi-verify.dir/llvm-cfi-verify.cpp.o  -o bin/llvm-cfi-verify  -Wl,-rpath,@loader_path/../lib  lib/libLLVMAArch64AsmParser.a  lib/libLLVMAMDGPUAsmParser.a  lib/libLLVMARMAsmParser.a  lib/libLLVMAVRAsmParser.a  lib/libLLVMBPFAsmParser.a  lib/libLLVMHexagonAsmParser.a  lib/libLLVMLanaiAsmParser.a  lib/libLLVMMipsAsmParser.a  lib/libLLVMMSP430AsmParser.a  lib/libLLVMPowerPCAsmParser.a  lib/libLLVMRISCVAsmParser.a  lib/libLLVMSparcAsmParser.a  lib/libLLVMSystemZAsmParser.a  lib/libLLVMWebAssemblyAsmParser.a  lib/libLLVMX86AsmParser.a  lib/libLLVMAArch64Desc.a  lib/libLLVMAMDGPUDesc.a  lib/libLLVMARMDesc.a  lib/libLLVMAVRDesc.a  lib/libLLVMBPFDesc.a  lib/libLLVMHexagonDesc.a  lib/libLLVMLanaiDesc.a  lib/libLLVMMipsDesc.a  lib/libLLVMMSP430Desc.a  lib/libLLVMNVPTXDesc.a  lib/libLLVMPowerPCDesc.a  lib/libLLVMRISCVDesc.a  lib/libLLVMSparcDesc.a  lib/libLLVMSystemZDesc.a  lib/libLLVMWebAssemblyDesc.a  lib/libLLVMX86Desc.a  lib/libLLVMXCoreDesc.a  lib/libLLVMAArch64Disassembler.a  lib/libLLVMAMDGPUDisassembler.a  lib/libLLVMARMDisassembler.a  lib/libLLVMAVRDisassembler.a  lib/libLLVMBPFDisassembler.a  lib/libLLVMHexagonDisassembler.a  lib/libLLVMLanaiDisassembler.a  lib/libLLVMMipsDisassembler.a  lib/libLLVMMSP430Disassembler.a  lib/libLLVMPowerPCDisassembler.a  lib/libLLVMRISCVDisassembler.a  lib/libLLVMSparcDisassembler.a  lib/libLLVMSystemZDisassembler.a  lib/libLLVMWebAssemblyDisassembler.a  lib/libLLVMX86Disassembler.a  lib/libLLVMXCoreDisassembler.a  lib/libLLVMAArch64Info.a  lib/libLLVMAMDGPUInfo.a  lib/libLLVMARMInfo.a  lib/libLLVMAVRInfo.a  lib/libLLVMBPFInfo.a  lib/libLLVMHexagonInfo.a  lib/libLLVMLanaiInfo.a  lib/libLLVMMipsInfo.a  lib/libLLVMMSP430Info.a  lib/libLLVMNVPTXInfo.a  lib/libLLVMPowerPCInfo.a  lib/libLLVMRISCVInfo.a  lib/libLLVMSparcInfo.a  lib/libLLVMSystemZInfo.a  lib/libLLVMWebAssemblyInfo.a  lib/libLLVMX86Info.a  lib/libLLVMXCoreInfo.a  lib/libLLVMMC.a  lib/libLLVMMCParser.a  lib/libLLVMObject.a  lib/libLLVMSupport.a  lib/libLLVMSymbolize.a  lib/libLLVMCFIVerify.a  lib/libLLVMRISCVUtils.a  lib/libLLVMAArch64Desc.a  lib/libLLVMAArch64Info.a  lib/libLLVMAArch64Utils.a  lib/libLLVMAMDGPUDesc.a  lib/libLLVMAMDGPUInfo.a  lib/libLLVMAMDGPUUtils.a  lib/libLLVMARMDesc.a  lib/libLLVMARMInfo.a  lib/libLLVMARMUtils.a  lib/libLLVMHexagonDesc.a  lib/libLLVMHexagonInfo.a  lib/libLLVMLanaiDesc.a  lib/libLLVMLanaiInfo.a  lib/libLLVMSystemZDesc.a  lib/libLLVMSystemZInfo.a  lib/libLLVMWebAssemblyDesc.a  lib/libLLVMWebAssemblyInfo.a  lib/libLLVMMCDisassembler.a  lib/libLLVMSymbolize.a  lib/libLLVMDebugInfoPDB.a  lib/libLLVMDebugInfoDWARF.a  lib/libLLVMObject.a  lib/libLLVMMCParser.a  lib/libLLVMMC.a  lib/libLLVMDebugInfoCodeView.a  lib/libLLVMDebugInfoMSF.a  lib/libLLVMBitReader.a  lib/libLLVMCore.a  lib/libLLVMRemarks.a  lib/libLLVMBitstreamReader.a  lib/libLLVMTextAPI.a  lib/libLLVMBinaryFormat.a  lib/libLLVMSupport.a  -lm  /usr/lib/libz.dylib  /usr/lib/libcurses.dylib  lib/libLLVMDemangle.a && :
ninja: build stopped: subcommand failed.
Command failed: Command '['/usr/local/bin/ninja', '-v']' returned non-zero exit status 1
Command: ['/usr/local/bin/ninja', '-v']
+ echo 'Retrying. debuginfo-tests may have failed due to high load.'
Retrying. debuginfo-tests may have failed due to high load.
+ sleep 30
+ python llvm-zorg/zorg/jenkins/monorepo_build.py lldb-cmake build --assertions '--projects=clang;libcxx;libcxxabi;compiler-rt;lld;lldb;debuginfo-tests' --compiler-flag=-Wdocumentation --cmake-type=Release
You are using pip version 18.1, however version 20.2.3 is available.
You should consider upgrading via the 'pip install --upgrade pip' command.
You are using pip version 18.1, however version 20.2.3 is available.
You should consider upgrading via the 'pip install --upgrade pip' command.
Dependency met os_version v10.15.5
Dependency met brew cmake v3.17.2
Dependency met brew ninja v1.8.2
Dependency met pip psutil v5.4.5
Dependency met pip six v1.11.0
Dependency met xcode v11.5
Clean

Hide Details

@@@ Clean @@@ Removing module cache: /Users/buildslave/jenkins/workspace/lldb-cmake/lldb-build/module.cache Completed at: 2020-10-01T09:24:14 @@@@@@
Cmake

Hide Details

@@@ Cmake @@@ cd /Users/buildslave/jenkins/workspace/lldb-cmake/lldb-build '/usr/local/bin/cmake' '-G' 'Ninja' '/Users/buildslave/jenkins/workspace/lldb-cmake/llvm-project/llvm' '-DCMAKE_BUILD_TYPE=Release' '-DCMAKE_EXPORT_COMPILE_COMMANDS=ON' '-DCMAKE_INSTALL_PREFIX=/Users/buildslave/jenkins/workspace/lldb-cmake/lldb-install' '-DCMAKE_MAKE_PROGRAM=/usr/local/bin/ninja' '-DLLDB_TEST_USER_ARGS=--arch;x86_64;--build-dir;/Users/buildslave/jenkins/workspace/lldb-cmake/lldb-build/lldb-test-build.noindex;-s=/Users/buildslave/jenkins/workspace/lldb-cmake/test/logs;-t;--env;TERM=vt100' '-DLLDB_ENABLE_PYTHON=On' '-DLLVM_ENABLE_ASSERTIONS:BOOL=TRUE' '-DLLVM_ENABLE_MODULES=On' '-DLLVM_ENABLE_PROJECTS=clang;libcxx;libcxxabi;compiler-rt;lld;lldb;debuginfo-tests' '-DLLVM_LIT_ARGS=-v --time-tests --shuffle --xunit-xml-output=/Users/buildslave/jenkins/workspace/lldb-cmake/test/results.xml -v -j 4' '-DLLVM_VERSION_PATCH=99' '-DCMAKE_C_FLAGS=-Wdocumentation' '-DCMAKE_CXX_FLAGS=-Wdocumentation' '-DCMAKE_C_COMPILER=/Users/buildslave/jenkins/workspace/lldb-cmake/host-compiler/bin/clang' '-DCMAKE_CXX_COMPILER=/Users/buildslave/jenkins/workspace/lldb-cmake/host-compiler/bin/clang++' -- clang project is enabled -- clang-tools-extra project is disabled -- compiler-rt project is enabled -- debuginfo-tests project is enabled -- libc project is disabled -- libclc project is disabled -- libcxx project is enabled -- libcxxabi project is enabled -- libunwind project is disabled -- lld project is enabled -- lldb project is enabled -- mlir project is disabled -- openmp project is disabled -- parallel-libs project is disabled -- polly project is disabled -- pstl project is disabled -- flang project is disabled -- Found libtool - /Applications/Xcode.app/Contents/Developer/Toolchains/XcodeDefault.xctoolchain/usr/bin/libtool -- Found LibXml2: /usr/lib/libxml2.dylib (found version "2.9.4") -- Native target architecture is X86 -- Threads enabled. -- Doxygen disabled. -- Go bindings disabled. -- Ninja version: 1.8.2 -- Found ld64 - /Applications/Xcode.app/Contents/Developer/Toolchains/XcodeDefault.xctoolchain/usr/bin/ld -- Could NOT find OCaml (missing: OCAMLFIND OCAML_VERSION OCAML_STDLIB_PATH) -- Could NOT find OCaml (missing: OCAMLFIND OCAML_VERSION OCAML_STDLIB_PATH) -- OCaml bindings disabled. -- LLVM host triple: x86_64-apple-darwin19.5.0 -- LLVM default target triple: x86_64-apple-darwin19.5.0 -- Building with -fPIC -- Found Python3: /usr/local/Frameworks/Python.framework/Versions/3.7/bin/python3.7 (found version "3.7.1") found components: Interpreter -- Constructing LLVMBuild project information -- Targeting AArch64 -- Targeting AMDGPU -- Targeting ARM -- Targeting AVR -- Targeting BPF -- Targeting Hexagon -- Targeting Lanai -- Targeting Mips -- Targeting MSP430 -- Targeting NVPTX -- Targeting PowerPC -- Targeting RISCV -- Targeting Sparc -- Targeting SystemZ -- Targeting WebAssembly -- Targeting X86 -- Targeting XCore -- Libc++abi will be using libc++ includes from /Users/buildslave/jenkins/workspace/lldb-cmake/llvm-project/libcxxabi/../libcxx/include -- Could not find CrashReporterClient, not linking against it -- Could not find ParallelSTL, libc++abi will not attempt to use it but the build may fail if the libc++ in use needs it to be available. -- Looking for cxxabi.h in /Users/buildslave/jenkins/workspace/lldb-cmake/llvm-project/libcxx/../libcxxabi/include -- Looking for cxxabi.h in /Users/buildslave/jenkins/workspace/lldb-cmake/llvm-project/libcxx/../libcxxabi/include - found -- Looking for __cxxabi_config.h in /Users/buildslave/jenkins/workspace/lldb-cmake/llvm-project/libcxx/../libcxxabi/include -- Looking for __cxxabi_config.h in /Users/buildslave/jenkins/workspace/lldb-cmake/llvm-project/libcxx/../libcxxabi/include - found -- Found OSX_SYSROOT: /Applications/Xcode.app/Contents/Developer/Platforms/MacOSX.platform/Developer/SDKs/MacOSX10.15.sdk -- Got ld supported ARCHES: armv6 armv7 armv7s arm64 arm64e arm64_32 i386 x86_64 x86_64h armv6m armv7k armv7m armv7em -- Toolchain supported arches: armv6;armv7;armv7s;arm64;arm64e;arm64_32;i386;x86_64;x86_64h;armv6m;armv7k;armv7m;armv7em -- Using cached valid architectures for osx. -- OSX supported arches: x86_64;x86_64h -- Using cached valid architectures for iossim. -- ios Simulator supported arches: i386;x86_64 -- Using cached valid architectures for ios. -- ios supported arches: armv6;armv7;armv7s;arm64;armv7k -- Compiler-RT supported architectures: x86_64;x86_64h;i386;armv6;armv7;armv7s;arm64;armv7k -- No arm64 support in /Applications/Xcode.app/Contents/Developer/Platforms/MacOSX.platform/Developer/SDKs/MacOSX10.15.sdk/SDKSettings.plist -- No arm64e support in /Applications/Xcode.app/Contents/Developer/Platforms/MacOSX.platform/Developer/SDKs/MacOSX10.15.sdk/SDKSettings.plist -- Using cached valid architectures for osx. -- OSX supported builtin arches: i386;x86_64;x86_64h -- Using cached valid architectures for iossim. -- ios Simulator supported builtin arches: i386;x86_64 -- Using cached valid architectures for ios. -- ios supported builtin arches: arm64;armv7;armv7k;armv7s -- Builtin supported architectures: i386;x86_64;x86_64h;armv7;armv7k;armv7s;arm64 -- For osx_i386 builtins preferring i386/fp_mode.c to fp_mode.c -- For osx_i386 builtins preferring i386/ashldi3.S to ashldi3.c -- For osx_i386 builtins preferring i386/ashrdi3.S to ashrdi3.c -- For osx_i386 builtins preferring i386/divdi3.S to divdi3.c -- For osx_i386 builtins preferring i386/floatdidf.S to floatdidf.c -- For osx_i386 builtins preferring i386/floatdisf.S to floatdisf.c -- For osx_i386 builtins preferring i386/floatundidf.S to floatundidf.c -- For osx_i386 builtins preferring i386/floatundisf.S to floatundisf.c -- For osx_i386 builtins preferring i386/lshrdi3.S to lshrdi3.c -- For osx_i386 builtins preferring i386/moddi3.S to moddi3.c -- For osx_i386 builtins preferring i386/muldi3.S to muldi3.c -- For osx_i386 builtins preferring i386/udivdi3.S to udivdi3.c -- For osx_i386 builtins preferring i386/umoddi3.S to umoddi3.c -- For osx_i386 builtins preferring i386/floatdixf.S to floatdixf.c -- For osx_i386 builtins preferring i386/floatundixf.S to floatundixf.c -- For osx_x86_64 builtins preferring i386/fp_mode.c to fp_mode.c -- For osx_x86_64 builtins preferring x86_64/floatdidf.c to floatdidf.c -- For osx_x86_64 builtins preferring x86_64/floatdisf.c to floatdisf.c -- For osx_x86_64 builtins preferring x86_64/floatundidf.S to floatundidf.c -- For osx_x86_64 builtins preferring x86_64/floatundisf.S to floatundisf.c -- For osx_x86_64 builtins preferring x86_64/floatdixf.c to floatdixf.c -- For osx_x86_64 builtins preferring x86_64/floatundixf.S to floatundixf.c -- For osx_x86_64h builtins preferring i386/fp_mode.c to fp_mode.c -- For osx_x86_64h builtins preferring x86_64/floatdidf.c to floatdidf.c -- For osx_x86_64h builtins preferring x86_64/floatdisf.c to floatdisf.c -- For osx_x86_64h builtins preferring x86_64/floatundidf.S to floatundidf.c -- For osx_x86_64h builtins preferring x86_64/floatundisf.S to floatundisf.c -- For osx_x86_64h builtins preferring x86_64/floatdixf.c to floatdixf.c -- For osx_x86_64h builtins preferring x86_64/floatundixf.S to floatundixf.c -- For cc_kext_osx_i386 builtins preferring i386/fp_mode.c to fp_mode.c -- For cc_kext_osx_i386 builtins preferring i386/ashldi3.S to ashldi3.c -- For cc_kext_osx_i386 builtins preferring i386/ashrdi3.S to ashrdi3.c -- For cc_kext_osx_i386 builtins preferring i386/divdi3.S to divdi3.c -- For cc_kext_osx_i386 builtins preferring i386/floatdidf.S to floatdidf.c -- For cc_kext_osx_i386 builtins preferring i386/floatdisf.S to floatdisf.c -- For cc_kext_osx_i386 builtins preferring i386/floatundidf.S to floatundidf.c -- For cc_kext_osx_i386 builtins preferring i386/floatundisf.S to floatundisf.c -- For cc_kext_osx_i386 builtins preferring i386/lshrdi3.S to lshrdi3.c -- For cc_kext_osx_i386 builtins preferring i386/moddi3.S to moddi3.c -- For cc_kext_osx_i386 builtins preferring i386/muldi3.S to muldi3.c -- For cc_kext_osx_i386 builtins preferring i386/udivdi3.S to udivdi3.c -- For cc_kext_osx_i386 builtins preferring i386/umoddi3.S to umoddi3.c -- For cc_kext_osx_i386 builtins preferring i386/floatdixf.S to floatdixf.c -- For cc_kext_osx_i386 builtins preferring i386/floatundixf.S to floatundixf.c -- For cc_kext_osx_x86_64 builtins preferring i386/fp_mode.c to fp_mode.c -- For cc_kext_osx_x86_64 builtins preferring x86_64/floatdidf.c to floatdidf.c -- For cc_kext_osx_x86_64 builtins preferring x86_64/floatdisf.c to floatdisf.c -- For cc_kext_osx_x86_64 builtins preferring x86_64/floatundidf.S to floatundidf.c -- For cc_kext_osx_x86_64 builtins preferring x86_64/floatundisf.S to floatundisf.c -- For cc_kext_osx_x86_64 builtins preferring x86_64/floatdixf.c to floatdixf.c -- For cc_kext_osx_x86_64 builtins preferring x86_64/floatundixf.S to floatundixf.c -- For cc_kext_osx_x86_64h builtins preferring i386/fp_mode.c to fp_mode.c -- For cc_kext_osx_x86_64h builtins preferring x86_64/floatdidf.c to floatdidf.c -- For cc_kext_osx_x86_64h builtins preferring x86_64/floatdisf.c to floatdisf.c -- For cc_kext_osx_x86_64h builtins preferring x86_64/floatundidf.S to floatundidf.c -- For cc_kext_osx_x86_64h builtins preferring x86_64/floatundisf.S to floatundisf.c -- For cc_kext_osx_x86_64h builtins preferring x86_64/floatdixf.c to floatdixf.c -- For cc_kext_osx_x86_64h builtins preferring x86_64/floatundixf.S to floatundixf.c -- For iossim_i386 builtins preferring i386/fp_mode.c to fp_mode.c -- For iossim_i386 builtins preferring i386/ashldi3.S to ashldi3.c -- For iossim_i386 builtins preferring i386/ashrdi3.S to ashrdi3.c -- For iossim_i386 builtins preferring i386/divdi3.S to divdi3.c -- For iossim_i386 builtins preferring i386/floatdidf.S to floatdidf.c -- For iossim_i386 builtins preferring i386/floatdisf.S to floatdisf.c -- For iossim_i386 builtins preferring i386/floatundidf.S to floatundidf.c -- For iossim_i386 builtins preferring i386/floatundisf.S to floatundisf.c -- For iossim_i386 builtins preferring i386/lshrdi3.S to lshrdi3.c -- For iossim_i386 builtins preferring i386/moddi3.S to moddi3.c -- For iossim_i386 builtins preferring i386/muldi3.S to muldi3.c -- For iossim_i386 builtins preferring i386/udivdi3.S to udivdi3.c -- For iossim_i386 builtins preferring i386/umoddi3.S to umoddi3.c -- For iossim_i386 builtins preferring i386/floatdixf.S to floatdixf.c -- For iossim_i386 builtins preferring i386/floatundixf.S to floatundixf.c -- For iossim_x86_64 builtins preferring i386/fp_mode.c to fp_mode.c -- For iossim_x86_64 builtins preferring x86_64/floatdidf.c to floatdidf.c -- For iossim_x86_64 builtins preferring x86_64/floatdisf.c to floatdisf.c -- For iossim_x86_64 builtins preferring x86_64/floatundidf.S to floatundidf.c -- For iossim_x86_64 builtins preferring x86_64/floatundisf.S to floatundisf.c -- For iossim_x86_64 builtins preferring x86_64/floatdixf.c to floatdixf.c -- For iossim_x86_64 builtins preferring x86_64/floatundixf.S to floatundixf.c -- For ios_arm64 builtins preferring aarch64/fp_mode.c to fp_mode.c -- For ios_armv7 builtins preferring arm/fp_mode.c to fp_mode.c -- For ios_armv7 builtins preferring arm/comparesf2.S to comparesf2.c -- For ios_armv7k builtins preferring arm/fp_mode.c to fp_mode.c -- For ios_armv7k builtins preferring arm/bswapdi2.S to bswapdi2.c -- For ios_armv7k builtins preferring arm/bswapsi2.S to bswapsi2.c -- For ios_armv7k builtins preferring arm/clzdi2.S to clzdi2.c -- For ios_armv7k builtins preferring arm/clzsi2.S to clzsi2.c -- For ios_armv7k builtins preferring arm/comparesf2.S to comparesf2.c -- For ios_armv7k builtins preferring arm/divmodsi4.S to divmodsi4.c -- For ios_armv7k builtins preferring arm/divsi3.S to divsi3.c -- For ios_armv7k builtins preferring arm/modsi3.S to modsi3.c -- For ios_armv7k builtins preferring arm/udivmodsi4.S to udivmodsi4.c -- For ios_armv7k builtins preferring arm/udivsi3.S to udivsi3.c -- For ios_armv7k builtins preferring arm/umodsi3.S to umodsi3.c -- For ios_armv7s builtins preferring arm/fp_mode.c to fp_mode.c -- For ios_armv7s builtins preferring arm/comparesf2.S to comparesf2.c -- For cc_kext_ios_arm64 builtins preferring aarch64/fp_mode.c to fp_mode.c -- For cc_kext_ios_armv7 builtins preferring arm/fp_mode.c to fp_mode.c -- For cc_kext_ios_armv7 builtins preferring arm/bswapdi2.S to bswapdi2.c -- For cc_kext_ios_armv7 builtins preferring arm/bswapsi2.S to bswapsi2.c -- For cc_kext_ios_armv7 builtins preferring arm/clzdi2.S to clzdi2.c -- For cc_kext_ios_armv7 builtins preferring arm/clzsi2.S to clzsi2.c -- For cc_kext_ios_armv7 builtins preferring arm/comparesf2.S to comparesf2.c -- For cc_kext_ios_armv7 builtins preferring arm/divmodsi4.S to divmodsi4.c -- For cc_kext_ios_armv7 builtins preferring arm/divsi3.S to divsi3.c -- For cc_kext_ios_armv7 builtins preferring arm/modsi3.S to modsi3.c -- For cc_kext_ios_armv7 builtins preferring arm/udivmodsi4.S to udivmodsi4.c -- For cc_kext_ios_armv7 builtins preferring arm/udivsi3.S to udivsi3.c -- For cc_kext_ios_armv7 builtins preferring arm/umodsi3.S to umodsi3.c -- For cc_kext_ios_armv7k builtins preferring arm/fp_mode.c to fp_mode.c -- For cc_kext_ios_armv7k builtins preferring arm/bswapdi2.S to bswapdi2.c -- For cc_kext_ios_armv7k builtins preferring arm/bswapsi2.S to bswapsi2.c -- For cc_kext_ios_armv7k builtins preferring arm/clzdi2.S to clzdi2.c -- For cc_kext_ios_armv7k builtins preferring arm/clzsi2.S to clzsi2.c -- For cc_kext_ios_armv7k builtins preferring arm/comparesf2.S to comparesf2.c -- For cc_kext_ios_armv7k builtins preferring arm/divmodsi4.S to divmodsi4.c -- For cc_kext_ios_armv7k builtins preferring arm/divsi3.S to divsi3.c -- For cc_kext_ios_armv7k builtins preferring arm/modsi3.S to modsi3.c -- For cc_kext_ios_armv7k builtins preferring arm/udivmodsi4.S to udivmodsi4.c -- For cc_kext_ios_armv7k builtins preferring arm/udivsi3.S to udivsi3.c -- For cc_kext_ios_armv7k builtins preferring arm/umodsi3.S to umodsi3.c -- For cc_kext_ios_armv7s builtins preferring arm/fp_mode.c to fp_mode.c -- For cc_kext_ios_armv7s builtins preferring arm/bswapdi2.S to bswapdi2.c -- For cc_kext_ios_armv7s builtins preferring arm/bswapsi2.S to bswapsi2.c -- For cc_kext_ios_armv7s builtins preferring arm/clzdi2.S to clzdi2.c -- For cc_kext_ios_armv7s builtins preferring arm/clzsi2.S to clzsi2.c -- For cc_kext_ios_armv7s builtins preferring arm/comparesf2.S to comparesf2.c -- For cc_kext_ios_armv7s builtins preferring arm/divmodsi4.S to divmodsi4.c -- For cc_kext_ios_armv7s builtins preferring arm/divsi3.S to divsi3.c -- For cc_kext_ios_armv7s builtins preferring arm/modsi3.S to modsi3.c -- For cc_kext_ios_armv7s builtins preferring arm/udivmodsi4.S to udivmodsi4.c -- For cc_kext_ios_armv7s builtins preferring arm/udivsi3.S to udivsi3.c -- For cc_kext_ios_armv7s builtins preferring arm/umodsi3.S to umodsi3.c -- For macho_embedded_armv6m builtins preferring arm/divsi3.S to divsi3.c -- For macho_embedded_armv6m builtins preferring arm/udivsi3.S to udivsi3.c -- For macho_embedded_armv6m builtins preferring arm/comparesf2.S to comparesf2.c -- For macho_embedded_armv6m builtins preferring arm/addsf3.S to addsf3.c -- For macho_embedded_armv7m builtins preferring arm/clzdi2.S to clzdi2.c -- For macho_embedded_armv7m builtins preferring arm/clzsi2.S to clzsi2.c -- For macho_embedded_armv7m builtins preferring arm/comparesf2.S to comparesf2.c -- For macho_embedded_armv7m builtins preferring arm/divmodsi4.S to divmodsi4.c -- For macho_embedded_armv7m builtins preferring arm/divsi3.S to divsi3.c -- For macho_embedded_armv7m builtins preferring arm/modsi3.S to modsi3.c -- For macho_embedded_armv7m builtins preferring arm/udivmodsi4.S to udivmodsi4.c -- For macho_embedded_armv7m builtins preferring arm/udivsi3.S to udivsi3.c -- For macho_embedded_armv7m builtins preferring arm/umodsi3.S to umodsi3.c -- For macho_embedded_armv7em builtins preferring arm/clzdi2.S to clzdi2.c -- For macho_embedded_armv7em builtins preferring arm/clzsi2.S to clzsi2.c -- For macho_embedded_armv7em builtins preferring arm/comparesf2.S to comparesf2.c -- For macho_embedded_armv7em builtins preferring arm/divmodsi4.S to divmodsi4.c -- For macho_embedded_armv7em builtins preferring arm/divsi3.S to divsi3.c -- For macho_embedded_armv7em builtins preferring arm/modsi3.S to modsi3.c -- For macho_embedded_armv7em builtins preferring arm/udivmodsi4.S to udivmodsi4.c -- For macho_embedded_armv7em builtins preferring arm/udivsi3.S to udivsi3.c -- For macho_embedded_armv7em builtins preferring arm/umodsi3.S to umodsi3.c -- For macho_embedded_armv7 builtins preferring arm/clzdi2.S to clzdi2.c -- For macho_embedded_armv7 builtins preferring arm/clzsi2.S to clzsi2.c -- For macho_embedded_armv7 builtins preferring arm/comparesf2.S to comparesf2.c -- For macho_embedded_armv7 builtins preferring arm/divmodsi4.S to divmodsi4.c -- For macho_embedded_armv7 builtins preferring arm/divsi3.S to divsi3.c -- For macho_embedded_armv7 builtins preferring arm/modsi3.S to modsi3.c -- For macho_embedded_armv7 builtins preferring arm/udivmodsi4.S to udivmodsi4.c -- For macho_embedded_armv7 builtins preferring arm/udivsi3.S to udivsi3.c -- For macho_embedded_armv7 builtins preferring arm/umodsi3.S to umodsi3.c -- For macho_embedded_i386 builtins preferring i386/ashldi3.S to ashldi3.c -- For macho_embedded_i386 builtins preferring i386/ashrdi3.S to ashrdi3.c -- For macho_embedded_i386 builtins preferring i386/divdi3.S to divdi3.c -- For macho_embedded_i386 builtins preferring i386/floatdidf.S to floatdidf.c -- For macho_embedded_i386 builtins preferring i386/floatdisf.S to floatdisf.c -- For macho_embedded_i386 builtins preferring i386/floatundidf.S to floatundidf.c -- For macho_embedded_i386 builtins preferring i386/floatundisf.S to floatundisf.c -- For macho_embedded_i386 builtins preferring i386/lshrdi3.S to lshrdi3.c -- For macho_embedded_i386 builtins preferring i386/moddi3.S to moddi3.c -- For macho_embedded_i386 builtins preferring i386/muldi3.S to muldi3.c -- For macho_embedded_i386 builtins preferring i386/udivdi3.S to udivdi3.c -- For macho_embedded_i386 builtins preferring i386/umoddi3.S to umoddi3.c -- For macho_embedded_x86_64 builtins preferring x86_64/floatdidf.c to floatdidf.c -- For macho_embedded_x86_64 builtins preferring x86_64/floatdisf.c to floatdisf.c -- For macho_embedded_x86_64 builtins preferring x86_64/floatundidf.S to floatundidf.c -- For macho_embedded_x86_64 builtins preferring x86_64/floatundisf.S to floatundisf.c -- No arm64 support in /Applications/Xcode.app/Contents/Developer/Platforms/MacOSX.platform/Developer/SDKs/MacOSX10.15.sdk/SDKSettings.plist -- No arm64e support in /Applications/Xcode.app/Contents/Developer/Platforms/MacOSX.platform/Developer/SDKs/MacOSX10.15.sdk/SDKSettings.plist -- Using cached valid architectures for osx. -- OSX supported builtin arches: i386;x86_64;x86_64h -- Using cached valid architectures for iossim. -- ios Simulator supported builtin arches: i386;x86_64 -- Using cached valid architectures for ios. -- ios supported builtin arches: arm64;armv7;armv7k;armv7s -- Builtin supported architectures: i386;x86_64;x86_64h;armv7;armv7k;armv7s;arm64 -- check-interception does nothing. -- Generated Sanitizer SUPPORTED_TOOLS list on "Darwin" is "asan;lsan;tsan;ubsan" -- sanitizer_common tests on "Darwin" will run against "asan;lsan;tsan;ubsan" -- Clang version: 12.0.99 -- Host linker version: 556.6 -- LLD version: 12.0.99 -- Enable editline support in LLDB: TRUE -- Enable curses support in LLDB: TRUE -- Enable LZMA compression support in LLDB: TRUE -- Could NOT find Lua (missing: LUA_LIBRARIES LUA_INCLUDE_DIR) (Required is at least version "5.3") -- Could NOT find LuaAndSwig (missing: LUA_LIBRARIES LUA_INCLUDE_DIR) -- Enable Lua scripting support in LLDB: FALSE -- Found Python3: /usr/local/Frameworks/Python.framework/Versions/3.7/bin/python3.7 (found version "3.7.1") found components: Interpreter Development -- Enable Python scripting support in LLDB: TRUE -- Found LibXml2: /usr/lib/libxml2.dylib (found suitable version "2.9.4", minimum required is "2.8") -- Enable Libxml 2 support in LLDB: TRUE -- LLDB version: 12.0.99git -- Symbols (liblldb): exporting all symbols from the lldb namespace CMake Warning at /Users/buildslave/jenkins/workspace/lldb-cmake/llvm-project/lldb/tools/debugserver/source/CMakeLists.txt:44 (message): Development code sign identity not found: 'lldb_codesign' This will cause failures in the test suite.Pass '-DLLDB_USE_SYSTEM_DEBUGSERVER=ON' to use the system one instead.See 'Code Signing on macOS' in the documentation. Call Stack (most recent call first): /Users/buildslave/jenkins/workspace/lldb-cmake/llvm-project/lldb/tools/debugserver/source/CMakeLists.txt:92 (get_debugserver_codesign_identity)

Hide Details

Hide Details

-- LLDB debugserver energy support is disabled -- Could NOT find Doxygen (missing: DOXYGEN_EXECUTABLE) -- Could NOT find epydoc -- LLDB Tests use just-built debugserver: /Users/buildslave/jenkins/workspace/lldb-cmake/lldb-build/./bin/debugserver -- Registering Bye as a pass plugin (static build: OFF) -- LLVM FileCheck Found: /usr/local/bin/FileCheck -- Version: 0.0.0 -- Performing Test HAVE_THREAD_SAFETY_ATTRIBUTES -- failed to compile -- Performing Test HAVE_GNU_POSIX_REGEX -- failed to compile -- Performing Test HAVE_POSIX_REGEX -- success -- Performing Test HAVE_STEADY_CLOCK -- success -- Configuring done -- Generating done -- Build files have been written to: /Users/buildslave/jenkins/workspace/lldb-cmake/lldb-build Completed at: 2020-10-01T09:24:55 @@@@@@
Build

Hide Details

@@@ Build @@@ cd /Users/buildslave/jenkins/workspace/lldb-cmake/lldb-build '/usr/local/bin/ninja' '-v' [1/2473] : && "/Applications/Xcode.app/Contents/Developer/Toolchains/XcodeDefault.xctoolchain/usr/bin/libtool" -static -no_warning_for_no_symbols -o lib/libLLVMOrcJIT.a lib/ExecutionEngine/Orc/CMakeFiles/LLVMOrcJIT.dir/CompileOnDemandLayer.cpp.o lib/ExecutionEngine/Orc/CMakeFiles/LLVMOrcJIT.dir/CompileUtils.cpp.o lib/ExecutionEngine/Orc/CMakeFiles/LLVMOrcJIT.dir/Core.cpp.o lib/ExecutionEngine/Orc/CMakeFiles/LLVMOrcJIT.dir/DebugUtils.cpp.o lib/ExecutionEngine/Orc/CMakeFiles/LLVMOrcJIT.dir/ExecutionUtils.cpp.o lib/ExecutionEngine/Orc/CMakeFiles/LLVMOrcJIT.dir/IndirectionUtils.cpp.o lib/ExecutionEngine/Orc/CMakeFiles/LLVMOrcJIT.dir/IRCompileLayer.cpp.o lib/ExecutionEngine/Orc/CMakeFiles/LLVMOrcJIT.dir/IRTransformLayer.cpp.o lib/ExecutionEngine/Orc/CMakeFiles/LLVMOrcJIT.dir/JITTargetMachineBuilder.cpp.o lib/ExecutionEngine/Orc/CMakeFiles/LLVMOrcJIT.dir/LazyReexports.cpp.o lib/ExecutionEngine/Orc/CMakeFiles/LLVMOrcJIT.dir/Legacy.cpp.o lib/ExecutionEngine/Orc/CMakeFiles/LLVMOrcJIT.dir/Layer.cpp.o lib/ExecutionEngine/Orc/CMakeFiles/LLVMOrcJIT.dir/LLJIT.cpp.o lib/ExecutionEngine/Orc/CMakeFiles/LLVMOrcJIT.dir/MachOPlatform.cpp.o lib/ExecutionEngine/Orc/CMakeFiles/LLVMOrcJIT.dir/Mangling.cpp.o lib/ExecutionEngine/Orc/CMakeFiles/LLVMOrcJIT.dir/NullResolver.cpp.o lib/ExecutionEngine/Orc/CMakeFiles/LLVMOrcJIT.dir/ObjectLinkingLayer.cpp.o lib/ExecutionEngine/Orc/CMakeFiles/LLVMOrcJIT.dir/ObjectTransformLayer.cpp.o lib/ExecutionEngine/Orc/CMakeFiles/LLVMOrcJIT.dir/OrcABISupport.cpp.o lib/ExecutionEngine/Orc/CMakeFiles/LLVMOrcJIT.dir/OrcCBindings.cpp.o lib/ExecutionEngine/Orc/CMakeFiles/LLVMOrcJIT.dir/OrcV2CBindings.cpp.o lib/ExecutionEngine/Orc/CMakeFiles/LLVMOrcJIT.dir/OrcMCJITReplacement.cpp.o lib/ExecutionEngine/Orc/CMakeFiles/LLVMOrcJIT.dir/RTDyldObjectLinkingLayer.cpp.o lib/ExecutionEngine/Orc/CMakeFiles/LLVMOrcJIT.dir/Speculation.cpp.o lib/ExecutionEngine/Orc/CMakeFiles/LLVMOrcJIT.dir/SpeculateAnalyses.cpp.o lib/ExecutionEngine/Orc/CMakeFiles/LLVMOrcJIT.dir/TargetProcessControl.cpp.o lib/ExecutionEngine/Orc/CMakeFiles/LLVMOrcJIT.dir/ThreadSafeModule.cpp.o lib/ExecutionEngine/Orc/CMakeFiles/LLVMOrcJIT.dir/TPCDynamicLibrarySearchGenerator.cpp.o lib/ExecutionEngine/Orc/CMakeFiles/LLVMOrcJIT.dir/TPCIndirectionUtils.cpp.o && : [2/2473] : && /Users/buildslave/jenkins/workspace/lldb-cmake/host-compiler/bin/clang++ -Wdocumentation -fPIC -fvisibility-inlines-hidden -Werror=date-time -Werror=unguarded-availability-new -fmodules -fmodules-cache-path=/Users/buildslave/jenkins/workspace/lldb-cmake/lldb-build/module.cache -fcxx-modules -Xclang -fmodules-local-submodule-visibility -Wall -Wextra -Wno-unused-parameter -Wwrite-strings -Wcast-qual -Wmissing-field-initializers -Wno-long-long -Wimplicit-fallthrough -Wcovered-switch-default -Wno-noexcept-type -Wnon-virtual-dtor -Wdelete-non-virtual-dtor -Wsuggest-override -Wstring-conversion -fdiagnostics-color -O3 -isysroot /Applications/Xcode.app/Contents/Developer/Platforms/MacOSX.platform/Developer/SDKs/MacOSX10.15.sdk -dynamiclib -Wl,-headerpad_max_install_names -compatibility_version 1.0.0 -current_version 1.0.0 -o lib/libc++.1.0.dylib -install_name @rpath/libc++.1.dylib projects/libcxx/src/CMakeFiles/cxx_shared.dir/algorithm.cpp.o projects/libcxx/src/CMakeFiles/cxx_shared.dir/any.cpp.o projects/libcxx/src/CMakeFiles/cxx_shared.dir/atomic.cpp.o projects/libcxx/src/CMakeFiles/cxx_shared.dir/barrier.cpp.o projects/libcxx/src/CMakeFiles/cxx_shared.dir/bind.cpp.o projects/libcxx/src/CMakeFiles/cxx_shared.dir/charconv.cpp.o projects/libcxx/src/CMakeFiles/cxx_shared.dir/chrono.cpp.o projects/libcxx/src/CMakeFiles/cxx_shared.dir/condition_variable.cpp.o projects/libcxx/src/CMakeFiles/cxx_shared.dir/condition_variable_destructor.cpp.o projects/libcxx/src/CMakeFiles/cxx_shared.dir/debug.cpp.o projects/libcxx/src/CMakeFiles/cxx_shared.dir/exception.cpp.o projects/libcxx/src/CMakeFiles/cxx_shared.dir/functional.cpp.o projects/libcxx/src/CMakeFiles/cxx_shared.dir/future.cpp.o projects/libcxx/src/CMakeFiles/cxx_shared.dir/hash.cpp.o projects/libcxx/src/CMakeFiles/cxx_shared.dir/ios.cpp.o projects/libcxx/src/CMakeFiles/cxx_shared.dir/iostream.cpp.o projects/libcxx/src/CMakeFiles/cxx_shared.dir/locale.cpp.o projects/libcxx/src/CMakeFiles/cxx_shared.dir/memory.cpp.o projects/libcxx/src/CMakeFiles/cxx_shared.dir/mutex.cpp.o projects/libcxx/src/CMakeFiles/cxx_shared.dir/mutex_destructor.cpp.o projects/libcxx/src/CMakeFiles/cxx_shared.dir/new.cpp.o projects/libcxx/src/CMakeFiles/cxx_shared.dir/optional.cpp.o projects/libcxx/src/CMakeFiles/cxx_shared.dir/random.cpp.o projects/libcxx/src/CMakeFiles/cxx_shared.dir/random_shuffle.cpp.o projects/libcxx/src/CMakeFiles/cxx_shared.dir/regex.cpp.o projects/libcxx/src/CMakeFiles/cxx_shared.dir/shared_mutex.cpp.o projects/libcxx/src/CMakeFiles/cxx_shared.dir/stdexcept.cpp.o projects/libcxx/src/CMakeFiles/cxx_shared.dir/string.cpp.o projects/libcxx/src/CMakeFiles/cxx_shared.dir/strstream.cpp.o projects/libcxx/src/CMakeFiles/cxx_shared.dir/system_error.cpp.o projects/libcxx/src/CMakeFiles/cxx_shared.dir/thread.cpp.o projects/libcxx/src/CMakeFiles/cxx_shared.dir/typeinfo.cpp.o projects/libcxx/src/CMakeFiles/cxx_shared.dir/utility.cpp.o projects/libcxx/src/CMakeFiles/cxx_shared.dir/valarray.cpp.o projects/libcxx/src/CMakeFiles/cxx_shared.dir/variant.cpp.o projects/libcxx/src/CMakeFiles/cxx_shared.dir/vector.cpp.o projects/libcxx/src/CMakeFiles/cxx_shared.dir/filesystem/operations.cpp.o projects/libcxx/src/CMakeFiles/cxx_shared.dir/filesystem/directory_iterator.cpp.o projects/libcxx/src/CMakeFiles/cxx_shared.dir/filesystem/int128_builtins.cpp.o -Wl,-rpath,@loader_path/../lib -nodefaultlibs -lSystem -lc lib/libc++abi.1.0.dylib -Wl,-unexported_symbols_list,/Users/buildslave/jenkins/workspace/lldb-cmake/llvm-project/libcxx/src/../lib/libc++unexp.exp -Wl,-reexported_symbols_list,/Users/buildslave/jenkins/workspace/lldb-cmake/llvm-project/libcxx/src/../lib/libc++abi.v2.exp -Wl,-force_symbols_not_weak_list,/Users/buildslave/jenkins/workspace/lldb-cmake/llvm-project/libcxx/src/../lib/notweak.exp -Wl,-force_symbols_weak_list,/Users/buildslave/jenkins/workspace/lldb-cmake/llvm-project/libcxx/src/../lib/weak.exp -Wl,-reexported_symbols_list,/Users/buildslave/jenkins/workspace/lldb-cmake/llvm-project/libcxxabi/src/../lib/new-delete.exp -Wl,-reexported_symbols_list,/Users/buildslave/jenkins/workspace/lldb-cmake/llvm-project/libcxxabi/src/../lib/exceptions.exp -Wl,-reexported_symbols_list,/Users/buildslave/jenkins/workspace/lldb-cmake/llvm-project/libcxxabi/src/../lib/personality-v0.exp && : FAILED: lib/libc++.1.0.dylib : && /Users/buildslave/jenkins/workspace/lldb-cmake/host-compiler/bin/clang++ -Wdocumentation -fPIC -fvisibility-inlines-hidden -Werror=date-time -Werror=unguarded-availability-new -fmodules -fmodules-cache-path=/Users/buildslave/jenkins/workspace/lldb-cmake/lldb-build/module.cache -fcxx-modules -Xclang -fmodules-local-submodule-visibility -Wall -Wextra -Wno-unused-parameter -Wwrite-strings -Wcast-qual -Wmissing-field-initializers -Wno-long-long -Wimplicit-fallthrough -Wcovered-switch-default -Wno-noexcept-type -Wnon-virtual-dtor -Wdelete-non-virtual-dtor -Wsuggest-override -Wstring-conversion -fdiagnostics-color -O3 -isysroot /Applications/Xcode.app/Contents/Developer/Platforms/MacOSX.platform/Developer/SDKs/MacOSX10.15.sdk -dynamiclib -Wl,-headerpad_max_install_names -compatibility_version 1.0.0 -current_version 1.0.0 -o lib/libc++.1.0.dylib -install_name @rpath/libc++.1.dylib projects/libcxx/src/CMakeFiles/cxx_shared.dir/algorithm.cpp.o projects/libcxx/src/CMakeFiles/cxx_shared.dir/any.cpp.o projects/libcxx/src/CMakeFiles/cxx_shared.dir/atomic.cpp.o projects/libcxx/src/CMakeFiles/cxx_shared.dir/barrier.cpp.o projects/libcxx/src/CMakeFiles/cxx_shared.dir/bind.cpp.o projects/libcxx/src/CMakeFiles/cxx_shared.dir/charconv.cpp.o projects/libcxx/src/CMakeFiles/cxx_shared.dir/chrono.cpp.o projects/libcxx/src/CMakeFiles/cxx_shared.dir/condition_variable.cpp.o projects/libcxx/src/CMakeFiles/cxx_shared.dir/condition_variable_destructor.cpp.o projects/libcxx/src/CMakeFiles/cxx_shared.dir/debug.cpp.o projects/libcxx/src/CMakeFiles/cxx_shared.dir/exception.cpp.o projects/libcxx/src/CMakeFiles/cxx_shared.dir/functional.cpp.o projects/libcxx/src/CMakeFiles/cxx_shared.dir/future.cpp.o projects/libcxx/src/CMakeFiles/cxx_shared.dir/hash.cpp.o projects/libcxx/src/CMakeFiles/cxx_shared.dir/ios.cpp.o projects/libcxx/src/CMakeFiles/cxx_shared.dir/iostream.cpp.o projects/libcxx/src/CMakeFiles/cxx_shared.dir/locale.cpp.o projects/libcxx/src/CMakeFiles/cxx_shared.dir/memory.cpp.o projects/libcxx/src/CMakeFiles/cxx_shared.dir/mutex.cpp.o projects/libcxx/src/CMakeFiles/cxx_shared.dir/mutex_destructor.cpp.o projects/libcxx/src/CMakeFiles/cxx_shared.dir/new.cpp.o projects/libcxx/src/CMakeFiles/cxx_shared.dir/optional.cpp.o projects/libcxx/src/CMakeFiles/cxx_shared.dir/random.cpp.o projects/libcxx/src/CMakeFiles/cxx_shared.dir/random_shuffle.cpp.o projects/libcxx/src/CMakeFiles/cxx_shared.dir/regex.cpp.o projects/libcxx/src/CMakeFiles/cxx_shared.dir/shared_mutex.cpp.o projects/libcxx/src/CMakeFiles/cxx_shared.dir/stdexcept.cpp.o projects/libcxx/src/CMakeFiles/cxx_shared.dir/string.cpp.o projects/libcxx/src/CMakeFiles/cxx_shared.dir/strstream.cpp.o projects/libcxx/src/CMakeFiles/cxx_shared.dir/system_error.cpp.o projects/libcxx/src/CMakeFiles/cxx_shared.dir/thread.cpp.o projects/libcxx/src/CMakeFiles/cxx_shared.dir/typeinfo.cpp.o projects/libcxx/src/CMakeFiles/cxx_shared.dir/utility.cpp.o projects/libcxx/src/CMakeFiles/cxx_shared.dir/valarray.cpp.o projects/libcxx/src/CMakeFiles/cxx_shared.dir/variant.cpp.o projects/libcxx/src/CMakeFiles/cxx_shared.dir/vector.cpp.o projects/libcxx/src/CMakeFiles/cxx_shared.dir/filesystem/operations.cpp.o projects/libcxx/src/CMakeFiles/cxx_shared.dir/filesystem/directory_iterator.cpp.o projects/libcxx/src/CMakeFiles/cxx_shared.dir/filesystem/int128_builtins.cpp.o -Wl,-rpath,@loader_path/../lib -nodefaultlibs -lSystem -lc lib/libc++abi.1.0.dylib -Wl,-unexported_symbols_list,/Users/buildslave/jenkins/workspace/lldb-cmake/llvm-project/libcxx/src/../lib/libc++unexp.exp -Wl,-reexported_symbols_list,/Users/buildslave/jenkins/workspace/lldb-cmake/llvm-project/libcxx/src/../lib/libc++abi.v2.exp -Wl,-force_symbols_not_weak_list,/Users/buildslave/jenkins/workspace/lldb-cmake/llvm-project/libcxx/src/../lib/notweak.exp -Wl,-force_symbols_weak_list,/Users/buildslave/jenkins/workspace/lldb-cmake/llvm-project/libcxx/src/../lib/weak.exp -Wl,-reexported_symbols_list,/Users/buildslave/jenkins/workspace/lldb-cmake/llvm-project/libcxxabi/src/../lib/new-delete.exp -Wl,-reexported_symbols_list,/Users/buildslave/jenkins/workspace/lldb-cmake/llvm-project/libcxxabi/src/../lib/exceptions.exp -Wl,-reexported_symbols_list,/Users/buildslave/jenkins/workspace/lldb-cmake/llvm-project/libcxxabi/src/../lib/personality-v0.exp && : ld: requested re-export symbol operator new(unsigned long) is not from a dylib, but from projects/libcxx/src/CMakeFiles/cxx_shared.dir/new.cpp.o file 'projects/libcxx/src/CMakeFiles/cxx_shared.dir/new.cpp.o' for architecture x86_64 clang-12: error: linker command failed with exit code 1 (use -v to see invocation) [3/2473] /Users/buildslave/jenkins/workspace/lldb-cmake/host-compiler/bin/clang++ -DHAVE_RPC_XDR_H=0 -D_DEBUG -D__STDC_CONSTANT_MACROS -D__STDC_FORMAT_MACROS -D__STDC_LIMIT_MACROS -Iprojects/compiler-rt/lib/sanitizer_common -I/Users/buildslave/jenkins/workspace/lldb-cmake/llvm-project/compiler-rt/lib/sanitizer_common -Iinclude -I/Users/buildslave/jenkins/workspace/lldb-cmake/llvm-project/llvm/include -I/Users/buildslave/jenkins/workspace/lldb-cmake/llvm-project/compiler-rt/lib/sanitizer_common/.. -Wdocumentation -fPIC -fvisibility-inlines-hidden -Werror=date-time -Werror=unguarded-availability-new -fmodules -fmodules-cache-path=/Users/buildslave/jenkins/workspace/lldb-cmake/lldb-build/module.cache -fcxx-modules -Xclang -fmodules-local-submodule-visibility -Wall -Wextra -Wno-unused-parameter -Wwrite-strings -Wcast-qual -Wmissing-field-initializers -pedantic -Wno-long-long -Wimplicit-fallthrough -Wcovered-switch-default -Wno-noexcept-type -Wnon-virtual-dtor -Wdelete-non-virtual-dtor -Wsuggest-override -Wstring-conversion -fdiagnostics-color -Wall -std=c++14 -Wno-unused-parameter -O3 -arch i386 -arch x86_64 -isysroot /Applications/Xcode.app/Contents/Developer/Platforms/MacOSX.platform/Developer/SDKs/MacOSX10.15.sdk -stdlib=libc++ -mios-simulator-version-min=9.0 -isysroot /Applications/Xcode.app/Contents/Developer/Platforms/iPhoneSimulator.platform/Developer/SDKs/iPhoneSimulator13.5.sdk -fPIC -fno-builtin -fno-exceptions -funwind-tables -fno-stack-protector -fno-sanitize=safe-stack -fvisibility=hidden -fno-lto -O3 -gline-tables-only -fno-modules -Wno-gnu -Wno-variadic-macros -Wno-c99-extensions -Wno-non-virtual-dtor -fno-rtti -Wframe-larger-than=570 -Wglobal-constructors -UNDEBUG -std=c++14 -MD -MT projects/compiler-rt/lib/sanitizer_common/CMakeFiles/RTSanitizerCommon.iossim.dir/sanitizer_errno.cpp.o -MF projects/compiler-rt/lib/sanitizer_common/CMakeFiles/RTSanitizerCommon.iossim.dir/sanitizer_errno.cpp.o.d -o projects/compiler-rt/lib/sanitizer_common/CMakeFiles/RTSanitizerCommon.iossim.dir/sanitizer_errno.cpp.o -c /Users/buildslave/jenkins/workspace/lldb-cmake/llvm-project/compiler-rt/lib/sanitizer_common/sanitizer_errno.cpp clang-12: warning: argument unused during compilation: '-fmodules-cache-path=/Users/buildslave/jenkins/workspace/lldb-cmake/lldb-build/module.cache' [-Wunused-command-line-argument] clang-12: warning: argument unused during compilation: '-fcxx-modules' [-Wunused-command-line-argument] [4/2473] /Users/buildslave/jenkins/workspace/lldb-cmake/host-compiler/bin/clang++ -DHAVE_RPC_XDR_H=0 -D_DEBUG -D__STDC_CONSTANT_MACROS -D__STDC_FORMAT_MACROS -D__STDC_LIMIT_MACROS -Iprojects/compiler-rt/lib/sanitizer_common -I/Users/buildslave/jenkins/workspace/lldb-cmake/llvm-project/compiler-rt/lib/sanitizer_common -Iinclude -I/Users/buildslave/jenkins/workspace/lldb-cmake/llvm-project/llvm/include -I/Users/buildslave/jenkins/workspace/lldb-cmake/llvm-project/compiler-rt/lib/sanitizer_common/.. -Wdocumentation -fPIC -fvisibility-inlines-hidden -Werror=date-time -Werror=unguarded-availability-new -fmodules -fmodules-cache-path=/Users/buildslave/jenkins/workspace/lldb-cmake/lldb-build/module.cache -fcxx-modules -Xclang -fmodules-local-submodule-visibility -Wall -Wextra -Wno-unused-parameter -Wwrite-strings -Wcast-qual -Wmissing-field-initializers -pedantic -Wno-long-long -Wimplicit-fallthrough -Wcovered-switch-default -Wno-noexcept-type -Wnon-virtual-dtor -Wdelete-non-virtual-dtor -Wsuggest-override -Wstring-conversion -fdiagnostics-color -Wall -std=c++14 -Wno-unused-parameter -O3 -arch x86_64 -arch x86_64h -isysroot /Applications/Xcode.app/Contents/Developer/Platforms/MacOSX.platform/Developer/SDKs/MacOSX10.15.sdk -stdlib=libc++ -mmacosx-version-min=10.10 -isysroot /Applications/Xcode.app/Contents/Developer/Platforms/MacOSX.platform/Developer/SDKs/MacOSX10.15.sdk -fPIC -fno-builtin -fno-exceptions -funwind-tables -fno-stack-protector -fno-sanitize=safe-stack -fvisibility=hidden -fno-lto -O3 -gline-tables-only -fno-modules -Wno-gnu -Wno-variadic-macros -Wno-c99-extensions -Wno-non-virtual-dtor -fno-rtti -Wframe-larger-than=570 -Wglobal-constructors -DSANITIZER_SUPPORTS_WEAK_HOOKS=0 -UNDEBUG -std=c++14 -MD -MT projects/compiler-rt/lib/sanitizer_common/CMakeFiles/RTSanitizerCommonNoHooks.osx.dir/sanitizer_stoptheworld_mac.cpp.o -MF projects/compiler-rt/lib/sanitizer_common/CMakeFiles/RTSanitizerCommonNoHooks.osx.dir/sanitizer_stoptheworld_mac.cpp.o.d -o projects/compiler-rt/lib/sanitizer_common/CMakeFiles/RTSanitizerCommonNoHooks.osx.dir/sanitizer_stoptheworld_mac.cpp.o -c /Users/buildslave/jenkins/workspace/lldb-cmake/llvm-project/compiler-rt/lib/sanitizer_common/sanitizer_stoptheworld_mac.cpp clang-12: warning: argument unused during compilation: '-fmodules-cache-path=/Users/buildslave/jenkins/workspace/lldb-cmake/lldb-build/module.cache' [-Wunused-command-line-argument] clang-12: warning: argument unused during compilation: '-fcxx-modules' [-Wunused-command-line-argument] [5/2473] /Users/buildslave/jenkins/workspace/lldb-cmake/host-compiler/bin/clang++ -DHAVE_RPC_XDR_H=0 -D_DEBUG -D__STDC_CONSTANT_MACROS -D__STDC_FORMAT_MACROS -D__STDC_LIMIT_MACROS -Iprojects/compiler-rt/lib/sanitizer_common -I/Users/buildslave/jenkins/workspace/lldb-cmake/llvm-project/compiler-rt/lib/sanitizer_common -Iinclude -I/Users/buildslave/jenkins/workspace/lldb-cmake/llvm-project/llvm/include -I/Users/buildslave/jenkins/workspace/lldb-cmake/llvm-project/compiler-rt/lib/sanitizer_common/.. -Wdocumentation -fPIC -fvisibility-inlines-hidden -Werror=date-time -Werror=unguarded-availability-new -fmodules -fmodules-cache-path=/Users/buildslave/jenkins/workspace/lldb-cmake/lldb-build/module.cache -fcxx-modules -Xclang -fmodules-local-submodule-visibility -Wall -Wextra -Wno-unused-parameter -Wwrite-strings -Wcast-qual -Wmissing-field-initializers -pedantic -Wno-long-long -Wimplicit-fallthrough -Wcovered-switch-default -Wno-noexcept-type -Wnon-virtual-dtor -Wdelete-non-virtual-dtor -Wsuggest-override -Wstring-conversion -fdiagnostics-color -Wall -std=c++14 -Wno-unused-parameter -O3 -arch i386 -arch x86_64 -isysroot /Applications/Xcode.app/Contents/Developer/Platforms/MacOSX.platform/Developer/SDKs/MacOSX10.15.sdk -stdlib=libc++ -mios-simulator-version-min=9.0 -isysroot /Applications/Xcode.app/Contents/Developer/Platforms/iPhoneSimulator.platform/Developer/SDKs/iPhoneSimulator13.5.sdk -fPIC -fno-builtin -fno-exceptions -funwind-tables -fno-stack-protector -fno-sanitize=safe-stack -fvisibility=hidden -fno-lto -O3 -gline-tables-only -fno-modules -Wno-gnu -Wno-variadic-macros -Wno-c99-extensions -Wno-non-virtual-dtor -fno-rtti -Wframe-larger-than=570 -Wglobal-constructors -DSANITIZER_SUPPORTS_WEAK_HOOKS=0 -UNDEBUG -std=c++14 -MD -MT projects/compiler-rt/lib/sanitizer_common/CMakeFiles/RTSanitizerCommonLibcNoHooks.iossim.dir/sanitizer_posix_libcdep.cpp.o -MF projects/compiler-rt/lib/sanitizer_common/CMakeFiles/RTSanitizerCommonLibcNoHooks.iossim.dir/sanitizer_posix_libcdep.cpp.o.d -o projects/compiler-rt/lib/sanitizer_common/CMakeFiles/RTSanitizerCommonLibcNoHooks.iossim.dir/sanitizer_posix_libcdep.cpp.o -c /Users/buildslave/jenkins/workspace/lldb-cmake/llvm-project/compiler-rt/lib/sanitizer_common/sanitizer_posix_libcdep.cpp clang-12: warning: argument unused during compilation: '-fmodules-cache-path=/Users/buildslave/jenkins/workspace/lldb-cmake/lldb-build/module.cache' [-Wunused-command-line-argument] clang-12: warning: argument unused during compilation: '-fcxx-modules' [-Wunused-command-line-argument] [6/2473] /Users/buildslave/jenkins/workspace/lldb-cmake/host-compiler/bin/clang++ -DHAVE_RPC_XDR_H=0 -D_DEBUG -D__STDC_CONSTANT_MACROS -D__STDC_FORMAT_MACROS -D__STDC_LIMIT_MACROS -Iprojects/compiler-rt/lib/sanitizer_common -I/Users/buildslave/jenkins/workspace/lldb-cmake/llvm-project/compiler-rt/lib/sanitizer_common -Iinclude -I/Users/buildslave/jenkins/workspace/lldb-cmake/llvm-project/llvm/include -I/Users/buildslave/jenkins/workspace/lldb-cmake/llvm-project/compiler-rt/lib/sanitizer_common/.. -Wdocumentation -fPIC -fvisibility-inlines-hidden -Werror=date-time -Werror=unguarded-availability-new -fmodules -fmodules-cache-path=/Users/buildslave/jenkins/workspace/lldb-cmake/lldb-build/module.cache -fcxx-modules -Xclang -fmodules-local-submodule-visibility -Wall -Wextra -Wno-unused-parameter -Wwrite-strings -Wcast-qual -Wmissing-field-initializers -pedantic -Wno-long-long -Wimplicit-fallthrough -Wcovered-switch-default -Wno-noexcept-type -Wnon-virtual-dtor -Wdelete-non-virtual-dtor -Wsuggest-override -Wstring-conversion -fdiagnostics-color -Wall -std=c++14 -Wno-unused-parameter -O3 -arch i386 -arch x86_64 -isysroot /Applications/Xcode.app/Contents/Developer/Platforms/MacOSX.platform/Developer/SDKs/MacOSX10.15.sdk -stdlib=libc++ -mios-simulator-version-min=9.0 -isysroot /Applications/Xcode.app/Contents/Developer/Platforms/iPhoneSimulator.platform/Developer/SDKs/iPhoneSimulator13.5.sdk -fPIC -fno-builtin -fno-exceptions -funwind-tables -fno-stack-protector -fno-sanitize=safe-stack -fvisibility=hidden -fno-lto -O3 -gline-tables-only -fno-modules -Wno-gnu -Wno-variadic-macros -Wno-c99-extensions -Wno-non-virtual-dtor -fno-rtti -Wframe-larger-than=570 -Wglobal-constructors -UNDEBUG -std=c++14 -MD -MT projects/compiler-rt/lib/sanitizer_common/CMakeFiles/RTSanitizerCommonLibc.iossim.dir/sanitizer_posix_libcdep.cpp.o -MF projects/compiler-rt/lib/sanitizer_common/CMakeFiles/RTSanitizerCommonLibc.iossim.dir/sanitizer_posix_libcdep.cpp.o.d -o projects/compiler-rt/lib/sanitizer_common/CMakeFiles/RTSanitizerCommonLibc.iossim.dir/sanitizer_posix_libcdep.cpp.o -c /Users/buildslave/jenkins/workspace/lldb-cmake/llvm-project/compiler-rt/lib/sanitizer_common/sanitizer_posix_libcdep.cpp clang-12: warning: argument unused during compilation: '-fmodules-cache-path=/Users/buildslave/jenkins/workspace/lldb-cmake/lldb-build/module.cache' [-Wunused-command-line-argument] clang-12: warning: argument unused during compilation: '-fcxx-modules' [-Wunused-command-line-argument] [7/2473] /Users/buildslave/jenkins/workspace/lldb-cmake/host-compiler/bin/clang++ -DHAVE_RPC_XDR_H=0 -D_DEBUG -D__STDC_CONSTANT_MACROS -D__STDC_FORMAT_MACROS -D__STDC_LIMIT_MACROS -Iprojects/compiler-rt/lib/sanitizer_common -I/Users/buildslave/jenkins/workspace/lldb-cmake/llvm-project/compiler-rt/lib/sanitizer_common -Iinclude -I/Users/buildslave/jenkins/workspace/lldb-cmake/llvm-project/llvm/include -I/Users/buildslave/jenkins/workspace/lldb-cmake/llvm-project/compiler-rt/lib/sanitizer_common/.. -Wdocumentation -fPIC -fvisibility-inlines-hidden -Werror=date-time -Werror=unguarded-availability-new -fmodules -fmodules-cache-path=/Users/buildslave/jenkins/workspace/lldb-cmake/lldb-build/module.cache -fcxx-modules -Xclang -fmodules-local-submodule-visibility -Wall -Wextra -Wno-unused-parameter -Wwrite-strings -Wcast-qual -Wmissing-field-initializers -pedantic -Wno-long-long -Wimplicit-fallthrough -Wcovered-switch-default -Wno-noexcept-type -Wnon-virtual-dtor -Wdelete-non-virtual-dtor -Wsuggest-override -Wstring-conversion -fdiagnostics-color -Wall -std=c++14 -Wno-unused-parameter -O3 -arch x86_64 -arch x86_64h -isysroot /Applications/Xcode.app/Contents/Developer/Platforms/MacOSX.platform/Developer/SDKs/MacOSX10.15.sdk -stdlib=libc++ -mmacosx-version-min=10.10 -isysroot /Applications/Xcode.app/Contents/Developer/Platforms/MacOSX.platform/Developer/SDKs/MacOSX10.15.sdk -fPIC -fno-builtin -fno-exceptions -funwind-tables -fno-stack-protector -fno-sanitize=safe-stack -fvisibility=hidden -fno-lto -O3 -gline-tables-only -fno-modules -Wno-gnu -Wno-variadic-macros -Wno-c99-extensions -Wno-non-virtual-dtor -fno-rtti -Wframe-larger-than=570 -Wglobal-constructors -UNDEBUG -std=c++14 -MD -MT projects/compiler-rt/lib/sanitizer_common/CMakeFiles/RTSanitizerCommonSymbolizer.osx.dir/sanitizer_symbolizer_mac.cpp.o -MF projects/compiler-rt/lib/sanitizer_common/CMakeFiles/RTSanitizerCommonSymbolizer.osx.dir/sanitizer_symbolizer_mac.cpp.o.d -o projects/compiler-rt/lib/sanitizer_common/CMakeFiles/RTSanitizerCommonSymbolizer.osx.dir/sanitizer_symbolizer_mac.cpp.o -c /Users/buildslave/jenkins/workspace/lldb-cmake/llvm-project/compiler-rt/lib/sanitizer_common/sanitizer_symbolizer_mac.cpp clang-12: warning: argument unused during compilation: '-fmodules-cache-path=/Users/buildslave/jenkins/workspace/lldb-cmake/lldb-build/module.cache' [-Wunused-command-line-argument] clang-12: warning: argument unused during compilation: '-fcxx-modules' [-Wunused-command-line-argument] [8/2473] /Users/buildslave/jenkins/workspace/lldb-cmake/host-compiler/bin/clang++ -DHAVE_RPC_XDR_H=0 -D_DEBUG -D__STDC_CONSTANT_MACROS -D__STDC_FORMAT_MACROS -D__STDC_LIMIT_MACROS -Iprojects/compiler-rt/lib/sanitizer_common -I/Users/buildslave/jenkins/workspace/lldb-cmake/llvm-project/compiler-rt/lib/sanitizer_common -Iinclude -I/Users/buildslave/jenkins/workspace/lldb-cmake/llvm-project/llvm/include -I/Users/buildslave/jenkins/workspace/lldb-cmake/llvm-project/compiler-rt/lib/sanitizer_common/.. -Wdocumentation -fPIC -fvisibility-inlines-hidden -Werror=date-time -Werror=unguarded-availability-new -fmodules -fmodules-cache-path=/Users/buildslave/jenkins/workspace/lldb-cmake/lldb-build/module.cache -fcxx-modules -Xclang -fmodules-local-submodule-visibility -Wall -Wextra -Wno-unused-parameter -Wwrite-strings -Wcast-qual -Wmissing-field-initializers -pedantic -Wno-long-long -Wimplicit-fallthrough -Wcovered-switch-default -Wno-noexcept-type -Wnon-virtual-dtor -Wdelete-non-virtual-dtor -Wsuggest-override -Wstring-conversion -fdiagnostics-color -Wall -std=c++14 -Wno-unused-parameter -O3 -arch x86_64 -arch x86_64h -isysroot /Applications/Xcode.app/Contents/Developer/Platforms/MacOSX.platform/Developer/SDKs/MacOSX10.15.sdk -stdlib=libc++ -mmacosx-version-min=10.10 -isysroot /Applications/Xcode.app/Contents/Developer/Platforms/MacOSX.platform/Developer/SDKs/MacOSX10.15.sdk -fPIC -fno-builtin -fno-exceptions -funwind-tables -fno-stack-protector -fno-sanitize=safe-stack -fvisibility=hidden -fno-lto -O3 -gline-tables-only -fno-modules -Wno-gnu -Wno-variadic-macros -Wno-c99-extensions -Wno-non-virtual-dtor -fno-rtti -Wframe-larger-than=570 -Wglobal-constructors -UNDEBUG -std=c++14 -MD -MT projects/compiler-rt/lib/sanitizer_common/CMakeFiles/RTSanitizerCommonSymbolizer.osx.dir/sanitizer_stackdepot.cpp.o -MF projects/compiler-rt/lib/sanitizer_common/CMakeFiles/RTSanitizerCommonSymbolizer.osx.dir/sanitizer_stackdepot.cpp.o.d -o projects/compiler-rt/lib/sanitizer_common/CMakeFiles/RTSanitizerCommonSymbolizer.osx.dir/sanitizer_stackdepot.cpp.o -c /Users/buildslave/jenkins/workspace/lldb-cmake/llvm-project/compiler-rt/lib/sanitizer_common/sanitizer_stackdepot.cpp clang-12: warning: argument unused during compilation: '-fmodules-cache-path=/Users/buildslave/jenkins/workspace/lldb-cmake/lldb-build/module.cache' [-Wunused-command-line-argument] clang-12: warning: argument unused during compilation: '-fcxx-modules' [-Wunused-command-line-argument] [9/2473] /Users/buildslave/jenkins/workspace/lldb-cmake/host-compiler/bin/clang++ -DHAVE_RPC_XDR_H=0 -D_DEBUG -D__STDC_CONSTANT_MACROS -D__STDC_FORMAT_MACROS -D__STDC_LIMIT_MACROS -Iprojects/compiler-rt/lib/sanitizer_common -I/Users/buildslave/jenkins/workspace/lldb-cmake/llvm-project/compiler-rt/lib/sanitizer_common -Iinclude -I/Users/buildslave/jenkins/workspace/lldb-cmake/llvm-project/llvm/include -I/Users/buildslave/jenkins/workspace/lldb-cmake/llvm-project/compiler-rt/lib/sanitizer_common/.. -Wdocumentation -fPIC -fvisibility-inlines-hidden -Werror=date-time -Werror=unguarded-availability-new -fmodules -fmodules-cache-path=/Users/buildslave/jenkins/workspace/lldb-cmake/lldb-build/module.cache -fcxx-modules -Xclang -fmodules-local-submodule-visibility -Wall -Wextra -Wno-unused-parameter -Wwrite-strings -Wcast-qual -Wmissing-field-initializers -pedantic -Wno-long-long -Wimplicit-fallthrough -Wcovered-switch-default -Wno-noexcept-type -Wnon-virtual-dtor -Wdelete-non-virtual-dtor -Wsuggest-override -Wstring-conversion -fdiagnostics-color -Wall -std=c++14 -Wno-unused-parameter -O3 -arch x86_64 -arch x86_64h -isysroot /Applications/Xcode.app/Contents/Developer/Platforms/MacOSX.platform/Developer/SDKs/MacOSX10.15.sdk -stdlib=libc++ -mmacosx-version-min=10.10 -isysroot /Applications/Xcode.app/Contents/Developer/Platforms/MacOSX.platform/Developer/SDKs/MacOSX10.15.sdk -fPIC -fno-builtin -fno-exceptions -funwind-tables -fno-stack-protector -fno-sanitize=safe-stack -fvisibility=hidden -fno-lto -O3 -gline-tables-only -fno-modules -Wno-gnu -Wno-variadic-macros -Wno-c99-extensions -Wno-non-virtual-dtor -fno-rtti -Wframe-larger-than=570 -Wglobal-constructors -DSANITIZER_SUPPORTS_WEAK_HOOKS=0 -UNDEBUG -std=c++14 -MD -MT projects/compiler-rt/lib/sanitizer_common/CMakeFiles/RTSanitizerCommonNoHooks.osx.dir/sanitizer_procmaps_mac.cpp.o -MF projects/compiler-rt/lib/sanitizer_common/CMakeFiles/RTSanitizerCommonNoHooks.osx.dir/sanitizer_procmaps_mac.cpp.o.d -o projects/compiler-rt/lib/sanitizer_common/CMakeFiles/RTSanitizerCommonNoHooks.osx.dir/sanitizer_procmaps_mac.cpp.o -c /Users/buildslave/jenkins/workspace/lldb-cmake/llvm-project/compiler-rt/lib/sanitizer_common/sanitizer_procmaps_mac.cpp clang-12: warning: argument unused during compilation: '-fmodules-cache-path=/Users/buildslave/jenkins/workspace/lldb-cmake/lldb-build/module.cache' [-Wunused-command-line-argument] clang-12: warning: argument unused during compilation: '-fcxx-modules' [-Wunused-command-line-argument] [10/2473] /Users/buildslave/jenkins/workspace/lldb-cmake/host-compiler/bin/clang++ -DHAVE_RPC_XDR_H=0 -D_DEBUG -D__STDC_CONSTANT_MACROS -D__STDC_FORMAT_MACROS -D__STDC_LIMIT_MACROS -Iprojects/compiler-rt/lib/sanitizer_common -I/Users/buildslave/jenkins/workspace/lldb-cmake/llvm-project/compiler-rt/lib/sanitizer_common -Iinclude -I/Users/buildslave/jenkins/workspace/lldb-cmake/llvm-project/llvm/include -I/Users/buildslave/jenkins/workspace/lldb-cmake/llvm-project/compiler-rt/lib/sanitizer_common/.. -Wdocumentation -fPIC -fvisibility-inlines-hidden -Werror=date-time -Werror=unguarded-availability-new -fmodules -fmodules-cache-path=/Users/buildslave/jenkins/workspace/lldb-cmake/lldb-build/module.cache -fcxx-modules -Xclang -fmodules-local-submodule-visibility -Wall -Wextra -Wno-unused-parameter -Wwrite-strings -Wcast-qual -Wmissing-field-initializers -pedantic -Wno-long-long -Wimplicit-fallthrough -Wcovered-switch-default -Wno-noexcept-type -Wnon-virtual-dtor -Wdelete-non-virtual-dtor -Wsuggest-override -Wstring-conversion -fdiagnostics-color -Wall -std=c++14 -Wno-unused-parameter -O3 -arch x86_64 -arch x86_64h -isysroot /Applications/Xcode.app/Contents/Developer/Platforms/MacOSX.platform/Developer/SDKs/MacOSX10.15.sdk -stdlib=libc++ -mmacosx-version-min=10.10 -isysroot /Applications/Xcode.app/Contents/Developer/Platforms/MacOSX.platform/Developer/SDKs/MacOSX10.15.sdk -fPIC -fno-builtin -fno-exceptions -funwind-tables -fno-stack-protector -fno-sanitize=safe-stack -fvisibility=hidden -fno-lto -O3 -gline-tables-only -fno-modules -Wno-gnu -Wno-variadic-macros -Wno-c99-extensions -Wno-non-virtual-dtor -fno-rtti -Wframe-larger-than=570 -Wglobal-constructors -UNDEBUG -std=c++14 -MD -MT projects/compiler-rt/lib/sanitizer_common/CMakeFiles/RTSanitizerCommonSymbolizer.osx.dir/sanitizer_symbolizer_posix_libcdep.cpp.o -MF projects/compiler-rt/lib/sanitizer_common/CMakeFiles/RTSanitizerCommonSymbolizer.osx.dir/sanitizer_symbolizer_posix_libcdep.cpp.o.d -o projects/compiler-rt/lib/sanitizer_common/CMakeFiles/RTSanitizerCommonSymbolizer.osx.dir/sanitizer_symbolizer_posix_libcdep.cpp.o -c /Users/buildslave/jenkins/workspace/lldb-cmake/llvm-project/compiler-rt/lib/sanitizer_common/sanitizer_symbolizer_posix_libcdep.cpp clang-12: warning: argument unused during compilation: '-fmodules-cache-path=/Users/buildslave/jenkins/workspace/lldb-cmake/lldb-build/module.cache' [-Wunused-command-line-argument] clang-12: warning: argument unused during compilation: '-fcxx-modules' [-Wunused-command-line-argument] [11/2473] /Users/buildslave/jenkins/workspace/lldb-cmake/host-compiler/bin/clang++ -DHAVE_RPC_XDR_H=0 -D_DEBUG -D__STDC_CONSTANT_MACROS -D__STDC_FORMAT_MACROS -D__STDC_LIMIT_MACROS -Iprojects/compiler-rt/lib/sanitizer_common -I/Users/buildslave/jenkins/workspace/lldb-cmake/llvm-project/compiler-rt/lib/sanitizer_common -Iinclude -I/Users/buildslave/jenkins/workspace/lldb-cmake/llvm-project/llvm/include -I/Users/buildslave/jenkins/workspace/lldb-cmake/llvm-project/compiler-rt/lib/sanitizer_common/.. -Wdocumentation -fPIC -fvisibility-inlines-hidden -Werror=date-time -Werror=unguarded-availability-new -fmodules -fmodules-cache-path=/Users/buildslave/jenkins/workspace/lldb-cmake/lldb-build/module.cache -fcxx-modules -Xclang -fmodules-local-submodule-visibility -Wall -Wextra -Wno-unused-parameter -Wwrite-strings -Wcast-qual -Wmissing-field-initializers -pedantic -Wno-long-long -Wimplicit-fallthrough -Wcovered-switch-default -Wno-noexcept-type -Wnon-virtual-dtor -Wdelete-non-virtual-dtor -Wsuggest-override -Wstring-conversion -fdiagnostics-color -Wall -std=c++14 -Wno-unused-parameter -O3 -arch i386 -arch x86_64 -isysroot /Applications/Xcode.app/Contents/Developer/Platforms/MacOSX.platform/Developer/SDKs/MacOSX10.15.sdk -stdlib=libc++ -mios-simulator-version-min=9.0 -isysroot /Applications/Xcode.app/Contents/Developer/Platforms/iPhoneSimulator.platform/Developer/SDKs/iPhoneSimulator13.5.sdk -fPIC -fno-builtin -fno-exceptions -funwind-tables -fno-stack-protector -fno-sanitize=safe-stack -fvisibility=hidden -fno-lto -O3 -gline-tables-only -fno-modules -Wno-gnu -Wno-variadic-macros -Wno-c99-extensions -Wno-non-virtual-dtor -fno-rtti -Wframe-larger-than=570 -Wglobal-constructors -UNDEBUG -std=c++14 -MD -MT projects/compiler-rt/lib/sanitizer_common/CMakeFiles/RTSanitizerCommon.iossim.dir/sanitizer_mac.cpp.o -MF projects/compiler-rt/lib/sanitizer_common/CMakeFiles/RTSanitizerCommon.iossim.dir/sanitizer_mac.cpp.o.d -o projects/compiler-rt/lib/sanitizer_common/CMakeFiles/RTSanitizerCommon.iossim.dir/sanitizer_mac.cpp.o -c /Users/buildslave/jenkins/workspace/lldb-cmake/llvm-project/compiler-rt/lib/sanitizer_common/sanitizer_mac.cpp clang-12: warning: argument unused during compilation: '-fmodules-cache-path=/Users/buildslave/jenkins/workspace/lldb-cmake/lldb-build/module.cache' [-Wunused-command-line-argument] clang-12: warning: argument unused during compilation: '-fcxx-modules' [-Wunused-command-line-argument] ninja: build stopped: subcommand failed. Command failed: Command '['/usr/local/bin/ninja', '-v']' returned non-zero exit status 1 Command: ['/usr/local/bin/ninja', '-v'] [Pipeline] } [Pipeline] // timeout [Pipeline] } [Pipeline] // stage [Pipeline] stage [Pipeline] { (Test) Stage "Test" skipped due to earlier failure(s) [Pipeline] } [Pipeline] // stage [Pipeline] stage [Pipeline] { (Declarative: Post Actions) [Pipeline] scanForIssues [Clang (LLVM based)] Sleeping for 5 seconds due to JENKINS-32191... [Clang (LLVM based)] Parsing console log (workspace: '/Users/buildslave/jenkins/workspace/lldb-cmake') [Clang (LLVM based)] Successfully parsed console log [Clang (LLVM based)] -> found 1 issue (skipped 1 duplicate) [Clang (LLVM based)] Post processing issues on 'green-dragon-10' with source code encoding 'UTF-8' [Clang (LLVM based)] Creating SCM blamer to obtain author and commit information for affected files [Clang (LLVM based)] Creating SCM miner to obtain statistics for affected repository files [Clang (LLVM based)] Resolving file names for all issues in source directory '/Users/buildslave/jenkins/workspace/lldb-cmake' [Clang (LLVM based)] -> resolved paths in source directory (1 found, 0 not found) [Clang (LLVM based)] Resolving module names from module definitions (build.xml, pom.xml, or Manifest.mf files) [Clang (LLVM based)] -> resolved module names for 1 issues [Clang (LLVM based)] Resolving package names (or namespaces) by parsing the affected files [Clang (LLVM based)] -> resolved package names of 1 affected files [Clang (LLVM based)] No filter has been set, publishing all 1 issues [Clang (LLVM based)] Creating fingerprints for all affected code blocks to track issues over different builds [Clang (LLVM based)] -> created fingerprints for 1 issues (skipped 0 issues) [Clang (LLVM based)] Copying affected files to Jenkins' build folder '/Users/Shared/Jenkins/Home/jobs/lldb-cmake/builds/24039/files-with-issues' [Clang (LLVM based)] -> 1 copied, 0 not in workspace, 0 not-found, 0 with I/O error [Pipeline] junit Recording test results Test reports were found but none of them are new. Did leafNodes run? For example, /Users/buildslave/jenkins/workspace/lldb-cmake/test/results.xml is 3 hr 29 min old

Hide Details

Error when executing always post condition: Also: hudson.remoting.Channel$CallSiteStackTrace: Remote call to green-dragon-10 at hudson.remoting.Channel.attachCallSiteStackTrace(Channel.java:1788) at hudson.remoting.UserRequest$ExceptionResponse.retrieve(UserRequest.java:356) at hudson.remoting.Channel.call(Channel.java:998) at hudson.FilePath.act(FilePath.java:1069) at hudson.FilePath.act(FilePath.java:1058) at hudson.tasks.junit.JUnitParser.parseResult(JUnitParser.java:114) at hudson.tasks.junit.JUnitResultArchiver.parse(JUnitResultArchiver.java:137) at hudson.tasks.junit.JUnitResultArchiver.parseAndAttach(JUnitResultArchiver.java:167) at hudson.tasks.junit.pipeline.JUnitResultsStepExecution.run(JUnitResultsStepExecution.java:52) at hudson.tasks.junit.pipeline.JUnitResultsStepExecution.run(JUnitResultsStepExecution.java:25) at org.jenkinsci.plugins.workflow.steps.SynchronousNonBlockingStepExecution.lambda$start$0(SynchronousNonBlockingStepExecution.java:47) at java.util.concurrent.Executors$RunnableAdapter.call(Executors.java:511) at java.util.concurrent.FutureTask.run(FutureTask.java:266) at java.util.concurrent.ThreadPoolExecutor.runWorker(ThreadPoolExecutor.java:1149) at java.util.concurrent.ThreadPoolExecutor$Worker.run(ThreadPoolExecutor.java:624) at java.lang.Thread.run(Thread.java:748) hudson.AbortException: Test reports were found but none of them are new. Did leafNodes run? For example, /Users/buildslave/jenkins/workspace/lldb-cmake/test/results.xml is 3 hr 29 min old

Hide Details

at hudson.tasks.junit.TestResult.parse(TestResult.java:222) at hudson.tasks.junit.TestResult.parse(TestResult.java:178) at hudson.tasks.junit.TestResult.<init>(TestResult.java:143) at hudson.tasks.junit.JUnitParser$ParseResultCallable.invoke(JUnitParser.java:146) at hudson.tasks.junit.JUnitParser$ParseResultCallable.invoke(JUnitParser.java:118) at hudson.FilePath$FileCallableWrapper.call(FilePath.java:3073) at hudson.remoting.UserRequest.perform(UserRequest.java:211) at hudson.remoting.UserRequest.perform(UserRequest.java:54) at hudson.remoting.Request$2.run(Request.java:369) at hudson.remoting.InterceptingExecutorService$1.call(InterceptingExecutorService.java:72) at java.util.concurrent.FutureTask.run(Unknown Source) at java.util.concurrent.ThreadPoolExecutor.runWorker(Unknown Source) at java.util.concurrent.ThreadPoolExecutor$Worker.run(Unknown Source) at java.lang.Thread.run(Unknown Source)

Hide Details

[Pipeline] } [Pipeline] // stage [Pipeline] } [Pipeline] // withEnv [Pipeline] } [Pipeline] // node [Pipeline] End of Pipeline ERROR: script returned exit code 1 Finished: FAILURE