FailedConsole Output

Skipping 9,133 KB.. Full Log

Hide Details

[ 35] libxpc.dylib x86_64-apple-ios13.5.0-simulator [ 36] libsystem_sim_pthread_host.dylib x86_64-apple-ios13.5.0-simulator [ 37] libsystem_sim_platform_host.dylib x86_64-apple-ios13.5.0-simulator [ 38] libsystem_sim_kernel_host.dylib x86_64-apple-ios13.5.0-simulator [ 39] libsystem_kernel.dylib x86_64-apple-macosx10.15.0-simulator(0x00007fff51b5a000) [ 40] libobjc.A.dylib x86_64-apple-ios13.5.0-simulator [ 41] libsystem_platform.dylib x86_64-apple-macosx10.15.0-simulator(0x00007fff51bfd000) [ 42] libsystem_pthread.dylib x86_64-apple-macosx10.15.0-simulator(0x00007fff51c06000)

Hide Details

Expecting regex pattern: "a\.out x86_64-apple-ios11.0.*-simulator" (was found, matched "a.out x86_64-apple-ios11.0.0-simulator")

Hide Details

<bound method SBProcess.Kill of <lldb.SBProcess; proxy of <Swig Object of type 'lldb::SBProcess *' at 0x10ea15c60> >>: success

Hide Details

PASS: LLDB (/Users/buildslave/jenkins/workspace/lldb-cmake/lldb-build/bin/clang-x86_64) :: test_lc_version_min_iphoneos (TestSimulatorPlatform.TestSimulatorPlatformLaunching) runCmd: settings clear -all output:

Hide Details

runCmd: settings set symbols.enable-external-lookup false output:

Hide Details

runCmd: settings set target.inherit-tcc true output:

Hide Details

runCmd: settings set target.auto-apply-fixits false output:

Hide Details

runCmd: settings set plugin.process.gdb-remote.packet-timeout 60 output:

Hide Details

runCmd: settings set symbols.clang-modules-cache-path "/Users/buildslave/jenkins/workspace/lldb-cmake/lldb-build/lldb-test-build.noindex/module-cache-lldb/lldb-api" output:

Hide Details

runCmd: settings set use-color false output:

Hide Details

runCmd: setting set target.prefer-dynamic-value no-dynamic-values output:

Hide Details

runCmd: log enable gdb-remote packets -f /Users/buildslave/jenkins/workspace/lldb-cmake/lldb-build/lldb-test-build.noindex/macosx/simulator/TestSimulatorPlatform.test_lc_version_min_macosx/packets.log output:

Hide Details

Ran command: "log enable gdb-remote packets -f /Users/buildslave/jenkins/workspace/lldb-cmake/lldb-build/lldb-test-build.noindex/macosx/simulator/TestSimulatorPlatform.test_lc_version_min_macosx/packets.log"

Hide Details

Got output:

Hide Details

Hide Details

runCmd: image list -b -t output: [ 0] a.out x86_64-apple-macosx10.9.0 [ 1] dyld x86_64-apple-macosx10.15.0 [ 2] libc++.1.dylib x86_64-apple-macosx10.15.0 [ 3] libSystem.B.dylib x86_64-apple-macosx10.15.0 [ 4] libc++abi.dylib x86_64-apple-macosx10.15.0 [ 5] libcache.dylib x86_64-apple-macosx10.15.0 [ 6] libcommonCrypto.dylib x86_64-apple-macosx10.15.0 [ 7] libcompiler_rt.dylib x86_64-apple-macosx10.15.0 [ 8] libcopyfile.dylib x86_64-apple-macosx10.15.0 [ 9] libcorecrypto.dylib x86_64-apple-macosx10.15.0 [ 10] libdispatch.dylib x86_64-apple-macosx10.15.0 [ 11] libdyld.dylib x86_64-apple-macosx10.15.0 [ 12] libkeymgr.dylib x86_64-apple-macosx10.15.0 [ 13] liblaunch.dylib x86_64-apple-macosx10.15.0 [ 14] libmacho.dylib x86_64-apple-macosx10.15.0 [ 15] libquarantine.dylib x86_64-apple-macosx10.15.0 [ 16] libremovefile.dylib x86_64-apple-macosx10.15.0 [ 17] libsystem_asl.dylib x86_64-apple-macosx10.15.0 [ 18] libsystem_blocks.dylib x86_64-apple-macosx10.15.0 [ 19] libsystem_c.dylib x86_64-apple-macosx10.15.0 [ 20] libsystem_configuration.dylib x86_64-apple-macosx10.15.0 [ 21] libsystem_coreservices.dylib x86_64-apple-macosx10.15.0 [ 22] libsystem_darwin.dylib x86_64-apple-macosx10.15.0 [ 23] libsystem_dnssd.dylib x86_64-apple-macosx10.15.0 [ 24] libsystem_featureflags.dylib x86_64-apple-macosx10.15.0 [ 25] libsystem_info.dylib x86_64-apple-macosx10.15.0 [ 26] libsystem_m.dylib x86_64-apple-macosx10.15.0 [ 27] libsystem_malloc.dylib x86_64-apple-macosx10.15.0 [ 28] libsystem_networkextension.dylib x86_64-apple-macosx10.15.0 [ 29] libsystem_notify.dylib x86_64-apple-macosx10.15.0 [ 30] libsystem_sandbox.dylib x86_64-apple-macosx10.15.0 [ 31] libsystem_secinit.dylib x86_64-apple-macosx10.15.0 [ 32] libsystem_kernel.dylib x86_64-apple-macosx10.15.0 [ 33] libsystem_platform.dylib x86_64-apple-macosx10.15.0 [ 34] libsystem_pthread.dylib x86_64-apple-macosx10.15.0 [ 35] libsystem_symptoms.dylib x86_64-apple-macosx10.15.0 [ 36] libsystem_trace.dylib x86_64-apple-macosx10.15.0 [ 37] libunwind.dylib x86_64-apple-macosx10.15.0 [ 38] libxpc.dylib x86_64-apple-macosx10.15.0 [ 39] libobjc.A.dylib x86_64-apple-macosx10.15.0

Hide Details

Hide Details

Ran command: "image list -b -t"

Hide Details

Got output: [ 0] a.out x86_64-apple-macosx10.9.0 [ 1] dyld x86_64-apple-macosx10.15.0 [ 2] libc++.1.dylib x86_64-apple-macosx10.15.0 [ 3] libSystem.B.dylib x86_64-apple-macosx10.15.0 [ 4] libc++abi.dylib x86_64-apple-macosx10.15.0 [ 5] libcache.dylib x86_64-apple-macosx10.15.0 [ 6] libcommonCrypto.dylib x86_64-apple-macosx10.15.0 [ 7] libcompiler_rt.dylib x86_64-apple-macosx10.15.0 [ 8] libcopyfile.dylib x86_64-apple-macosx10.15.0 [ 9] libcorecrypto.dylib x86_64-apple-macosx10.15.0 [ 10] libdispatch.dylib x86_64-apple-macosx10.15.0 [ 11] libdyld.dylib x86_64-apple-macosx10.15.0 [ 12] libkeymgr.dylib x86_64-apple-macosx10.15.0 [ 13] liblaunch.dylib x86_64-apple-macosx10.15.0 [ 14] libmacho.dylib x86_64-apple-macosx10.15.0 [ 15] libquarantine.dylib x86_64-apple-macosx10.15.0 [ 16] libremovefile.dylib x86_64-apple-macosx10.15.0 [ 17] libsystem_asl.dylib x86_64-apple-macosx10.15.0 [ 18] libsystem_blocks.dylib x86_64-apple-macosx10.15.0 [ 19] libsystem_c.dylib x86_64-apple-macosx10.15.0 [ 20] libsystem_configuration.dylib x86_64-apple-macosx10.15.0 [ 21] libsystem_coreservices.dylib x86_64-apple-macosx10.15.0 [ 22] libsystem_darwin.dylib x86_64-apple-macosx10.15.0 [ 23] libsystem_dnssd.dylib x86_64-apple-macosx10.15.0 [ 24] libsystem_featureflags.dylib x86_64-apple-macosx10.15.0 [ 25] libsystem_info.dylib x86_64-apple-macosx10.15.0 [ 26] libsystem_m.dylib x86_64-apple-macosx10.15.0 [ 27] libsystem_malloc.dylib x86_64-apple-macosx10.15.0 [ 28] libsystem_networkextension.dylib x86_64-apple-macosx10.15.0 [ 29] libsystem_notify.dylib x86_64-apple-macosx10.15.0 [ 30] libsystem_sandbox.dylib x86_64-apple-macosx10.15.0 [ 31] libsystem_secinit.dylib x86_64-apple-macosx10.15.0 [ 32] libsystem_kernel.dylib x86_64-apple-macosx10.15.0 [ 33] libsystem_platform.dylib x86_64-apple-macosx10.15.0 [ 34] libsystem_pthread.dylib x86_64-apple-macosx10.15.0 [ 35] libsystem_symptoms.dylib x86_64-apple-macosx10.15.0 [ 36] libsystem_trace.dylib x86_64-apple-macosx10.15.0 [ 37] libunwind.dylib x86_64-apple-macosx10.15.0 [ 38] libxpc.dylib x86_64-apple-macosx10.15.0 [ 39] libobjc.A.dylib x86_64-apple-macosx10.15.0

Hide Details

Expecting regex pattern: "a\.out x86_64-apple-macosx10.9.*" (was found, matched "a.out x86_64-apple-macosx10.9.0")

Hide Details

--

Hide Details

******************** PASS: lldb-shell :: SymbolFile/symbol-binding.test (896 of 2163) PASS: lldb-api :: functionalities/thread/concurrent_events/TestConcurrentTwoBreakpointsOneSignal.py (897 of 2163) PASS: lldb-unit :: SymbolFile/NativePDB/./SymbolFileNativePDBTests/PDBFPOProgramToDWARFExpressionTests.UnresolvedDependentCyclicRegisterAssignmentReference (898 of 2163) FAIL: lldb-api :: tools/lldb-vscode/launch/TestVSCode_launch.py (899 of 2163) ******************** TEST 'lldb-api :: tools/lldb-vscode/launch/TestVSCode_launch.py' FAILED ******************** Script: -- /usr/local/Frameworks/Python.framework/Versions/3.7/bin/python3.7 /Users/buildslave/jenkins/workspace/lldb-cmake/llvm-project/lldb/test/API/dotest.py -S nm -u CXXFLAGS -u CFLAGS --codesign-identity - --arch x86_64 --build-dir /Users/buildslave/jenkins/workspace/lldb-cmake/lldb-build/lldb-test-build.noindex -s=/Users/buildslave/jenkins/workspace/lldb-cmake/test/logs -t --env TERM=vt100 --env LLVM_LIBS_DIR=/Users/buildslave/jenkins/workspace/lldb-cmake/lldb-build/./lib --arch x86_64 --build-dir /Users/buildslave/jenkins/workspace/lldb-cmake/lldb-build/lldb-test-build.noindex -s /Users/buildslave/jenkins/workspace/lldb-cmake/lldb-build/lldb-test-traces --lldb-module-cache-dir /Users/buildslave/jenkins/workspace/lldb-cmake/lldb-build/lldb-test-build.noindex/module-cache-lldb/lldb-api --clang-module-cache-dir /Users/buildslave/jenkins/workspace/lldb-cmake/lldb-build/lldb-test-build.noindex/module-cache-clang/lldb-api --executable /Users/buildslave/jenkins/workspace/lldb-cmake/lldb-build/./bin/lldb --compiler /Users/buildslave/jenkins/workspace/lldb-cmake/lldb-build/./bin/clang --dsymutil /Users/buildslave/jenkins/workspace/lldb-cmake/lldb-build/./bin/dsymutil --filecheck /Users/buildslave/jenkins/workspace/lldb-cmake/lldb-build/./bin/FileCheck --yaml2obj /Users/buildslave/jenkins/workspace/lldb-cmake/lldb-build/./bin/yaml2obj --server /Users/buildslave/jenkins/workspace/lldb-cmake/lldb-build/./bin/debugserver --lldb-libs-dir /Users/buildslave/jenkins/workspace/lldb-cmake/lldb-build/./lib /Users/buildslave/jenkins/workspace/lldb-cmake/llvm-project/lldb/test/API/tools/lldb-vscode/launch -p TestVSCode_launch.py -- Exit Code: 1

Hide Details

Command Output (stdout): -- lldb version 12.0.99 clang revision e99d184d54937b56d5f4f1ba06fb984019beaee1 llvm revision e99d184d54937b56d5f4f1ba06fb984019beaee1 libstdcxx tests will not be run because: Don't know how to build with libstdcxx on macosx Skipping following debug info categories: ['dwo'] description: breakpoint 1.1 description: breakpoint 2.1

Hide Details

-- Command Output (stderr): --

Hide Details

Session logs for test failures/errors/unexpected successes will go into directory '/Users/buildslave/jenkins/workspace/lldb-cmake/lldb-build/lldb-test-traces' Change dir to: /Users/buildslave/jenkins/workspace/lldb-cmake/llvm-project/lldb/test/API/tools/lldb-vscode/launch runCmd: settings clear -all output:

Hide Details

runCmd: settings set symbols.enable-external-lookup false output:

Hide Details

runCmd: settings set target.inherit-tcc true output:

Hide Details

runCmd: settings set target.auto-apply-fixits false output:

Hide Details

runCmd: settings set plugin.process.gdb-remote.packet-timeout 60 output:

Hide Details

runCmd: settings set symbols.clang-modules-cache-path "/Users/buildslave/jenkins/workspace/lldb-cmake/lldb-build/lldb-test-build.noindex/module-cache-lldb/lldb-api" output:

Hide Details

runCmd: settings set use-color false output:

Hide Details

runCmd: setting set target.prefer-dynamic-value no-dynamic-values output:

Hide Details

Adding tearDown hook: def cleanup(): if disconnectAutomatically: self.vscode.request_disconnect(terminateDebuggee=True) self.vscode.terminate()

Hide Details

Hide Details

Executing tearDown hook: def cleanup(): if disconnectAutomatically: self.vscode.request_disconnect(terminateDebuggee=True) self.vscode.terminate()

Hide Details

Hide Details

PASS: LLDB (/Users/buildslave/jenkins/workspace/lldb-cmake/lldb-build/bin/clang-x86_64) :: test_args (TestVSCode_launch.TestVSCode_launch) runCmd: settings clear -all output:

Hide Details

runCmd: settings set symbols.enable-external-lookup false output:

Hide Details

runCmd: settings set target.inherit-tcc true output:

Hide Details

runCmd: settings set target.auto-apply-fixits false output:

Hide Details

runCmd: settings set plugin.process.gdb-remote.packet-timeout 60 output:

Hide Details

runCmd: settings set symbols.clang-modules-cache-path "/Users/buildslave/jenkins/workspace/lldb-cmake/lldb-build/lldb-test-build.noindex/module-cache-lldb/lldb-api" output:

Hide Details

runCmd: settings set use-color false output:

Hide Details

runCmd: setting set target.prefer-dynamic-value no-dynamic-values output:

Hide Details

Adding tearDown hook: def cleanup(): if disconnectAutomatically: self.vscode.request_disconnect(terminateDebuggee=True) self.vscode.terminate()

Hide Details

Hide Details

Executing tearDown hook: def cleanup(): if disconnectAutomatically: self.vscode.request_disconnect(terminateDebuggee=True) self.vscode.terminate()

Hide Details

Hide Details

PASS: LLDB (/Users/buildslave/jenkins/workspace/lldb-cmake/lldb-build/bin/clang-x86_64) :: test_commands (TestVSCode_launch.TestVSCode_launch) runCmd: settings clear -all output:

Hide Details

runCmd: settings set symbols.enable-external-lookup false output:

Hide Details

runCmd: settings set target.inherit-tcc true output:

Hide Details

runCmd: settings set target.auto-apply-fixits false output:

Hide Details

runCmd: settings set plugin.process.gdb-remote.packet-timeout 60 output:

Hide Details

runCmd: settings set symbols.clang-modules-cache-path "/Users/buildslave/jenkins/workspace/lldb-cmake/lldb-build/lldb-test-build.noindex/module-cache-lldb/lldb-api" output:

Hide Details

runCmd: settings set use-color false output:

Hide Details

runCmd: setting set target.prefer-dynamic-value no-dynamic-values output:

Hide Details

Adding tearDown hook: def cleanup(): if disconnectAutomatically: self.vscode.request_disconnect(terminateDebuggee=True) self.vscode.terminate()

Hide Details

Hide Details

Executing tearDown hook: def cleanup(): if disconnectAutomatically: self.vscode.request_disconnect(terminateDebuggee=True) self.vscode.terminate()

Hide Details

Hide Details

PASS: LLDB (/Users/buildslave/jenkins/workspace/lldb-cmake/lldb-build/bin/clang-x86_64) :: test_cwd (TestVSCode_launch.TestVSCode_launch) runCmd: settings clear -all output:

Hide Details

runCmd: settings set symbols.enable-external-lookup false output:

Hide Details

runCmd: settings set target.inherit-tcc true output:

Hide Details

runCmd: settings set target.auto-apply-fixits false output:

Hide Details

runCmd: settings set plugin.process.gdb-remote.packet-timeout 60 output:

Hide Details

runCmd: settings set symbols.clang-modules-cache-path "/Users/buildslave/jenkins/workspace/lldb-cmake/lldb-build/lldb-test-build.noindex/module-cache-lldb/lldb-api" output:

Hide Details

runCmd: settings set use-color false output:

Hide Details

runCmd: setting set target.prefer-dynamic-value no-dynamic-values output:

Hide Details

Adding tearDown hook: def cleanup(): if disconnectAutomatically: self.vscode.request_disconnect(terminateDebuggee=True) self.vscode.terminate()

Hide Details

Hide Details

Executing tearDown hook: def cleanup(): if disconnectAutomatically: self.vscode.request_disconnect(terminateDebuggee=True) self.vscode.terminate()

Hide Details

Hide Details

PASS: LLDB (/Users/buildslave/jenkins/workspace/lldb-cmake/lldb-build/bin/clang-x86_64) :: test_debuggerRoot (TestVSCode_launch.TestVSCode_launch) UNSUPPORTED: LLDB (/Users/buildslave/jenkins/workspace/lldb-cmake/lldb-build/bin/clang-x86_64) :: test_default (TestVSCode_launch.TestVSCode_launch) (skip on macosx, darwin, ios, tvos, watchos, bridgeos) runCmd: settings clear -all output:

Hide Details

runCmd: settings set symbols.enable-external-lookup false output:

Hide Details

runCmd: settings set target.inherit-tcc true output:

Hide Details

runCmd: settings set target.auto-apply-fixits false output:

Hide Details

runCmd: settings set plugin.process.gdb-remote.packet-timeout 60 output:

Hide Details

runCmd: settings set symbols.clang-modules-cache-path "/Users/buildslave/jenkins/workspace/lldb-cmake/lldb-build/lldb-test-build.noindex/module-cache-lldb/lldb-api" output:

Hide Details

runCmd: settings set use-color false output:

Hide Details

runCmd: setting set target.prefer-dynamic-value no-dynamic-values output:

Hide Details

Adding tearDown hook: def cleanup(): if disconnectAutomatically: self.vscode.request_disconnect(terminateDebuggee=True) self.vscode.terminate()

Hide Details

Hide Details

Executing tearDown hook: def cleanup(): if disconnectAutomatically: self.vscode.request_disconnect(terminateDebuggee=True) self.vscode.terminate()

Hide Details

Hide Details

PASS: LLDB (/Users/buildslave/jenkins/workspace/lldb-cmake/lldb-build/bin/clang-x86_64) :: test_disableSTDIO (TestVSCode_launch.TestVSCode_launch) runCmd: settings clear -all output:

Hide Details

runCmd: settings set symbols.enable-external-lookup false output:

Hide Details

runCmd: settings set target.inherit-tcc true output:

Hide Details

runCmd: settings set target.auto-apply-fixits false output:

Hide Details

runCmd: settings set plugin.process.gdb-remote.packet-timeout 60 output:

Hide Details

runCmd: settings set symbols.clang-modules-cache-path "/Users/buildslave/jenkins/workspace/lldb-cmake/lldb-build/lldb-test-build.noindex/module-cache-lldb/lldb-api" output:

Hide Details

runCmd: settings set use-color false output:

Hide Details

runCmd: setting set target.prefer-dynamic-value no-dynamic-values output:

Hide Details

Adding tearDown hook: def cleanup(): if disconnectAutomatically: self.vscode.request_disconnect(terminateDebuggee=True) self.vscode.terminate()

Hide Details

Hide Details

Executing tearDown hook: def cleanup(): if disconnectAutomatically: self.vscode.request_disconnect(terminateDebuggee=True) self.vscode.terminate()

Hide Details

Hide Details

PASS: LLDB (/Users/buildslave/jenkins/workspace/lldb-cmake/lldb-build/bin/clang-x86_64) :: test_environment (TestVSCode_launch.TestVSCode_launch) runCmd: settings clear -all output:

Hide Details

runCmd: settings set symbols.enable-external-lookup false output:

Hide Details

runCmd: settings set target.inherit-tcc true output:

Hide Details

runCmd: settings set target.auto-apply-fixits false output:

Hide Details

runCmd: settings set plugin.process.gdb-remote.packet-timeout 60 output:

Hide Details

runCmd: settings set symbols.clang-modules-cache-path "/Users/buildslave/jenkins/workspace/lldb-cmake/lldb-build/lldb-test-build.noindex/module-cache-lldb/lldb-api" output:

Hide Details

runCmd: settings set use-color false output:

Hide Details

runCmd: setting set target.prefer-dynamic-value no-dynamic-values output:

Hide Details

Adding tearDown hook: def cleanup(): if disconnectAutomatically: self.vscode.request_disconnect(terminateDebuggee=True) self.vscode.terminate()

Hide Details

Hide Details

FAIL: LLDB (/Users/buildslave/jenkins/workspace/lldb-cmake/lldb-build/bin/clang-x86_64) :: test_extra_launch_commands (TestVSCode_launch.TestVSCode_launch) Executing tearDown hook: def cleanup(): if disconnectAutomatically: self.vscode.request_disconnect(terminateDebuggee=True) self.vscode.terminate()

Hide Details

Hide Details

runCmd: settings clear -all output:

Hide Details

runCmd: settings set symbols.enable-external-lookup false output:

Hide Details

runCmd: settings set target.inherit-tcc true output:

Hide Details

runCmd: settings set target.auto-apply-fixits false output:

Hide Details

runCmd: settings set plugin.process.gdb-remote.packet-timeout 60 output:

Hide Details

runCmd: settings set symbols.clang-modules-cache-path "/Users/buildslave/jenkins/workspace/lldb-cmake/lldb-build/lldb-test-build.noindex/module-cache-lldb/lldb-api" output:

Hide Details

runCmd: settings set use-color false output:

Hide Details

runCmd: setting set target.prefer-dynamic-value no-dynamic-values output:

Hide Details

Adding tearDown hook: def cleanup(): if disconnectAutomatically: self.vscode.request_disconnect(terminateDebuggee=True) self.vscode.terminate()

Hide Details

Hide Details

Executing tearDown hook: def cleanup(): if disconnectAutomatically: self.vscode.request_disconnect(terminateDebuggee=True) self.vscode.terminate()

Hide Details

Hide Details

PASS: LLDB (/Users/buildslave/jenkins/workspace/lldb-cmake/lldb-build/bin/clang-x86_64) :: test_shellExpandArguments_disabled (TestVSCode_launch.TestVSCode_launch) runCmd: settings clear -all output:

Hide Details

runCmd: settings set symbols.enable-external-lookup false output:

Hide Details

runCmd: settings set target.inherit-tcc true output:

Hide Details

runCmd: settings set target.auto-apply-fixits false output:

Hide Details

runCmd: settings set plugin.process.gdb-remote.packet-timeout 60 output:

Hide Details

runCmd: settings set symbols.clang-modules-cache-path "/Users/buildslave/jenkins/workspace/lldb-cmake/lldb-build/lldb-test-build.noindex/module-cache-lldb/lldb-api" output:

Hide Details

runCmd: settings set use-color false output:

Hide Details

runCmd: setting set target.prefer-dynamic-value no-dynamic-values output:

Hide Details

Adding tearDown hook: def cleanup(): if disconnectAutomatically: self.vscode.request_disconnect(terminateDebuggee=True) self.vscode.terminate()

Hide Details

Hide Details

Executing tearDown hook: def cleanup(): if disconnectAutomatically: self.vscode.request_disconnect(terminateDebuggee=True) self.vscode.terminate()

Hide Details

Hide Details

PASS: LLDB (/Users/buildslave/jenkins/workspace/lldb-cmake/lldb-build/bin/clang-x86_64) :: test_shellExpandArguments_enabled (TestVSCode_launch.TestVSCode_launch) runCmd: settings clear -all output:

Hide Details

runCmd: settings set symbols.enable-external-lookup false output:

Hide Details

runCmd: settings set target.inherit-tcc true output:

Hide Details

runCmd: settings set target.auto-apply-fixits false output:

Hide Details

runCmd: settings set plugin.process.gdb-remote.packet-timeout 60 output:

Hide Details

runCmd: settings set symbols.clang-modules-cache-path "/Users/buildslave/jenkins/workspace/lldb-cmake/lldb-build/lldb-test-build.noindex/module-cache-lldb/lldb-api" output:

Hide Details

runCmd: settings set use-color false output:

Hide Details

runCmd: setting set target.prefer-dynamic-value no-dynamic-values output:

Hide Details

Adding tearDown hook: def cleanup(): if disconnectAutomatically: self.vscode.request_disconnect(terminateDebuggee=True) self.vscode.terminate()

Hide Details

Hide Details

Executing tearDown hook: def cleanup(): if disconnectAutomatically: self.vscode.request_disconnect(terminateDebuggee=True) self.vscode.terminate()

Hide Details

Hide Details

PASS: LLDB (/Users/buildslave/jenkins/workspace/lldb-cmake/lldb-build/bin/clang-x86_64) :: test_sourcePath (TestVSCode_launch.TestVSCode_launch) runCmd: settings clear -all output:

Hide Details

runCmd: settings set symbols.enable-external-lookup false output:

Hide Details

runCmd: settings set target.inherit-tcc true output:

Hide Details

runCmd: settings set target.auto-apply-fixits false output:

Hide Details

runCmd: settings set plugin.process.gdb-remote.packet-timeout 60 output:

Hide Details

runCmd: settings set symbols.clang-modules-cache-path "/Users/buildslave/jenkins/workspace/lldb-cmake/lldb-build/lldb-test-build.noindex/module-cache-lldb/lldb-api" output:

Hide Details

runCmd: settings set use-color false output:

Hide Details

runCmd: setting set target.prefer-dynamic-value no-dynamic-values output:

Hide Details

Adding tearDown hook: def cleanup(): if disconnectAutomatically: self.vscode.request_disconnect(terminateDebuggee=True) self.vscode.terminate()

Hide Details

Hide Details

Executing tearDown hook: def cleanup(): if disconnectAutomatically: self.vscode.request_disconnect(terminateDebuggee=True) self.vscode.terminate()

Hide Details

Hide Details

PASS: LLDB (/Users/buildslave/jenkins/workspace/lldb-cmake/lldb-build/bin/clang-x86_64) :: test_stopOnEntry (TestVSCode_launch.TestVSCode_launch) UNSUPPORTED: LLDB (/Users/buildslave/jenkins/workspace/lldb-cmake/lldb-build/bin/clang-x86_64) :: test_terminate_commands (TestVSCode_launch.TestVSCode_launch) (skip on macosx, darwin, ios, tvos, watchos, bridgeos) runCmd: settings clear -all output:

Hide Details

runCmd: settings set symbols.enable-external-lookup false output:

Hide Details

runCmd: settings set target.inherit-tcc true output:

Hide Details

runCmd: settings set target.auto-apply-fixits false output:

Hide Details

runCmd: settings set plugin.process.gdb-remote.packet-timeout 60 output:

Hide Details

runCmd: settings set symbols.clang-modules-cache-path "/Users/buildslave/jenkins/workspace/lldb-cmake/lldb-build/lldb-test-build.noindex/module-cache-lldb/lldb-api" output:

Hide Details

runCmd: settings set use-color false output:

Hide Details

runCmd: setting set target.prefer-dynamic-value no-dynamic-values output:

Hide Details

PASS: LLDB (/Users/buildslave/jenkins/workspace/lldb-cmake/lldb-build/bin/clang-x86_64) :: test_termination (TestVSCode_launch.TestVSCode_launch) Restore dir to: /Users/buildslave/jenkins/workspace/lldb-cmake/lldb-build/tools/lldb/test ====================================================================== FAIL: test_extra_launch_commands (TestVSCode_launch.TestVSCode_launch) ---------------------------------------------------------------------- Traceback (most recent call last): File "/Users/buildslave/jenkins/workspace/lldb-cmake/llvm-project/lldb/test/API/tools/lldb-vscode/launch/TestVSCode_launch.py", line 425, in test_extra_launch_commands self.continue_to_exit() File "/Users/buildslave/jenkins/workspace/lldb-cmake/llvm-project/lldb/packages/Python/lldbsuite/test/tools/lldb-vscode/lldbvscode_testcase.py", line 247, in continue_to_exit 'make sure program ran to completion') AssertionError: 'stopped' != 'exited' - stopped+ exited : make sure program ran to completion Config=x86_64-/Users/buildslave/jenkins/workspace/lldb-cmake/lldb-build/bin/clang ---------------------------------------------------------------------- Ran 14 tests in 183.702s

Hide Details

RESULT: FAILED (11 passes, 1 failures, 0 errors, 2 skipped, 0 expected failures, 0 unexpected successes)

Hide Details

--

Hide Details

******************** PASS: lldb-unit :: Host/./HostTests/SocketTests/SocketTest.UDPConnect/ipv4 (900 of 2163) UNSUPPORTED: lldb-api :: tools/lldb-server/TestGdbRemoteCompletion.py (901 of 2163) PASS: lldb-unit :: UnwindAssembly/x86/./UnwindAssemblyx86Tests/Testx86AssemblyInspectionEngine.TestAddESP (902 of 2163) PASS: lldb-unit :: UnwindAssembly/ARM64/./Arm64InstEmulationTests/TestArm64InstEmulation.TestRegisterDoubleSpills (903 of 2163) PASS: lldb-shell :: Unwind/trap_frame_sym_ctx.test (904 of 2163) PASS: lldb-api :: lang/cpp/extern_c/TestExternCSymbols.py (905 of 2163) PASS: lldb-unit :: Utility/./UtilityTests/StreamTeeTest.Constructor2Streams (906 of 2163) PASS: lldb-shell :: Process/TestAbortExitCode.test (907 of 2163) PASS: lldb-api :: lang/cpp/stl/TestStdCXXDisassembly.py (908 of 2163) PASS: lldb-api :: commands/log/basic/TestLogging.py (909 of 2163) PASS: lldb-api :: commands/expression/no-deadlock/TestExprDoesntBlock.py (910 of 2163) PASS: lldb-unit :: Utility/./UtilityTests/PassiveReplayTest.InstrumentedBar (911 of 2163) PASS: lldb-api :: functionalities/data-formatter/data-formatter-stl/libcxx/list/loop/TestDataFormatterLibcxxListLoop.py (912 of 2163) PASS: lldb-unit :: UnwindAssembly/x86/./UnwindAssemblyx86Tests/Testx86AssemblyInspectionEngine.TestPushEDX (913 of 2163) PASS: lldb-api :: functionalities/tsan/thread_leak/TestTsanThreadLeak.py (914 of 2163) PASS: lldb-api :: lang/cpp/global_operators/TestCppGlobalOperators.py (915 of 2163) PASS: lldb-unit :: Breakpoint/./LLDBBreakpointTests/BreakpointIDTest.StringIsBreakpointName (916 of 2163) PASS: lldb-shell :: Minidump/breakpad-symbols.test (917 of 2163) PASS: lldb-unit :: Utility/./UtilityTests/StringListTest.ShiftMove (918 of 2163) PASS: lldb-api :: functionalities/target_var/TestTargetVar.py (919 of 2163) PASS: lldb-unit :: Host/./HostTests/NativeProcessProtocolTest.ReadCStringFromMemory_MaxSize (920 of 2163) PASS: lldb-api :: functionalities/gdb_remote_client/TestJLink6Armv7RegisterDefinition.py (921 of 2163) PASS: lldb-api :: functionalities/data-formatter/summary-string-onfail/Test-rdar-9974002.py (922 of 2163) PASS: lldb-shell :: ObjectFile/Breakpad/breakpad-identification.test (923 of 2163) PASS: lldb-unit :: Symbol/./SymbolTests/SymbolsTest.TerminateLocateExecutableSymbolFileForUnknownExecutableAndUnknownSymbolFile (924 of 2163) PASS: lldb-unit :: Utility/./UtilityTests/StreamTeeTest.GetStreamAtIndexOutOfBounds (925 of 2163) PASS: lldb-unit :: Language/CPlusPlus/./LanguageCPlusPlusTests/CPlusPlusLanguage.CPlusPlusNameParser (926 of 2163) PASS: lldb-shell :: ObjectFile/ELF/short-build-id.yaml (927 of 2163) PASS: lldb-shell :: SymbolFile/DWARF/DW_AT_location-DW_AT_const_value.s (928 of 2163) PASS: lldb-unit :: Utility/./UtilityTests/ArchSpecTest.TestSetTriple (929 of 2163) PASS: lldb-api :: lang/cpp/incomplete-types/TestCppIncompleteTypes.py (930 of 2163) PASS: lldb-unit :: Utility/./UtilityTests/NameMatchesTest.Equals (931 of 2163) PASS: lldb-shell :: SymbolFile/Breakpad/unwind-via-stack-win-no-memory-info.yaml (932 of 2163) PASS: lldb-unit :: UnwindAssembly/x86/./UnwindAssemblyx86Tests/Testx86AssemblyInspectionEngine.Test64bitFramelessBigStackFrame (933 of 2163) PASS: lldb-unit :: Utility/./UtilityTests/XcodeSDKTest.ParseTest (934 of 2163) PASS: lldb-unit :: Utility/./UtilityTests/LogChannelEnabledTest.LLDB_LOG_ERROR (935 of 2163) PASS: lldb-unit :: Utility/./UtilityTests/StringListTest.JoinThree (936 of 2163) PASS: lldb-unit :: Target/./TargetTests/PathMappingListTest.AbsoluteTests (937 of 2163) PASS: lldb-unit :: SymbolFile/DWARF/./SymbolFileDWARFTests/DWARFASTParserClangTests.EnsureAllDIEsInDeclContextHaveBeenParsedParsesOnlyMatchingEntries (938 of 2163) PASS: lldb-api :: functionalities/data-formatter/nsdictionarysynth/TestNSDictionarySynthetic.py (939 of 2163) PASS: lldb-api :: functionalities/postmortem/wow64_minidump/TestWow64MiniDump.py (940 of 2163) PASS: lldb-unit :: Utility/./UtilityTests/SerializationRountripTest.SerializeDeserializeCStringArray (941 of 2163) PASS: lldb-unit :: UnwindAssembly/x86/./UnwindAssemblyx86Tests/Testx86AssemblyInspectionEngine.TestPopR12 (942 of 2163) PASS: lldb-unit :: Interpreter/./InterpreterTests/OptionArgParserTest.toBoolean (943 of 2163) PASS: lldb-unit :: Utility/./UtilityTests/RangeTest.Union (944 of 2163) PASS: lldb-unit :: Editline/./EditlineTests/EditlineTestFixture.EditlineReceivesSingleLineText (945 of 2163) PASS: lldb-unit :: Utility/./UtilityTests/StringExtractorTest.GetNameColonValueNoSemicolon (946 of 2163) PASS: lldb-unit :: ObjectFile/ELF/./ObjectFileELFTests/ObjectFileELFTest.GetSymtab_NoSymEntryPointArmThumbAddressClass (947 of 2163) PASS: lldb-unit :: Symbol/./SymbolTests/TestTypeSystemClang.TestGetTypeClassDeclType (948 of 2163) PASS: lldb-api :: functionalities/testid/TestTestId.py (949 of 2163) PASS: lldb-unit :: Host/./HostTests/File.GetWaitableHandleFileno (950 of 2163) PASS: lldb-api :: python_api/interpreter/TestRunCommandInterpreterAPI.py (951 of 2163) PASS: lldb-api :: functionalities/data-formatter/data-formatter-objc/TestDataFormatterObjCNSContainer.py (952 of 2163) PASS: lldb-unit :: Utility/./UtilityTests/StringExtractorTest.GetNameColonValueContainsColon (953 of 2163) PASS: lldb-unit :: Expression/./ExpressionTests/ClangHostTest.MacOSX (954 of 2163) PASS: lldb-api :: commands/target/basic/TestTargetCommand.py (955 of 2163) PASS: lldb-api :: commands/session/save/TestSessionSave.py (956 of 2163) PASS: lldb-unit :: SymbolFile/DWARF/./SymbolFileDWARFTests/SymbolFileDWARFTests.TestAbbrevOrder1Start5 (957 of 2163) PASS: lldb-unit :: Target/./TargetTests/ExecutionContextTest.GetByteOrderTarget (958 of 2163) PASS: lldb-api :: python_api/module_section/TestModuleAndSection.py (959 of 2163) PASS: lldb-api :: tools/lldb-server/TestGdbRemoteExitCode.py (960 of 2163) PASS: lldb-unit :: Language/Highlighting/./HighlighterTests/HighlighterTest.ClangTrailingBackslashWithWhitespace (961 of 2163) PASS: lldb-unit :: Symbol/./SymbolTests/TestTypeSystemClang.TestIsClangType (962 of 2163) PASS: lldb-api :: functionalities/thread/concurrent_events/TestConcurrentWatchBreak.py (963 of 2163) PASS: lldb-unit :: Utility/./UtilityTests/StringExtractorTest.GetHexBytes (964 of 2163) PASS: lldb-api :: functionalities/tail_call_frames/ambiguous_tail_call_seq2/TestAmbiguousTailCallSeq2.py (965 of 2163) PASS: lldb-api :: functionalities/float-display/TestFloatDisplay.py (966 of 2163) PASS: lldb-shell :: SymbolFile/DWARF/split-dwarf-inlining.cpp (967 of 2163) PASS: lldb-unit :: ScriptInterpreter/Python/./ScriptInterpreterPythonTests/PythonDataObjectsTest.TestOwnedReferences (968 of 2163) PASS: lldb-unit :: Utility/./UtilityTests/NameMatchesTest.Ignore (969 of 2163) PASS: lldb-api :: python_api/watchpoint/TestWatchpointIgnoreCount.py (970 of 2163) PASS: lldb-unit :: Utility/./UtilityTests/StructuredDataTest.StringDump (971 of 2163) PASS: lldb-unit :: Process/gdb-remote/./ProcessGdbRemoteTests/GDBRemoteCommunicationClientTest.GetModulesInfo_UUID20 (972 of 2163) PASS: lldb-api :: python_api/debugger/TestDebuggerAPI.py (973 of 2163) PASS: lldb-unit :: Thread/./ThreadTests/ThreadTest.SetStopInfo (974 of 2163) PASS: lldb-api :: types/TestShortType.py (975 of 2163) PASS: lldb-unit :: Process/gdb-remote/./ProcessGdbRemoteTests/GDBRemoteClientBaseTest.SendContinueAndInterrupt (976 of 2163) PASS: lldb-unit :: API/./APITests/SBCommandInterpreterTest.MultiWordCommand (977 of 2163) PASS: lldb-api :: commands/expression/import-std-module/weak_ptr-dbg-info-content/TestDbgInfoContentWeakPtrFromStdModule.py (978 of 2163) PASS: lldb-unit :: Symbol/./SymbolTests/SymbolsTest.LocateExecutableSymbolFileForUnknownExecutableAndMissingSymbolFile (979 of 2163) PASS: lldb-unit :: Utility/./UtilityTests/RangeDataVector.CustomSort (980 of 2163) PASS: lldb-unit :: Utility/./UtilityTests/StreamTest.PutULEB128 (981 of 2163) PASS: lldb-unit :: Utility/./UtilityTests/StreamTest.PutHex32ByteOrderLittle (982 of 2163) PASS: lldb-unit :: Core/./LLDBCoreTests/MangledTest.EmptyForInvalidName (983 of 2163) PASS: lldb-shell :: Commands/command-regex-unalias.test (984 of 2163) PASS: lldb-api :: functionalities/signal/raise/TestRaise.py (985 of 2163) PASS: lldb-api :: functionalities/type_lookup/TestTypeLookup.py (986 of 2163) PASS: lldb-api :: functionalities/data-formatter/language_category_updates/TestDataFormatterLanguageCategoryUpdates.py (987 of 2163) PASS: lldb-unit :: Utility/./UtilityTests/StringListTest.CopyListSingle (988 of 2163) PASS: lldb-api :: python_api/sbstructureddata/TestStructuredDataAPI.py (989 of 2163) PASS: lldb-api :: commands/expression/entry-bp/TestExprEntryBP.py (990 of 2163) PASS: lldb-shell :: ObjectFile/ELF/PT_TLS-overlap-PT_LOAD.yaml (991 of 2163) PASS: lldb-unit :: Process/minidump/./LLDBMinidumpTests/MinidumpParserTest.GetPidWindows (992 of 2163) PASS: lldb-api :: functionalities/breakpoint/cpp/TestCPPBreakpointLocations.py (993 of 2163) PASS: lldb-shell :: Driver/LocalLLDBInit.test (994 of 2163) PASS: lldb-unit :: SymbolFile/NativePDB/./SymbolFileNativePDBTests/PDBFPOProgramToDWARFExpressionTests.InvalidOpUnary (995 of 2163) PASS: lldb-api :: commands/expression/invalid-args/TestInvalidArgsExpression.py (996 of 2163) UNSUPPORTED: lldb-shell :: SymbolFile/PDB/calling-conventions.test (997 of 2163) PASS: lldb-api :: python_api/file_handle/TestFileHandle.py (998 of 2163) PASS: lldb-shell :: SymbolFile/NativePDB/source-list.cpp (999 of 2163) PASS: lldb-api :: commands/expression/namespace_local_var_same_name_obj_c/TestNamespaceLocalVarSameNameObjC.py (1000 of 2163) PASS: lldb-api :: functionalities/unwind/zeroth_frame/TestZerothFrame.py (1001 of 2163) PASS: lldb-unit :: Utility/./UtilityTests/AnsiTerminal.Incomplete (1002 of 2163) UNSUPPORTED: lldb-api :: lang/cpp/function-template-parameter-pack/TestFunctionTemplateParameterPack.py (1003 of 2163) UNSUPPORTED: lldb-api :: android/platform/TestDefaultCacheLineSize.py (1004 of 2163) PASS: lldb-unit :: Signals/./SignalsTests/UnixSignalsTest.GetFilteredSignals (1005 of 2163) PASS: lldb-api :: lang/c/local_variables/TestLocalVariables.py (1006 of 2163) UNSUPPORTED: lldb-api :: tools/lldb-server/registers-target-xml-reading/TestGdbRemoteTargetXmlPacket.py (1007 of 2163) PASS: lldb-unit :: Utility/./UtilityTests/StreamTest.PutHex64ByteOrderBig (1008 of 2163) PASS: lldb-api :: lang/cpp/class_types/TestClassTypes.py (1009 of 2163) PASS: lldb-unit :: Utility/./UtilityTests/ScalarTest.Division (1010 of 2163) PASS: lldb-unit :: Utility/./UtilityTests/OptionsWithRawTest.ArgsButNoDelimiter (1011 of 2163) PASS: lldb-api :: functionalities/optimized_code/TestNoASanExceptionAfterEvalOP_piece.py (1012 of 2163) PASS: lldb-api :: lang/cpp/inlines/TestInlines.py (1013 of 2163) PASS: lldb-api :: functionalities/data-formatter/data-formatter-categories/TestDataFormatterCategories.py (1014 of 2163) PASS: lldb-api :: lang/c/blocks/TestBlocks.py (1015 of 2163) PASS: lldb-shell :: Minidump/Windows/find-module.test (1016 of 2163) PASS: lldb-unit :: Expression/./ExpressionTests/DWARFExpression.DW_OP_pick (1017 of 2163) XFAIL: lldb-shell :: Unwind/prefer-debug-over-eh-frame.test (1018 of 2163) PASS: lldb-unit :: Utility/./UtilityTests/LogTest.Unregister (1019 of 2163) UNSUPPORTED: lldb-shell :: Process/Windows/exception_access_violation.cpp (1020 of 2163) PASS: lldb-unit :: Utility/./UtilityTests/ScalarTest.ComparisonFloat (1021 of 2163) PASS: lldb-unit :: Utility/./UtilityTests/RangeTest.NotEqual (1022 of 2163) PASS: lldb-api :: lang/cpp/frame-var-anon-unions/TestFrameVariableAnonymousUnions.py (1023 of 2163) PASS: lldb-api :: lang/objc/single-entry-dictionary/TestObjCSingleEntryDictionary.py (1024 of 2163) PASS: lldb-unit :: Utility/./UtilityTests/LogChannelEnabledTest.LogVerboseThread (1025 of 2163) PASS: lldb-api :: commands/expression/radar_8638051/Test8638051.py (1026 of 2163) PASS: lldb-api :: functionalities/breakpoint/objc/TestObjCBreakpoints.py (1027 of 2163) PASS: lldb-api :: commands/apropos/basic/TestApropos.py (1028 of 2163) PASS: lldb-api :: lang/objc/exceptions/TestObjCExceptions.py (1029 of 2163) PASS: lldb-api :: python_api/process/TestProcessAPI.py (1030 of 2163) PASS: lldb-api :: lang/objc/modules-update/TestClangModulesUpdate.py (1031 of 2163) PASS: lldb-api :: functionalities/target_var/no_vars/TestTargetVarNoVars.py (1032 of 2163) PASS: lldb-api :: iohandler/unicode/TestUnicode.py (1033 of 2163) PASS: lldb-unit :: Process/minidump/./LLDBMinidumpTests/MinidumpParserTest.GetArchitecture (1034 of 2163) PASS: lldb-api :: python_api/sbplatform/TestSBPlatform.py (1035 of 2163) PASS: lldb-unit :: Process/gdb-remote/./ProcessGdbRemoteTests/GDBRemoteCommunicationClientTest.GetMemoryRegionInfo (1036 of 2163) PASS: lldb-api :: lang/c/conflicting-symbol/TestConflictingSymbol.py (1037 of 2163) PASS: lldb-api :: functionalities/mtc/simple/TestMTCSimple.py (1038 of 2163) PASS: lldb-unit :: Utility/./UtilityTests/StringListTest.SplitIntoLines (1039 of 2163) PASS: lldb-unit :: Utility/./UtilityTests/StringExtractorTest.GetHexU8_Underflow2_NoEof (1040 of 2163) PASS: lldb-shell :: Minidump/Windows/Sigsegv/sigsegv.test (1041 of 2163) PASS: lldb-api :: functionalities/step_scripted/TestStepScripted.py (1042 of 2163) PASS: lldb-unit :: Utility/./UtilityTests/ArgsTest.ReplaceArgumentAtIndexOutOfRange (1043 of 2163) PASS: lldb-api :: lang/cpp/dynamic-value-same-basename/TestDynamicValueSameBase.py (1044 of 2163) PASS: lldb-api :: lang/objc/objc-runtime-ivars/TestRuntimeIvars.py (1045 of 2163) PASS: lldb-api :: functionalities/memory/find/TestMemoryFind.py (1046 of 2163) PASS: lldb-api :: macosx/find-dsym/deep-bundle/TestDeepBundle.py (1047 of 2163) PASS: lldb-unit :: Utility/./UtilityTests/Flags.AllClear (1048 of 2163) PASS: lldb-api :: functionalities/data-formatter/data-formatter-stl/libcxx/list/TestDataFormatterLibcxxList.py (1049 of 2163) UNSUPPORTED: lldb-api :: commands/register/register/intel_xtended_registers/mpx_bound_violation/TestBoundViolation.py (1050 of 2163) PASS: lldb-api :: commands/target/create-deps/TestTargetCreateDeps.py (1051 of 2163) PASS: lldb-api :: lang/objc/objc_direct-methods/TestObjCDirectMethods.py (1052 of 2163) PASS: lldb-api :: lang/cpp/diamond/TestDiamond.py (1053 of 2163) PASS: lldb-api :: functionalities/tail_call_frames/sbapi_support/TestTailCallFrameSBAPI.py (1054 of 2163) PASS: lldb-unit :: Utility/./UtilityTests/StringListTest.GetMaxStringLengthIncreasingSize (1055 of 2163) PASS: lldb-unit :: UnwindAssembly/x86/./UnwindAssemblyx86Tests/Testx86AssemblyInspectionEngine.TestAddRSP (1056 of 2163) PASS: lldb-unit :: DataFormatter/./LLDBFormatterTests/TypeMatcherTests.RegexName (1057 of 2163) PASS: lldb-unit :: Utility/./UtilityTests/StringListTest.InsertStringAtIndexMove (1058 of 2163) PASS: lldb-api :: lang/c/find_struct_type/TestFindStructTypes.py (1059 of 2163) PASS: lldb-api :: functionalities/thread/concurrent_events/TestConcurrentTwoWatchpointsOneBreakpoint.py (1060 of 2163) PASS: lldb-shell :: Settings/TestModuleCacheSanity.test (1061 of 2163) PASS: lldb-unit :: Process/gdb-remote/./ProcessGdbRemoteTests/GDBRemoteCommunicationTest.ReadPacket_checksum (1062 of 2163) PASS: lldb-shell :: Minidump/Windows/broken-unwind.test (1063 of 2163) PASS: lldb-unit :: ScriptInterpreter/Python/./ScriptInterpreterPythonTests/PythonDataObjectsTest.TestPythonIntegerToStr (1064 of 2163) PASS: lldb-api :: python_api/class_members/TestSBTypeClassMembers.py (1065 of 2163) PASS: lldb-unit :: Core/./LLDBCoreTests/MangledTest.ResultForValidName (1066 of 2163) PASS: lldb-unit :: Language/Highlighting/./HighlighterTests/HighlighterTest.ClangCursorPosAfterOtherToken (1067 of 2163) PASS: lldb-unit :: UnwindAssembly/x86/./UnwindAssemblyx86Tests/Testx86AssemblyInspectionEngine.TestSpillRegToStackViaMOVx86_64 (1068 of 2163) PASS: lldb-api :: functionalities/data-formatter/typedef_array/TestTypedefArray.py (1069 of 2163) PASS: lldb-unit :: Utility/./UtilityTests/UriParserTest.MinimalPort (1070 of 2163) PASS: lldb-api :: functionalities/thread/step_out/TestThreadStepOut.py (1071 of 2163) PASS: lldb-api :: lang/c/step-target/TestStepTarget.py (1072 of 2163) PASS: lldb-api :: functionalities/thread/concurrent_events/TestConcurrentManyWatchpoints.py (1073 of 2163) PASS: lldb-api :: commands/expression/result_numbering/TestResultNumbering.py (1074 of 2163) PASS: lldb-api :: macosx/save_crashlog/TestSaveCrashlog.py (1075 of 2163) PASS: lldb-unit :: SymbolFile/NativePDB/./SymbolFileNativePDBTests/PDBFPOProgramToDWARFExpressionTests.InvalidAssignmentMultiple (1076 of 2163) PASS: lldb-unit :: Utility/./UtilityTests/EnvironmentTest.EnvpConstruction (1077 of 2163) PASS: lldb-api :: lang/objc/objc-property/TestObjCProperty.py (1078 of 2163) PASS: lldb-api :: functionalities/tail_call_frames/cross_dso/TestCrossDSOTailCalls.py (1079 of 2163) PASS: lldb-unit :: Utility/./UtilityTests/StringExtractorTest.GetHexBytesAvail_FullString (1080 of 2163) PASS: lldb-shell :: ScriptInterpreter/Python/eof.test (1081 of 2163) PASS: lldb-unit :: Utility/./UtilityTests/StringListTest.ForRangeEmpty (1082 of 2163) PASS: lldb-shell :: SymbolFile/DWARF/dwo-type-in-main-file.s (1083 of 2163) PASS: lldb-api :: commands/frame/diagnose/inheritance/TestDiagnoseInheritance.py (1084 of 2163) UNSUPPORTED: lldb-shell :: ScriptInterpreter/Lua/independent_state.test (1085 of 2163) UNSUPPORTED: lldb-api :: arm/breakpoint-it/TestBreakpointIt.py (1086 of 2163) PASS: lldb-api :: lang/objc/objc-ivar-protocols/TestIvarProtocols.py (1087 of 2163) PASS: lldb-unit :: Utility/./UtilityTests/ConstStringTest.NullAndEmptyStates (1088 of 2163) PASS: lldb-api :: commands/expression/import-std-module/queue/TestQueueFromStdModule.py (1089 of 2163) PASS: lldb-unit :: Process/gdb-remote/./ProcessGdbRemoteTests/GDBRemoteCommunicationClientTest.SendStopTracePacket (1090 of 2163) PASS: lldb-unit :: ScriptInterpreter/Python/./ScriptInterpreterPythonTests/PythonDataObjectsTest.TestPythonTupleValues (1091 of 2163) PASS: lldb-shell :: SymbolFile/NativePDB/disassembly.cpp (1092 of 2163) PASS: lldb-unit :: Utility/./UtilityTests/SerializationRountripTest.SerializeDeserializeCStringArrayNullptr (1093 of 2163) PASS: lldb-api :: tools/lldb-vscode/stackTrace/TestVSCode_stackTrace.py (1094 of 2163) PASS: lldb-unit :: Utility/./UtilityTests/StringListTest.JoinNonSpace (1095 of 2163) PASS: lldb-api :: functionalities/paths/TestPaths.py (1096 of 2163) PASS: lldb-api :: functionalities/multiword-commands/TestMultiWordCommands.py (1097 of 2163) PASS: lldb-api :: lang/objc/ptr_refs/TestPtrRefsObjC.py (1098 of 2163) PASS: lldb-unit :: Utility/./UtilityTests/ArgsTest.TestMultipleArgs (1099 of 2163) PASS: lldb-unit :: Utility/./UtilityTests/OptionsWithRawTest.MultiWordSuffix (1100 of 2163) PASS: lldb-shell :: ObjectFile/ELF/minidebuginfo-corrupt-xz.yaml (1101 of 2163) PASS: lldb-unit :: Language/Highlighting/./HighlighterTests/HighlighterTest.ClangCursorPosEndOfLine (1102 of 2163) PASS: lldb-api :: functionalities/thread/jump/TestThreadJump.py (1103 of 2163) PASS: lldb-api :: lang/cpp/nested-class-other-compilation-unit/TestNestedClassWithParentInAnotherCU.py (1104 of 2163) UNSUPPORTED: lldb-shell :: Register/x86-64-xmm16-write.test (1105 of 2163) PASS: lldb-api :: macosx/find-dsym/bundle-with-dot-in-filename/TestBundleWithDotInFilename.py (1106 of 2163) UNSUPPORTED: lldb-api :: commands/expression/macros/TestMacros.py (1107 of 2163) UNSUPPORTED: lldb-shell :: Watchpoint/netbsd-nouserdbregs.test (1108 of 2163) PASS: lldb-unit :: Host/./HostTests/NativeProcessProtocolTest.SetBreakpointFailWrite (1109 of 2163) PASS: lldb-unit :: Utility/./UtilityTests/XcodeSDKTest.SDKSupportsSwift (1110 of 2163) PASS: lldb-api :: functionalities/thread/state_after_expression/TestStateAfterExpression.py (1111 of 2163) PASS: lldb-unit :: Utility/./UtilityTests/StringListTest.GetSize (1112 of 2163) PASS: lldb-unit :: Utility/./UtilityTests/BinaryStreamTest.PutULEB128SevenBytes (1113 of 2163) PASS: lldb-api :: functionalities/archives/TestBSDArchives.py (1114 of 2163) PASS: lldb-unit :: Utility/./UtilityTests/OptionsWithRawTest.WhitespaceInput (1115 of 2163) PASS: lldb-unit :: Process/gdb-remote/./ProcessGdbRemoteTests/GDBRemoteCommunicationClientTest.SendGetMetaDataPacket (1116 of 2163) PASS: lldb-unit :: Utility/./UtilityTests/StringListTest.Clear (1117 of 2163) PASS: lldb-unit :: Expression/./ExpressionTests/DiagnosticManagerTest.GetStringPreserveOrder (1118 of 2163) PASS: lldb-unit :: Utility/./UtilityTests/DataExtractorTest.GetDoubleUnaligned (1119 of 2163) PASS: lldb-unit :: Utility/./UtilityTests/StringListTest.RemoveBlankLines (1120 of 2163) PASS: lldb-api :: commands/expression/import-std-module/unique_ptr-dbg-info-content/TestUniquePtrDbgInfoContent.py (1121 of 2163) PASS: lldb-api :: lang/c/record_decl_in_expr/TestRecordDeclInExpr.py (1122 of 2163) PASS: lldb-api :: functionalities/gdb_remote_client/TestNestedRegDefinitions.py (1123 of 2163) PASS: lldb-unit :: Utility/./UtilityTests/StringLexerTest.Peek (1124 of 2163) PASS: lldb-unit :: SymbolFile/NativePDB/./SymbolFileNativePDBTests/PDBFPOProgramToDWARFExpressionTests.MultipleIndependentAssignments (1125 of 2163) PASS: lldb-unit :: Utility/./UtilityTests/FileSpecTest.GetPath (1126 of 2163) UNSUPPORTED: lldb-shell :: Unwind/unwind-plan-dwarf-dump.test (1127 of 2163) PASS: lldb-shell :: SymbolFile/DWARF/apple-index-is-used.cpp (1128 of 2163) PASS: lldb-unit :: Symbol/./SymbolTests/TestClangASTImporter.ImportInvalidType (1129 of 2163) PASS: lldb-unit :: UnwindAssembly/x86/./UnwindAssemblyx86Tests/Testx86AssemblyInspectionEngine.TestSpillRegToStackViaMOVi386 (1130 of 2163) PASS: lldb-unit :: Process/gdb-remote/./ProcessGdbRemoteTests/GDBRemoteCommunicationClientTest.SendStartTracePacket (1131 of 2163) PASS: lldb-unit :: Process/gdb-remote/./ProcessGdbRemoteTests/GDBRemoteCommunicationClientTest.TestPacketSpeedJSON (1132 of 2163) PASS: lldb-api :: python_api/watchpoint/watchlocation/TestSetWatchlocation.py (1133 of 2163) PASS: lldb-api :: commands/expression/import-std-module/vector-bool/TestVectorBoolFromStdModule.py (1134 of 2163) PASS: lldb-api :: tools/lldb-vscode/breakpoint-events/TestVSCode_breakpointEvents.py (1135 of 2163) PASS: lldb-shell :: SymbolFile/DWARF/debug_aranges-empty-section.s (1136 of 2163) UNSUPPORTED: lldb-api :: functionalities/darwin_log/source/debug/TestDarwinLogSourceDebug.py (1137 of 2163) UNSUPPORTED: lldb-api :: functionalities/thread/thread_specific_break_plus_condition/TestThreadSpecificBpPlusCondition.py (1138 of 2163) PASS: lldb-unit :: Utility/./UtilityTests/RangeTest.ContainsRangeStartingFromZero (1139 of 2163) PASS: lldb-api :: commands/process/signal/TestProcessSignal.py (1140 of 2163) PASS: lldb-unit :: Utility/./UtilityTests/UriParserTest.SchemeHostSeparator2 (1141 of 2163) PASS: lldb-api :: commands/expression/import-std-module/list-dbg-info-content/TestDbgInfoContentListFromStdModule.py (1142 of 2163) PASS: lldb-shell :: SymbolFile/DWARF/find-qualified-variable.cpp (1143 of 2163) PASS: lldb-unit :: Utility/./UtilityTests/BinaryStreamTest.PutSLEB128SixBytes (1144 of 2163) PASS: lldb-unit :: Utility/./UtilityTests/GeneratorTest.YamlMultiProvider (1145 of 2163) PASS: lldb-api :: commands/expression/unicode-in-variable/TestUnicodeInVariable.py (1146 of 2163) PASS: lldb-api :: lang/cpp/alignas_base_class/TestAlignAsBaseClass.py (1147 of 2163) PASS: lldb-api :: lang/objc/hidden-ivars/TestHiddenIvars.py (1148 of 2163) PASS: lldb-api :: commands/platform/file/close/TestPlatformFileClose.py (1149 of 2163) PASS: lldb-unit :: Utility/./UtilityTests/UriParserTest.SchemeHostSeparator3 (1150 of 2163) UNSUPPORTED: lldb-api :: functionalities/darwin_log/source/info/TestDarwinLogSourceInfo.py (1151 of 2163) PASS: lldb-unit :: UnwindAssembly/x86/./UnwindAssemblyx86Tests/Testx86AssemblyInspectionEngine.TestSimplex86_64Augmented (1152 of 2163) PASS: lldb-api :: tools/lldb-server/TestLldbGdbServer.py (1153 of 2163) UNSUPPORTED: lldb-shell :: ScriptInterpreter/Lua/lua.test (1154 of 2163) PASS: lldb-shell :: Driver/TestUseColor.test (1155 of 2163) UNSUPPORTED: lldb-api :: commands/trace/TestTraceSchema.py (1156 of 2163) PASS: lldb-unit :: Utility/./UtilityTests/FileSpecTest.OperatorBool (1157 of 2163) PASS: lldb-unit :: Host/./HostTests/SocketTests/SocketTest.DecodeHostAndPort/ipv6 (1158 of 2163) UNSUPPORTED: lldb-shell :: ObjectFile/ELF/minidebuginfo-set-and-hit-breakpoint.test (1159 of 2163) PASS: lldb-shell :: SymbolFile/DWARF/dwp-debug-types.s (1160 of 2163) PASS: lldb-api :: functionalities/thread/num_threads/TestNumThreads.py (1161 of 2163) PASS: lldb-shell :: SymbolFile/NativePDB/tag-types.cpp (1162 of 2163) PASS: lldb-unit :: ObjectFile/PECOFF/./ObjectFilePECOFFTests/PECallFrameInfoTest.Chained_eh (1163 of 2163) PASS: lldb-api :: python_api/target/TestTargetAPI.py (1164 of 2163) PASS: lldb-unit :: Language/Highlighting/./HighlighterTests/HighlighterTest.Colons (1165 of 2163) PASS: lldb-unit :: Utility/./UtilityTests/DeserializerTest.HasData (1166 of 2163) PASS: lldb-shell :: Quit/TestQuitExitCodeHex0.test (1167 of 2163) PASS: lldb-unit :: Utility/./UtilityTests/StringExtractorTest.GetHexU8_Underflow_NoEof (1168 of 2163) PASS: lldb-shell :: SymbolFile/DWARF/debug_ranges.s (1169 of 2163) PASS: lldb-shell :: Breakpoint/debug_rnglist_basic.test (1170 of 2163) PASS: lldb-unit :: ScriptInterpreter/Python/./ScriptInterpreterPythonTests/PythonDataObjectsTest.TestPythonDictionaryManipulation (1171 of 2163) PASS: lldb-unit :: Utility/./UtilityTests/BinaryStreamTest.PutSLEB128EightBytes (1172 of 2163) PASS: lldb-unit :: Utility/./UtilityTests/ArgsTest.EscapeLLDBCommandArgument (1173 of 2163) PASS: lldb-api :: commands/target/dump-symtab-demangle/TestDumpSymtabDemangle.py (1174 of 2163) PASS: lldb-shell :: ObjectFile/wasm/unified-debug-sections.yaml (1175 of 2163) PASS: lldb-unit :: Core/./LLDBCoreTests/RichManglingContextTest.FromCxxMethodName (1176 of 2163) PASS: lldb-api :: lang/cpp/accelerator-table/TestCPPAccelerator.py (1177 of 2163) UNSUPPORTED: lldb-api :: tools/lldb-server/TestGdbRemote_vContThreads.py (1178 of 2163) PASS: lldb-api :: functionalities/data-formatter/data-formatter-stl/libcxx/forward_list/TestDataFormatterLibcxxForwardList.py (1179 of 2163) PASS: lldb-unit :: Host/./HostTests/SocketTests/SocketTest.TCPGetAddress/ipv6 (1180 of 2163) PASS: lldb-api :: functionalities/conditional_break/TestConditionalBreak.py (1181 of 2163) PASS: lldb-api :: functionalities/thread/concurrent_events/TestConcurrentNWatchNBreak.py (1182 of 2163) PASS: lldb-unit :: ScriptInterpreter/Python/./ScriptInterpreterPythonTests/PythonDataObjectsTest.TestInstanceNameResolutionNoDot (1183 of 2163) PASS: lldb-api :: functionalities/thread/concurrent_events/TestConcurrentCrashWithSignal.py (1184 of 2163) PASS: lldb-unit :: Process/minidump/./LLDBMinidumpTests/MinidumpParserTest.GetMiscInfo_no_stream (1185 of 2163) PASS: lldb-shell :: Reproducer/TestDSYM.test (1186 of 2163) PASS: lldb-api :: commands/frame/diagnose/bad-reference/TestBadReference.py (1187 of 2163) PASS: lldb-api :: functionalities/thread/concurrent_events/TestConcurrentCrashWithWatchpointBreakpointSignal.py (1188 of 2163) PASS: lldb-unit :: Utility/./UtilityTests/UriParserTest.TypicalPortPathIPv6 (1189 of 2163) PASS: lldb-api :: functionalities/thread/concurrent_events/TestConcurrentSignalWatchBreak.py (1190 of 2163) UNSUPPORTED: lldb-api :: functionalities/unwind/standard/TestStandardUnwind.py (1191 of 2163) PASS: lldb-api :: tools/lldb-server/TestGdbRemoteSingleStep.py (1192 of 2163) PASS: lldb-api :: functionalities/data-formatter/var-in-aggregate-misuse/TestVarInAggregateMisuse.py (1193 of 2163) PASS: lldb-shell :: Breakpoint/dummy-target.test (1194 of 2163) UNSUPPORTED: lldb-shell :: SymbolFile/target-symbols-add-unwind.test (1195 of 2163) PASS: lldb-unit :: Utility/./UtilityTests/VMRange.SetEndAddress (1196 of 2163) PASS: lldb-shell :: Breakpoint/case-sensitive.test (1197 of 2163) PASS: lldb-unit :: Utility/./UtilityTests/AnsiTerminal.Twice (1198 of 2163) PASS: lldb-shell :: Expr/TestIRMemoryMap.test (1199 of 2163) PASS: lldb-shell :: SymbolFile/DWARF/anon_class_w_and_wo_export_symbols.ll (1200 of 2163) PASS: lldb-shell :: Breakpoint/debug_addrx.test (1201 of 2163) PASS: lldb-unit :: ObjectFile/Breakpad/./ObjectFileBreakpadTests/FuncRecord.parse (1202 of 2163) PASS: lldb-unit :: Utility/./UtilityTests/XcodeSDKTest.SDKSupportsModules (1203 of 2163) PASS: lldb-api :: python_api/disassemble-raw-data/TestDisassemble_VST1_64.py (1204 of 2163) PASS: lldb-api :: functionalities/data-formatter/data-formatter-objc/TestDataFormatterObjCNSBundle.py (1205 of 2163) PASS: lldb-shell :: SymbolFile/DWARF/DW_OP_piece-struct.s (1206 of 2163) PASS: lldb-shell :: Reproducer/TestFileRepro.test (1207 of 2163) PASS: lldb-api :: commands/process/launch/TestProcessLaunch.py (1208 of 2163) PASS: lldb-api :: functionalities/param_entry_vals/basic_entry_values/TestBasicEntryValues.py (1209 of 2163) PASS: lldb-unit :: Symbol/./SymbolTests/TestTypeSystemClang.TestDeletingImplicitCopyCstrDueToMoveCStr (1210 of 2163) PASS: lldb-api :: commands/frame/recognizer/TestFrameRecognizer.py (1211 of 2163) PASS: lldb-shell :: SymbolFile/DWARF/debug_line-relative_path.s (1212 of 2163) PASS: lldb-unit :: Process/gdb-remote/./ProcessGdbRemoteTests/GDBRemoteCommunicationClientTest.WriteRegisterNoSuffix (1213 of 2163) PASS: lldb-unit :: Host/./HostTests/SocketTests/SocketTest.TCPListen0GetPort/ipv4 (1214 of 2163) PASS: lldb-shell :: Reproducer/TestVerify.test (1215 of 2163) PASS: lldb-api :: lang/objc/self/TestObjCSelf.py (1216 of 2163) PASS: lldb-unit :: Utility/./UtilityTests/StringListTest.AppendStringMove (1217 of 2163) PASS: lldb-unit :: ObjectFile/Breakpad/./ObjectFileBreakpadTests/ModuleRecord.parse (1218 of 2163) PASS: lldb-api :: lang/cpp/bitfields/TestCppBitfields.py (1219 of 2163) PASS: lldb-unit :: Utility/./UtilityTests/PassiveReplayTest.InstrumentedFooInvalid (1220 of 2163) PASS: lldb-api :: commands/expression/regression-access-function-template-in-record/TestRegressionAccessFunctionTemplateInRecord.py (1221 of 2163) PASS: lldb-unit :: Host/./HostTests/HostInfoTest.GetXcodeSDK (1222 of 2163) PASS: lldb-unit :: Utility/./UtilityTests/StreamTest.PutRawBytesToBigEndian (1223 of 2163) PASS: lldb-shell :: Watchpoint/SetErrorCases.test (1224 of 2163) PASS: lldb-api :: api/multithreaded/TestMultithreaded.py (1225 of 2163) PASS: lldb-unit :: Utility/./UtilityTests/CompletionRequest.DuplicateFilteringWithComments (1226 of 2163) PASS: lldb-unit :: Utility/./UtilityTests/StringExtractorTest.GetU32LittleEndian (1227 of 2163) PASS: lldb-unit :: Utility/./UtilityTests/NameMatchesTest.Contains (1228 of 2163) PASS: lldb-unit :: Core/./LLDBCoreTests/SourceFileCache.FindSourceFileFound (1229 of 2163) PASS: lldb-unit :: Utility/./UtilityTests/BinaryStreamTest.PutSLEB128OneByte (1230 of 2163) PASS: lldb-unit :: Utility/./UtilityTests/BinaryStreamTest.PutSLEB128FiveBytes (1231 of 2163) PASS: lldb-unit :: ScriptInterpreter/Python/./ScriptInterpreterPythonTests/PythonDataObjectsTest.TestPythonTupleInitializerList2 (1232 of 2163) PASS: lldb-api :: functionalities/data-formatter/data-formatter-stl/libcxx/unordered/TestDataFormatterUnordered.py (1233 of 2163) PASS: lldb-unit :: Language/Highlighting/./HighlighterTests/HighlighterTest.HighlighterSelectionType (1234 of 2163) UNSUPPORTED: lldb-api :: lang/c/typedef/Testtypedef.py (1235 of 2163) PASS: lldb-api :: functionalities/target-new-solib-notifications/TestModuleLoadedNotifys.py (1236 of 2163) PASS: lldb-unit :: Host/./HostTests/SocketTests/SocketTest.UDPConnect/ipv6 (1237 of 2163) PASS: lldb-api :: lang/objc/print-obj/TestPrintObj.py (1238 of 2163) PASS: lldb-api :: lang/cpp/namespace_conflicts/TestNamespaceConflicts.py (1239 of 2163) PASS: lldb-unit :: UnwindAssembly/x86/./UnwindAssemblyx86Tests/Testx86AssemblyInspectionEngine.Test32BitOnlyInstruction (1240 of 2163) PASS: lldb-unit :: Utility/./UtilityTests/StringListTest.LongestCommonPrefixDuplicateElement (1241 of 2163) PASS: lldb-api :: lang/objc/foundation/TestObjCMethodsNSArray.py (1242 of 2163) UNSUPPORTED: lldb-shell :: SymbolFile/PDB/class-layout.test (1243 of 2163) PASS: lldb-shell :: SymbolFile/DWARF/debug-types-dwo-cross-reference.cpp (1244 of 2163) UNSUPPORTED: lldb-api :: functionalities/longjmp/TestLongjmp.py (1245 of 2163) PASS: lldb-api :: functionalities/data-formatter/data-formatter-objc/TestDataFormatterObjCNSError.py (1246 of 2163) PASS: lldb-unit :: UnwindAssembly/x86/./UnwindAssemblyx86Tests/Testx86AssemblyInspectionEngine.TestPopRBPWithREX (1247 of 2163) UNSUPPORTED: lldb-shell :: SymbolFile/PDB/enums-layout.test (1248 of 2163) PASS: lldb-unit :: Utility/./UtilityTests/StringExtractorTest.GetHexBytesAvail_Underflow (1249 of 2163) PASS: lldb-shell :: Commands/command-disassemble.s (1250 of 2163) PASS: lldb-api :: lang/objc/modules-hash-mismatch/TestClangModulesHashMismatch.py (1251 of 2163) PASS: lldb-api :: commands/expression/deleting-implicit-copy-constructor/TestDeletingImplicitCopyConstructor.py (1252 of 2163) PASS: lldb-api :: functionalities/thread/concurrent_events/TestConcurrentDelayedCrashWithBreakpointSignal.py (1253 of 2163) PASS: lldb-api :: lang/c/bitfields/TestBitfields.py (1254 of 2163) PASS: lldb-unit :: Utility/./UtilityTests/StringListTest.AppendStringCString (1255 of 2163) UNSUPPORTED: lldb-api :: functionalities/data-formatter/data-formatter-stl/libstdcpp/unique_ptr/TestDataFormatterStdUniquePtr.py (1256 of 2163) PASS: lldb-unit :: Utility/./UtilityTests/RegularExpression.Invalid (1257 of 2163) PASS: lldb-shell :: BuildScript/modes.test (1258 of 2163) PASS: lldb-shell :: ObjectFile/ELF/minidebuginfo-find-symbols.yaml (1259 of 2163) PASS: lldb-api :: lang/cpp/constructors/TestCppConstructors.py (1260 of 2163) PASS: lldb-shell :: BuildScript/toolchain-clang.test (1261 of 2163) PASS: lldb-api :: tools/lldb-vscode/variables/TestVSCode_variables.py (1262 of 2163) PASS: lldb-unit :: Language/Highlighting/./HighlighterTests/HighlighterTest.ClangCommas (1263 of 2163) PASS: lldb-api :: commands/gui/breakpoints/TestGuiBreakpoints.py (1264 of 2163) PASS: lldb-shell :: ObjectFile/ELF/netbsd-exec-8.99.30-amd64.yaml (1265 of 2163) PASS: lldb-unit :: Interpreter/./InterpreterTests/OptionArgParserTest.toScriptLanguage (1266 of 2163) PASS: lldb-unit :: Utility/./UtilityTests/DataExtractorTest.GetCStrAtEnd (1267 of 2163) PASS: lldb-unit :: ScriptInterpreter/Python/./ScriptInterpreterPythonTests/PythonDataObjectsTest.TestBorrowedReferences (1268 of 2163) PASS: lldb-api :: commands/expression/import-std-module/stack/TestStackFromStdModule.py (1269 of 2163) PASS: lldb-api :: commands/expression/ir-interpreter-phi-nodes/TestIRInterpreterPHINodes.py (1270 of 2163) PASS: lldb-api :: lang/cpp/gmodules/TestWithModuleDebugging.py (1271 of 2163) PASS: lldb-shell :: SymbolFile/DWARF/array-sizes.s (1272 of 2163) PASS: lldb-shell :: Commands/command-backtrace.test (1273 of 2163) PASS: lldb-api :: functionalities/data-formatter/data-formatter-stl/libcxx/deque/TestDataFormatterLibcxxDeque.py (1274 of 2163) PASS: lldb-api :: functionalities/plugins/command_plugin/TestPluginCommands.py (1275 of 2163) UNSUPPORTED: lldb-shell :: ExecControl/StopHook/stop-hook-threads.test (1276 of 2163) PASS: lldb-api :: functionalities/stats_api/TestStatisticsAPI.py (1277 of 2163) PASS: lldb-unit :: Utility/./UtilityTests/BinaryStreamTest.PutSLEB128TwoBytes (1278 of 2163) PASS: lldb-unit :: ObjectFile/PECOFF/./ObjectFilePECOFFTests/PECallFrameInfoTest.Basic_eh (1279 of 2163) PASS: lldb-unit :: Utility/./UtilityTests/AnsiTerminal.AtStart (1280 of 2163) PASS: lldb-unit :: Utility/./UtilityTests/StreamTest.PutHex8 (1281 of 2163) PASS: lldb-api :: lang/objc/global_ptrs/TestGlobalObjects.py (1282 of 2163) PASS: lldb-api :: commands/target/stop-hook/enable/TestTargetStopHookEnable.py (1283 of 2163) PASS: lldb-shell :: Expr/TestMultilineExpr.test (1284 of 2163) PASS: lldb-unit :: UnwindAssembly/x86/./UnwindAssemblyx86Tests/Testx86AssemblyInspectionEngine.TestPopEDI (1285 of 2163) PASS: lldb-unit :: Utility/./UtilityTests/SharedCluster.ClusterManager (1286 of 2163) UNSUPPORTED: lldb-api :: tools/intel-features/intel-pt/test/TestIntelPTSimpleBinary.py (1287 of 2163) PASS: lldb-api :: functionalities/tail_call_frames/unambiguous_sequence/TestUnambiguousTailCalls.py (1288 of 2163) PASS: lldb-api :: functionalities/thread/concurrent_events/TestConcurrentTwoWatchpointThreads.py (1289 of 2163) PASS: lldb-shell :: ObjectFile/Breakpad/uuid-matching-mac.test (1290 of 2163) PASS: lldb-unit :: Utility/./UtilityTests/StreamTeeTest.CopyConstructor (1291 of 2163) PASS: lldb-unit :: Utility/./UtilityTests/SubsystemRAIITest.NormalSubsystem (1292 of 2163) PASS: lldb-api :: lang/c/complex/TestComplexC99.py (1293 of 2163) PASS: lldb-unit :: Core/./LLDBCoreTests/ModuleSpecTest.InvalidInMemoryBuffer (1294 of 2163) PASS: lldb-unit :: Utility/./UtilityTests/StreamTest.PutHex64ByteOrderLittle (1295 of 2163) PASS: lldb-unit :: Host/./HostTests/NativeProcessProtocolTest.ReadMemoryWithoutTrap (1296 of 2163) PASS: lldb-unit :: Process/gdb-remote/./ProcessGdbRemoteTests/GDBRemoteCommunicationServerTest.SendErrorResponse_ErrorNumber (1297 of 2163) PASS: lldb-unit :: ObjectFile/Breakpad/./ObjectFileBreakpadTests/FileRecord.parse (1298 of 2163) PASS: lldb-unit :: API/./APITests/SBCommandInterpreterTest.SingleWordCommand (1299 of 2163) PASS: lldb-unit :: Host/./HostTests/FileActionTest.Open (1300 of 2163) PASS: lldb-api :: functionalities/gdb_remote_client/TestRecognizeBreakpoint.py (1301 of 2163) PASS: lldb-unit :: Utility/./UtilityTests/SubsystemRAIITest.SubsystemWithErrorSuccess (1302 of 2163) PASS: lldb-api :: tools/lldb-server/TestGdbRemoteExpeditedRegisters.py (1303 of 2163) PASS: lldb-unit :: Utility/./UtilityTests/DataExtractorTest.GetMaxS64 (1304 of 2163) PASS: lldb-unit :: Utility/./UtilityTests/NameMatchesTest.StartsWith (1305 of 2163) PASS: lldb-api :: tools/lldb-vscode/console/TestVSCode_console.py (1306 of 2163) PASS: lldb-api :: functionalities/abbreviation/TestAbbreviations.py (1307 of 2163) PASS: lldb-api :: commands/expression/import-std-module/forward_decl_from_module/TestForwardDeclFromStdModule.py (1308 of 2163) UNSUPPORTED: lldb-api :: lang/cpp/printf/TestPrintf.py (1309 of 2163) PASS: lldb-api :: functionalities/reproducers/attach/TestReproducerAttach.py (1310 of 2163) PASS: lldb-shell :: Reproducer/Modules/TestModuleCXX.test (1311 of 2163) PASS: lldb-unit :: Utility/./UtilityTests/ScalarTest.Equality (1312 of 2163) PASS: lldb-unit :: Expression/./ExpressionTests/CppModuleConfigurationTest.LinuxLocalLibCpp (1313 of 2163) PASS: lldb-unit :: Symbol/./SymbolTests/PostfixExpression.ParseOneExpression (1314 of 2163) PASS: lldb-shell :: SymbolFile/DWARF/limit-debug-info.s (1315 of 2163) PASS: lldb-unit :: Host/./HostTests/SocketTests/SocketTest.TCPGetConnectURI/ipv6 (1316 of 2163) PASS: lldb-unit :: Host/./HostTests/MainLoopTest.ReadObject (1317 of 2163) PASS: lldb-shell :: SymbolFile/DWARF/DW_AT_low_pc-addrx.s (1318 of 2163) PASS: lldb-api :: commands/expression/context-object/TestContextObject.py (1319 of 2163) PASS: lldb-api :: lang/cpp/static_methods/TestCPPStaticMethods.py (1320 of 2163) PASS: lldb-unit :: Utility/./UtilityTests/DataExtractorTest.UncommonAddressSize (1321 of 2163) PASS: lldb-api :: functionalities/thread/concurrent_events/TestConcurrentSignalWatch.py (1322 of 2163) UNSUPPORTED: lldb-shell :: Register/x86-ymm-read.test (1323 of 2163) PASS: lldb-api :: macosx/function-starts/TestFunctionStarts.py (1324 of 2163) PASS: lldb-unit :: SymbolFile/DWARF/./SymbolFileDWARFTests/SymbolFileDWARFTests.TestAbilitiesForDWARF (1325 of 2163) PASS: lldb-api :: commands/target/create-no-such-arch/TestNoSuchArch.py (1326 of 2163) PASS: lldb-shell :: Reproducer/TestCrash.test (1327 of 2163) PASS: lldb-unit :: Core/./LLDBCoreTests/SourceFileCache.FindSourceFileNotFound (1328 of 2163) PASS: lldb-unit :: UnwindAssembly/x86/./UnwindAssemblyx86Tests/Testx86AssemblyInspectionEngine.TestSubESP (1329 of 2163) PASS: lldb-shell :: Minidump/memory-region.yaml (1330 of 2163) PASS: lldb-unit :: Utility/./UtilityTests/StreamTest.ShiftOperatorStrings (1331 of 2163) PASS: lldb-shell :: Breakpoint/jitbp_elf.test (1332 of 2163) PASS: lldb-api :: functionalities/thread/concurrent_events/TestConcurrentWatchpointDelayWatchpointOneBreakpoint.py (1333 of 2163) PASS: lldb-unit :: Core/./LLDBCoreTests/RichManglingContextTest.Basic (1334 of 2163) PASS: lldb-api :: linux/builtin_trap/TestBuiltinTrap.py (1335 of 2163) PASS: lldb-api :: commands/frame/diagnose/array/TestArray.py (1336 of 2163) PASS: lldb-api :: functionalities/data-formatter/stringprinter/TestStringPrinter.py (1337 of 2163) PASS: lldb-unit :: Utility/./UtilityTests/ArgsTest.TestQuotedTrailingBackslash (1338 of 2163) PASS: lldb-api :: functionalities/return-value/TestReturnValue.py (1339 of 2163) PASS: lldb-unit :: UnwindAssembly/PPC64/./PPC64InstEmulationTests/TestPPC64InstEmulation.TestMediumFunction (1340 of 2163) PASS: lldb-unit :: Utility/./UtilityTests/UriParserTest.Empty (1341 of 2163) PASS: lldb-unit :: Utility/./UtilityTests/Flags.IsClear (1342 of 2163) UNSUPPORTED: lldb-shell :: ScriptInterpreter/Lua/lua-python.test (1343 of 2163) PASS: lldb-unit :: Utility/./UtilityTests/StringExtractorTest.DecodeHexU8_InvalidHex (1344 of 2163) PASS: lldb-unit :: Process/gdb-remote/./ProcessGdbRemoteTests/GDBRemoteClientBaseTest.SendContinueDelegateInterface (1345 of 2163) PASS: lldb-unit :: ScriptInterpreter/Python/./ScriptInterpreterPythonTests/PythonDataObjectsTest.TestCallable (1346 of 2163) PASS: lldb-shell :: SymbolFile/Breakpad/line-table-missing-file.test (1347 of 2163) PASS: lldb-api :: lang/cpp/const_this/TestConstThis.py (1348 of 2163) PASS: lldb-api :: functionalities/breakpoint/address_breakpoints/TestBadAddressBreakpoints.py (1349 of 2163) PASS: lldb-shell :: Reproducer/TestDump.test (1350 of 2163) PASS: lldb-api :: functionalities/data-formatter/data-formatter-proper-plurals/TestFormattersOneIsSingular.py (1351 of 2163) PASS: lldb-unit :: Utility/./UtilityTests/ConstStringTest.format_provider (1352 of 2163) UNSUPPORTED: lldb-api :: functionalities/darwin_log/filter/exact_match/subsystem/TestDarwinLogFilterMatchSubsystem.py (1353 of 2163) PASS: lldb-api :: commands/expression/import-std-module/no-std-module/TestMissingStdModule.py (1354 of 2163) UNSUPPORTED: lldb-shell :: Expr/TestIRMemoryMapWindows.test (1355 of 2163) PASS: lldb-api :: lang/objc/objc-checker/TestObjCCheckers.py (1356 of 2163) PASS: lldb-shell :: Commands/command-thread-select.test (1357 of 2163) PASS: lldb-shell :: Driver/TestTarget.test (1358 of 2163) PASS: lldb-api :: functionalities/gdb_remote_client/TestProcessConnect.py (1359 of 2163) PASS: lldb-unit :: Utility/./UtilityTests/StringListTest.ShiftCString (1360 of 2163) PASS: lldb-unit :: Utility/./UtilityTests/StringExtractorTest.GetHexBytesAvail_Partial (1361 of 2163) PASS: lldb-api :: lang/c/offsetof/TestOffsetof.py (1362 of 2163) PASS: lldb-api :: lang/c/complex_int/TestComplexInt.py (1363 of 2163) PASS: lldb-unit :: UnwindAssembly/ARM64/./Arm64InstEmulationTests/TestArm64InstEmulation.TestFramelessThreeEpilogueFunction (1364 of 2163) PASS: lldb-api :: python_api/watchpoint/TestWatchpointIter.py (1365 of 2163) PASS: lldb-shell :: SymbolFile/DWARF/debug_loc_and_loclists.s (1366 of 2163) PASS: lldb-unit :: UnwindAssembly/x86/./UnwindAssemblyx86Tests/Testx86AssemblyInspectionEngine.TestSpArithx86_64Augmented (1367 of 2163) PASS: lldb-unit :: ScriptInterpreter/Python/./ScriptInterpreterPythonTests/PythonDataObjectsTest.TestRun (1368 of 2163) PASS: lldb-unit :: Symbol/./SymbolTests/TestClangASTImporter.CopyTypeTagDecl (1369 of 2163) PASS: lldb-api :: commands/expression/weak_symbols/TestWeakSymbols.py (1370 of 2163) UNSUPPORTED: lldb-api :: functionalities/thread/break_after_join/TestBreakAfterJoin.py (1371 of 2163) PASS: lldb-unit :: Utility/./UtilityTests/RangeTest.NotEqualInvalid (1372 of 2163) PASS: lldb-unit :: Target/./TargetTests/ModuleCacheTest.GetAndPut (1373 of 2163) UNSUPPORTED: lldb-api :: functionalities/thread/concurrent_events/TestConcurrentManySignals.py (1374 of 2163) PASS: lldb-unit :: Utility/./UtilityTests/StreamTest.PutCString (1375 of 2163) PASS: lldb-unit :: Utility/./UtilityTests/StreamTeeTest.AppendStream (1376 of 2163) PASS: lldb-unit :: Utility/./UtilityTests/ListenerTest.GetEventImmediate (1377 of 2163) PASS: lldb-api :: lang/cpp/unicode-literals/TestUnicodeLiterals.py (1378 of 2163) PASS: lldb-unit :: Utility/./UtilityTests/CompletionRequest.TryCompleteCurrentArgMode (1379 of 2163) PASS: lldb-api :: functionalities/thread/concurrent_events/TestConcurrentTwoWatchpointsOneDelayBreakpoint.py (1380 of 2163) PASS: lldb-unit :: Utility/./UtilityTests/StreamTest.PutRawBytesToMixedEndian (1381 of 2163) PASS: lldb-shell :: Heap/heap-cstr.test (1382 of 2163) PASS: lldb-unit :: SymbolFile/NativePDB/./SymbolFileNativePDBTests/PDBFPOProgramToDWARFExpressionTests.MultipleDependentAssignments (1383 of 2163) PASS: lldb-api :: functionalities/thread/crash_during_step/TestCrashDuringStep.py (1384 of 2163) PASS: lldb-unit :: Utility/./UtilityTests/SerializationRountripTest.SerializeDeserializeCStringNull (1385 of 2163) PASS: lldb-unit :: SymbolFile/DWARF/./SymbolFileDWARFTests/SymbolFileDWARFTests.TestAbbrevOutOfOrder (1386 of 2163) PASS: lldb-unit :: Process/gdb-remote/./ProcessGdbRemoteTests/GDBRemoteCommunicationClientTest.WriteRegister (1387 of 2163) PASS: lldb-api :: functionalities/pre_run_dylibs/TestPreRunDylibs.py (1388 of 2163) PASS: lldb-unit :: Process/gdb-remote/./ProcessGdbRemoteTests/GDBRemoteClientBaseTest.SendContinueAndWait (1389 of 2163) PASS: lldb-api :: functionalities/breakpoint/breakpoint_command/TestBreakpointCommandsFromPython.py (1390 of 2163) PASS: lldb-unit :: Utility/./UtilityTests/OptionsWithRawTest.SingleWordSuffix (1391 of 2163) PASS: lldb-unit :: Utility/./UtilityTests/EventTest.DumpEventDataBytes (1392 of 2163) PASS: lldb-api :: commands/disassemble/basic/TestDisassembleBreakpoint.py (1393 of 2163) PASS: lldb-api :: commands/expression/call-function/TestCallStopAndContinue.py (1394 of 2163) PASS: lldb-unit :: Utility/./UtilityTests/StreamTest.PutBytesAsRawHex8ToLittleEndian (1395 of 2163) PASS: lldb-unit :: Utility/./UtilityTests/ScalarTest.ExtractBitfield (1396 of 2163) PASS: lldb-unit :: Utility/./UtilityTests/VASprintfTest.EncodingError (1397 of 2163) PASS: lldb-unit :: Utility/./UtilityTests/GeneratorTest.Get (1398 of 2163) PASS: lldb-shell :: Driver/TestRepl.test (1399 of 2163) PASS: lldb-unit :: Utility/./UtilityTests/StreamTest.PutStringAsRawHex8 (1400 of 2163) PASS: lldb-api :: functionalities/thread/concurrent_events/TestConcurrentTwoWatchpointsOneSignal.py (1401 of 2163) PASS: lldb-unit :: ScriptInterpreter/Python/./ScriptInterpreterPythonTests/PythonDataObjectsTest.TestPythonListToStructuredList (1402 of 2163) PASS: lldb-unit :: ObjectFile/Breakpad/./ObjectFileBreakpadTests/Record.classify (1403 of 2163) UNSUPPORTED: lldb-api :: functionalities/darwin_log/filter/regex/activity-chain/TestDarwinLogFilterRegexActivityChain.py (1404 of 2163) UNSUPPORTED: lldb-api :: functionalities/signal/handle-segv/TestHandleSegv.py (1405 of 2163) PASS: lldb-shell :: SymbolFile/DWARF/childless-compile-unit.s (1406 of 2163) PASS: lldb-unit :: Utility/./UtilityTests/StatusTest.ErrorConversion (1407 of 2163) PASS: lldb-shell :: Minidump/disassemble-no-module.yaml (1408 of 2163) PASS: lldb-api :: functionalities/var_path/TestVarPath.py (1409 of 2163) UNSUPPORTED: lldb-shell :: Breakpoint/case-insensitive.test (1410 of 2163) PASS: lldb-api :: python_api/section/TestSectionAPI.py (1411 of 2163) PASS: lldb-api :: functionalities/breakpoint/serialize/TestBreakpointSerialization.py (1412 of 2163) PASS: lldb-api :: commands/expression/call-function/TestCallStdStringFunction.py (1413 of 2163) PASS: lldb-unit :: Utility/./UtilityTests/StringListTest.InsertStringAtIndexStdString (1414 of 2163) PASS: lldb-unit :: Utility/./UtilityTests/VMRange.CollectionContains (1415 of 2163) PASS: lldb-api :: functionalities/data-formatter/format-propagation/TestFormatPropagation.py (1416 of 2163) PASS: lldb-unit :: Expression/./ExpressionTests/DiagnosticManagerTest.PutStringSeverities (1417 of 2163) PASS: lldb-unit :: Utility/./UtilityTests/RegularExpression.Match (1418 of 2163) PASS: lldb-api :: macosx/order/TestOrderFile.py (1419 of 2163) PASS: lldb-api :: lang/objc/foundation/TestConstStrings.py (1420 of 2163) PASS: lldb-unit :: UnwindAssembly/x86/./UnwindAssemblyx86Tests/Testx86AssemblyInspectionEngine.TestPopR15 (1421 of 2163) PASS: lldb-unit :: ObjectFile/ELF/./ObjectFileELFTests/ObjectFileELFTest.GetSymtab_NoSymEntryPointArmAddressClass (1422 of 2163) PASS: lldb-unit :: Utility/./UtilityTests/RangeTest.LessThan (1423 of 2163) PASS: lldb-unit :: Utility/./UtilityTests/RangeTest.Equal (1424 of 2163) PASS: lldb-unit :: Utility/./UtilityTests/ScalarTest.SetValueFromCString (1425 of 2163) PASS: lldb-api :: lang/cpp/function-qualifiers/TestCppFunctionQualifiers.py (1426 of 2163) PASS: lldb-api :: commands/expression/inline-namespace/TestInlineNamespace.py (1427 of 2163) PASS: lldb-unit :: Symbol/./SymbolTests/LineEntryTest.GetSameLineContiguousAddressRangeNoInlines (1428 of 2163) PASS: lldb-unit :: Utility/./UtilityTests/ScalarTest.RightShiftOperator (1429 of 2163) PASS: lldb-shell :: Minidump/Windows/arm-fp-unwind.test (1430 of 2163) PASS: lldb-api :: functionalities/thread/concurrent_events/TestConcurrentWatchpointWithDelayWatchpointThreads.py (1431 of 2163) PASS: lldb-api :: functionalities/data-formatter/data-formatter-stl/libcxx/multiset/TestDataFormatterLibcxxMultiSet.py (1432 of 2163) PASS: lldb-unit :: Utility/./UtilityTests/RangeTest.Constructor (1433 of 2163) PASS: lldb-shell :: Breakpoint/implicit_const_form_support.test (1434 of 2163) PASS: lldb-shell :: SymbolFile/DWARF/dwp.s (1435 of 2163) PASS: lldb-api :: lang/cpp/member-and-local-vars-with-same-name/TestMembersAndLocalsWithSameName.py (1436 of 2163) PASS: lldb-api :: commands/command/invalid-args/TestInvalidArgsCommand.py (1437 of 2163) PASS: lldb-api :: tools/lldb-vscode/runInTerminal/TestVSCode_runInTerminal.py (1438 of 2163) PASS: lldb-unit :: Instruction/./EmulatorTests/TestAArch64Emulator.TestOverflow (1439 of 2163) PASS: lldb-shell :: SymbolFile/Breakpad/symtab.test (1440 of 2163) PASS: lldb-unit :: Host/./HostTests/SocketTests/SocketTest.TCPListen0GetPort/ipv6 (1441 of 2163) UNSUPPORTED: lldb-api :: commands/expression/call-restarts/TestCallThatRestarts.py (1442 of 2163) PASS: lldb-shell :: ObjectFile/ELF/aarch64-relocations.yaml (1443 of 2163) PASS: lldb-api :: commands/watchpoints/watchpoint_commands/command/TestWatchpointCommandLLDB.py (1444 of 2163) PASS: lldb-api :: tools/lldb-vscode/attach/TestVSCode_attach.py (1445 of 2163) PASS: lldb-unit :: Utility/./UtilityTests/ConstStringTest.MangledCounterpart (1446 of 2163) PASS: lldb-api :: lang/objc/blocks/TestObjCIvarsInBlocks.py (1447 of 2163) PASS: lldb-unit :: Utility/./UtilityTests/ListenerTest.GetEventWait (1448 of 2163) PASS: lldb-unit :: Host/./HostTests/NativeProcessProtocolTest.ReadCStringFromMemory (1449 of 2163) PASS: lldb-unit :: Utility/./UtilityTests/VMRange.Comparison (1450 of 2163) PASS: lldb-api :: commands/breakpoint/command/list/TestBreakpointCommandList.py (1451 of 2163) PASS: lldb-unit :: Utility/./UtilityTests/RangeTest.ContainsEndInclusive (1452 of 2163) PASS: lldb-api :: commands/frame/diagnose/local-variable/TestLocalVariable.py (1453 of 2163) PASS: lldb-unit :: Host/./HostTests/NativeProcessProtocolTest.SetBreakpointFailRead (1454 of 2163) PASS: lldb-api :: types/TestIntegerType.py (1455 of 2163) PASS: lldb-api :: functionalities/inferior-crashing/TestInferiorCrashing.py (1456 of 2163) PASS: lldb-shell :: Reproducer/TestSynchronous.test (1457 of 2163) PASS: lldb-shell :: Settings/TestEchoCommands.test (1458 of 2163) PASS: lldb-api :: commands/target/stop-hook/disable/TestTargetStopHookDisable.py (1459 of 2163) PASS: lldb-api :: functionalities/thread/ignore_suspended/TestIgnoreSuspendedThread.py (1460 of 2163) PASS: lldb-api :: functionalities/data-formatter/data-formatter-objc/nsstring/TestDataFormatterNSString.py (1461 of 2163) PASS: lldb-api :: functionalities/breakpoint/inlined_breakpoints/TestInlinedBreakpoints.py (1462 of 2163) PASS: lldb-api :: commands/version/TestVersion.py (1463 of 2163) PASS: lldb-api :: functionalities/data-formatter/parray/TestPrintArray.py (1464 of 2163) XFAIL: lldb-shell :: SymbolFile/DWARF/find-type-in-function.cpp (1465 of 2163) PASS: lldb-unit :: Process/gdb-remote/./ProcessGdbRemoteTests/GDBRemoteCommunicationClientTest.SendGetDataPacket (1466 of 2163) PASS: lldb-shell :: ObjectFile/PECOFF/basic-info-arm.yaml (1467 of 2163) PASS: lldb-unit :: Utility/./UtilityTests/ArgsTest.TestSingleQuotedArgWithSpace (1468 of 2163) PASS: lldb-api :: lang/objc/objc-baseclass-sbtype/TestObjCBaseClassSBType.py (1469 of 2163) PASS: lldb-api :: functionalities/data-formatter/data-formatter-caching/TestDataFormatterCaching.py (1470 of 2163) PASS: lldb-api :: functionalities/thread/concurrent_events/TestConcurrentCrashWithWatchpoint.py (1471 of 2163) PASS: lldb-api :: functionalities/data-formatter/nssetsynth/TestNSSetSynthetic.py (1472 of 2163) PASS: lldb-unit :: Language/Highlighting/./HighlighterTests/HighlighterTest.ClangIdentifiers (1473 of 2163) PASS: lldb-api :: commands/expression/import-std-module/vector-of-vectors/TestVectorOfVectorsFromStdModule.py (1474 of 2163) PASS: lldb-unit :: Utility/./UtilityTests/ArchSpecTest.YAML (1475 of 2163) UNSUPPORTED: lldb-shell :: Register/x86-gp-write.test (1476 of 2163) PASS: lldb-api :: python_api/lldbutil/process/TestPrintStackTraces.py (1477 of 2163) PASS: lldb-unit :: UnwindAssembly/x86/./UnwindAssemblyx86Tests/Testx86AssemblyInspectionEngine.TestPushESI (1478 of 2163) PASS: lldb-unit :: Language/Highlighting/./HighlighterTests/HighlighterTest.ClangCursorPosBeforeOtherToken (1479 of 2163) PASS: lldb-unit :: Utility/./UtilityTests/BinaryStreamTest.PutSLEB128SevenBytes (1480 of 2163) PASS: lldb-unit :: Utility/./UtilityTests/ArgsTest.GetQuotedCommandString (1481 of 2163) UNSUPPORTED: lldb-api :: tools/lldb-server/TestGdbRemoteAuxvSupport.py (1482 of 2163) PASS: lldb-api :: sample_test/TestSampleTest.py (1483 of 2163) PASS: lldb-unit :: UnwindAssembly/x86/./UnwindAssemblyx86Tests/Testx86AssemblyInspectionEngine.TestDisassemblyJunkBytes (1484 of 2163) PASS: lldb-shell :: SymbolFile/NativePDB/globals-fundamental.cpp (1485 of 2163) PASS: lldb-unit :: Target/./TargetTests/PathMappingListTest.RelativeTests (1486 of 2163) PASS: lldb-api :: lang/cpp/virtual-functions/TestCppVirtualFunctions.py (1487 of 2163) PASS: lldb-unit :: DataFormatter/./LLDBFormatterTests/StringPrinterTests.CxxASCII (1488 of 2163) PASS: lldb-api :: macosx/profile_vrs_detach/TestDetachVrsProfile.py (1489 of 2163) UNSUPPORTED: lldb-api :: tools/lldb-server/libraries-svr4/TestGdbRemoteLibrariesSvr4Support.py (1490 of 2163) PASS: lldb-unit :: UnwindAssembly/ARM64/./Arm64InstEmulationTests/TestArm64InstEmulation.TestRegisterSavedTwice (1491 of 2163) PASS: lldb-api :: lang/objcxx/hide-runtime-values/TestObjCXXHideRuntimeValues.py (1492 of 2163) PASS: lldb-unit :: Host/./HostTests/FileSystemTest.GetByteSize (1493 of 2163) PASS: lldb-api :: commands/command/delete/TestCommandDelete.py (1494 of 2163) PASS: lldb-unit :: Utility/./UtilityTests/OptionsWithRawTest.QuotedSuffix (1495 of 2163) PASS: lldb-unit :: DataFormatter/./LLDBFormatterTests/TypeMatcherTests.CreatedBySameMatchString (1496 of 2163) PASS: lldb-unit :: SymbolFile/NativePDB/./SymbolFileNativePDBTests/PDBFPOProgramToDWARFExpressionTests.DependencyChain (1497 of 2163) PASS: lldb-api :: commands/settings/use_source_cache/TestUseSourceCache.py (1498 of 2163) PASS: lldb-unit :: Utility/./UtilityTests/RecordReplayTest.InstrumentedBar (1499 of 2163) PASS: lldb-api :: types/TestDoubleTypesExpr.py (1500 of 2163) PASS: lldb-unit :: ScriptInterpreter/Python/./ScriptInterpreterPythonTests/PythonDataObjectsTest.TestPythonFile (1501 of 2163) PASS: lldb-api :: lang/cpp/gmodules-templates/TestGModules.py (1502 of 2163) PASS: lldb-api :: functionalities/data-formatter/data-formatter-objc/TestDataFormatterObjCNSData.py (1503 of 2163) UNSUPPORTED: lldb-api :: commands/watchpoints/variable_out_of_scope/TestWatchedVarHitWhenInScope.py (1504 of 2163) PASS: lldb-unit :: Utility/./UtilityTests/StringLexerTest.Next (1505 of 2163) PASS: lldb-unit :: Utility/./UtilityTests/StringLexerTest.GetUnlexed (1506 of 2163) PASS: lldb-api :: functionalities/pointer_num_children/TestPointerNumChildren.py (1507 of 2163) PASS: lldb-shell :: SymbolFile/DWARF/debug_ranges_and_rnglists.test (1508 of 2163) PASS: lldb-unit :: SymbolFile/NativePDB/./SymbolFileNativePDBTests/PDBFPOProgramToDWARFExpressionTests.UnknownOp (1509 of 2163) PASS: lldb-api :: functionalities/tsan/cpp_global_location/TestTsanCPPGlobalLocation.py (1510 of 2163) PASS: lldb-api :: commands/expression/top-level/TestTopLevelExprs.py (1511 of 2163) PASS: lldb-api :: commands/command/source/TestCommandSource.py (1512 of 2163) UNSUPPORTED: lldb-shell :: ScriptInterpreter/Lua/bindings.test (1513 of 2163) PASS: lldb-shell :: SymbolFile/DWARF/debug_rnglists-dwo.s (1514 of 2163) PASS: lldb-api :: functionalities/ubsan/basic/TestUbsanBasic.py (1515 of 2163) PASS: lldb-unit :: Utility/./UtilityTests/StringExtractorTest.GetHexBytesAvail_OddPair (1516 of 2163) UNSUPPORTED: lldb-shell :: Register/x86-64-xmm16-read.test (1517 of 2163) PASS: lldb-unit :: UnwindAssembly/x86/./UnwindAssemblyx86Tests/Testx86AssemblyInspectionEngine.TestPopEBP (1518 of 2163) PASS: lldb-api :: commands/watchpoints/multiple_threads/TestWatchpointMultipleThreads.py (1519 of 2163) PASS: lldb-shell :: ObjectFile/PECOFF/sections.yaml (1520 of 2163) PASS: lldb-api :: functionalities/lazy-loading/TestLazyLoading.py (1521 of 2163) PASS: lldb-unit :: debugserver/./debugserverTests/RNBSocket.LoopBackListenIPv6 (1522 of 2163) PASS: lldb-unit :: Target/./TargetTests/ExecutionContextTest.GetByteOrderProcess (1523 of 2163) PASS: lldb-shell :: ObjectFile/PECOFF/dep-modules.yaml (1524 of 2163) PASS: lldb-shell :: Reproducer/TestProcessList.test (1525 of 2163) PASS: lldb-shell :: Minidump/fb-dump.test (1526 of 2163) PASS: lldb-api :: commands/expression/import-std-module/weak_ptr/TestWeakPtrFromStdModule.py (1527 of 2163) PASS: lldb-api :: functionalities/data-formatter/data-formatter-stl/libcxx/initializerlist/TestInitializerList.py (1528 of 2163) PASS: lldb-unit :: UnwindAssembly/x86/./UnwindAssemblyx86Tests/Testx86AssemblyInspectionEngine.TestPushECX (1529 of 2163) UNSUPPORTED: lldb-api :: functionalities/darwin_log/filter/exact_match/activity/TestDarwinLogFilterMatchActivity.py (1530 of 2163) PASS: lldb-unit :: Target/./TargetTests/RemoteAwarePlatformTest.TestResolveExecutabelOnClientByPlatform (1531 of 2163) PASS: lldb-unit :: Language/Highlighting/./HighlighterTests/HighlighterTest.DefaultHighlighterWithCursorOutOfBounds (1532 of 2163) PASS: lldb-unit :: Process/minidump/./LLDBMinidumpTests/MinidumpParserTest.GetLinuxProcStatus_no_stream (1533 of 2163) PASS: lldb-unit :: Core/./LLDBCoreTests/RichManglingContextTest.SwitchProvider (1534 of 2163) PASS: lldb-unit :: Host/./HostTests/FileSystemTest.EmptyTest (1535 of 2163) PASS: lldb-shell :: SymbolFile/DWARF/split-dwarf-multiple-cu.ll (1536 of 2163) PASS: lldb-api :: lang/cpp/operators/TestCppOperators.py (1537 of 2163) PASS: lldb-api :: functionalities/breakpoint/source_regexp/TestSourceRegexBreakpoints.py (1538 of 2163) PASS: lldb-shell :: SymbolFile/NativePDB/global-classes.cpp (1539 of 2163) PASS: lldb-shell :: Breakpoint/debug_rnglist_rlestartend.test (1540 of 2163) PASS: lldb-api :: functionalities/gdb_remote_client/TestNoWatchpointSupportInfo.py (1541 of 2163) PASS: lldb-shell :: SymbolFile/DWARF/inline-function-address.ll (1542 of 2163) PASS: lldb-unit :: Process/minidump/./LLDBMinidumpTests/RegisterContextMinidump.CheckRegisterContextMinidump_ARM (1543 of 2163) PASS: lldb-shell :: BuildScript/script-args.test (1544 of 2163) PASS: lldb-unit :: Utility/./UtilityTests/LogChannelTest.Disable (1545 of 2163) PASS: lldb-unit :: UnwindAssembly/x86/./UnwindAssemblyx86Tests/Testx86AssemblyInspectionEngine.TestPopR13 (1546 of 2163) PASS: lldb-unit :: UnwindAssembly/x86/./UnwindAssemblyx86Tests/Testx86AssemblyInspectionEngine.TestLEAVE (1547 of 2163) PASS: lldb-api :: commands/expression/expr-in-syscall/TestExpressionInSyscall.py (1548 of 2163) PASS: lldb-unit :: Utility/./UtilityTests/StringListTest.CopyListEmpty (1549 of 2163) PASS: lldb-unit :: Host/./HostTests/SocketTests/SocketTest.UDPGetConnectURI/ipv4 (1550 of 2163) PASS: lldb-api :: sanity/TestSettingSkipping.py (1551 of 2163) PASS: lldb-api :: lang/objc/objc-struct-argument/TestObjCStructArgument.py (1552 of 2163) PASS: lldb-shell :: Reproducer/TestWorkingDir.test (1553 of 2163) PASS: lldb-api :: lang/objc/objc-stepping/TestObjCStepping.py (1554 of 2163) PASS: lldb-unit :: Expression/./ExpressionTests/DiagnosticManagerTest.GetStringMultiline (1555 of 2163) PASS: lldb-api :: functionalities/breakpoint/breakpoint_by_file_colon_line/TestBreakpointByFileColonLine.py (1556 of 2163) PASS: lldb-api :: lang/cpp/call-function/TestCallCPPFunction.py (1557 of 2163) PASS: lldb-unit :: Utility/./UtilityTests/StringExtractorTest.GetHexU8_Underflow2 (1558 of 2163) PASS: lldb-unit :: Utility/./UtilityTests/LogChannelEnabledTest.log_options (1559 of 2163) PASS: lldb-unit :: ScriptInterpreter/Python/./ScriptInterpreterPythonTests/PythonDataObjectsTest.TestPythonByteArray (1560 of 2163) PASS: lldb-api :: lang/cpp/limit-debug-info/TestWithLimitDebugInfo.py (1561 of 2163) PASS: lldb-shell :: SymbolFile/DWARF/debug_loclists-dwo.s (1562 of 2163) PASS: lldb-api :: functionalities/data-formatter/data-formatter-stl/libcxx/string/TestDataFormatterLibcxxString.py (1563 of 2163) PASS: lldb-api :: types/TestLongTypes.py (1564 of 2163) PASS: lldb-unit :: Utility/./UtilityTests/GeneratorTest.Create (1565 of 2163) PASS: lldb-api :: functionalities/breakpoint/comp_dir_symlink/TestCompDirSymLink.py (1566 of 2163) PASS: lldb-unit :: Utility/./UtilityTests/RangeDataVector.FindEntryIndexesThatContain_Overlap (1567 of 2163) PASS: lldb-unit :: Utility/./UtilityTests/UriParserTest.LongPath (1568 of 2163) PASS: lldb-api :: tools/lldb-server/commandline/TestStubSetSID.py (1569 of 2163) PASS: lldb-unit :: Language/Highlighting/./HighlighterTests/HighlighterTest.ClangStringLiterals (1570 of 2163) PASS: lldb-shell :: Minidump/no-process-id.yaml (1571 of 2163) PASS: lldb-shell :: Settings/TestSettingsWrite.test (1572 of 2163) PASS: lldb-unit :: Expression/./ExpressionTests/DiagnosticManagerTest.AppendMessageNoDiag (1573 of 2163) PASS: lldb-api :: lang/objcxx/class-name-clash/TestNameClash.py (1574 of 2163) PASS: lldb-api :: commands/expression/cast_int_to_anonymous_enum/TestCastIntToAnonymousEnum.py (1575 of 2163) PASS: lldb-unit :: Utility/./UtilityTests/StringExtractorTest.GetHexU8_Extra_NoEof (1576 of 2163) PASS: lldb-unit :: UnwindAssembly/x86/./UnwindAssemblyx86Tests/Testx86AssemblyInspectionEngine.TestPushRBP (1577 of 2163) PASS: lldb-unit :: Utility/./UtilityTests/VMRange.Clear (1578 of 2163) PASS: lldb-unit :: Core/./LLDBCoreTests/ModuleSpecTest.TestMachOFile (1579 of 2163) PASS: lldb-unit :: Editline/./EditlineTests/EditlineTestFixture.EditlineReceivesMultiLineText (1580 of 2163) PASS: lldb-api :: commands/thread/select/TestThreadSelect.py (1581 of 2163) PASS: lldb-shell :: Breakpoint/split-dwarf-5-addrbase.test (1582 of 2163) PASS: lldb-unit :: Process/minidump/./LLDBMinidumpTests/MinidumpParserTest.InvalidMinidump (1583 of 2163) PASS: lldb-unit :: Interpreter/./InterpreterTests/OptionValueFileColonLine.setFromString (1584 of 2163) PASS: lldb-unit :: Utility/./UtilityTests/StreamTest.PutPtr (1585 of 2163) PASS: lldb-api :: functionalities/dynamic_value_child_count/TestDynamicValueChildCount.py (1586 of 2163) PASS: lldb-unit :: Utility/./UtilityTests/UriParserTest.SchemeHostSeparator (1587 of 2163) PASS: lldb-unit :: Utility/./UtilityTests/StringLexerTest.HasAtLeast (1588 of 2163) PASS: lldb-api :: functionalities/gdb_remote_client/TestRestartBug.py (1589 of 2163) PASS: lldb-api :: lang/cpp/class_types/TestClassTypesDisassembly.py (1590 of 2163) PASS: lldb-api :: commands/expression/persistent_variables/TestPersistentVariables.py (1591 of 2163) PASS: lldb-api :: functionalities/limit-debug-info/TestLimitDebugInfo.py (1592 of 2163) PASS: lldb-unit :: Utility/./UtilityTests/FileSpecTest.EqualDotsWindows (1593 of 2163) PASS: lldb-unit :: Language/CPlusPlus/./LanguageCPlusPlusTests/CPlusPlusLanguage.MethodNameParsing (1594 of 2163) PASS: lldb-unit :: Host/./HostTests/MainLoopTest.TerminatesImmediately (1595 of 2163) PASS: lldb-shell :: SymbolFile/DWARF/find-variable-file.cpp (1596 of 2163) PASS: lldb-unit :: Utility/./UtilityTests/ArgsTest.TestOverwriteArgs (1597 of 2163) PASS: lldb-unit :: ScriptInterpreter/Python/./ScriptInterpreterPythonTests/PythonDataObjectsTest.TestPythonStringToStr (1598 of 2163) PASS: lldb-api :: functionalities/type_completion/TestTypeCompletion.py (1599 of 2163) PASS: lldb-api :: functionalities/data-formatter/cstring-utf8-summary/TestCstringUnicode.py (1600 of 2163) PASS: lldb-unit :: Utility/./UtilityTests/StringExtractorTest.GetHexU8_Underflow (1601 of 2163) PASS: lldb-api :: functionalities/data-formatter/vector-types/TestVectorTypesFormatting.py (1602 of 2163) PASS: lldb-api :: functionalities/tsan/multiple/TestTsanMultiple.py (1603 of 2163) PASS: lldb-api :: commands/expression/import-std-module/list/TestListFromStdModule.py (1604 of 2163) PASS: lldb-shell :: SymbolFile/Breakpad/unwind-via-raSearch.test (1605 of 2163) PASS: lldb-shell :: SymbolFile/DWARF/debug-types-missing-signature.test (1606 of 2163) PASS: lldb-unit :: Interpreter/./InterpreterTests/CompletionTest.FileCompletionAbsolute (1607 of 2163) PASS: lldb-unit :: Utility/./UtilityTests/ScalarTest.GetBytes (1608 of 2163) PASS: lldb-unit :: Process/minidump/./LLDBMinidumpTests/MinidumpParserTest.GetFilteredModuleList (1609 of 2163) UNSUPPORTED: lldb-shell :: Register/x86-zmm-write.test (1610 of 2163) PASS: lldb-api :: functionalities/data-formatter/ptr_ref_typedef/TestPtrRef2Typedef.py (1611 of 2163) PASS: lldb-unit :: Host/./HostTests/NativeProcessProtocolTest.SetBreakpointFailVerify (1612 of 2163) PASS: lldb-api :: functionalities/gdb_remote_client/TestPlatformClient.py (1613 of 2163) PASS: lldb-unit :: Utility/./UtilityTests/UriParserTest.MinimalPortPath (1614 of 2163) PASS: lldb-unit :: Utility/./UtilityTests/ConstStringTest.YAML (1615 of 2163) PASS: lldb-api :: python_api/lldbutil/iter/TestLLDBIterator.py (1616 of 2163) PASS: lldb-api :: functionalities/breakpoint/debugbreak/TestDebugBreak.py (1617 of 2163) PASS: lldb-api :: functionalities/gdb_remote_client/TestStopPCs.py (1618 of 2163) PASS: lldb-api :: lang/cpp/thread_local/TestThreadLocal.py (1619 of 2163) PASS: lldb-unit :: ScriptInterpreter/Python/./ScriptInterpreterPythonTests/PythonDataObjectsTest.TestPythonDictionaryValueEquality (1620 of 2163) PASS: lldb-unit :: Platform/./LLDBPlatformTests/PlatformDarwinTest.TestParseVersionBuildDir (1621 of 2163) PASS: lldb-api :: functionalities/gdb_remote_client/TestArmRegisterDefinition.py (1622 of 2163) PASS: lldb-api :: commands/platform/basic/TestPlatformPython.py (1623 of 2163) PASS: lldb-api :: commands/expression/import-std-module/shared_ptr-dbg-info-content/TestSharedPtrDbgInfoContentFromStdModule.py (1624 of 2163) PASS: lldb-api :: functionalities/postmortem/elf-core/thread_crash/TestLinuxCoreThreads.py (1625 of 2163) PASS: lldb-unit :: Utility/./UtilityTests/ArgsTest.StringListConstructor (1626 of 2163) PASS: lldb-api :: functionalities/data-formatter/builtin-formats/TestBuiltinFormats.py (1627 of 2163) UNSUPPORTED: lldb-shell :: SymbolFile/PDB/pointers.test (1628 of 2163) PASS: lldb-unit :: Host/./HostTests/FileSystemTest.MakeAbsolute (1629 of 2163) UNSUPPORTED: lldb-shell :: ObjectFile/ELF/minidebuginfo-no-lzma.yaml (1630 of 2163) PASS: lldb-shell :: ObjectFile/ELF/section-types-edgecases.yaml (1631 of 2163) PASS: lldb-unit :: Expression/./ExpressionTests/DiagnosticManagerTest.AppendMessageSubsequentDiags (1632 of 2163) UNSUPPORTED: lldb-api :: functionalities/thread/state/TestThreadStates.py (1633 of 2163) PASS: lldb-api :: functionalities/thread/concurrent_events/TestConcurrentDelaySignalBreak.py (1634 of 2163) PASS: lldb-unit :: Expression/./ExpressionTests/CppModuleConfigurationTest.UnknownLibCppFile (1635 of 2163) PASS: lldb-shell :: SymbolFile/DWARF/debug-types-basic.test (1636 of 2163) PASS: lldb-unit :: Disassembler/./DisassemblerTests/TestArm64Disassembly.TestArmv81Instruction (1637 of 2163) PASS: lldb-shell :: SymbolFile/DWARF/DW_TAG_variable-DW_AT_const_value.s (1638 of 2163) PASS: lldb-unit :: Process/minidump/./LLDBMinidumpTests/MinidumpParserTest.GetPidWow64 (1639 of 2163) PASS: lldb-unit :: Target/./TargetTests/ModuleCacheTest.GetAndPutUuidExists (1640 of 2163) PASS: lldb-api :: functionalities/plugins/python_os_plugin/TestPythonOSPlugin.py (1641 of 2163) UNSUPPORTED: lldb-shell :: Register/x86-64-ymm16-read.test (1642 of 2163) PASS: lldb-unit :: Utility/./UtilityTests/ScalarTest.TruncOrExtendTo (1643 of 2163) PASS: lldb-api :: python_api/watchpoint/watchlocation/TestTargetWatchAddress.py (1644 of 2163) UNSUPPORTED: lldb-api :: lang/objc/objc-dynamic-value/TestObjCDynamicValue.py (1645 of 2163) PASS: lldb-unit :: UnwindAssembly/ARM64/./Arm64InstEmulationTests/TestArm64InstEmulation.TestSimpleDarwinFunction (1646 of 2163) UNSUPPORTED: lldb-shell :: Register/arm-fp-read.test (1647 of 2163) PASS: lldb-unit :: Symbol/./SymbolTests/TestTypeSystemClang.TestConvertAccessTypeToAccessSpecifier (1648 of 2163) PASS: lldb-shell :: SymbolFile/DWARF/dwarf5-debug_line.s (1649 of 2163) PASS: lldb-api :: commands/expression/unwind_expression/TestUnwindExpression.py (1650 of 2163) PASS: lldb-api :: functionalities/data-formatter/data-formatter-objc/TestDataFormatterObjCNSURL.py (1651 of 2163) PASS: lldb-unit :: Utility/./UtilityTests/DataExtractorTest.GetMaxU64 (1652 of 2163) PASS: lldb-api :: types/TestFloatTypesExpr.py (1653 of 2163) PASS: lldb-api :: functionalities/thread/concurrent_events/TestConcurrentTwoBreakpointThreads.py (1654 of 2163) PASS: lldb-api :: macosx/indirect_symbol/TestIndirectSymbols.py (1655 of 2163) PASS: lldb-api :: functionalities/tail_call_frames/thread_step_out_or_return/TestSteppingOutWithArtificialFrames.py (1656 of 2163) PASS: lldb-unit :: Process/gdb-remote/./ProcessGdbRemoteTests/GDBRemoteClientBaseTest.SendPacketAndReceiveResponseWithOutputSupport (1657 of 2163) PASS: lldb-unit :: Language/Highlighting/./HighlighterTests/HighlighterTest.ClangUnterminatedString (1658 of 2163) PASS: lldb-api :: tools/lldb-vscode/coreFile/TestVSCode_coreFile.py (1659 of 2163) UNSUPPORTED: lldb-shell :: ScriptInterpreter/Lua/breakpoint_callback.test (1660 of 2163) PASS: lldb-unit :: Utility/./UtilityTests/StringListTest.GetMaxStringLengthEmpty (1661 of 2163) PASS: lldb-unit :: Utility/./UtilityTests/StreamTest.PutSLEB128 (1662 of 2163) PASS: lldb-unit :: ScriptInterpreter/Python/./ScriptInterpreterPythonTests/PythonDataObjectsTest.TestResetting (1663 of 2163) PASS: lldb-api :: commands/gui/viewlarge/TestGuiViewLarge.py (1664 of 2163) PASS: lldb-api :: lang/c/forward/TestForwardDeclaration.py (1665 of 2163) PASS: lldb-api :: commands/expression/import-std-module/deque-dbg-info-content/TestDbgInfoContentDequeFromStdModule.py (1666 of 2163) PASS: lldb-api :: functionalities/signal/TestSendSignal.py (1667 of 2163) PASS: lldb-unit :: Host/./HostTests/Host.GetEnvironment (1668 of 2163) PASS: lldb-api :: lang/objcxx/objcxx-ivar-vector/TestIvarVector.py (1669 of 2163) PASS: lldb-api :: commands/command/script/import/TestImport.py (1670 of 2163) PASS: lldb-unit :: Utility/./UtilityTests/StringExtractorTest.GetU64LittleEndian (1671 of 2163) PASS: lldb-shell :: Quit/TestQuitExitCodeHexA.test (1672 of 2163) PASS: lldb-unit :: Host/./HostTests/ConnectionFileDescriptorTest.TCPGetURIv6 (1673 of 2163) PASS: lldb-api :: functionalities/tail_call_frames/disambiguate_call_site/TestDisambiguateCallSite.py (1674 of 2163) PASS: lldb-shell :: SymbolFile/DWARF/debug-line-basic.s (1675 of 2163) PASS: lldb-unit :: Symbol/./SymbolTests/TestTypeSystemClang.TestGetBasicTypeFromName (1676 of 2163) PASS: lldb-api :: macosx/lc-note/kern-ver-str/TestKernVerStrLCNOTE.py (1677 of 2163) PASS: lldb-api :: lang/cpp/signed_types/TestSignedTypes.py (1678 of 2163) PASS: lldb-api :: commands/expression/import-std-module/forward_list-dbg-info-content/TestDbgInfoContentForwardListFromStdModule.py (1679 of 2163) PASS: lldb-api :: lang/cpp/multiple-inheritance/TestCppMultipleInheritance.py (1680 of 2163) PASS: lldb-unit :: Language/Highlighting/./HighlighterTests/HighlighterTest.ClangPPDirectives (1681 of 2163) PASS: lldb-unit :: Process/gdb-remote/./ProcessGdbRemoteTests/GDBRemoteClientBaseTest.SendContinueAndInterrupt2PacketBug (1682 of 2163) PASS: lldb-api :: tools/lldb-server/TestGdbRemoteThreadsInStopReply.py (1683 of 2163) PASS: lldb-unit :: Utility/./UtilityTests/DataExtractorTest.GetCStrAtNullOffset (1684 of 2163) PASS: lldb-unit :: Process/gdb-remote/./ProcessGdbRemoteTests/GDBRemoteCommunicationClientTest.GetModulesInfoInvalidResponse (1685 of 2163) PASS: lldb-api :: functionalities/inline-stepping/TestInlineStepping.py (1686 of 2163) PASS: lldb-api :: python_api/watchpoint/condition/TestWatchpointConditionAPI.py (1687 of 2163) PASS: lldb-api :: types/TestDoubleTypes.py (1688 of 2163) PASS: lldb-unit :: UnwindAssembly/x86/./UnwindAssemblyx86Tests/Testx86AssemblyInspectionEngine.TestDisassemblyMidFunctionEpilogues (1689 of 2163) PASS: lldb-shell :: SymbolFile/DWARF/DW_AT_const_value.s (1690 of 2163) PASS: lldb-api :: commands/expression/dont_allow_jit/TestAllowJIT.py (1691 of 2163) PASS: lldb-shell :: SymbolFile/DWARF/dir-separator-windows.s (1692 of 2163) PASS: lldb-shell :: Host/TestCustomShell.test (1693 of 2163) PASS: lldb-unit :: Process/minidump/./LLDBMinidumpTests/MinidumpParserTest.GetThreadContext_x86_32_wow64 (1694 of 2163) UNSUPPORTED: lldb-shell :: SymbolFile/PDB/function-level-linking.test (1695 of 2163) PASS: lldb-shell :: Driver/TestCore.test (1696 of 2163) PASS: lldb-unit :: Utility/./UtilityTests/StringListTest.Join (1697 of 2163) UNSUPPORTED: lldb-api :: functionalities/darwin_log/filter/regex/message/TestDarwinLogFilterRegexMessage.py (1698 of 2163) PASS: lldb-api :: lang/cpp/bool/TestCPPBool.py (1699 of 2163) PASS: lldb-api :: commands/help/TestHelp.py (1700 of 2163) PASS: lldb-api :: functionalities/multidebugger_commands/TestMultipleDebuggersCommands.py (1701 of 2163) PASS: lldb-unit :: Process/minidump/./LLDBMinidumpTests/MinidumpParserTest.MinidumpDuplicateModuleMappedSecond (1702 of 2163) PASS: lldb-api :: functionalities/data-formatter/data-formatter-stl/libcxx/variant/TestDataFormatterLibcxxVariant.py (1703 of 2163) PASS: lldb-api :: commands/reproducer/invalid-args/TestInvalidArgsReproducer.py (1704 of 2163) PASS: lldb-api :: lang/cpp/dynamic-value/TestCppValueCast.py (1705 of 2163) PASS: lldb-unit :: Utility/./UtilityTests/StreamTest.PutMaxHex64ByteOrderLittle (1706 of 2163) PASS: lldb-api :: commands/watchpoints/step_over_watchpoint/TestStepOverWatchpoint.py (1707 of 2163) PASS: lldb-unit :: Utility/./UtilityTests/UserIDResolver.GetUserName (1708 of 2163) UNSUPPORTED: lldb-api :: functionalities/darwin_log/filter/regex/category/TestDarwinLogFilterRegexCategory.py (1709 of 2163) PASS: lldb-unit :: Process/gdb-remote/./ProcessGdbRemoteTests/GDBRemoteCommunicationClientTest.ReadRegister (1710 of 2163) PASS: lldb-unit :: Utility/./UtilityTests/FileSpecTest.EqualDotsPosix (1711 of 2163) UNSUPPORTED: lldb-api :: functionalities/darwin_log/format/TestDarwinLogMessageFormat.py (1712 of 2163) PASS: lldb-unit :: Utility/./UtilityTests/UriParserTest.BracketedHostname (1713 of 2163) PASS: lldb-unit :: Utility/./UtilityTests/UriParserTest.TypicalPortPathIPv4 (1714 of 2163) PASS: lldb-unit :: Utility/./UtilityTests/FileSpecTest.FileAndDirectoryComponents (1715 of 2163) PASS: lldb-unit :: Process/gdb-remote/./ProcessGdbRemoteTests/GDBRemoteClientBaseTest.SendContinueDelegateStructuredDataReceipt (1716 of 2163) PASS: lldb-unit :: Utility/./UtilityTests/StringExtractorTest.GetHexU8_Exact_NoEof (1717 of 2163) PASS: lldb-unit :: Utility/./UtilityTests/ArgsTest.TestArgv (1718 of 2163) PASS: lldb-api :: types/TestShortTypeExpr.py (1719 of 2163) PASS: lldb-shell :: SymbolFile/DWARF/find-inline-method.s (1720 of 2163) PASS: lldb-api :: commands/expression/import-std-module/shared_ptr/TestSharedPtrFromStdModule.py (1721 of 2163) PASS: lldb-unit :: Process/gdb-remote/./ProcessGdbRemoteTests/GDBRemoteCommunicationServerTest.SendErrorResponse_StringError (1722 of 2163) PASS: lldb-unit :: Core/./LLDBCoreTests/UniqueCStringMap.NoDefaultConstructor (1723 of 2163) PASS: lldb-api :: functionalities/recursion/TestValueObjectRecursion.py (1724 of 2163) PASS: lldb-api :: lang/cpp/auto/TestCPPAuto.py (1725 of 2163) PASS: lldb-unit :: UnwindAssembly/x86/./UnwindAssemblyx86Tests/Testx86AssemblyInspectionEngine.TestPopESI (1726 of 2163) PASS: lldb-api :: lang/c/step_over_no_deadlock/TestStepOverDoesntBlock.py (1727 of 2163) UNSUPPORTED: lldb-shell :: SymbolFile/PDB/typedefs.test (1728 of 2163) PASS: lldb-api :: driver/batch_mode/TestBatchMode.py (1729 of 2163) PASS: lldb-shell :: ScriptInterpreter/None/none.test (1730 of 2163) PASS: lldb-api :: macosx/duplicate-archive-members/TestDuplicateMembers.py (1731 of 2163) PASS: lldb-api :: commands/frame/diagnose/dereference-argument/TestDiagnoseDereferenceArgument.py (1732 of 2163) PASS: lldb-unit :: Utility/./UtilityTests/StringExtractorTest.GetHexU8_Exact (1733 of 2163) UNSUPPORTED: lldb-api :: tools/lldb-server/thread-name/TestGdbRemoteThreadName.py (1734 of 2163) PASS: lldb-unit :: Expression/./ExpressionTests/CppModuleConfigurationTest.Linux (1735 of 2163) PASS: lldb-unit :: Utility/./UtilityTests/RangeDataVector.FindEntryIndexesThatContain (1736 of 2163) PASS: lldb-api :: iohandler/resize/TestIOHandlerResize.py (1737 of 2163) PASS: lldb-api :: lang/cpp/exceptions/TestCPPExceptionBreakpoints.py (1738 of 2163) PASS: lldb-unit :: Process/minidump/./LLDBMinidumpTests/MinidumpParserTest.GetExceptionStream (1739 of 2163) PASS: lldb-api :: functionalities/thread/step_until/TestStepUntil.py (1740 of 2163) PASS: lldb-api :: lang/cpp/type_lookup/TestCppTypeLookup.py (1741 of 2163) PASS: lldb-unit :: Host/./HostTests/File.GetStreamFromDescriptor (1742 of 2163) PASS: lldb-unit :: Symbol/./SymbolTests/DWARFCallFrameInfoTest.Basic_dwarf3 (1743 of 2163) UNSUPPORTED: lldb-api :: functionalities/data-formatter/data-formatter-stl/libstdcpp/list/TestDataFormatterStdList.py (1744 of 2163) UNSUPPORTED: lldb-api :: functionalities/darwin_log/filter/exact_match/message/TestDarwinLogFilterMatchMessage.py (1745 of 2163) PASS: lldb-shell :: SymbolFile/NativePDB/ast-types.cpp (1746 of 2163) PASS: lldb-api :: functionalities/thread/concurrent_events/TestConcurrentBreakpointOneDelayBreakpointThreads.py (1747 of 2163) PASS: lldb-unit :: tools/lldb-server/tests/./LLDBServerTests/StandardStartupTest.TestStopReplyContainsThreadPcs (1748 of 2163) PASS: lldb-unit :: ScriptInterpreter/Python/./ScriptInterpreterPythonTests/PythonDataObjectsTest.TestPythonCallableInvoke (1749 of 2163) PASS: lldb-api :: tools/lldb-vscode/breakpoint/TestVSCode_setFunctionBreakpoints.py (1750 of 2163) PASS: lldb-unit :: UnwindAssembly/x86/./UnwindAssemblyx86Tests/Testx86AssemblyInspectionEngine.TestPopR14 (1751 of 2163) PASS: lldb-api :: lang/objc/orderedset/TestOrderedSet.py (1752 of 2163) PASS: lldb-api :: api/listeners/TestListener.py (1753 of 2163) PASS: lldb-shell :: SymbolFile/DWARF/DW_AT_data_bit_offset-DW_OP_stack_value.s (1754 of 2163) PASS: lldb-api :: commands/expression/scoped_enums/TestScopedEnumType.py (1755 of 2163) PASS: lldb-api :: functionalities/history/TestHistoryRecall.py (1756 of 2163) PASS: lldb-unit :: Language/Highlighting/./HighlighterTests/HighlighterTest.Keywords (1757 of 2163) UNSUPPORTED: lldb-api :: lang/objc/rdar-12408181/TestRdar12408181.py (1758 of 2163) PASS: lldb-api :: functionalities/data-formatter/data-formatter-stl/libcxx/tuple/TestDataFormatterLibcxxTuple.py (1759 of 2163) PASS: lldb-api :: lang/objc/objc-super/TestObjCSuper.py (1760 of 2163) PASS: lldb-api :: functionalities/data-formatter/data-formatter-stl/libcxx/queue/TestDataFormatterLibcxxQueue.py (1761 of 2163) PASS: lldb-api :: commands/expression/char/TestExprsChar.py (1762 of 2163) PASS: lldb-unit :: Utility/./UtilityTests/ArgsTest.TestUnknownEscape (1763 of 2163) PASS: lldb-unit :: Utility/./UtilityTests/StringExtractorTest.GetHexU8_InvalidHex (1764 of 2163) PASS: lldb-api :: python_api/process/read-mem-cstring/TestReadMemCString.py (1765 of 2163) PASS: lldb-shell :: SymbolFile/DWARF/find-method.cpp (1766 of 2163) PASS: lldb-api :: python_api/process/io/TestProcessIO.py (1767 of 2163) PASS: lldb-shell :: Commands/command-stop-hook-output.test (1768 of 2163) PASS: lldb-shell :: Reproducer/TestMultipleTargets.test (1769 of 2163) PASS: lldb-shell :: SymbolFile/Breakpad/line-table-discontinuous-file-ids.test (1770 of 2163) PASS: lldb-unit :: Host/./HostTests/SocketTests/SocketTest.TCPListen0ConnectAccept/ipv4 (1771 of 2163) PASS: lldb-api :: python_api/function_symbol/TestDisasmAPI.py (1772 of 2163) PASS: lldb-unit :: Utility/./UtilityTests/RangeTest.DoesAdjoinOrIntersect (1773 of 2163) PASS: lldb-shell :: SymbolFile/DWARF/debug-types-address-ranges.s (1774 of 2163) PASS: lldb-api :: commands/command/script_alias/TestCommandScriptAlias.py (1775 of 2163) UNSUPPORTED: lldb-api :: tools/lldb-server/platform-process-connect/TestPlatformProcessConnect.py (1776 of 2163) PASS: lldb-api :: python_api/get-value-32bit-int/TestGetValue32BitInt.py (1777 of 2163) PASS: lldb-shell :: SymbolFile/DWARF/DW_OP_piece-smaller-than-struct.s (1778 of 2163) PASS: lldb-api :: python_api/value/empty_class/TestValueAPIEmptyClass.py (1779 of 2163) PASS: lldb-shell :: Reproducer/TestDriverOptions.test (1780 of 2163) PASS: lldb-unit :: SymbolFile/DWARF/./SymbolFileDWARFTests/SymbolFileDWARFTests.TestAbbrevMissingTerminator (1781 of 2163) PASS: lldb-api :: functionalities/process_crash_info/TestProcessCrashInfo.py (1782 of 2163) PASS: lldb-unit :: Utility/./UtilityTests/ScalarTest.Scalar_512 (1783 of 2163) PASS: lldb-shell :: ObjectFile/wasm/stripped-debug-sections.yaml (1784 of 2163) PASS: lldb-unit :: Utility/./UtilityTests/RangeTest.EqualInvalid (1785 of 2163) PASS: lldb-api :: commands/expression/import-std-module/deque-basic/TestDequeFromStdModule.py (1786 of 2163) PASS: lldb-shell :: SymbolFile/DWARF/dir-separator-posix.s (1787 of 2163) PASS: lldb-unit :: Utility/./UtilityTests/StringExtractorTest.InitEmpty (1788 of 2163) PASS: lldb-api :: lang/c/tls_globals/TestTlsGlobals.py (1789 of 2163) PASS: lldb-unit :: debugserver/./debugserverTests/RNBSocket.AnyListen (1790 of 2163) PASS: lldb-api :: commands/expression/import-std-module/sysroot/TestStdModuleSysroot.py (1791 of 2163) PASS: lldb-api :: commands/target/stop-hook/delete/TestTargetStopHookDelete.py (1792 of 2163) PASS: lldb-api :: commands/expression/persist_objc_pointeetype/TestPersistObjCPointeeType.py (1793 of 2163) PASS: lldb-api :: lang/cpp/this/TestCPPThis.py (1794 of 2163) PASS: lldb-unit :: Utility/./UtilityTests/UriParserTest.SchemeHostSeparator4 (1795 of 2163) PASS: lldb-api :: functionalities/data-formatter/data-formatter-objc/TestDataFormatterObjCKVO.py (1796 of 2163) PASS: lldb-unit :: Utility/./UtilityTests/UriParserTest.BracketedHostnameWithPortIPv4 (1797 of 2163) PASS: lldb-unit :: Utility/./UtilityTests/BinaryStreamTest.PutULEB128FiveBytes (1798 of 2163) PASS: lldb-unit :: Utility/./UtilityTests/AnsiTerminal.Unknown (1799 of 2163) PASS: lldb-unit :: Utility/./UtilityTests/AnsiTerminal.Basic (1800 of 2163) PASS: lldb-api :: functionalities/plugins/python_os_plugin/stepping_plugin_threads/TestOSPluginStepping.py (1801 of 2163) PASS: lldb-unit :: Utility/./UtilityTests/StringListTest.ForRange (1802 of 2163) PASS: lldb-api :: functionalities/object-file/TestImageListMultiArchitecture.py (1803 of 2163) PASS: lldb-api :: macosx/DBGSourcePathRemapping/TestDSYMSourcePathRemapping.py (1804 of 2163) PASS: lldb-api :: iohandler/completion/TestIOHandlerCompletion.py (1805 of 2163) PASS: lldb-unit :: debugserver/./debugserverTests/RNBSocket.LoopBackConnectIPv6 (1806 of 2163) PASS: lldb-unit :: Host/./HostTests/HostInfoTest.GetAugmentedArchSpec (1807 of 2163) PASS: lldb-unit :: Symbol/./SymbolTests/TestTypeSystemClang.TestDisplayNameEmpty (1808 of 2163) PASS: lldb-shell :: SymbolFile/NativePDB/ast-methods.cpp (1809 of 2163) PASS: lldb-unit :: Utility/./UtilityTests/StreamTest.ShiftOperatorPtr (1810 of 2163) PASS: lldb-unit :: Utility/./UtilityTests/OptionsWithRawTest.SingleWhitespaceInput (1811 of 2163) PASS: lldb-api :: functionalities/data-formatter/synthcapping/TestSyntheticCapping.py (1812 of 2163) PASS: lldb-api :: lang/objc/modules-inline-functions/TestModulesInlineFunctions.py (1813 of 2163) PASS: lldb-unit :: Host/./HostTests/SocketAddressTest.Set (1814 of 2163) PASS: lldb-unit :: Utility/./UtilityTests/OptionsWithRawTest.LeadingSpaceArgs (1815 of 2163) PASS: lldb-unit :: Utility/./UtilityTests/StringLexerTest.PutBack (1816 of 2163) PASS: lldb-shell :: SymbolFile/DWARF/debug_line-tombstone.s (1817 of 2163) PASS: lldb-api :: lang/cpp/global_variables/TestCPPGlobalVariables.py (1818 of 2163) PASS: lldb-api :: lang/objc/foundation/TestObjCMethodsString.py (1819 of 2163) PASS: lldb-unit :: Utility/./UtilityTests/StreamTest.AddressEmptyPrefix (1820 of 2163) PASS: lldb-api :: commands/log/invalid-args/TestInvalidArgsLog.py (1821 of 2163) PASS: lldb-api :: functionalities/postmortem/elf-core/gcore/TestGCore.py (1822 of 2163) PASS: lldb-unit :: Utility/./UtilityTests/ProcessInfoTest.Constructor (1823 of 2163) PASS: lldb-shell :: SymbolFile/DWARF/dwarf5_locations.s (1824 of 2163) PASS: lldb-unit :: Language/Highlighting/./HighlighterTests/HighlighterTest.DefaultHighlighterWithCursor (1825 of 2163) PASS: lldb-shell :: ObjectFile/ELF/netbsd-core-amd64.test (1826 of 2163) PASS: lldb-api :: commands/platform/basic/TestPlatformCommand.py (1827 of 2163) PASS: lldb-api :: functionalities/data-formatter/data-formatter-stl/libcxx/set/TestDataFormatterLibcxxSet.py (1828 of 2163) PASS: lldb-unit :: UnwindAssembly/x86/./UnwindAssemblyx86Tests/Testx86AssemblyInspectionEngine.TestSimplei386ugmented (1829 of 2163) PASS: lldb-unit :: Utility/./UtilityTests/Predicate.WaitForValueEqualTo (1830 of 2163) PASS: lldb-api :: functionalities/data-formatter/boolreference/TestFormattersBoolRefPtr.py (1831 of 2163) PASS: lldb-unit :: Utility/./UtilityTests/ScalarTest.APIntConstructor (1832 of 2163) PASS: lldb-unit :: Utility/./UtilityTests/RangeTest.SizeTypes (1833 of 2163) PASS: lldb-api :: lang/c/struct_types/TestStructTypes.py (1834 of 2163) PASS: lldb-unit :: Process/minidump/./LLDBMinidumpTests/MinidumpParserTest.GetArchitectureWindows (1835 of 2163) PASS: lldb-unit :: Utility/./UtilityTests/DataExtractorTest.GetBitfield (1836 of 2163) PASS: lldb-unit :: Utility/./UtilityTests/StringListTest.JoinSingle (1837 of 2163) PASS: lldb-api :: tools/lldb-server/register-reading/TestGdbRemoteGPacket.py (1838 of 2163) PASS: lldb-unit :: Utility/./UtilityTests/StreamTest.SetIndentLevel (1839 of 2163) PASS: lldb-api :: lang/cpp/template-specialization-type/TestTemplateSpecializationType.py (1840 of 2163) PASS: lldb-unit :: Utility/./UtilityTests/SerializationRountripTest.SerializeDeserializePod (1841 of 2163) PASS: lldb-api :: lang/c/shared_lib_stripped_symbols/TestSharedLibStrippedSymbols.py (1842 of 2163) PASS: lldb-unit :: Utility/./UtilityTests/StringExtractorTest.GetHexU8_InvalidHex_NoEof (1843 of 2163) PASS: lldb-unit :: Utility/./UtilityTests/ArchSpecTest.MergeFromMachOUnknown (1844 of 2163) PASS: lldb-unit :: Symbol/./SymbolTests/TestTypeSystemClang.TestGetEnumIntegerTypeBasicTypes (1845 of 2163) PASS: lldb-unit :: SymbolFile/DWARF/./SymbolFileDWARFTests/SymbolFileDWARFTests.TestAbbrevValidAttrNullForm (1846 of 2163) UNSUPPORTED: lldb-api :: functionalities/breakpoint/hardware_breakpoints/write_memory_with_hw_breakpoint/TestWriteMemoryWithHWBreakpoint.py (1847 of 2163) PASS: lldb-unit :: Utility/./UtilityTests/StreamTeeTest.Constructor1Stream (1848 of 2163) PASS: lldb-unit :: Utility/./UtilityTests/DataExtractorTest.GetCStrUnterminated (1849 of 2163) PASS: lldb-api :: functionalities/postmortem/minidump-new/TestMiniDumpNew.py (1850 of 2163) PASS: lldb-api :: functionalities/data-formatter/data-formatter-skip-summary/TestDataFormatterSkipSummary.py (1851 of 2163) PASS: lldb-unit :: ObjectFile/Breakpad/./ObjectFileBreakpadTests/StackCFIRecord.parse (1852 of 2163) PASS: lldb-unit :: Utility/./UtilityTests/ArgsTest.ReplaceArgumentAtIndexShort (1853 of 2163) PASS: lldb-shell :: SymbolFile/DWARF/find-function-regex.cpp (1854 of 2163) PASS: lldb-api :: python_api/frame/TestFrames.py (1855 of 2163) PASS: lldb-shell :: Process/UnsupportedLanguage.test (1856 of 2163) PASS: lldb-unit :: Utility/./UtilityTests/StringExtractorTest.DecodeHexU8_InvalidHex2 (1857 of 2163) PASS: lldb-api :: functionalities/thread/thread_exit/TestThreadExit.py (1858 of 2163) PASS: lldb-api :: lang/cpp/namespace_definitions/TestNamespaceDefinitions.py (1859 of 2163) PASS: lldb-api :: functionalities/breakpoint/breakpoint_ignore_count/TestBreakpointIgnoreCount.py (1860 of 2163) PASS: lldb-api :: functionalities/breakpoint/breakpoint_command/TestRegexpBreakCommand.py (1861 of 2163) PASS: lldb-unit :: Utility/./UtilityTests/RangeTest.ContainsEndInclusiveInvalid (1862 of 2163) PASS: lldb-api :: commands/command/script/TestCommandScript.py (1863 of 2163) PASS: lldb-api :: functionalities/signal/handle-abrt/TestHandleAbort.py (1864 of 2163) PASS: lldb-api :: lang/objc/radar-9691614/TestObjCMethodReturningBOOL.py (1865 of 2163) PASS: lldb-unit :: Utility/./UtilityTests/StringExtractorTest.InitMisc (1866 of 2163) PASS: lldb-api :: commands/expression/test/TestExprs.py (1867 of 2163) PASS: lldb-api :: functionalities/thread/concurrent_events/TestConcurrentDelayedCrashWithBreakpointWatchpoint.py (1868 of 2163) PASS: lldb-shell :: SymbolFile/DWARF/dwarf5-atomic.s (1869 of 2163) PASS: lldb-unit :: Expression/./ExpressionTests/DiagnosticManagerTest.HasFixits (1870 of 2163) PASS: lldb-api :: lang/cpp/char8_t/TestCxxChar8_t.py (1871 of 2163) PASS: lldb-unit :: Language/Highlighting/./HighlighterTests/HighlighterTest.ClangBraces (1872 of 2163) PASS: lldb-unit :: Target/./TargetTests/MemoryRegionInfoTest.Formatv (1873 of 2163) PASS: lldb-api :: commands/watchpoints/watchpoint_events/TestWatchpointEvents.py (1874 of 2163) PASS: lldb-api :: commands/platform/process/list/TestProcessList.py (1875 of 2163) PASS: lldb-unit :: Utility/./UtilityTests/RangeTest.SlideZero (1876 of 2163) PASS: lldb-api :: functionalities/data-formatter/data-formatter-objc/TestDataFormatterObjCNSDate.py (1877 of 2163) PASS: lldb-unit :: Utility/./UtilityTests/StringListTest.JoinMultiCharSeparator (1878 of 2163) PASS: lldb-unit :: Symbol/./SymbolTests/TestTypeSystemClang.TestGetTypeClassNested (1879 of 2163) UNSUPPORTED: lldb-api :: linux/sepdebugsymlink/TestTargetSymbolsSepDebugSymlink.py (1880 of 2163) PASS: lldb-shell :: SymbolFile/dissassemble-entry-point.s (1881 of 2163) PASS: lldb-api :: functionalities/thread/backtrace_limit/TestBacktraceLimit.py (1882 of 2163) PASS: lldb-unit :: Utility/./UtilityTests/StringListTest.ShiftStdString (1883 of 2163) PASS: lldb-api :: commands/expression/import-std-module/conflicts/TestStdModuleWithConflicts.py (1884 of 2163) PASS: lldb-unit :: Utility/./UtilityTests/CompletionRequest.DuplicateFiltering (1885 of 2163) PASS: lldb-api :: sample_test/TestSampleInlineTest.py (1886 of 2163) PASS: lldb-unit :: Utility/./UtilityTests/BinaryStreamTest.PutSLEB128Zero (1887 of 2163) PASS: lldb-unit :: Symbol/./SymbolTests/TestTypeSystemClang.TemplateArguments (1888 of 2163) PASS: lldb-unit :: ScriptInterpreter/Python/./ScriptInterpreterPythonTests/PythonDataObjectsTest.TestExtractingUInt64ThroughStructuredData (1889 of 2163) PASS: lldb-api :: lang/c/set_values/TestSetValues.py (1890 of 2163) PASS: lldb-unit :: Utility/./UtilityTests/BinaryStreamTest.PutULEB128SixBytes (1891 of 2163) PASS: lldb-shell :: ObjectFile/ELF/PT_LOAD-empty.yaml (1892 of 2163) PASS: lldb-unit :: UnwindAssembly/x86/./UnwindAssemblyx86Tests/Testx86AssemblyInspectionEngine.Testi386IgnoredRegisters (1893 of 2163) PASS: lldb-unit :: SymbolFile/NativePDB/./SymbolFileNativePDBTests/PDBFPOProgramToDWARFExpressionTests.MissingTargetRegister (1894 of 2163) PASS: lldb-api :: functionalities/data-formatter/data-formatter-stl/libcxx/bitset/TestDataFormatterLibcxxBitset.py (1895 of 2163) PASS: lldb-shell :: SymbolFile/NativePDB/bitfields.cpp (1896 of 2163) PASS: lldb-api :: commands/gui/basic/TestGuiBasic.py (1897 of 2163) PASS: lldb-shell :: ObjectFile/PECOFF/basic-info-arm64.yaml (1898 of 2163) PASS: lldb-api :: functionalities/thread/concurrent_events/TestConcurrentBreakpointsDelayedBreakpointOneWatchpoint.py (1899 of 2163) PASS: lldb-api :: types/TestIntegerTypeExpr.py (1900 of 2163) PASS: lldb-shell :: ObjectFile/ELF/section-addresses.yaml (1901 of 2163) PASS: lldb-api :: sanity/TestModuleCacheSanity.py (1902 of 2163) PASS: lldb-unit :: Core/./LLDBCoreTests/StreamCallbackTest.Callback (1903 of 2163) PASS: lldb-unit :: Expression/./ExpressionTests/ClangExpressionDeclMapTest.TestPersistentDeclLookup (1904 of 2163) PASS: lldb-unit :: Utility/./UtilityTests/RangeTest.ClearWithStarAddress (1905 of 2163) XFAIL: lldb-shell :: Register/x86-mm-xmm-read.test (1906 of 2163) PASS: lldb-api :: commands/watchpoints/watchpoint_size/TestWatchpointSizes.py (1907 of 2163) PASS: lldb-shell :: SymbolFile/DWARF/DW_TAG_variable-invalid_location.s (1908 of 2163) PASS: lldb-api :: lang/cpp/this_class_type_mixing/TestThisClassTypeMixing.py (1909 of 2163) PASS: lldb-api :: api/log/TestAPILog.py (1910 of 2163) UNSUPPORTED: lldb-api :: python_api/event/TestEvents.py (1911 of 2163) PASS: lldb-unit :: Process/gdb-remote/./ProcessGdbRemoteTests/GDBRemoteCommunicationClientTest.GetQOffsets (1912 of 2163) PASS: lldb-api :: functionalities/postmortem/minidump/TestMiniDump.py (1913 of 2163) PASS: lldb-api :: functionalities/data-formatter/data-formatter-stl/libcxx/function/TestLibCxxFunction.py (1914 of 2163) UNSUPPORTED: lldb-shell :: Register/x86-zmm-read.test (1915 of 2163) PASS: lldb-unit :: Utility/./UtilityTests/VMRange.Ordering (1916 of 2163) UNSUPPORTED: lldb-api :: benchmarks/continue/TestBenchmarkContinue.py (1917 of 2163) PASS: lldb-unit :: SymbolFile/NativePDB/./SymbolFileNativePDBTests/PDBFPOProgramToDWARFExpressionTests.UnresolvedRegisterAssignmentReference (1918 of 2163) PASS: lldb-api :: functionalities/thread/concurrent_events/TestConcurrentDelaySignalWatch.py (1919 of 2163) PASS: lldb-unit :: Symbol/./SymbolTests/TestClangASTImporter.DeportTypeTagDecl (1920 of 2163) PASS: lldb-unit :: ObjectFile/Breakpad/./ObjectFileBreakpadTests/InfoRecord.parse (1921 of 2163) PASS: lldb-api :: lang/objc/objc-ivar-offsets/TestObjCIvarOffsets.py (1922 of 2163) PASS: lldb-unit :: ObjectFile/Breakpad/./ObjectFileBreakpadTests/StackWinRecord.parse (1923 of 2163) PASS: lldb-unit :: Utility/./UtilityTests/RecordReplayTest.InstrumentedBarRef (1924 of 2163) PASS: lldb-unit :: UnwindAssembly/x86/./UnwindAssemblyx86Tests/Testx86AssemblyInspectionEngine.TestPushRBX (1925 of 2163) PASS: lldb-unit :: Utility/./UtilityTests/RangeTest.SetRangeBase (1926 of 2163) UNSUPPORTED: lldb-api :: tools/lldb-server/signal-filtering/TestGdbRemote_QPassSignals.py (1927 of 2163) PASS: lldb-unit :: Host/./HostTests/SocketTests/SocketTest.TCPListen0ConnectAccept/ipv6 (1928 of 2163) PASS: lldb-shell :: Driver/TestFile.test (1929 of 2163) UNSUPPORTED: lldb-api :: linux/mix-dwo-and-regular-objects/TestMixedDwarfBinary.py (1930 of 2163) PASS: lldb-api :: functionalities/memory/cache/TestMemoryCache.py (1931 of 2163) PASS: lldb-api :: functionalities/data-formatter/data-formatter-objc/cmtime/TestDataFormatterCMTime.py (1932 of 2163) PASS: lldb-unit :: Language/Highlighting/./HighlighterTests/HighlighterTest.FallbackHighlighter (1933 of 2163) PASS: lldb-api :: lang/c/unions/TestUnionMembers.py (1934 of 2163) PASS: lldb-api :: lang/c/modules/TestCModules.py (1935 of 2163) PASS: lldb-unit :: Utility/./UtilityTests/StringListTest.SplitIntoLinesEmpty (1936 of 2163) PASS: lldb-api :: functionalities/data-formatter/pyobjsynthprovider/TestPyObjSynthProvider.py (1937 of 2163) XFAIL: lldb-shell :: Register/x86-64-ymm-write.test (1938 of 2163) PASS: lldb-unit :: Language/Highlighting/./HighlighterTests/HighlighterTest.HighlighterSelectionPath (1939 of 2163) PASS: lldb-api :: functionalities/data-formatter/data-formatter-script/TestDataFormatterScript.py (1940 of 2163) PASS: lldb-unit :: SymbolFile/NativePDB/./SymbolFileNativePDBTests/PDBFPOProgramToDWARFExpressionTests.UnresolvedCyclicRegisterAssignmentReference (1941 of 2163) PASS: lldb-unit :: Host/./HostTests/Host.WaitStatusFormat (1942 of 2163) PASS: lldb-unit :: Utility/./UtilityTests/UriParserTest.BracketedHostnamePort (1943 of 2163) PASS: lldb-unit :: Symbol/./SymbolTests/TestClangASTImporter.RecordLayout (1944 of 2163) PASS: lldb-unit :: ScriptInterpreter/Python/./ScriptInterpreterPythonTests/PythonDataObjectsTest.TestExceptions (1945 of 2163) PASS: lldb-shell :: Reproducer/Functionalities/TestDataFormatter.test (1946 of 2163) PASS: lldb-unit :: Symbol/./SymbolTests/Type.GetTypeScopeAndBasename (1947 of 2163) PASS: lldb-unit :: Utility/./UtilityTests/RangeTest.Copy (1948 of 2163) PASS: lldb-unit :: Utility/./UtilityTests/BinaryStreamTest.PutULEB128Zero (1949 of 2163) PASS: lldb-unit :: Utility/./UtilityTests/BinaryStreamTest.PutSLEB128NineBytes (1950 of 2163) PASS: lldb-unit :: Utility/./UtilityTests/VASprintfTest.BufferResize (1951 of 2163) PASS: lldb-shell :: Driver/TestCommands.test (1952 of 2163) PASS: lldb-unit :: UnwindAssembly/x86/./UnwindAssemblyx86Tests/Testx86AssemblyInspectionEngine.TestCALLNextInsn (1953 of 2163) PASS: lldb-shell :: SymbolFile/Breakpad/stack-cfi-parsing.test (1954 of 2163) PASS: lldb-api :: python_api/disassemble-raw-data/TestDisassembleRawData.py (1955 of 2163) PASS: lldb-api :: lang/objc/foundation/TestSymbolTable.py (1956 of 2163) PASS: lldb-unit :: Process/gdb-remote/./ProcessGdbRemoteTests/GDBRemoteCommunicationClientTest.SendSignalsToIgnore (1957 of 2163) PASS: lldb-unit :: UnwindAssembly/ARM64/./Arm64InstEmulationTests/TestArm64InstEmulation.TestMediumDarwinFunction (1958 of 2163) PASS: lldb-unit :: Host/./HostTests/NativeProcessProtocolTest.ReadCStringFromMemory_CrossPageBoundary (1959 of 2163) PASS: lldb-api :: functionalities/data-formatter/data-formatter-named-summaries/TestDataFormatterNamedSummaries.py (1960 of 2163) PASS: lldb-unit :: Symbol/./SymbolTests/TestTypeSystemClang.TestUnifyAccessSpecifiers (1961 of 2163) UNSUPPORTED: lldb-api :: linux/add-symbols/TestTargetSymbolsAddCommand.py (1962 of 2163) PASS: lldb-unit :: Utility/./UtilityTests/BinaryStreamTest.PutULEB128EightBytes (1963 of 2163) PASS: lldb-api :: python_api/default-constructor/TestDefaultConstructorForAPIObjects.py (1964 of 2163) PASS: lldb-api :: functionalities/memory-region/TestMemoryRegion.py (1965 of 2163) PASS: lldb-unit :: Host/./HostTests/SocketTests/SocketTest.UDPGetConnectURI/ipv6 (1966 of 2163) PASS: lldb-unit :: Utility/./UtilityTests/StringListTest.SplitIntoLinesSingleTrailingCR (1967 of 2163) PASS: lldb-api :: lang/cpp/stl/TestSTL.py (1968 of 2163) PASS: lldb-unit :: Utility/./UtilityTests/SerializationRountripTest.SerializeDeserializeObjectReference (1969 of 2163) PASS: lldb-unit :: Utility/./UtilityTests/StructuredDataTest.ParseJSONFromFile (1970 of 2163) PASS: lldb-api :: functionalities/unwind/sigtramp/TestSigtrampUnwind.py (1971 of 2163) PASS: lldb-unit :: Process/minidump/./LLDBMinidumpTests/MinidumpParserTest.GetMemoryRegionInfo (1972 of 2163) PASS: lldb-unit :: Utility/./UtilityTests/ArgsTest.TestSingleArgWithQuotedSpace (1973 of 2163) UNSUPPORTED: lldb-api :: arm/breakpoint-thumb-codesection/TestBreakpointThumbCodesection.py (1974 of 2163) PASS: lldb-api :: commands/expression/codegen-crash-typedefdecl-not-in_declcontext/TestCodegenCrashTypedefDeclNotInDeclContext.py (1975 of 2163) PASS: lldb-unit :: Language/Highlighting/./HighlighterTests/HighlighterTest.ClangEmptyInput (1976 of 2163) PASS: lldb-api :: lang/cpp/llvm-style/TestLLVMStyle.py (1977 of 2163) PASS: lldb-api :: tools/lldb-server/TestGdbRemote_vCont.py (1978 of 2163) PASS: lldb-shell :: SymbolFile/DWARF/DW_AT_const_value-bitfields.s (1979 of 2163) PASS: lldb-shell :: Commands/CommandScriptImmediateOutput/CommandScriptImmediateOutputFile.test (1980 of 2163) PASS: lldb-api :: tools/lldb-server/TestGdbRemoteKill.py (1981 of 2163) PASS: lldb-unit :: Host/./HostTests/ConnectionFileDescriptorTest.TCPGetURIv4 (1982 of 2163) PASS: lldb-unit :: Host/./HostTests/FileSystemTest.GetPermissions (1983 of 2163) PASS: lldb-unit :: Utility/./UtilityTests/UriParserTest.Minimal (1984 of 2163) PASS: lldb-unit :: UnwindAssembly/PPC64/./PPC64InstEmulationTests/TestPPC64InstEmulation.TestSimpleFunction (1985 of 2163) PASS: lldb-shell :: ObjectFile/ELF/compressed-sections.yaml (1986 of 2163) PASS: lldb-unit :: Process/minidump/./LLDBMinidumpTests/MinidumpParserTest.GetThreadContext_x86_64 (1987 of 2163) PASS: lldb-api :: functionalities/gdb_remote_client/TestTargetXMLArch.py (1988 of 2163) PASS: lldb-shell :: SymbolFile/NativePDB/break-by-function.cpp (1989 of 2163) PASS: lldb-unit :: Symbol/./SymbolTests/TestTypeSystemClang.TestGetEnumIntegerTypeInvalid (1990 of 2163) PASS: lldb-api :: terminal/TestEditline.py (1991 of 2163) PASS: lldb-unit :: Symbol/./SymbolTests/TestTypeSystemClang.AddMethodToObjCObjectType (1992 of 2163) PASS: lldb-unit :: Symbol/./SymbolTests/TestTypeSystemClang.TestFunctionTemplateConstruction (1993 of 2163) PASS: lldb-shell :: Register/x86-64-read.test (1994 of 2163) PASS: lldb-unit :: Utility/./UtilityTests/TimerTest.CategoryTimesNested (1995 of 2163) PASS: lldb-unit :: Utility/./UtilityTests/LogTest.Register (1996 of 2163) PASS: lldb-unit :: Process/gdb-remote/./ProcessGdbRemoteTests/GDBRemoteCommunicationClientTest.GetMemoryRegionInfoInvalidResponse (1997 of 2163) PASS: lldb-api :: python_api/sbenvironment/TestSBEnvironment.py (1998 of 2163) PASS: lldb-shell :: Settings/TestDisableColor.test (1999 of 2163) PASS: lldb-shell :: SymbolFile/DWARF/DW_TAG_basic_type_DW_ATE_UTF_nonC.ll (2000 of 2163) PASS: lldb-shell :: ScriptInterpreter/None/import_module.test (2001 of 2163) PASS: lldb-shell :: SymbolFile/Breakpad/line-table.test (2002 of 2163) PASS: lldb-api :: tools/lldb-server/TestGdbRemoteAttach.py (2003 of 2163) PASS: lldb-shell :: Settings/TestDisassemblyFormat.test (2004 of 2163) PASS: lldb-api :: commands/expression/call-function/TestCallBuiltinFunction.py (2005 of 2163) PASS: lldb-api :: commands/apropos/with-process/TestAproposWithProcess.py (2006 of 2163) PASS: lldb-unit :: ObjectFile/MachO/./ObjectFileMachOTests/ObjectFileMachOTest.ModuleFromSharedCacheInfo (2007 of 2163) PASS: lldb-api :: lang/objc/modules-cache/TestClangModulesCache.py (2008 of 2163) PASS: lldb-api :: commands/expression/import-std-module/unique_ptr/TestUniquePtrFromStdModule.py (2009 of 2163) PASS: lldb-unit :: ScriptInterpreter/Python/./ScriptInterpreterPythonTests/PythonDataObjectsTest.TestPythonTupleToStructuredList (2010 of 2163) PASS: lldb-unit :: Utility/./UtilityTests/StringLexerTest.AdvanceIf (2011 of 2163) PASS: lldb-unit :: UnwindAssembly/x86/./UnwindAssemblyx86Tests/Testx86AssemblyInspectionEngine.TestPush0 (2012 of 2163) PASS: lldb-api :: python_api/breakpoint/TestBreakpointAPI.py (2013 of 2163) PASS: lldb-api :: functionalities/data-formatter/data-formatter-stl/libcxx/iterator/TestDataFormatterLibccIterator.py (2014 of 2163) PASS: lldb-api :: lang/objc/modules-compile-error/TestModulesCompileError.py (2015 of 2163) PASS: lldb-api :: functionalities/data-formatter/data-formatter-disabling/TestDataFormatterDisabling.py (2016 of 2163) PASS: lldb-unit :: Utility/./UtilityTests/RangeTest.ContainsAddr (2017 of 2163) PASS: lldb-unit :: Utility/./UtilityTests/StringListTest.LongestCommonPrefixEmpty (2018 of 2163) PASS: lldb-unit :: Utility/./UtilityTests/StringExtractorTest.GetHexBytes_Partial (2019 of 2163) PASS: lldb-api :: iohandler/autosuggestion/TestAutosuggestion.py (2020 of 2163) PASS: lldb-unit :: Target/./TargetTests/ExecutionContextTest.GetByteOrder (2021 of 2163) PASS: lldb-api :: functionalities/postmortem/elf-core/TestLinuxCore.py (2022 of 2163) UNSUPPORTED: lldb-shell :: ScriptInterpreter/Lua/nested_sessions.test (2023 of 2163) PASS: lldb-api :: lang/cpp/scope/TestCppScope.py (2024 of 2163) UNSUPPORTED: lldb-api :: functionalities/data-formatter/data-formatter-stl/libstdcpp/smart_ptr/TestDataFormatterStdSmartPtr.py (2025 of 2163) PASS: lldb-shell :: Settings/TestFrameFormatMangling.test (2026 of 2163) UNSUPPORTED: lldb-shell :: Unwind/eh-frame-augment-noop.test (2027 of 2163) PASS: lldb-api :: functionalities/data-formatter/data-formatter-objc/TestDataFormatterObjCCF.py (2028 of 2163) PASS: lldb-unit :: UnwindAssembly/x86/./UnwindAssemblyx86Tests/Testx86AssemblyInspectionEngine.TestPushEBX (2029 of 2163) PASS: lldb-api :: lang/cpp/rvalue-references/TestRvalueReferences.py (2030 of 2163) PASS: lldb-api :: functionalities/data-formatter/data-formatter-smart-array/TestDataFormatterSmartArray.py (2031 of 2163) PASS: lldb-shell :: ObjectFile/MachO/lc_build_version_notools.yaml (2032 of 2163) PASS: lldb-unit :: Platform/./LLDBPlatformTests/PlatformDarwinTest.FindComponentInPath (2033 of 2163) PASS: lldb-unit :: Utility/./UtilityTests/StreamTest.PutHex16ByteOrderLittle (2034 of 2163) PASS: lldb-api :: functionalities/unwind/noreturn/module-end/TestNoReturnModuleEnd.py (2035 of 2163) PASS: lldb-api :: lang/c/array_types/TestArrayTypes.py (2036 of 2163) PASS: lldb-unit :: Utility/./UtilityTests/RegularExpression.Valid (2037 of 2163) PASS: lldb-api :: commands/expression/persistent_ptr_update/TestPersistentPtrUpdate.py (2038 of 2163) PASS: lldb-unit :: Utility/./UtilityTests/StreamTeeTest.SetStreamAtIndexOutOfBounds (2039 of 2163) PASS: lldb-unit :: Utility/./UtilityTests/ArchSpecTest.OperatorBool (2040 of 2163) PASS: lldb-shell :: ScriptInterpreter/Python/sb_address_exception.test (2041 of 2163) PASS: lldb-unit :: Core/./LLDBCoreTests/MangledTest.NameIndexes_FindFunctionSymbols (2042 of 2163) PASS: lldb-unit :: ScriptInterpreter/Python/./ScriptInterpreterPythonTests/PythonDataObjectsTest.TestPythonIntegerToStructuredInteger (2043 of 2163) PASS: lldb-api :: commands/watchpoints/multiple_hits/TestMultipleHits.py (2044 of 2163) PASS: lldb-unit :: Utility/./UtilityTests/TimerTest.CategoryTimes (2045 of 2163) PASS: lldb-api :: functionalities/inferior-crashing/TestInferiorCrashingStep.py (2046 of 2163) PASS: lldb-unit :: Utility/./UtilityTests/SerializationRountripTest.SerializeDeserializeCString (2047 of 2163) PASS: lldb-unit :: Utility/./UtilityTests/Flags.Test (2048 of 2163) PASS: lldb-unit :: Utility/./UtilityTests/FileSpecTest.Equal (2049 of 2163) PASS: lldb-unit :: ScriptInterpreter/Python/./ScriptInterpreterPythonTests/PythonDataObjectsTest.TestPythonBoolean (2050 of 2163) PASS: lldb-api :: functionalities/step-avoids-no-debug/TestStepNoDebug.py (2051 of 2163) PASS: lldb-api :: functionalities/data-formatter/data-formatter-python-synth/TestDataFormatterPythonSynth.py (2052 of 2163) PASS: lldb-api :: commands/watchpoints/hello_watchpoint/TestMyFirstWatchpoint.py (2053 of 2163) PASS: lldb-api :: lang/objcxx/cxx-bridged-po/TestObjCXXBridgedPO.py (2054 of 2163) PASS: lldb-unit :: Utility/./UtilityTests/AnsiTerminal.AtEnd (2055 of 2163) PASS: lldb-unit :: Utility/./UtilityTests/StringExtractorTest.GetHexBytes_FullString (2056 of 2163) UNSUPPORTED: lldb-api :: lang/cpp/static_members/TestCPPStaticMembers.py (2057 of 2163) PASS: lldb-unit :: Host/./HostTests/SocketAddressTest.GetAddressInfo (2058 of 2163) PASS: lldb-api :: functionalities/breakpoint/dummy_target_breakpoints/TestBreakpointsWithNoTargets.py (2059 of 2163) PASS: lldb-api :: commands/expression/call-throws/TestCallThatThrows.py (2060 of 2163) PASS: lldb-api :: functionalities/inferior-assert/TestInferiorAssert.py (2061 of 2163) PASS: lldb-shell :: ScriptInterpreter/Python/crashlog.test (2062 of 2163) PASS: lldb-unit :: Process/minidump/./LLDBMinidumpTests/MinidumpParserTest.GetThreadsAndGetThreadContext (2063 of 2163) PASS: lldb-api :: commands/expression/multiline-completion/TestMultilineCompletion.py (2064 of 2163) PASS: lldb-api :: functionalities/tsan/global_location/TestTsanGlobalLocation.py (2065 of 2163) PASS: lldb-unit :: Symbol/./SymbolTests/Type.CompilerContextPattern (2066 of 2163) PASS: lldb-unit :: Utility/./UtilityTests/VMRange.ContainsRange (2067 of 2163) UNSUPPORTED: lldb-shell :: ScriptInterpreter/Lua/convenience_variables.test (2068 of 2163) PASS: lldb-api :: python_api/sbvalue_const_addrof/TestSBValueConstAddrOf.py (2069 of 2163) PASS: lldb-unit :: ScriptInterpreter/Python/./ScriptInterpreterPythonTests/PythonDataObjectsTest.TestPythonListValueEquality (2070 of 2163) PASS: lldb-api :: lang/cpp/namespace/TestNamespaceLookup.py (2071 of 2163) PASS: lldb-unit :: Expression/./ExpressionTests/CppModuleConfigurationTest.MissingLibCpp (2072 of 2163) PASS: lldb-unit :: Utility/./UtilityTests/RangeTest.Clear (2073 of 2163) PASS: lldb-shell :: ObjectFile/PECOFF/export-dllfunc.yaml (2074 of 2163) PASS: lldb-unit :: Language/Highlighting/./HighlighterTests/HighlighterTest.ClangPreserveNewLine (2075 of 2163) PASS: lldb-shell :: SymbolFile/DWARF/find-basic-type.cpp (2076 of 2163) PASS: lldb-unit :: Utility/./UtilityTests/UriParserTest.PortOverflow (2077 of 2163) PASS: lldb-shell :: Quit/TestQuitExitCodeTooManyArgs.test (2078 of 2163) PASS: lldb-unit :: Utility/./UtilityTests/ArgsTest.TestAppendArg (2079 of 2163) PASS: lldb-unit :: Utility/./UtilityTests/SerializationRountripTest.SerializeDeserializePodReferences (2080 of 2163) PASS: lldb-shell :: ObjectFile/ELF/section-permissions.yaml (2081 of 2163) PASS: lldb-unit :: Core/./LLDBCoreTests/CommunicationTest.SynchronizeWhileClosing (2082 of 2163) PASS: lldb-unit :: Utility/./UtilityTests/BroadcasterTest.EventTypeHasListeners (2083 of 2163) PASS: lldb-unit :: Utility/./UtilityTests/ArgsTest.DoubleQuotedItem (2084 of 2163) PASS: lldb-api :: lang/objc/real-definition/TestRealDefinition.py (2085 of 2163) PASS: lldb-unit :: Expression/./ExpressionTests/DiagnosticManagerTest.PutString (2086 of 2163) UNSUPPORTED: lldb-api :: functionalities/data-formatter/data-formatter-stl/libstdcpp/tuple/TestDataFormatterStdTuple.py (2087 of 2163) PASS: lldb-unit :: Process/gdb-remote/./ProcessGdbRemoteTests/GDBRemoteCommunicationServerTest.SendErrorResponse_UnimplementedError (2088 of 2163) PASS: lldb-unit :: Language/Highlighting/./HighlighterTests/HighlighterTest.ClangCursorPos (2089 of 2163) PASS: lldb-api :: functionalities/data-formatter/data-formatter-advanced/TestDataFormatterAdv.py (2090 of 2163) PASS: lldb-api :: commands/expression/import-std-module/basic/TestImportStdModule.py (2091 of 2163) PASS: lldb-unit :: Language/Highlighting/./HighlighterTests/HighlighterTest.ClangSquareBrackets (2092 of 2163) PASS: lldb-shell :: SymbolFile/DWARF/dir-separator-no-comp-dir-relative-name.s (2093 of 2163) PASS: lldb-api :: functionalities/thread_plan/TestThreadPlanCommands.py (2094 of 2163) PASS: lldb-api :: macosx/thread_suspend/TestInternalThreadSuspension.py (2095 of 2163) PASS: lldb-unit :: Utility/./UtilityTests/StreamTeeTest.SetStreamAtIndexOverwrite (2096 of 2163) UNSUPPORTED: lldb-shell :: Register/aarch64-gp-read.test (2097 of 2163) PASS: lldb-unit :: Utility/./UtilityTests/UriParserTest.MinimalPath (2098 of 2163) PASS: lldb-api :: functionalities/thread/concurrent_events/TestConcurrentSignalNWatchNBreak.py (2099 of 2163) PASS: lldb-shell :: ObjectFile/ELF/PT_LOAD.yaml (2100 of 2163) PASS: lldb-shell :: SymbolFile/DWARF/dwarf5-index-is-used.cpp (2101 of 2163) PASS: lldb-shell :: Register/x86-64-ymm-read.test (2102 of 2163) PASS: lldb-unit :: Utility/./UtilityTests/FileSpecTest.CopyByAppendingPathComponent (2103 of 2163) PASS: lldb-unit :: Core/./LLDBCoreTests/ModuleSpecTest.TestCOFFFile (2104 of 2163) PASS: lldb-api :: functionalities/data-formatter/data-formatter-objc/TestDataFormatterObjCExpr.py (2105 of 2163) PASS: lldb-unit :: Utility/./UtilityTests/BinaryStreamTest.PutULEB128TwoBytes (2106 of 2163) PASS: lldb-unit :: Utility/./UtilityTests/RecordReplayTest.InstrumentedFoo (2107 of 2163) PASS: lldb-api :: lang/objc/objc-ivar-stripped/TestObjCIvarStripped.py (2108 of 2163) PASS: lldb-api :: commands/breakpoint/set/func-regex/TestBreakpointRegexError.py (2109 of 2163) UNSUPPORTED: lldb-api :: commands/register/register/intel_xtended_registers/mpx_offset_intersection/TestMPXOffsetIntersection.py (2110 of 2163) PASS: lldb-shell :: SymbolFile/Breakpad/line-table-mixed-path-styles.test (2111 of 2163) PASS: lldb-api :: functionalities/data-formatter/data-formatter-stl/libcxx/atomic/TestLibCxxAtomic.py (2112 of 2163) PASS: lldb-api :: functionalities/data-formatter/dump_dynamic/TestDumpDynamic.py (2113 of 2163) PASS: lldb-shell :: ObjectFile/PECOFF/invalid-export-table.yaml (2114 of 2163) PASS: lldb-unit :: Language/CPlusPlus/./LanguageCPlusPlusTests/CPlusPlusLanguage.FindAlternateFunctionManglings (2115 of 2163) UNSUPPORTED: lldb-shell :: SymbolFile/NativePDB/ast-functions-msvc.cpp (2116 of 2163) PASS: lldb-unit :: Utility/./UtilityTests/XcodeSDKTest.FindXcodeContentsDirectoryInPath (2117 of 2163) PASS: lldb-api :: lang/objc/objc++/TestObjCXX.py (2118 of 2163) UNSUPPORTED: lldb-shell :: SymbolFile/PDB/expressions.test (2119 of 2163) PASS: lldb-unit :: Utility/./UtilityTests/UriParserTest.BadPort (2120 of 2163) PASS: lldb-unit :: Utility/./UtilityTests/UserIDResolver.GetGroupName (2121 of 2163) UNSUPPORTED: lldb-api :: functionalities/darwin_log/filter/exact_match/category/TestDarwinLogFilterMatchCategory.py (2122 of 2163) PASS: lldb-unit :: Target/./TargetTests/ModuleCacheTest.GetAndPutStrangeHostname (2123 of 2163) PASS: lldb-shell :: ObjectFile/PECOFF/sections-names.yaml (2124 of 2163) PASS: lldb-shell :: SymbolFile/DWARF/dwarf5-partial-index.cpp (2125 of 2163) PASS: lldb-unit :: Utility/./UtilityTests/ArgsTest.TestQuotedUnknownEscape (2126 of 2163) PASS: lldb-shell :: Reproducer/TestHomeDir.test (2127 of 2163) PASS: lldb-unit :: Utility/./UtilityTests/XcodeSDKTest.GetCanonicalNameAndConstruct (2128 of 2163) PASS: lldb-api :: commands/frame/diagnose/virtual-method-call/TestDiagnoseDereferenceVirtualMethodCall.py (2129 of 2163) PASS: lldb-unit :: DataFormatter/./LLDBFormatterTests/TypeMatcherTests.ExactName (2130 of 2163) PASS: lldb-unit :: Utility/./UtilityTests/RegisterValueTest.GetSet8 (2131 of 2163) PASS: lldb-unit :: Utility/./UtilityTests/OptionsWithRawTest.EmptySuffixSingleWhitespace (2132 of 2163) PASS: lldb-unit :: Utility/./UtilityTests/PassiveReplayTest.InstrumentedFoo (2133 of 2163) PASS: lldb-unit :: DataFormatter/./LLDBFormatterTests/StringPrinterTests.CxxUTF8 (2134 of 2163) PASS: lldb-api :: functionalities/data-formatter/frameformat_smallstruct/TestFrameFormatSmallStruct.py (2135 of 2163) UNSUPPORTED: lldb-api :: functionalities/darwin_log/filter/exact_match/activity-chain/TestDarwinLogFilterMatchActivityChain.py (2136 of 2163) PASS: lldb-unit :: Utility/./UtilityTests/TildeExpressionResolver.ResolveFullPath (2137 of 2163) PASS: lldb-unit :: Symbol/./SymbolTests/TestTypeSystemClang.TestGetTypeClassTypeOfExpr (2138 of 2163) PASS: lldb-api :: commands/expression/import-std-module/vector/TestVectorFromStdModule.py (2139 of 2163) PASS: lldb-api :: python_api/value_var_update/TestValueVarUpdate.py (2140 of 2163) PASS: lldb-unit :: Symbol/./SymbolTests/TestTypeSystemClang.TestRecordHasFields (2141 of 2163) PASS: lldb-api :: source-manager/TestSourceManager.py (2142 of 2163) UNSUPPORTED: lldb-api :: tools/lldb-vscode/completions/TestVSCode_completions.py (2143 of 2163) PASS: lldb-api :: functionalities/thread/concurrent_events/TestConcurrentManyBreakpoints.py (2144 of 2163) PASS: lldb-unit :: Utility/./UtilityTests/StreamTest.PutCStringWithStringRef (2145 of 2163) PASS: lldb-api :: lang/objc/objc-struct-return/TestObjCStructReturn.py (2146 of 2163) PASS: lldb-api :: commands/frame/diagnose/dereference-this/TestDiagnoseDereferenceThis.py (2147 of 2163) PASS: lldb-unit :: Process/./ProcessEventDataTests/ProcessEventDataTest.DoOnRemoval (2148 of 2163) PASS: lldb-unit :: ScriptInterpreter/Python/./ScriptInterpreterPythonTests/PythonDataObjectsTest.TestPythonDictionaryToStructuredDictionary (2149 of 2163) PASS: lldb-api :: commands/frame/var-scope/TestFrameVariableScope.py (2150 of 2163) UNSUPPORTED: lldb-shell :: ScriptInterpreter/Lua/command_script_import.test (2151 of 2163) PASS: lldb-unit :: Utility/./UtilityTests/RecordReplayTest.InstrumentedBarPtr (2152 of 2163) PASS: lldb-api :: macosx/macCatalyst/TestMacCatalyst.py (2153 of 2163) PASS: lldb-api :: commands/expression/import-std-module/forward_list/TestForwardListFromStdModule.py (2154 of 2163) PASS: lldb-shell :: Recognizer/assert.test (2155 of 2163) PASS: lldb-unit :: Process/minidump/./LLDBMinidumpTests/MinidumpParserTest.GetLinuxProcStatus (2156 of 2163) PASS: lldb-unit :: Utility/./UtilityTests/DataExtractorTest.GetCStr (2157 of 2163) PASS: lldb-unit :: Utility/./UtilityTests/ProcessInstanceInfo.DumpTable (2158 of 2163) UNSUPPORTED: lldb-shell :: Register/x86-64-ymm16-write.test (2159 of 2163) PASS: lldb-unit :: Language/Highlighting/./HighlighterTests/HighlighterTest.DefaultHighlighter (2160 of 2163) PASS: lldb-api :: lang/objc/objc-foundation-dictionary-empty/TestNSDictionary0.py (2161 of 2163) PASS: lldb-api :: lang/objc/variadic_methods/TestVariadicMethods.py (2162 of 2163) PASS: lldb-shell :: ObjectFile/ELF/PT_LOAD-overlap-PT_TLS.yaml (2163 of 2163) Slowest Tests: -------------------------------------------------------------------------- 600.98s: lldb-api :: macosx/simulator/TestSimulatorPlatform.py 184.74s: lldb-api :: tools/lldb-vscode/launch/TestVSCode_launch.py 123.98s: lldb-api :: lang/cpp/stl/TestStdCXXDisassembly.py 106.34s: lldb-api :: functionalities/postmortem/mach-core/TestMachCore.py 103.95s: lldb-api :: lang/c/anonymous/TestAnonymous.py 102.24s: lldb-api :: tools/lldb-server/TestLldbGdbServer.py 96.60s: lldb-api :: commands/expression/context-object-objc/TestContextObjectObjc.py 95.21s: lldb-api :: lang/objc/objc-optimized/TestObjcOptimized.py 94.49s: lldb-api :: functionalities/data-formatter/nsarraysynth/TestNSArraySynthetic.py 87.22s: lldb-api :: functionalities/thread/concurrent_events/TestConcurrentTwoBreakpointsOneSignal.py 84.11s: lldb-api :: commands/expression/issue_11588/Test11588.py 78.59s: lldb-api :: lang/objc/objc-new-syntax/TestObjCNewSyntaxLiteral.py 68.55s: lldb-api :: functionalities/load_using_paths/TestLoadUsingPaths.py 66.79s: lldb-api :: functionalities/gdb_remote_client/TestRegDefinitionInParts.py 65.97s: lldb-api :: commands/expression/completion-crash-incomplete-record/TestCompletionCrashIncompleteRecord.py 60.10s: lldb-api :: functionalities/postmortem/netbsd-core/TestNetBSDCore.py 59.05s: lldb-unit :: UnwindAssembly/ARM64/./Arm64InstEmulationTests/TestArm64InstEmulation.TestCFARegisterTrackedAcrossJumps 58.38s: lldb-api :: lang/objc/hidden-ivars/TestHiddenIvars.py 58.11s: lldb-api :: functionalities/completion/TestCompletion.py 55.12s: lldb-api :: lang/objc/foundation/TestFoundationDisassembly.py

Hide Details

Tests Times: -------------------------------------------------------------------------- [ Range ] :: [ Percentage ] :: [ Count ] -------------------------------------------------------------------------- [600s,650s) :: [ ] :: [ 1/2163] [550s,600s) :: [ ] :: [ 0/2163] [500s,550s) :: [ ] :: [ 0/2163] [450s,500s) :: [ ] :: [ 0/2163] [400s,450s) :: [ ] :: [ 0/2163] [350s,400s) :: [ ] :: [ 0/2163] [300s,350s) :: [ ] :: [ 0/2163] [250s,300s) :: [ ] :: [ 0/2163] [200s,250s) :: [ ] :: [ 0/2163] [150s,200s) :: [ ] :: [ 1/2163] [100s,150s) :: [ ] :: [ 7/2163] [ 50s,100s) :: [ ] :: [ 18/2163] [ 0s, 50s) :: [*************************************** ] :: [2136/2163] -------------------------------------------------------------------------- ******************** Timed Out Tests (1): lldb-api :: macosx/simulator/TestSimulatorPlatform.py

Hide Details

******************** Failed Tests (1): lldb-api :: tools/lldb-vscode/launch/TestVSCode_launch.py

Hide Details

Hide Details

Testing Time: 2158.38s Unsupported : 153 Passed : 2002 Expectedly Failed: 6 Timed Out : 1 Failed : 1 FAILED: tools/lldb/test/CMakeFiles/check-lldb-lit cd /Users/buildslave/jenkins/workspace/lldb-cmake/lldb-build/tools/lldb/test && /usr/local/Frameworks/Python.framework/Versions/3.7/bin/python3.7 /Users/buildslave/jenkins/workspace/lldb-cmake/lldb-build/./bin/llvm-lit -v --time-tests --shuffle --xunit-xml-output=/Users/buildslave/jenkins/workspace/lldb-cmake/test/results.xml -v -j 4 /Users/buildslave/jenkins/workspace/lldb-cmake/lldb-build/tools/lldb/test ninja: build stopped: subcommand failed. Command failed: Command '['/usr/bin/env', 'TERM=vt100', '/usr/local/bin/ninja', '-v', 'check-lldb']' returned non-zero exit status 1 Command: ['/usr/bin/env', 'TERM=vt100', '/usr/local/bin/ninja', '-v', 'check-lldb'] [Pipeline] } [Pipeline] // timeout [Pipeline] } [Pipeline] // stage [Pipeline] stage [Pipeline] { (Declarative: Post Actions) [Pipeline] scanForIssues [Clang (LLVM based)] Sleeping for 5 seconds due to JENKINS-32191... [Clang (LLVM based)] Parsing console log (workspace: '/Users/buildslave/jenkins/workspace/lldb-cmake') [Clang (LLVM based)] Successfully parsed console log [Clang (LLVM based)] -> found 10 issues (skipped 12 duplicates) [Clang (LLVM based)] Post processing issues on 'green-dragon-10' with source code encoding 'UTF-8' [Clang (LLVM based)] Creating SCM blamer to obtain author and commit information for affected files [Clang (LLVM based)] Creating SCM miner to obtain statistics for affected repository files [Clang (LLVM based)] Resolving file names for all issues in source directory '/Users/buildslave/jenkins/workspace/lldb-cmake' [Clang (LLVM based)] -> resolved paths in source directory (7 found, 0 not found) [Clang (LLVM based)] Resolving module names from module definitions (build.xml, pom.xml, or Manifest.mf files) [Clang (LLVM based)] -> resolved module names for 10 issues [Clang (LLVM based)] Resolving package names (or namespaces) by parsing the affected files [Clang (LLVM based)] -> resolved package names of 7 affected files [Clang (LLVM based)] No filter has been set, publishing all 10 issues [Clang (LLVM based)] Creating fingerprints for all affected code blocks to track issues over different builds [Clang (LLVM based)] -> created fingerprints for 10 issues (skipped 0 issues) [Clang (LLVM based)] Copying affected files to Jenkins' build folder '/Users/Shared/Jenkins/Home/jobs/lldb-cmake/builds/24045/files-with-issues' [Clang (LLVM based)] -> 5 copied, 2 not in workspace, 0 not-found, 0 with I/O error [Pipeline] junit Recording test results [Pipeline] emailext Warning: aaronpuchert@alice-dsl.net is not a recognized user, but sending mail anyway Warning: alexandre.ganea@ubisoft.com is not a recognized user, but sending mail anyway Warning: pklausler@nvidia.com is not a recognized user, but sending mail anyway Warning: aeubanks@google.com is not a recognized user, but sending mail anyway Warning: aaronpuchert@alice-dsl.net is not a recognized user, but sending mail anyway Warning: alexandre.ganea@ubisoft.com is not a recognized user, but sending mail anyway Warning: pklausler@nvidia.com is not a recognized user, but sending mail anyway Warning: aeubanks@google.com is not a recognized user, but sending mail anyway

Hide Details

Begin Pre-Send Script... Sending email to: mschifer@apple.com aemerson@apple.com aaronpuchert@alice-dsl.net alexandre.ganea@ubisoft.com jpaquette@apple.com risemann@apple.com pklausler@nvidia.com aeubanks@google.com "vsapsai@apple.com" <vsapsai@apple.com> Azhar Mohammed <azhar@apple.com>
[Pipeline] } [Pipeline] // stage [Pipeline] } [Pipeline] // withEnv [Pipeline] } [Pipeline] // node [Pipeline] End of Pipeline ERROR: script returned exit code 1 Finished: FAILURE