FailedConsole Output

Skipping 9,431 KB.. Full Log
on -fdiagnostics-color -Wno-deprecated-declarations -Wno-unknown-pragmas -Wno-strict-aliasing -Wno-deprecated-register -Wno-vla-extension -O3  -isysroot /Applications/Xcode.app/Contents/Developer/Platforms/MacOSX.platform/Developer/SDKs/MacOSX10.15.sdk    -include /Users/buildslave/jenkins/workspace/lldb-cmake-reproducers/llvm-project/lldb/unittests/gtest_common.h -Wno-variadic-macros -Wno-gnu-zero-variadic-macro-arguments -fno-exceptions -fno-rtti -UNDEBUG -Wno-suggest-override -std=c++14 -MD -MT tools/lldb/unittests/tools/lldb-server/tests/CMakeFiles/LLDBServerTests.dir/MessageObjects.cpp.o -MF tools/lldb/unittests/tools/lldb-server/tests/CMakeFiles/LLDBServerTests.dir/MessageObjects.cpp.o.d -o tools/lldb/unittests/tools/lldb-server/tests/CMakeFiles/LLDBServerTests.dir/MessageObjects.cpp.o -c /Users/buildslave/jenkins/workspace/lldb-cmake-reproducers/llvm-project/lldb/unittests/tools/lldb-server/tests/MessageObjects.cpp
[175/183] /Users/buildslave/jenkins/workspace/lldb-cmake-reproducers/host-compiler/bin/clang++  -DGTEST_HAS_RTTI=0 -DGTEST_HAS_TR1_TUPLE=0 -DHAVE_ROUND -D_DEBUG -D__STDC_CONSTANT_MACROS -D__STDC_FORMAT_MACROS -D__STDC_LIMIT_MACROS -Itools/lldb/unittests/debugserver -I/Users/buildslave/jenkins/workspace/lldb-cmake-reproducers/llvm-project/lldb/unittests/debugserver -I/Users/buildslave/jenkins/workspace/lldb-cmake-reproducers/llvm-project/lldb/include -Itools/lldb/include -Iinclude -I/Users/buildslave/jenkins/workspace/lldb-cmake-reproducers/llvm-project/llvm/include -I/usr/local/Cellar/python/3.7.0/Frameworks/Python.framework/Versions/3.7/include/python3.7m -I/Users/buildslave/jenkins/workspace/lldb-cmake-reproducers/llvm-project/llvm/../clang/include -Itools/lldb/../clang/include -I/usr/local/include -I/Applications/Xcode.app/Contents/Developer/Platforms/MacOSX.platform/Developer/SDKs/MacOSX10.15.sdk/usr/include/libxml2 -I/Users/buildslave/jenkins/workspace/lldb-cmake-reproducers/llvm-project/lldb/source -I/Users/buildslave/jenkins/workspace/lldb-cmake-reproducers/llvm-project/lldb/unittests -I/Users/buildslave/jenkins/workspace/lldb-cmake-reproducers/llvm-project/lldb/tools/debugserver/source -I/Users/buildslave/jenkins/workspace/lldb-cmake-reproducers/llvm-project/lldb/tools/debugserver/source/MacOSX -I/Users/buildslave/jenkins/workspace/lldb-cmake-reproducers/llvm-project/llvm/utils/unittest/googletest/include -I/Users/buildslave/jenkins/workspace/lldb-cmake-reproducers/llvm-project/llvm/utils/unittest/googlemock/include -Wdocumentation -fPIC -fvisibility-inlines-hidden -Werror=date-time -Werror=unguarded-availability-new -fmodules -fmodules-cache-path=/Users/buildslave/jenkins/workspace/lldb-cmake-reproducers/lldb-build/module.cache -fcxx-modules -Xclang -fmodules-local-submodule-visibility -Wall -Wextra -Wno-unused-parameter -Wwrite-strings -Wcast-qual -Wmissing-field-initializers -pedantic -Wno-long-long -Wimplicit-fallthrough -Wcovered-switch-default -Wno-noexcept-type -Wnon-virtual-dtor -Wdelete-non-virtual-dtor -Wsuggest-override -Wstring-conversion -fdiagnostics-color -Wno-deprecated-declarations -Wno-unknown-pragmas -Wno-strict-aliasing -Wno-deprecated-register -Wno-vla-extension -O3  -isysroot /Applications/Xcode.app/Contents/Developer/Platforms/MacOSX.platform/Developer/SDKs/MacOSX10.15.sdk    -include /Users/buildslave/jenkins/workspace/lldb-cmake-reproducers/llvm-project/lldb/unittests/gtest_common.h -Wno-variadic-macros -Wno-gnu-zero-variadic-macro-arguments -fno-exceptions -fno-rtti -UNDEBUG -Wno-suggest-override -std=c++14 -MD -MT tools/lldb/unittests/debugserver/CMakeFiles/debugserverTests.dir/JSONTest.cpp.o -MF tools/lldb/unittests/debugserver/CMakeFiles/debugserverTests.dir/JSONTest.cpp.o.d -o tools/lldb/unittests/debugserver/CMakeFiles/debugserverTests.dir/JSONTest.cpp.o -c /Users/buildslave/jenkins/workspace/lldb-cmake-reproducers/llvm-project/lldb/unittests/debugserver/JSONTest.cpp
[176/183] : && /Users/buildslave/jenkins/workspace/lldb-cmake-reproducers/host-compiler/bin/clang++  -Wdocumentation -fPIC -fvisibility-inlines-hidden -Werror=date-time -Werror=unguarded-availability-new -fmodules -fmodules-cache-path=/Users/buildslave/jenkins/workspace/lldb-cmake-reproducers/lldb-build/module.cache -fcxx-modules -Xclang -fmodules-local-submodule-visibility -Wall -Wextra -Wno-unused-parameter -Wwrite-strings -Wcast-qual -Wmissing-field-initializers -pedantic -Wno-long-long -Wimplicit-fallthrough -Wcovered-switch-default -Wno-noexcept-type -Wnon-virtual-dtor -Wdelete-non-virtual-dtor -Wsuggest-override -Wstring-conversion -fdiagnostics-color -Wno-deprecated-declarations -Wno-unknown-pragmas -Wno-strict-aliasing -Wno-deprecated-register -Wno-vla-extension -O3  -isysroot /Applications/Xcode.app/Contents/Developer/Platforms/MacOSX.platform/Developer/SDKs/MacOSX10.15.sdk -Wl,-search_paths_first -Wl,-headerpad_max_install_names -Wl,-dead_strip tools/lldb/unittests/debugserver/CMakeFiles/debugserverTests.dir/JSONTest.cpp.o tools/lldb/unittests/debugserver/CMakeFiles/debugserverTests.dir/RNBSocketTest.cpp.o tools/lldb/unittests/debugserver/CMakeFiles/debugserverTests.dir/debugserver_LogCallback.cpp.o  -o tools/lldb/unittests/debugserver/debugserverTests  lib/libLLVMSupport.a  lib/libLLVMSupport.a  lib/libgtest_main.a  lib/libgtest.a  lib/liblldbDebugserverCommon.a  lib/liblldbHost.a  lib/libLLVMTestingSupport.a  lib/liblldbDebugserverArchSupport.a  lib/liblldbDebugserverDarwin_DarwinLog.a  -lcompression  /usr/lib/libxml2.dylib  /usr/lib/libedit.dylib  /usr/local/lib/liblzma.dylib  /usr/lib/libedit.dylib  /usr/local/lib/liblzma.dylib  lib/liblldbHostMacOSXObjCXX.a  lib/liblldbUtility.a  -framework  CoreFoundation  -framework  Foundation  -framework  CoreServices  -framework  Security  lib/libLLVMObject.a  lib/libLLVMBitReader.a  lib/libLLVMCore.a  lib/libLLVMRemarks.a  lib/libLLVMBitstreamReader.a  lib/libLLVMMCParser.a  lib/libLLVMMC.a  lib/libLLVMDebugInfoCodeView.a  lib/libLLVMDebugInfoMSF.a  lib/libLLVMTextAPI.a  lib/libLLVMBinaryFormat.a  lib/libgtest.a  lib/libLLVMSupport.a  -lm  /usr/lib/libz.dylib  /usr/lib/libcurses.dylib  lib/libLLVMDemangle.a  -lpthread && cd /Users/buildslave/jenkins/workspace/lldb-cmake-reproducers/lldb-build/tools/lldb/unittests/debugserver && /usr/local/Cellar/cmake/3.17.2/bin/cmake -E make_directory /Users/buildslave/jenkins/workspace/lldb-cmake-reproducers/lldb-build/tools/lldb/unittests/debugserver/./Inputs
[177/183] /Users/buildslave/jenkins/workspace/lldb-cmake-reproducers/host-compiler/bin/clang++  -DGTEST_HAS_RTTI=0 -DGTEST_HAS_TR1_TUPLE=0 -DHAVE_ROUND -DLLDB_SERVER=\"/Users/buildslave/jenkins/workspace/lldb-cmake-reproducers/lldb-build/bin/debugserver\" -DLLDB_SERVER_IS_DEBUGSERVER=1 -DLLDB_TEST_INFERIOR_PATH=\"/Users/buildslave/jenkins/workspace/lldb-cmake-reproducers/lldb-build/tools/lldb/unittests/tools/lldb-server/.\" -DLLDB_TEST_INFERIOR_SUFFIX=\"\" -D_DEBUG -D__STDC_CONSTANT_MACROS -D__STDC_FORMAT_MACROS -D__STDC_LIMIT_MACROS -Itools/lldb/unittests/tools/lldb-server/tests -I/Users/buildslave/jenkins/workspace/lldb-cmake-reproducers/llvm-project/lldb/unittests/tools/lldb-server/tests -I/Users/buildslave/jenkins/workspace/lldb-cmake-reproducers/llvm-project/lldb/include -Itools/lldb/include -Iinclude -I/Users/buildslave/jenkins/workspace/lldb-cmake-reproducers/llvm-project/llvm/include -I/usr/local/Cellar/python/3.7.0/Frameworks/Python.framework/Versions/3.7/include/python3.7m -I/Users/buildslave/jenkins/workspace/lldb-cmake-reproducers/llvm-project/llvm/../clang/include -Itools/lldb/../clang/include -I/usr/local/include -I/Applications/Xcode.app/Contents/Developer/Platforms/MacOSX.platform/Developer/SDKs/MacOSX10.15.sdk/usr/include/libxml2 -I/Users/buildslave/jenkins/workspace/lldb-cmake-reproducers/llvm-project/lldb/source -I/Users/buildslave/jenkins/workspace/lldb-cmake-reproducers/llvm-project/lldb/unittests -I/Users/buildslave/jenkins/workspace/lldb-cmake-reproducers/llvm-project/llvm/utils/unittest/googletest/include -I/Users/buildslave/jenkins/workspace/lldb-cmake-reproducers/llvm-project/llvm/utils/unittest/googlemock/include -Wdocumentation -fPIC -fvisibility-inlines-hidden -Werror=date-time -Werror=unguarded-availability-new -fmodules -fmodules-cache-path=/Users/buildslave/jenkins/workspace/lldb-cmake-reproducers/lldb-build/module.cache -fcxx-modules -Xclang -fmodules-local-submodule-visibility -Wall -Wextra -Wno-unused-parameter -Wwrite-strings -Wcast-qual -Wmissing-field-initializers -pedantic -Wno-long-long -Wimplicit-fallthrough -Wcovered-switch-default -Wno-noexcept-type -Wnon-virtual-dtor -Wdelete-non-virtual-dtor -Wsuggest-override -Wstring-conversion -fdiagnostics-color -Wno-deprecated-declarations -Wno-unknown-pragmas -Wno-strict-aliasing -Wno-deprecated-register -Wno-vla-extension -O3  -isysroot /Applications/Xcode.app/Contents/Developer/Platforms/MacOSX.platform/Developer/SDKs/MacOSX10.15.sdk    -include /Users/buildslave/jenkins/workspace/lldb-cmake-reproducers/llvm-project/lldb/unittests/gtest_common.h -Wno-variadic-macros -Wno-gnu-zero-variadic-macro-arguments -fno-exceptions -fno-rtti -UNDEBUG -Wno-suggest-override -std=c++14 -MD -MT tools/lldb/unittests/tools/lldb-server/tests/CMakeFiles/LLDBServerTests.dir/TestBase.cpp.o -MF tools/lldb/unittests/tools/lldb-server/tests/CMakeFiles/LLDBServerTests.dir/TestBase.cpp.o.d -o tools/lldb/unittests/tools/lldb-server/tests/CMakeFiles/LLDBServerTests.dir/TestBase.cpp.o -c /Users/buildslave/jenkins/workspace/lldb-cmake-reproducers/llvm-project/lldb/unittests/tools/lldb-server/tests/TestBase.cpp
[178/183] /Users/buildslave/jenkins/workspace/lldb-cmake-reproducers/host-compiler/bin/clang++  -DGTEST_HAS_RTTI=0 -DGTEST_HAS_TR1_TUPLE=0 -DHAVE_ROUND -DLLDB_SERVER=\"/Users/buildslave/jenkins/workspace/lldb-cmake-reproducers/lldb-build/bin/debugserver\" -DLLDB_SERVER_IS_DEBUGSERVER=1 -DLLDB_TEST_INFERIOR_PATH=\"/Users/buildslave/jenkins/workspace/lldb-cmake-reproducers/lldb-build/tools/lldb/unittests/tools/lldb-server/.\" -DLLDB_TEST_INFERIOR_SUFFIX=\"\" -D_DEBUG -D__STDC_CONSTANT_MACROS -D__STDC_FORMAT_MACROS -D__STDC_LIMIT_MACROS -Itools/lldb/unittests/tools/lldb-server/tests -I/Users/buildslave/jenkins/workspace/lldb-cmake-reproducers/llvm-project/lldb/unittests/tools/lldb-server/tests -I/Users/buildslave/jenkins/workspace/lldb-cmake-reproducers/llvm-project/lldb/include -Itools/lldb/include -Iinclude -I/Users/buildslave/jenkins/workspace/lldb-cmake-reproducers/llvm-project/llvm/include -I/usr/local/Cellar/python/3.7.0/Frameworks/Python.framework/Versions/3.7/include/python3.7m -I/Users/buildslave/jenkins/workspace/lldb-cmake-reproducers/llvm-project/llvm/../clang/include -Itools/lldb/../clang/include -I/usr/local/include -I/Applications/Xcode.app/Contents/Developer/Platforms/MacOSX.platform/Developer/SDKs/MacOSX10.15.sdk/usr/include/libxml2 -I/Users/buildslave/jenkins/workspace/lldb-cmake-reproducers/llvm-project/lldb/source -I/Users/buildslave/jenkins/workspace/lldb-cmake-reproducers/llvm-project/lldb/unittests -I/Users/buildslave/jenkins/workspace/lldb-cmake-reproducers/llvm-project/llvm/utils/unittest/googletest/include -I/Users/buildslave/jenkins/workspace/lldb-cmake-reproducers/llvm-project/llvm/utils/unittest/googlemock/include -Wdocumentation -fPIC -fvisibility-inlines-hidden -Werror=date-time -Werror=unguarded-availability-new -fmodules -fmodules-cache-path=/Users/buildslave/jenkins/workspace/lldb-cmake-reproducers/lldb-build/module.cache -fcxx-modules -Xclang -fmodules-local-submodule-visibility -Wall -Wextra -Wno-unused-parameter -Wwrite-strings -Wcast-qual -Wmissing-field-initializers -pedantic -Wno-long-long -Wimplicit-fallthrough -Wcovered-switch-default -Wno-noexcept-type -Wnon-virtual-dtor -Wdelete-non-virtual-dtor -Wsuggest-override -Wstring-conversion -fdiagnostics-color -Wno-deprecated-declarations -Wno-unknown-pragmas -Wno-strict-aliasing -Wno-deprecated-register -Wno-vla-extension -O3  -isysroot /Applications/Xcode.app/Contents/Developer/Platforms/MacOSX.platform/Developer/SDKs/MacOSX10.15.sdk    -include /Users/buildslave/jenkins/workspace/lldb-cmake-reproducers/llvm-project/lldb/unittests/gtest_common.h -Wno-variadic-macros -Wno-gnu-zero-variadic-macro-arguments -fno-exceptions -fno-rtti -UNDEBUG -Wno-suggest-override -std=c++14 -MD -MT tools/lldb/unittests/tools/lldb-server/tests/CMakeFiles/LLDBServerTests.dir/LLGSTest.cpp.o -MF tools/lldb/unittests/tools/lldb-server/tests/CMakeFiles/LLDBServerTests.dir/LLGSTest.cpp.o.d -o tools/lldb/unittests/tools/lldb-server/tests/CMakeFiles/LLDBServerTests.dir/LLGSTest.cpp.o -c /Users/buildslave/jenkins/workspace/lldb-cmake-reproducers/llvm-project/lldb/unittests/tools/lldb-server/tests/LLGSTest.cpp
[179/183] /Users/buildslave/jenkins/workspace/lldb-cmake-reproducers/host-compiler/bin/clang++  -DGTEST_HAS_RTTI=0 -DGTEST_HAS_TR1_TUPLE=0 -DHAVE_ROUND -DLLDB_SERVER=\"/Users/buildslave/jenkins/workspace/lldb-cmake-reproducers/lldb-build/bin/debugserver\" -DLLDB_SERVER_IS_DEBUGSERVER=1 -DLLDB_TEST_INFERIOR_PATH=\"/Users/buildslave/jenkins/workspace/lldb-cmake-reproducers/lldb-build/tools/lldb/unittests/tools/lldb-server/.\" -DLLDB_TEST_INFERIOR_SUFFIX=\"\" -D_DEBUG -D__STDC_CONSTANT_MACROS -D__STDC_FORMAT_MACROS -D__STDC_LIMIT_MACROS -Itools/lldb/unittests/tools/lldb-server/tests -I/Users/buildslave/jenkins/workspace/lldb-cmake-reproducers/llvm-project/lldb/unittests/tools/lldb-server/tests -I/Users/buildslave/jenkins/workspace/lldb-cmake-reproducers/llvm-project/lldb/include -Itools/lldb/include -Iinclude -I/Users/buildslave/jenkins/workspace/lldb-cmake-reproducers/llvm-project/llvm/include -I/usr/local/Cellar/python/3.7.0/Frameworks/Python.framework/Versions/3.7/include/python3.7m -I/Users/buildslave/jenkins/workspace/lldb-cmake-reproducers/llvm-project/llvm/../clang/include -Itools/lldb/../clang/include -I/usr/local/include -I/Applications/Xcode.app/Contents/Developer/Platforms/MacOSX.platform/Developer/SDKs/MacOSX10.15.sdk/usr/include/libxml2 -I/Users/buildslave/jenkins/workspace/lldb-cmake-reproducers/llvm-project/lldb/source -I/Users/buildslave/jenkins/workspace/lldb-cmake-reproducers/llvm-project/lldb/unittests -I/Users/buildslave/jenkins/workspace/lldb-cmake-reproducers/llvm-project/llvm/utils/unittest/googletest/include -I/Users/buildslave/jenkins/workspace/lldb-cmake-reproducers/llvm-project/llvm/utils/unittest/googlemock/include -Wdocumentation -fPIC -fvisibility-inlines-hidden -Werror=date-time -Werror=unguarded-availability-new -fmodules -fmodules-cache-path=/Users/buildslave/jenkins/workspace/lldb-cmake-reproducers/lldb-build/module.cache -fcxx-modules -Xclang -fmodules-local-submodule-visibility -Wall -Wextra -Wno-unused-parameter -Wwrite-strings -Wcast-qual -Wmissing-field-initializers -pedantic -Wno-long-long -Wimplicit-fallthrough -Wcovered-switch-default -Wno-noexcept-type -Wnon-virtual-dtor -Wdelete-non-virtual-dtor -Wsuggest-override -Wstring-conversion -fdiagnostics-color -Wno-deprecated-declarations -Wno-unknown-pragmas -Wno-strict-aliasing -Wno-deprecated-register -Wno-vla-extension -O3  -isysroot /Applications/Xcode.app/Contents/Developer/Platforms/MacOSX.platform/Developer/SDKs/MacOSX10.15.sdk    -include /Users/buildslave/jenkins/workspace/lldb-cmake-reproducers/llvm-project/lldb/unittests/gtest_common.h -Wno-variadic-macros -Wno-gnu-zero-variadic-macro-arguments -fno-exceptions -fno-rtti -UNDEBUG -Wno-suggest-override -std=c++14 -MD -MT tools/lldb/unittests/tools/lldb-server/tests/CMakeFiles/LLDBServerTests.dir/TestClient.cpp.o -MF tools/lldb/unittests/tools/lldb-server/tests/CMakeFiles/LLDBServerTests.dir/TestClient.cpp.o.d -o tools/lldb/unittests/tools/lldb-server/tests/CMakeFiles/LLDBServerTests.dir/TestClient.cpp.o -c /Users/buildslave/jenkins/workspace/lldb-cmake-reproducers/llvm-project/lldb/unittests/tools/lldb-server/tests/TestClient.cpp
While building module 'lldb_Wrapper' imported from /Users/buildslave/jenkins/workspace/lldb-cmake-reproducers/llvm-project/lldb/source/Plugins/Process/gdb-remote/GDBRemoteCommunication.h:20:
In file included from <module-includes>:12:
In file included from /Users/buildslave/jenkins/workspace/lldb-cmake-reproducers/llvm-project/lldb/include/lldb/Breakpoint/BreakpointResolverAddress.h:13:
/Users/buildslave/jenkins/workspace/lldb-cmake-reproducers/llvm-project/lldb/include/lldb/Core/ModuleSpec.h:35:23: warning: empty paragraph passed to '\param' command [-Wdocumentation]
  /// \param file_spec.
      ~~~~~~~~~~~~~~~~^
/Users/buildslave/jenkins/workspace/lldb-cmake-reproducers/llvm-project/lldb/include/lldb/Core/ModuleSpec.h:35:14: warning: parameter 'file_spec.' not found in the function declaration [-Wdocumentation]
  /// \param file_spec.
             ^~~~~~~~~~
/Users/buildslave/jenkins/workspace/lldb-cmake-reproducers/llvm-project/lldb/include/lldb/Core/ModuleSpec.h:35:14: note: did you mean 'file_spec'?
  /// \param file_spec.
             ^~~~~~~~~~
             file_spec
2 warnings generated.
[180/183] /Users/buildslave/jenkins/workspace/lldb-cmake-reproducers/host-compiler/bin/clang++  -DGTEST_HAS_RTTI=0 -DGTEST_HAS_TR1_TUPLE=0 -DHAVE_ROUND -DLLDB_SERVER=\"/Users/buildslave/jenkins/workspace/lldb-cmake-reproducers/lldb-build/bin/debugserver\" -DLLDB_SERVER_IS_DEBUGSERVER=1 -DLLDB_TEST_INFERIOR_PATH=\"/Users/buildslave/jenkins/workspace/lldb-cmake-reproducers/lldb-build/tools/lldb/unittests/tools/lldb-server/.\" -DLLDB_TEST_INFERIOR_SUFFIX=\"\" -D_DEBUG -D__STDC_CONSTANT_MACROS -D__STDC_FORMAT_MACROS -D__STDC_LIMIT_MACROS -Itools/lldb/unittests/tools/lldb-server/tests -I/Users/buildslave/jenkins/workspace/lldb-cmake-reproducers/llvm-project/lldb/unittests/tools/lldb-server/tests -I/Users/buildslave/jenkins/workspace/lldb-cmake-reproducers/llvm-project/lldb/include -Itools/lldb/include -Iinclude -I/Users/buildslave/jenkins/workspace/lldb-cmake-reproducers/llvm-project/llvm/include -I/usr/local/Cellar/python/3.7.0/Frameworks/Python.framework/Versions/3.7/include/python3.7m -I/Users/buildslave/jenkins/workspace/lldb-cmake-reproducers/llvm-project/llvm/../clang/include -Itools/lldb/../clang/include -I/usr/local/include -I/Applications/Xcode.app/Contents/Developer/Platforms/MacOSX.platform/Developer/SDKs/MacOSX10.15.sdk/usr/include/libxml2 -I/Users/buildslave/jenkins/workspace/lldb-cmake-reproducers/llvm-project/lldb/source -I/Users/buildslave/jenkins/workspace/lldb-cmake-reproducers/llvm-project/lldb/unittests -I/Users/buildslave/jenkins/workspace/lldb-cmake-reproducers/llvm-project/llvm/utils/unittest/googletest/include -I/Users/buildslave/jenkins/workspace/lldb-cmake-reproducers/llvm-project/llvm/utils/unittest/googlemock/include -Wdocumentation -fPIC -fvisibility-inlines-hidden -Werror=date-time -Werror=unguarded-availability-new -fmodules -fmodules-cache-path=/Users/buildslave/jenkins/workspace/lldb-cmake-reproducers/lldb-build/module.cache -fcxx-modules -Xclang -fmodules-local-submodule-visibility -Wall -Wextra -Wno-unused-parameter -Wwrite-strings -Wcast-qual -Wmissing-field-initializers -pedantic -Wno-long-long -Wimplicit-fallthrough -Wcovered-switch-default -Wno-noexcept-type -Wnon-virtual-dtor -Wdelete-non-virtual-dtor -Wsuggest-override -Wstring-conversion -fdiagnostics-color -Wno-deprecated-declarations -Wno-unknown-pragmas -Wno-strict-aliasing -Wno-deprecated-register -Wno-vla-extension -O3  -isysroot /Applications/Xcode.app/Contents/Developer/Platforms/MacOSX.platform/Developer/SDKs/MacOSX10.15.sdk    -include /Users/buildslave/jenkins/workspace/lldb-cmake-reproducers/llvm-project/lldb/unittests/gtest_common.h -Wno-variadic-macros -Wno-gnu-zero-variadic-macro-arguments -fno-exceptions -fno-rtti -UNDEBUG -Wno-suggest-override -std=c++14 -MD -MT tools/lldb/unittests/tools/lldb-server/tests/CMakeFiles/LLDBServerTests.dir/ThreadIdsInJstopinfoTest.cpp.o -MF tools/lldb/unittests/tools/lldb-server/tests/CMakeFiles/LLDBServerTests.dir/ThreadIdsInJstopinfoTest.cpp.o.d -o tools/lldb/unittests/tools/lldb-server/tests/CMakeFiles/LLDBServerTests.dir/ThreadIdsInJstopinfoTest.cpp.o -c /Users/buildslave/jenkins/workspace/lldb-cmake-reproducers/llvm-project/lldb/unittests/tools/lldb-server/tests/ThreadIdsInJstopinfoTest.cpp
[181/183] : && /Users/buildslave/jenkins/workspace/lldb-cmake-reproducers/host-compiler/bin/clang++  -Wdocumentation -fPIC -fvisibility-inlines-hidden -Werror=date-time -Werror=unguarded-availability-new -fmodules -fmodules-cache-path=/Users/buildslave/jenkins/workspace/lldb-cmake-reproducers/lldb-build/module.cache -fcxx-modules -Xclang -fmodules-local-submodule-visibility -Wall -Wextra -Wno-unused-parameter -Wwrite-strings -Wcast-qual -Wmissing-field-initializers -pedantic -Wno-long-long -Wimplicit-fallthrough -Wcovered-switch-default -Wno-noexcept-type -Wnon-virtual-dtor -Wdelete-non-virtual-dtor -Wsuggest-override -Wstring-conversion -fdiagnostics-color -Wno-deprecated-declarations -Wno-unknown-pragmas -Wno-strict-aliasing -Wno-deprecated-register -Wno-vla-extension -O3  -isysroot /Applications/Xcode.app/Contents/Developer/Platforms/MacOSX.platform/Developer/SDKs/MacOSX10.15.sdk -Wl,-search_paths_first -Wl,-headerpad_max_install_names -Wl,-dead_strip tools/lldb/unittests/tools/lldb-server/tests/CMakeFiles/LLDBServerTests.dir/LLGSTest.cpp.o tools/lldb/unittests/tools/lldb-server/tests/CMakeFiles/LLDBServerTests.dir/MessageObjects.cpp.o tools/lldb/unittests/tools/lldb-server/tests/CMakeFiles/LLDBServerTests.dir/TestBase.cpp.o tools/lldb/unittests/tools/lldb-server/tests/CMakeFiles/LLDBServerTests.dir/TestClient.cpp.o tools/lldb/unittests/tools/lldb-server/tests/CMakeFiles/LLDBServerTests.dir/ThreadIdsInJstopinfoTest.cpp.o  -o tools/lldb/unittests/tools/lldb-server/tests/LLDBServerTests  lib/libLLVMSupport.a  lib/libLLVMSupport.a  lib/libgtest_main.a  lib/libgtest.a  lib/liblldbHost.a  lib/liblldbCore.a  lib/liblldbInterpreter.a  lib/liblldbTarget.a  lib/liblldbPluginPlatformLinux.a  lib/liblldbPluginProcessGDBRemote.a  lib/libLLVMTestingSupport.a  lib/liblldbPluginPlatformMacOSX.a  lib/liblldbPluginPlatformPOSIX.a  lib/liblldbPluginPlatformMacOSXObjCXX.a  lib/liblldbCore.a  lib/liblldbInterpreter.a  lib/liblldbTarget.a  lib/liblldbBreakpoint.a  lib/liblldbDataFormatters.a  lib/liblldbExpression.a  lib/liblldbSymbol.a  lib/liblldbPluginCPlusPlusLanguage.a  lib/liblldbPluginObjCLanguage.a  lib/liblldbCommands.a  lib/liblldbPluginExpressionParserClang.a  lib/liblldbPluginProcessUtility.a  lib/liblldbPluginObjectFileJIT.a  lib/liblldbPluginClangCommon.a  lib/liblldbPluginCPPRuntime.a  lib/liblldbPluginTypeSystemClang.a  lib/liblldbPluginAppleObjCRuntime.a  lib/liblldbPluginObjCRuntime.a  lib/liblldbPluginRenderScriptRuntime.a  lib/liblldbPluginSymbolFileDWARF.a  lib/liblldbPluginSymbolFilePDB.a  lib/liblldbPluginSymbolFileNativePDB.a  lib/liblldbCore.a  lib/liblldbInterpreter.a  lib/liblldbTarget.a  lib/liblldbBreakpoint.a  lib/liblldbDataFormatters.a  lib/liblldbExpression.a  lib/liblldbSymbol.a  lib/liblldbPluginCPlusPlusLanguage.a  lib/liblldbPluginObjCLanguage.a  lib/liblldbCommands.a  lib/liblldbPluginExpressionParserClang.a  lib/liblldbPluginProcessUtility.a  lib/liblldbPluginObjectFileJIT.a  lib/liblldbPluginClangCommon.a  lib/liblldbPluginCPPRuntime.a  lib/liblldbPluginTypeSystemClang.a  lib/liblldbPluginAppleObjCRuntime.a  lib/liblldbPluginObjCRuntime.a  lib/liblldbPluginRenderScriptRuntime.a  lib/liblldbPluginSymbolFileDWARF.a  lib/liblldbPluginSymbolFilePDB.a  lib/liblldbPluginSymbolFileNativePDB.a  lib/liblldbCore.a  lib/liblldbInterpreter.a  lib/liblldbTarget.a  lib/liblldbBreakpoint.a  lib/liblldbDataFormatters.a  lib/liblldbExpression.a  lib/liblldbSymbol.a  lib/liblldbPluginCPlusPlusLanguage.a  lib/liblldbPluginObjCLanguage.a  lib/liblldbCommands.a  lib/liblldbPluginExpressionParserClang.a  lib/liblldbPluginProcessUtility.a  lib/liblldbPluginObjectFileJIT.a  lib/liblldbPluginClangCommon.a  lib/liblldbPluginCPPRuntime.a  lib/liblldbPluginTypeSystemClang.a  lib/liblldbPluginAppleObjCRuntime.a  lib/liblldbPluginObjCRuntime.a  lib/liblldbPluginRenderScriptRuntime.a  lib/liblldbPluginSymbolFileDWARF.a  lib/liblldbPluginSymbolFilePDB.a  lib/liblldbPluginSymbolFileNativePDB.a  lib/liblldbCore.a  lib/liblldbInterpreter.a  lib/liblldbTarget.a  lib/liblldbBreakpoint.a  lib/liblldbDataFormatters.a  lib/liblldbExpression.a  lib/liblldbSymbol.a  lib/liblldbPluginCPlusPlusLanguage.a  lib/liblldbPluginObjCLanguage.a  lib/liblldbCommands.a  lib/liblldbPluginExpressionParserClang.a  lib/liblldbPluginProcessUtility.a  lib/liblldbPluginObjectFileJIT.a  lib/liblldbPluginClangCommon.a  lib/liblldbPluginCPPRuntime.a  lib/liblldbPluginTypeSystemClang.a  lib/liblldbPluginAppleObjCRuntime.a  lib/liblldbPluginObjCRuntime.a  lib/liblldbPluginRenderScriptRuntime.a  lib/liblldbPluginSymbolFileDWARF.a  lib/liblldbPluginSymbolFilePDB.a  lib/liblldbPluginSymbolFileNativePDB.a  lib/liblldbCore.a  lib/liblldbInterpreter.a  lib/liblldbTarget.a  lib/liblldbBreakpoint.a  lib/liblldbDataFormatters.a  lib/liblldbExpression.a  lib/liblldbSymbol.a  lib/liblldbPluginCPlusPlusLanguage.a  lib/liblldbPluginObjCLanguage.a  lib/liblldbCommands.a  lib/liblldbPluginExpressionParserClang.a  lib/liblldbPluginProcessUtility.a  lib/liblldbPluginObjectFileJIT.a  lib/liblldbPluginClangCommon.a  lib/liblldbPluginCPPRuntime.a  lib/liblldbPluginTypeSystemClang.a  lib/liblldbPluginAppleObjCRuntime.a  lib/liblldbPluginObjCRuntime.a  lib/liblldbPluginRenderScriptRuntime.a  lib/liblldbPluginSymbolFileDWARF.a  lib/liblldbPluginSymbolFilePDB.a  lib/liblldbPluginSymbolFileNativePDB.a  /usr/lib/libform.dylib  /usr/lib/libpanel.dylib  lib/liblldbBase.a  lib/libLLVMMCJIT.a  lib/libLLVMExecutionEngine.a  lib/libLLVMRuntimeDyld.a  lib/libclangCodeGen.a  lib/libLLVMCoverage.a  lib/libLLVMLTO.a  lib/libLLVMExtensions.a  lib/libLLVMCodeGen.a  lib/libLLVMPasses.a  lib/libLLVMCoroutines.a  lib/libLLVMipo.a  lib/libLLVMBitWriter.a  lib/libLLVMInstrumentation.a  lib/libLLVMLinker.a  lib/libLLVMVectorize.a  lib/libLLVMScalarOpts.a  lib/libLLVMAggressiveInstCombine.a  lib/libLLVMInstCombine.a  lib/libLLVMObjCARCOpts.a  lib/libLLVMHelloNew.a  lib/libclangRewriteFrontend.a  lib/libclangRewrite.a  lib/libclangFrontend.a  lib/libclangDriver.a  lib/libLLVMOption.a  lib/libclangParse.a  lib/libclangSerialization.a  lib/libclangSema.a  lib/libclangEdit.a  lib/libclangAnalysis.a  lib/libclangASTMatchers.a  lib/libLLVMTarget.a  lib/libLLVMIRReader.a  lib/libLLVMAsmParser.a  lib/liblldbHost.a  /usr/lib/libxml2.dylib  /usr/lib/libedit.dylib  /usr/local/lib/liblzma.dylib  /usr/lib/libedit.dylib  /usr/local/lib/liblzma.dylib  lib/liblldbHostMacOSXObjCXX.a  lib/libLLVMDebugInfoDWARF.a  lib/liblldbUtility.a  -framework  Foundation  -framework  CoreFoundation  -framework  CoreServices  -framework  Security  lib/libclangAST.a  lib/libLLVMFrontendOpenMP.a  lib/libLLVMTransformUtils.a  lib/libLLVMAnalysis.a  lib/libLLVMProfileData.a  lib/libclangLex.a  lib/libclangBasic.a  lib/libLLVMDebugInfoPDB.a  lib/libLLVMObject.a  lib/libLLVMBitReader.a  lib/libLLVMCore.a  lib/libLLVMRemarks.a  lib/libLLVMBitstreamReader.a  lib/libLLVMMCParser.a  lib/libLLVMMC.a  lib/libLLVMTextAPI.a  lib/libLLVMBinaryFormat.a  lib/libLLVMDebugInfoCodeView.a  lib/libLLVMDebugInfoMSF.a  -lcompression  lib/libgtest.a  lib/libLLVMSupport.a  -lm  /usr/lib/libz.dylib  /usr/lib/libcurses.dylib  lib/libLLVMDemangle.a  -lpthread && cd /Users/buildslave/jenkins/workspace/lldb-cmake-reproducers/lldb-build/tools/lldb/unittests/tools/lldb-server/tests && /usr/local/Cellar/cmake/3.17.2/bin/cmake -E make_directory /Users/buildslave/jenkins/workspace/lldb-cmake-reproducers/lldb-build/tools/lldb/unittests/tools/lldb-server/tests/./Inputs
[181/183] cd /Users/buildslave/jenkins/workspace/lldb-cmake-reproducers/lldb-build/tools/lldb/test && /usr/local/Frameworks/Python.framework/Versions/3.7/bin/python3.7 /Users/buildslave/jenkins/workspace/lldb-cmake-reproducers/lldb-build/./bin/llvm-lit -v --time-tests --shuffle --xunit-xml-output=/Users/buildslave/jenkins/workspace/lldb-cmake-reproducers/test/results.xml -v --param lldb-run-with-repro=capture /Users/buildslave/jenkins/workspace/lldb-cmake-reproducers/lldb-build/tools/lldb/test/API /Users/buildslave/jenkins/workspace/lldb-cmake-reproducers/lldb-build/tools/lldb/test/Shell
Deleting module cache at /Users/buildslave/jenkins/workspace/lldb-cmake-reproducers/lldb-build/lldb-test-build.noindex/module-cache-lldb/lldb-api.
Deleting module cache at /Users/buildslave/jenkins/workspace/lldb-cmake-reproducers/lldb-build/lldb-test-build.noindex/module-cache-clang/lldb-api.
-- Testing: 1236 tests, 16 workers --
llvm-lit: /Users/buildslave/jenkins/workspace/lldb-cmake-reproducers/llvm-project/lldb/test/API/lit.cfg.py:142: note: Running API tests in capture mode.
llvm-lit: /Users/buildslave/jenkins/workspace/lldb-cmake-reproducers/llvm-project/lldb/test/Shell/lit.cfg.py:52: note: Running Shell tests in capture mode.
llvm-lit: /Users/buildslave/jenkins/workspace/lldb-cmake-reproducers/llvm-project/lldb/test/Shell/helper/toolchain.py:117: note: using SDKROOT: '/Applications/Xcode.app/Contents/Developer/Platforms/MacOSX.platform/Developer/SDKs/MacOSX.sdk'
llvm-lit: /Users/buildslave/jenkins/workspace/lldb-cmake-reproducers/lldb-build/bin/../../llvm-project/llvm/utils/lit/lit/llvm/config.py:379: note: using clang: /Users/buildslave/jenkins/workspace/lldb-cmake-reproducers/lldb-build/bin/clang
llvm-lit: /Users/buildslave/jenkins/workspace/lldb-cmake-reproducers/lldb-build/bin/../../llvm-project/llvm/utils/lit/lit/llvm/config.py:379: note: using ld.lld: /Users/buildslave/jenkins/workspace/lldb-cmake-reproducers/lldb-build/bin/ld.lld
llvm-lit: /Users/buildslave/jenkins/workspace/lldb-cmake-reproducers/lldb-build/bin/../../llvm-project/llvm/utils/lit/lit/llvm/config.py:379: note: using lld-link: /Users/buildslave/jenkins/workspace/lldb-cmake-reproducers/lldb-build/bin/lld-link
llvm-lit: /Users/buildslave/jenkins/workspace/lldb-cmake-reproducers/lldb-build/bin/../../llvm-project/llvm/utils/lit/lit/llvm/config.py:379: note: using ld64.lld: /Users/buildslave/jenkins/workspace/lldb-cmake-reproducers/lldb-build/bin/ld64.lld
llvm-lit: /Users/buildslave/jenkins/workspace/lldb-cmake-reproducers/lldb-build/bin/../../llvm-project/llvm/utils/lit/lit/llvm/config.py:379: note: using wasm-ld: /Users/buildslave/jenkins/workspace/lldb-cmake-reproducers/lldb-build/bin/wasm-ld
PASS: lldb-shell :: SymbolFile/DWARF/inline-function-address.ll (1 of 1236)
PASS: lldb-shell :: SymbolFile/DWARF/debug-types-signature-loop.s (2 of 1236)
PASS: lldb-shell :: ObjectFile/PECOFF/sections-names.yaml (3 of 1236)
UNSUPPORTED: lldb-shell :: Quit/TestQuitExitCode-30.test (4 of 1236)
PASS: lldb-shell :: SymbolFile/DWARF/dwp-separate-debug-file.cpp (5 of 1236)
PASS: lldb-shell :: Minidump/memory-region.yaml (6 of 1236)
UNSUPPORTED: lldb-api :: commands/process/launch/TestProcessLaunch.py (7 of 1236)
PASS: lldb-api :: functionalities/postmortem/elf-core/gcore/TestGCore.py (8 of 1236)
UNSUPPORTED: lldb-api :: benchmarks/expression/TestExpressionCmd.py (9 of 1236)
UNSUPPORTED: lldb-api :: functionalities/thread/concurrent_events/TestConcurrentManySignals.py (10 of 1236)
UNSUPPORTED: lldb-api :: functionalities/data-formatter/data-formatter-stl/libstdcpp/smart_ptr/TestDataFormatterStdSmartPtr.py (11 of 1236)
PASS: lldb-shell :: Unwind/eh-frame-dwarf-unwind.test (12 of 1236)
FAIL: lldb-api :: commands/target/stop-hooks/TestStopHookScripted.py (13 of 1236)
******************** TEST 'lldb-api :: commands/target/stop-hooks/TestStopHookScripted.py' FAILED ********************
Script:
--
/usr/local/Frameworks/Python.framework/Versions/3.7/bin/python3.7 /Users/buildslave/jenkins/workspace/lldb-cmake-reproducers/llvm-project/lldb/test/API/dotest.py -s /Users/buildslave/jenkins/workspace/lldb-cmake-reproducers/lldb-build/lldb-test-traces -S nm -u CXXFLAGS -u CFLAGS --codesign-identity lldb_codesign --server /Users/buildslave/jenkins/workspace/lldb-cmake-reproducers/lldb-build/./bin/debugserver --arch x86_64 --build-dir /Users/buildslave/jenkins/workspace/lldb-cmake-reproducers/lldb-build/lldb-test-build.noindex -s=/Users/buildslave/jenkins/workspace/lldb-cmake-reproducers/test/logs -t --env TERM=vt100 --env LLVM_LIBS_DIR=/Users/buildslave/jenkins/workspace/lldb-cmake-reproducers/lldb-build/./lib --arch x86_64 --build-dir /Users/buildslave/jenkins/workspace/lldb-cmake-reproducers/lldb-build/lldb-test-build.noindex --lldb-module-cache-dir /Users/buildslave/jenkins/workspace/lldb-cmake-reproducers/lldb-build/lldb-test-build.noindex/module-cache-lldb/lldb-api --clang-module-cache-dir /Users/buildslave/jenkins/workspace/lldb-cmake-reproducers/lldb-build/lldb-test-build.noindex/module-cache-clang/lldb-api --executable /Users/buildslave/jenkins/workspace/lldb-cmake-reproducers/lldb-build/./bin/lldb --compiler /Users/buildslave/jenkins/workspace/lldb-cmake-reproducers/lldb-build/./bin/clang --dsymutil /Users/buildslave/jenkins/workspace/lldb-cmake-reproducers/lldb-build/./bin/dsymutil --filecheck /Users/buildslave/jenkins/workspace/lldb-cmake-reproducers/lldb-build/./bin/FileCheck --yaml2obj /Users/buildslave/jenkins/workspace/lldb-cmake-reproducers/lldb-build/./bin/yaml2obj --lldb-libs-dir /Users/buildslave/jenkins/workspace/lldb-cmake-reproducers/lldb-build/./lib --skip-category=lldb-vscode --skip-category=std-module /Users/buildslave/jenkins/workspace/lldb-cmake-reproducers/llvm-project/lldb/test/API/commands/target/stop-hooks -p TestStopHookScripted.py --capture-path /Users/buildslave/jenkins/workspace/lldb-cmake-reproducers/lldb-build/lldb-test-build.noindex/reproducers/TestStopHookScripted.py
--
Exit Code: 1

Hide Details

Command Output (stdout): -- lldb version 12.0.99 clang revision 63c58c2b934525c9863e624cf39ec542dd84ca78 llvm revision 63c58c2b934525c9863e624cf39ec542dd84ca78 libstdcxx tests will not be run because: Don't know how to build with libstdcxx on macosx Skipping following debug info categories: ['dwo'] Running command: target stop-hook add -P stop_hook.stop_handler -k increment -v 5 -k return_false -v 1 -n step_out_of_me I have stopped 1 times.

Hide Details

-- Command Output (stderr): --

Hide Details

Session logs for test failures/errors/unexpected successes will go into directory '/Users/buildslave/jenkins/workspace/lldb-cmake-reproducers/test/logs' Change dir to: /Users/buildslave/jenkins/workspace/lldb-cmake-reproducers/llvm-project/lldb/test/API/commands/target/stop-hooks runCmd: settings clear -all output:

Hide Details

runCmd: settings set symbols.enable-external-lookup false output:

Hide Details

runCmd: settings set target.inherit-tcc true output:

Hide Details

runCmd: settings set target.auto-apply-fixits false output:

Hide Details

runCmd: settings set plugin.process.gdb-remote.packet-timeout 60 output:

Hide Details

runCmd: settings set symbols.clang-modules-cache-path "/Users/buildslave/jenkins/workspace/lldb-cmake-reproducers/lldb-build/lldb-test-build.noindex/module-cache-lldb/lldb-api" output:

Hide Details

runCmd: settings set use-color false output:

Hide Details

runCmd: setting set target.prefer-dynamic-value no-dynamic-values output:

Hide Details

FAIL: LLDB (/Users/buildslave/jenkins/workspace/lldb-cmake-reproducers/lldb-build/bin/clang-x86_64) :: test_stop_hooks_scripted_return_false (TestStopHookScripted.TestStopHooks) <bound method SBProcess.Kill of <lldb.SBProcess; proxy of <Swig Object of type 'lldb::SBProcess *' at 0x1095be210> >>: success

Hide Details

Restore dir to: /Users/buildslave/jenkins/workspace/lldb-cmake-reproducers/lldb-build/tools/lldb/test ====================================================================== FAIL: test_stop_hooks_scripted_return_false (TestStopHookScripted.TestStopHooks) Test that the returning False from a stop hook works ---------------------------------------------------------------------- Traceback (most recent call last): File "/Users/buildslave/jenkins/workspace/lldb-cmake-reproducers/llvm-project/lldb/test/API/commands/target/stop-hooks/TestStopHookScripted.py", line 54, in test_stop_hooks_scripted_return_false self.do_test_auto_continue(True) File "/Users/buildslave/jenkins/workspace/lldb-cmake-reproducers/llvm-project/lldb/test/API/commands/target/stop-hooks/TestStopHookScripted.py", line 91, in do_test_auto_continue self.assertEqual("main", func_name, "Didn't stop at the expected function.") AssertionError: 'main' != 'step_out_of_me' - main+ step_out_of_me : Didn't stop at the expected function. Config=x86_64-/Users/buildslave/jenkins/workspace/lldb-cmake-reproducers/lldb-build/bin/clang ---------------------------------------------------------------------- Ran 1 test in 2.299s

Hide Details

RESULT: FAILED (0 passes, 1 failures, 0 errors, 0 skipped, 0 expected failures, 0 unexpected successes)

Hide Details

--

Hide Details

******************** PASS: lldb-api :: functionalities/thread/concurrent_events/TestConcurrentSignalWatch.py (14 of 1236) PASS: lldb-shell :: SymbolFile/DWARF/DW_OP_piece-smaller-than-struct.s (15 of 1236) UNSUPPORTED: lldb-shell :: SymbolFile/PDB/function-level-linking.test (16 of 1236) PASS: lldb-api :: lang/c/complex/TestComplexC99.py (17 of 1236) PASS: lldb-api :: functionalities/data-formatter/data-formatter-enum-format/TestDataFormatterEnumFormat.py (18 of 1236) UNSUPPORTED: lldb-shell :: Unwind/eh-frame-augment-noop.test (19 of 1236) PASS: lldb-api :: commands/frame/diagnose/bad-reference/TestBadReference.py (20 of 1236) UNSUPPORTED: lldb-shell :: Register/x86-64-read.test (21 of 1236) PASS: lldb-shell :: ObjectFile/ELF/PT_LOAD.yaml (22 of 1236) PASS: lldb-api :: functionalities/breakpoint/address_breakpoints/TestAddressBreakpoints.py (23 of 1236) PASS: lldb-api :: tools/lldb-server/TestGdbRemoteRegisterState.py (24 of 1236) PASS: lldb-shell :: Commands/command-stop-hook-output.test (25 of 1236) PASS: lldb-api :: functionalities/thread/concurrent_events/TestConcurrentBreakpointsDelayedBreakpointOneWatchpoint.py (26 of 1236) PASS: lldb-api :: functionalities/thread/concurrent_events/TestConcurrentTwoBreakpointsOneDelaySignal.py (27 of 1236) PASS: lldb-api :: functionalities/breakpoint/breakpoint_language/TestBreakpointLanguage.py (28 of 1236) PASS: lldb-api :: commands/expression/argument_passing_restrictions/TestArgumentPassingRestrictions.py (29 of 1236) PASS: lldb-api :: python_api/hello_world/TestHelloWorld.py (30 of 1236) PASS: lldb-api :: commands/disassemble/basic/TestFrameDisassemble.py (31 of 1236) PASS: lldb-api :: lang/cpp/subst_template_type_param/TestSubstTemplateTypeParam.py (32 of 1236) UNSUPPORTED: lldb-shell :: Reproducer/TestProcessList.test (33 of 1236) PASS: lldb-api :: iohandler/resize/TestIOHandlerResize.py (34 of 1236) PASS: lldb-api :: functionalities/object-file/TestImageListMultiArchitecture.py (35 of 1236) PASS: lldb-shell :: ObjectFile/ELF/PT_LOAD-overlap-PT_TLS.yaml (36 of 1236) UNSUPPORTED: lldb-shell :: Register/x86-zmm-write.test (37 of 1236) PASS: lldb-api :: macosx/add-dsym/TestAddDsymMidExecutionCommand.py (38 of 1236) UNSUPPORTED: lldb-shell :: SymbolFile/NativePDB/source-list.cpp (39 of 1236) PASS: lldb-api :: functionalities/wrong_commands/TestWrongCommands.py (40 of 1236) PASS: lldb-shell :: SymbolFile/DWARF/dwarf5_locations.s (41 of 1236) PASS: lldb-api :: python_api/interpreter/TestCommandInterpreterAPI.py (42 of 1236) UNSUPPORTED: lldb-api :: functionalities/data-formatter/data-formatter-stl/libstdcpp/vbool/TestDataFormatterStdVBool.py (43 of 1236) UNSUPPORTED: lldb-api :: functionalities/breakpoint/hardware_breakpoints/write_memory_with_hw_breakpoint/TestWriteMemoryWithHWBreakpoint.py (44 of 1236) PASS: lldb-api :: functionalities/stats_api/TestStatisticsAPI.py (45 of 1236) PASS: lldb-shell :: Minidump/fb-dump.test (46 of 1236) PASS: lldb-api :: functionalities/thread/concurrent_events/TestConcurrentNWatchNBreak.py (47 of 1236) PASS: lldb-api :: functionalities/breakpoint/scripted_bkpt/TestScriptedResolver.py (48 of 1236) PASS: lldb-api :: commands/frame/var/TestFrameVar.py (49 of 1236) UNSUPPORTED: lldb-api :: commands/expression/import-std-module/unique_ptr-dbg-info-content/TestUniquePtrDbgInfoContent.py (50 of 1236) PASS: lldb-shell :: SymbolFile/DWARF/debug_loc-aslr.s (51 of 1236) PASS: lldb-shell :: Settings/TestFrameFormatMangling.test (52 of 1236) PASS: lldb-api :: functionalities/gdb_remote_client/TestQemuAArch64TargetXml.py (53 of 1236) UNSUPPORTED: lldb-api :: functionalities/gdb_remote_client/TestIOSSimulator.py (54 of 1236) PASS: lldb-api :: functionalities/breakpoint/breakpoint_ids/TestBreakpointIDs.py (55 of 1236) UNSUPPORTED: lldb-shell :: SymbolFile/NativePDB/nested-types.cpp (56 of 1236) PASS: lldb-api :: functionalities/plugins/command_plugin/TestPluginCommands.py (57 of 1236) PASS: lldb-shell :: Commands/command-source.test (58 of 1236) PASS: lldb-api :: commands/expression/persistent_variables/TestPersistentVariables.py (59 of 1236) PASS: lldb-api :: commands/frame/diagnose/array/TestArray.py (60 of 1236) PASS: lldb-api :: lang/cpp/operators/TestCppOperators.py (61 of 1236) PASS: lldb-shell :: SymbolFile/Breakpad/line-table-missing-file.test (62 of 1236) PASS: lldb-api :: functionalities/gdb_remote_client/TestRegDefinitionInParts.py (63 of 1236) PASS: lldb-api :: commands/expression/weak_symbols/TestWeakSymbols.py (64 of 1236) PASS: lldb-api :: functionalities/data-formatter/data-formatter-stl/libcxx/map/TestDataFormatterLibccMap.py (65 of 1236) UNSUPPORTED: lldb-api :: commands/expression/import-std-module/conflicts/TestStdModuleWithConflicts.py (66 of 1236) UNSUPPORTED: lldb-shell :: SymbolFile/PDB/calling-conventions.test (67 of 1236) PASS: lldb-api :: lang/objc/ivar-IMP/TestObjCiVarIMP.py (68 of 1236) PASS: lldb-api :: lang/c/global_variables/TestGlobalVariables.py (69 of 1236) PASS: lldb-api :: lang/cpp/multiple-inheritance/TestCppMultipleInheritance.py (70 of 1236) PASS: lldb-api :: functionalities/data-formatter/data-formatter-stl/libcxx/optional/TestDataFormatterLibcxxOptional.py (71 of 1236) PASS: lldb-api :: commands/expression/char/TestExprsChar.py (72 of 1236) PASS: lldb-api :: functionalities/thread/concurrent_events/TestConcurrentSignalNWatchNBreak.py (73 of 1236) PASS: lldb-shell :: SymbolFile/DWARF/dwo-type-in-main-file.s (74 of 1236) PASS: lldb-shell :: Driver/TestSingleQuote.test (75 of 1236) PASS: lldb-api :: commands/expression/invalid-args/TestInvalidArgsExpression.py (76 of 1236) PASS: lldb-api :: functionalities/load_unload/TestLoadUnload.py (77 of 1236) PASS: lldb-shell :: Commands/command-script-import.test (78 of 1236) PASS: lldb-api :: commands/gui/basic/TestGuiBasic.py (79 of 1236) PASS: lldb-api :: python_api/objc_type/TestObjCType.py (80 of 1236) PASS: lldb-shell :: SymbolFile/DWARF/deterministic-build.cpp (81 of 1236) UNSUPPORTED: lldb-api :: functionalities/data-formatter/data-formatter-stl/libstdcpp/list/TestDataFormatterStdList.py (82 of 1236) PASS: lldb-api :: commands/expression/dont_allow_jit/TestAllowJIT.py (83 of 1236) UNSUPPORTED: lldb-shell :: Expr/TestIRMemoryMapWindows.test (84 of 1236) UNSUPPORTED: lldb-api :: commands/settings/quoting/TestQuoting.py (85 of 1236) UNSUPPORTED: lldb-api :: commands/expression/import-std-module/forward_list-dbg-info-content/TestDbgInfoContentForwardListFromStdModule.py (86 of 1236) UNSUPPORTED: lldb-shell :: Reproducer/TestPythonImport.test (87 of 1236) UNSUPPORTED: lldb-api :: lang/cpp/static_members/TestCPPStaticMembers.py (88 of 1236) PASS: lldb-api :: python_api/debugger/TestDebuggerAPI.py (89 of 1236) UNSUPPORTED: lldb-shell :: SymbolFile/NativePDB/ast-methods.cpp (90 of 1236) PASS: lldb-api :: lang/objc/modules-inline-functions/TestModulesInlineFunctions.py (91 of 1236) PASS: lldb-api :: lang/objc/modules-compile-error/TestModulesCompileError.py (92 of 1236) PASS: lldb-shell :: ObjectFile/ELF/many-sections.s (93 of 1236) PASS: lldb-shell :: SymbolFile/DWARF/static_scope.s (94 of 1236) PASS: lldb-api :: commands/expression/formatters/TestFormatters.py (95 of 1236) PASS: lldb-api :: functionalities/thread/concurrent_events/TestConcurrentSignalWatchBreak.py (96 of 1236) PASS: lldb-api :: macosx/duplicate-archive-members/TestDuplicateMembers.py (97 of 1236) PASS: lldb-api :: functionalities/data-formatter/data-formatter-named-summaries/TestDataFormatterNamedSummaries.py (98 of 1236) UNSUPPORTED: lldb-shell :: Reproducer/Modules/TestModuleCXX.test (99 of 1236) PASS: lldb-api :: functionalities/breakpoint/auto_continue/TestBreakpointAutoContinue.py (100 of 1236) PASS: lldb-api :: lang/cpp/constructors/TestCppConstructors.py (101 of 1236) UNSUPPORTED: lldb-api :: commands/trace/TestTraceLoad.py (102 of 1236) UNSUPPORTED: lldb-shell :: Reproducer/TestWorkingDir.test (103 of 1236) UNSUPPORTED: lldb-shell :: Unwind/unwind-plan-dwarf-dump.test (104 of 1236) PASS: lldb-api :: functionalities/tail_call_frames/cross_object/TestCrossObjectTailCalls.py (105 of 1236) PASS: lldb-api :: python_api/lldbutil/iter/TestLLDBIterator.py (106 of 1236) PASS: lldb-api :: python_api/watchpoint/TestWatchpointIter.py (107 of 1236) UNSUPPORTED: lldb-api :: functionalities/signal/handle-segv/TestHandleSegv.py (108 of 1236) PASS: lldb-api :: lang/c/unions/TestUnionMembers.py (109 of 1236) PASS: lldb-api :: functionalities/thread/ignore_suspended/TestIgnoreSuspendedThread.py (110 of 1236) PASS: lldb-shell :: ObjectFile/wasm/stripped-debug-sections.yaml (111 of 1236) PASS: lldb-api :: commands/platform/basic/TestPlatformCommand.py (112 of 1236) PASS: lldb-api :: lang/objc/bitfield_ivars/TestBitfieldIvars.py (113 of 1236) UNSUPPORTED: lldb-api :: macosx/simulator/TestSimulatorPlatform.py (114 of 1236) UNSUPPORTED: lldb-shell :: BuildScript/toolchain-msvc.test (115 of 1236) UNSUPPORTED: lldb-api :: tools/lldb-server/registers-target-xml-reading/TestGdbRemoteTargetXmlPacket.py (116 of 1236) PASS: lldb-api :: functionalities/data-formatter/data-formatter-objc/TestDataFormatterObjCNSContainer.py (117 of 1236) UNSUPPORTED: lldb-api :: commands/process/attach/attach_denied/TestAttachDenied.py (118 of 1236) PASS: lldb-shell :: Breakpoint/split-dwarf-5-addrbase.test (119 of 1236) UNSUPPORTED: lldb-shell :: Driver/LocalLLDBInit.test (120 of 1236) PASS: lldb-shell :: BuildScript/modes.test (121 of 1236) UNSUPPORTED: lldb-api :: tools/lldb-vscode/module/TestVSCode_module.py (122 of 1236) UNSUPPORTED: lldb-api :: commands/trace/TestTraceSchema.py (123 of 1236) PASS: lldb-shell :: SymbolFile/DWARF/find-basic-type.cpp (124 of 1236) PASS: lldb-api :: lang/objc/objc-dyn-sbtype/TestObjCDynamicSBType.py (125 of 1236) UNSUPPORTED: lldb-shell :: Watchpoint/netbsd-nouserdbregs.test (126 of 1236) PASS: lldb-shell :: ObjectFile/ELF/duplicate-section.yaml (127 of 1236) PASS: lldb-api :: functionalities/breakpoint/breakpoint_hit_count/TestBreakpointHitCount.py (128 of 1236) PASS: lldb-api :: commands/watchpoints/watchpoint_disable/TestWatchpointDisable.py (129 of 1236) PASS: lldb-api :: lang/c/step_over_no_deadlock/TestStepOverDoesntBlock.py (130 of 1236) PASS: lldb-api :: functionalities/postmortem/elf-core/thread_crash/TestLinuxCoreThreads.py (131 of 1236) UNSUPPORTED: lldb-api :: android/platform/TestDefaultCacheLineSize.py (132 of 1236) PASS: lldb-api :: commands/expression/static-initializers/TestStaticInitializers.py (133 of 1236) PASS: lldb-api :: functionalities/gdb_remote_client/TestGDBRemoteLoad.py (134 of 1236) UNSUPPORTED: lldb-api :: functionalities/inferior-changed/TestInferiorChanged.py (135 of 1236) PASS: lldb-api :: macosx/thread_suspend/TestInternalThreadSuspension.py (136 of 1236) UNSUPPORTED: lldb-shell :: SymbolFile/NativePDB/globals-bss.cpp (137 of 1236) PASS: lldb-shell :: SymbolFile/DWARF/debug_ranges-missing-section.s (138 of 1236) UNSUPPORTED: lldb-api :: macosx/function-starts/TestFunctionStarts.py (139 of 1236) UNSUPPORTED: lldb-api :: commands/process/attach-resume/TestAttachResume.py (140 of 1236) PASS: lldb-api :: commands/target/stop-hook/disable/TestTargetStopHookDisable.py (141 of 1236) UNSUPPORTED: lldb-shell :: SymbolFile/target-symbols-add-unwind.test (142 of 1236) PASS: lldb-api :: lang/cpp/call-function/TestCallCPPFunction.py (143 of 1236) PASS: lldb-api :: commands/target/stop-hook/enable/TestTargetStopHookEnable.py (144 of 1236) PASS: lldb-shell :: SymbolFile/DWARF/debug-types-line-tables.s (145 of 1236) PASS: lldb-api :: commands/command/invalid-args/TestInvalidArgsCommand.py (146 of 1236) PASS: lldb-shell :: SymbolFile/DWARF/dwarf5-index-is-used.cpp (147 of 1236) PASS: lldb-api :: lang/objc/objc-checker/TestObjCCheckers.py (148 of 1236) PASS: lldb-shell :: SymbolFile/DWARF/split-dwarf-inlining.cpp (149 of 1236) PASS: lldb-shell :: SymbolFile/DWARF/apple-index-is-used.cpp (150 of 1236) PASS: lldb-api :: lang/objc/ptr_refs/TestPtrRefsObjC.py (151 of 1236) UNSUPPORTED: lldb-shell :: Reproducer/TestReuseDirectory.test (152 of 1236) PASS: lldb-api :: lang/cpp/inlines/TestInlines.py (153 of 1236) UNSUPPORTED: lldb-shell :: Reproducer/Functionalities/TestImageList.test (154 of 1236) UNSUPPORTED: lldb-api :: commands/register/register/intel_xtended_registers/mpx_offset_intersection/TestMPXOffsetIntersection.py (155 of 1236) PASS: lldb-api :: functionalities/data-formatter/ptr_ref_typedef/TestPtrRef2Typedef.py (156 of 1236) PASS: lldb-api :: commands/expression/deleting-implicit-copy-constructor/TestDeletingImplicitCopyConstructor.py (157 of 1236) UNSUPPORTED: lldb-shell :: ScriptInterpreter/Python/crashlog.test (158 of 1236) PASS: lldb-api :: functionalities/thread/concurrent_events/TestConcurrentManyCrash.py (159 of 1236) UNSUPPORTED: lldb-shell :: Register/x86-64-zmm-write.test (160 of 1236) UNSUPPORTED: lldb-shell :: ScriptInterpreter/Lua/watchpoint_callback.test (161 of 1236) UNSUPPORTED: lldb-shell :: Reproducer/TestDebugSymbols.test (162 of 1236) PASS: lldb-api :: commands/expression/class_template_specialization_empty_pack/TestClassTemplateSpecializationParametersHandling.py (163 of 1236) UNSUPPORTED: lldb-api :: tools/lldb-server/TestGdbRemote_vContThreads.py (164 of 1236) UNSUPPORTED: lldb-shell :: Reproducer/TestMultipleTargets.test (165 of 1236) UNSUPPORTED: lldb-api :: python_api/disassemble-raw-data/TestDisassemble_VST1_64.py (166 of 1236) UNSUPPORTED: lldb-api :: functionalities/thread/multi_break/TestMultipleBreakpoints.py (167 of 1236) PASS: lldb-api :: lang/cpp/namespace/TestNamespace.py (168 of 1236) PASS: lldb-api :: commands/expression/radar_9673664/TestExprHelpExamples.py (169 of 1236) UNSUPPORTED: lldb-api :: tools/lldb-vscode/disconnect/TestVSCode_disconnect.py (170 of 1236) PASS: lldb-shell :: Commands/CommandScriptImmediateOutput/CommandScriptImmediateOutputFile.test (171 of 1236) UNSUPPORTED: lldb-shell :: SymbolFile/PDB/compilands.test (172 of 1236) PASS: lldb-api :: commands/expression/cast_int_to_anonymous_enum/TestCastIntToAnonymousEnum.py (173 of 1236) UNSUPPORTED: lldb-shell :: SymbolFile/NativePDB/bitfields.cpp (174 of 1236) PASS: lldb-api :: functionalities/data-formatter/data-formatter-objc/TestDataFormatterObjCNSData.py (175 of 1236) PASS: lldb-api :: functionalities/memory-region/TestMemoryRegion.py (176 of 1236) PASS: lldb-shell :: SymbolFile/DWARF/DW_AT_const_value-bitfields.s (177 of 1236) UNSUPPORTED: lldb-api :: commands/register/register/intel_xtended_registers/mpx_bound_violation/TestBoundViolation.py (178 of 1236) PASS: lldb-api :: commands/expression/completion-in-lambda-and-unnamed-class/TestCompletionInLambdaAndUnnamedClass.py (179 of 1236) UNSUPPORTED: lldb-api :: functionalities/data-formatter/data-formatter-stl/libstdcpp/vector/TestDataFormatterStdVector.py (180 of 1236) PASS: lldb-api :: functionalities/thread/concurrent_events/TestConcurrentWatchpointDelayWatchpointOneBreakpoint.py (181 of 1236) PASS: lldb-api :: lang/cpp/namespace_conflicts/TestNamespaceConflicts.py (182 of 1236) UNSUPPORTED: lldb-api :: commands/expression/unwind_expression/TestUnwindExpression.py (183 of 1236) PASS: lldb-api :: functionalities/data-formatter/data-formatter-disabling/TestDataFormatterDisabling.py (184 of 1236) UNSUPPORTED: lldb-shell :: Reproducer/Functionalities/TestStepping.test (185 of 1236) PASS: lldb-api :: types/TestRecursiveTypes.py (186 of 1236) UNSUPPORTED: lldb-api :: functionalities/data-formatter/data-formatter-stl/libstdcpp/map/TestDataFormatterStdMap.py (187 of 1236) UNSUPPORTED: lldb-shell :: Reproducer/TestLuaImport.test (188 of 1236) PASS: lldb-api :: functionalities/data-formatter/ostypeformatting/TestFormattersOsType.py (189 of 1236) PASS: lldb-api :: functionalities/recursion/TestValueObjectRecursion.py (190 of 1236) UNSUPPORTED: lldb-api :: functionalities/breakpoint/hardware_breakpoints/hardware_breakpoint_on_multiple_threads/TestHWBreakMultiThread.py (191 of 1236) PASS: lldb-api :: commands/watchpoints/watchpoint_commands/command/TestWatchpointCommandLLDB.py (192 of 1236) UNSUPPORTED: lldb-shell :: ExecControl/StopHook/stop-hook-threads.test (193 of 1236) PASS: lldb-api :: lang/objc/foundation/TestObjCMethodsNSError.py (194 of 1236) PASS: lldb-api :: lang/c/stepping/TestStepAndBreakpoints.py (195 of 1236) PASS: lldb-api :: types/TestLongTypes.py (196 of 1236) UNSUPPORTED: lldb-api :: commands/register/register/intel_xtended_registers/TestMPXRegisters.py (197 of 1236) UNSUPPORTED: lldb-api :: functionalities/darwin_log/basic/TestDarwinLogBasic.py (198 of 1236) UNSUPPORTED: lldb-shell :: Quit/TestQuitExitCode30.test (199 of 1236) UNSUPPORTED: lldb-api :: commands/expression/import-std-module/unique_ptr/TestUniquePtrFromStdModule.py (200 of 1236) PASS: lldb-api :: lang/cpp/extern_c/TestExternCSymbols.py (201 of 1236) PASS: lldb-shell :: Driver/TestProcessAttach.test (202 of 1236) PASS: lldb-api :: functionalities/data-formatter/data-formatter-objc/nsindexpath/TestDataFormatterNSIndexPath.py (203 of 1236) PASS: lldb-api :: lang/objc/single-entry-dictionary/TestObjCSingleEntryDictionary.py (204 of 1236) PASS: lldb-shell :: ObjectFile/wasm/basic.yaml (205 of 1236) PASS: lldb-shell :: Commands/command-disassemble.s (206 of 1236) PASS: lldb-api :: lang/cpp/static_methods/TestCPPStaticMethods.py (207 of 1236) UNSUPPORTED: lldb-shell :: Register/arm-gp-read.test (208 of 1236) UNSUPPORTED: lldb-shell :: Register/x86-ymm-read.test (209 of 1236) PASS: lldb-shell :: SymbolFile/DWARF/dwp.s (210 of 1236) PASS: lldb-api :: functionalities/data-formatter/data-formatter-caching/TestDataFormatterCaching.py (211 of 1236) PASS: lldb-shell :: ExecControl/StopHook/stop-hook.test (212 of 1236) UNSUPPORTED: lldb-api :: functionalities/darwin_log/source/debug/TestDarwinLogSourceDebug.py (213 of 1236) UNSUPPORTED: lldb-shell :: Register/x86-gp-write.test (214 of 1236) PASS: lldb-api :: commands/expression/diagnostics/TestExprDiagnostics.py (215 of 1236) UNSUPPORTED: lldb-api :: commands/watchpoints/multi_watchpoint_slots/TestWatchpointMultipleSlots.py (216 of 1236) PASS: lldb-api :: commands/expression/test/TestExprs.py (217 of 1236) UNSUPPORTED: lldb-api :: functionalities/darwin_log/filter/exact_match/category/TestDarwinLogFilterMatchCategory.py (218 of 1236) PASS: lldb-shell :: Minidump/Windows/Sigsegv/sigsegv.test (219 of 1236) PASS: lldb-api :: functionalities/testid/TestTestId.py (220 of 1236) PASS: lldb-api :: functionalities/return-value/TestReturnValue.py (221 of 1236) PASS: lldb-api :: tools/lldb-server/register-reading/TestGdbRemoteGPacket.py (222 of 1236) UNSUPPORTED: lldb-api :: functionalities/darwin_log/filter/regex/activity-chain/TestDarwinLogFilterRegexActivityChain.py (223 of 1236) UNSUPPORTED: lldb-api :: functionalities/step_scripted/TestStepScripted.py (224 of 1236) UNSUPPORTED: lldb-shell :: ScriptInterpreter/Lua/independent_state.test (225 of 1236) PASS: lldb-shell :: ObjectFile/ELF/PT_LOAD-overlap-section.yaml (226 of 1236) UNSUPPORTED: lldb-api :: functionalities/darwin_log/filter/exact_match/activity-chain/TestDarwinLogFilterMatchActivityChain.py (227 of 1236) PASS: lldb-api :: functionalities/data-formatter/data-formatter-smart-array/TestDataFormatterSmartArray.py (228 of 1236) PASS: lldb-shell :: Expr/TestIRMemoryMap.test (229 of 1236) UNSUPPORTED: lldb-shell :: Process/Windows/exception_access_violation.cpp (230 of 1236) UNSUPPORTED: lldb-shell :: ScriptInterpreter/Lua/breakpoint_callback.test (231 of 1236) PASS: lldb-api :: commands/gui/breakpoints/TestGuiBreakpoints.py (232 of 1236) PASS: lldb-shell :: ObjectFile/ELF/gnu-debuglink.yaml (233 of 1236) UNSUPPORTED: lldb-api :: commands/expression/expr-in-syscall/TestExpressionInSyscall.py (234 of 1236) PASS: lldb-api :: functionalities/tsan/cpp_global_location/TestTsanCPPGlobalLocation.py (235 of 1236) PASS: lldb-shell :: SymbolFile/Breakpad/stack-cfi-parsing.test (236 of 1236) PASS: lldb-shell :: ObjectFile/wasm/unified-debug-sections.yaml (237 of 1236) UNSUPPORTED: lldb-shell :: Process/TestEnvironment.test (238 of 1236) PASS: lldb-api :: python_api/value/empty_class/TestValueAPIEmptyClass.py (239 of 1236) PASS: lldb-api :: lang/objc/objc-new-syntax/TestObjCNewSyntaxArray.py (240 of 1236) PASS: lldb-api :: functionalities/type_completion/TestTypeCompletion.py (241 of 1236) PASS: lldb-api :: commands/expression/inline-namespace/TestInlineNamespace.py (242 of 1236) UNSUPPORTED: lldb-shell :: Reproducer/Functionalities/TestDataFormatter.test (243 of 1236) PASS: lldb-api :: commands/target/create-no-such-arch/TestNoSuchArch.py (244 of 1236) PASS: lldb-api :: lang/c/function_types/TestFunctionTypes.py (245 of 1236) PASS: lldb-api :: functionalities/postmortem/wow64_minidump/TestWow64MiniDump.py (246 of 1236) PASS: lldb-api :: python_api/sbenvironment/TestSBEnvironment.py (247 of 1236) PASS: lldb-shell :: SymbolFile/DWARF/find-basic-variable.cpp (248 of 1236) PASS: lldb-api :: functionalities/asan/TestReportData.py (249 of 1236) UNSUPPORTED: lldb-api :: linux/add-symbols/TestTargetSymbolsAddCommand.py (250 of 1236) PASS: lldb-shell :: BuildScript/script-args.test (251 of 1236) UNSUPPORTED: lldb-shell :: SymbolFile/PDB/class-layout.test (252 of 1236) UNSUPPORTED: lldb-api :: lang/objc/modules/TestObjCModules.py (253 of 1236) PASS: lldb-api :: functionalities/thread/crash_during_step/TestCrashDuringStep.py (254 of 1236) PASS: lldb-api :: functionalities/signal/handle-abrt/TestHandleAbort.py (255 of 1236) PASS: lldb-api :: commands/apropos/basic/TestApropos.py (256 of 1236) PASS: lldb-api :: functionalities/data-formatter/varscript_formatting/TestDataFormatterVarScriptFormatting.py (257 of 1236) PASS: lldb-api :: commands/watchpoints/watchpoint_commands/command/TestWatchpointCommandPython.py (258 of 1236) UNSUPPORTED: lldb-api :: benchmarks/startup/TestStartupDelays.py (259 of 1236) PASS: lldb-shell :: SymbolFile/DWARF/find-variable-file.cpp (260 of 1236) PASS: lldb-shell :: ObjectFile/Breakpad/sections.test (261 of 1236) PASS: lldb-api :: functionalities/data-formatter/data-formatter-categories/TestDataFormatterCategories.py (262 of 1236) PASS: lldb-shell :: Breakpoint/case-sensitive.test (263 of 1236) PASS: lldb-api :: functionalities/data-formatter/data-formatter-objc/TestDataFormatterObjCCF.py (264 of 1236) PASS: lldb-api :: commands/expression/radar_9531204/TestPrintfAfterUp.py (265 of 1236) PASS: lldb-api :: commands/session/history/TestSessionHistory.py (266 of 1236) PASS: lldb-shell :: SymbolFile/DWARF/debug-line-basic.s (267 of 1236) PASS: lldb-api :: lang/cpp/wchar_t/TestCxxWCharT.py (268 of 1236) PASS: lldb-api :: commands/disassemble/basic/TestDisassembleBreakpoint.py (269 of 1236) PASS: lldb-api :: functionalities/data-formatter/data-formatter-objc/nsstring/TestDataFormatterNSString.py (270 of 1236) PASS: lldb-api :: python_api/class_members/TestSBTypeClassMembers.py (271 of 1236) UNSUPPORTED: lldb-shell :: SymbolFile/PDB/type-quals.test (272 of 1236) PASS: lldb-api :: commands/expression/po_verbosity/TestPoVerbosity.py (273 of 1236) UNSUPPORTED: lldb-api :: macosx/macCatalystAppMacOSFramework/TestMacCatalystAppWithMacOSFramework.py (274 of 1236) PASS: lldb-shell :: Unwind/trap_frame_sym_ctx.test (275 of 1236) PASS: lldb-shell :: Minidump/Windows/arm-fp-unwind.test (276 of 1236) UNSUPPORTED: lldb-api :: commands/expression/import-std-module/shared_ptr-dbg-info-content/TestSharedPtrDbgInfoContentFromStdModule.py (277 of 1236) PASS: lldb-shell :: SymbolFile/Breakpad/symtab.test (278 of 1236) PASS: lldb-shell :: SymbolFile/DWARF/find-qualified-variable.cpp (279 of 1236) PASS: lldb-api :: functionalities/breakpoint/dummy_target_breakpoints/TestBreakpointsWithNoTargets.py (280 of 1236) UNSUPPORTED: lldb-api :: commands/expression/import-std-module/forward_list/TestForwardListFromStdModule.py (281 of 1236) PASS: lldb-api :: functionalities/data-formatter/data-formatter-synth/TestDataFormatterSynth.py (282 of 1236) PASS: lldb-api :: commands/target/select/TestTargetSelect.py (283 of 1236) PASS: lldb-api :: lang/cpp/modules-import/TestCXXModulesImport.py (284 of 1236) PASS: lldb-api :: functionalities/target-new-solib-notifications/TestModuleLoadedNotifys.py (285 of 1236) PASS: lldb-api :: functionalities/mtc/simple/TestMTCSimple.py (286 of 1236) PASS: lldb-api :: functionalities/gdb_remote_client/TestGDBRemoteDiskFileCompletion.py (287 of 1236) PASS: lldb-api :: functionalities/data-formatter/hexcaps/TestDataFormatterHexCaps.py (288 of 1236) PASS: lldb-api :: functionalities/var_path/TestVarPath.py (289 of 1236) UNSUPPORTED: lldb-api :: commands/watchpoints/variable_out_of_scope/TestWatchedVarHitWhenInScope.py (290 of 1236) UNSUPPORTED: lldb-shell :: Reproducer/TestHomeDir.test (291 of 1236) UNSUPPORTED: lldb-api :: linux/mix-dwo-and-regular-objects/TestMixedDwarfBinary.py (292 of 1236) PASS: lldb-api :: functionalities/limit-debug-info/TestLimitDebugInfo.py (293 of 1236) PASS: lldb-api :: commands/command/script/import/TestImport.py (294 of 1236) PASS: lldb-api :: lang/objc/variadic_methods/TestVariadicMethods.py (295 of 1236) PASS: lldb-api :: iohandler/unicode/TestUnicode.py (296 of 1236) PASS: lldb-shell :: SymbolFile/DWARF/array-sizes.s (297 of 1236) UNSUPPORTED: lldb-api :: tools/lldb-server/libraries-svr4/TestGdbRemoteLibrariesSvr4Support.py (298 of 1236) PASS: lldb-api :: lang/cpp/function_refs/TestFunctionRefs.py (299 of 1236) UNSUPPORTED: lldb-shell :: Reproducer/TestGDBRemoteRepro.test (300 of 1236) UNSUPPORTED: lldb-shell :: Driver/TestPositionalArgs.test (301 of 1236) UNSUPPORTED: lldb-shell :: SymbolFile/DWARF/debug-types-expressions.test (302 of 1236) UNSUPPORTED: lldb-shell :: Reproducer/TestDiscard.test (303 of 1236) PASS: lldb-api :: lang/objc/real-definition/TestRealDefinition.py (304 of 1236) UNSUPPORTED: lldb-shell :: ScriptInterpreter/Lua/bindings.test (305 of 1236) PASS: lldb-shell :: SymbolFile/DWARF/debug_aranges-empty-section.s (306 of 1236) UNSUPPORTED: lldb-api :: functionalities/data-formatter/data-formatter-stl/libstdcpp/iterator/TestDataFormatterStdIterator.py (307 of 1236) PASS: lldb-api :: functionalities/gdb_remote_client/TestThreadSelectionBug.py (308 of 1236) PASS: lldb-api :: commands/expression/call-function/TestCallStopAndContinue.py (309 of 1236) PASS: lldb-api :: functionalities/thread/state_after_expression/TestStateAfterExpression.py (310 of 1236) PASS: lldb-api :: functionalities/inferior-crashing/recursive-inferior/TestRecursiveInferior.py (311 of 1236) PASS: lldb-api :: commands/gui/viewlarge/TestGuiViewLarge.py (312 of 1236) UNSUPPORTED: lldb-shell :: Register/x86-ymm-write.test (313 of 1236) PASS: lldb-shell :: VSCode/TestOptions.test (314 of 1236) PASS: lldb-api :: functionalities/data-formatter/data-formatter-cpp/TestDataFormatterCpp.py (315 of 1236) UNSUPPORTED: lldb-api :: tools/lldb-server/TestAppleSimulatorOSType.py (316 of 1236) PASS: lldb-shell :: SymbolFile/DWARF/gnu-style-compression.cpp (317 of 1236) PASS: lldb-api :: commands/watchpoints/hello_watchpoint/TestMyFirstWatchpoint.py (318 of 1236) PASS: lldb-api :: sanity/TestSettingSkipping.py (319 of 1236) PASS: lldb-api :: python_api/breakpoint/TestBreakpointAPI.py (320 of 1236) PASS: lldb-api :: terminal/TestSTTYBeforeAndAfter.py (321 of 1236) PASS: lldb-shell :: ObjectFile/ELF/section-types.yaml (322 of 1236) PASS: lldb-api :: lang/cpp/class_types/TestClassTypesDisassembly.py (323 of 1236) UNSUPPORTED: lldb-api :: commands/expression/completion-crash-invalid-iterator/TestInvalidIteratorCompletionCrash.py (324 of 1236) PASS: lldb-shell :: SymbolFile/DWARF/dwarf5-atomic.s (325 of 1236) PASS: lldb-api :: lang/objc/rdar-11355592/TestRdar11355592.py (326 of 1236) PASS: lldb-api :: functionalities/breakpoint/breakpoint_by_file_colon_line/TestBreakpointByFileColonLine.py (327 of 1236) UNSUPPORTED: lldb-shell :: Reproducer/TestDump.test (328 of 1236) UNSUPPORTED: lldb-api :: commands/expression/import-std-module/vector/TestVectorFromStdModule.py (329 of 1236) PASS: lldb-api :: commands/watchpoints/multiple_hits/TestMultipleHits.py (330 of 1236) PASS: lldb-api :: functionalities/multidebugger_commands/TestMultipleDebuggersCommands.py (331 of 1236) UNSUPPORTED: lldb-shell :: SymbolFile/PDB/function-nested-block.test (332 of 1236) UNSUPPORTED: lldb-shell :: Register/aarch64-fp-read.test (333 of 1236) PASS: lldb-api :: types/TestShortType.py (334 of 1236) PASS: lldb-shell :: SymbolFile/DWARF/debug_loclists-dwo.s (335 of 1236) PASS: lldb-api :: functionalities/breakpoint/breakpoint_command/TestRegexpBreakCommand.py (336 of 1236) PASS: lldb-api :: functionalities/gdb_remote_client/TestArmRegisterDefinition.py (337 of 1236) PASS: lldb-shell :: SymbolFile/DWARF/debug-names-compressed.cpp (338 of 1236) PASS: lldb-shell :: Unwind/thread-step-out-ret-addr-check.test (339 of 1236) PASS: lldb-api :: functionalities/data-formatter/data-formatter-ptr-to-array/TestPtrToArrayFormatting.py (340 of 1236) UNSUPPORTED: lldb-api :: functionalities/breakpoint/breakpoint_set_restart/TestBreakpointSetRestart.py (341 of 1236) UNSUPPORTED: lldb-shell :: Register/x86-64-ymm16-write.test (342 of 1236) PASS: lldb-api :: lang/cpp/namespace_definitions/TestNamespaceDefinitions.py (343 of 1236) UNSUPPORTED: lldb-api :: commands/expression/import-std-module/sysroot/TestStdModuleSysroot.py (344 of 1236) PASS: lldb-api :: functionalities/data-formatter/data-formatter-skip-summary/TestDataFormatterSkipSummary.py (345 of 1236) UNSUPPORTED: lldb-api :: python_api/interpreter/TestRunCommandInterpreterAPI.py (346 of 1236) UNSUPPORTED: lldb-api :: commands/expression/import-std-module/vector-bool/TestVectorBoolFromStdModule.py (347 of 1236) UNSUPPORTED: lldb-api :: tools/lldb-vscode/breakpoint-events/TestVSCode_breakpointEvents.py (348 of 1236) PASS: lldb-api :: lang/c/blocks/TestBlocks.py (349 of 1236) PASS: lldb-api :: commands/expression/radar_8638051/Test8638051.py (350 of 1236) UNSUPPORTED: lldb-api :: commands/expression/macros/TestMacros.py (351 of 1236) PASS: lldb-shell :: Quit/TestQuitExitCodeTooManyArgs.test (352 of 1236) PASS: lldb-shell :: SymbolFile/DWARF/debug-types-dwarf5.s (353 of 1236) PASS: lldb-api :: functionalities/unwind/zeroth_frame/TestZerothFrame.py (354 of 1236) PASS: lldb-api :: functionalities/data-formatter/synthupdate/TestSyntheticFilterRecompute.py (355 of 1236) PASS: lldb-shell :: SymbolFile/DWARF/DW_AT_data_bit_offset-DW_OP_stack_value.s (356 of 1236) PASS: lldb-shell :: Breakpoint/implicit_const_form_support.test (357 of 1236) PASS: lldb-api :: commands/watchpoints/multiple_threads/TestWatchpointMultipleThreads.py (358 of 1236) PASS: lldb-api :: lang/cpp/function-qualifiers/TestCppFunctionQualifiers.py (359 of 1236) PASS: lldb-api :: commands/frame/diagnose/complicated-expression/TestComplicatedExpression.py (360 of 1236) PASS: lldb-api :: functionalities/unwind/noreturn/module-end/TestNoReturnModuleEnd.py (361 of 1236) PASS: lldb-api :: commands/register/register/register_command/TestRegisters.py (362 of 1236) UNSUPPORTED: lldb-api :: functionalities/darwin_log/source/info/TestDarwinLogSourceInfo.py (363 of 1236) XFAIL: lldb-shell :: Unwind/prefer-debug-over-eh-frame.test (364 of 1236) PASS: lldb-api :: commands/watchpoints/watchpoint_size/TestWatchpointSizes.py (365 of 1236) PASS: lldb-api :: functionalities/memory/find/TestMemoryFind.py (366 of 1236) UNSUPPORTED: lldb-shell :: ScriptInterpreter/Lua/lua-python.test (367 of 1236) PASS: lldb-shell :: ObjectFile/ELF/section-addresses.yaml (368 of 1236) PASS: lldb-api :: lang/objc/objc-stepping/TestObjCStepping.py (369 of 1236) PASS: lldb-api :: lang/objc/foundation/TestObjCMethods2.py (370 of 1236) PASS: lldb-api :: lang/cpp/unicode-literals/TestUnicodeLiterals.py (371 of 1236) PASS: lldb-shell :: SymbolFile/DWARF/find-basic-function.cpp (372 of 1236) PASS: lldb-api :: commands/expression/calculator_mode/TestCalculatorMode.py (373 of 1236) PASS: lldb-api :: python_api/watchpoint/TestSetWatchpoint.py (374 of 1236) PASS: lldb-api :: functionalities/breakpoint/serialize/TestBreakpointSerialization.py (375 of 1236) UNSUPPORTED: lldb-api :: benchmarks/expression/TestRepeatedExprs.py (376 of 1236) PASS: lldb-shell :: Process/Optimization.test (377 of 1236) PASS: lldb-api :: lang/cpp/accelerator-table/TestCPPAccelerator.py (378 of 1236) PASS: lldb-api :: functionalities/breakpoint/breakpoint_conditions/TestBreakpointConditions.py (379 of 1236) PASS: lldb-api :: functionalities/postmortem/minidump-new/TestMiniDumpNew.py (380 of 1236) PASS: lldb-api :: functionalities/thread/concurrent_events/TestConcurrentBreakpointOneDelayBreakpointThreads.py (381 of 1236) PASS: lldb-api :: commands/watchpoints/watchpoint_on_vectors/TestValueOfVectorVariable.py (382 of 1236) PASS: lldb-shell :: SymbolFile/DWARF/dwarf5-debug_line.s (383 of 1236) PASS: lldb-api :: python_api/sbtype_typeclass/TestSBTypeTypeClass.py (384 of 1236) PASS: lldb-api :: lang/cpp/rvalue-references/TestRvalueReferences.py (385 of 1236) PASS: lldb-shell :: SymbolFile/DWARF/DW_AT_low_pc-addrx.s (386 of 1236) UNSUPPORTED: lldb-api :: functionalities/thread/create_during_step/TestCreateDuringStep.py (387 of 1236) PASS: lldb-api :: commands/command/script_alias/TestCommandScriptAlias.py (388 of 1236) PASS: lldb-api :: functionalities/thread/concurrent_events/TestConcurrentTwoBreakpointThreads.py (389 of 1236) UNSUPPORTED: lldb-shell :: SymbolFile/DWARF/debug_loc.s (390 of 1236) XFAIL: lldb-shell :: Register/x86-64-ymm-write.test (391 of 1236) PASS: lldb-api :: lang/objc/radar-9691614/TestObjCMethodReturningBOOL.py (392 of 1236) PASS: lldb-shell :: Register/x86-64-gp-read.test (393 of 1236) UNSUPPORTED: lldb-shell :: Driver/TestHelp.test (394 of 1236) PASS: lldb-api :: api/listeners/TestListener.py (395 of 1236) PASS: lldb-shell :: SymbolFile/Breakpad/unwind-via-stack-cfi.test (396 of 1236) PASS: lldb-shell :: SymbolFile/DWARF/DW_AT_declaration-with-children.s (397 of 1236) UNSUPPORTED: lldb-shell :: Reproducer/TestDSYM.test (398 of 1236) UNSUPPORTED: lldb-api :: functionalities/gdb_remote_client/TestWriteMemory.py (399 of 1236) PASS: lldb-api :: functionalities/dynamic_value_child_count/TestDynamicValueChildCount.py (400 of 1236) PASS: lldb-api :: functionalities/data-formatter/data-formatter-stl/libcxx/list/loop/TestDataFormatterLibcxxListLoop.py (401 of 1236) PASS: lldb-api :: functionalities/data-formatter/synthcapping/TestSyntheticCapping.py (402 of 1236) PASS: lldb-api :: lang/cpp/operator-overload/TestOperatorOverload.py (403 of 1236) UNSUPPORTED: lldb-shell :: SymbolFile/NativePDB/globals-fundamental.cpp (404 of 1236) PASS: lldb-api :: functionalities/data-formatter/cstring-utf8-summary/TestCstringUnicode.py (405 of 1236) PASS: lldb-api :: functionalities/data-formatter/data-formatter-stl/libcxx/multiset/TestDataFormatterLibcxxMultiSet.py (406 of 1236) PASS: lldb-api :: python_api/watchpoint/watchlocation/TestTargetWatchAddress.py (407 of 1236) UNSUPPORTED: lldb-api :: functionalities/data-formatter/data-formatter-stl/libstdcpp/string/TestDataFormatterStdString.py (408 of 1236) PASS: lldb-api :: commands/target/stop-hooks/TestStopHooks.py (409 of 1236) UNSUPPORTED: lldb-shell :: Register/x86-64-gp-write.test (410 of 1236) PASS: lldb-api :: commands/frame/diagnose/dereference-this/TestDiagnoseDereferenceThis.py (411 of 1236) PASS: lldb-shell :: ObjectFile/ELF/base-address.yaml (412 of 1236) PASS: lldb-api :: commands/log/basic/TestLogging.py (413 of 1236) PASS: lldb-api :: functionalities/breakpoint/objc/TestObjCBreakpoints.py (414 of 1236) PASS: lldb-shell :: Quit/TestQuitExitCodeHex0.test (415 of 1236) PASS: lldb-shell :: SymbolFile/DWARF/DW_TAG_variable-invalid_location.s (416 of 1236) PASS: lldb-api :: commands/expression/completion/TestExprCompletion.py (417 of 1236) PASS: lldb-api :: lang/cpp/char8_t/TestCxxChar8_t.py (418 of 1236) UNSUPPORTED: lldb-api :: python_api/process/io/TestProcessIO.py (419 of 1236) PASS: lldb-shell :: Driver/TestConvenienceVariables.test (420 of 1236) UNSUPPORTED: lldb-shell :: SymbolFile/PDB/vbases.test (421 of 1236) PASS: lldb-api :: lang/cpp/std-function-step-into-callable/TestStdFunctionStepIntoCallable.py (422 of 1236) UNSUPPORTED: lldb-shell :: Reproducer/TestRelativePath.test (423 of 1236) UNSUPPORTED: lldb-api :: functionalities/load_using_paths/TestLoadUsingPaths.py (424 of 1236) PASS: lldb-api :: types/TestIntegerType.py (425 of 1236) PASS: lldb-shell :: SymbolFile/DWARF/limit-debug-info.s (426 of 1236) PASS: lldb-api :: commands/add-dsym/uuid/TestAddDsymCommand.py (427 of 1236) UNSUPPORTED: lldb-api :: benchmarks/frame_variable/TestFrameVariableResponse.py (428 of 1236) UNSUPPORTED: lldb-api :: tools/lldb-server/signal-filtering/TestGdbRemote_QPassSignals.py (429 of 1236) PASS: lldb-api :: functionalities/data-formatter/data-formatter-objc/TestDataFormatterObjCNSBundle.py (430 of 1236) PASS: lldb-api :: python_api/lldbutil/TestSwigVersion.py (431 of 1236) PASS: lldb-api :: functionalities/gdb_remote_client/TestqOffsets.py (432 of 1236) UNSUPPORTED: lldb-api :: tools/lldb-server/TestGdbRemoteCompletion.py (433 of 1236) PASS: lldb-api :: functionalities/postmortem/mach-core/TestMachCore.py (434 of 1236) PASS: lldb-api :: lang/cpp/template/TestTemplateArgs.py (435 of 1236) UNSUPPORTED: lldb-api :: macosx/thread-names/TestInterruptThreadNames.py (436 of 1236) PASS: lldb-api :: functionalities/data-formatter/data-formatter-stl/libcxx/atomic/TestLibCxxAtomic.py (437 of 1236) PASS: lldb-shell :: SymbolFile/DWARF/debug_line-relative_path.s (438 of 1236) PASS: lldb-shell :: Commands/command-backtrace.test (439 of 1236) PASS: lldb-shell :: ObjectFile/ELF/section-types-edgecases.yaml (440 of 1236) UNSUPPORTED: lldb-shell :: Breakpoint/case-insensitive.test (441 of 1236) PASS: lldb-shell :: Breakpoint/debug_rnglist_offset_pair.test (442 of 1236) PASS: lldb-api :: functionalities/tail_call_frames/inlining_and_tail_calls/TestInliningAndTailCalls.py (443 of 1236) UNSUPPORTED: lldb-api :: functionalities/deleted-executable/TestDeletedExecutable.py (444 of 1236) PASS: lldb-shell :: SymbolFile/DWARF/find-method.cpp (445 of 1236) PASS: lldb-api :: functionalities/data-formatter/parray/TestPrintArray.py (446 of 1236) PASS: lldb-api :: lang/cpp/nsimport/TestCppNsImport.py (447 of 1236) PASS: lldb-api :: functionalities/data-formatter/format-propagation/TestFormatPropagation.py (448 of 1236) PASS: lldb-api :: functionalities/breakpoint/breakpoint_callback_command_source/TestBreakpointCallbackCommandSource.py (449 of 1236) PASS: lldb-api :: lang/c/local_variables/TestLocalVariables.py (450 of 1236) PASS: lldb-shell :: SymbolFile/DWARF/DW_OP_piece-struct.s (451 of 1236) PASS: lldb-api :: lang/c/modules/TestCModules.py (452 of 1236) UNSUPPORTED: lldb-api :: functionalities/longjmp/TestLongjmp.py (453 of 1236) PASS: lldb-shell :: Quit/TestQuitExitCode0.test (454 of 1236) PASS: lldb-shell :: SymbolFile/Breakpad/line-table-mixed-path-styles.test (455 of 1236) PASS: lldb-api :: python_api/value_var_update/TestValueVarUpdate.py (456 of 1236) PASS: lldb-api :: tools/lldb-server/TestGdbRemoteSingleStep.py (457 of 1236) UNSUPPORTED: lldb-shell :: SymbolFile/NativePDB/break-by-line.cpp (458 of 1236) PASS: lldb-api :: functionalities/target_var/TestTargetVar.py (459 of 1236) PASS: lldb-api :: arm/emulation/TestEmulations.py (460 of 1236) PASS: lldb-api :: lang/objc/modules-non-objc-target/TestObjCModulesNonObjCTarget.py (461 of 1236) PASS: lldb-api :: functionalities/thread/concurrent_events/TestConcurrentTwoBreakpointsOneWatchpoint.py (462 of 1236) PASS: lldb-api :: lang/cpp/frame-var-anon-unions/TestFrameVariableAnonymousUnions.py (463 of 1236) PASS: lldb-api :: commands/frame/diagnose/dereference-argument/TestDiagnoseDereferenceArgument.py (464 of 1236) PASS: lldb-api :: commands/command/delete/TestCommandDelete.py (465 of 1236) PASS: lldb-api :: commands/expression/context-object/TestContextObject.py (466 of 1236) PASS: lldb-api :: commands/expression/ignore-artificial-constructors/TestIgnoreArtificialConstructors.py (467 of 1236) UNSUPPORTED: lldb-shell :: ScriptInterpreter/Lua/convenience_variables.test (468 of 1236) PASS: lldb-api :: lang/c/vla/TestVLA.py (469 of 1236) PASS: lldb-shell :: SymbolFile/DWARF/clang-ast-from-dwarf-unamed-and-anon-structs.cpp (470 of 1236) PASS: lldb-api :: functionalities/breakpoint/debugbreak/TestDebugBreak.py (471 of 1236) PASS: lldb-api :: lang/cpp/typeof/TestTypeOfDeclTypeExpr.py (472 of 1236) PASS: lldb-shell :: SymbolFile/DWARF/debug_ranges_and_rnglists.test (473 of 1236) PASS: lldb-api :: commands/expression/rdar44436068/Test128BitsInteger.py (474 of 1236) PASS: lldb-api :: python_api/process/TestProcessAPI.py (475 of 1236) UNSUPPORTED: lldb-api :: functionalities/darwin_log/filter/regex/activity/TestDarwinLogFilterRegexActivity.py (476 of 1236) UNSUPPORTED: lldb-api :: lang/objc/modules-update/TestClangModulesUpdate.py (477 of 1236) PASS: lldb-api :: types/TestFloatTypesExpr.py (478 of 1236) PASS: lldb-shell :: ObjectFile/ELF/basic-info.yaml (479 of 1236) UNSUPPORTED: lldb-shell :: SymbolFile/NativePDB/function-types-builtins.cpp (480 of 1236) PASS: lldb-api :: commands/command/source/TestCommandSource.py (481 of 1236) UNSUPPORTED: lldb-api :: functionalities/reproducers/attach/TestReproducerAttach.py (482 of 1236) UNSUPPORTED: lldb-api :: functionalities/darwin_log/filter/exact_match/subsystem/TestDarwinLogFilterMatchSubsystem.py (483 of 1236) UNSUPPORTED: lldb-shell :: SymbolFile/NativePDB/locate-pdb.cpp (484 of 1236) UNSUPPORTED: lldb-shell :: SymbolFile/NativePDB/function-types-calling-conv.cpp (485 of 1236) PASS: lldb-shell :: SymbolFile/DWARF/debug_ranges.s (486 of 1236) PASS: lldb-api :: functionalities/gdb_remote_client/TestGDBRemoteClient.py (487 of 1236) PASS: lldb-shell :: ScriptInterpreter/None/none.test (488 of 1236) PASS: lldb-api :: lang/objc/orderedset/TestOrderedSet.py (489 of 1236) PASS: lldb-api :: lang/objc/objc-new-syntax/TestObjCNewSyntaxDictionary.py (490 of 1236) PASS: lldb-api :: api/check_public_api_headers/TestPublicAPIHeaders.py (491 of 1236) PASS: lldb-api :: functionalities/thread/concurrent_events/TestConcurrentTwoBreakpointsOneSignal.py (492 of 1236) PASS: lldb-api :: lang/cpp/dynamic-value-same-basename/TestDynamicValueSameBase.py (493 of 1236) PASS: lldb-api :: lang/cpp/class_static/TestStaticVariables.py (494 of 1236) PASS: lldb-shell :: Breakpoint/single-file-split-dwarf.test (495 of 1236) PASS: lldb-api :: functionalities/memory/read/TestMemoryRead.py (496 of 1236) PASS: lldb-api :: python_api/exprpath_synthetic/TestExprPathSynthetic.py (497 of 1236) PASS: lldb-api :: lang/c/set_values/TestSetValues.py (498 of 1236) PASS: lldb-api :: functionalities/plugins/python_os_plugin/stepping_plugin_threads/TestOSPluginStepping.py (499 of 1236) XFAIL: lldb-shell :: SymbolFile/DWARF/find-type-in-function.cpp (500 of 1236) PASS: lldb-api :: functionalities/breakpoint/breakpoint_names/TestBreakpointNames.py (501 of 1236) PASS: lldb-api :: commands/expression/multiline-completion/TestMultilineCompletion.py (502 of 1236) UNSUPPORTED: lldb-shell :: SymbolFile/NativePDB/local-variables.cpp (503 of 1236) PASS: lldb-shell :: Settings/TestDisableColor.test (504 of 1236) PASS: lldb-api :: functionalities/value_md5_crash/TestValueMD5Crash.py (505 of 1236) PASS: lldb-api :: driver/batch_mode/TestBatchMode.py (506 of 1236) PASS: lldb-api :: commands/expression/regression-access-function-template-in-record/TestRegressionAccessFunctionTemplateInRecord.py (507 of 1236) PASS: lldb-api :: functionalities/dead-strip/TestDeadStrip.py (508 of 1236) PASS: lldb-api :: macosx/lc-note/kern-ver-str/TestKernVerStrLCNOTE.py (509 of 1236) PASS: lldb-api :: functionalities/non-overlapping-index-variable-i/TestIndexVariable.py (510 of 1236) PASS: lldb-api :: functionalities/abbreviation/TestAbbreviations.py (511 of 1236) PASS: lldb-api :: lang/cpp/unique-types/TestUniqueTypes.py (512 of 1236) PASS: lldb-api :: lang/c/strings/TestCStrings.py (513 of 1236) PASS: lldb-api :: commands/frame/select/TestFrameSelect.py (514 of 1236) PASS: lldb-api :: lang/objc/global_ptrs/TestGlobalObjects.py (515 of 1236) PASS: lldb-api :: tools/lldb-server/TestGdbRemoteThreadsInStopReply.py (516 of 1236) UNSUPPORTED: lldb-api :: lang/objc/rdar-12408181/TestRdar12408181.py (517 of 1236) PASS: lldb-shell :: Minidump/dump-all.test (518 of 1236) UNSUPPORTED: lldb-shell :: SymbolFile/PDB/typedefs.test (519 of 1236) PASS: lldb-api :: functionalities/data-formatter/frameformat_smallstruct/TestFrameFormatSmallStruct.py (520 of 1236) PASS: lldb-shell :: SymbolFile/DWARF/dir-separator-posix.s (521 of 1236) PASS: lldb-shell :: ObjectFile/PECOFF/section-types.yaml (522 of 1236) PASS: lldb-api :: functionalities/set-data/TestSetData.py (523 of 1236) PASS: lldb-api :: commands/breakpoint/set/func-regex/TestBreakpointRegexError.py (524 of 1236) PASS: lldb-api :: functionalities/data-formatter/data-formatter-stl/libcxx/unique_ptr/TestDataFormatterLibcxxUniquePtr.py (525 of 1236) PASS: lldb-api :: lang/c/struct_types/TestStructTypes.py (526 of 1236) PASS: lldb-api :: functionalities/ubsan/user-expression/TestUbsanUserExpression.py (527 of 1236) PASS: lldb-api :: lang/cpp/enum_types/TestCPP11EnumTypes.py (528 of 1236) UNSUPPORTED: lldb-shell :: Driver/TestRepl.test (529 of 1236) PASS: lldb-api :: functionalities/gdb_remote_client/TestRecognizeBreakpoint.py (530 of 1236) PASS: lldb-shell :: Recognizer/assert.test (531 of 1236) PASS: lldb-api :: lang/c/local_types/TestUseClosestType.py (532 of 1236) UNSUPPORTED: lldb-api :: tools/lldb-vscode/breakpoint/TestVSCode_setFunctionBreakpoints.py (533 of 1236) PASS: lldb-api :: commands/target/basic/TestTargetCommand.py (534 of 1236) UNSUPPORTED: lldb-shell :: SymbolFile/NativePDB/ast-functions.cpp (535 of 1236) PASS: lldb-api :: functionalities/pre_run_dylibs/TestPreRunDylibs.py (536 of 1236) PASS: lldb-api :: lang/cpp/member-and-local-vars-with-same-name/TestMembersAndLocalsWithSameName.py (537 of 1236) UNSUPPORTED: lldb-api :: functionalities/thread/break_after_join/TestBreakAfterJoin.py (538 of 1236) PASS: lldb-api :: functionalities/abbreviation/TestCommonShortSpellings.py (539 of 1236) UNSUPPORTED: lldb-api :: functionalities/process_save_core/TestProcessSaveCore.py (540 of 1236) PASS: lldb-api :: macosx/safe-to-func-call/TestSafeFuncCalls.py (541 of 1236) PASS: lldb-api :: lang/cpp/alignas_base_class/TestAlignAsBaseClass.py (542 of 1236) PASS: lldb-api :: commands/process/signal/TestProcessSignal.py (543 of 1236) PASS: lldb-api :: python_api/name_lookup/TestNameLookup.py (544 of 1236) PASS: lldb-api :: commands/expression/call-function/TestCallBuiltinFunction.py (545 of 1236) PASS: lldb-api :: lang/c/stepping/TestThreadStepping.py (546 of 1236) PASS: lldb-shell :: SymbolFile/DWARF/win-i386-line-table.s (547 of 1236) PASS: lldb-api :: functionalities/breakpoint/comp_dir_symlink/TestCompDirSymLink.py (548 of 1236) UNSUPPORTED: lldb-shell :: SymbolFile/NativePDB/global-classes.cpp (549 of 1236) PASS: lldb-api :: lang/c/record_decl_in_expr/TestRecordDeclInExpr.py (550 of 1236) PASS: lldb-api :: functionalities/float-display/TestFloatDisplay.py (551 of 1236) UNSUPPORTED: lldb-shell :: Reproducer/TestCrash.test (552 of 1236) PASS: lldb-api :: functionalities/thread/concurrent_events/TestConcurrentDelaySignalBreak.py (553 of 1236) PASS: lldb-shell :: ObjectFile/ELF/PT_LOAD-overlap-PT_INTERP.yaml (554 of 1236) UNSUPPORTED: lldb-api :: macosx/find-dsym/bundle-with-dot-in-filename/TestBundleWithDotInFilename.py (555 of 1236) PASS: lldb-api :: lang/cpp/template-specialization-type/TestTemplateSpecializationType.py (556 of 1236) PASS: lldb-api :: tools/lldb-server/commandline/TestStubSetSID.py (557 of 1236) PASS: lldb-api :: lang/objc/modules-hash-mismatch/TestClangModulesHashMismatch.py (558 of 1236) PASS: lldb-api :: lang/cpp/global_variables/TestCPPGlobalVariables.py (559 of 1236) PASS: lldb-shell :: SymbolFile/DWARF/debug_rnglists-dwo.s (560 of 1236) UNSUPPORTED: lldb-shell :: Driver/TestCore.test (561 of 1236) PASS: lldb-api :: tools/lldb-server/inferior-crash/TestGdbRemoteAbort.py (562 of 1236) PASS: lldb-api :: types/TestShortTypeExpr.py (563 of 1236) PASS: lldb-api :: functionalities/data-formatter/data-formatter-advanced/TestDataFormatterAdv.py (564 of 1236) PASS: lldb-api :: lang/c/const_variables/TestConstVariables.py (565 of 1236) PASS: lldb-api :: lang/cpp/trivial_abi/TestTrivialABI.py (566 of 1236) PASS: lldb-shell :: SymbolFile/DWARF/dwarf5-partial-index.cpp (567 of 1236) PASS: lldb-shell :: Host/TestCustomShell.test (568 of 1236) PASS: lldb-api :: commands/settings/use_source_cache/TestUseSourceCache.py (569 of 1236) PASS: lldb-api :: functionalities/conditional_break/TestConditionalBreak.py (570 of 1236) PASS: lldb-api :: commands/settings/TestSettings.py (571 of 1236) PASS: lldb-shell :: ObjectFile/ELF/aarch64-relocations.yaml (572 of 1236) UNSUPPORTED: lldb-api :: benchmarks/stepping/TestSteppingSpeed.py (573 of 1236) PASS: lldb-shell :: Minidump/Windows/broken-unwind.test (574 of 1236) PASS: lldb-api :: functionalities/thread/concurrent_events/TestConcurrentDelayedCrashWithBreakpointWatchpoint.py (575 of 1236) PASS: lldb-shell :: SymbolFile/DWARF/debug_loc_and_loclists.s (576 of 1236) UNSUPPORTED: lldb-api :: functionalities/darwin_log/filter/regex/category/TestDarwinLogFilterRegexCategory.py (577 of 1236) PASS: lldb-api :: python_api/module_section/TestModuleAndSection.py (578 of 1236) PASS: lldb-api :: functionalities/breakpoint/inlined_breakpoints/TestInlinedBreakpoints.py (579 of 1236) PASS: lldb-api :: functionalities/data-formatter/data-formatter-synthtype/TestDataFormatterSynthType.py (580 of 1236) PASS: lldb-shell :: Commands/command-regex-delete.test (581 of 1236) PASS: lldb-api :: commands/expression/namespace_local_var_same_name_cpp_and_c/TestNamespaceLocalVarSameNameCppAndC.py (582 of 1236) PASS: lldb-api :: functionalities/data-formatter/data-formatter-stl/libcxx/set/TestDataFormatterLibcxxSet.py (583 of 1236) PASS: lldb-api :: commands/frame/diagnose/inheritance/TestDiagnoseInheritance.py (584 of 1236) PASS: lldb-api :: commands/reproducer/invalid-args/TestInvalidArgsReproducer.py (585 of 1236) PASS: lldb-api :: python_api/thread/TestThreadAPI.py (586 of 1236) PASS: lldb-api :: functionalities/source-map/TestTargetSourceMap.py (587 of 1236) PASS: lldb-api :: commands/expression/codegen-crash-import-def-arraytype-element/TestImportDefinitionArrayType.py (588 of 1236) PASS: lldb-shell :: ObjectFile/ELF/compressed-sections.yaml (589 of 1236) PASS: lldb-api :: functionalities/data-formatter/data-formatter-python-synth/TestDataFormatterPythonSynth.py (590 of 1236) PASS: lldb-api :: lang/cpp/gmodules/TestWithModuleDebugging.py (591 of 1236) PASS: lldb-api :: functionalities/data-formatter/array_typedef/TestArrayTypedef.py (592 of 1236) PASS: lldb-api :: functionalities/inline-stepping/TestInlineStepping.py (593 of 1236) PASS: lldb-api :: functionalities/thread/concurrent_events/TestConcurrentWatchBreakDelay.py (594 of 1236) PASS: lldb-shell :: SymbolFile/DWARF/find-method-local-struct.cpp (595 of 1236) UNSUPPORTED: lldb-api :: tools/intel-features/intel-pt/test/TestIntelPTSimpleBinary.py (596 of 1236) PASS: lldb-api :: lang/cpp/lambdas/TestLambdas.py (597 of 1236) UNSUPPORTED: lldb-api :: functionalities/postmortem/minidump-new/TestMiniDumpUUID.py (598 of 1236) PASS: lldb-shell :: Settings/TestSettingsSet.test (599 of 1236) PASS: lldb-api :: functionalities/data-formatter/data-formatter-objc/TestDataFormatterObjCKVO.py (600 of 1236) UNSUPPORTED: lldb-shell :: SymbolFile/PDB/enums-layout.test (601 of 1236) PASS: lldb-api :: python_api/signals/TestSignalsAPI.py (602 of 1236) UNSUPPORTED: lldb-api :: lang/cpp/function-template-parameter-pack/TestFunctionTemplateParameterPack.py (603 of 1236) PASS: lldb-api :: functionalities/breakpoint/breakpoint_options/TestBreakpointOptions.py (604 of 1236) PASS: lldb-api :: commands/expression/persistent_ptr_update/TestPersistentPtrUpdate.py (605 of 1236) PASS: lldb-api :: lang/objc/blocks/TestObjCIvarsInBlocks.py (606 of 1236) UNSUPPORTED: lldb-shell :: Reproducer/TestVerify.test (607 of 1236) PASS: lldb-shell :: SymbolFile/DWARF/DW_TAG_basic_type_DW_ATE_UTF_nonC.ll (608 of 1236) PASS: lldb-api :: functionalities/data-formatter/data-formatter-stl/libstdcpp/unique_ptr/invalid/TestDataFormatterInvalidStdUniquePtr.py (609 of 1236) PASS: lldb-api :: lang/cpp/llvm-style/TestLLVMStyle.py (610 of 1236) UNSUPPORTED: lldb-shell :: SymbolFile/NativePDB/ast-types.cpp (611 of 1236) PASS: lldb-api :: functionalities/gdb_remote_client/TestJLink6Armv7RegisterDefinition.py (612 of 1236) UNSUPPORTED: lldb-shell :: Register/x86-64-zmm-read.test (613 of 1236) PASS: lldb-api :: commands/target/stop-hook/delete/TestTargetStopHookDelete.py (614 of 1236) PASS: lldb-shell :: SymbolFile/DWARF/module-ownership.mm (615 of 1236) UNSUPPORTED: lldb-shell :: ObjectFile/ELF/minidebuginfo-set-and-hit-breakpoint.test (616 of 1236) PASS: lldb-api :: commands/process/attach/TestProcessAttach.py (617 of 1236) PASS: lldb-api :: functionalities/asan/TestMemoryHistory.py (618 of 1236) PASS: lldb-api :: lang/objc/objc-static-method/TestObjCStaticMethod.py (619 of 1236) PASS: lldb-api :: lang/c/offsetof/TestOffsetof.py (620 of 1236) PASS: lldb-api :: functionalities/lazy-loading/TestLazyLoading.py (621 of 1236) PASS: lldb-api :: functionalities/breakpoint/cpp/TestCPPBreakpointLocations.py (622 of 1236) PASS: lldb-shell :: Breakpoint/debug_rnglistx_rlex.test (623 of 1236) PASS: lldb-shell :: Commands/CommandScriptImmediateOutput/CommandScriptImmediateOutputConsole.test (624 of 1236) PASS: lldb-api :: python_api/value/TestValueAPI.py (625 of 1236) PASS: lldb-api :: functionalities/data-formatter/setvaluefromcstring/TestSetValueFromCString.py (626 of 1236) PASS: lldb-api :: functionalities/data-formatter/data-formatter-objc/TestDataFormatterObjCPlain.py (627 of 1236) PASS: lldb-api :: functionalities/tsan/thread_leak/TestTsanThreadLeak.py (628 of 1236) PASS: lldb-api :: lang/cpp/stl/TestStdCXXDisassembly.py (629 of 1236) UNSUPPORTED: lldb-shell :: SymbolFile/PDB/pointers.test (630 of 1236) PASS: lldb-shell :: SymbolFile/DWARF/debug-types-basic.test (631 of 1236) PASS: lldb-api :: commands/watchpoints/watchpoint_commands/condition/TestWatchpointConditionCmd.py (632 of 1236) PASS: lldb-api :: functionalities/jitloader_gdb/TestJITLoaderGDB.py (633 of 1236) PASS: lldb-shell :: ScriptInterpreter/Python/eof.test (634 of 1236) PASS: lldb-api :: commands/expression/rdar42038760/TestScalarURem.py (635 of 1236) PASS: lldb-shell :: Settings/TestStopCommandSourceOnError.test (636 of 1236) PASS: lldb-shell :: Settings/TestSettingsWrite.test (637 of 1236) PASS: lldb-api :: functionalities/gdb_remote_client/TestNoWatchpointSupportInfo.py (638 of 1236) PASS: lldb-api :: functionalities/data-formatter/data-formatter-objc/TestDataFormatterObjCNSDate.py (639 of 1236) UNSUPPORTED: lldb-api :: functionalities/data-formatter/data-formatter-stl/libstdcpp/tuple/TestDataFormatterStdTuple.py (640 of 1236) UNSUPPORTED: lldb-api :: tools/lldb-vscode/step/TestVSCode_step.py (641 of 1236) PASS: lldb-api :: types/TestCharType.py (642 of 1236) PASS: lldb-api :: tools/lldb-server/TestGdbRemoteHostInfo.py (643 of 1236) UNSUPPORTED: lldb-shell :: Reproducer/Functionalities/TestExpressionEvaluation.test (644 of 1236) PASS: lldb-api :: python_api/function_symbol/TestDisasmAPI.py (645 of 1236) PASS: lldb-shell :: Commands/command-disassemble-process.yaml (646 of 1236) PASS: lldb-api :: lang/cpp/signed_types/TestSignedTypes.py (647 of 1236) PASS: lldb-api :: functionalities/thread/concurrent_events/TestConcurrentBreakpointDelayBreakpointOneSignal.py (648 of 1236) PASS: lldb-api :: functionalities/completion/TestCompletion.py (649 of 1236) PASS: lldb-shell :: ObjectFile/PECOFF/sections.yaml (650 of 1236) PASS: lldb-shell :: ObjectFile/PECOFF/basic-info.yaml (651 of 1236) PASS: lldb-api :: python_api/default-constructor/TestDefaultConstructorForAPIObjects.py (652 of 1236) PASS: lldb-shell :: ObjectFile/ELF/PT_TLS-overlap-PT_LOAD.yaml (653 of 1236) PASS: lldb-api :: lang/objc/objc-optimized/TestObjcOptimized.py (654 of 1236) PASS: lldb-shell :: Minidump/no-process-id.yaml (655 of 1236) PASS: lldb-shell :: Minidump/disassemble-no-module.yaml (656 of 1236) PASS: lldb-shell :: BuildScript/compiler-full-path.test (657 of 1236) PASS: lldb-api :: python_api/section/TestSectionAPI.py (658 of 1236) PASS: lldb-shell :: ObjectFile/ELF/minidebuginfo-find-symbols.yaml (659 of 1236) UNSUPPORTED: lldb-api :: functionalities/darwin_log/filter/regex/subsystem/TestDarwinLogFilterRegexSubsystem.py (660 of 1236) UNSUPPORTED: lldb-shell :: Unwind/eh-frame-small-fde.test (661 of 1236) UNSUPPORTED: lldb-api :: commands/expression/import-std-module/basic/TestImportStdModule.py (662 of 1236) UNSUPPORTED: lldb-api :: tools/lldb-server/platform-process-connect/TestPlatformProcessConnect.py (663 of 1236) PASS: lldb-api :: functionalities/data-formatter/summary-string-onfail/Test-rdar-9974002.py (664 of 1236) PASS: lldb-api :: functionalities/backticks/TestBackticksWithoutATarget.py (665 of 1236) PASS: lldb-shell :: SymbolFile/DWARF/childless-compile-unit.s (666 of 1236) UNSUPPORTED: lldb-api :: commands/expression/issue_11588/Test11588.py (667 of 1236) PASS: lldb-api :: lang/cpp/class-template-parameter-pack/TestClassTemplateParameterPack.py (668 of 1236) PASS: lldb-api :: functionalities/data-formatter/data-formatter-stl/libcxx/tuple/TestDataFormatterLibcxxTuple.py (669 of 1236) UNSUPPORTED: lldb-api :: tools/lldb-vscode/breakpoint/TestVSCode_setBreakpoints.py (670 of 1236) PASS: lldb-api :: lang/c/forward/TestForwardDeclaration.py (671 of 1236) UNSUPPORTED: lldb-api :: commands/watchpoints/hello_watchlocation/TestWatchLocation.py (672 of 1236) PASS: lldb-api :: functionalities/gdb_remote_client/TestProcessConnect.py (673 of 1236) PASS: lldb-api :: lang/objc/objc_direct-methods/TestObjCDirectMethods.py (674 of 1236) UNSUPPORTED: lldb-api :: tools/lldb-server/TestGdbRemoteModuleInfo.py (675 of 1236) PASS: lldb-api :: functionalities/data-formatter/user-format-vs-summary/TestUserFormatVsSummary.py (676 of 1236) PASS: lldb-api :: api/multiple-debuggers/TestMultipleDebuggers.py (677 of 1236) PASS: lldb-api :: functionalities/thread/create_after_attach/TestCreateAfterAttach.py (678 of 1236) PASS: lldb-api :: lang/objc/self/TestObjCSelf.py (679 of 1236) UNSUPPORTED: lldb-api :: lang/objc/print-obj/TestPrintObj.py (680 of 1236) PASS: lldb-shell :: Breakpoint/debug_rnglist_rlestartend.test (681 of 1236) PASS: lldb-api :: functionalities/thread/jump/TestThreadJump.py (682 of 1236) UNSUPPORTED: lldb-api :: python_api/event/TestEvents.py (683 of 1236) UNSUPPORTED: lldb-api :: arm/breakpoint-thumb-codesection/TestBreakpointThumbCodesection.py (684 of 1236) PASS: lldb-api :: sample_test/TestSampleTest.py (685 of 1236) UNSUPPORTED: lldb-api :: functionalities/gdb_remote_client/TestRestartBug.py (686 of 1236) UNSUPPORTED: lldb-api :: commands/register/register/aarch64_sve_registers/rw_access_static_config/TestSVERegisters.py (687 of 1236) PASS: lldb-api :: lang/c/inlines/TestRedefinitionsInInlines.py (688 of 1236) UNSUPPORTED: lldb-api :: functionalities/darwin_log/filter/exact_match/message/TestDarwinLogFilterMatchMessage.py (689 of 1236) PASS: lldb-api :: lang/cpp/bitfields/TestCppBitfields.py (690 of 1236) PASS: lldb-api :: lang/objc/foundation/TestObjectDescriptionAPI.py (691 of 1236) PASS: lldb-shell :: Settings/TestFrameFormatNoColor.test (692 of 1236) PASS: lldb-shell :: ObjectFile/PECOFF/invalid-export-table.yaml (693 of 1236) PASS: lldb-shell :: ObjectFile/ELF/PT_LOAD-empty.yaml (694 of 1236) PASS: lldb-shell :: SymbolFile/DWARF/compilercontext.ll (695 of 1236) PASS: lldb-api :: functionalities/data-formatter/data-formatter-objc/TestDataFormatterObjCNSURL.py (696 of 1236) PASS: lldb-api :: tools/lldb-server/commandline/TestStubReverseConnect.py (697 of 1236) PASS: lldb-shell :: SymbolFile/DWARF/find-inline-method.s (698 of 1236) PASS: lldb-api :: lang/c/bitfields/TestBitfields.py (699 of 1236) UNSUPPORTED: lldb-shell :: Reproducer/TestSynchronous.test (700 of 1236) PASS: lldb-api :: lang/objc/foundation/TestConstStrings.py (701 of 1236) PASS: lldb-api :: commands/expression/save_jit_objects/TestSaveJITObjects.py (702 of 1236) PASS: lldb-api :: functionalities/breakpoint/breakpoint_by_line_and_column/TestBreakpointByLineAndColumn.py (703 of 1236) UNSUPPORTED: lldb-shell :: ScriptInterpreter/Lua/quit.test (704 of 1236) PASS: lldb-api :: commands/version/TestVersion.py (705 of 1236) PASS: lldb-api :: functionalities/data-formatter/type_summary_list_script/TestTypeSummaryListScript.py (706 of 1236) PASS: lldb-api :: types/TestIntegerTypeExpr.py (707 of 1236) PASS: lldb-api :: lang/cpp/offsetof/TestOffsetofCpp.py (708 of 1236) PASS: lldb-api :: lang/cpp/stl/TestSTL.py (709 of 1236) PASS: lldb-api :: commands/expression/import_builtin_fileid/TestImportBuiltinFileID.py (710 of 1236) PASS: lldb-shell :: SymbolFile/Breakpad/stack-cfi-arm.yaml (711 of 1236) PASS: lldb-api :: lang/cpp/this_class_type_mixing/TestThisClassTypeMixing.py (712 of 1236) PASS: lldb-api :: python_api/sbvalue_const_addrof/TestSBValueConstAddrOf.py (713 of 1236) PASS: lldb-api :: functionalities/thread/concurrent_events/TestConcurrentManyWatchpoints.py (714 of 1236) PASS: lldb-shell :: SymbolFile/DWARF/parallel-indexing-stress.s (715 of 1236) UNSUPPORTED: lldb-api :: commands/expression/import-std-module/no-std-module/TestMissingStdModule.py (716 of 1236) UNSUPPORTED: lldb-api :: functionalities/darwin_log/format/TestDarwinLogMessageFormat.py (717 of 1236) PASS: lldb-shell :: ObjectFile/PECOFF/basic-info-arm.yaml (718 of 1236) PASS: lldb-api :: functionalities/pointer_num_children/TestPointerNumChildren.py (719 of 1236) PASS: lldb-shell :: SymbolFile/Breakpad/unwind-via-raSearch.test (720 of 1236) PASS: lldb-api :: python_api/watchpoint/condition/TestWatchpointConditionAPI.py (721 of 1236) PASS: lldb-api :: commands/apropos/with-process/TestAproposWithProcess.py (722 of 1236) PASS: lldb-api :: lang/objc/unicode-string/TestUnicodeString.py (723 of 1236) UNSUPPORTED: lldb-api :: lang/objc/foundation/TestRuntimeTypes.py (724 of 1236) PASS: lldb-api :: functionalities/gdb_remote_client/TestPlatformClient.py (725 of 1236) PASS: lldb-api :: functionalities/thread/exit_during_step/TestExitDuringStep.py (726 of 1236) UNSUPPORTED: lldb-api :: benchmarks/libcxxlist/TestBenchmarkLibcxxList.py (727 of 1236) PASS: lldb-api :: functionalities/paths/TestPaths.py (728 of 1236) PASS: lldb-api :: commands/statistics/basic/TestStats.py (729 of 1236) PASS: lldb-api :: lang/c/anonymous/TestAnonymous.py (730 of 1236) UNSUPPORTED: lldb-shell :: Register/aarch64-gp-read.test (731 of 1236) PASS: lldb-api :: commands/source/info/TestSourceInfo.py (732 of 1236) PASS: lldb-api :: python_api/formatters/TestFormattersSBAPI.py (733 of 1236) PASS: lldb-api :: functionalities/thread/backtrace_limit/TestBacktraceLimit.py (734 of 1236) PASS: lldb-api :: functionalities/thread/concurrent_events/TestConcurrentManyBreakpoints.py (735 of 1236) PASS: lldb-shell :: Breakpoint/jitbp_elf.test (736 of 1236) PASS: lldb-api :: functionalities/thread/concurrent_events/TestConcurrentDelaySignalWatch.py (737 of 1236) PASS: lldb-shell :: SymbolFile/DWARF/debug_rnglists.s (738 of 1236) UNSUPPORTED: lldb-shell :: BuildScript/toolchain-clang-cl.test (739 of 1236) PASS: lldb-api :: commands/frame/diagnose/local-variable/TestLocalVariable.py (740 of 1236) PASS: lldb-api :: commands/expression/fixits/TestFixIts.py (741 of 1236) PASS: lldb-api :: lang/objc/modules-auto-import/TestModulesAutoImport.py (742 of 1236) PASS: lldb-api :: commands/target/modules/search-paths/insert/TestTargetModulesSearchpathsInsert.py (743 of 1236) PASS: lldb-shell :: Driver/TestUseColor.test (744 of 1236) PASS: lldb-api :: commands/expression/import_base_class_when_class_has_derived_member/TestImportBaseClassWhenClassHasDerivedMember.py (745 of 1236) UNSUPPORTED: lldb-shell :: SymbolFile/PDB/func-symbols.test (746 of 1236) PASS: lldb-api :: lang/c/array_types/TestArrayTypes.py (747 of 1236) PASS: lldb-api :: commands/platform/file/read/TestPlatformFileRead.py (748 of 1236) PASS: lldb-api :: commands/expression/scoped_enums/TestScopedEnumType.py (749 of 1236) PASS: lldb-api :: sanity/TestModuleCacheSanity.py (750 of 1236) PASS: lldb-shell :: Settings/TestModuleCacheSanity.test (751 of 1236) PASS: lldb-api :: lang/objcxx/class-name-clash/TestNameClash.py (752 of 1236) PASS: lldb-shell :: ObjectFile/ELF/netbsd-core-amd64.test (753 of 1236) UNSUPPORTED: lldb-api :: macosx/profile_vrs_detach/TestDetachVrsProfile.py (754 of 1236) PASS: lldb-api :: functionalities/thread/thread_specific_break/TestThreadSpecificBreakpoint.py (755 of 1236) UNSUPPORTED: lldb-api :: commands/expression/import-std-module/stack/TestStackFromStdModule.py (756 of 1236) PASS: lldb-api :: lang/cpp/gmodules-templates/TestGModules.py (757 of 1236) PASS: lldb-api :: sample_test/TestSampleInlineTest.py (758 of 1236) PASS: lldb-api :: commands/command/nested_alias/TestNestedAlias.py (759 of 1236) PASS: lldb-api :: python_api/frame/inlines/TestInlinedFrame.py (760 of 1236) UNSUPPORTED: lldb-api :: functionalities/darwin_log/filter/exact_match/activity/TestDarwinLogFilterMatchActivity.py (761 of 1236) PASS: lldb-api :: lang/objc/objc-class-method/TestObjCClassMethod.py (762 of 1236) PASS: lldb-api :: commands/expression/entry-bp/TestExprEntryBP.py (763 of 1236) UNSUPPORTED: lldb-shell :: Register/x86-gp-read.test (764 of 1236) UNSUPPORTED: lldb-api :: tools/lldb-vscode/launch/TestVSCode_launch.py (765 of 1236) UNSUPPORTED: lldb-api :: functionalities/data-formatter/data-formatter-stl/libstdcpp/unique_ptr/TestDataFormatterStdUniquePtr.py (766 of 1236) PASS: lldb-api :: lang/objc/objc-ivar-stripped/TestObjCIvarStripped.py (767 of 1236) PASS: lldb-api :: functionalities/thread/concurrent_events/TestConcurrentTwoWatchpointsOneSignal.py (768 of 1236) PASS: lldb-api :: lang/objc/modules-incomplete/TestIncompleteModules.py (769 of 1236) PASS: lldb-shell :: SymbolFile/DWARF/clang-ast-from-dwarf-objc-property.m (770 of 1236) PASS: lldb-api :: lang/mixed/TestMixedLanguages.py (771 of 1236) PASS: lldb-api :: iohandler/completion/TestIOHandlerCompletion.py (772 of 1236) PASS: lldb-shell :: Breakpoint/debug_addrx.test (773 of 1236) PASS: lldb-api :: functionalities/inferior-crashing/recursive-inferior/TestRecursiveInferiorStep.py (774 of 1236) PASS: lldb-shell :: Breakpoint/ppc64-localentry.test (775 of 1236) UNSUPPORTED: lldb-api :: python_api/file_handle/TestFileHandle.py (776 of 1236) PASS: lldb-api :: lang/objc/foundation/TestSymbolTable.py (777 of 1236) PASS: lldb-api :: functionalities/data-formatter/compactvectors/TestCompactVectors.py (778 of 1236) PASS: lldb-shell :: ObjectFile/Breakpad/breakpad-identification.test (779 of 1236) PASS: lldb-shell :: Driver/TestCommands.test (780 of 1236) PASS: lldb-api :: python_api/lldbutil/process/TestPrintStackTraces.py (781 of 1236) PASS: lldb-api :: python_api/lldbutil/iter/TestRegistersIterator.py (782 of 1236) PASS: lldb-api :: lang/cpp/namespace/TestNamespaceLookup.py (783 of 1236) UNSUPPORTED: lldb-api :: functionalities/unwind/standard/TestStandardUnwind.py (784 of 1236) PASS: lldb-shell :: SymbolFile/DWARF/debug-types-missing-signature.test (785 of 1236) PASS: lldb-api :: commands/expression/test/TestExprs2.py (786 of 1236) PASS: lldb-api :: macosx/order/TestOrderFile.py (787 of 1236) UNSUPPORTED: lldb-api :: tools/lldb-vscode/stackTrace/TestVSCode_stackTrace.py (788 of 1236) PASS: lldb-api :: lang/c/tls_globals/TestTlsGlobals.py (789 of 1236) PASS: lldb-api :: commands/frame/var-scope/TestFrameVariableScope.py (790 of 1236) PASS: lldb-api :: python_api/watchpoint/watchlocation/TestSetWatchlocation.py (791 of 1236) PASS: lldb-shell :: SymbolFile/Breakpad/symtab-macho.test (792 of 1236) PASS: lldb-api :: functionalities/data-formatter/data-formatter-stl/libcxx/bitset/TestDataFormatterLibcxxBitset.py (793 of 1236) UNSUPPORTED: lldb-api :: python_api/disassemble-raw-data/TestDisassembleRawData.py (794 of 1236) UNSUPPORTED: lldb-api :: tools/lldb-vscode/runInTerminal/TestVSCode_runInTerminal.py (795 of 1236) PASS: lldb-api :: functionalities/thread/backtrace_all/TestBacktraceAll.py (796 of 1236) UNSUPPORTED: lldb-shell :: Register/x86-64-ymm-read.test (797 of 1236) PASS: lldb-api :: lang/objc/objc-baseclass-sbtype/TestObjCBaseClassSBType.py (798 of 1236) PASS: lldb-api :: functionalities/breakpoint/cpp_exception/TestCPPExceptionBreakpoint.py (799 of 1236) PASS: lldb-api :: lang/cpp/nested-class-other-compilation-unit/TestNestedClassWithParentInAnotherCU.py (800 of 1236) PASS: lldb-api :: commands/expression/result_numbering/TestResultNumbering.py (801 of 1236) UNSUPPORTED: lldb-api :: benchmarks/turnaround/TestCompileRunToBreakpointTurnaround.py (802 of 1236) UNSUPPORTED: lldb-api :: commands/expression/import-std-module/deque-basic/TestDequeFromStdModule.py (803 of 1236) PASS: lldb-api :: python_api/get-value-32bit-int/TestGetValue32BitInt.py (804 of 1236) PASS: lldb-api :: commands/platform/process/list/TestProcessList.py (805 of 1236) PASS: lldb-api :: functionalities/breakpoint/consecutive_breakpoints/TestConsecutiveBreakpoints.py (806 of 1236) UNSUPPORTED: lldb-api :: commands/expression/no-deadlock/TestExprDoesntBlock.py (807 of 1236) UNSUPPORTED: lldb-shell :: Register/x86-zmm-read.test (808 of 1236) PASS: lldb-api :: lang/objc/modules-app-update/TestClangModulesAppUpdate.py (809 of 1236) PASS: lldb-shell :: Settings/TestLineMarkerColor.test (810 of 1236) PASS: lldb-api :: functionalities/data-formatter/nssetsynth/TestNSSetSynthetic.py (811 of 1236) UNSUPPORTED: lldb-api :: python_api/symbol-context/TestSymbolContext.py (812 of 1236) UNSUPPORTED: lldb-shell :: ScriptInterpreter/Lua/nested_sessions.test (813 of 1236) PASS: lldb-api :: functionalities/data-formatter/data-formatter-stl/libcxx/function/TestLibCxxFunction.py (814 of 1236) PASS: lldb-api :: commands/process/launch-with-shellexpand/TestLaunchWithShellExpand.py (815 of 1236) PASS: lldb-api :: commands/watchpoints/watchpoint_events/TestWatchpointEvents.py (816 of 1236) UNSUPPORTED: lldb-api :: linux/thread/create_during_instruction_step/TestCreateDuringInstructionStep.py (817 of 1236) PASS: lldb-api :: api/multiple-targets/TestMultipleTargets.py (818 of 1236) PASS: lldb-shell :: SymbolFile/DWARF/debug-types-dwo-cross-reference.cpp (819 of 1236) PASS: lldb-shell :: ObjectFile/PECOFF/basic-info-arm64.yaml (820 of 1236) UNSUPPORTED: lldb-api :: commands/expression/import-std-module/deque-dbg-info-content/TestDbgInfoContentDequeFromStdModule.py (821 of 1236) PASS: lldb-api :: lang/cpp/this/TestCPPThis.py (822 of 1236) PASS: lldb-api :: functionalities/memory/cache/TestMemoryCache.py (823 of 1236) PASS: lldb-api :: commands/command/script/import/rdar-12586188/TestRdar12586188.py (824 of 1236) PASS: lldb-api :: python_api/frame/get-variables/TestGetVariables.py (825 of 1236) UNSUPPORTED: lldb-api :: commands/expression/import-std-module/queue/TestQueueFromStdModule.py (826 of 1236) PASS: lldb-api :: commands/target/dump-symtab-demangle/TestDumpSymtabDemangle.py (827 of 1236) UNSUPPORTED: lldb-api :: functionalities/thread/exit_during_expression/TestExitDuringExpression.py (828 of 1236) PASS: lldb-shell :: ObjectFile/Breakpad/uuid-matching-mac.test (829 of 1236) PASS: lldb-api :: python_api/function_symbol/TestSymbolAPI.py (830 of 1236) UNSUPPORTED: lldb-api :: commands/expression/import-std-module/forward_decl_from_module/TestForwardDeclFromStdModule.py (831 of 1236) PASS: lldb-api :: lang/cpp/breakpoint_in_member_func_w_non_primitive_params/TestBreakpointInMemberFuncWNonPrimitiveParams.py (832 of 1236) PASS: lldb-api :: functionalities/step-avoids-no-debug/TestStepNoDebug.py (833 of 1236) PASS: lldb-api :: tools/lldb-server/TestGdbRemoteKill.py (834 of 1236) PASS: lldb-api :: functionalities/data-formatter/data-formatter-stl/libcxx/variant/TestDataFormatterLibcxxVariant.py (835 of 1236) PASS: lldb-api :: functionalities/thread/concurrent_events/TestConcurrentSignalDelayBreak.py (836 of 1236) PASS: lldb-api :: functionalities/thread/concurrent_events/TestConcurrentCrashWithBreak.py (837 of 1236) UNSUPPORTED: lldb-api :: tools/lldb-server/TestGdbRemoteAuxvSupport.py (838 of 1236) PASS: lldb-shell :: ObjectFile/ELF/build-id-case.yaml (839 of 1236) PASS: lldb-shell :: ObjectFile/PECOFF/export-dllfunc.yaml (840 of 1236) PASS: lldb-api :: functionalities/tail_call_frames/ambiguous_tail_call_seq1/TestAmbiguousTailCallSeq1.py (841 of 1236) PASS: lldb-api :: lang/objcxx/objcxx-ivar-vector/TestIvarVector.py (842 of 1236) PASS: lldb-api :: functionalities/data-formatter/data-formatter-stl/libcxx/unordered/TestDataFormatterUnordered.py (843 of 1236) PASS: lldb-api :: functionalities/inferior-crashing/TestInferiorCrashingStep.py (844 of 1236) XFAIL: lldb-shell :: Register/x86-64-write.test (845 of 1236) UNSUPPORTED: lldb-shell :: ScriptInterpreter/Python/scripted_breakpoint.test (846 of 1236) UNSUPPORTED: lldb-api :: commands/expression/import-std-module/vector-of-vectors/TestVectorOfVectorsFromStdModule.py (847 of 1236) PASS: lldb-api :: lang/c/find_struct_type/TestFindStructTypes.py (848 of 1236) PASS: lldb-shell :: Minidump/Windows/find-module.test (849 of 1236) UNSUPPORTED: lldb-api :: functionalities/signal/TestSendSignal.py (850 of 1236) PASS: lldb-shell :: Quit/TestQuitExitCodeImplicit0.test (851 of 1236) UNSUPPORTED: lldb-api :: macosx/macCatalyst/TestMacCatalyst.py (852 of 1236) PASS: lldb-api :: functionalities/ubsan/basic/TestUbsanBasic.py (853 of 1236) UNSUPPORTED: lldb-api :: commands/expression/import-std-module/vector-dbg-info-content/TestDbgInfoContentVectorFromStdModule.py (854 of 1236) PASS: lldb-api :: lang/objc/objc-static-method-stripped/TestObjCStaticMethodStripped.py (855 of 1236) PASS: lldb-api :: functionalities/dlopen_other_executable/TestDlopenOtherExecutable.py (856 of 1236) PASS: lldb-api :: functionalities/tsan/thread_numbers/TestTsanThreadNumbers.py (857 of 1236) PASS: lldb-api :: tools/lldb-server/TestGdbRemoteAttach.py (858 of 1236) PASS: lldb-api :: lang/cpp/const_this/TestConstThis.py (859 of 1236) XFAIL: lldb-shell :: Register/x86-mm-xmm-write.test (860 of 1236) UNSUPPORTED: lldb-shell :: SymbolFile/DWARF/split-dwarf-expression-eval-bug.cpp (861 of 1236) PASS: lldb-api :: types/TestFloatTypes.py (862 of 1236) PASS: lldb-api :: tools/lldb-server/TestGdbRemoteExitCode.py (863 of 1236) PASS: lldb-api :: commands/expression/persist_objc_pointeetype/TestPersistObjCPointeeType.py (864 of 1236) PASS: lldb-api :: functionalities/target_var/no_vars/TestTargetVarNoVars.py (865 of 1236) UNSUPPORTED: lldb-api :: tools/lldb-server/thread-name/TestGdbRemoteThreadName.py (866 of 1236) PASS: lldb-api :: functionalities/breakpoint/breakpoint_command/TestBreakpointCommand.py (867 of 1236) UNSUPPORTED: lldb-shell :: ScriptInterpreter/Lua/lua.test (868 of 1236) PASS: lldb-api :: lang/cpp/template-function/TestTemplateFunctions.py (869 of 1236) PASS: lldb-shell :: Heap/heap-cstr.test (870 of 1236) PASS: lldb-api :: functionalities/breakpoint/breakpoint_ignore_count/TestBreakpointIgnoreCount.py (871 of 1236) PASS: lldb-shell :: ScriptInterpreter/Python/python.test (872 of 1236) PASS: lldb-api :: functionalities/data-formatter/nsarraysynth/TestNSArraySynthetic.py (873 of 1236) PASS: lldb-api :: commands/expression/call-function/TestCallUserDefinedFunction.py (874 of 1236) PASS: lldb-api :: functionalities/param_entry_vals/basic_entry_values/TestBasicEntryValues.py (875 of 1236) PASS: lldb-api :: functionalities/thread/num_threads/TestNumThreads.py (876 of 1236) PASS: lldb-api :: commands/watchpoints/watchpoint_count/TestWatchpointCount.py (877 of 1236) PASS: lldb-api :: functionalities/breakpoint/hardware_breakpoints/require_hw_breakpoints/TestRequireHWBreakpoints.py (878 of 1236) PASS: lldb-api :: functionalities/data-formatter/data-formatter-script/TestDataFormatterScript.py (879 of 1236) PASS: lldb-api :: lang/cpp/limit-debug-info/TestWithLimitDebugInfo.py (880 of 1236) PASS: lldb-api :: macosx/indirect_symbol/TestIndirectSymbols.py (881 of 1236) PASS: lldb-shell :: SymbolFile/symbol-binding.test (882 of 1236) PASS: lldb-api :: iohandler/autosuggestion/TestAutosuggestion.py (883 of 1236) PASS: lldb-api :: lang/objc/objc-new-syntax/TestObjCNewSyntaxLiteral.py (884 of 1236) PASS: lldb-api :: types/TestCharTypeExpr.py (885 of 1236) PASS: lldb-api :: functionalities/tail_call_frames/unambiguous_sequence/TestUnambiguousTailCalls.py (886 of 1236) PASS: lldb-api :: functionalities/data-formatter/dump_dynamic/TestDumpDynamic.py (887 of 1236) UNSUPPORTED: lldb-api :: commands/expression/call-restarts/TestCallThatRestarts.py (888 of 1236) PASS: lldb-api :: functionalities/plugins/python_os_plugin/TestPythonOSPlugin.py (889 of 1236) PASS: lldb-api :: lang/cpp/breakpoint-commands/TestCPPBreakpointCommands.py (890 of 1236) UNSUPPORTED: lldb-api :: commands/expression/import-std-module/weak_ptr/TestWeakPtrFromStdModule.py (891 of 1236) PASS: lldb-shell :: ObjectFile/MachO/symtab.yaml (892 of 1236) PASS: lldb-shell :: SymbolFile/DWARF/find-variable-dwo.cpp (893 of 1236) PASS: lldb-api :: functionalities/gdb_remote_client/TestWasm.py (894 of 1236) PASS: lldb-api :: tools/lldb-server/TestLldbGdbServer.py (895 of 1236) PASS: lldb-api :: commands/gui/basicdebug/TestGuiBasicDebug.py (896 of 1236) UNSUPPORTED: lldb-api :: lang/cpp/printf/TestPrintf.py (897 of 1236) PASS: lldb-shell :: SymbolFile/DWARF/debug_line-tombstone.s (898 of 1236) PASS: lldb-shell :: Breakpoint/dummy-target.test (899 of 1236) PASS: lldb-api :: commands/expression/options/TestExprOptions.py (900 of 1236) PASS: lldb-api :: lang/cpp/class_types/TestClassTypes.py (901 of 1236) PASS: lldb-api :: functionalities/thread/step_out/TestThreadStepOut.py (902 of 1236) PASS: lldb-api :: commands/expression/dollar-in-variable/TestDollarInVariable.py (903 of 1236) PASS: lldb-api :: lang/c/shared_lib/TestSharedLib.py (904 of 1236) PASS: lldb-shell :: SymbolFile/DWARF/DW_AT_const_value.s (905 of 1236) PASS: lldb-api :: lang/objcxx/cxx-bridged-po/TestObjCXXBridgedPO.py (906 of 1236) PASS: lldb-api :: commands/expression/xvalue/TestXValuePrinting.py (907 of 1236) UNSUPPORTED: lldb-api :: functionalities/thread/thread_specific_break_plus_condition/TestThreadSpecificBpPlusCondition.py (908 of 1236) PASS: lldb-shell :: Minidump/breakpad-symbols.test (909 of 1236) UNSUPPORTED: lldb-api :: tools/lldb-vscode/coreFile/TestVSCode_coreFile.py (910 of 1236) PASS: lldb-api :: macosx/nslog/TestDarwinNSLogOutput.py (911 of 1236) PASS: lldb-api :: commands/expression/pr35310/TestExprsBug35310.py (912 of 1236) PASS: lldb-api :: lang/c/step-target/TestStepTarget.py (913 of 1236) PASS: lldb-shell :: SymbolFile/Breakpad/line-table-discontinuous-file-ids.test (914 of 1236) PASS: lldb-api :: functionalities/tail_call_frames/disambiguate_call_site/TestDisambiguateCallSite.py (915 of 1236) UNSUPPORTED: lldb-api :: functionalities/tty/TestTerminal.py (916 of 1236) PASS: lldb-shell :: SymbolFile/Breakpad/unwind-via-stack-win.test (917 of 1236) PASS: lldb-api :: python_api/sbstructureddata/TestStructuredDataAPI.py (918 of 1236) PASS: lldb-shell :: SymbolFile/DWARF/split-dwarf-multiple-cu.ll (919 of 1236) UNSUPPORTED: lldb-shell :: Reproducer/TestVersionCheck.test (920 of 1236) PASS: lldb-api :: functionalities/data-formatter/data-formatter-objc/TestDataFormatterObjCNSError.py (921 of 1236) UNSUPPORTED: lldb-shell :: Reproducer/TestCaptureEnvOverride.test (922 of 1236) PASS: lldb-api :: functionalities/postmortem/minidump/TestMiniDump.py (923 of 1236) UNSUPPORTED: lldb-shell :: ScriptInterpreter/Lua/io.test (924 of 1236) PASS: lldb-api :: lang/cpp/virtual-overload/TestVirtualOverload.py (925 of 1236) PASS: lldb-api :: commands/expression/two-files/TestObjCTypeQueryFromOtherCompileUnit.py (926 of 1236) PASS: lldb-api :: lang/cpp/dynamic-value/TestCppValueCast.py (927 of 1236) PASS: lldb-api :: assert_messages_test/TestAssertMessages.py (928 of 1236) PASS: lldb-api :: lang/cpp/covariant-return-types/TestCovariantReturnTypes.py (929 of 1236) PASS: lldb-api :: functionalities/data-formatter/data-formatter-stl/libcxx/vector/TestDataFormatterLibcxxVector.py (930 of 1236) PASS: lldb-api :: python_api/sbplatform/TestSBPlatform.py (931 of 1236) PASS: lldb-api :: lang/cpp/auto/TestCPPAuto.py (932 of 1236) UNSUPPORTED: lldb-api :: macosx/find-dsym/deep-bundle/TestDeepBundle.py (933 of 1236) UNSUPPORTED: lldb-shell :: Driver/TestFile.test (934 of 1236) PASS: lldb-api :: lang/c/shared_lib_stripped_symbols/TestSharedLibStrippedSymbols.py (935 of 1236) PASS: lldb-shell :: ObjectFile/ELF/minidebuginfo-corrupt-xz.yaml (936 of 1236) PASS: lldb-api :: functionalities/gdb_remote_client/TestTargetXMLArch.py (937 of 1236) PASS: lldb-shell :: SymbolFile/DWARF/anon_class_w_and_wo_export_symbols.ll (938 of 1236) PASS: lldb-api :: commands/expression/completion-crash-incomplete-record/TestCompletionCrashIncompleteRecord.py (939 of 1236) UNSUPPORTED: lldb-api :: tools/lldb-vscode/attach/TestVSCode_attach.py (940 of 1236) PASS: lldb-api :: functionalities/thread/exit_during_break/TestExitDuringBreak.py (941 of 1236) PASS: lldb-api :: lang/cpp/scope/TestCppScope.py (942 of 1236) PASS: lldb-api :: functionalities/thread/concurrent_events/TestConcurrentWatchBreak.py (943 of 1236) PASS: lldb-api :: commands/log/invalid-args/TestInvalidArgsLog.py (944 of 1236) PASS: lldb-api :: lang/objc/rdar-10967107/TestRdar10967107.py (945 of 1236) PASS: lldb-shell :: Process/TestAbortExitCode.test (946 of 1236) PASS: lldb-api :: lang/c/unicode/TestUnicodeSymbols.py (947 of 1236) PASS: lldb-api :: commands/target/create-deps/TestTargetCreateDeps.py (948 of 1236) PASS: lldb-api :: functionalities/avoids-fd-leak/TestFdLeak.py (949 of 1236) PASS: lldb-api :: python_api/watchpoint/TestWatchpointIgnoreCount.py (950 of 1236) PASS: lldb-api :: commands/help/TestHelp.py (951 of 1236) UNSUPPORTED: lldb-api :: tools/lldb-vscode/console/TestVSCode_console.py (952 of 1236) PASS: lldb-api :: functionalities/thread/concurrent_events/TestConcurrentCrashWithSignal.py (953 of 1236) PASS: lldb-api :: functionalities/fat_archives/TestFatArchives.py (954 of 1236) PASS: lldb-api :: lang/objc/objc-super/TestObjCSuper.py (955 of 1236) PASS: lldb-api :: functionalities/breakpoint/address_breakpoints/TestBadAddressBreakpoints.py (956 of 1236) PASS: lldb-api :: commands/platform/basic/TestPlatformPython.py (957 of 1236) PASS: lldb-api :: functionalities/data-formatter/data-formatter-objc/TestDataFormatterObjNSException.py (958 of 1236) PASS: lldb-api :: commands/thread/select/TestThreadSelect.py (959 of 1236) PASS: lldb-api :: lang/objc/objc-struct-return/TestObjCStructReturn.py (960 of 1236) PASS: lldb-shell :: SymbolFile/Breakpad/line-table-edgecases.test (961 of 1236) PASS: lldb-api :: functionalities/data-formatter/poarray/TestPrintObjectArray.py (962 of 1236) UNSUPPORTED: lldb-shell :: SymbolFile/NativePDB/stack_unwinding01.cpp (963 of 1236) UNSUPPORTED: lldb-api :: commands/expression/import-std-module/weak_ptr-dbg-info-content/TestDbgInfoContentWeakPtrFromStdModule.py (964 of 1236) PASS: lldb-api :: functionalities/tsan/multiple/TestTsanMultiple.py (965 of 1236) PASS: lldb-api :: lang/c/conflicting-symbol/TestConflictingSymbol.py (966 of 1236) PASS: lldb-api :: tools/lldb-server/inferior-crash/TestGdbRemoteSegFault.py (967 of 1236) PASS: lldb-api :: commands/quit/TestQuit.py (968 of 1236) PASS: lldb-api :: functionalities/gdb_remote_client/TestNestedRegDefinitions.py (969 of 1236) UNSUPPORTED: lldb-api :: python_api/process/read-mem-cstring/TestReadMemCString.py (970 of 1236) UNSUPPORTED: lldb-shell :: SymbolFile/NativePDB/ast-functions-msvc.cpp (971 of 1236) PASS: lldb-api :: commands/expression/function_template_specialization_temp_args/TestFunctionTemplateSpecializationTempArgs.py (972 of 1236) PASS: lldb-api :: functionalities/thread/concurrent_events/TestConcurrentTwoWatchpointThreads.py (973 of 1236) PASS: lldb-api :: linux/builtin_trap/TestBuiltinTrap.py (974 of 1236) PASS: lldb-api :: functionalities/data-formatter/var-in-aggregate-misuse/TestVarInAggregateMisuse.py (975 of 1236) PASS: lldb-api :: functionalities/breakpoint/move_nearest/TestMoveNearest.py (976 of 1236) PASS: lldb-shell :: ObjectFile/MachO/subsections.yaml (977 of 1236) PASS: lldb-api :: python_api/symbol-context/two-files/TestSymbolContextTwoFiles.py (978 of 1236) PASS: lldb-api :: functionalities/breakpoint/step_over_breakpoint/TestStepOverBreakpoint.py (979 of 1236) PASS: lldb-shell :: Breakpoint/debug_rnglist_basic.test (980 of 1236) PASS: lldb-api :: commands/expression/call-throws/TestCallThatThrows.py (981 of 1236) PASS: lldb-api :: functionalities/data-formatter/builtin-formats/TestBuiltinFormats.py (982 of 1236) UNSUPPORTED: lldb-api :: commands/expression/import-std-module/shared_ptr/TestSharedPtrFromStdModule.py (983 of 1236) PASS: lldb-api :: commands/gui/invalid-args/TestInvalidArgsGui.py (984 of 1236) PASS: lldb-api :: functionalities/thread/step_until/TestStepUntil.py (985 of 1236) PASS: lldb-shell :: Commands/command-thread-select.test (986 of 1236) UNSUPPORTED: lldb-shell :: ScriptInterpreter/Python/sb_address_exception.test (987 of 1236) PASS: lldb-api :: lang/cpp/dynamic-value/TestDynamicValue.py (988 of 1236) UNSUPPORTED: lldb-api :: commands/expression/import-std-module/list/TestListFromStdModule.py (989 of 1236) PASS: lldb-shell :: SymbolFile/Breakpad/line-table.test (990 of 1236) PASS: lldb-shell :: ObjectFile/ELF/PT_LOAD-overlap.yaml (991 of 1236) PASS: lldb-shell :: SymbolFile/DWARF/debug-types-address-ranges.s (992 of 1236) PASS: lldb-api :: functionalities/thread/concurrent_events/TestConcurrentCrashWithWatchpointBreakpointSignal.py (993 of 1236) PASS: lldb-api :: functionalities/tail_call_frames/cross_dso/TestCrossDSOTailCalls.py (994 of 1236) PASS: lldb-shell :: Commands/command-breakpoint-col.test (995 of 1236) PASS: lldb-shell :: Commands/command-regex-unalias.test (996 of 1236) PASS: lldb-api :: macosx/find-app-in-bundle/TestFindAppInBundle.py (997 of 1236) PASS: lldb-api :: functionalities/gdb_remote_client/TestNoGPacketSupported.py (998 of 1236) PASS: lldb-api :: lang/objc/objc-ivar-protocols/TestIvarProtocols.py (999 of 1236) PASS: lldb-api :: functionalities/data-formatter/refpointer-recursion/TestDataFormatterRefPtrRecursion.py (1000 of 1236) UNSUPPORTED: lldb-shell :: Reproducer/TestDriverOptions.test (1001 of 1236) PASS: lldb-api :: functionalities/tsan/basic/TestTsanBasic.py (1002 of 1236) PASS: lldb-api :: functionalities/data-formatter/type_summary_list_arg/TestTypeSummaryListArg.py (1003 of 1236) PASS: lldb-api :: lang/cpp/elaborated-types/TestElaboratedTypes.py (1004 of 1236) PASS: lldb-api :: functionalities/data-formatter/data-formatter-stl/libcxx/forward_list/TestDataFormatterLibcxxForwardList.py (1005 of 1236) PASS: lldb-api :: lang/c/complex_int/TestComplexInt.py (1006 of 1236) PASS: lldb-shell :: ObjectFile/PECOFF/symbol.yaml (1007 of 1236) PASS: lldb-api :: lang/objc/objc-runtime-ivars/TestRuntimeIvars.py (1008 of 1236) PASS: lldb-api :: lang/objc/objc-foundation-dictionary-empty/TestNSDictionary0.py (1009 of 1236) PASS: lldb-api :: functionalities/rerun/TestRerun.py (1010 of 1236) PASS: lldb-shell :: SymbolFile/DWARF/dwp-debug-types.s (1011 of 1236) UNSUPPORTED: lldb-shell :: SymbolFile/PDB/expressions.test (1012 of 1236) UNSUPPORTED: lldb-shell :: SymbolFile/NativePDB/tag-types.cpp (1013 of 1236) PASS: lldb-api :: functionalities/thread/concurrent_events/TestConcurrentCrashWithWatchpoint.py (1014 of 1236) PASS: lldb-api :: lang/cpp/virtual-functions/TestCppVirtualFunctions.py (1015 of 1236) PASS: lldb-api :: functionalities/data-formatter/language_category_updates/TestDataFormatterLanguageCategoryUpdates.py (1016 of 1236) PASS: lldb-api :: lang/objc/objc-struct-argument/TestObjCStructArgument.py (1017 of 1236) PASS: lldb-api :: commands/expression/multiline-navigation/TestMultilineNavigation.py (1018 of 1236) PASS: lldb-shell :: SymbolFile/DWARF/inline-function-address-shared.test (1019 of 1236) PASS: lldb-api :: functionalities/multiword-commands/TestMultiWordCommands.py (1020 of 1236) PASS: lldb-api :: lang/cpp/exceptions/TestCPPExceptionBreakpoints.py (1021 of 1236) PASS: lldb-api :: lang/cpp/bool/TestCPPBool.py (1022 of 1236) PASS: lldb-api :: lang/objc/foundation/TestFoundationDisassembly.py (1023 of 1236) PASS: lldb-api :: functionalities/data-formatter/data-formatter-objc/TestDataFormatterObjCExpr.py (1024 of 1236) PASS: lldb-api :: commands/expression/codegen-crash-typedefdecl-not-in_declcontext/TestCodegenCrashTypedefDeclNotInDeclContext.py (1025 of 1236) PASS: lldb-api :: functionalities/history/TestHistoryRecall.py (1026 of 1236) PASS: lldb-shell :: ObjectFile/ELF/netbsd-exec-8.99.30-amd64.yaml (1027 of 1236) PASS: lldb-api :: functionalities/ptr_refs/TestPtrRefs.py (1028 of 1236) PASS: lldb-api :: tools/lldb-server/TestGdbRemoteProcessInfo.py (1029 of 1236) UNSUPPORTED: lldb-api :: macosx/version_zero/TestGetVersionZeroVersion.py (1030 of 1236) PASS: lldb-api :: terminal/TestEditline.py (1031 of 1236) PASS: lldb-api :: functionalities/data-formatter/data-formatter-stl/libcxx/iterator/TestDataFormatterLibccIterator.py (1032 of 1236) PASS: lldb-api :: macosx/load-kext/TestLoadKext.py (1033 of 1236) UNSUPPORTED: lldb-api :: lang/objc/objc-dynamic-value/TestObjCDynamicValue.py (1034 of 1236) PASS: lldb-api :: commands/platform/file/close/TestPlatformFileClose.py (1035 of 1236) PASS: lldb-api :: macosx/queues/TestQueues.py (1036 of 1236) PASS: lldb-api :: macosx/universal/TestUniversal.py (1037 of 1236) PASS: lldb-api :: tools/lldb-server/TestGdbRemoteExpeditedRegisters.py (1038 of 1236) UNSUPPORTED: lldb-shell :: Register/x86-64-xmm16-read.test (1039 of 1236) PASS: lldb-api :: functionalities/thread/concurrent_events/TestConcurrentTwoWatchpointsOneDelayBreakpoint.py (1040 of 1236) UNSUPPORTED: lldb-api :: python_api/sbdata/TestSBData.py (1041 of 1236) UNSUPPORTED: lldb-api :: functionalities/unwind/ehframe/TestEhFrameUnwind.py (1042 of 1236) PASS: lldb-shell :: Minidump/memory-region-from-module.yaml (1043 of 1236) PASS: lldb-api :: lang/cpp/char1632_t/TestChar1632T.py (1044 of 1236) PASS: lldb-shell :: Commands/command-target-modules-dump-sections.yaml (1045 of 1236) PASS: lldb-api :: python_api/lldbutil/frame/TestFrameUtils.py (1046 of 1236) PASS: lldb-api :: types/TestDoubleTypesExpr.py (1047 of 1236) PASS: lldb-api :: commands/expression/context-object-objc/TestContextObjectObjc.py (1048 of 1236) PASS: lldb-api :: lang/c/enum_types/TestEnumTypes.py (1049 of 1236) UNSUPPORTED: lldb-api :: benchmarks/libcxxmap/TestBenchmarkLibcxxMap.py (1050 of 1236) PASS: lldb-api :: functionalities/data-formatter/data-formatter-proper-plurals/TestFormattersOneIsSingular.py (1051 of 1236) PASS: lldb-api :: functionalities/tail_call_frames/sbapi_support/TestTailCallFrameSBAPI.py (1052 of 1236) PASS: lldb-shell :: ObjectFile/PECOFF/uuid.yaml (1053 of 1236) PASS: lldb-shell :: ObjectFile/wasm/embedded-debug-sections.yaml (1054 of 1236) UNSUPPORTED: lldb-api :: functionalities/darwin_log/filter/regex/message/TestDarwinLogFilterRegexMessage.py (1055 of 1236) PASS: lldb-shell :: Breakpoint/split-dwarf5-debug-stroffsets.test (1056 of 1236) PASS: lldb-api :: python_api/findvalue_duplist/TestSBFrameFindValue.py (1057 of 1236) PASS: lldb-shell :: ObjectFile/Breakpad/sections-trailing-func.test (1058 of 1236) PASS: lldb-api :: lang/cpp/symbols/TestSymbols.py (1059 of 1236) PASS: lldb-api :: functionalities/thread/concurrent_events/TestConcurrentSignalBreak.py (1060 of 1236) PASS: lldb-api :: python_api/value/change_values/TestChangeValueAPI.py (1061 of 1236) PASS: lldb-api :: commands/watchpoints/watchpoint_set_command/TestWatchLocationWithWatchSet.py (1062 of 1236) PASS: lldb-api :: types/TestLongTypesExpr.py (1063 of 1236) PASS: lldb-shell :: SymbolFile/DWARF/DW_AT_location-DW_AT_const_value.s (1064 of 1236) PASS: lldb-api :: functionalities/data-formatter/pyobjsynthprovider/TestPyObjSynthProvider.py (1065 of 1236) UNSUPPORTED: lldb-api :: tools/lldb-vscode/breakpoint/TestVSCode_setExceptionBreakpoints.py (1066 of 1236) PASS: lldb-api :: commands/expression/ir-interpreter/TestIRInterpreter.py (1067 of 1236) PASS: lldb-shell :: Driver/TestNoUseColor.test (1068 of 1236) PASS: lldb-api :: functionalities/unwind/sigtramp/TestSigtrampUnwind.py (1069 of 1236) PASS: lldb-shell :: Quit/TestQuitExitCodeNonInt.test (1070 of 1236) PASS: lldb-shell :: SymbolFile/dissassemble-entry-point.s (1071 of 1236) PASS: lldb-api :: functionalities/archives/TestBSDArchives.py (1072 of 1236) PASS: lldb-api :: python_api/type/TestTypeList.py (1073 of 1236) PASS: lldb-shell :: Watchpoint/SetErrorCases.test (1074 of 1236) UNSUPPORTED: lldb-shell :: SymbolFile/NativePDB/break-by-function.cpp (1075 of 1236) UNSUPPORTED: lldb-shell :: SymbolFile/PDB/udt-layout.test (1076 of 1236) UNSUPPORTED: lldb-api :: commands/session/save/TestSessionSave.py (1077 of 1236) UNSUPPORTED: lldb-shell :: SymbolFile/NativePDB/disassembly.cpp (1078 of 1236) UNSUPPORTED: lldb-shell :: Register/arm-fp-read.test (1079 of 1236) PASS: lldb-api :: lang/objc/conflicting-definition/TestConflictingDefinition.py (1080 of 1236) PASS: lldb-api :: types/TestDoubleTypes.py (1081 of 1236) PASS: lldb-api :: lang/objc/objc-ivar-offsets/TestObjCIvarOffsets.py (1082 of 1236) PASS: lldb-shell :: ObjectFile/MachO/lc_build_version_notools.yaml (1083 of 1236) PASS: lldb-api :: commands/frame/recognizer/TestFrameRecognizer.py (1084 of 1236) PASS: lldb-api :: functionalities/unwind/noreturn/TestNoreturnUnwind.py (1085 of 1236) PASS: lldb-api :: api/log/TestAPILog.py (1086 of 1236) PASS: lldb-api :: api/command-return-object/TestSBCommandReturnObject.py (1087 of 1236) PASS: lldb-shell :: SymbolFile/DWARF/DW_AT_loclists_base.s (1088 of 1236) UNSUPPORTED: lldb-shell :: SymbolFile/PDB/ast-restore.test (1089 of 1236) UNSUPPORTED: lldb-api :: functionalities/thread/state/TestThreadStates.py (1090 of 1236) PASS: lldb-shell :: ObjectFile/ELF/short-build-id.yaml (1091 of 1236) UNSUPPORTED: lldb-api :: tools/lldb-vscode/completions/TestVSCode_completions.py (1092 of 1236) UNSUPPORTED: lldb-api :: benchmarks/continue/TestBenchmarkContinue.py (1093 of 1236) UNSUPPORTED: lldb-shell :: SymbolFile/NativePDB/typedefs.cpp (1094 of 1236) PASS: lldb-api :: functionalities/thread/concurrent_events/TestConcurrentDelayWatchBreak.py (1095 of 1236) PASS: lldb-api :: functionalities/tail_call_frames/disambiguate_tail_call_seq/TestDisambiguateTailCallSeq.py (1096 of 1236) PASS: lldb-api :: macosx/save_crashlog/TestSaveCrashlog.py (1097 of 1236) PASS: lldb-shell :: BuildScript/toolchain-clang.test (1098 of 1236) PASS: lldb-api :: functionalities/data-formatter/data-formatter-stl/libcxx/queue/TestDataFormatterLibcxxQueue.py (1099 of 1236) PASS: lldb-api :: functionalities/tail_call_frames/thread_step_out_or_return/TestSteppingOutWithArtificialFrames.py (1100 of 1236) PASS: lldb-api :: lang/objc/objc-builtin-types/TestObjCBuiltinTypes.py (1101 of 1236) PASS: lldb-api :: lang/c/register_variables/TestRegisterVariables.py (1102 of 1236) PASS: lldb-api :: functionalities/data-formatter/data-formatter-objc/cmtime/TestDataFormatterCMTime.py (1103 of 1236) PASS: lldb-api :: functionalities/thread_plan/TestThreadPlanCommands.py (1104 of 1236) PASS: lldb-api :: functionalities/thread/concurrent_events/TestConcurrentTwoWatchpointsOneBreakpoint.py (1105 of 1236) PASS: lldb-api :: functionalities/signal/raise/TestRaise.py (1106 of 1236) PASS: lldb-api :: commands/expression/namespace_local_var_same_name_obj_c/TestNamespaceLocalVarSameNameObjC.py (1107 of 1236) UNSUPPORTED: lldb-api :: commands/expression/timeout/TestCallWithTimeout.py (1108 of 1236) PASS: lldb-shell :: ObjectFile/MachO/lc_build_version.yaml (1109 of 1236) PASS: lldb-shell :: ObjectFile/Breakpad/discontiguous-sections.test (1110 of 1236) UNSUPPORTED: lldb-api :: functionalities/breakpoint/breakpoint_in_delayslot/TestAvoidBreakpointInDelaySlot.py (1111 of 1236) PASS: lldb-api :: functionalities/data-formatter/data-formatter-synthval/TestDataFormatterSynthVal.py (1112 of 1236) PASS: lldb-api :: commands/frame/diagnose/virtual-method-call/TestDiagnoseDereferenceVirtualMethodCall.py (1113 of 1236) UNSUPPORTED: lldb-shell :: ScriptInterpreter/Lua/persistent_state.test (1114 of 1236) UNSUPPORTED: lldb-shell :: Register/x86-64-xmm16-write.test (1115 of 1236) PASS: lldb-api :: commands/frame/diagnose/dereference-function-return/TestDiagnoseDereferenceFunctionReturn.py (1116 of 1236) PASS: lldb-api :: functionalities/data-formatter/vector-types/TestVectorTypesFormatting.py (1117 of 1236) PASS: lldb-api :: commands/watchpoints/step_over_watchpoint/TestStepOverWatchpoint.py (1118 of 1236) UNSUPPORTED: lldb-shell :: SymbolFile/PDB/variables-locations.test (1119 of 1236) PASS: lldb-api :: functionalities/data-formatter/data-formatter-stl/libcxx/list/TestDataFormatterLibcxxList.py (1120 of 1236) PASS: lldb-api :: functionalities/breakpoint/breakpoint_locations/TestBreakpointLocations.py (1121 of 1236) PASS: lldb-api :: lang/objc/exceptions/TestObjCExceptions.py (1122 of 1236) PASS: lldb-api :: commands/expression/call-function/TestCallStdStringFunction.py (1123 of 1236) PASS: lldb-shell :: SymbolFile/DWARF/DW_TAG_variable-DW_AT_const_value.s (1124 of 1236) PASS: lldb-api :: functionalities/data-formatter/nsdictionarysynth/TestNSDictionarySynthetic.py (1125 of 1236) UNSUPPORTED: lldb-api :: commands/expression/import-std-module/empty-module/TestEmptyStdModule.py (1126 of 1236) UNSUPPORTED: lldb-api :: linux/sepdebugsymlink/TestTargetSymbolsSepDebugSymlink.py (1127 of 1236) PASS: lldb-shell :: Settings/TestFrameFormatColor.test (1128 of 1236) PASS: lldb-api :: lang/cpp/typedef/TestCppTypedef.py (1129 of 1236) PASS: lldb-api :: commands/breakpoint/command/list/TestBreakpointCommandList.py (1130 of 1236) PASS: lldb-api :: commands/expression/persistent_types/TestPersistentTypes.py (1131 of 1236) PASS: lldb-api :: functionalities/thread/thread_exit/TestThreadExit.py (1132 of 1236) PASS: lldb-api :: python_api/value/linked_list/TestValueAPILinkedList.py (1133 of 1236) UNSUPPORTED: lldb-shell :: Driver/TestError.test (1134 of 1236) PASS: lldb-api :: commands/expression/top-level/TestTopLevelExprs.py (1135 of 1236) UNSUPPORTED: lldb-shell :: SymbolFile/DWARF/DW_TAG_GNU_call_site-DW_AT_low_pc.s (1136 of 1236) PASS: lldb-shell :: Process/UnsupportedLanguage.test (1137 of 1236) UNSUPPORTED: lldb-shell :: Quit/TestQuitExitCodeHexA.test (1138 of 1236) PASS: lldb-api :: python_api/sblaunchinfo/TestSBLaunchInfo.py (1139 of 1236) PASS: lldb-shell :: SymbolFile/DWARF/dir-separator-no-comp-dir.s (1140 of 1236) PASS: lldb-api :: commands/frame/language/TestGuessLanguage.py (1141 of 1236) UNSUPPORTED: lldb-shell :: ScriptInterpreter/Lua/command_script_import.test (1142 of 1236) PASS: lldb-api :: functionalities/data-formatter/data-formatter-stl/libcxx/multimap/TestDataFormatterLibccMultiMap.py (1143 of 1236) UNSUPPORTED: lldb-api :: lang/c/typedef/Testtypedef.py (1144 of 1236) PASS: lldb-api :: lang/objc/foundation/TestObjCMethodsNSArray.py (1145 of 1236) PASS: lldb-api :: functionalities/thread/concurrent_events/TestConcurrentWatchpointWithDelayWatchpointThreads.py (1146 of 1236) UNSUPPORTED: lldb-api :: functionalities/postmortem/netbsd-core/TestNetBSDCore.py (1147 of 1236) PASS: lldb-api :: functionalities/data-formatter/data-formatter-globals/TestDataFormatterGlobals.py (1148 of 1236) PASS: lldb-api :: lang/cpp/unsigned_types/TestUnsignedTypes.py (1149 of 1236) PASS: lldb-api :: functionalities/tail_call_frames/ambiguous_tail_call_seq2/TestAmbiguousTailCallSeq2.py (1150 of 1236) PASS: lldb-api :: functionalities/tail_call_frames/thread_step_out_message/TestArtificialFrameStepOutMessage.py (1151 of 1236) PASS: lldb-shell :: SymbolFile/DWARF/find-function-regex.cpp (1152 of 1236) PASS: lldb-api :: python_api/frame/TestFrames.py (1153 of 1236) PASS: lldb-api :: functionalities/optimized_code/TestNoASanExceptionAfterEvalOP_piece.py (1154 of 1236) PASS: lldb-shell :: Expr/TestMultilineExpr.test (1155 of 1236) PASS: lldb-api :: lang/objc/direct-dispatch-step/TestObjCDirectDispatchStepping.py (1156 of 1236) UNSUPPORTED: lldb-api :: functionalities/breakpoint/breakpoint_command/TestBreakpointCommandsFromPython.py (1157 of 1236) PASS: lldb-api :: lang/objcxx/hide-runtime-values/TestObjCXXHideRuntimeValues.py (1158 of 1236) PASS: lldb-shell :: SymbolFile/DWARF/dir-separator-no-comp-dir-relative-name.s (1159 of 1236) PASS: lldb-api :: functionalities/tsan/global_location/TestTsanGlobalLocation.py (1160 of 1236) PASS: lldb-api :: macosx/lc-note/firmware-corefile/TestFirmwareCorefiles.py (1161 of 1236) PASS: lldb-api :: functionalities/data-formatter/stringprinter/TestStringPrinter.py (1162 of 1236) UNSUPPORTED: lldb-shell :: Reproducer/TestFileRepro.test (1163 of 1236) UNSUPPORTED: lldb-shell :: SymbolFile/NativePDB/function-types-classes.cpp (1164 of 1236) PASS: lldb-shell :: ObjectFile/ELF/avr-basic-info.yaml (1165 of 1236) PASS: lldb-api :: functionalities/type_lookup/TestTypeLookup.py (1166 of 1236) PASS: lldb-api :: commands/expression/unicode-in-variable/TestUnicodeInVariable.py (1167 of 1236) PASS: lldb-shell :: Settings/TestDisassemblyFormat.test (1168 of 1236) PASS: lldb-api :: lang/cpp/chained-calls/TestCppChainedCalls.py (1169 of 1236) UNSUPPORTED: lldb-api :: tools/lldb-vscode/variables/TestVSCode_variables.py (1170 of 1236) PASS: lldb-api :: commands/expression/ir-interpreter-phi-nodes/TestIRInterpreterPHINodes.py (1171 of 1236) PASS: lldb-api :: lang/objc/foundation/TestObjCMethods.py (1172 of 1236) PASS: lldb-api :: commands/expression/persistent_types/TestNestedPersistentTypes.py (1173 of 1236) UNSUPPORTED: lldb-api :: commands/command/script/TestCommandScript.py (1174 of 1236) PASS: lldb-shell :: SymbolFile/DWARF/dir-separator-windows.s (1175 of 1236) PASS: lldb-shell :: SymbolFile/Breakpad/unwind-via-stack-win-no-memory-info.yaml (1176 of 1236) PASS: lldb-api :: functionalities/exec/TestExec.py (1177 of 1236) PASS: lldb-api :: lang/cpp/global_operators/TestCppGlobalOperators.py (1178 of 1236) UNSUPPORTED: lldb-api :: iohandler/resize/TestIOHandlerResizeNoEditline.py (1179 of 1236) PASS: lldb-api :: lang/cpp/incomplete-types/TestCppIncompleteTypes.py (1180 of 1236) PASS: lldb-api :: api/multithreaded/TestMultithreaded.py (1181 of 1236) PASS: lldb-api :: functionalities/data-formatter/typedef_array/TestTypedefArray.py (1182 of 1236) PASS: lldb-api :: tools/lldb-server/TestGdbRemote_vCont.py (1183 of 1236) PASS: lldb-api :: source-manager/TestSourceManager.py (1184 of 1236) UNSUPPORTED: lldb-api :: functionalities/process_group/TestChangeProcessGroup.py (1185 of 1236) UNSUPPORTED: lldb-shell :: Register/x86-64-ymm16-read.test (1186 of 1236) PASS: lldb-shell :: ScriptInterpreter/None/import_module.test (1187 of 1236) PASS: lldb-api :: functionalities/show_location/TestShowLocationDwarf5.py (1188 of 1236) PASS: lldb-api :: commands/expression/anonymous-struct/TestCallUserAnonTypedef.py (1189 of 1236) PASS: lldb-api :: lang/objc/modules-cache/TestClangModulesCache.py (1190 of 1236) PASS: lldb-api :: lang/objc/objc-property/TestObjCProperty.py (1191 of 1236) UNSUPPORTED: lldb-api :: arm/breakpoint-it/TestBreakpointIt.py (1192 of 1236) UNSUPPORTED: lldb-api :: commands/expression/import-std-module/list-dbg-info-content/TestDbgInfoContentListFromStdModule.py (1193 of 1236) PASS: lldb-api :: functionalities/postmortem/elf-core/TestLinuxCore.py (1194 of 1236) PASS: lldb-api :: tools/lldb-server/TestGdbRemote_qThreadStopInfo.py (1195 of 1236) PASS: lldb-api :: functionalities/thread/concurrent_events/TestConcurrentDelayedCrashWithBreakpointSignal.py (1196 of 1236) PASS: lldb-shell :: ObjectFile/MachO/lc_version_min.yaml (1197 of 1236) PASS: lldb-shell :: SymbolFile/DWARF/find-basic-namespace.cpp (1198 of 1236) UNSUPPORTED: lldb-api :: commands/expression/import-std-module/pair/TestPairFromStdModule.py (1199 of 1236) PASS: lldb-api :: commands/watchpoints/watchpoint_commands/TestWatchpointCommands.py (1200 of 1236) UNSUPPORTED: lldb-shell :: SymbolFile/PDB/variables.test (1201 of 1236) PASS: lldb-api :: functionalities/tail_call_frames/disambiguate_paths_to_common_sink/TestDisambiguatePathsToCommonSink.py (1202 of 1236) UNSUPPORTED: lldb-shell :: ObjectFile/ELF/minidebuginfo-no-lzma.yaml (1203 of 1236) UNSUPPORTED: lldb-shell :: SymbolFile/NativePDB/s_constant.cpp (1204 of 1236) PASS: lldb-shell :: ObjectFile/PECOFF/dep-modules.yaml (1205 of 1236) PASS: lldb-api :: lang/cpp/diamond/TestDiamond.py (1206 of 1236) PASS: lldb-shell :: ObjectFile/ELF/section-overlap.yaml (1207 of 1236) PASS: lldb-api :: functionalities/breakpoint/source_regexp/TestSourceRegexBreakpoints.py (1208 of 1236) UNSUPPORTED: lldb-api :: commands/target/auto-install-main-executable/TestAutoInstallMainExecutable.py (1209 of 1236) PASS: lldb-shell :: Settings/TestEchoCommands.test (1210 of 1236) PASS: lldb-shell :: ObjectFile/ELF/section-permissions.yaml (1211 of 1236) PASS: lldb-api :: lang/cpp/overloaded-functions/TestOverloadedFunctions.py (1212 of 1236) PASS: lldb-api :: functionalities/breakpoint/global_constructor/TestBreakpointInGlobalConstructor.py (1213 of 1236) PASS: lldb-api :: functionalities/data-formatter/data-formatter-stl/libcxx/string/TestDataFormatterLibcxxString.py (1214 of 1236) PASS: lldb-api :: commands/expression/vector_of_enums/TestVectorOfEnums.py (1215 of 1236) PASS: lldb-api :: lang/cpp/type_lookup/TestCppTypeLookup.py (1216 of 1236) PASS: lldb-shell :: Driver/TestTarget.test (1217 of 1236) PASS: lldb-shell :: ObjectFile/PECOFF/disassemble-thumb.yaml (1218 of 1236) PASS: lldb-api :: functionalities/thread/concurrent_events/TestConcurrentSignalDelayWatch.py (1219 of 1236) PASS: lldb-api :: macosx/DBGSourcePathRemapping/TestDSYMSourcePathRemapping.py (1220 of 1236) XFAIL: lldb-shell :: Register/x86-mm-xmm-read.test (1221 of 1236) PASS: lldb-api :: functionalities/data-formatter/data-formatter-stl/libcxx/initializerlist/TestInitializerList.py (1222 of 1236) PASS: lldb-api :: lang/objc/objc++/TestObjCXX.py (1223 of 1236) PASS: lldb-api :: python_api/sbvalue_persist/TestSBValuePersist.py (1224 of 1236) PASS: lldb-api :: macosx/dyld-trie-symbols/TestDyldTrieSymbols.py (1225 of 1236) PASS: lldb-api :: functionalities/data-formatter/boolreference/TestFormattersBoolRefPtr.py (1226 of 1236) PASS: lldb-api :: lang/cpp/thread_local/TestThreadLocal.py (1227 of 1236) PASS: lldb-api :: functionalities/inferior-crashing/TestInferiorCrashing.py (1228 of 1236) PASS: lldb-api :: functionalities/data-formatter/data-formatter-stl/libcxx/vbool/TestDataFormatterLibcxxVBool.py (1229 of 1236) PASS: lldb-api :: functionalities/gdb_remote_client/TestStopPCs.py (1230 of 1236) PASS: lldb-api :: functionalities/process_crash_info/TestProcessCrashInfo.py (1231 of 1236) PASS: lldb-api :: lang/objc/forward-decl/TestForwardDecl.py (1232 of 1236) PASS: lldb-api :: lang/objc/foundation/TestObjCMethodsString.py (1233 of 1236) PASS: lldb-api :: python_api/target/TestTargetAPI.py (1234 of 1236) PASS: lldb-api :: functionalities/inferior-assert/TestInferiorAssert.py (1235 of 1236) PASS: lldb-api :: lang/objc/hidden-ivars/TestHiddenIvars.py (1236 of 1236) Slowest Tests: -------------------------------------------------------------------------- 119.87s: lldb-api :: tools/lldb-server/TestLldbGdbServer.py 83.50s: lldb-api :: lang/objc/foundation/TestFoundationDisassembly.py 67.65s: lldb-api :: lang/objc/foundation/TestObjCMethods.py 62.57s: lldb-api :: lang/objc/exceptions/TestObjCExceptions.py 61.18s: lldb-api :: api/multithreaded/TestMultithreaded.py 52.74s: lldb-api :: types/TestLongTypesExpr.py 51.86s: lldb-api :: lang/cpp/namespace/TestNamespaceLookup.py 51.85s: lldb-api :: lang/objc/objc-new-syntax/TestObjCNewSyntaxLiteral.py 46.61s: lldb-api :: functionalities/completion/TestCompletion.py 43.82s: lldb-api :: lang/objc/real-definition/TestRealDefinition.py 42.29s: lldb-api :: types/TestLongTypes.py 39.59s: lldb-api :: lang/objc/objc-new-syntax/TestObjCNewSyntaxArray.py 38.44s: lldb-api :: lang/objc/objc-new-syntax/TestObjCNewSyntaxDictionary.py 37.20s: lldb-api :: lang/objc/foundation/TestObjCMethodsNSError.py 33.69s: lldb-api :: types/TestIntegerTypeExpr.py 33.21s: lldb-api :: tools/lldb-server/TestGdbRemoteThreadsInStopReply.py 32.84s: lldb-api :: lang/objc/foundation/TestObjCMethodsString.py 31.94s: lldb-api :: lang/objc/hidden-ivars/TestHiddenIvars.py 28.71s: lldb-api :: python_api/lldbutil/iter/TestLLDBIterator.py 28.21s: lldb-api :: lang/objc/conflicting-definition/TestConflictingDefinition.py

Hide Details

Tests Times: -------------------------------------------------------------------------- [ Range ] :: [ Percentage ] :: [ Count ] -------------------------------------------------------------------------- [110s,120s) :: [ ] :: [ 1/1236] [100s,110s) :: [ ] :: [ 0/1236] [ 90s,100s) :: [ ] :: [ 0/1236] [ 80s, 90s) :: [ ] :: [ 1/1236] [ 70s, 80s) :: [ ] :: [ 0/1236] [ 60s, 70s) :: [ ] :: [ 3/1236] [ 50s, 60s) :: [ ] :: [ 3/1236] [ 40s, 50s) :: [ ] :: [ 3/1236] [ 30s, 40s) :: [ ] :: [ 7/1236] [ 20s, 30s) :: [ ] :: [ 21/1236] [ 10s, 20s) :: [**** ] :: [ 136/1236] [ 0s, 10s) :: [********************************** ] :: [1061/1236] -------------------------------------------------------------------------- ******************** Failed Tests (1): lldb-api :: commands/target/stop-hooks/TestStopHookScripted.py

Hide Details

Hide Details

Testing Time: 382.95s Unsupported : 298 Passed : 931 Expectedly Failed: 6 Failed : 1 FAILED: tools/lldb/test/CMakeFiles/check-lldb-reproducers-capture cd /Users/buildslave/jenkins/workspace/lldb-cmake-reproducers/lldb-build/tools/lldb/test && /usr/local/Frameworks/Python.framework/Versions/3.7/bin/python3.7 /Users/buildslave/jenkins/workspace/lldb-cmake-reproducers/lldb-build/./bin/llvm-lit -v --time-tests --shuffle --xunit-xml-output=/Users/buildslave/jenkins/workspace/lldb-cmake-reproducers/test/results.xml -v --param lldb-run-with-repro=capture /Users/buildslave/jenkins/workspace/lldb-cmake-reproducers/lldb-build/tools/lldb/test/API /Users/buildslave/jenkins/workspace/lldb-cmake-reproducers/lldb-build/tools/lldb/test/Shell ninja: build stopped: cannot make progress due to previous errors. Command failed: Command '['/usr/local/bin/ninja', '-k', '0', '-v', 'check-lldb-reproducers']' returned non-zero exit status 1. Command: ['/usr/local/bin/ninja', '-k', '0', '-v', 'check-lldb-reproducers'] [Pipeline] } [Pipeline] // timeout [Pipeline] } [Pipeline] // stage [Pipeline] stage [Pipeline] { (Declarative: Post Actions) [Pipeline] scanForIssues [Clang (LLVM based)] Sleeping for 5 seconds due to JENKINS-32191... [Clang (LLVM based)] Parsing console log (workspace: '/Users/buildslave/jenkins/workspace/lldb-cmake-reproducers') [Clang (LLVM based)] Successfully parsed console log [Clang (LLVM based)] -> found 8 issues (skipped 10 duplicates) [Clang (LLVM based)] Post processing issues on 'green-dragon-23' with source code encoding 'UTF-8' [Clang (LLVM based)] Creating SCM blamer to obtain author and commit information for affected files [Clang (LLVM based)] Creating SCM miner to obtain statistics for affected repository files [Clang (LLVM based)] Resolving file names for all issues in source directory '/Users/buildslave/jenkins/workspace/lldb-cmake-reproducers' [Clang (LLVM based)] -> resolved paths in source directory (6 found, 0 not found) [Clang (LLVM based)] Resolving module names from module definitions (build.xml, pom.xml, or Manifest.mf files) [Clang (LLVM based)] -> resolved module names for 8 issues [Clang (LLVM based)] Resolving package names (or namespaces) by parsing the affected files [Clang (LLVM based)] -> resolved package names of 6 affected files [Clang (LLVM based)] No filter has been set, publishing all 8 issues [Clang (LLVM based)] Creating fingerprints for all affected code blocks to track issues over different builds [Clang (LLVM based)] -> created fingerprints for 8 issues (skipped 0 issues) [Clang (LLVM based)] Copying affected files to Jenkins' build folder '/Users/Shared/Jenkins/Home/jobs/lldb-cmake-reproducers/builds/336/files-with-issues' [Clang (LLVM based)] -> 4 copied, 2 not in workspace, 0 not-found, 0 with I/O error [Pipeline] junit Recording test results [Pipeline] } [Pipeline] // stage [Pipeline] } [Pipeline] // withEnv [Pipeline] } [Pipeline] // node [Pipeline] End of Pipeline ERROR: script returned exit code 1 Finished: FAILURE