FailedConsole Output

Skipping 10,193 KB.. Full Log
-stage2-Rthinlto/llvm-project/compiler-rt/test/fuzzer/merge.test --check-prefix=CHECK2
: 'RUN: at line 28';    /Users/buildslave/jenkins/workspace/clang-stage2-Rthinlto/clang-build/Build/tools/clang/runtime/compiler-rt-bins/test/fuzzer/X86_64DefaultDarwinConfig/Output/merge.test.tmp-FullCoverageSetTest         -merge=1 /Users/buildslave/jenkins/workspace/clang-stage2-Rthinlto/clang-build/Build/tools/clang/runtime/compiler-rt-bins/test/fuzzer/X86_64DefaultDarwinConfig/Output/merge.test.tmp/T1 /Users/buildslave/jenkins/workspace/clang-stage2-Rthinlto/clang-build/Build/tools/clang/runtime/compiler-rt-bins/test/fuzzer/X86_64DefaultDarwinConfig/Output/merge.test.tmp/T2 2>&1 | FileCheck /Users/buildslave/jenkins/workspace/clang-stage2-Rthinlto/llvm-project/compiler-rt/test/fuzzer/merge.test --check-prefix=CHECK3
: 'RUN: at line 33';   rm /Users/buildslave/jenkins/workspace/clang-stage2-Rthinlto/clang-build/Build/tools/clang/runtime/compiler-rt-bins/test/fuzzer/X86_64DefaultDarwinConfig/Output/merge.test.tmp/T1/*
: 'RUN: at line 34';   cp /Users/buildslave/jenkins/workspace/clang-stage2-Rthinlto/clang-build/Build/tools/clang/runtime/compiler-rt-bins/test/fuzzer/X86_64DefaultDarwinConfig/Output/merge.test.tmp/T0/* /Users/buildslave/jenkins/workspace/clang-stage2-Rthinlto/clang-build/Build/tools/clang/runtime/compiler-rt-bins/test/fuzzer/X86_64DefaultDarwinConfig/Output/merge.test.tmp/T1/
: 'RUN: at line 35';   echo looooooooong > /Users/buildslave/jenkins/workspace/clang-stage2-Rthinlto/clang-build/Build/tools/clang/runtime/compiler-rt-bins/test/fuzzer/X86_64DefaultDarwinConfig/Output/merge.test.tmp/T2/looooooooong
: 'RUN: at line 36';    /Users/buildslave/jenkins/workspace/clang-stage2-Rthinlto/clang-build/Build/tools/clang/runtime/compiler-rt-bins/test/fuzzer/X86_64DefaultDarwinConfig/Output/merge.test.tmp-FullCoverageSetTest         -merge=1 /Users/buildslave/jenkins/workspace/clang-stage2-Rthinlto/clang-build/Build/tools/clang/runtime/compiler-rt-bins/test/fuzzer/X86_64DefaultDarwinConfig/Output/merge.test.tmp/T1 /Users/buildslave/jenkins/workspace/clang-stage2-Rthinlto/clang-build/Build/tools/clang/runtime/compiler-rt-bins/test/fuzzer/X86_64DefaultDarwinConfig/Output/merge.test.tmp/T2 -max_len=6 2>&1 | FileCheck /Users/buildslave/jenkins/workspace/clang-stage2-Rthinlto/llvm-project/compiler-rt/test/fuzzer/merge.test --check-prefix=MAX_LEN
: 'RUN: at line 40';   rm /Users/buildslave/jenkins/workspace/clang-stage2-Rthinlto/clang-build/Build/tools/clang/runtime/compiler-rt-bins/test/fuzzer/X86_64DefaultDarwinConfig/Output/merge.test.tmp/T1/*
: 'RUN: at line 41';   cp /Users/buildslave/jenkins/workspace/clang-stage2-Rthinlto/clang-build/Build/tools/clang/runtime/compiler-rt-bins/test/fuzzer/X86_64DefaultDarwinConfig/Output/merge.test.tmp/T0/* /Users/buildslave/jenkins/workspace/clang-stage2-Rthinlto/clang-build/Build/tools/clang/runtime/compiler-rt-bins/test/fuzzer/X86_64DefaultDarwinConfig/Output/merge.test.tmp/T1/
: 'RUN: at line 42';   rm -f /Users/buildslave/jenkins/workspace/clang-stage2-Rthinlto/clang-build/Build/tools/clang/runtime/compiler-rt-bins/test/fuzzer/X86_64DefaultDarwinConfig/Output/merge.test.tmp/MCF
: 'RUN: at line 43';    /Users/buildslave/jenkins/workspace/clang-stage2-Rthinlto/clang-build/Build/tools/clang/runtime/compiler-rt-bins/test/fuzzer/X86_64DefaultDarwinConfig/Output/merge.test.tmp-FullCoverageSetTest -merge=1 -merge_control_file=/Users/buildslave/jenkins/workspace/clang-stage2-Rthinlto/clang-build/Build/tools/clang/runtime/compiler-rt-bins/test/fuzzer/X86_64DefaultDarwinConfig/Output/merge.test.tmp/MCF /Users/buildslave/jenkins/workspace/clang-stage2-Rthinlto/clang-build/Build/tools/clang/runtime/compiler-rt-bins/test/fuzzer/X86_64DefaultDarwinConfig/Output/merge.test.tmp/T1 /Users/buildslave/jenkins/workspace/clang-stage2-Rthinlto/clang-build/Build/tools/clang/runtime/compiler-rt-bins/test/fuzzer/X86_64DefaultDarwinConfig/Output/merge.test.tmp/T2 2>&1 | FileCheck /Users/buildslave/jenkins/workspace/clang-stage2-Rthinlto/llvm-project/compiler-rt/test/fuzzer/merge.test --check-prefix=MCF
: 'RUN: at line 44';   grep STARTED /Users/buildslave/jenkins/workspace/clang-stage2-Rthinlto/clang-build/Build/tools/clang/runtime/compiler-rt-bins/test/fuzzer/X86_64DefaultDarwinConfig/Output/merge.test.tmp/MCF
: 'RUN: at line 45';   grep FT /Users/buildslave/jenkins/workspace/clang-stage2-Rthinlto/clang-build/Build/tools/clang/runtime/compiler-rt-bins/test/fuzzer/X86_64DefaultDarwinConfig/Output/merge.test.tmp/MCF
: 'RUN: at line 51';   rm /Users/buildslave/jenkins/workspace/clang-stage2-Rthinlto/clang-build/Build/tools/clang/runtime/compiler-rt-bins/test/fuzzer/X86_64DefaultDarwinConfig/Output/merge.test.tmp/T1/*
: 'RUN: at line 52';   cp /Users/buildslave/jenkins/workspace/clang-stage2-Rthinlto/clang-build/Build/tools/clang/runtime/compiler-rt-bins/test/fuzzer/X86_64DefaultDarwinConfig/Output/merge.test.tmp/T0/* /Users/buildslave/jenkins/workspace/clang-stage2-Rthinlto/clang-build/Build/tools/clang/runtime/compiler-rt-bins/test/fuzzer/X86_64DefaultDarwinConfig/Output/merge.test.tmp/T1/
: 'RUN: at line 53';   echo 'FUZZER' > /Users/buildslave/jenkins/workspace/clang-stage2-Rthinlto/clang-build/Build/tools/clang/runtime/compiler-rt-bins/test/fuzzer/X86_64DefaultDarwinConfig/Output/merge.test.tmp/T2/FUZZER
: 'RUN: at line 54';    /Users/buildslave/jenkins/workspace/clang-stage2-Rthinlto/clang-build/Build/tools/clang/runtime/compiler-rt-bins/test/fuzzer/X86_64DefaultDarwinConfig/Output/merge.test.tmp-FullCoverageSetTest -merge=1 /Users/buildslave/jenkins/workspace/clang-stage2-Rthinlto/clang-build/Build/tools/clang/runtime/compiler-rt-bins/test/fuzzer/X86_64DefaultDarwinConfig/Output/merge.test.tmp/T1 /Users/buildslave/jenkins/workspace/clang-stage2-Rthinlto/clang-build/Build/tools/clang/runtime/compiler-rt-bins/test/fuzzer/X86_64DefaultDarwinConfig/Output/merge.test.tmp/T2 2>&1 | FileCheck /Users/buildslave/jenkins/workspace/clang-stage2-Rthinlto/llvm-project/compiler-rt/test/fuzzer/merge.test --check-prefix=MERGE_WITH_CRASH
: 'RUN: at line 59';   rm /Users/buildslave/jenkins/workspace/clang-stage2-Rthinlto/clang-build/Build/tools/clang/runtime/compiler-rt-bins/test/fuzzer/X86_64DefaultDarwinConfig/Output/merge.test.tmp/T1/* /Users/buildslave/jenkins/workspace/clang-stage2-Rthinlto/clang-build/Build/tools/clang/runtime/compiler-rt-bins/test/fuzzer/X86_64DefaultDarwinConfig/Output/merge.test.tmp/T2/*
: 'RUN: at line 60';   echo 'FUZZER' > /Users/buildslave/jenkins/workspace/clang-stage2-Rthinlto/clang-build/Build/tools/clang/runtime/compiler-rt-bins/test/fuzzer/X86_64DefaultDarwinConfig/Output/merge.test.tmp/T2/FUZZER
: 'RUN: at line 61';    /Users/buildslave/jenkins/workspace/clang-stage2-Rthinlto/clang-build/Build/tools/clang/runtime/compiler-rt-bins/test/fuzzer/X86_64DefaultDarwinConfig/Output/merge.test.tmp-FullCoverageSetTest -merge=1 /Users/buildslave/jenkins/workspace/clang-stage2-Rthinlto/clang-build/Build/tools/clang/runtime/compiler-rt-bins/test/fuzzer/X86_64DefaultDarwinConfig/Output/merge.test.tmp/T1 /Users/buildslave/jenkins/workspace/clang-stage2-Rthinlto/clang-build/Build/tools/clang/runtime/compiler-rt-bins/test/fuzzer/X86_64DefaultDarwinConfig/Output/merge.test.tmp/T2  -max_len=5 2>&1 | FileCheck /Users/buildslave/jenkins/workspace/clang-stage2-Rthinlto/llvm-project/compiler-rt/test/fuzzer/merge.test --check-prefix=MERGE_LEN5
: 'RUN: at line 62';   not grep FUZZER /Users/buildslave/jenkins/workspace/clang-stage2-Rthinlto/clang-build/Build/tools/clang/runtime/compiler-rt-bins/test/fuzzer/X86_64DefaultDarwinConfig/Output/merge.test.tmp/T1/*
: 'RUN: at line 63';   grep FUZZE /Users/buildslave/jenkins/workspace/clang-stage2-Rthinlto/clang-build/Build/tools/clang/runtime/compiler-rt-bins/test/fuzzer/X86_64DefaultDarwinConfig/Output/merge.test.tmp/T1/*
--
Exit Code: 137

Hide Details

Command Output (stderr): -- /Users/buildslave/jenkins/workspace/clang-stage2-Rthinlto/clang-build/Build/tools/clang/runtime/compiler-rt-bins/test/fuzzer/X86_64DefaultDarwinConfig/Output/merge.test.script: line 35: 18751 Done /Users/buildslave/jenkins/workspace/clang-stage2-Rthinlto/clang-build/Build/tools/clang/runtime/compiler-rt-bins/test/fuzzer/X86_64DefaultDarwinConfig/Output/merge.test.tmp-FullCoverageSetTest -merge=1 /Users/buildslave/jenkins/workspace/clang-stage2-Rthinlto/clang-build/Build/tools/clang/runtime/compiler-rt-bins/test/fuzzer/X86_64DefaultDarwinConfig/Output/merge.test.tmp/T1 /Users/buildslave/jenkins/workspace/clang-stage2-Rthinlto/clang-build/Build/tools/clang/runtime/compiler-rt-bins/test/fuzzer/X86_64DefaultDarwinConfig/Output/merge.test.tmp/T2 2>&1 18752 Killed: 9 | FileCheck /Users/buildslave/jenkins/workspace/clang-stage2-Rthinlto/llvm-project/compiler-rt/test/fuzzer/merge.test --check-prefix=CHECK1

Hide Details

--

Hide Details

******************** FAIL: libFuzzer :: merge_two_step.test (2904 of 2953) ******************** TEST 'libFuzzer :: merge_two_step.test' FAILED ******************** Script: -- : 'RUN: at line 1'; /Users/buildslave/jenkins/workspace/clang-stage2-Rthinlto/clang-build/Build/./bin/clang --driver-mode=g++ -O2 -gline-tables-only -fsanitize=address,fuzzer -I/Users/buildslave/jenkins/workspace/clang-stage2-Rthinlto/llvm-project/compiler-rt/lib/fuzzer -arch x86_64 -stdlib=libc++ -mmacosx-version-min=10.10 -isysroot /Applications/Xcode.app/Contents/Developer/Platforms/MacOSX.platform/Developer/SDKs/MacOSX10.14.sdk /Users/buildslave/jenkins/workspace/clang-stage2-Rthinlto/llvm-project/compiler-rt/test/fuzzer/FullCoverageSetTest.cpp -o /Users/buildslave/jenkins/workspace/clang-stage2-Rthinlto/clang-build/Build/tools/clang/runtime/compiler-rt-bins/test/fuzzer/X86_64DefaultDarwinConfig/Output/merge_two_step.test.tmp-FullCoverageSetTest : 'RUN: at line 3'; rm -rf /Users/buildslave/jenkins/workspace/clang-stage2-Rthinlto/clang-build/Build/tools/clang/runtime/compiler-rt-bins/test/fuzzer/X86_64DefaultDarwinConfig/Output/merge_two_step.test.tmp/T0 /Users/buildslave/jenkins/workspace/clang-stage2-Rthinlto/clang-build/Build/tools/clang/runtime/compiler-rt-bins/test/fuzzer/X86_64DefaultDarwinConfig/Output/merge_two_step.test.tmp/T1 /Users/buildslave/jenkins/workspace/clang-stage2-Rthinlto/clang-build/Build/tools/clang/runtime/compiler-rt-bins/test/fuzzer/X86_64DefaultDarwinConfig/Output/merge_two_step.test.tmp/T2 : 'RUN: at line 4'; mkdir -p /Users/buildslave/jenkins/workspace/clang-stage2-Rthinlto/clang-build/Build/tools/clang/runtime/compiler-rt-bins/test/fuzzer/X86_64DefaultDarwinConfig/Output/merge_two_step.test.tmp/T0 /Users/buildslave/jenkins/workspace/clang-stage2-Rthinlto/clang-build/Build/tools/clang/runtime/compiler-rt-bins/test/fuzzer/X86_64DefaultDarwinConfig/Output/merge_two_step.test.tmp/T1 /Users/buildslave/jenkins/workspace/clang-stage2-Rthinlto/clang-build/Build/tools/clang/runtime/compiler-rt-bins/test/fuzzer/X86_64DefaultDarwinConfig/Output/merge_two_step.test.tmp/T2 : 'RUN: at line 5'; echo F..... > /Users/buildslave/jenkins/workspace/clang-stage2-Rthinlto/clang-build/Build/tools/clang/runtime/compiler-rt-bins/test/fuzzer/X86_64DefaultDarwinConfig/Output/merge_two_step.test.tmp/T1/1 : 'RUN: at line 6'; echo .U.... > /Users/buildslave/jenkins/workspace/clang-stage2-Rthinlto/clang-build/Build/tools/clang/runtime/compiler-rt-bins/test/fuzzer/X86_64DefaultDarwinConfig/Output/merge_two_step.test.tmp/T1/2 : 'RUN: at line 7'; echo ..Z... > /Users/buildslave/jenkins/workspace/clang-stage2-Rthinlto/clang-build/Build/tools/clang/runtime/compiler-rt-bins/test/fuzzer/X86_64DefaultDarwinConfig/Output/merge_two_step.test.tmp/T1/3 : 'RUN: at line 10'; rm -f /Users/buildslave/jenkins/workspace/clang-stage2-Rthinlto/clang-build/Build/tools/clang/runtime/compiler-rt-bins/test/fuzzer/X86_64DefaultDarwinConfig/Output/merge_two_step.test.tmp/MCF : 'RUN: at line 11'; /Users/buildslave/jenkins/workspace/clang-stage2-Rthinlto/clang-build/Build/tools/clang/runtime/compiler-rt-bins/test/fuzzer/X86_64DefaultDarwinConfig/Output/merge_two_step.test.tmp-FullCoverageSetTest -merge=1 -merge_control_file=/Users/buildslave/jenkins/workspace/clang-stage2-Rthinlto/clang-build/Build/tools/clang/runtime/compiler-rt-bins/test/fuzzer/X86_64DefaultDarwinConfig/Output/merge_two_step.test.tmp/MCF /Users/buildslave/jenkins/workspace/clang-stage2-Rthinlto/clang-build/Build/tools/clang/runtime/compiler-rt-bins/test/fuzzer/X86_64DefaultDarwinConfig/Output/merge_two_step.test.tmp/T0 /Users/buildslave/jenkins/workspace/clang-stage2-Rthinlto/clang-build/Build/tools/clang/runtime/compiler-rt-bins/test/fuzzer/X86_64DefaultDarwinConfig/Output/merge_two_step.test.tmp/T1 2>&1 | FileCheck /Users/buildslave/jenkins/workspace/clang-stage2-Rthinlto/llvm-project/compiler-rt/test/fuzzer/merge_two_step.test --check-prefix=CHECK1 : 'RUN: at line 15'; echo ...Z.. > /Users/buildslave/jenkins/workspace/clang-stage2-Rthinlto/clang-build/Build/tools/clang/runtime/compiler-rt-bins/test/fuzzer/X86_64DefaultDarwinConfig/Output/merge_two_step.test.tmp/T2/1 : 'RUN: at line 16'; echo ....E. > /Users/buildslave/jenkins/workspace/clang-stage2-Rthinlto/clang-build/Build/tools/clang/runtime/compiler-rt-bins/test/fuzzer/X86_64DefaultDarwinConfig/Output/merge_two_step.test.tmp/T2/2 : 'RUN: at line 17'; echo .....R > /Users/buildslave/jenkins/workspace/clang-stage2-Rthinlto/clang-build/Build/tools/clang/runtime/compiler-rt-bins/test/fuzzer/X86_64DefaultDarwinConfig/Output/merge_two_step.test.tmp/T2/3 : 'RUN: at line 18'; echo F..... > /Users/buildslave/jenkins/workspace/clang-stage2-Rthinlto/clang-build/Build/tools/clang/runtime/compiler-rt-bins/test/fuzzer/X86_64DefaultDarwinConfig/Output/merge_two_step.test.tmp/T2/a : 'RUN: at line 20'; rm -rf /Users/buildslave/jenkins/workspace/clang-stage2-Rthinlto/clang-build/Build/tools/clang/runtime/compiler-rt-bins/test/fuzzer/X86_64DefaultDarwinConfig/Output/merge_two_step.test.tmp/T0 : 'RUN: at line 21'; mkdir -p /Users/buildslave/jenkins/workspace/clang-stage2-Rthinlto/clang-build/Build/tools/clang/runtime/compiler-rt-bins/test/fuzzer/X86_64DefaultDarwinConfig/Output/merge_two_step.test.tmp/T0 : 'RUN: at line 24'; /Users/buildslave/jenkins/workspace/clang-stage2-Rthinlto/clang-build/Build/tools/clang/runtime/compiler-rt-bins/test/fuzzer/X86_64DefaultDarwinConfig/Output/merge_two_step.test.tmp-FullCoverageSetTest -merge=1 -merge_control_file=/Users/buildslave/jenkins/workspace/clang-stage2-Rthinlto/clang-build/Build/tools/clang/runtime/compiler-rt-bins/test/fuzzer/X86_64DefaultDarwinConfig/Output/merge_two_step.test.tmp/MCF /Users/buildslave/jenkins/workspace/clang-stage2-Rthinlto/clang-build/Build/tools/clang/runtime/compiler-rt-bins/test/fuzzer/X86_64DefaultDarwinConfig/Output/merge_two_step.test.tmp/T0 /Users/buildslave/jenkins/workspace/clang-stage2-Rthinlto/clang-build/Build/tools/clang/runtime/compiler-rt-bins/test/fuzzer/X86_64DefaultDarwinConfig/Output/merge_two_step.test.tmp/T1 /Users/buildslave/jenkins/workspace/clang-stage2-Rthinlto/clang-build/Build/tools/clang/runtime/compiler-rt-bins/test/fuzzer/X86_64DefaultDarwinConfig/Output/merge_two_step.test.tmp/T2 2>&1 | FileCheck /Users/buildslave/jenkins/workspace/clang-stage2-Rthinlto/llvm-project/compiler-rt/test/fuzzer/merge_two_step.test --check-prefix=CHECK2 -- Exit Code: 137

Hide Details

Command Output (stderr): -- /Users/buildslave/jenkins/workspace/clang-stage2-Rthinlto/clang-build/Build/tools/clang/runtime/compiler-rt-bins/test/fuzzer/X86_64DefaultDarwinConfig/Output/merge_two_step.test.script: line 15: 18771 Done /Users/buildslave/jenkins/workspace/clang-stage2-Rthinlto/clang-build/Build/tools/clang/runtime/compiler-rt-bins/test/fuzzer/X86_64DefaultDarwinConfig/Output/merge_two_step.test.tmp-FullCoverageSetTest -merge=1 -merge_control_file=/Users/buildslave/jenkins/workspace/clang-stage2-Rthinlto/clang-build/Build/tools/clang/runtime/compiler-rt-bins/test/fuzzer/X86_64DefaultDarwinConfig/Output/merge_two_step.test.tmp/MCF /Users/buildslave/jenkins/workspace/clang-stage2-Rthinlto/clang-build/Build/tools/clang/runtime/compiler-rt-bins/test/fuzzer/X86_64DefaultDarwinConfig/Output/merge_two_step.test.tmp/T0 /Users/buildslave/jenkins/workspace/clang-stage2-Rthinlto/clang-build/Build/tools/clang/runtime/compiler-rt-bins/test/fuzzer/X86_64DefaultDarwinConfig/Output/merge_two_step.test.tmp/T1 2>&1 18772 Killed: 9 | FileCheck /Users/buildslave/jenkins/workspace/clang-stage2-Rthinlto/llvm-project/compiler-rt/test/fuzzer/merge_two_step.test --check-prefix=CHECK1

Hide Details

--

Hide Details

******************** FAIL: libFuzzer :: minimize_two_crashes.test (2905 of 2953) ******************** TEST 'libFuzzer :: minimize_two_crashes.test' FAILED ******************** Script: -- : 'RUN: at line 5'; /Users/buildslave/jenkins/workspace/clang-stage2-Rthinlto/clang-build/Build/./bin/clang --driver-mode=g++ -O2 -gline-tables-only -fsanitize=address,fuzzer -I/Users/buildslave/jenkins/workspace/clang-stage2-Rthinlto/llvm-project/compiler-rt/lib/fuzzer -arch x86_64 -stdlib=libc++ -mmacosx-version-min=10.10 -isysroot /Applications/Xcode.app/Contents/Developer/Platforms/MacOSX.platform/Developer/SDKs/MacOSX10.14.sdk -O0 /Users/buildslave/jenkins/workspace/clang-stage2-Rthinlto/llvm-project/compiler-rt/test/fuzzer/TwoDifferentBugsTest.cpp -o /Users/buildslave/jenkins/workspace/clang-stage2-Rthinlto/clang-build/Build/tools/clang/runtime/compiler-rt-bins/test/fuzzer/X86_64DefaultDarwinConfig/Output/minimize_two_crashes.test.tmp-TwoDifferentBugsTest : 'RUN: at line 7'; rm -rf /Users/buildslave/jenkins/workspace/clang-stage2-Rthinlto/clang-build/Build/tools/clang/runtime/compiler-rt-bins/test/fuzzer/X86_64DefaultDarwinConfig/Output/minimize_two_crashes.test.tmp && mkdir /Users/buildslave/jenkins/workspace/clang-stage2-Rthinlto/clang-build/Build/tools/clang/runtime/compiler-rt-bins/test/fuzzer/X86_64DefaultDarwinConfig/Output/minimize_two_crashes.test.tmp : 'RUN: at line 8'; echo H12345678901234667888090 > /Users/buildslave/jenkins/workspace/clang-stage2-Rthinlto/clang-build/Build/tools/clang/runtime/compiler-rt-bins/test/fuzzer/X86_64DefaultDarwinConfig/Output/minimize_two_crashes.test.tmp/long_crash : 'RUN: at line 9'; env ASAN_OPTIONS=abort_on_error=0:log_to_syslog=0:dedup_token_length=3 /Users/buildslave/jenkins/workspace/clang-stage2-Rthinlto/clang-build/Build/tools/clang/runtime/compiler-rt-bins/test/fuzzer/X86_64DefaultDarwinConfig/Output/minimize_two_crashes.test.tmp-TwoDifferentBugsTest -seed=1 -minimize_crash=1 /Users/buildslave/jenkins/workspace/clang-stage2-Rthinlto/clang-build/Build/tools/clang/runtime/compiler-rt-bins/test/fuzzer/X86_64DefaultDarwinConfig/Output/minimize_two_crashes.test.tmp/long_crash -exact_artifact_path=/Users/buildslave/jenkins/workspace/clang-stage2-Rthinlto/clang-build/Build/tools/clang/runtime/compiler-rt-bins/test/fuzzer/X86_64DefaultDarwinConfig/Output/minimize_two_crashes.test.tmp/result 2>&1 | FileCheck /Users/buildslave/jenkins/workspace/clang-stage2-Rthinlto/llvm-project/compiler-rt/test/fuzzer/minimize_two_crashes.test : 'RUN: at line 17'; not /Users/buildslave/jenkins/workspace/clang-stage2-Rthinlto/clang-build/Build/tools/clang/runtime/compiler-rt-bins/test/fuzzer/X86_64DefaultDarwinConfig/Output/minimize_two_crashes.test.tmp-TwoDifferentBugsTest /Users/buildslave/jenkins/workspace/clang-stage2-Rthinlto/clang-build/Build/tools/clang/runtime/compiler-rt-bins/test/fuzzer/X86_64DefaultDarwinConfig/Output/minimize_two_crashes.test.tmp/result 2>&1 | FileCheck /Users/buildslave/jenkins/workspace/clang-stage2-Rthinlto/llvm-project/compiler-rt/test/fuzzer/minimize_two_crashes.test --check-prefix=VERIFY -- Exit Code: 137

Hide Details

Command Output (stderr): -- /Users/buildslave/jenkins/workspace/clang-stage2-Rthinlto/clang-build/Build/tools/clang/runtime/compiler-rt-bins/test/fuzzer/X86_64DefaultDarwinConfig/Output/minimize_two_crashes.test.script: line 5: 18875 Done not /Users/buildslave/jenkins/workspace/clang-stage2-Rthinlto/clang-build/Build/tools/clang/runtime/compiler-rt-bins/test/fuzzer/X86_64DefaultDarwinConfig/Output/minimize_two_crashes.test.tmp-TwoDifferentBugsTest /Users/buildslave/jenkins/workspace/clang-stage2-Rthinlto/clang-build/Build/tools/clang/runtime/compiler-rt-bins/test/fuzzer/X86_64DefaultDarwinConfig/Output/minimize_two_crashes.test.tmp/result 2>&1 18876 Killed: 9 | FileCheck /Users/buildslave/jenkins/workspace/clang-stage2-Rthinlto/llvm-project/compiler-rt/test/fuzzer/minimize_two_crashes.test --check-prefix=VERIFY

Hide Details

--

Hide Details

******************** UNSUPPORTED: libFuzzer :: msan-param-unpoison.test (2906 of 2953) UNSUPPORTED: libFuzzer :: msan.test (2907 of 2953) FAIL: libFuzzer :: not-instrumented.test (2908 of 2953) ******************** TEST 'libFuzzer :: not-instrumented.test' FAILED ******************** Script: -- : 'RUN: at line 1'; /Users/buildslave/jenkins/workspace/clang-stage2-Rthinlto/clang-build/Build/./bin/clang --driver-mode=g++ -O2 -gline-tables-only -fsanitize=address,fuzzer -I/Users/buildslave/jenkins/workspace/clang-stage2-Rthinlto/llvm-project/compiler-rt/lib/fuzzer -arch x86_64 -stdlib=libc++ -mmacosx-version-min=10.10 -isysroot /Applications/Xcode.app/Contents/Developer/Platforms/MacOSX.platform/Developer/SDKs/MacOSX10.14.sdk /Users/buildslave/jenkins/workspace/clang-stage2-Rthinlto/llvm-project/compiler-rt/test/fuzzer/NotinstrumentedTest.cpp -fsanitize-coverage=0 -o /Users/buildslave/jenkins/workspace/clang-stage2-Rthinlto/clang-build/Build/tools/clang/runtime/compiler-rt-bins/test/fuzzer/X86_64DefaultDarwinConfig/Output/not-instrumented.test.tmp-NotinstrumentedTest-NoCoverage : 'RUN: at line 2'; not /Users/buildslave/jenkins/workspace/clang-stage2-Rthinlto/clang-build/Build/tools/clang/runtime/compiler-rt-bins/test/fuzzer/X86_64DefaultDarwinConfig/Output/not-instrumented.test.tmp-NotinstrumentedTest-NoCoverage 2>&1 | FileCheck /Users/buildslave/jenkins/workspace/clang-stage2-Rthinlto/llvm-project/compiler-rt/test/fuzzer/not-instrumented.test --check-prefix=NO_COVERAGE -- Exit Code: 137

Hide Details

Command Output (stderr): -- /Users/buildslave/jenkins/workspace/clang-stage2-Rthinlto/clang-build/Build/tools/clang/runtime/compiler-rt-bins/test/fuzzer/X86_64DefaultDarwinConfig/Output/not-instrumented.test.script: line 2: 18887 Done not /Users/buildslave/jenkins/workspace/clang-stage2-Rthinlto/clang-build/Build/tools/clang/runtime/compiler-rt-bins/test/fuzzer/X86_64DefaultDarwinConfig/Output/not-instrumented.test.tmp-NotinstrumentedTest-NoCoverage 2>&1 18888 Killed: 9 | FileCheck /Users/buildslave/jenkins/workspace/clang-stage2-Rthinlto/llvm-project/compiler-rt/test/fuzzer/not-instrumented.test --check-prefix=NO_COVERAGE

Hide Details

--

Hide Details

******************** FAIL: libFuzzer :: null-deref-on-empty.test (2909 of 2953) ******************** TEST 'libFuzzer :: null-deref-on-empty.test' FAILED ******************** Script: -- : 'RUN: at line 1'; /Users/buildslave/jenkins/workspace/clang-stage2-Rthinlto/clang-build/Build/./bin/clang --driver-mode=g++ -O2 -gline-tables-only -fsanitize=address,fuzzer -I/Users/buildslave/jenkins/workspace/clang-stage2-Rthinlto/llvm-project/compiler-rt/lib/fuzzer -arch x86_64 -stdlib=libc++ -mmacosx-version-min=10.10 -isysroot /Applications/Xcode.app/Contents/Developer/Platforms/MacOSX.platform/Developer/SDKs/MacOSX10.14.sdk /Users/buildslave/jenkins/workspace/clang-stage2-Rthinlto/llvm-project/compiler-rt/test/fuzzer/NullDerefOnEmptyTest.cpp -o /Users/buildslave/jenkins/workspace/clang-stage2-Rthinlto/clang-build/Build/tools/clang/runtime/compiler-rt-bins/test/fuzzer/X86_64DefaultDarwinConfig/Output/null-deref-on-empty.test.tmp-NullDerefOnEmptyTest : 'RUN: at line 3'; not /Users/buildslave/jenkins/workspace/clang-stage2-Rthinlto/clang-build/Build/tools/clang/runtime/compiler-rt-bins/test/fuzzer/X86_64DefaultDarwinConfig/Output/null-deref-on-empty.test.tmp-NullDerefOnEmptyTest -print_final_stats=1 2>&1 | FileCheck /Users/buildslave/jenkins/workspace/clang-stage2-Rthinlto/llvm-project/compiler-rt/test/fuzzer/null-deref-on-empty.test --check-prefix=NULL_DEREF_ON_EMPTY -- Exit Code: 137

Hide Details

Command Output (stderr): -- /Users/buildslave/jenkins/workspace/clang-stage2-Rthinlto/clang-build/Build/tools/clang/runtime/compiler-rt-bins/test/fuzzer/X86_64DefaultDarwinConfig/Output/null-deref-on-empty.test.script: line 2: 18894 Done not /Users/buildslave/jenkins/workspace/clang-stage2-Rthinlto/clang-build/Build/tools/clang/runtime/compiler-rt-bins/test/fuzzer/X86_64DefaultDarwinConfig/Output/null-deref-on-empty.test.tmp-NullDerefOnEmptyTest -print_final_stats=1 2>&1 18895 Killed: 9 | FileCheck /Users/buildslave/jenkins/workspace/clang-stage2-Rthinlto/llvm-project/compiler-rt/test/fuzzer/null-deref-on-empty.test --check-prefix=NULL_DEREF_ON_EMPTY

Hide Details

--

Hide Details

******************** FAIL: libFuzzer :: null-deref.test (2910 of 2953) ******************** TEST 'libFuzzer :: null-deref.test' FAILED ******************** Script: -- : 'RUN: at line 1'; /Users/buildslave/jenkins/workspace/clang-stage2-Rthinlto/clang-build/Build/./bin/clang --driver-mode=g++ -O2 -gline-tables-only -fsanitize=address,fuzzer -I/Users/buildslave/jenkins/workspace/clang-stage2-Rthinlto/llvm-project/compiler-rt/lib/fuzzer -arch x86_64 -stdlib=libc++ -mmacosx-version-min=10.10 -isysroot /Applications/Xcode.app/Contents/Developer/Platforms/MacOSX.platform/Developer/SDKs/MacOSX10.14.sdk /Users/buildslave/jenkins/workspace/clang-stage2-Rthinlto/llvm-project/compiler-rt/test/fuzzer/NullDerefTest.cpp -o /Users/buildslave/jenkins/workspace/clang-stage2-Rthinlto/clang-build/Build/tools/clang/runtime/compiler-rt-bins/test/fuzzer/X86_64DefaultDarwinConfig/Output/null-deref.test.tmp-NullDerefTest : 'RUN: at line 3'; not /Users/buildslave/jenkins/workspace/clang-stage2-Rthinlto/clang-build/Build/tools/clang/runtime/compiler-rt-bins/test/fuzzer/X86_64DefaultDarwinConfig/Output/null-deref.test.tmp-NullDerefTest 2>&1 | FileCheck /Users/buildslave/jenkins/workspace/clang-stage2-Rthinlto/llvm-project/compiler-rt/test/fuzzer/null-deref.test --check-prefix=NullDerefTest : 'RUN: at line 4'; not /Users/buildslave/jenkins/workspace/clang-stage2-Rthinlto/clang-build/Build/tools/clang/runtime/compiler-rt-bins/test/fuzzer/X86_64DefaultDarwinConfig/Output/null-deref.test.tmp-NullDerefTest -close_fd_mask=3 2>&1 | FileCheck /Users/buildslave/jenkins/workspace/clang-stage2-Rthinlto/llvm-project/compiler-rt/test/fuzzer/null-deref.test --check-prefix=NullDerefTest : 'RUN: at line 7'; not /Users/buildslave/jenkins/workspace/clang-stage2-Rthinlto/clang-build/Build/tools/clang/runtime/compiler-rt-bins/test/fuzzer/X86_64DefaultDarwinConfig/Output/null-deref.test.tmp-NullDerefTest -artifact_prefix=ZZZ 2>&1 | FileCheck /Users/buildslave/jenkins/workspace/clang-stage2-Rthinlto/llvm-project/compiler-rt/test/fuzzer/null-deref.test --check-prefix=NullDerefTestPrefix : 'RUN: at line 9'; not /Users/buildslave/jenkins/workspace/clang-stage2-Rthinlto/clang-build/Build/tools/clang/runtime/compiler-rt-bins/test/fuzzer/X86_64DefaultDarwinConfig/Output/null-deref.test.tmp-NullDerefTest -artifact_prefix=ZZZ -exact_artifact_path=FOOBAR 2>&1 | FileCheck /Users/buildslave/jenkins/workspace/clang-stage2-Rthinlto/llvm-project/compiler-rt/test/fuzzer/null-deref.test --check-prefix=NullDerefTestExactPath -- Exit Code: 137

Hide Details

Command Output (stderr): -- /Users/buildslave/jenkins/workspace/clang-stage2-Rthinlto/clang-build/Build/tools/clang/runtime/compiler-rt-bins/test/fuzzer/X86_64DefaultDarwinConfig/Output/null-deref.test.script: line 5: 18906 Done not /Users/buildslave/jenkins/workspace/clang-stage2-Rthinlto/clang-build/Build/tools/clang/runtime/compiler-rt-bins/test/fuzzer/X86_64DefaultDarwinConfig/Output/null-deref.test.tmp-NullDerefTest 2>&1 18907 Killed: 9 | FileCheck /Users/buildslave/jenkins/workspace/clang-stage2-Rthinlto/llvm-project/compiler-rt/test/fuzzer/null-deref.test --check-prefix=NullDerefTest

Hide Details

--

Hide Details

******************** UNSUPPORTED: libFuzzer :: only-some-bytes-fork.test (2911 of 2953) UNSUPPORTED: libFuzzer :: only-some-bytes.test (2912 of 2953) FAIL: libFuzzer :: minimize_crash.test (2913 of 2953) ******************** TEST 'libFuzzer :: minimize_crash.test' FAILED ******************** Script: -- : 'RUN: at line 1'; /Users/buildslave/jenkins/workspace/clang-stage2-Rthinlto/clang-build/Build/./bin/clang --driver-mode=g++ -O2 -gline-tables-only -fsanitize=address,fuzzer -I/Users/buildslave/jenkins/workspace/clang-stage2-Rthinlto/llvm-project/compiler-rt/lib/fuzzer -arch x86_64 -stdlib=libc++ -mmacosx-version-min=10.10 -isysroot /Applications/Xcode.app/Contents/Developer/Platforms/MacOSX.platform/Developer/SDKs/MacOSX10.14.sdk /Users/buildslave/jenkins/workspace/clang-stage2-Rthinlto/llvm-project/compiler-rt/test/fuzzer/NullDerefTest.cpp -o /Users/buildslave/jenkins/workspace/clang-stage2-Rthinlto/clang-build/Build/tools/clang/runtime/compiler-rt-bins/test/fuzzer/X86_64DefaultDarwinConfig/Output/minimize_crash.test.tmp-NullDerefTest : 'RUN: at line 2'; /Users/buildslave/jenkins/workspace/clang-stage2-Rthinlto/clang-build/Build/./bin/clang --driver-mode=g++ -O2 -gline-tables-only -fsanitize=address,fuzzer -I/Users/buildslave/jenkins/workspace/clang-stage2-Rthinlto/llvm-project/compiler-rt/lib/fuzzer -arch x86_64 -stdlib=libc++ -mmacosx-version-min=10.10 -isysroot /Applications/Xcode.app/Contents/Developer/Platforms/MacOSX.platform/Developer/SDKs/MacOSX10.14.sdk /Users/buildslave/jenkins/workspace/clang-stage2-Rthinlto/llvm-project/compiler-rt/test/fuzzer/SingleByteInputTest.cpp -o /Users/buildslave/jenkins/workspace/clang-stage2-Rthinlto/clang-build/Build/tools/clang/runtime/compiler-rt-bins/test/fuzzer/X86_64DefaultDarwinConfig/Output/minimize_crash.test.tmp-SingleByteInputTest : 'RUN: at line 3'; mkdir -p /Users/buildslave/jenkins/workspace/clang-stage2-Rthinlto/clang-build/Build/tools/clang/runtime/compiler-rt-bins/test/fuzzer/X86_64DefaultDarwinConfig/Output/minimize_crash.test.tmp.dir : 'RUN: at line 5'; echo 'Hi!rv349f34t3gg' > /Users/buildslave/jenkins/workspace/clang-stage2-Rthinlto/clang-build/Build/tools/clang/runtime/compiler-rt-bins/test/fuzzer/X86_64DefaultDarwinConfig/Output/minimize_crash.test.tmp.dir/not_minimal_crash : 'RUN: at line 6'; /Users/buildslave/jenkins/workspace/clang-stage2-Rthinlto/clang-build/Build/tools/clang/runtime/compiler-rt-bins/test/fuzzer/X86_64DefaultDarwinConfig/Output/minimize_crash.test.tmp-NullDerefTest -minimize_crash=1 /Users/buildslave/jenkins/workspace/clang-stage2-Rthinlto/clang-build/Build/tools/clang/runtime/compiler-rt-bins/test/fuzzer/X86_64DefaultDarwinConfig/Output/minimize_crash.test.tmp.dir/not_minimal_crash -max_total_time=2 2>&1 | FileCheck /Users/buildslave/jenkins/workspace/clang-stage2-Rthinlto/llvm-project/compiler-rt/test/fuzzer/minimize_crash.test : 'RUN: at line 8'; /Users/buildslave/jenkins/workspace/clang-stage2-Rthinlto/clang-build/Build/tools/clang/runtime/compiler-rt-bins/test/fuzzer/X86_64DefaultDarwinConfig/Output/minimize_crash.test.tmp-NullDerefTest -minimize_crash=1 /Users/buildslave/jenkins/workspace/clang-stage2-Rthinlto/clang-build/Build/tools/clang/runtime/compiler-rt-bins/test/fuzzer/X86_64DefaultDarwinConfig/Output/minimize_crash.test.tmp.dir/not_minimal_crash -max_total_time=2 -exact_artifact_path=/Users/buildslave/jenkins/workspace/clang-stage2-Rthinlto/clang-build/Build/tools/clang/runtime/compiler-rt-bins/test/fuzzer/X86_64DefaultDarwinConfig/Output/minimize_crash.test.tmp.exact_minimized_path 2>&1 | FileCheck /Users/buildslave/jenkins/workspace/clang-stage2-Rthinlto/llvm-project/compiler-rt/test/fuzzer/minimize_crash.test --check-prefix=CHECK_EXACT : 'RUN: at line 10'; rm /Users/buildslave/jenkins/workspace/clang-stage2-Rthinlto/clang-build/Build/tools/clang/runtime/compiler-rt-bins/test/fuzzer/X86_64DefaultDarwinConfig/Output/minimize_crash.test.tmp.dir/not_minimal_crash /Users/buildslave/jenkins/workspace/clang-stage2-Rthinlto/clang-build/Build/tools/clang/runtime/compiler-rt-bins/test/fuzzer/X86_64DefaultDarwinConfig/Output/minimize_crash.test.tmp.exact_minimized_path : 'RUN: at line 12'; echo -n 'abcd*xyz' > /Users/buildslave/jenkins/workspace/clang-stage2-Rthinlto/clang-build/Build/tools/clang/runtime/compiler-rt-bins/test/fuzzer/X86_64DefaultDarwinConfig/Output/minimize_crash.test.tmp.dir/not_minimal_crash : 'RUN: at line 13'; /Users/buildslave/jenkins/workspace/clang-stage2-Rthinlto/clang-build/Build/tools/clang/runtime/compiler-rt-bins/test/fuzzer/X86_64DefaultDarwinConfig/Output/minimize_crash.test.tmp-SingleByteInputTest -minimize_crash=1 /Users/buildslave/jenkins/workspace/clang-stage2-Rthinlto/clang-build/Build/tools/clang/runtime/compiler-rt-bins/test/fuzzer/X86_64DefaultDarwinConfig/Output/minimize_crash.test.tmp.dir/not_minimal_crash -exact_artifact_path=/Users/buildslave/jenkins/workspace/clang-stage2-Rthinlto/clang-build/Build/tools/clang/runtime/compiler-rt-bins/test/fuzzer/X86_64DefaultDarwinConfig/Output/minimize_crash.test.tmp.exact_minimized_path 2>&1 | FileCheck /Users/buildslave/jenkins/workspace/clang-stage2-Rthinlto/llvm-project/compiler-rt/test/fuzzer/minimize_crash.test --check-prefix=MIN1 -- Exit Code: 137

Hide Details

Command Output (stderr): -- /Users/buildslave/jenkins/workspace/clang-stage2-Rthinlto/clang-build/Build/tools/clang/runtime/compiler-rt-bins/test/fuzzer/X86_64DefaultDarwinConfig/Output/minimize_crash.test.script: line 9: 18763 Done /Users/buildslave/jenkins/workspace/clang-stage2-Rthinlto/clang-build/Build/tools/clang/runtime/compiler-rt-bins/test/fuzzer/X86_64DefaultDarwinConfig/Output/minimize_crash.test.tmp-NullDerefTest -minimize_crash=1 /Users/buildslave/jenkins/workspace/clang-stage2-Rthinlto/clang-build/Build/tools/clang/runtime/compiler-rt-bins/test/fuzzer/X86_64DefaultDarwinConfig/Output/minimize_crash.test.tmp.dir/not_minimal_crash -max_total_time=2 2>&1 18764 Killed: 9 | FileCheck /Users/buildslave/jenkins/workspace/clang-stage2-Rthinlto/llvm-project/compiler-rt/test/fuzzer/minimize_crash.test

Hide Details

--

Hide Details

******************** UNSUPPORTED: libFuzzer :: print-func.test (2914 of 2953) FAIL: libFuzzer :: overwrite-input.test (2915 of 2953) ******************** TEST 'libFuzzer :: overwrite-input.test' FAILED ******************** Script: -- : 'RUN: at line 1'; /Users/buildslave/jenkins/workspace/clang-stage2-Rthinlto/clang-build/Build/./bin/clang --driver-mode=g++ -O2 -gline-tables-only -fsanitize=address,fuzzer -I/Users/buildslave/jenkins/workspace/clang-stage2-Rthinlto/llvm-project/compiler-rt/lib/fuzzer -arch x86_64 -stdlib=libc++ -mmacosx-version-min=10.10 -isysroot /Applications/Xcode.app/Contents/Developer/Platforms/MacOSX.platform/Developer/SDKs/MacOSX10.14.sdk /Users/buildslave/jenkins/workspace/clang-stage2-Rthinlto/llvm-project/compiler-rt/test/fuzzer/OverwriteInputTest.cpp -o /Users/buildslave/jenkins/workspace/clang-stage2-Rthinlto/clang-build/Build/tools/clang/runtime/compiler-rt-bins/test/fuzzer/X86_64DefaultDarwinConfig/Output/overwrite-input.test.tmp-OverwriteInputTest : 'RUN: at line 2'; not /Users/buildslave/jenkins/workspace/clang-stage2-Rthinlto/clang-build/Build/tools/clang/runtime/compiler-rt-bins/test/fuzzer/X86_64DefaultDarwinConfig/Output/overwrite-input.test.tmp-OverwriteInputTest 2>&1 | FileCheck /Users/buildslave/jenkins/workspace/clang-stage2-Rthinlto/llvm-project/compiler-rt/test/fuzzer/overwrite-input.test -- Exit Code: 137

Hide Details

Command Output (stderr): -- /Users/buildslave/jenkins/workspace/clang-stage2-Rthinlto/clang-build/Build/tools/clang/runtime/compiler-rt-bins/test/fuzzer/X86_64DefaultDarwinConfig/Output/overwrite-input.test.script: line 2: 18922 Done not /Users/buildslave/jenkins/workspace/clang-stage2-Rthinlto/clang-build/Build/tools/clang/runtime/compiler-rt-bins/test/fuzzer/X86_64DefaultDarwinConfig/Output/overwrite-input.test.tmp-OverwriteInputTest 2>&1 18923 Killed: 9 | FileCheck /Users/buildslave/jenkins/workspace/clang-stage2-Rthinlto/llvm-project/compiler-rt/test/fuzzer/overwrite-input.test

Hide Details

--

Hide Details

******************** FAIL: libFuzzer :: read-binary.test (2916 of 2953) ******************** TEST 'libFuzzer :: read-binary.test' FAILED ******************** Script: -- : 'RUN: at line 4'; echo -e "Hello\r\nWorld\r" > /Users/buildslave/jenkins/workspace/clang-stage2-Rthinlto/clang-build/Build/tools/clang/runtime/compiler-rt-bins/test/fuzzer/X86_64DefaultDarwinConfig/Output/read-binary.test.tmp-testcase : 'RUN: at line 5'; /Users/buildslave/jenkins/workspace/clang-stage2-Rthinlto/clang-build/Build/./bin/clang --driver-mode=g++ -O2 -gline-tables-only -fsanitize=address,fuzzer -I/Users/buildslave/jenkins/workspace/clang-stage2-Rthinlto/llvm-project/compiler-rt/lib/fuzzer -arch x86_64 -stdlib=libc++ -mmacosx-version-min=10.10 -isysroot /Applications/Xcode.app/Contents/Developer/Platforms/MacOSX.platform/Developer/SDKs/MacOSX10.14.sdk /Users/buildslave/jenkins/workspace/clang-stage2-Rthinlto/llvm-project/compiler-rt/test/fuzzer/ReadBinaryTest.cpp -o /Users/buildslave/jenkins/workspace/clang-stage2-Rthinlto/clang-build/Build/tools/clang/runtime/compiler-rt-bins/test/fuzzer/X86_64DefaultDarwinConfig/Output/read-binary.test.tmp-fuzzer : 'RUN: at line 6'; /Users/buildslave/jenkins/workspace/clang-stage2-Rthinlto/clang-build/Build/tools/clang/runtime/compiler-rt-bins/test/fuzzer/X86_64DefaultDarwinConfig/Output/read-binary.test.tmp-fuzzer /Users/buildslave/jenkins/workspace/clang-stage2-Rthinlto/clang-build/Build/tools/clang/runtime/compiler-rt-bins/test/fuzzer/X86_64DefaultDarwinConfig/Output/read-binary.test.tmp-testcase | FileCheck /Users/buildslave/jenkins/workspace/clang-stage2-Rthinlto/llvm-project/compiler-rt/test/fuzzer/read-binary.test -- Exit Code: 137

Hide Details

Command Output (stderr): -- INFO: Seed: 3556198790 INFO: Loaded 1 modules (70 inline 8-bit counters): 70 [0x10a7b3a88, 0x10a7b3ace), INFO: Loaded 1 PC tables (70 PCs): 70 [0x10a7b3ad0,0x10a7b3f30), /Users/buildslave/jenkins/workspace/clang-stage2-Rthinlto/clang-build/Build/tools/clang/runtime/compiler-rt-bins/test/fuzzer/X86_64DefaultDarwinConfig/Output/read-binary.test.tmp-fuzzer: Running 1 inputs 1 time(s) each. Running: /Users/buildslave/jenkins/workspace/clang-stage2-Rthinlto/clang-build/Build/tools/clang/runtime/compiler-rt-bins/test/fuzzer/X86_64DefaultDarwinConfig/Output/read-binary.test.tmp-testcase Executed /Users/buildslave/jenkins/workspace/clang-stage2-Rthinlto/clang-build/Build/tools/clang/runtime/compiler-rt-bins/test/fuzzer/X86_64DefaultDarwinConfig/Output/read-binary.test.tmp-testcase in 0 ms *** *** NOTE: fuzzing was not performed, you have only *** executed the target code on a fixed set of inputs. *** /Users/buildslave/jenkins/workspace/clang-stage2-Rthinlto/clang-build/Build/tools/clang/runtime/compiler-rt-bins/test/fuzzer/X86_64DefaultDarwinConfig/Output/read-binary.test.script: line 3: 18934 Done /Users/buildslave/jenkins/workspace/clang-stage2-Rthinlto/clang-build/Build/tools/clang/runtime/compiler-rt-bins/test/fuzzer/X86_64DefaultDarwinConfig/Output/read-binary.test.tmp-fuzzer /Users/buildslave/jenkins/workspace/clang-stage2-Rthinlto/clang-build/Build/tools/clang/runtime/compiler-rt-bins/test/fuzzer/X86_64DefaultDarwinConfig/Output/read-binary.test.tmp-testcase 18935 Killed: 9 | FileCheck /Users/buildslave/jenkins/workspace/clang-stage2-Rthinlto/llvm-project/compiler-rt/test/fuzzer/read-binary.test

Hide Details

--

Hide Details

******************** FAIL: libFuzzer :: recommended-dictionary.test (2917 of 2953) ******************** TEST 'libFuzzer :: recommended-dictionary.test' FAILED ******************** Script: -- : 'RUN: at line 2'; /Users/buildslave/jenkins/workspace/clang-stage2-Rthinlto/clang-build/Build/./bin/clang --driver-mode=g++ -O2 -gline-tables-only -fsanitize=address,fuzzer -I/Users/buildslave/jenkins/workspace/clang-stage2-Rthinlto/llvm-project/compiler-rt/lib/fuzzer -arch x86_64 -stdlib=libc++ -mmacosx-version-min=10.10 -isysroot /Applications/Xcode.app/Contents/Developer/Platforms/MacOSX.platform/Developer/SDKs/MacOSX10.14.sdk /Users/buildslave/jenkins/workspace/clang-stage2-Rthinlto/llvm-project/compiler-rt/test/fuzzer/RepeatedMemcmp.cpp -o /Users/buildslave/jenkins/workspace/clang-stage2-Rthinlto/clang-build/Build/tools/clang/runtime/compiler-rt-bins/test/fuzzer/X86_64DefaultDarwinConfig/Output/recommended-dictionary.test.tmp-RepeatedMemcmp : 'RUN: at line 3'; /Users/buildslave/jenkins/workspace/clang-stage2-Rthinlto/clang-build/Build/tools/clang/runtime/compiler-rt-bins/test/fuzzer/X86_64DefaultDarwinConfig/Output/recommended-dictionary.test.tmp-RepeatedMemcmp -seed=11 -runs=100000 -max_len=20 2>&1 | FileCheck /Users/buildslave/jenkins/workspace/clang-stage2-Rthinlto/llvm-project/compiler-rt/test/fuzzer/recommended-dictionary.test --check-prefix=RECOMMENDED_DICT -- Exit Code: 137

Hide Details

Command Output (stderr): -- /Users/buildslave/jenkins/workspace/clang-stage2-Rthinlto/clang-build/Build/tools/clang/runtime/compiler-rt-bins/test/fuzzer/X86_64DefaultDarwinConfig/Output/recommended-dictionary.test.script: line 2: 18942 Done /Users/buildslave/jenkins/workspace/clang-stage2-Rthinlto/clang-build/Build/tools/clang/runtime/compiler-rt-bins/test/fuzzer/X86_64DefaultDarwinConfig/Output/recommended-dictionary.test.tmp-RepeatedMemcmp -seed=11 -runs=100000 -max_len=20 2>&1 18943 Killed: 9 | FileCheck /Users/buildslave/jenkins/workspace/clang-stage2-Rthinlto/llvm-project/compiler-rt/test/fuzzer/recommended-dictionary.test --check-prefix=RECOMMENDED_DICT

Hide Details

--

Hide Details

******************** FAIL: libFuzzer :: reduce_inputs.test (2918 of 2953) ******************** TEST 'libFuzzer :: reduce_inputs.test' FAILED ******************** Script: -- : 'RUN: at line 3'; rm -rf /Users/buildslave/jenkins/workspace/clang-stage2-Rthinlto/clang-build/Build/tools/clang/runtime/compiler-rt-bins/test/fuzzer/X86_64DefaultDarwinConfig/Output/reduce_inputs.test.tmp/C : 'RUN: at line 4'; mkdir -p /Users/buildslave/jenkins/workspace/clang-stage2-Rthinlto/clang-build/Build/tools/clang/runtime/compiler-rt-bins/test/fuzzer/X86_64DefaultDarwinConfig/Output/reduce_inputs.test.tmp/C : 'RUN: at line 5'; /Users/buildslave/jenkins/workspace/clang-stage2-Rthinlto/clang-build/Build/./bin/clang --driver-mode=g++ -O2 -gline-tables-only -fsanitize=address,fuzzer -I/Users/buildslave/jenkins/workspace/clang-stage2-Rthinlto/llvm-project/compiler-rt/lib/fuzzer -arch x86_64 -stdlib=libc++ -mmacosx-version-min=10.10 -isysroot /Applications/Xcode.app/Contents/Developer/Platforms/MacOSX.platform/Developer/SDKs/MacOSX10.14.sdk /Users/buildslave/jenkins/workspace/clang-stage2-Rthinlto/llvm-project/compiler-rt/test/fuzzer/ShrinkControlFlowSimpleTest.cpp -o /Users/buildslave/jenkins/workspace/clang-stage2-Rthinlto/clang-build/Build/tools/clang/runtime/compiler-rt-bins/test/fuzzer/X86_64DefaultDarwinConfig/Output/reduce_inputs.test.tmp-ShrinkControlFlowSimpleTest : 'RUN: at line 6'; /Users/buildslave/jenkins/workspace/clang-stage2-Rthinlto/clang-build/Build/./bin/clang --driver-mode=g++ -O2 -gline-tables-only -fsanitize=address,fuzzer -I/Users/buildslave/jenkins/workspace/clang-stage2-Rthinlto/llvm-project/compiler-rt/lib/fuzzer -arch x86_64 -stdlib=libc++ -mmacosx-version-min=10.10 -isysroot /Applications/Xcode.app/Contents/Developer/Platforms/MacOSX.platform/Developer/SDKs/MacOSX10.14.sdk /Users/buildslave/jenkins/workspace/clang-stage2-Rthinlto/llvm-project/compiler-rt/test/fuzzer/ShrinkControlFlowTest.cpp -o /Users/buildslave/jenkins/workspace/clang-stage2-Rthinlto/clang-build/Build/tools/clang/runtime/compiler-rt-bins/test/fuzzer/X86_64DefaultDarwinConfig/Output/reduce_inputs.test.tmp-ShrinkControlFlowTest : 'RUN: at line 7'; /Users/buildslave/jenkins/workspace/clang-stage2-Rthinlto/clang-build/Build/tools/clang/runtime/compiler-rt-bins/test/fuzzer/X86_64DefaultDarwinConfig/Output/reduce_inputs.test.tmp-ShrinkControlFlowSimpleTest -exit_on_item=0eb8e4ed029b774d80f2b66408203801cb982a60 -runs=1000000 /Users/buildslave/jenkins/workspace/clang-stage2-Rthinlto/clang-build/Build/tools/clang/runtime/compiler-rt-bins/test/fuzzer/X86_64DefaultDarwinConfig/Output/reduce_inputs.test.tmp/C 2>&1 | FileCheck /Users/buildslave/jenkins/workspace/clang-stage2-Rthinlto/llvm-project/compiler-rt/test/fuzzer/reduce_inputs.test : 'RUN: at line 11'; /Users/buildslave/jenkins/workspace/clang-stage2-Rthinlto/clang-build/Build/tools/clang/runtime/compiler-rt-bins/test/fuzzer/X86_64DefaultDarwinConfig/Output/reduce_inputs.test.tmp-ShrinkControlFlowSimpleTest -runs=0 /Users/buildslave/jenkins/workspace/clang-stage2-Rthinlto/clang-build/Build/tools/clang/runtime/compiler-rt-bins/test/fuzzer/X86_64DefaultDarwinConfig/Output/reduce_inputs.test.tmp/C 2>&1 | FileCheck /Users/buildslave/jenkins/workspace/clang-stage2-Rthinlto/llvm-project/compiler-rt/test/fuzzer/reduce_inputs.test --check-prefix=COUNT : 'RUN: at line 15'; /Users/buildslave/jenkins/workspace/clang-stage2-Rthinlto/clang-build/Build/tools/clang/runtime/compiler-rt-bins/test/fuzzer/X86_64DefaultDarwinConfig/Output/reduce_inputs.test.tmp-ShrinkControlFlowTest -exit_on_item=0eb8e4ed029b774d80f2b66408203801cb982a60 -seed=42 -runs=1000000 2>&1 | FileCheck /Users/buildslave/jenkins/workspace/clang-stage2-Rthinlto/llvm-project/compiler-rt/test/fuzzer/reduce_inputs.test -- Exit Code: 137

Hide Details

Command Output (stderr): -- /Users/buildslave/jenkins/workspace/clang-stage2-Rthinlto/clang-build/Build/tools/clang/runtime/compiler-rt-bins/test/fuzzer/X86_64DefaultDarwinConfig/Output/reduce_inputs.test.script: line 7: 18951 Done /Users/buildslave/jenkins/workspace/clang-stage2-Rthinlto/clang-build/Build/tools/clang/runtime/compiler-rt-bins/test/fuzzer/X86_64DefaultDarwinConfig/Output/reduce_inputs.test.tmp-ShrinkControlFlowSimpleTest -exit_on_item=0eb8e4ed029b774d80f2b66408203801cb982a60 -runs=1000000 /Users/buildslave/jenkins/workspace/clang-stage2-Rthinlto/clang-build/Build/tools/clang/runtime/compiler-rt-bins/test/fuzzer/X86_64DefaultDarwinConfig/Output/reduce_inputs.test.tmp/C 2>&1 18952 Killed: 9 | FileCheck /Users/buildslave/jenkins/workspace/clang-stage2-Rthinlto/llvm-project/compiler-rt/test/fuzzer/reduce_inputs.test

Hide Details

--

Hide Details

******************** FAIL: libFuzzer :: reload.test (2919 of 2953) ******************** TEST 'libFuzzer :: reload.test' FAILED ******************** Script: -- : 'RUN: at line 1'; /Users/buildslave/jenkins/workspace/clang-stage2-Rthinlto/clang-build/Build/./bin/clang --driver-mode=g++ -O2 -gline-tables-only -fsanitize=address,fuzzer -I/Users/buildslave/jenkins/workspace/clang-stage2-Rthinlto/llvm-project/compiler-rt/lib/fuzzer -arch x86_64 -stdlib=libc++ -mmacosx-version-min=10.10 -isysroot /Applications/Xcode.app/Contents/Developer/Platforms/MacOSX.platform/Developer/SDKs/MacOSX10.14.sdk /Users/buildslave/jenkins/workspace/clang-stage2-Rthinlto/llvm-project/compiler-rt/test/fuzzer/ReloadTest.cpp -o /Users/buildslave/jenkins/workspace/clang-stage2-Rthinlto/clang-build/Build/tools/clang/runtime/compiler-rt-bins/test/fuzzer/X86_64DefaultDarwinConfig/Output/reload.test.tmp-ReloadTest : 'RUN: at line 2'; not /Users/buildslave/jenkins/workspace/clang-stage2-Rthinlto/clang-build/Build/tools/clang/runtime/compiler-rt-bins/test/fuzzer/X86_64DefaultDarwinConfig/Output/reload.test.tmp-ReloadTest -max_len=10000 -seed=1 -timeout=15 -len_control=0 -exact_artifact_path=/Users/buildslave/jenkins/workspace/clang-stage2-Rthinlto/clang-build/Build/tools/clang/runtime/compiler-rt-bins/test/fuzzer/X86_64DefaultDarwinConfig/Output/reload.test.tmp.crash 2>&1 | FileCheck /Users/buildslave/jenkins/workspace/clang-stage2-Rthinlto/llvm-project/compiler-rt/test/fuzzer/reload.test : 'RUN: at line 6'; not /Users/buildslave/jenkins/workspace/clang-stage2-Rthinlto/clang-build/Build/tools/clang/runtime/compiler-rt-bins/test/fuzzer/X86_64DefaultDarwinConfig/Output/reload.test.tmp-ReloadTest /Users/buildslave/jenkins/workspace/clang-stage2-Rthinlto/clang-build/Build/tools/clang/runtime/compiler-rt-bins/test/fuzzer/X86_64DefaultDarwinConfig/Output/reload.test.tmp.crash 2>&1 | FileCheck /Users/buildslave/jenkins/workspace/clang-stage2-Rthinlto/llvm-project/compiler-rt/test/fuzzer/reload.test --check-prefix=ARTIFACT : 'RUN: at line 12'; echo z >> /Users/buildslave/jenkins/workspace/clang-stage2-Rthinlto/clang-build/Build/tools/clang/runtime/compiler-rt-bins/test/fuzzer/X86_64DefaultDarwinConfig/Output/reload.test.tmp.crash : 'RUN: at line 13'; /Users/buildslave/jenkins/workspace/clang-stage2-Rthinlto/clang-build/Build/tools/clang/runtime/compiler-rt-bins/test/fuzzer/X86_64DefaultDarwinConfig/Output/reload.test.tmp-ReloadTest /Users/buildslave/jenkins/workspace/clang-stage2-Rthinlto/clang-build/Build/tools/clang/runtime/compiler-rt-bins/test/fuzzer/X86_64DefaultDarwinConfig/Output/reload.test.tmp.crash -- Exit Code: 137

Hide Details

Command Output (stderr): -- /Users/buildslave/jenkins/workspace/clang-stage2-Rthinlto/clang-build/Build/tools/clang/runtime/compiler-rt-bins/test/fuzzer/X86_64DefaultDarwinConfig/Output/reload.test.script: line 5: 18957 Done not /Users/buildslave/jenkins/workspace/clang-stage2-Rthinlto/clang-build/Build/tools/clang/runtime/compiler-rt-bins/test/fuzzer/X86_64DefaultDarwinConfig/Output/reload.test.tmp-ReloadTest -max_len=10000 -seed=1 -timeout=15 -len_control=0 -exact_artifact_path=/Users/buildslave/jenkins/workspace/clang-stage2-Rthinlto/clang-build/Build/tools/clang/runtime/compiler-rt-bins/test/fuzzer/X86_64DefaultDarwinConfig/Output/reload.test.tmp.crash 2>&1 18958 Killed: 9 | FileCheck /Users/buildslave/jenkins/workspace/clang-stage2-Rthinlto/llvm-project/compiler-rt/test/fuzzer/reload.test

Hide Details

--

Hide Details

******************** FAIL: libFuzzer :: repeated-bytes.test (2920 of 2953) ******************** TEST 'libFuzzer :: repeated-bytes.test' FAILED ******************** Script: -- : 'RUN: at line 1'; /Users/buildslave/jenkins/workspace/clang-stage2-Rthinlto/clang-build/Build/./bin/clang --driver-mode=g++ -O2 -gline-tables-only -fsanitize=address,fuzzer -I/Users/buildslave/jenkins/workspace/clang-stage2-Rthinlto/llvm-project/compiler-rt/lib/fuzzer -arch x86_64 -stdlib=libc++ -mmacosx-version-min=10.10 -isysroot /Applications/Xcode.app/Contents/Developer/Platforms/MacOSX.platform/Developer/SDKs/MacOSX10.14.sdk /Users/buildslave/jenkins/workspace/clang-stage2-Rthinlto/llvm-project/compiler-rt/test/fuzzer/RepeatedBytesTest.cpp -o /Users/buildslave/jenkins/workspace/clang-stage2-Rthinlto/clang-build/Build/tools/clang/runtime/compiler-rt-bins/test/fuzzer/X86_64DefaultDarwinConfig/Output/repeated-bytes.test.tmp-RepeatedBytesTest : 'RUN: at line 3'; not /Users/buildslave/jenkins/workspace/clang-stage2-Rthinlto/clang-build/Build/tools/clang/runtime/compiler-rt-bins/test/fuzzer/X86_64DefaultDarwinConfig/Output/repeated-bytes.test.tmp-RepeatedBytesTest -seed=1 -runs=1000000 2>&1 | FileCheck /Users/buildslave/jenkins/workspace/clang-stage2-Rthinlto/llvm-project/compiler-rt/test/fuzzer/repeated-bytes.test -- Exit Code: 137

Hide Details

Command Output (stderr): -- /Users/buildslave/jenkins/workspace/clang-stage2-Rthinlto/clang-build/Build/tools/clang/runtime/compiler-rt-bins/test/fuzzer/X86_64DefaultDarwinConfig/Output/repeated-bytes.test.script: line 2: 18969 Done not /Users/buildslave/jenkins/workspace/clang-stage2-Rthinlto/clang-build/Build/tools/clang/runtime/compiler-rt-bins/test/fuzzer/X86_64DefaultDarwinConfig/Output/repeated-bytes.test.tmp-RepeatedBytesTest -seed=1 -runs=1000000 2>&1 18970 Killed: 9 | FileCheck /Users/buildslave/jenkins/workspace/clang-stage2-Rthinlto/llvm-project/compiler-rt/test/fuzzer/repeated-bytes.test

Hide Details

--

Hide Details

******************** FAIL: libFuzzer :: seed_inputs.test (2921 of 2953) ******************** TEST 'libFuzzer :: seed_inputs.test' FAILED ******************** Script: -- : 'RUN: at line 4'; /Users/buildslave/jenkins/workspace/clang-stage2-Rthinlto/clang-build/Build/./bin/clang --driver-mode=g++ -O2 -gline-tables-only -fsanitize=address,fuzzer -I/Users/buildslave/jenkins/workspace/clang-stage2-Rthinlto/llvm-project/compiler-rt/lib/fuzzer -arch x86_64 -stdlib=libc++ -mmacosx-version-min=10.10 -isysroot /Applications/Xcode.app/Contents/Developer/Platforms/MacOSX.platform/Developer/SDKs/MacOSX10.14.sdk /Users/buildslave/jenkins/workspace/clang-stage2-Rthinlto/llvm-project/compiler-rt/test/fuzzer/SimpleTest.cpp -o /Users/buildslave/jenkins/workspace/clang-stage2-Rthinlto/clang-build/Build/tools/clang/runtime/compiler-rt-bins/test/fuzzer/X86_64DefaultDarwinConfig/Output/seed_inputs.test.tmp-SimpleTest : 'RUN: at line 7'; echo -n "/Users/buildslave/jenkins/workspace/clang-stage2-Rthinlto/clang-build/Build/tools/clang/runtime/compiler-rt-bins/test/fuzzer/X86_64DefaultDarwinConfig/Output/seed_inputs.test.tmp-SimpleTest" > /Users/buildslave/jenkins/workspace/clang-stage2-Rthinlto/clang-build/Build/tools/clang/runtime/compiler-rt-bins/test/fuzzer/X86_64DefaultDarwinConfig/Output/seed_inputs.test.tmp.seed-inputs : 'RUN: at line 9'; /Users/buildslave/jenkins/workspace/clang-stage2-Rthinlto/clang-build/Build/tools/clang/runtime/compiler-rt-bins/test/fuzzer/X86_64DefaultDarwinConfig/Output/seed_inputs.test.tmp-SimpleTest -runs=1 -seed_inputs=@/Users/buildslave/jenkins/workspace/clang-stage2-Rthinlto/clang-build/Build/tools/clang/runtime/compiler-rt-bins/test/fuzzer/X86_64DefaultDarwinConfig/Output/seed_inputs.test.tmp.seed-inputs 2>&1 | FileCheck /Users/buildslave/jenkins/workspace/clang-stage2-Rthinlto/llvm-project/compiler-rt/test/fuzzer/seed_inputs.test --check-prefix=USE-1 : 'RUN: at line 10'; /Users/buildslave/jenkins/workspace/clang-stage2-Rthinlto/clang-build/Build/tools/clang/runtime/compiler-rt-bins/test/fuzzer/X86_64DefaultDarwinConfig/Output/seed_inputs.test.tmp-SimpleTest -runs=1 -seed_inputs=/Users/buildslave/jenkins/workspace/clang-stage2-Rthinlto/clang-build/Build/tools/clang/runtime/compiler-rt-bins/test/fuzzer/X86_64DefaultDarwinConfig/Output/seed_inputs.test.tmp-SimpleTest 2>&1 | FileCheck /Users/buildslave/jenkins/workspace/clang-stage2-Rthinlto/llvm-project/compiler-rt/test/fuzzer/seed_inputs.test --check-prefix=USE-1 : 'RUN: at line 13'; echo -n "/Users/buildslave/jenkins/workspace/clang-stage2-Rthinlto/clang-build/Build/tools/clang/runtime/compiler-rt-bins/test/fuzzer/X86_64DefaultDarwinConfig/Output/seed_inputs.test.tmp-SimpleTest,/Users/buildslave/jenkins/workspace/clang-stage2-Rthinlto/clang-build/Build/tools/clang/runtime/compiler-rt-bins/test/fuzzer/X86_64DefaultDarwinConfig/Output/seed_inputs.test.tmp-SimpleTest" > /Users/buildslave/jenkins/workspace/clang-stage2-Rthinlto/clang-build/Build/tools/clang/runtime/compiler-rt-bins/test/fuzzer/X86_64DefaultDarwinConfig/Output/seed_inputs.test.tmp.seed-inputs : 'RUN: at line 14'; /Users/buildslave/jenkins/workspace/clang-stage2-Rthinlto/clang-build/Build/tools/clang/runtime/compiler-rt-bins/test/fuzzer/X86_64DefaultDarwinConfig/Output/seed_inputs.test.tmp-SimpleTest -runs=1 -seed_inputs=@/Users/buildslave/jenkins/workspace/clang-stage2-Rthinlto/clang-build/Build/tools/clang/runtime/compiler-rt-bins/test/fuzzer/X86_64DefaultDarwinConfig/Output/seed_inputs.test.tmp.seed-inputs 2>&1 | FileCheck /Users/buildslave/jenkins/workspace/clang-stage2-Rthinlto/llvm-project/compiler-rt/test/fuzzer/seed_inputs.test --check-prefix=USE-2 : 'RUN: at line 15'; /Users/buildslave/jenkins/workspace/clang-stage2-Rthinlto/clang-build/Build/tools/clang/runtime/compiler-rt-bins/test/fuzzer/X86_64DefaultDarwinConfig/Output/seed_inputs.test.tmp-SimpleTest -runs=1 -seed_inputs=/Users/buildslave/jenkins/workspace/clang-stage2-Rthinlto/clang-build/Build/tools/clang/runtime/compiler-rt-bins/test/fuzzer/X86_64DefaultDarwinConfig/Output/seed_inputs.test.tmp-SimpleTest,/Users/buildslave/jenkins/workspace/clang-stage2-Rthinlto/clang-build/Build/tools/clang/runtime/compiler-rt-bins/test/fuzzer/X86_64DefaultDarwinConfig/Output/seed_inputs.test.tmp-SimpleTest 2>&1 | FileCheck /Users/buildslave/jenkins/workspace/clang-stage2-Rthinlto/llvm-project/compiler-rt/test/fuzzer/seed_inputs.test --check-prefix=USE-2 : 'RUN: at line 18'; echo -n "/Users/buildslave/jenkins/workspace/clang-stage2-Rthinlto/clang-build/Build/tools/clang/runtime/compiler-rt-bins/test/fuzzer/X86_64DefaultDarwinConfig/Output/seed_inputs.test.tmp-SimpleTest,/Users/buildslave/jenkins/workspace/clang-stage2-Rthinlto/clang-build/Build/tools/clang/runtime/compiler-rt-bins/test/fuzzer/X86_64DefaultDarwinConfig/Output/seed_inputs.test.tmp-SimpleTest,nonexistent-file," > /Users/buildslave/jenkins/workspace/clang-stage2-Rthinlto/clang-build/Build/tools/clang/runtime/compiler-rt-bins/test/fuzzer/X86_64DefaultDarwinConfig/Output/seed_inputs.test.tmp.seed-inputs : 'RUN: at line 19'; /Users/buildslave/jenkins/workspace/clang-stage2-Rthinlto/clang-build/Build/tools/clang/runtime/compiler-rt-bins/test/fuzzer/X86_64DefaultDarwinConfig/Output/seed_inputs.test.tmp-SimpleTest -runs=1 -seed_inputs=@/Users/buildslave/jenkins/workspace/clang-stage2-Rthinlto/clang-build/Build/tools/clang/runtime/compiler-rt-bins/test/fuzzer/X86_64DefaultDarwinConfig/Output/seed_inputs.test.tmp.seed-inputs 2>&1 | FileCheck /Users/buildslave/jenkins/workspace/clang-stage2-Rthinlto/llvm-project/compiler-rt/test/fuzzer/seed_inputs.test --check-prefix=USE-2 : 'RUN: at line 20'; /Users/buildslave/jenkins/workspace/clang-stage2-Rthinlto/clang-build/Build/tools/clang/runtime/compiler-rt-bins/test/fuzzer/X86_64DefaultDarwinConfig/Output/seed_inputs.test.tmp-SimpleTest -runs=1 -seed_inputs=/Users/buildslave/jenkins/workspace/clang-stage2-Rthinlto/clang-build/Build/tools/clang/runtime/compiler-rt-bins/test/fuzzer/X86_64DefaultDarwinConfig/Output/seed_inputs.test.tmp-SimpleTest,/Users/buildslave/jenkins/workspace/clang-stage2-Rthinlto/clang-build/Build/tools/clang/runtime/compiler-rt-bins/test/fuzzer/X86_64DefaultDarwinConfig/Output/seed_inputs.test.tmp-SimpleTest,nonexistent-file, 2>&1 | FileCheck /Users/buildslave/jenkins/workspace/clang-stage2-Rthinlto/llvm-project/compiler-rt/test/fuzzer/seed_inputs.test --check-prefix=USE-2 : 'RUN: at line 24'; not /Users/buildslave/jenkins/workspace/clang-stage2-Rthinlto/clang-build/Build/tools/clang/runtime/compiler-rt-bins/test/fuzzer/X86_64DefaultDarwinConfig/Output/seed_inputs.test.tmp-SimpleTest -runs=1 -seed_inputs=@nonexistent-file 2>&1 | FileCheck /Users/buildslave/jenkins/workspace/clang-stage2-Rthinlto/llvm-project/compiler-rt/test/fuzzer/seed_inputs.test --check-prefix=EMPTY : 'RUN: at line 25'; echo -n "" > /Users/buildslave/jenkins/workspace/clang-stage2-Rthinlto/clang-build/Build/tools/clang/runtime/compiler-rt-bins/test/fuzzer/X86_64DefaultDarwinConfig/Output/seed_inputs.test.tmp.seed-inputs : 'RUN: at line 26'; not /Users/buildslave/jenkins/workspace/clang-stage2-Rthinlto/clang-build/Build/tools/clang/runtime/compiler-rt-bins/test/fuzzer/X86_64DefaultDarwinConfig/Output/seed_inputs.test.tmp-SimpleTest -runs=1 -seed_inputs=@/Users/buildslave/jenkins/workspace/clang-stage2-Rthinlto/clang-build/Build/tools/clang/runtime/compiler-rt-bins/test/fuzzer/X86_64DefaultDarwinConfig/Output/seed_inputs.test.tmp.seed-inputs 2>&1 | FileCheck /Users/buildslave/jenkins/workspace/clang-stage2-Rthinlto/llvm-project/compiler-rt/test/fuzzer/seed_inputs.test --check-prefix=EMPTY : 'RUN: at line 27'; not /Users/buildslave/jenkins/workspace/clang-stage2-Rthinlto/clang-build/Build/tools/clang/runtime/compiler-rt-bins/test/fuzzer/X86_64DefaultDarwinConfig/Output/seed_inputs.test.tmp-SimpleTest -runs=1 -seed_inputs= 2>&1 | FileCheck /Users/buildslave/jenkins/workspace/clang-stage2-Rthinlto/llvm-project/compiler-rt/test/fuzzer/seed_inputs.test --check-prefix=EMPTY -- Exit Code: 137

Hide Details

Command Output (stderr): -- /Users/buildslave/jenkins/workspace/clang-stage2-Rthinlto/clang-build/Build/tools/clang/runtime/compiler-rt-bins/test/fuzzer/X86_64DefaultDarwinConfig/Output/seed_inputs.test.script: line 14: 18990 Done /Users/buildslave/jenkins/workspace/clang-stage2-Rthinlto/clang-build/Build/tools/clang/runtime/compiler-rt-bins/test/fuzzer/X86_64DefaultDarwinConfig/Output/seed_inputs.test.tmp-SimpleTest -runs=1 -seed_inputs=@/Users/buildslave/jenkins/workspace/clang-stage2-Rthinlto/clang-build/Build/tools/clang/runtime/compiler-rt-bins/test/fuzzer/X86_64DefaultDarwinConfig/Output/seed_inputs.test.tmp.seed-inputs 2>&1 18991 Killed: 9 | FileCheck /Users/buildslave/jenkins/workspace/clang-stage2-Rthinlto/llvm-project/compiler-rt/test/fuzzer/seed_inputs.test --check-prefix=USE-1

Hide Details

--

Hide Details

******************** UNSUPPORTED: libFuzzer :: sigint.test (2922 of 2953) UNSUPPORTED: libFuzzer :: sigusr.test (2923 of 2953) UNSUPPORTED: libFuzzer :: simple-cmp.test (2924 of 2953) FAIL: libFuzzer :: shrink.test (2925 of 2953) ******************** TEST 'libFuzzer :: shrink.test' FAILED ******************** Script: -- : 'RUN: at line 1'; /Users/buildslave/jenkins/workspace/clang-stage2-Rthinlto/clang-build/Build/./bin/clang --driver-mode=g++ -O2 -gline-tables-only -fsanitize=address,fuzzer -I/Users/buildslave/jenkins/workspace/clang-stage2-Rthinlto/llvm-project/compiler-rt/lib/fuzzer -arch x86_64 -stdlib=libc++ -mmacosx-version-min=10.10 -isysroot /Applications/Xcode.app/Contents/Developer/Platforms/MacOSX.platform/Developer/SDKs/MacOSX10.14.sdk /Users/buildslave/jenkins/workspace/clang-stage2-Rthinlto/llvm-project/compiler-rt/test/fuzzer/ShrinkControlFlowTest.cpp -o /Users/buildslave/jenkins/workspace/clang-stage2-Rthinlto/clang-build/Build/tools/clang/runtime/compiler-rt-bins/test/fuzzer/X86_64DefaultDarwinConfig/Output/shrink.test.tmp-ShrinkControlFlowTest : 'RUN: at line 2'; /Users/buildslave/jenkins/workspace/clang-stage2-Rthinlto/clang-build/Build/./bin/clang --driver-mode=g++ -O2 -gline-tables-only -fsanitize=address,fuzzer -I/Users/buildslave/jenkins/workspace/clang-stage2-Rthinlto/llvm-project/compiler-rt/lib/fuzzer -arch x86_64 -stdlib=libc++ -mmacosx-version-min=10.10 -isysroot /Applications/Xcode.app/Contents/Developer/Platforms/MacOSX.platform/Developer/SDKs/MacOSX10.14.sdk /Users/buildslave/jenkins/workspace/clang-stage2-Rthinlto/llvm-project/compiler-rt/test/fuzzer/ShrinkValueProfileTest.cpp -o /Users/buildslave/jenkins/workspace/clang-stage2-Rthinlto/clang-build/Build/tools/clang/runtime/compiler-rt-bins/test/fuzzer/X86_64DefaultDarwinConfig/Output/shrink.test.tmp-ShrinkValueProfileTest : 'RUN: at line 3'; /Users/buildslave/jenkins/workspace/clang-stage2-Rthinlto/clang-build/Build/tools/clang/runtime/compiler-rt-bins/test/fuzzer/X86_64DefaultDarwinConfig/Output/shrink.test.tmp-ShrinkControlFlowTest -seed=1 -exit_on_item=0eb8e4ed029b774d80f2b66408203801cb982a60 -runs=2000000 -shrink=1 -reduce_inputs=0 2>&1 | FileCheck /Users/buildslave/jenkins/workspace/clang-stage2-Rthinlto/llvm-project/compiler-rt/test/fuzzer/shrink.test --check-prefix=SHRINK1 : 'RUN: at line 5'; /Users/buildslave/jenkins/workspace/clang-stage2-Rthinlto/clang-build/Build/tools/clang/runtime/compiler-rt-bins/test/fuzzer/X86_64DefaultDarwinConfig/Output/shrink.test.tmp-ShrinkControlFlowTest -seed=1 -exit_on_item=0eb8e4ed029b774d80f2b66408203801cb982a60 -runs=1000000 -shrink=0 -reduce_inputs=0 -max_len=64 2>&1 | FileCheck /Users/buildslave/jenkins/workspace/clang-stage2-Rthinlto/llvm-project/compiler-rt/test/fuzzer/shrink.test --check-prefix=SHRINK0 : 'RUN: at line 6'; /Users/buildslave/jenkins/workspace/clang-stage2-Rthinlto/clang-build/Build/tools/clang/runtime/compiler-rt-bins/test/fuzzer/X86_64DefaultDarwinConfig/Output/shrink.test.tmp-ShrinkValueProfileTest -seed=1 -exit_on_item=aea2e3923af219a8956f626558ef32f30a914ebc -runs=100000 -shrink=1 -reduce_inputs=0 -use_value_profile=1 2>&1 | FileCheck /Users/buildslave/jenkins/workspace/clang-stage2-Rthinlto/llvm-project/compiler-rt/test/fuzzer/shrink.test --check-prefix=SHRINK1_VP -- Exit Code: 137

Hide Details

Command Output (stderr): -- /Users/buildslave/jenkins/workspace/clang-stage2-Rthinlto/clang-build/Build/tools/clang/runtime/compiler-rt-bins/test/fuzzer/X86_64DefaultDarwinConfig/Output/shrink.test.script: line 5: 18988 Done /Users/buildslave/jenkins/workspace/clang-stage2-Rthinlto/clang-build/Build/tools/clang/runtime/compiler-rt-bins/test/fuzzer/X86_64DefaultDarwinConfig/Output/shrink.test.tmp-ShrinkControlFlowTest -seed=1 -exit_on_item=0eb8e4ed029b774d80f2b66408203801cb982a60 -runs=2000000 -shrink=1 -reduce_inputs=0 2>&1 18989 Killed: 9 | FileCheck /Users/buildslave/jenkins/workspace/clang-stage2-Rthinlto/llvm-project/compiler-rt/test/fuzzer/shrink.test --check-prefix=SHRINK1

Hide Details

--

Hide Details

******************** FAIL: libFuzzer :: standalone.test (2926 of 2953) ******************** TEST 'libFuzzer :: standalone.test' FAILED ******************** Script: -- : 'RUN: at line 1'; /Users/buildslave/jenkins/workspace/clang-stage2-Rthinlto/clang-build/Build/./bin/clang -O2 -gline-tables-only -fsanitize=address -I/Users/buildslave/jenkins/workspace/clang-stage2-Rthinlto/llvm-project/compiler-rt/lib/fuzzer -arch x86_64 -stdlib=libc++ -mmacosx-version-min=10.10 -isysroot /Applications/Xcode.app/Contents/Developer/Platforms/MacOSX.platform/Developer/SDKs/MacOSX10.14.sdk /Users/buildslave/jenkins/workspace/clang-stage2-Rthinlto/llvm-project/compiler-rt/lib/fuzzer/standalone/StandaloneFuzzTargetMain.c -c -o /Users/buildslave/jenkins/workspace/clang-stage2-Rthinlto/clang-build/Build/tools/clang/runtime/compiler-rt-bins/test/fuzzer/X86_64DefaultDarwinConfig/Output/standalone.test.tmp_1.o : 'RUN: at line 2'; /Users/buildslave/jenkins/workspace/clang-stage2-Rthinlto/clang-build/Build/./bin/clang --driver-mode=g++ -O2 -gline-tables-only -fsanitize=address -I/Users/buildslave/jenkins/workspace/clang-stage2-Rthinlto/llvm-project/compiler-rt/lib/fuzzer -arch x86_64 -stdlib=libc++ -mmacosx-version-min=10.10 -isysroot /Applications/Xcode.app/Contents/Developer/Platforms/MacOSX.platform/Developer/SDKs/MacOSX10.14.sdk /Users/buildslave/jenkins/workspace/clang-stage2-Rthinlto/llvm-project/compiler-rt/test/fuzzer/InitializeTest.cpp -c -o /Users/buildslave/jenkins/workspace/clang-stage2-Rthinlto/clang-build/Build/tools/clang/runtime/compiler-rt-bins/test/fuzzer/X86_64DefaultDarwinConfig/Output/standalone.test.tmp_2.o : 'RUN: at line 4'; /Users/buildslave/jenkins/workspace/clang-stage2-Rthinlto/clang-build/Build/./bin/clang --driver-mode=g++ -O2 -gline-tables-only -fsanitize=address -I/Users/buildslave/jenkins/workspace/clang-stage2-Rthinlto/llvm-project/compiler-rt/lib/fuzzer -arch x86_64 -stdlib=libc++ -mmacosx-version-min=10.10 -isysroot /Applications/Xcode.app/Contents/Developer/Platforms/MacOSX.platform/Developer/SDKs/MacOSX10.14.sdk /Users/buildslave/jenkins/workspace/clang-stage2-Rthinlto/clang-build/Build/tools/clang/runtime/compiler-rt-bins/test/fuzzer/X86_64DefaultDarwinConfig/Output/standalone.test.tmp_1.o /Users/buildslave/jenkins/workspace/clang-stage2-Rthinlto/clang-build/Build/tools/clang/runtime/compiler-rt-bins/test/fuzzer/X86_64DefaultDarwinConfig/Output/standalone.test.tmp_2.o -o /Users/buildslave/jenkins/workspace/clang-stage2-Rthinlto/clang-build/Build/tools/clang/runtime/compiler-rt-bins/test/fuzzer/X86_64DefaultDarwinConfig/Output/standalone.test.tmp-StandaloneInitializeTest : 'RUN: at line 5'; /Users/buildslave/jenkins/workspace/clang-stage2-Rthinlto/clang-build/Build/tools/clang/runtime/compiler-rt-bins/test/fuzzer/X86_64DefaultDarwinConfig/Output/standalone.test.tmp-StandaloneInitializeTest /Users/buildslave/jenkins/workspace/clang-stage2-Rthinlto/llvm-project/compiler-rt/test/fuzzer/hi.txt /Users/buildslave/jenkins/workspace/clang-stage2-Rthinlto/llvm-project/compiler-rt/test/fuzzer/dict1.txt 2>&1 | FileCheck /Users/buildslave/jenkins/workspace/clang-stage2-Rthinlto/llvm-project/compiler-rt/test/fuzzer/standalone.test -- Exit Code: 137

Hide Details

Command Output (stderr): -- /Users/buildslave/jenkins/workspace/clang-stage2-Rthinlto/clang-build/Build/tools/clang/runtime/compiler-rt-bins/test/fuzzer/X86_64DefaultDarwinConfig/Output/standalone.test.script: line 4: 18999 Done /Users/buildslave/jenkins/workspace/clang-stage2-Rthinlto/clang-build/Build/tools/clang/runtime/compiler-rt-bins/test/fuzzer/X86_64DefaultDarwinConfig/Output/standalone.test.tmp-StandaloneInitializeTest /Users/buildslave/jenkins/workspace/clang-stage2-Rthinlto/llvm-project/compiler-rt/test/fuzzer/hi.txt /Users/buildslave/jenkins/workspace/clang-stage2-Rthinlto/llvm-project/compiler-rt/test/fuzzer/dict1.txt 2>&1 19000 Killed: 9 | FileCheck /Users/buildslave/jenkins/workspace/clang-stage2-Rthinlto/llvm-project/compiler-rt/test/fuzzer/standalone.test

Hide Details

--

Hide Details

******************** FAIL: libFuzzer :: strcmp.test (2927 of 2953) ******************** TEST 'libFuzzer :: strcmp.test' FAILED ******************** Script: -- : 'RUN: at line 2'; /Users/buildslave/jenkins/workspace/clang-stage2-Rthinlto/clang-build/Build/./bin/clang --driver-mode=g++ -O2 -gline-tables-only -fsanitize=address,fuzzer -I/Users/buildslave/jenkins/workspace/clang-stage2-Rthinlto/llvm-project/compiler-rt/lib/fuzzer -arch x86_64 -stdlib=libc++ -mmacosx-version-min=10.10 -isysroot /Applications/Xcode.app/Contents/Developer/Platforms/MacOSX.platform/Developer/SDKs/MacOSX10.14.sdk /Users/buildslave/jenkins/workspace/clang-stage2-Rthinlto/llvm-project/compiler-rt/test/fuzzer/StrcmpTest.cpp -o /Users/buildslave/jenkins/workspace/clang-stage2-Rthinlto/clang-build/Build/tools/clang/runtime/compiler-rt-bins/test/fuzzer/X86_64DefaultDarwinConfig/Output/strcmp.test.tmp-StrcmpTest : 'RUN: at line 3'; not /Users/buildslave/jenkins/workspace/clang-stage2-Rthinlto/clang-build/Build/tools/clang/runtime/compiler-rt-bins/test/fuzzer/X86_64DefaultDarwinConfig/Output/strcmp.test.tmp-StrcmpTest -seed=1 -runs=2000000 2>&1 | FileCheck /Users/buildslave/jenkins/workspace/clang-stage2-Rthinlto/llvm-project/compiler-rt/test/fuzzer/strcmp.test -- Exit Code: 137

Hide Details

Command Output (stderr): -- /Users/buildslave/jenkins/workspace/clang-stage2-Rthinlto/clang-build/Build/tools/clang/runtime/compiler-rt-bins/test/fuzzer/X86_64DefaultDarwinConfig/Output/strcmp.test.script: line 2: 19005 Done not /Users/buildslave/jenkins/workspace/clang-stage2-Rthinlto/clang-build/Build/tools/clang/runtime/compiler-rt-bins/test/fuzzer/X86_64DefaultDarwinConfig/Output/strcmp.test.tmp-StrcmpTest -seed=1 -runs=2000000 2>&1 19006 Killed: 9 | FileCheck /Users/buildslave/jenkins/workspace/clang-stage2-Rthinlto/llvm-project/compiler-rt/test/fuzzer/strcmp.test

Hide Details

--

Hide Details

******************** FAIL: libFuzzer :: simple.test (2928 of 2953) ******************** TEST 'libFuzzer :: simple.test' FAILED ******************** Script: -- : 'RUN: at line 2'; /Users/buildslave/jenkins/workspace/clang-stage2-Rthinlto/clang-build/Build/./bin/clang --driver-mode=g++ -O2 -gline-tables-only -fsanitize=address,fuzzer -I/Users/buildslave/jenkins/workspace/clang-stage2-Rthinlto/llvm-project/compiler-rt/lib/fuzzer -arch x86_64 -stdlib=libc++ -mmacosx-version-min=10.10 -isysroot /Applications/Xcode.app/Contents/Developer/Platforms/MacOSX.platform/Developer/SDKs/MacOSX10.14.sdk /Users/buildslave/jenkins/workspace/clang-stage2-Rthinlto/llvm-project/compiler-rt/test/fuzzer/SimpleTest.cpp -o /Users/buildslave/jenkins/workspace/clang-stage2-Rthinlto/clang-build/Build/tools/clang/runtime/compiler-rt-bins/test/fuzzer/X86_64DefaultDarwinConfig/Output/simple.test.tmp-SimpleTest : 'RUN: at line 4'; not /Users/buildslave/jenkins/workspace/clang-stage2-Rthinlto/clang-build/Build/tools/clang/runtime/compiler-rt-bins/test/fuzzer/X86_64DefaultDarwinConfig/Output/simple.test.tmp-SimpleTest 2>&1 | FileCheck /Users/buildslave/jenkins/workspace/clang-stage2-Rthinlto/llvm-project/compiler-rt/test/fuzzer/simple.test : 'RUN: at line 7'; not /Users/buildslave/jenkins/workspace/clang-stage2-Rthinlto/clang-build/Build/tools/clang/runtime/compiler-rt-bins/test/fuzzer/X86_64DefaultDarwinConfig/Output/simple.test.tmp-SimpleTest -only_ascii=1 2>&1 -- Exit Code: 137

Hide Details

Command Output (stderr): -- /Users/buildslave/jenkins/workspace/clang-stage2-Rthinlto/clang-build/Build/tools/clang/runtime/compiler-rt-bins/test/fuzzer/X86_64DefaultDarwinConfig/Output/simple.test.script: line 3: 19011 Done not /Users/buildslave/jenkins/workspace/clang-stage2-Rthinlto/clang-build/Build/tools/clang/runtime/compiler-rt-bins/test/fuzzer/X86_64DefaultDarwinConfig/Output/simple.test.tmp-SimpleTest 2>&1 19012 Killed: 9 | FileCheck /Users/buildslave/jenkins/workspace/clang-stage2-Rthinlto/llvm-project/compiler-rt/test/fuzzer/simple.test

Hide Details

--

Hide Details

******************** FAIL: libFuzzer :: strncmp.test (2929 of 2953) ******************** TEST 'libFuzzer :: strncmp.test' FAILED ******************** Script: -- : 'RUN: at line 2'; /Users/buildslave/jenkins/workspace/clang-stage2-Rthinlto/clang-build/Build/./bin/clang --driver-mode=g++ -O2 -gline-tables-only -fsanitize=address,fuzzer -I/Users/buildslave/jenkins/workspace/clang-stage2-Rthinlto/llvm-project/compiler-rt/lib/fuzzer -arch x86_64 -stdlib=libc++ -mmacosx-version-min=10.10 -isysroot /Applications/Xcode.app/Contents/Developer/Platforms/MacOSX.platform/Developer/SDKs/MacOSX10.14.sdk /Users/buildslave/jenkins/workspace/clang-stage2-Rthinlto/llvm-project/compiler-rt/test/fuzzer/StrncmpTest.cpp -o /Users/buildslave/jenkins/workspace/clang-stage2-Rthinlto/clang-build/Build/tools/clang/runtime/compiler-rt-bins/test/fuzzer/X86_64DefaultDarwinConfig/Output/strncmp.test.tmp-StrncmpTest : 'RUN: at line 3'; not /Users/buildslave/jenkins/workspace/clang-stage2-Rthinlto/clang-build/Build/tools/clang/runtime/compiler-rt-bins/test/fuzzer/X86_64DefaultDarwinConfig/Output/strncmp.test.tmp-StrncmpTest -seed=2 -runs=10000000 2>&1 | FileCheck /Users/buildslave/jenkins/workspace/clang-stage2-Rthinlto/llvm-project/compiler-rt/test/fuzzer/strncmp.test -- Exit Code: 137

Hide Details

Command Output (stderr): -- /Users/buildslave/jenkins/workspace/clang-stage2-Rthinlto/clang-build/Build/tools/clang/runtime/compiler-rt-bins/test/fuzzer/X86_64DefaultDarwinConfig/Output/strncmp.test.script: line 2: 19032 Done not /Users/buildslave/jenkins/workspace/clang-stage2-Rthinlto/clang-build/Build/tools/clang/runtime/compiler-rt-bins/test/fuzzer/X86_64DefaultDarwinConfig/Output/strncmp.test.tmp-StrncmpTest -seed=2 -runs=10000000 2>&1 19033 Killed: 9 | FileCheck /Users/buildslave/jenkins/workspace/clang-stage2-Rthinlto/llvm-project/compiler-rt/test/fuzzer/strncmp.test

Hide Details

--

Hide Details

******************** PASS: libFuzzer :: strncmp-oob.test (2930 of 2953) FAIL: libFuzzer :: strstr.test (2931 of 2953) ******************** TEST 'libFuzzer :: strstr.test' FAILED ******************** Script: -- : 'RUN: at line 2'; /Users/buildslave/jenkins/workspace/clang-stage2-Rthinlto/clang-build/Build/./bin/clang --driver-mode=g++ -O2 -gline-tables-only -fsanitize=address,fuzzer -I/Users/buildslave/jenkins/workspace/clang-stage2-Rthinlto/llvm-project/compiler-rt/lib/fuzzer -arch x86_64 -stdlib=libc++ -mmacosx-version-min=10.10 -isysroot /Applications/Xcode.app/Contents/Developer/Platforms/MacOSX.platform/Developer/SDKs/MacOSX10.14.sdk /Users/buildslave/jenkins/workspace/clang-stage2-Rthinlto/llvm-project/compiler-rt/test/fuzzer/StrstrTest.cpp -o /Users/buildslave/jenkins/workspace/clang-stage2-Rthinlto/clang-build/Build/tools/clang/runtime/compiler-rt-bins/test/fuzzer/X86_64DefaultDarwinConfig/Output/strstr.test.tmp-StrstrTest : 'RUN: at line 3'; not /Users/buildslave/jenkins/workspace/clang-stage2-Rthinlto/clang-build/Build/tools/clang/runtime/compiler-rt-bins/test/fuzzer/X86_64DefaultDarwinConfig/Output/strstr.test.tmp-StrstrTest -seed=1 -runs=2000000 2>&1 | FileCheck /Users/buildslave/jenkins/workspace/clang-stage2-Rthinlto/llvm-project/compiler-rt/test/fuzzer/strstr.test -- Exit Code: 137

Hide Details

Command Output (stderr): -- /Users/buildslave/jenkins/workspace/clang-stage2-Rthinlto/clang-build/Build/tools/clang/runtime/compiler-rt-bins/test/fuzzer/X86_64DefaultDarwinConfig/Output/strstr.test.script: line 2: 19063 Done not /Users/buildslave/jenkins/workspace/clang-stage2-Rthinlto/clang-build/Build/tools/clang/runtime/compiler-rt-bins/test/fuzzer/X86_64DefaultDarwinConfig/Output/strstr.test.tmp-StrstrTest -seed=1 -runs=2000000 2>&1 19064 Killed: 9 | FileCheck /Users/buildslave/jenkins/workspace/clang-stage2-Rthinlto/llvm-project/compiler-rt/test/fuzzer/strstr.test

Hide Details

--

Hide Details

******************** FAIL: libFuzzer :: symbolize-deadlock.test (2932 of 2953) ******************** TEST 'libFuzzer :: symbolize-deadlock.test' FAILED ******************** Script: -- : 'RUN: at line 1'; /Users/buildslave/jenkins/workspace/clang-stage2-Rthinlto/clang-build/Build/./bin/clang --driver-mode=g++ -O2 -gline-tables-only -fsanitize=address,fuzzer -I/Users/buildslave/jenkins/workspace/clang-stage2-Rthinlto/llvm-project/compiler-rt/lib/fuzzer -arch x86_64 -stdlib=libc++ -mmacosx-version-min=10.10 -isysroot /Applications/Xcode.app/Contents/Developer/Platforms/MacOSX.platform/Developer/SDKs/MacOSX10.14.sdk /Users/buildslave/jenkins/workspace/clang-stage2-Rthinlto/llvm-project/compiler-rt/test/fuzzer/SymbolizeDeadlock.cpp -o /Users/buildslave/jenkins/workspace/clang-stage2-Rthinlto/clang-build/Build/tools/clang/runtime/compiler-rt-bins/test/fuzzer/X86_64DefaultDarwinConfig/Output/symbolize-deadlock.test.tmp : 'RUN: at line 2'; not /Users/buildslave/jenkins/workspace/clang-stage2-Rthinlto/clang-build/Build/tools/clang/runtime/compiler-rt-bins/test/fuzzer/X86_64DefaultDarwinConfig/Output/symbolize-deadlock.test.tmp -rss_limit_mb=20 2>&1 -- Exit Code: 254

Hide Details

Command Output (stderr): -- clang-10: error: unable to execute command: Killed: 9 clang-10: error: dsymutil command failed due to signal (use -v to see invocation)

Hide Details

--

Hide Details

******************** UNSUPPORTED: libFuzzer :: target-function.test (2933 of 2953) FAIL: libFuzzer :: swap-cmp.test (2934 of 2953) ******************** TEST 'libFuzzer :: swap-cmp.test' FAILED ******************** Script: -- : 'RUN: at line 1'; /Users/buildslave/jenkins/workspace/clang-stage2-Rthinlto/clang-build/Build/./bin/clang --driver-mode=g++ -O2 -gline-tables-only -fsanitize=address,fuzzer -I/Users/buildslave/jenkins/workspace/clang-stage2-Rthinlto/llvm-project/compiler-rt/lib/fuzzer -arch x86_64 -stdlib=libc++ -mmacosx-version-min=10.10 -isysroot /Applications/Xcode.app/Contents/Developer/Platforms/MacOSX.platform/Developer/SDKs/MacOSX10.14.sdk /Users/buildslave/jenkins/workspace/clang-stage2-Rthinlto/llvm-project/compiler-rt/test/fuzzer/SwapCmpTest.cpp -o /Users/buildslave/jenkins/workspace/clang-stage2-Rthinlto/clang-build/Build/tools/clang/runtime/compiler-rt-bins/test/fuzzer/X86_64DefaultDarwinConfig/Output/swap-cmp.test.tmp-SwapCmpTest : 'RUN: at line 3'; not /Users/buildslave/jenkins/workspace/clang-stage2-Rthinlto/clang-build/Build/tools/clang/runtime/compiler-rt-bins/test/fuzzer/X86_64DefaultDarwinConfig/Output/swap-cmp.test.tmp-SwapCmpTest -seed=1 -runs=10000000 2>&1 | FileCheck /Users/buildslave/jenkins/workspace/clang-stage2-Rthinlto/llvm-project/compiler-rt/test/fuzzer/swap-cmp.test -- Exit Code: 137

Hide Details

Command Output (stderr): -- /Users/buildslave/jenkins/workspace/clang-stage2-Rthinlto/clang-build/Build/tools/clang/runtime/compiler-rt-bins/test/fuzzer/X86_64DefaultDarwinConfig/Output/swap-cmp.test.script: line 2: 19056 Done not /Users/buildslave/jenkins/workspace/clang-stage2-Rthinlto/clang-build/Build/tools/clang/runtime/compiler-rt-bins/test/fuzzer/X86_64DefaultDarwinConfig/Output/swap-cmp.test.tmp-SwapCmpTest -seed=1 -runs=10000000 2>&1 19057 Killed: 9 | FileCheck /Users/buildslave/jenkins/workspace/clang-stage2-Rthinlto/llvm-project/compiler-rt/test/fuzzer/swap-cmp.test

Hide Details

--

Hide Details

******************** UNSUPPORTED: libFuzzer :: trace-malloc-2.test (2935 of 2953) UNSUPPORTED: libFuzzer :: trace-malloc-threaded.test (2936 of 2953) UNSUPPORTED: libFuzzer :: trace-malloc-unbalanced.test (2937 of 2953) PASS: libFuzzer :: large.test (2938 of 2953) FAIL: libFuzzer :: three-bytes.test (2939 of 2953) ******************** TEST 'libFuzzer :: three-bytes.test' FAILED ******************** Script: -- : 'RUN: at line 2'; /Users/buildslave/jenkins/workspace/clang-stage2-Rthinlto/clang-build/Build/./bin/clang --driver-mode=g++ -O2 -gline-tables-only -fsanitize=address,fuzzer -I/Users/buildslave/jenkins/workspace/clang-stage2-Rthinlto/llvm-project/compiler-rt/lib/fuzzer -arch x86_64 -stdlib=libc++ -mmacosx-version-min=10.10 -isysroot /Applications/Xcode.app/Contents/Developer/Platforms/MacOSX.platform/Developer/SDKs/MacOSX10.14.sdk /Users/buildslave/jenkins/workspace/clang-stage2-Rthinlto/llvm-project/compiler-rt/test/fuzzer/ThreeBytes.cpp -o /Users/buildslave/jenkins/workspace/clang-stage2-Rthinlto/clang-build/Build/tools/clang/runtime/compiler-rt-bins/test/fuzzer/X86_64DefaultDarwinConfig/Output/three-bytes.test.tmp : 'RUN: at line 4'; /Users/buildslave/jenkins/workspace/clang-stage2-Rthinlto/clang-build/Build/tools/clang/runtime/compiler-rt-bins/test/fuzzer/X86_64DefaultDarwinConfig/Output/three-bytes.test.tmp -seed=1 -runs=30000 : 'RUN: at line 5'; not /Users/buildslave/jenkins/workspace/clang-stage2-Rthinlto/clang-build/Build/tools/clang/runtime/compiler-rt-bins/test/fuzzer/X86_64DefaultDarwinConfig/Output/three-bytes.test.tmp -seed=1 -runs=1000000 -use_value_profile=2 2>&1 | FileCheck /Users/buildslave/jenkins/workspace/clang-stage2-Rthinlto/llvm-project/compiler-rt/test/fuzzer/three-bytes.test -- Exit Code: 137

Hide Details

Command Output (stderr): -- INFO: Seed: 1 INFO: Loaded 1 modules (4 inline 8-bit counters): 4 [0x10d6f69d8, 0x10d6f69dc), INFO: Loaded 1 PC tables (4 PCs): 4 [0x10d6f69e0,0x10d6f6a20), INFO: -max_len is not provided; libFuzzer will not generate inputs larger than 4096 bytes INFO: A corpus is not provided, starting from an empty corpus #2 INITED cov: 2 ft: 2 corp: 1/1b exec/s: 0 rss: 26Mb #6 NEW cov: 3 ft: 3 corp: 2/5b lim: 4 exec/s: 0 rss: 26Mb L: 4/4 MS: 4 ShuffleBytes-ChangeBit-CrossOver-CrossOver- #9 REDUCE cov: 3 ft: 3 corp: 2/4b lim: 4 exec/s: 0 rss: 27Mb L: 3/3 MS: 3 ChangeByte-EraseBytes-InsertByte- #30000 DONE cov: 3 ft: 3 corp: 2/4b lim: 301 exec/s: 0 rss: 30Mb Done 30000 runs in 0 second(s) /Users/buildslave/jenkins/workspace/clang-stage2-Rthinlto/clang-build/Build/tools/clang/runtime/compiler-rt-bins/test/fuzzer/X86_64DefaultDarwinConfig/Output/three-bytes.test.script: line 3: 19087 Done not /Users/buildslave/jenkins/workspace/clang-stage2-Rthinlto/clang-build/Build/tools/clang/runtime/compiler-rt-bins/test/fuzzer/X86_64DefaultDarwinConfig/Output/three-bytes.test.tmp -seed=1 -runs=1000000 -use_value_profile=2 2>&1 19088 Killed: 9 | FileCheck /Users/buildslave/jenkins/workspace/clang-stage2-Rthinlto/llvm-project/compiler-rt/test/fuzzer/three-bytes.test

Hide Details

--

Hide Details

******************** FAIL: libFuzzer :: trace-malloc.test (2940 of 2953) ******************** TEST 'libFuzzer :: trace-malloc.test' FAILED ******************** Script: -- : 'RUN: at line 1'; /Users/buildslave/jenkins/workspace/clang-stage2-Rthinlto/clang-build/Build/./bin/clang --driver-mode=g++ -O2 -gline-tables-only -fsanitize=address,fuzzer -I/Users/buildslave/jenkins/workspace/clang-stage2-Rthinlto/llvm-project/compiler-rt/lib/fuzzer -arch x86_64 -stdlib=libc++ -mmacosx-version-min=10.10 -isysroot /Applications/Xcode.app/Contents/Developer/Platforms/MacOSX.platform/Developer/SDKs/MacOSX10.14.sdk /Users/buildslave/jenkins/workspace/clang-stage2-Rthinlto/llvm-project/compiler-rt/test/fuzzer/TraceMallocTest.cpp -o /Users/buildslave/jenkins/workspace/clang-stage2-Rthinlto/clang-build/Build/tools/clang/runtime/compiler-rt-bins/test/fuzzer/X86_64DefaultDarwinConfig/Output/trace-malloc.test.tmp-TraceMallocTest : 'RUN: at line 3'; /Users/buildslave/jenkins/workspace/clang-stage2-Rthinlto/clang-build/Build/tools/clang/runtime/compiler-rt-bins/test/fuzzer/X86_64DefaultDarwinConfig/Output/trace-malloc.test.tmp-TraceMallocTest -seed=1 -trace_malloc=1 -runs=10000 2>&1 | FileCheck /Users/buildslave/jenkins/workspace/clang-stage2-Rthinlto/llvm-project/compiler-rt/test/fuzzer/trace-malloc.test -- Exit Code: 137

Hide Details

Command Output (stderr): -- /Users/buildslave/jenkins/workspace/clang-stage2-Rthinlto/clang-build/Build/tools/clang/runtime/compiler-rt-bins/test/fuzzer/X86_64DefaultDarwinConfig/Output/trace-malloc.test.script: line 2: 19106 Done /Users/buildslave/jenkins/workspace/clang-stage2-Rthinlto/clang-build/Build/tools/clang/runtime/compiler-rt-bins/test/fuzzer/X86_64DefaultDarwinConfig/Output/trace-malloc.test.tmp-TraceMallocTest -seed=1 -trace_malloc=1 -runs=10000 2>&1 19107 Killed: 9 | FileCheck /Users/buildslave/jenkins/workspace/clang-stage2-Rthinlto/llvm-project/compiler-rt/test/fuzzer/trace-malloc.test

Hide Details

--

Hide Details

******************** PASS: libFuzzer :: ulimit.test (2941 of 2953) FAIL: libFuzzer :: value-profile-cmp2.test (2942 of 2953) ******************** TEST 'libFuzzer :: value-profile-cmp2.test' FAILED ******************** Script: -- : 'RUN: at line 5'; /Users/buildslave/jenkins/workspace/clang-stage2-Rthinlto/clang-build/Build/./bin/clang --driver-mode=g++ -O2 -gline-tables-only -fsanitize=address,fuzzer -I/Users/buildslave/jenkins/workspace/clang-stage2-Rthinlto/llvm-project/compiler-rt/lib/fuzzer -arch x86_64 -stdlib=libc++ -mmacosx-version-min=10.10 -isysroot /Applications/Xcode.app/Contents/Developer/Platforms/MacOSX.platform/Developer/SDKs/MacOSX10.14.sdk -fno-sanitize=address /Users/buildslave/jenkins/workspace/clang-stage2-Rthinlto/llvm-project/compiler-rt/test/fuzzer/SimpleHashTest.cpp -o /Users/buildslave/jenkins/workspace/clang-stage2-Rthinlto/clang-build/Build/tools/clang/runtime/compiler-rt-bins/test/fuzzer/X86_64DefaultDarwinConfig/Output/value-profile-cmp2.test.tmp-SimpleHashTest : 'RUN: at line 6'; not /Users/buildslave/jenkins/workspace/clang-stage2-Rthinlto/clang-build/Build/tools/clang/runtime/compiler-rt-bins/test/fuzzer/X86_64DefaultDarwinConfig/Output/value-profile-cmp2.test.tmp-SimpleHashTest -seed=1 -use_cmp=0 -use_value_profile=1 -runs=100000000 -max_len=64 2>&1 | FileCheck /Users/buildslave/jenkins/workspace/clang-stage2-Rthinlto/llvm-project/compiler-rt/test/fuzzer/value-profile-cmp2.test -- Exit Code: 137

Hide Details

Command Output (stderr): -- /Users/buildslave/jenkins/workspace/clang-stage2-Rthinlto/clang-build/Build/tools/clang/runtime/compiler-rt-bins/test/fuzzer/X86_64DefaultDarwinConfig/Output/value-profile-cmp2.test.script: line 2: 19112 Done not /Users/buildslave/jenkins/workspace/clang-stage2-Rthinlto/clang-build/Build/tools/clang/runtime/compiler-rt-bins/test/fuzzer/X86_64DefaultDarwinConfig/Output/value-profile-cmp2.test.tmp-SimpleHashTest -seed=1 -use_cmp=0 -use_value_profile=1 -runs=100000000 -max_len=64 2>&1 19113 Killed: 9 | FileCheck /Users/buildslave/jenkins/workspace/clang-stage2-Rthinlto/llvm-project/compiler-rt/test/fuzzer/value-profile-cmp2.test

Hide Details

--

Hide Details

******************** FAIL: libFuzzer :: value-profile-cmp3.test (2943 of 2953) ******************** TEST 'libFuzzer :: value-profile-cmp3.test' FAILED ******************** Script: -- : 'RUN: at line 3'; /Users/buildslave/jenkins/workspace/clang-stage2-Rthinlto/clang-build/Build/./bin/clang --driver-mode=g++ -O2 -gline-tables-only -fsanitize=address,fuzzer -I/Users/buildslave/jenkins/workspace/clang-stage2-Rthinlto/llvm-project/compiler-rt/lib/fuzzer -arch x86_64 -stdlib=libc++ -mmacosx-version-min=10.10 -isysroot /Applications/Xcode.app/Contents/Developer/Platforms/MacOSX.platform/Developer/SDKs/MacOSX10.14.sdk /Users/buildslave/jenkins/workspace/clang-stage2-Rthinlto/llvm-project/compiler-rt/test/fuzzer/AbsNegAndConstantTest.cpp -o /Users/buildslave/jenkins/workspace/clang-stage2-Rthinlto/clang-build/Build/tools/clang/runtime/compiler-rt-bins/test/fuzzer/X86_64DefaultDarwinConfig/Output/value-profile-cmp3.test.tmp-AbsNegAndConstantTest : 'RUN: at line 4'; not /Users/buildslave/jenkins/workspace/clang-stage2-Rthinlto/clang-build/Build/tools/clang/runtime/compiler-rt-bins/test/fuzzer/X86_64DefaultDarwinConfig/Output/value-profile-cmp3.test.tmp-AbsNegAndConstantTest -seed=1 -use_cmp=0 -use_value_profile=1 -runs=100000000 2>&1 | FileCheck /Users/buildslave/jenkins/workspace/clang-stage2-Rthinlto/llvm-project/compiler-rt/test/fuzzer/value-profile-cmp3.test -- Exit Code: 137

Hide Details

Command Output (stderr): -- /Users/buildslave/jenkins/workspace/clang-stage2-Rthinlto/clang-build/Build/tools/clang/runtime/compiler-rt-bins/test/fuzzer/X86_64DefaultDarwinConfig/Output/value-profile-cmp3.test.script: line 2: 19128 Done not /Users/buildslave/jenkins/workspace/clang-stage2-Rthinlto/clang-build/Build/tools/clang/runtime/compiler-rt-bins/test/fuzzer/X86_64DefaultDarwinConfig/Output/value-profile-cmp3.test.tmp-AbsNegAndConstantTest -seed=1 -use_cmp=0 -use_value_profile=1 -runs=100000000 2>&1 19129 Killed: 9 | FileCheck /Users/buildslave/jenkins/workspace/clang-stage2-Rthinlto/llvm-project/compiler-rt/test/fuzzer/value-profile-cmp3.test

Hide Details

--

Hide Details

******************** FAIL: libFuzzer :: value-profile-div.test (2944 of 2953) ******************** TEST 'libFuzzer :: value-profile-div.test' FAILED ******************** Script: -- : 'RUN: at line 4'; /Users/buildslave/jenkins/workspace/clang-stage2-Rthinlto/clang-build/Build/./bin/clang --driver-mode=g++ -O2 -gline-tables-only -fsanitize=address,fuzzer -I/Users/buildslave/jenkins/workspace/clang-stage2-Rthinlto/llvm-project/compiler-rt/lib/fuzzer -arch x86_64 -stdlib=libc++ -mmacosx-version-min=10.10 -isysroot /Applications/Xcode.app/Contents/Developer/Platforms/MacOSX.platform/Developer/SDKs/MacOSX10.14.sdk /Users/buildslave/jenkins/workspace/clang-stage2-Rthinlto/llvm-project/compiler-rt/test/fuzzer/DivTest.cpp -fsanitize-coverage=trace-div -o /Users/buildslave/jenkins/workspace/clang-stage2-Rthinlto/clang-build/Build/tools/clang/runtime/compiler-rt-bins/test/fuzzer/X86_64DefaultDarwinConfig/Output/value-profile-div.test.tmp-DivTest : 'RUN: at line 5'; not /Users/buildslave/jenkins/workspace/clang-stage2-Rthinlto/clang-build/Build/tools/clang/runtime/compiler-rt-bins/test/fuzzer/X86_64DefaultDarwinConfig/Output/value-profile-div.test.tmp-DivTest -seed=1 -use_value_profile=1 -runs=10000000 2>&1 | FileCheck /Users/buildslave/jenkins/workspace/clang-stage2-Rthinlto/llvm-project/compiler-rt/test/fuzzer/value-profile-div.test -- Exit Code: 137

Hide Details

Command Output (stderr): -- /Users/buildslave/jenkins/workspace/clang-stage2-Rthinlto/clang-build/Build/tools/clang/runtime/compiler-rt-bins/test/fuzzer/X86_64DefaultDarwinConfig/Output/value-profile-div.test.script: line 2: 19154 Done not /Users/buildslave/jenkins/workspace/clang-stage2-Rthinlto/clang-build/Build/tools/clang/runtime/compiler-rt-bins/test/fuzzer/X86_64DefaultDarwinConfig/Output/value-profile-div.test.tmp-DivTest -seed=1 -use_value_profile=1 -runs=10000000 2>&1 19155 Killed: 9 | FileCheck /Users/buildslave/jenkins/workspace/clang-stage2-Rthinlto/llvm-project/compiler-rt/test/fuzzer/value-profile-div.test

Hide Details

--

Hide Details

******************** FAIL: libFuzzer :: value-profile-cmp4.test (2945 of 2953) ******************** TEST 'libFuzzer :: value-profile-cmp4.test' FAILED ******************** Script: -- : 'RUN: at line 2'; /Users/buildslave/jenkins/workspace/clang-stage2-Rthinlto/clang-build/Build/./bin/clang --driver-mode=g++ -O2 -gline-tables-only -fsanitize=address,fuzzer -I/Users/buildslave/jenkins/workspace/clang-stage2-Rthinlto/llvm-project/compiler-rt/lib/fuzzer -arch x86_64 -stdlib=libc++ -mmacosx-version-min=10.10 -isysroot /Applications/Xcode.app/Contents/Developer/Platforms/MacOSX.platform/Developer/SDKs/MacOSX10.14.sdk /Users/buildslave/jenkins/workspace/clang-stage2-Rthinlto/llvm-project/compiler-rt/test/fuzzer/AbsNegAndConstant64Test.cpp -o /Users/buildslave/jenkins/workspace/clang-stage2-Rthinlto/clang-build/Build/tools/clang/runtime/compiler-rt-bins/test/fuzzer/X86_64DefaultDarwinConfig/Output/value-profile-cmp4.test.tmp-AbsNegAndConstant64Test : 'RUN: at line 3'; not /Users/buildslave/jenkins/workspace/clang-stage2-Rthinlto/clang-build/Build/tools/clang/runtime/compiler-rt-bins/test/fuzzer/X86_64DefaultDarwinConfig/Output/value-profile-cmp4.test.tmp-AbsNegAndConstant64Test -seed=1 -use_cmp=0 -use_value_profile=1 -runs=100000000 2>&1 | FileCheck /Users/buildslave/jenkins/workspace/clang-stage2-Rthinlto/llvm-project/compiler-rt/test/fuzzer/value-profile-cmp4.test -- Exit Code: 137

Hide Details

Command Output (stderr): -- /Users/buildslave/jenkins/workspace/clang-stage2-Rthinlto/llvm-project/compiler-rt/test/fuzzer/AbsNegAndConstant64Test.cpp:20:69: warning: format specifies type 'unsigned long' but the argument has type 'int64_t' (aka 'long long') [-Wformat] printf("BINGO; Found the target, exiting; x = 0x%lx y 0x%lx\n", x, y); ~~~ ^ %llx /Users/buildslave/jenkins/workspace/clang-stage2-Rthinlto/llvm-project/compiler-rt/test/fuzzer/AbsNegAndConstant64Test.cpp:20:72: warning: format specifies type 'unsigned long' but the argument has type 'uint64_t' (aka 'unsigned long long') [-Wformat] printf("BINGO; Found the target, exiting; x = 0x%lx y 0x%lx\n", x, y); ~~~ ^ %llx 2 warnings generated. /Users/buildslave/jenkins/workspace/clang-stage2-Rthinlto/clang-build/Build/tools/clang/runtime/compiler-rt-bins/test/fuzzer/X86_64DefaultDarwinConfig/Output/value-profile-cmp4.test.script: line 2: 19140 Done not /Users/buildslave/jenkins/workspace/clang-stage2-Rthinlto/clang-build/Build/tools/clang/runtime/compiler-rt-bins/test/fuzzer/X86_64DefaultDarwinConfig/Output/value-profile-cmp4.test.tmp-AbsNegAndConstant64Test -seed=1 -use_cmp=0 -use_value_profile=1 -runs=100000000 2>&1 19141 Killed: 9 | FileCheck /Users/buildslave/jenkins/workspace/clang-stage2-Rthinlto/llvm-project/compiler-rt/test/fuzzer/value-profile-cmp4.test

Hide Details

--

Hide Details

******************** FAIL: libFuzzer :: value-profile-cmp.test (2946 of 2953) ******************** TEST 'libFuzzer :: value-profile-cmp.test' FAILED ******************** Script: -- : 'RUN: at line 3'; /Users/buildslave/jenkins/workspace/clang-stage2-Rthinlto/clang-build/Build/./bin/clang --driver-mode=g++ -O2 -gline-tables-only -fsanitize=address,fuzzer -I/Users/buildslave/jenkins/workspace/clang-stage2-Rthinlto/llvm-project/compiler-rt/lib/fuzzer -arch x86_64 -stdlib=libc++ -mmacosx-version-min=10.10 -isysroot /Applications/Xcode.app/Contents/Developer/Platforms/MacOSX.platform/Developer/SDKs/MacOSX10.14.sdk /Users/buildslave/jenkins/workspace/clang-stage2-Rthinlto/llvm-project/compiler-rt/test/fuzzer/SimpleCmpTest.cpp -o /Users/buildslave/jenkins/workspace/clang-stage2-Rthinlto/clang-build/Build/tools/clang/runtime/compiler-rt-bins/test/fuzzer/X86_64DefaultDarwinConfig/Output/value-profile-cmp.test.tmp-SimpleCmpTest : 'RUN: at line 4'; not /Users/buildslave/jenkins/workspace/clang-stage2-Rthinlto/clang-build/Build/tools/clang/runtime/compiler-rt-bins/test/fuzzer/X86_64DefaultDarwinConfig/Output/value-profile-cmp.test.tmp-SimpleCmpTest -seed=1 -use_cmp=0 -use_value_profile=1 -runs=100000000 2>&1 | FileCheck /Users/buildslave/jenkins/workspace/clang-stage2-Rthinlto/llvm-project/compiler-rt/test/fuzzer/value-profile-cmp.test -- Exit Code: 137

Hide Details

Command Output (stderr): -- /Users/buildslave/jenkins/workspace/clang-stage2-Rthinlto/llvm-project/compiler-rt/test/fuzzer/SimpleCmpTest.cpp:42:19: warning: format specifies type 'ssize_t' (aka 'long') but the argument has type 'uint64_t' (aka 'unsigned long long') [-Wformat] Size, x, y, z, a); ^ /Users/buildslave/jenkins/workspace/clang-stage2-Rthinlto/llvm-project/compiler-rt/test/fuzzer/SimpleCmpTest.cpp:42:22: warning: format specifies type 'ssize_t' (aka 'long') but the argument has type 'int64_t' (aka 'long long') [-Wformat] Size, x, y, z, a); ^ 2 warnings generated. /Users/buildslave/jenkins/workspace/clang-stage2-Rthinlto/clang-build/Build/tools/clang/runtime/compiler-rt-bins/test/fuzzer/X86_64DefaultDarwinConfig/Output/value-profile-cmp.test.script: line 2: 19103 Done not /Users/buildslave/jenkins/workspace/clang-stage2-Rthinlto/clang-build/Build/tools/clang/runtime/compiler-rt-bins/test/fuzzer/X86_64DefaultDarwinConfig/Output/value-profile-cmp.test.tmp-SimpleCmpTest -seed=1 -use_cmp=0 -use_value_profile=1 -runs=100000000 2>&1 19104 Killed: 9 | FileCheck /Users/buildslave/jenkins/workspace/clang-stage2-Rthinlto/llvm-project/compiler-rt/test/fuzzer/value-profile-cmp.test

Hide Details

--

Hide Details

******************** FAIL: libFuzzer :: value-profile-mem.test (2947 of 2953) ******************** TEST 'libFuzzer :: value-profile-mem.test' FAILED ******************** Script: -- : 'RUN: at line 5'; /Users/buildslave/jenkins/workspace/clang-stage2-Rthinlto/clang-build/Build/./bin/clang --driver-mode=g++ -O2 -gline-tables-only -fsanitize=address,fuzzer -I/Users/buildslave/jenkins/workspace/clang-stage2-Rthinlto/llvm-project/compiler-rt/lib/fuzzer -arch x86_64 -stdlib=libc++ -mmacosx-version-min=10.10 -isysroot /Applications/Xcode.app/Contents/Developer/Platforms/MacOSX.platform/Developer/SDKs/MacOSX10.14.sdk /Users/buildslave/jenkins/workspace/clang-stage2-Rthinlto/llvm-project/compiler-rt/test/fuzzer/SingleMemcmpTest.cpp -o /Users/buildslave/jenkins/workspace/clang-stage2-Rthinlto/clang-build/Build/tools/clang/runtime/compiler-rt-bins/test/fuzzer/X86_64DefaultDarwinConfig/Output/value-profile-mem.test.tmp-SingleMemcmpTest -fno-sanitize-coverage=trace-cmp : 'RUN: at line 6'; not /Users/buildslave/jenkins/workspace/clang-stage2-Rthinlto/clang-build/Build/tools/clang/runtime/compiler-rt-bins/test/fuzzer/X86_64DefaultDarwinConfig/Output/value-profile-mem.test.tmp-SingleMemcmpTest -seed=1 -use_cmp=0 -use_value_profile=1 -runs=10000000 2>&1 | FileCheck /Users/buildslave/jenkins/workspace/clang-stage2-Rthinlto/llvm-project/compiler-rt/test/fuzzer/value-profile-mem.test -- Exit Code: 137

Hide Details

Command Output (stderr): -- /Users/buildslave/jenkins/workspace/clang-stage2-Rthinlto/clang-build/Build/tools/clang/runtime/compiler-rt-bins/test/fuzzer/X86_64DefaultDarwinConfig/Output/value-profile-mem.test.script: line 2: 19184 Done not /Users/buildslave/jenkins/workspace/clang-stage2-Rthinlto/clang-build/Build/tools/clang/runtime/compiler-rt-bins/test/fuzzer/X86_64DefaultDarwinConfig/Output/value-profile-mem.test.tmp-SingleMemcmpTest -seed=1 -use_cmp=0 -use_value_profile=1 -runs=10000000 2>&1 19185 Killed: 9 | FileCheck /Users/buildslave/jenkins/workspace/clang-stage2-Rthinlto/llvm-project/compiler-rt/test/fuzzer/value-profile-mem.test

Hide Details

--

Hide Details

******************** FAIL: libFuzzer :: value-profile-strcmp.test (2948 of 2953) ******************** TEST 'libFuzzer :: value-profile-strcmp.test' FAILED ******************** Script: -- : 'RUN: at line 4'; /Users/buildslave/jenkins/workspace/clang-stage2-Rthinlto/clang-build/Build/./bin/clang --driver-mode=g++ -O2 -gline-tables-only -fsanitize=address,fuzzer -I/Users/buildslave/jenkins/workspace/clang-stage2-Rthinlto/llvm-project/compiler-rt/lib/fuzzer -arch x86_64 -stdlib=libc++ -mmacosx-version-min=10.10 -isysroot /Applications/Xcode.app/Contents/Developer/Platforms/MacOSX.platform/Developer/SDKs/MacOSX10.14.sdk /Users/buildslave/jenkins/workspace/clang-stage2-Rthinlto/llvm-project/compiler-rt/test/fuzzer/SingleStrcmpTest.cpp -o /Users/buildslave/jenkins/workspace/clang-stage2-Rthinlto/clang-build/Build/tools/clang/runtime/compiler-rt-bins/test/fuzzer/X86_64DefaultDarwinConfig/Output/value-profile-strcmp.test.tmp-SingleStrcmpTest : 'RUN: at line 5'; not /Users/buildslave/jenkins/workspace/clang-stage2-Rthinlto/clang-build/Build/tools/clang/runtime/compiler-rt-bins/test/fuzzer/X86_64DefaultDarwinConfig/Output/value-profile-strcmp.test.tmp-SingleStrcmpTest -seed=1 -use_cmp=0 -use_value_profile=1 -runs=10000000 2>&1 | FileCheck /Users/buildslave/jenkins/workspace/clang-stage2-Rthinlto/llvm-project/compiler-rt/test/fuzzer/value-profile-strcmp.test -- Exit Code: 137

Hide Details

Command Output (stderr): -- /Users/buildslave/jenkins/workspace/clang-stage2-Rthinlto/clang-build/Build/tools/clang/runtime/compiler-rt-bins/test/fuzzer/X86_64DefaultDarwinConfig/Output/value-profile-strcmp.test.script: line 2: 19207 Done not /Users/buildslave/jenkins/workspace/clang-stage2-Rthinlto/clang-build/Build/tools/clang/runtime/compiler-rt-bins/test/fuzzer/X86_64DefaultDarwinConfig/Output/value-profile-strcmp.test.tmp-SingleStrcmpTest -seed=1 -use_cmp=0 -use_value_profile=1 -runs=10000000 2>&1 19208 Killed: 9 | FileCheck /Users/buildslave/jenkins/workspace/clang-stage2-Rthinlto/llvm-project/compiler-rt/test/fuzzer/value-profile-strcmp.test

Hide Details

--

Hide Details

******************** FAIL: libFuzzer :: value-profile-strncmp.test (2949 of 2953) ******************** TEST 'libFuzzer :: value-profile-strncmp.test' FAILED ******************** Script: -- : 'RUN: at line 3'; /Users/buildslave/jenkins/workspace/clang-stage2-Rthinlto/clang-build/Build/./bin/clang --driver-mode=g++ -O2 -gline-tables-only -fsanitize=address,fuzzer -I/Users/buildslave/jenkins/workspace/clang-stage2-Rthinlto/llvm-project/compiler-rt/lib/fuzzer -arch x86_64 -stdlib=libc++ -mmacosx-version-min=10.10 -isysroot /Applications/Xcode.app/Contents/Developer/Platforms/MacOSX.platform/Developer/SDKs/MacOSX10.14.sdk /Users/buildslave/jenkins/workspace/clang-stage2-Rthinlto/llvm-project/compiler-rt/test/fuzzer/SingleStrncmpTest.cpp -o /Users/buildslave/jenkins/workspace/clang-stage2-Rthinlto/clang-build/Build/tools/clang/runtime/compiler-rt-bins/test/fuzzer/X86_64DefaultDarwinConfig/Output/value-profile-strncmp.test.tmp-SingleStrncmpTest : 'RUN: at line 4'; not /Users/buildslave/jenkins/workspace/clang-stage2-Rthinlto/clang-build/Build/tools/clang/runtime/compiler-rt-bins/test/fuzzer/X86_64DefaultDarwinConfig/Output/value-profile-strncmp.test.tmp-SingleStrncmpTest -seed=1 -use_cmp=0 -use_value_profile=1 -runs=100000000 2>&1 | FileCheck /Users/buildslave/jenkins/workspace/clang-stage2-Rthinlto/llvm-project/compiler-rt/test/fuzzer/value-profile-strncmp.test -- Exit Code: 137

Hide Details

Command Output (stderr): -- /Users/buildslave/jenkins/workspace/clang-stage2-Rthinlto/clang-build/Build/tools/clang/runtime/compiler-rt-bins/test/fuzzer/X86_64DefaultDarwinConfig/Output/value-profile-strncmp.test.script: line 2: 19224 Done not /Users/buildslave/jenkins/workspace/clang-stage2-Rthinlto/clang-build/Build/tools/clang/runtime/compiler-rt-bins/test/fuzzer/X86_64DefaultDarwinConfig/Output/value-profile-strncmp.test.tmp-SingleStrncmpTest -seed=1 -use_cmp=0 -use_value_profile=1 -runs=100000000 2>&1 19225 Killed: 9 | FileCheck /Users/buildslave/jenkins/workspace/clang-stage2-Rthinlto/llvm-project/compiler-rt/test/fuzzer/value-profile-strncmp.test

Hide Details

--

Hide Details

******************** FAIL: libFuzzer :: value-profile-set.test (2950 of 2953) ******************** TEST 'libFuzzer :: value-profile-set.test' FAILED ******************** Script: -- : 'RUN: at line 3'; /Users/buildslave/jenkins/workspace/clang-stage2-Rthinlto/clang-build/Build/./bin/clang --driver-mode=g++ -O2 -gline-tables-only -fsanitize=address,fuzzer -I/Users/buildslave/jenkins/workspace/clang-stage2-Rthinlto/llvm-project/compiler-rt/lib/fuzzer -arch x86_64 -stdlib=libc++ -mmacosx-version-min=10.10 -isysroot /Applications/Xcode.app/Contents/Developer/Platforms/MacOSX.platform/Developer/SDKs/MacOSX10.14.sdk /Users/buildslave/jenkins/workspace/clang-stage2-Rthinlto/llvm-project/compiler-rt/test/fuzzer/FourIndependentBranchesTest.cpp -o /Users/buildslave/jenkins/workspace/clang-stage2-Rthinlto/clang-build/Build/tools/clang/runtime/compiler-rt-bins/test/fuzzer/X86_64DefaultDarwinConfig/Output/value-profile-set.test.tmp-FourIndependentBranchesTest : 'RUN: at line 4'; not /Users/buildslave/jenkins/workspace/clang-stage2-Rthinlto/clang-build/Build/tools/clang/runtime/compiler-rt-bins/test/fuzzer/X86_64DefaultDarwinConfig/Output/value-profile-set.test.tmp-FourIndependentBranchesTest -seed=1 -use_cmp=0 -use_value_profile=1 -runs=100000000 2>&1 | FileCheck /Users/buildslave/jenkins/workspace/clang-stage2-Rthinlto/llvm-project/compiler-rt/test/fuzzer/value-profile-set.test -- Exit Code: 137

Hide Details

Command Output (stderr): -- /Users/buildslave/jenkins/workspace/clang-stage2-Rthinlto/clang-build/Build/tools/clang/runtime/compiler-rt-bins/test/fuzzer/X86_64DefaultDarwinConfig/Output/value-profile-set.test.script: line 2: 19212 Done not /Users/buildslave/jenkins/workspace/clang-stage2-Rthinlto/clang-build/Build/tools/clang/runtime/compiler-rt-bins/test/fuzzer/X86_64DefaultDarwinConfig/Output/value-profile-set.test.tmp-FourIndependentBranchesTest -seed=1 -use_cmp=0 -use_value_profile=1 -runs=100000000 2>&1 19213 Killed: 9 | FileCheck /Users/buildslave/jenkins/workspace/clang-stage2-Rthinlto/llvm-project/compiler-rt/test/fuzzer/value-profile-set.test

Hide Details

--

Hide Details

******************** UNSUPPORTED: libFuzzer :: windows-opt-ref.test (2951 of 2953) FAIL: libFuzzer :: value-profile-load.test (2952 of 2953) ******************** TEST 'libFuzzer :: value-profile-load.test' FAILED ******************** Script: -- : 'RUN: at line 2'; /Users/buildslave/jenkins/workspace/clang-stage2-Rthinlto/clang-build/Build/./bin/clang --driver-mode=g++ -O2 -gline-tables-only -fsanitize=address,fuzzer -I/Users/buildslave/jenkins/workspace/clang-stage2-Rthinlto/llvm-project/compiler-rt/lib/fuzzer -arch x86_64 -stdlib=libc++ -mmacosx-version-min=10.10 -isysroot /Applications/Xcode.app/Contents/Developer/Platforms/MacOSX.platform/Developer/SDKs/MacOSX10.14.sdk /Users/buildslave/jenkins/workspace/clang-stage2-Rthinlto/llvm-project/compiler-rt/test/fuzzer/LoadTest.cpp -fsanitize-coverage=trace-gep -o /Users/buildslave/jenkins/workspace/clang-stage2-Rthinlto/clang-build/Build/tools/clang/runtime/compiler-rt-bins/test/fuzzer/X86_64DefaultDarwinConfig/Output/value-profile-load.test.tmp-LoadTest : 'RUN: at line 3'; not /Users/buildslave/jenkins/workspace/clang-stage2-Rthinlto/clang-build/Build/tools/clang/runtime/compiler-rt-bins/test/fuzzer/X86_64DefaultDarwinConfig/Output/value-profile-load.test.tmp-LoadTest -seed=2 -use_cmp=0 -use_value_profile=1 -runs=20000000 2>&1 | FileCheck /Users/buildslave/jenkins/workspace/clang-stage2-Rthinlto/llvm-project/compiler-rt/test/fuzzer/value-profile-load.test -- Exit Code: 137

Hide Details

Command Output (stderr): -- /Users/buildslave/jenkins/workspace/clang-stage2-Rthinlto/clang-build/Build/tools/clang/runtime/compiler-rt-bins/test/fuzzer/X86_64DefaultDarwinConfig/Output/value-profile-load.test.script: line 2: 19166 Done not /Users/buildslave/jenkins/workspace/clang-stage2-Rthinlto/clang-build/Build/tools/clang/runtime/compiler-rt-bins/test/fuzzer/X86_64DefaultDarwinConfig/Output/value-profile-load.test.tmp-LoadTest -seed=2 -use_cmp=0 -use_value_profile=1 -runs=20000000 2>&1 19167 Killed: 9 | FileCheck /Users/buildslave/jenkins/workspace/clang-stage2-Rthinlto/llvm-project/compiler-rt/test/fuzzer/value-profile-load.test

Hide Details

--

Hide Details

******************** FAIL: libFuzzer :: value-profile-switch.test (2953 of 2953) ******************** TEST 'libFuzzer :: value-profile-switch.test' FAILED ******************** Script: -- : 'RUN: at line 3'; /Users/buildslave/jenkins/workspace/clang-stage2-Rthinlto/clang-build/Build/./bin/clang --driver-mode=g++ -O2 -gline-tables-only -fsanitize=address,fuzzer -I/Users/buildslave/jenkins/workspace/clang-stage2-Rthinlto/llvm-project/compiler-rt/lib/fuzzer -arch x86_64 -stdlib=libc++ -mmacosx-version-min=10.10 -isysroot /Applications/Xcode.app/Contents/Developer/Platforms/MacOSX.platform/Developer/SDKs/MacOSX10.14.sdk /Users/buildslave/jenkins/workspace/clang-stage2-Rthinlto/llvm-project/compiler-rt/test/fuzzer/SwitchTest.cpp -o /Users/buildslave/jenkins/workspace/clang-stage2-Rthinlto/clang-build/Build/tools/clang/runtime/compiler-rt-bins/test/fuzzer/X86_64DefaultDarwinConfig/Output/value-profile-switch.test.tmp-SwitchTest : 'RUN: at line 4'; /Users/buildslave/jenkins/workspace/clang-stage2-Rthinlto/clang-build/Build/./bin/clang --driver-mode=g++ -O2 -gline-tables-only -fsanitize=address,fuzzer -I/Users/buildslave/jenkins/workspace/clang-stage2-Rthinlto/llvm-project/compiler-rt/lib/fuzzer -arch x86_64 -stdlib=libc++ -mmacosx-version-min=10.10 -isysroot /Applications/Xcode.app/Contents/Developer/Platforms/MacOSX.platform/Developer/SDKs/MacOSX10.14.sdk /Users/buildslave/jenkins/workspace/clang-stage2-Rthinlto/llvm-project/compiler-rt/test/fuzzer/Switch2Test.cpp -o /Users/buildslave/jenkins/workspace/clang-stage2-Rthinlto/clang-build/Build/tools/clang/runtime/compiler-rt-bins/test/fuzzer/X86_64DefaultDarwinConfig/Output/value-profile-switch.test.tmp-Switch2Test : 'RUN: at line 5'; /Users/buildslave/jenkins/workspace/clang-stage2-Rthinlto/clang-build/Build/./bin/clang --driver-mode=g++ -O2 -gline-tables-only -fsanitize=address,fuzzer -I/Users/buildslave/jenkins/workspace/clang-stage2-Rthinlto/llvm-project/compiler-rt/lib/fuzzer -arch x86_64 -stdlib=libc++ -mmacosx-version-min=10.10 -isysroot /Applications/Xcode.app/Contents/Developer/Platforms/MacOSX.platform/Developer/SDKs/MacOSX10.14.sdk /Users/buildslave/jenkins/workspace/clang-stage2-Rthinlto/llvm-project/compiler-rt/test/fuzzer/Switch3Test.cpp -o /Users/buildslave/jenkins/workspace/clang-stage2-Rthinlto/clang-build/Build/tools/clang/runtime/compiler-rt-bins/test/fuzzer/X86_64DefaultDarwinConfig/Output/value-profile-switch.test.tmp-Switch3Test : 'RUN: at line 6'; not /Users/buildslave/jenkins/workspace/clang-stage2-Rthinlto/clang-build/Build/tools/clang/runtime/compiler-rt-bins/test/fuzzer/X86_64DefaultDarwinConfig/Output/value-profile-switch.test.tmp-SwitchTest -use_cmp=0 -use_value_profile=1 -runs=100000000 -seed=1 2>&1 | FileCheck /Users/buildslave/jenkins/workspace/clang-stage2-Rthinlto/llvm-project/compiler-rt/test/fuzzer/value-profile-switch.test : 'RUN: at line 7'; not /Users/buildslave/jenkins/workspace/clang-stage2-Rthinlto/clang-build/Build/tools/clang/runtime/compiler-rt-bins/test/fuzzer/X86_64DefaultDarwinConfig/Output/value-profile-switch.test.tmp-Switch2Test -use_cmp=0 -use_value_profile=1 -runs=100000000 -seed=1 2>&1 | FileCheck /Users/buildslave/jenkins/workspace/clang-stage2-Rthinlto/llvm-project/compiler-rt/test/fuzzer/value-profile-switch.test : 'RUN: at line 8'; not /Users/buildslave/jenkins/workspace/clang-stage2-Rthinlto/clang-build/Build/tools/clang/runtime/compiler-rt-bins/test/fuzzer/X86_64DefaultDarwinConfig/Output/value-profile-switch.test.tmp-Switch3Test -use_cmp=0 -use_value_profile=1 -runs=100000000 -seed=1 2>&1 -- Exit Code: 137

Hide Details

Command Output (stderr): -- /Users/buildslave/jenkins/workspace/clang-stage2-Rthinlto/clang-build/Build/tools/clang/runtime/compiler-rt-bins/test/fuzzer/X86_64DefaultDarwinConfig/Output/value-profile-switch.test.script: line 6: 19244 Done not /Users/buildslave/jenkins/workspace/clang-stage2-Rthinlto/clang-build/Build/tools/clang/runtime/compiler-rt-bins/test/fuzzer/X86_64DefaultDarwinConfig/Output/value-profile-switch.test.tmp-SwitchTest -use_cmp=0 -use_value_profile=1 -runs=100000000 -seed=1 2>&1 19245 Killed: 9 | FileCheck /Users/buildslave/jenkins/workspace/clang-stage2-Rthinlto/llvm-project/compiler-rt/test/fuzzer/value-profile-switch.test

Hide Details

--

Hide Details

********************

Hide Details

Testing Time: 677.68s ******************** Failing Tests (387): ThreadSanitizer-x86_64 :: race_range_pc.cpp ThreadSanitizer-x86_64 :: race_stress.cpp ThreadSanitizer-x86_64 :: real_deadlock_detector_stress_test.cpp ThreadSanitizer-x86_64 :: restore_stack.cpp ThreadSanitizer-x86_64 :: setuid.c ThreadSanitizer-x86_64 :: signal_block.cpp ThreadSanitizer-x86_64 :: signal_cond.cpp ThreadSanitizer-x86_64 :: signal_longjmp.cpp ThreadSanitizer-x86_64 :: signal_malloc.cpp ThreadSanitizer-x86_64 :: signal_pause.cpp ThreadSanitizer-x86_64 :: signal_write.cpp ThreadSanitizer-x86_64 :: sigsuspend.cpp ThreadSanitizer-x86_64 :: simple_stack.c ThreadSanitizer-x86_64 :: simple_stack2.cpp ThreadSanitizer-x86_64 :: stack_sync_reuse.cpp ThreadSanitizer-x86_64 :: static_init1.cpp ThreadSanitizer-x86_64 :: static_init2.cpp ThreadSanitizer-x86_64 :: static_init4.cpp ThreadSanitizer-x86_64 :: static_init5.cpp ThreadSanitizer-x86_64 :: static_init6.cpp ThreadSanitizer-x86_64 :: thread_detach.c ThreadSanitizer-x86_64 :: thread_detach2.c ThreadSanitizer-x86_64 :: thread_end_with_ignore3.cpp ThreadSanitizer-x86_64 :: thread_exit.c ThreadSanitizer-x86_64 :: thread_leak.c ThreadSanitizer-x86_64 :: thread_leak2.c ThreadSanitizer-x86_64 :: thread_leak4.c ThreadSanitizer-x86_64 :: tls_race.cpp ThreadSanitizer-x86_64 :: tsan-vs-gvn.cpp ThreadSanitizer-x86_64 :: unaligned_norace.cpp ThreadSanitizer-x86_64 :: vfork.cpp ThreadSanitizer-x86_64 :: virtual_inheritance_compile_bug.cpp ThreadSanitizer-x86_64 :: vptr_benign_race.cpp ThreadSanitizer-x86_64 :: write_in_reader_lock.cpp UBSan-AddressSanitizer-x86_64 :: TestCases/Float/cast-overflow.cpp UBSan-AddressSanitizer-x86_64 :: TestCases/ImplicitConversion/integer-arithmetic-value-change.c UBSan-AddressSanitizer-x86_64 :: TestCases/ImplicitConversion/integer-conversion-incdec.c UBSan-AddressSanitizer-x86_64 :: TestCases/ImplicitConversion/integer-conversion.c UBSan-AddressSanitizer-x86_64 :: TestCases/ImplicitConversion/integer-sign-change-blacklist.c UBSan-AddressSanitizer-x86_64 :: TestCases/ImplicitConversion/integer-sign-change-incdec.c UBSan-AddressSanitizer-x86_64 :: TestCases/ImplicitConversion/integer-sign-change-summary.cpp UBSan-AddressSanitizer-x86_64 :: TestCases/ImplicitConversion/integer-sign-change.c UBSan-AddressSanitizer-x86_64 :: TestCases/ImplicitConversion/integer-truncation.c UBSan-AddressSanitizer-x86_64 :: TestCases/ImplicitConversion/signed-integer-truncation-blacklist.c UBSan-AddressSanitizer-x86_64 :: TestCases/ImplicitConversion/signed-integer-truncation-incdec.c UBSan-AddressSanitizer-x86_64 :: TestCases/ImplicitConversion/signed-integer-truncation-or-sign-change-blacklist.c UBSan-AddressSanitizer-x86_64 :: TestCases/ImplicitConversion/signed-integer-truncation-or-sign-change-summary.cpp UBSan-AddressSanitizer-x86_64 :: TestCases/ImplicitConversion/signed-integer-truncation-summary.cpp UBSan-AddressSanitizer-x86_64 :: TestCases/ImplicitConversion/signed-integer-truncation.c UBSan-AddressSanitizer-x86_64 :: TestCases/ImplicitConversion/unsigned-integer-truncation-blacklist.c UBSan-AddressSanitizer-x86_64 :: TestCases/ImplicitConversion/unsigned-integer-truncation-summary.cpp UBSan-AddressSanitizer-x86_64 :: TestCases/ImplicitConversion/unsigned-integer-truncation.c UBSan-AddressSanitizer-x86_64 :: TestCases/Integer/add-overflow.cpp UBSan-AddressSanitizer-x86_64 :: TestCases/Integer/div-overflow.cpp UBSan-AddressSanitizer-x86_64 :: TestCases/Integer/div-zero.cpp UBSan-AddressSanitizer-x86_64 :: TestCases/Integer/incdec-overflow.cpp UBSan-AddressSanitizer-x86_64 :: TestCases/Integer/mul-overflow.cpp UBSan-AddressSanitizer-x86_64 :: TestCases/Integer/negate-overflow.cpp UBSan-AddressSanitizer-x86_64 :: TestCases/Integer/no-recover.cpp UBSan-AddressSanitizer-x86_64 :: TestCases/Integer/shift.cpp UBSan-AddressSanitizer-x86_64 :: TestCases/Integer/sub-overflow.cpp UBSan-AddressSanitizer-x86_64 :: TestCases/Integer/summary.cpp UBSan-AddressSanitizer-x86_64 :: TestCases/Integer/uadd-overflow.cpp UBSan-AddressSanitizer-x86_64 :: TestCases/Integer/uincdec-overflow.cpp UBSan-AddressSanitizer-x86_64 :: TestCases/Integer/umul-overflow.cpp UBSan-AddressSanitizer-x86_64 :: TestCases/Integer/usub-overflow.cpp UBSan-AddressSanitizer-x86_64 :: TestCases/Misc/bool.cpp UBSan-AddressSanitizer-x86_64 :: TestCases/Misc/bool.m UBSan-AddressSanitizer-x86_64 :: TestCases/Misc/bounds.cpp UBSan-AddressSanitizer-x86_64 :: TestCases/Misc/builtins.cpp UBSan-AddressSanitizer-x86_64 :: TestCases/Misc/coverage-levels.cpp UBSan-AddressSanitizer-x86_64 :: TestCases/Misc/deduplication.cpp UBSan-AddressSanitizer-x86_64 :: TestCases/Misc/enum.cpp UBSan-AddressSanitizer-x86_64 :: TestCases/Misc/missing_return.cpp UBSan-AddressSanitizer-x86_64 :: TestCases/Misc/monitor.cpp UBSan-AddressSanitizer-x86_64 :: TestCases/Misc/nonnull-arg.cpp UBSan-AddressSanitizer-x86_64 :: TestCases/Misc/nonnull.cpp UBSan-AddressSanitizer-x86_64 :: TestCases/Misc/nullability.c UBSan-AddressSanitizer-x86_64 :: TestCases/Misc/print_summary.c UBSan-AddressSanitizer-x86_64 :: TestCases/Misc/unreachable.cpp UBSan-AddressSanitizer-x86_64 :: TestCases/Misc/vla.c UBSan-AddressSanitizer-x86_64 :: TestCases/Pointer/alignment-assumption-attribute-align_value-on-lvalue.cpp UBSan-AddressSanitizer-x86_64 :: TestCases/Pointer/alignment-assumption-attribute-align_value-on-paramvar.cpp UBSan-AddressSanitizer-x86_64 :: TestCases/Pointer/alignment-assumption-attribute-alloc_align-on-function-variable.cpp UBSan-AddressSanitizer-x86_64 :: TestCases/Pointer/alignment-assumption-attribute-alloc_align-on-function.cpp UBSan-AddressSanitizer-x86_64 :: TestCases/Pointer/alignment-assumption-attribute-assume_aligned-on-function-two-params.cpp UBSan-AddressSanitizer-x86_64 :: TestCases/Pointer/alignment-assumption-attribute-assume_aligned-on-function.cpp UBSan-AddressSanitizer-x86_64 :: TestCases/Pointer/alignment-assumption-blacklist.cpp UBSan-AddressSanitizer-x86_64 :: TestCases/Pointer/alignment-assumption-builtin_assume_aligned-three-params-variable.cpp UBSan-AddressSanitizer-x86_64 :: TestCases/Pointer/alignment-assumption-builtin_assume_aligned-three-params.cpp UBSan-AddressSanitizer-x86_64 :: TestCases/Pointer/alignment-assumption-builtin_assume_aligned-two-params.cpp UBSan-AddressSanitizer-x86_64 :: TestCases/Pointer/alignment-assumption-openmp.cpp UBSan-AddressSanitizer-x86_64 :: TestCases/Pointer/alignment-assumption-summary.cpp UBSan-AddressSanitizer-x86_64 :: TestCases/Pointer/index-overflow.cpp UBSan-AddressSanitizer-x86_64 :: TestCases/Pointer/nullptr-and-nonzero-offset-constants.cpp UBSan-AddressSanitizer-x86_64 :: TestCases/Pointer/nullptr-and-nonzero-offset-summary.cpp UBSan-AddressSanitizer-x86_64 :: TestCases/Pointer/nullptr-and-nonzero-offset-variable.cpp UBSan-AddressSanitizer-x86_64 :: TestCases/Pointer/unsigned-index-expression.cpp UBSan-AddressSanitizer-x86_64 :: TestCases/TypeCheck/Function/function.cpp UBSan-AddressSanitizer-x86_64 :: TestCases/TypeCheck/PR33221.cpp UBSan-AddressSanitizer-x86_64 :: TestCases/TypeCheck/misaligned.cpp UBSan-AddressSanitizer-x86_64 :: TestCases/TypeCheck/null.cpp UBSan-AddressSanitizer-x86_64 :: TestCases/TypeCheck/vptr-corrupted-vtable-itanium.cpp UBSan-AddressSanitizer-x86_64 :: TestCases/TypeCheck/vptr-virtual-base-construction.cpp UBSan-AddressSanitizer-x86_64 :: TestCases/TypeCheck/vptr-virtual-base.cpp UBSan-AddressSanitizer-x86_64 :: TestCases/TypeCheck/vptr.cpp UBSan-Minimal-x86_64 :: TestCases/alignment-assumption.c UBSan-Minimal-x86_64 :: TestCases/implicit-integer-sign-change.c UBSan-Minimal-x86_64 :: TestCases/implicit-signed-integer-truncation-or-sign-change.c UBSan-Minimal-x86_64 :: TestCases/implicit-signed-integer-truncation.c UBSan-Minimal-x86_64 :: TestCases/implicit-unsigned-integer-truncation.c UBSan-Minimal-x86_64 :: TestCases/nullptr-and-nonzero-offset.c UBSan-Minimal-x86_64 :: TestCases/recover-dedup-limit.cpp UBSan-Minimal-x86_64 :: TestCases/recover-dedup.cpp UBSan-Minimal-x86_64 :: TestCases/uadd-overflow.cpp UBSan-Standalone-x86_64 :: TestCases/Float/cast-overflow.cpp UBSan-Standalone-x86_64 :: TestCases/ImplicitConversion/integer-arithmetic-value-change.c UBSan-Standalone-x86_64 :: TestCases/ImplicitConversion/integer-conversion-incdec.c UBSan-Standalone-x86_64 :: TestCases/ImplicitConversion/integer-conversion.c UBSan-Standalone-x86_64 :: TestCases/ImplicitConversion/integer-sign-change-blacklist.c UBSan-Standalone-x86_64 :: TestCases/ImplicitConversion/integer-sign-change-incdec.c UBSan-Standalone-x86_64 :: TestCases/ImplicitConversion/integer-sign-change.c UBSan-Standalone-x86_64 :: TestCases/ImplicitConversion/integer-truncation.c UBSan-Standalone-x86_64 :: TestCases/ImplicitConversion/signed-integer-truncation-blacklist.c UBSan-Standalone-x86_64 :: TestCases/ImplicitConversion/signed-integer-truncation-incdec.c UBSan-Standalone-x86_64 :: TestCases/ImplicitConversion/signed-integer-truncation-or-sign-change-blacklist.c UBSan-Standalone-x86_64 :: TestCases/ImplicitConversion/signed-integer-truncation.c UBSan-Standalone-x86_64 :: TestCases/ImplicitConversion/unsigned-integer-truncation-blacklist.c UBSan-Standalone-x86_64 :: TestCases/ImplicitConversion/unsigned-integer-truncation.c UBSan-Standalone-x86_64 :: TestCases/Integer/div-overflow.cpp UBSan-Standalone-x86_64 :: TestCases/Integer/div-zero.cpp UBSan-Standalone-x86_64 :: TestCases/Integer/incdec-overflow.cpp UBSan-Standalone-x86_64 :: TestCases/Integer/mul-overflow.cpp UBSan-Standalone-x86_64 :: TestCases/Integer/negate-overflow.cpp UBSan-Standalone-x86_64 :: TestCases/Integer/no-recover.cpp UBSan-Standalone-x86_64 :: TestCases/Integer/shift.cpp UBSan-Standalone-x86_64 :: TestCases/Integer/sub-overflow.cpp UBSan-Standalone-x86_64 :: TestCases/Integer/suppressions.cpp UBSan-Standalone-x86_64 :: TestCases/Integer/uadd-overflow.cpp UBSan-Standalone-x86_64 :: TestCases/Integer/uincdec-overflow.cpp UBSan-Standalone-x86_64 :: TestCases/Integer/umul-overflow.cpp UBSan-Standalone-x86_64 :: TestCases/Integer/usub-overflow.cpp UBSan-Standalone-x86_64 :: TestCases/Misc/bool.cpp UBSan-Standalone-x86_64 :: TestCases/Misc/bool.m UBSan-Standalone-x86_64 :: TestCases/Misc/bounds.cpp UBSan-Standalone-x86_64 :: TestCases/Misc/builtins.cpp UBSan-Standalone-x86_64 :: TestCases/Misc/coverage-levels.cpp UBSan-Standalone-x86_64 :: TestCases/Misc/log-path_test.cpp UBSan-Standalone-x86_64 :: TestCases/Misc/missing_return.cpp UBSan-Standalone-x86_64 :: TestCases/Misc/monitor.cpp UBSan-Standalone-x86_64 :: TestCases/Misc/nonnull-arg.cpp UBSan-Standalone-x86_64 :: TestCases/Misc/nonnull.cpp UBSan-Standalone-x86_64 :: TestCases/Misc/nullability.c UBSan-Standalone-x86_64 :: TestCases/Misc/print_summary.c UBSan-Standalone-x86_64 :: TestCases/Misc/unreachable.cpp UBSan-Standalone-x86_64 :: TestCases/Misc/vla.c UBSan-Standalone-x86_64 :: TestCases/Pointer/alignment-assumption-attribute-align_value-on-lvalue.cpp UBSan-Standalone-x86_64 :: TestCases/Pointer/alignment-assumption-attribute-align_value-on-paramvar.cpp UBSan-Standalone-x86_64 :: TestCases/Pointer/alignment-assumption-attribute-alloc_align-on-function-variable.cpp UBSan-Standalone-x86_64 :: TestCases/Pointer/alignment-assumption-attribute-alloc_align-on-function.cpp UBSan-Standalone-x86_64 :: TestCases/Pointer/alignment-assumption-attribute-assume_aligned-on-function-two-params.cpp UBSan-Standalone-x86_64 :: TestCases/Pointer/alignment-assumption-attribute-assume_aligned-on-function.cpp UBSan-Standalone-x86_64 :: TestCases/Pointer/alignment-assumption-blacklist.cpp UBSan-Standalone-x86_64 :: TestCases/Pointer/alignment-assumption-builtin_assume_aligned-three-params-variable.cpp UBSan-Standalone-x86_64 :: TestCases/Pointer/alignment-assumption-builtin_assume_aligned-three-params.cpp UBSan-Standalone-x86_64 :: TestCases/Pointer/alignment-assumption-builtin_assume_aligned-two-params.cpp UBSan-Standalone-x86_64 :: TestCases/Pointer/alignment-assumption-openmp.cpp UBSan-Standalone-x86_64 :: TestCases/Pointer/index-overflow.cpp UBSan-Standalone-x86_64 :: TestCases/Pointer/nullptr-and-nonzero-offset-constants.cpp UBSan-Standalone-x86_64 :: TestCases/Pointer/nullptr-and-nonzero-offset-variable.cpp UBSan-Standalone-x86_64 :: TestCases/TypeCheck/Function/function.cpp UBSan-Standalone-x86_64 :: TestCases/TypeCheck/PR33221.cpp UBSan-Standalone-x86_64 :: TestCases/TypeCheck/misaligned.cpp UBSan-Standalone-x86_64 :: TestCases/TypeCheck/null.cpp UBSan-Standalone-x86_64 :: TestCases/TypeCheck/vptr-corrupted-vtable-itanium.cpp UBSan-Standalone-x86_64 :: TestCases/TypeCheck/vptr-non-unique-typeinfo.cpp UBSan-Standalone-x86_64 :: TestCases/TypeCheck/vptr-virtual-base-construction.cpp UBSan-Standalone-x86_64 :: TestCases/TypeCheck/vptr-virtual-base.cpp UBSan-Standalone-x86_64 :: TestCases/TypeCheck/vptr.cpp UBSan-StandaloneStatic-x86_64 :: TestCases/Float/cast-overflow.cpp UBSan-StandaloneStatic-x86_64 :: TestCases/ImplicitConversion/integer-arithmetic-value-change.c UBSan-StandaloneStatic-x86_64 :: TestCases/ImplicitConversion/integer-conversion-incdec.c UBSan-StandaloneStatic-x86_64 :: TestCases/ImplicitConversion/integer-conversion.c UBSan-StandaloneStatic-x86_64 :: TestCases/ImplicitConversion/integer-sign-change-blacklist.c UBSan-StandaloneStatic-x86_64 :: TestCases/ImplicitConversion/integer-sign-change-incdec.c UBSan-StandaloneStatic-x86_64 :: TestCases/ImplicitConversion/integer-sign-change.c UBSan-StandaloneStatic-x86_64 :: TestCases/ImplicitConversion/integer-truncation.c UBSan-StandaloneStatic-x86_64 :: TestCases/ImplicitConversion/signed-integer-truncation-blacklist.c UBSan-StandaloneStatic-x86_64 :: TestCases/ImplicitConversion/signed-integer-truncation-incdec.c UBSan-StandaloneStatic-x86_64 :: TestCases/ImplicitConversion/signed-integer-truncation-or-sign-change-blacklist.c UBSan-StandaloneStatic-x86_64 :: TestCases/ImplicitConversion/signed-integer-truncation.c UBSan-StandaloneStatic-x86_64 :: TestCases/ImplicitConversion/unsigned-integer-truncation-blacklist.c UBSan-StandaloneStatic-x86_64 :: TestCases/ImplicitConversion/unsigned-integer-truncation.c UBSan-StandaloneStatic-x86_64 :: TestCases/Integer/add-overflow.cpp UBSan-StandaloneStatic-x86_64 :: TestCases/Integer/div-zero.cpp UBSan-StandaloneStatic-x86_64 :: TestCases/Integer/incdec-overflow.cpp UBSan-StandaloneStatic-x86_64 :: TestCases/Integer/negate-overflow.cpp UBSan-StandaloneStatic-x86_64 :: TestCases/Integer/no-recover.cpp UBSan-StandaloneStatic-x86_64 :: TestCases/Integer/shift.cpp UBSan-StandaloneStatic-x86_64 :: TestCases/Integer/sub-overflow.cpp UBSan-StandaloneStatic-x86_64 :: TestCases/Integer/suppressions.cpp UBSan-StandaloneStatic-x86_64 :: TestCases/Integer/uadd-overflow.cpp UBSan-StandaloneStatic-x86_64 :: TestCases/Integer/uincdec-overflow.cpp UBSan-StandaloneStatic-x86_64 :: TestCases/Integer/umul-overflow.cpp UBSan-StandaloneStatic-x86_64 :: TestCases/Integer/usub-overflow.cpp UBSan-StandaloneStatic-x86_64 :: TestCases/Misc/bool.cpp UBSan-StandaloneStatic-x86_64 :: TestCases/Misc/bool.m UBSan-StandaloneStatic-x86_64 :: TestCases/Misc/bounds.cpp UBSan-StandaloneStatic-x86_64 :: TestCases/Misc/builtins.cpp UBSan-StandaloneStatic-x86_64 :: TestCases/Misc/deduplication.cpp UBSan-StandaloneStatic-x86_64 :: TestCases/Misc/enum.cpp UBSan-StandaloneStatic-x86_64 :: TestCases/Misc/log-path_test.cpp UBSan-StandaloneStatic-x86_64 :: TestCases/Misc/missing_return.cpp UBSan-StandaloneStatic-x86_64 :: TestCases/Misc/nonnull-arg.cpp UBSan-StandaloneStatic-x86_64 :: TestCases/Misc/nonnull.cpp UBSan-StandaloneStatic-x86_64 :: TestCases/Misc/nullability.c UBSan-StandaloneStatic-x86_64 :: TestCases/Misc/print_summary.c UBSan-StandaloneStatic-x86_64 :: TestCases/Misc/unreachable.cpp UBSan-StandaloneStatic-x86_64 :: TestCases/Misc/vla.c UBSan-StandaloneStatic-x86_64 :: TestCases/Pointer/alignment-assumption-attribute-align_value-on-lvalue.cpp UBSan-StandaloneStatic-x86_64 :: TestCases/Pointer/alignment-assumption-attribute-align_value-on-paramvar.cpp UBSan-StandaloneStatic-x86_64 :: TestCases/Pointer/alignment-assumption-attribute-alloc_align-on-function-variable.cpp UBSan-StandaloneStatic-x86_64 :: TestCases/Pointer/alignment-assumption-attribute-alloc_align-on-function.cpp UBSan-StandaloneStatic-x86_64 :: TestCases/Pointer/alignment-assumption-attribute-assume_aligned-on-function-two-params.cpp UBSan-StandaloneStatic-x86_64 :: TestCases/Pointer/alignment-assumption-attribute-assume_aligned-on-function.cpp UBSan-StandaloneStatic-x86_64 :: TestCases/Pointer/alignment-assumption-blacklist.cpp UBSan-StandaloneStatic-x86_64 :: TestCases/Pointer/alignment-assumption-builtin_assume_aligned-three-params-variable.cpp UBSan-StandaloneStatic-x86_64 :: TestCases/Pointer/alignment-assumption-builtin_assume_aligned-three-params.cpp UBSan-StandaloneStatic-x86_64 :: TestCases/Pointer/alignment-assumption-builtin_assume_aligned-two-params.cpp UBSan-StandaloneStatic-x86_64 :: TestCases/Pointer/alignment-assumption-openmp.cpp UBSan-StandaloneStatic-x86_64 :: TestCases/Pointer/index-overflow.cpp UBSan-StandaloneStatic-x86_64 :: TestCases/Pointer/nullptr-and-nonzero-offset-constants.cpp UBSan-StandaloneStatic-x86_64 :: TestCases/Pointer/nullptr-and-nonzero-offset-variable.cpp UBSan-StandaloneStatic-x86_64 :: TestCases/TypeCheck/Function/function.cpp UBSan-StandaloneStatic-x86_64 :: TestCases/TypeCheck/PR33221.cpp UBSan-StandaloneStatic-x86_64 :: TestCases/TypeCheck/misaligned.cpp UBSan-StandaloneStatic-x86_64 :: TestCases/TypeCheck/null.cpp UBSan-StandaloneStatic-x86_64 :: TestCases/TypeCheck/vptr-corrupted-vtable-itanium.cpp UBSan-StandaloneStatic-x86_64 :: TestCases/TypeCheck/vptr-non-unique-typeinfo.cpp UBSan-StandaloneStatic-x86_64 :: TestCases/TypeCheck/vptr-virtual-base.cpp UBSan-StandaloneStatic-x86_64 :: TestCases/TypeCheck/vptr.cpp UBSan-ThreadSanitizer-x86_64 :: TestCases/Float/cast-overflow.cpp UBSan-ThreadSanitizer-x86_64 :: TestCases/ImplicitConversion/integer-arithmetic-value-change.c UBSan-ThreadSanitizer-x86_64 :: TestCases/ImplicitConversion/integer-conversion-incdec.c UBSan-ThreadSanitizer-x86_64 :: TestCases/ImplicitConversion/integer-conversion.c UBSan-ThreadSanitizer-x86_64 :: TestCases/ImplicitConversion/integer-sign-change-blacklist.c UBSan-ThreadSanitizer-x86_64 :: TestCases/ImplicitConversion/integer-sign-change-incdec.c UBSan-ThreadSanitizer-x86_64 :: TestCases/ImplicitConversion/integer-sign-change-summary.cpp UBSan-ThreadSanitizer-x86_64 :: TestCases/ImplicitConversion/integer-sign-change.c UBSan-ThreadSanitizer-x86_64 :: TestCases/ImplicitConversion/integer-truncation.c UBSan-ThreadSanitizer-x86_64 :: TestCases/ImplicitConversion/signed-integer-truncation-blacklist.c UBSan-ThreadSanitizer-x86_64 :: TestCases/ImplicitConversion/signed-integer-truncation-incdec.c UBSan-ThreadSanitizer-x86_64 :: TestCases/ImplicitConversion/signed-integer-truncation-or-sign-change-blacklist.c UBSan-ThreadSanitizer-x86_64 :: TestCases/ImplicitConversion/signed-integer-truncation-or-sign-change-summary.cpp UBSan-ThreadSanitizer-x86_64 :: TestCases/ImplicitConversion/signed-integer-truncation-summary.cpp UBSan-ThreadSanitizer-x86_64 :: TestCases/ImplicitConversion/signed-integer-truncation.c UBSan-ThreadSanitizer-x86_64 :: TestCases/ImplicitConversion/unsigned-integer-truncation-blacklist.c UBSan-ThreadSanitizer-x86_64 :: TestCases/ImplicitConversion/unsigned-integer-truncation-summary.cpp UBSan-ThreadSanitizer-x86_64 :: TestCases/ImplicitConversion/unsigned-integer-truncation.c UBSan-ThreadSanitizer-x86_64 :: TestCases/Integer/add-overflow.cpp UBSan-ThreadSanitizer-x86_64 :: TestCases/Integer/div-overflow.cpp UBSan-ThreadSanitizer-x86_64 :: TestCases/Integer/div-zero.cpp UBSan-ThreadSanitizer-x86_64 :: TestCases/Integer/incdec-overflow.cpp UBSan-ThreadSanitizer-x86_64 :: TestCases/Integer/mul-overflow.cpp UBSan-ThreadSanitizer-x86_64 :: TestCases/Integer/negate-overflow.cpp UBSan-ThreadSanitizer-x86_64 :: TestCases/Integer/no-recover.cpp UBSan-ThreadSanitizer-x86_64 :: TestCases/Integer/shift.cpp UBSan-ThreadSanitizer-x86_64 :: TestCases/Integer/sub-overflow.cpp UBSan-ThreadSanitizer-x86_64 :: TestCases/Integer/uadd-overflow.cpp UBSan-ThreadSanitizer-x86_64 :: TestCases/Integer/uincdec-overflow.cpp UBSan-ThreadSanitizer-x86_64 :: TestCases/Integer/umul-overflow.cpp UBSan-ThreadSanitizer-x86_64 :: TestCases/Integer/usub-overflow.cpp UBSan-ThreadSanitizer-x86_64 :: TestCases/Misc/bool.cpp UBSan-ThreadSanitizer-x86_64 :: TestCases/Misc/bool.m UBSan-ThreadSanitizer-x86_64 :: TestCases/Misc/bounds.cpp UBSan-ThreadSanitizer-x86_64 :: TestCases/Misc/builtins.cpp UBSan-ThreadSanitizer-x86_64 :: TestCases/Misc/deduplication.cpp UBSan-ThreadSanitizer-x86_64 :: TestCases/Misc/enum.cpp UBSan-ThreadSanitizer-x86_64 :: TestCases/Misc/missing_return.cpp UBSan-ThreadSanitizer-x86_64 :: TestCases/Pointer/nullptr-and-nonzero-offset-constants.cpp UBSan-ThreadSanitizer-x86_64 :: TestCases/Pointer/nullptr-and-nonzero-offset-variable.cpp UBSan-ThreadSanitizer-x86_64 :: TestCases/Pointer/unsigned-index-expression.cpp UBSan-ThreadSanitizer-x86_64 :: TestCases/TypeCheck/Function/function.cpp UBSan-ThreadSanitizer-x86_64 :: TestCases/TypeCheck/PR33221.cpp UBSan-ThreadSanitizer-x86_64 :: TestCases/TypeCheck/misaligned.cpp UBSan-ThreadSanitizer-x86_64 :: TestCases/TypeCheck/null.cpp UBSan-ThreadSanitizer-x86_64 :: TestCases/TypeCheck/vptr-corrupted-vtable-itanium.cpp UBSan-ThreadSanitizer-x86_64 :: TestCases/TypeCheck/vptr-virtual-base.cpp UBSan-ThreadSanitizer-x86_64 :: TestCases/TypeCheck/vptr.cpp cfi-devirt-x86_64 :: base-derived-destructor.cpp cfi-devirt-x86_64 :: icall/bad-signature.c cfi-devirt-x86_64 :: mfcall.cpp cfi-devirt-x86_64 :: multiple-inheritance.cpp cfi-devirt-x86_64 :: multiple-inheritance2.cpp cfi-devirt-x86_64 :: nvcall.cpp cfi-devirt-x86_64 :: overwrite.cpp cfi-devirt-x86_64 :: simple-fail.cpp cfi-devirt-x86_64 :: target_uninstrumented.cpp cfi-devirt-x86_64 :: vdtor.cpp cfi-standalone-x86_64 :: anon-namespace.cpp cfi-standalone-x86_64 :: bad-cast.cpp cfi-standalone-x86_64 :: base-derived-destructor.cpp cfi-standalone-x86_64 :: cross-dso-diagnostic.cpp cfi-standalone-x86_64 :: icall/bad-signature.c cfi-standalone-x86_64 :: mfcall.cpp cfi-standalone-x86_64 :: multiple-inheritance.cpp cfi-standalone-x86_64 :: multiple-inheritance2.cpp cfi-standalone-x86_64 :: nvcall.cpp cfi-standalone-x86_64 :: overwrite.cpp cfi-standalone-x86_64 :: simple-fail.cpp cfi-standalone-x86_64 :: stats.cpp cfi-standalone-x86_64 :: target_uninstrumented.cpp cfi-standalone-x86_64 :: vdtor.cpp libFuzzer :: acquire-crash-state.test libFuzzer :: bogus-initialize.test libFuzzer :: buffer-overflow-on-input.test libFuzzer :: caller-callee.test libFuzzer :: counters.test libFuzzer :: coverage.test libFuzzer :: cxxstring.test libFuzzer :: dead-stripping.test libFuzzer :: deprecated-instrumentation.test libFuzzer :: dso.test libFuzzer :: exit-report.test libFuzzer :: exit_on_src_pos.test libFuzzer :: fuzzer-alignment-assumption.test libFuzzer :: fuzzer-customcrossover.test libFuzzer :: fuzzer-custommutator.test libFuzzer :: fuzzer-dict.test libFuzzer :: fuzzer-dirs.test libFuzzer :: fuzzer-fdmask.test libFuzzer :: fuzzer-finalstats.test libFuzzer :: fuzzer-flags.test libFuzzer :: fuzzer-implicit-integer-sign-change.test libFuzzer :: fuzzer-implicit-signed-integer-truncation-or 22 warning(s) in tests -sign-change.test libFuzzer :: fuzzer-implicit-signed-integer-truncation.test libFuzzer :: fuzzer-implicit-unsigned-integer-truncation.test libFuzzer :: fuzzer-oom.test libFuzzer :: fuzzer-printcovpcs.test libFuzzer :: fuzzer-runs.test libFuzzer :: fuzzer-seed.test libFuzzer :: fuzzer-singleinputs.test libFuzzer :: fuzzer-threaded.test libFuzzer :: fuzzer-timeout.test libFuzzer :: fuzzer-ubsan.test libFuzzer :: initialize.test libFuzzer :: len_control.test libFuzzer :: max-number-of-runs.test libFuzzer :: memcmp.test libFuzzer :: memcmp64.test libFuzzer :: merge-control-file.test libFuzzer :: merge-posix.test libFuzzer :: merge.test libFuzzer :: merge_two_step.test libFuzzer :: minimize_crash.test libFuzzer :: minimize_two_crashes.test libFuzzer :: not-instrumented.test libFuzzer :: null-deref-on-empty.test libFuzzer :: null-deref.test libFuzzer :: overwrite-input.test libFuzzer :: read-binary.test libFuzzer :: recommended-dictionary.test libFuzzer :: reduce_inputs.test libFuzzer :: reload.test libFuzzer :: repeated-bytes.test libFuzzer :: seed_inputs.test libFuzzer :: shrink.test libFuzzer :: simple.test libFuzzer :: standalone.test libFuzzer :: strcmp.test libFuzzer :: strncmp.test libFuzzer :: strstr.test libFuzzer :: swap-cmp.test libFuzzer :: symbolize-deadlock.test libFuzzer :: three-bytes.test libFuzzer :: trace-malloc.test libFuzzer :: value-profile-cmp.test libFuzzer :: value-profile-cmp2.test libFuzzer :: value-profile-cmp3.test libFuzzer :: value-profile-cmp4.test libFuzzer :: value-profile-div.test libFuzzer :: value-profile-load.test libFuzzer :: value-profile-mem.test libFuzzer :: value-profile-set.test libFuzzer :: value-profile-strcmp.test libFuzzer :: value-profile-strncmp.test libFuzzer :: value-profile-switch.test

Hide Details

Expected Passes : 1674 Expected Failures : 34 Unsupported Tests : 858 Unexpected Failures: 387 FAILED: test/CMakeFiles/check-compiler-rt cd /Users/buildslave/jenkins/workspace/clang-stage2-Rthinlto/clang-build/Build/tools/clang/runtime/compiler-rt-bins/test && /usr/local/bin/python /Users/buildslave/jenkins/workspace/clang-stage2-Rthinlto/clang-build/Build/bin/llvm-lit --xunit-xml-output=testresults.xunit.xml -v --timeout=600 /Users/buildslave/jenkins/workspace/clang-stage2-Rthinlto/clang-build/Build/tools/clang/runtime/compiler-rt-bins/test/builtins/TestCases /Users/buildslave/jenkins/workspace/clang-stage2-Rthinlto/clang-build/Build/tools/clang/runtime/compiler-rt-bins/test/builtins/Unit/X86_64DarwinConfig /Users/buildslave/jenkins/workspace/clang-stage2-Rthinlto/clang-build/Build/tools/clang/runtime/compiler-rt-bins/test/lsan/X86_64LsanConfig /Users/buildslave/jenkins/workspace/clang-stage2-Rthinlto/clang-build/Build/tools/clang/runtime/compiler-rt-bins/test/lsan/X86_64AsanConfig /Users/buildslave/jenkins/workspace/clang-stage2-Rthinlto/clang-build/Build/tools/clang/runtime/compiler-rt-bins/test/ubsan/Standalone-x86_64 /Users/buildslave/jenkins/workspace/clang-stage2-Rthinlto/clang-build/Build/tools/clang/runtime/compiler-rt-bins/test/ubsan/AddressSanitizer-x86_64 /Users/buildslave/jenkins/workspace/clang-stage2-Rthinlto/clang-build/Build/tools/clang/runtime/compiler-rt-bins/test/ubsan/ThreadSanitizer-x86_64 /Users/buildslave/jenkins/workspace/clang-stage2-Rthinlto/clang-build/Build/tools/clang/runtime/compiler-rt-bins/test/ubsan/StandaloneStatic-x86_64 /Users/buildslave/jenkins/workspace/clang-stage2-Rthinlto/clang-build/Build/tools/clang/runtime/compiler-rt-bins/test/cfi/Standalone-x86_64 /Users/buildslave/jenkins/workspace/clang-stage2-Rthinlto/clang-build/Build/tools/clang/runtime/compiler-rt-bins/test/cfi/Devirt-x86_64 /Users/buildslave/jenkins/workspace/clang-stage2-Rthinlto/clang-build/Build/tools/clang/runtime/compiler-rt-bins/test/sanitizer_common/asan-x86_64-Darwin /Users/buildslave/jenkins/workspace/clang-stage2-Rthinlto/clang-build/Build/tools/clang/runtime/compiler-rt-bins/test/sanitizer_common/lsan-x86_64-Darwin /Users/buildslave/jenkins/workspace/clang-stage2-Rthinlto/clang-build/Build/tools/clang/runtime/compiler-rt-bins/test/sanitizer_common/tsan-x86_64-Darwin /Users/buildslave/jenkins/workspace/clang-stage2-Rthinlto/clang-build/Build/tools/clang/runtime/compiler-rt-bins/test/sanitizer_common/ubsan-x86_64-Darwin /Users/buildslave/jenkins/workspace/clang-stage2-Rthinlto/clang-build/Build/tools/clang/runtime/compiler-rt-bins/test/sanitizer_common/Unit /Users/buildslave/jenkins/workspace/clang-stage2-Rthinlto/clang-build/Build/tools/clang/runtime/compiler-rt-bins/test/fuzzer/unit /Users/buildslave/jenkins/workspace/clang-stage2-Rthinlto/clang-build/Build/tools/clang/runtime/compiler-rt-bins/test/fuzzer/X86_64DefaultDarwinConfig/ /Users/buildslave/jenkins/workspace/clang-stage2-Rthinlto/clang-build/Build/tools/clang/runtime/compiler-rt-bins/test/asan/X86_64DarwinConfig /Users/buildslave/jenkins/workspace/clang-stage2-Rthinlto/clang-build/Build/tools/clang/runtime/compiler-rt-bins/test/asan/Unit /Users/buildslave/jenkins/workspace/clang-stage2-Rthinlto/clang-build/Build/tools/clang/runtime/compiler-rt-bins/test/tsan/X86_64Config /Users/buildslave/jenkins/workspace/clang-stage2-Rthinlto/clang-build/Build/tools/clang/runtime/compiler-rt-bins/test/tsan/Unit /Users/buildslave/jenkins/workspace/clang-stage2-Rthinlto/clang-build/Build/tools/clang/runtime/compiler-rt-bins/test/ubsan_minimal/x86_64 /Users/buildslave/jenkins/workspace/clang-stage2-Rthinlto/clang-build/Build/tools/clang/runtime/compiler-rt-bins/test/profile/Profile-x86_64 /Users/buildslave/jenkins/workspace/clang-stage2-Rthinlto/clang-build/Build/tools/clang/runtime/compiler-rt-bins/test/xray/X86_64DarwinConfig /Users/buildslave/jenkins/workspace/clang-stage2-Rthinlto/clang-build/Build/tools/clang/runtime/compiler-rt-bins/test/xray/X86_64HDarwinConfig /Users/buildslave/jenkins/workspace/clang-stage2-Rthinlto/clang-build/Build/tools/clang/runtime/compiler-rt-bins/test/shadowcallstack/arm64 ninja: build stopped: subcommand failed. [2/4] cd /Users/buildslave/jenkins/workspace/clang-stage2-Rthinlto/llvm-project/clang/bindings/python && /usr/local/Cellar/cmake/3.15.1/bin/cmake -E env CLANG_LIBRARY_PATH=/Users/buildslave/jenkins/workspace/clang-stage2-Rthinlto/clang-build/Build/lib /usr/local/bin/python -m unittest discover .................................................s................................................s.s.......s...s.........s... ---------------------------------------------------------------------- Ran 126 tests in 0.248s

Hide Details

OK (skipped=6) FAILED: tools/clang/runtime/CMakeFiles/check-compiler-rt cd /Users/buildslave/jenkins/workspace/clang-stage2-Rthinlto/clang-build/Build/tools/clang/runtime/compiler-rt-bins && /usr/local/Cellar/cmake/3.15.1/bin/cmake --build . --target check-all --config RelWithDebInfo ninja: build stopped: cannot make progress due to previous errors. Command failed Command: ['env', 'MALLOC_LOG_FILE=/dev/null', '/usr/local/bin/ninja', '-v', '-k', '0', 'check-all'] [Pipeline] } [Pipeline] // timeout [Pipeline] } [Pipeline] // stage [Pipeline] stage [Pipeline] { (Declarative: Post Actions) [Pipeline] scanForIssues No credentials specified [Clang (LLVM based)] Sleeping for 5 seconds due to JENKINS-32191... [Clang (LLVM based)] Parsing console log (workspace: '/Users/buildslave/jenkins/workspace/clang-stage2-Rthinlto') [Clang (LLVM based)] [-ERROR-] Can't resolve absolute paths for some files: [Clang (LLVM based)] [-ERROR-] - /Users/buildslave/jenkins/workspace/clang-stage2-Rthinlto/clang-build/Build/tools/clang/runtime/compiler-rt-bins/llvm-lit: /Users/buildslave/jenkins/workspace/clang-stage2-Rthinlto/llvm-project/compiler-rt/test/lit.common.cfg.py [Clang (LLVM based)] [-ERROR-] - /Users/buildslave/jenkins/workspace/clang-stage2-Rthinlto/clang-build/Build/tools/clang/runtime/compiler-rt-bins/<inline asm> [Clang (LLVM based)] [-ERROR-] Can't create fingerprints for some files: [Clang (LLVM based)] [-ERROR-] - '/Users/buildslave/jenkins/workspace/clang-stage2-Rthinlto/clang-build/Build/tools/clang/runtime/compiler-rt-bins/llvm-lit: /Users/buildslave/jenkins/workspace/clang-stage2-Rthinlto/llvm-project/compiler-rt/test/lit.common.cfg.py', IO exception has been thrown: java.nio.file.NoSuchFileException: /Users/buildslave/jenkins/workspace/clang-stage2-Rthinlto/clang-build/Build/tools/clang/runtime/compiler-rt-bins/llvm-lit: /Users/buildslave/jenkins/workspace/clang-stage2-Rthinlto/llvm-project/compiler-rt/test/lit.common.cfg.py [Clang (LLVM based)] [-ERROR-] - '/Users/buildslave/jenkins/workspace/clang-stage2-Rthinlto/clang-build/Build/tools/clang/runtime/compiler-rt-bins/<inline asm>', IO exception has been thrown: java.nio.file.NoSuchFileException: /Users/buildslave/jenkins/workspace/clang-stage2-Rthinlto/clang-build/Build/tools/clang/runtime/compiler-rt-bins/<inline asm> [Clang (LLVM based)] [-ERROR-] - '/Users/buildslave/jenkins/workspace/clang-stage2-Rthinlto/clang-build/Build/tools/clang/runtime/compiler-rt-bins/<inline asm>', IO exception has been thrown: java.nio.file.NoSuchFileException: /Users/buildslave/jenkins/workspace/clang-stage2-Rthinlto/clang-build/Build/tools/clang/runtime/compiler-rt-bins/<inline asm> [Clang (LLVM based)] [-ERROR-] - '/Users/buildslave/jenkins/workspace/clang-stage2-Rthinlto/clang-build/Build/tools/clang/runtime/compiler-rt-bins/<inline asm>', IO exception has been thrown: java.nio.file.NoSuchFileException: /Users/buildslave/jenkins/workspace/clang-stage2-Rthinlto/clang-build/Build/tools/clang/runtime/compiler-rt-bins/<inline asm> [Clang (LLVM based)] [-ERROR-] Can't determine head commit using 'git rev-parse'. Skipping blame. [Clang (LLVM based)] [-ERROR-] hudson.plugins.git.GitException: Command "git rev-parse HEAD^{commit}" returned status code 128: stdout: stderr: fatal: not a git repository (or any of the parent directories): .git

Hide Details

[Clang (LLVM based)] [-ERROR-] at org.jenkinsci.plugins.gitclient.CliGitAPIImpl.launchCommandIn(CliGitAPIImpl.java:2172) [Clang (LLVM based)] [-ERROR-] at org.jenkinsci.plugins.gitclient.CliGitAPIImpl.launchCommandIn(CliGitAPIImpl.java:2140) [Clang (LLVM based)] [-ERROR-] at org.jenkinsci.plugins.gitclient.CliGitAPIImpl.launchCommandIn(CliGitAPIImpl.java:2136) [Clang (LLVM based)] [-ERROR-] at org.jenkinsci.plugins.gitclient.CliGitAPIImpl.launchCommand(CliGitAPIImpl.java:1741) [Clang (LLVM based)] [-ERROR-] at org.jenkinsci.plugins.gitclient.CliGitAPIImpl.launchCommand(CliGitAPIImpl.java:1753) [Clang (LLVM based)] [-ERROR-] at org.jenkinsci.plugins.gitclient.CliGitAPIImpl.revParse(CliGitAPIImpl.java:938) [Clang (LLVM based)] [-ERROR-] at hudson.plugins.git.GitAPI.revParse(GitAPI.java:316) [Clang (LLVM based)] [-ERROR-] at io.jenkins.plugins.analysis.core.scm.GitBlamer.blame(GitBlamer.java:65) [Clang (LLVM based)] [-ERROR-] at io.jenkins.plugins.analysis.core.steps.IssuesScanner$ReportPostProcessor.invoke(IssuesScanner.java:180) [Clang (LLVM based)] [-ERROR-] at io.jenkins.plugins.analysis.core.steps.IssuesScanner$ReportPostProcessor.invoke(IssuesScanner.java:148) [Clang (LLVM based)] [-ERROR-] at hudson.FilePath$FileCallableWrapper.call(FilePath.java:3050) [Clang (LLVM based)] [-ERROR-] at hudson.remoting.UserRequest.perform(UserRequest.java:212) [Clang (LLVM based)] [-ERROR-] at hudson.remoting.UserRequest.perform(UserRequest.java:54) [Clang (LLVM based)] [-ERROR-] at hudson.remoting.Request$2.run(Request.java:369) [Clang (LLVM based)] [-ERROR-] at hudson.remoting.InterceptingExecutorService$1.call(InterceptingExecutorService.java:72) [Clang (LLVM based)] [-ERROR-] at java.util.concurrent.FutureTask.run(FutureTask.java:266) [Clang (LLVM based)] [-ERROR-] at java.util.concurrent.ThreadPoolExecutor.runWorker(ThreadPoolExecutor.java:1149) [Clang (LLVM based)] [-ERROR-] at java.util.concurrent.ThreadPoolExecutor$Worker.run(ThreadPoolExecutor.java:624) [Clang (LLVM based)] [-ERROR-] at java.lang.Thread.run(Thread.java:748) [Clang (LLVM based)] Post processing issues on 'green-dragon-17' with source code encoding 'UTF-8' [Clang (LLVM based)] Resolving absolute file names for all issues in workspace '/Users/buildslave/jenkins/workspace/clang-stage2-Rthinlto' [Clang (LLVM based)] -> 0 resolved, 2 unresolved, 31 already resolved [Clang (LLVM based)] Copying affected files to Jenkins' build folder '/Users/Shared/Jenkins/Home/jobs/clang-stage2-Rthinlto/builds/2012/files-with-issues' [Clang (LLVM based)] -> 31 copied, 0 not in workspace, 2 not-found, 0 with I/O error [Clang (LLVM based)] Resolving module names from module definitions (build.xml, pom.xml, or Manifest.mf files) [Clang (LLVM based)] -> resolved module names for 55 issues [Clang (LLVM based)] Resolving package names (or namespaces) by parsing the affected files [Clang (LLVM based)] -> resolved package names of 33 affected files [Clang (LLVM based)] No filter has been set, publishing all 55 issues [Clang (LLVM based)] Creating fingerprints for all affected code blocks to track issues over different builds [Clang (LLVM based)] -> created fingerprints for 51 issues [Clang (LLVM based)] Invoking Git blamer to create author and commit information for all affected files [Clang (LLVM based)] GIT_COMMIT env = 'HEAD' [Clang (LLVM based)] Git working tree = '/Users/buildslave/jenkins/workspace/clang-stage2-Rthinlto'
[Pipeline] } [Pipeline] // stage [Pipeline] } [Pipeline] // node [Pipeline] End of Pipeline ERROR: script returned exit code 1 Finished: FAILURE