FailedConsole Output

Skipping 12,335 KB.. Full Log
/lib/libLLVMDebugInfoPDB.a(PDBExtras.cpp.o)) was built for newer OSX version (10.14) than being linked (10.12)
ld: warning: object file (/Users/buildslave/jenkins/workspace/lldb-cmake-standalone/clang-build/lib/libLLVMTextAPI.a(TextStub.cpp.o)) was built for newer OSX version (10.14) than being linked (10.12)
ld: warning: object file (/Users/buildslave/jenkins/workspace/lldb-cmake-standalone/clang-build/lib/libLLVMTextAPI.a(Target.cpp.o)) was built for newer OSX version (10.14) than being linked (10.12)
ld: warning: object file (/Users/buildslave/jenkins/workspace/lldb-cmake-standalone/clang-build/lib/libLLVMObject.a(IRObjectFile.cpp.o)) was built for newer OSX version (10.14) than being linked (10.12)
ld: warning: object file (/Users/buildslave/jenkins/workspace/lldb-cmake-standalone/clang-build/lib/libLLVMObject.a(ELF.cpp.o)) was built for newer OSX version (10.14) than being linked (10.12)
ld: warning: object file (/Users/buildslave/jenkins/workspace/lldb-cmake-standalone/clang-build/lib/libLLVMObject.a(TapiFile.cpp.o)) was built for newer OSX version (10.14) than being linked (10.12)
ld: warning: object file (/Users/buildslave/jenkins/workspace/lldb-cmake-standalone/clang-build/lib/libLLVMRemarks.a(RemarkStringTable.cpp.o)) was built for newer OSX version (10.14) than being linked (10.12)
ld: warning: object file (/Users/buildslave/jenkins/workspace/lldb-cmake-standalone/clang-build/lib/libLLVMSupport.a(xxhash.cpp.o)) was built for newer OSX version (10.14) than being linked (10.12)
ld: warning: object file (/Users/buildslave/jenkins/workspace/lldb-cmake-standalone/clang-build/lib/libclangAnalysis.a(CFGStmtMap.cpp.o)) was built for newer OSX version (10.14) than being linked (10.12)
ld: warning: object file (/Users/buildslave/jenkins/workspace/lldb-cmake-standalone/clang-build/lib/libclangAST.a(ASTTypeTraits.cpp.o)) was built for newer OSX version (10.14) than being linked (10.12)
ld: warning: object file (/Users/buildslave/jenkins/workspace/lldb-cmake-standalone/clang-build/lib/libclangAnalysis.a(ObjCNoReturn.cpp.o)) was built for newer OSX version (10.14) than being linked (10.12)
ld: warning: object file (/Users/buildslave/jenkins/workspace/lldb-cmake-standalone/clang-build/lib/libclangCodeGen.a(ModuleBuilder.cpp.o)) was built for newer OSX version (10.14) than being linked (10.12)
ld: warning: object file (/Users/buildslave/jenkins/workspace/lldb-cmake-standalone/clang-build/lib/libclangAST.a(ScanfFormatString.cpp.o)) was built for newer OSX version (10.14) than being linked (10.12)
ld: warning: object file (/Users/buildslave/jenkins/workspace/lldb-cmake-standalone/clang-build/lib/libclangRewrite.a(RewriteRope.cpp.o)) was built for newer OSX version (10.14) than being linked (10.12)
ld: warning: object file (/Users/buildslave/jenkins/workspace/lldb-cmake-standalone/clang-build/lib/libclangAST.a(PrintfFormatString.cpp.o)) was built for newer OSX version (10.14) than being linked (10.12)
ld: warning: object file (/Users/buildslave/jenkins/workspace/lldb-cmake-standalone/clang-build/lib/libclangSerialization.a(ASTWriterStmt.cpp.o)) was built for newer OSX version (10.14) than being linked (10.12)
ld: warning: object file (/Users/buildslave/jenkins/workspace/lldb-cmake-standalone/clang-build/lib/libclangSerialization.a(ASTWriterDecl.cpp.o)) was built for newer OSX version (10.14) than being linked (10.12)
ld: warning: object file (/Users/buildslave/jenkins/workspace/lldb-cmake-standalone/clang-build/lib/libclangAnalysis.a(ConstructionContext.cpp.o)) was built for newer OSX version (10.14) than being linked (10.12)
ld: warning: object file (/Users/buildslave/jenkins/workspace/lldb-cmake-standalone/clang-build/lib/libclangAST.a(FormatString.cpp.o)) was built for newer OSX version (10.14) than being linked (10.12)
ld: warning: object file (/Users/buildslave/jenkins/workspace/lldb-cmake-standalone/clang-build/lib/libclangAST.a(ASTImporterLookupTable.cpp.o)) was built for newer OSX version (10.14) than being linked (10.12)
ld: warning: object file (/Users/buildslave/jenkins/workspace/lldb-cmake-standalone/clang-build/lib/libclangBasic.a(SanitizerSpecialCaseList.cpp.o)) was built for newer OSX version (10.14) than being linked (10.12)
ld: warning: object file (/Users/buildslave/jenkins/workspace/lldb-cmake-standalone/clang-build/lib/libclangEdit.a(EditedSource.cpp.o)) was built for newer OSX version (10.14) than being linked (10.12)
ld: warning: object file (/Users/buildslave/jenkins/workspace/lldb-cmake-standalone/clang-build/lib/libclangEdit.a(RewriteObjCFoundationAPI.cpp.o)) was built for newer OSX version (10.14) than being linked (10.12)
ld: warning: object file (/Users/buildslave/jenkins/workspace/lldb-cmake-standalone/clang-build/lib/libclangEdit.a(Commit.cpp.o)) was built for newer OSX version (10.14) than being linked (10.12)
ld: warning: object file (/Users/buildslave/jenkins/workspace/lldb-cmake-standalone/clang-build/lib/libclangAnalysis.a(CocoaConventions.cpp.o)) was built for newer OSX version (10.14) than being linked (10.12)
ld: warning: object file (/Users/buildslave/jenkins/workspace/lldb-cmake-standalone/clang-build/lib/libclangAST.a(EvalEmitter.cpp.o)) was built for newer OSX version (10.14) than being linked (10.12)
ld: warning: object file (/Users/buildslave/jenkins/workspace/lldb-cmake-standalone/clang-build/lib/libclangAST.a(InterpFrame.cpp.o)) was built for newer OSX version (10.14) than being linked (10.12)
ld: warning: object file (/Users/buildslave/jenkins/workspace/lldb-cmake-standalone/clang-build/lib/libclangAST.a(InterpStack.cpp.o)) was built for newer OSX version (10.14) than being linked (10.12)
ld: warning: object file (/Users/buildslave/jenkins/workspace/lldb-cmake-standalone/clang-build/lib/libclangAST.a(InterpState.cpp.o)) was built for newer OSX version (10.14) than being linked (10.12)
ld: warning: object file (/Users/buildslave/jenkins/workspace/lldb-cmake-standalone/clang-build/lib/libclangAST.a(ByteCodeEmitter.cpp.o)) was built for newer OSX version (10.14) than being linked (10.12)
ld: warning: object file (/Users/buildslave/jenkins/workspace/lldb-cmake-standalone/clang-build/lib/libclangAST.a(ByteCodeExprGen.cpp.o)) was built for newer OSX version (10.14) than being linked (10.12)
ld: warning: object file (/Users/buildslave/jenkins/workspace/lldb-cmake-standalone/clang-build/lib/libclangAST.a(ByteCodeStmtGen.cpp.o)) was built for newer OSX version (10.14) than being linked (10.12)
ld: warning: object file (/Users/buildslave/jenkins/workspace/lldb-cmake-standalone/clang-build/lib/libclangAST.a(ByteCodeGenError.cpp.o)) was built for newer OSX version (10.14) than being linked (10.12)
ld: warning: object file (/Users/buildslave/jenkins/workspace/lldb-cmake-standalone/clang-build/lib/libclangAST.a(Pointer.cpp.o)) was built for newer OSX version (10.14) than being linked (10.12)
ld: warning: object file (/Users/buildslave/jenkins/workspace/lldb-cmake-standalone/clang-build/lib/libclangAST.a(Program.cpp.o)) was built for newer OSX version (10.14) than being linked (10.12)
ld: warning: object file (/Users/buildslave/jenkins/workspace/lldb-cmake-standalone/clang-build/lib/libclangAST.a(Interp.cpp.o)) was built for newer OSX version (10.14) than being linked (10.12)
ld: warning: object file (/Users/buildslave/jenkins/workspace/lldb-cmake-standalone/clang-build/lib/libclangAnalysis.a(BodyFarm.cpp.o)) was built for newer OSX version (10.14) than being linked (10.12)
ld: warning: object file (/Users/buildslave/jenkins/workspace/lldb-cmake-standalone/clang-build/lib/libclangRewrite.a(Rewriter.cpp.o)) was built for newer OSX version (10.14) than being linked (10.12)
ld: warning: object file (/Users/buildslave/jenkins/workspace/lldb-cmake-standalone/clang-build/lib/libclangRewrite.a(DeltaTree.cpp.o)) was built for newer OSX version (10.14) than being linked (10.12)
ld: warning: object file (/Users/buildslave/jenkins/workspace/lldb-cmake-standalone/clang-build/lib/libLLVMDebugInfoPDB.a(PDBSymbolData.cpp.o)) was built for newer OSX version (10.14) than being linked (10.12)
ld: warning: object file (/Users/buildslave/jenkins/workspace/lldb-cmake-standalone/clang-build/lib/libLLVMDebugInfoPDB.a(PDBSymbolFunc.cpp.o)) was built for newer OSX version (10.14) than being linked (10.12)
ld: warning: object file (/Users/buildslave/jenkins/workspace/lldb-cmake-standalone/clang-build/lib/libLLVMDebugInfoPDB.a(PDBSymbolCompiland.cpp.o)) was built for newer OSX version (10.14) than being linked (10.12)
ld: warning: object file (/Users/buildslave/jenkins/workspace/lldb-cmake-standalone/clang-build/lib/libclangAST.a(Source.cpp.o)) was built for newer OSX version (10.14) than being linked (10.12)
ld: warning: object file (/Users/buildslave/jenkins/workspace/lldb-cmake-standalone/clang-build/lib/libclangAST.a(Function.cpp.o)) was built for newer OSX version (10.14) than being linked (10.12)
ld: warning: object file (/Users/buildslave/jenkins/workspace/lldb-cmake-standalone/clang-build/lib/libLLVMDebugInfoPDB.a(PDBSymbolExe.cpp.o)) was built for newer OSX version (10.14) than being linked (10.12)
ld: warning: object file (/Users/buildslave/jenkins/workspace/lldb-cmake-standalone/clang-build/lib/libLLVMDebugInfoPDB.a(PDBSymbolBlock.cpp.o)) was built for newer OSX version (10.14) than being linked (10.12)
ld: warning: object file (/Users/buildslave/jenkins/workspace/lldb-cmake-standalone/clang-build/lib/libLLVMDebugInfoPDB.a(PDBSymbolLabel.cpp.o)) was built for newer OSX version (10.14) than being linked (10.12)
ld: warning: object file (/Users/buildslave/jenkins/workspace/lldb-cmake-standalone/clang-build/lib/libLLVMDebugInfoPDB.a(PDBSymbolThunk.cpp.o)) was built for newer OSX version (10.14) than being linked (10.12)
ld: warning: object file (/Users/buildslave/jenkins/workspace/lldb-cmake-standalone/clang-build/lib/libLLVMDebugInfoPDB.a(PDBSymbolCustom.cpp.o)) was built for newer OSX version (10.14) than being linked (10.12)
ld: warning: object file (/Users/buildslave/jenkins/workspace/lldb-cmake-standalone/clang-build/lib/libLLVMDebugInfoPDB.a(PDBSymbolTypeUDT.cpp.o)) was built for newer OSX version (10.14) than being linked (10.12)
ld: warning: object file (/Users/buildslave/jenkins/workspace/lldb-cmake-standalone/clang-build/lib/libLLVMDebugInfoPDB.a(PDBSymbolUnknown.cpp.o)) was built for newer OSX version (10.14) than being linked (10.12)
ld: warning: object file (/Users/buildslave/jenkins/workspace/lldb-cmake-standalone/clang-build/lib/libLLVMDebugInfoPDB.a(PDBSymbolTypeEnum.cpp.o)) was built for newer OSX version (10.14) than being linked (10.12)
ld: warning: object file (/Users/buildslave/jenkins/workspace/lldb-cmake-standalone/clang-build/lib/libLLVMDebugInfoPDB.a(PDBSymbolTypeArray.cpp.o)) was built for newer OSX version (10.14) than being linked (10.12)
ld: warning: object file (/Users/buildslave/jenkins/workspace/lldb-cmake-standalone/clang-build/lib/libLLVMDebugInfoPDB.a(PDBSymbolAnnotation.cpp.o)) was built for newer OSX version (10.14) than being linked (10.12)
ld: warning: object file (/Users/buildslave/jenkins/workspace/lldb-cmake-standalone/clang-build/lib/libLLVMDebugInfoPDB.a(PDBSymbolTypeCustom.cpp.o)) was built for newer OSX version (10.14) than being linked (10.12)
ld: warning: object file (/Users/buildslave/jenkins/workspace/lldb-cmake-standalone/clang-build/lib/libLLVMDebugInfoPDB.a(PDBSymbolTypeFriend.cpp.o)) was built for newer OSX version (10.14) than being linked (10.12)
ld: warning: object file (/Users/buildslave/jenkins/workspace/lldb-cmake-standalone/clang-build/lib/libLLVMDebugInfoPDB.a(PDBSymbolTypeVTable.cpp.o)) was built for newer OSX version (10.14) than being linked (10.12)
ld: warning: object file (/Users/buildslave/jenkins/workspace/lldb-cmake-standalone/clang-build/lib/libLLVMDebugInfoPDB.a(PDBSymbolTypeBuiltin.cpp.o)) was built for newer OSX version (10.14) than being linked (10.12)
ld: warning: object file (/Users/buildslave/jenkins/workspace/lldb-cmake-standalone/clang-build/lib/libLLVMDebugInfoPDB.a(PDBSymbolTypeManaged.cpp.o)) was built for newer OSX version (10.14) than being linked (10.12)
ld: warning: object file (/Users/buildslave/jenkins/workspace/lldb-cmake-standalone/clang-build/lib/libLLVMDebugInfoPDB.a(PDBSymbolTypePointer.cpp.o)) was built for newer OSX version (10.14) than being linked (10.12)
ld: warning: object file (/Users/buildslave/jenkins/workspace/lldb-cmake-standalone/clang-build/lib/libLLVMDebugInfoPDB.a(PDBSymbolTypeTypedef.cpp.o)) was built for newer OSX version (10.14) than being linked (10.12)
ld: warning: object file (/Users/buildslave/jenkins/workspace/lldb-cmake-standalone/clang-build/lib/libLLVMDebugInfoPDB.a(PDBSymbolCompilandEnv.cpp.o)) was built for newer OSX version (10.14) than being linked (10.12)
ld: warning: object file (/Users/buildslave/jenkins/workspace/lldb-cmake-standalone/clang-build/lib/libLLVMDebugInfoPDB.a(PDBSymbolFuncDebugEnd.cpp.o)) was built for newer OSX version (10.14) than being linked (10.12)
ld: warning: object file (/Users/buildslave/jenkins/workspace/lldb-cmake-standalone/clang-build/lib/libLLVMDebugInfoPDB.a(PDBSymbolPublicSymbol.cpp.o)) was built for newer OSX version (10.14) than being linked (10.12)
ld: warning: object file (/Users/buildslave/jenkins/workspace/lldb-cmake-standalone/clang-build/lib/libLLVMDebugInfoPDB.a(PDBSymbolTypeBaseClass.cpp.o)) was built for newer OSX version (10.14) than being linked (10.12)
ld: warning: object file (/Users/buildslave/jenkins/workspace/lldb-cmake-standalone/clang-build/lib/libLLVMDebugInfoPDB.a(PDBSymbolTypeDimension.cpp.o)) was built for newer OSX version (10.14) than being linked (10.12)
ld: warning: object file (/Users/buildslave/jenkins/workspace/lldb-cmake-standalone/clang-build/lib/libLLVMDebugInfoPDB.a(PDBSymbolFuncDebugStart.cpp.o)) was built for newer OSX version (10.14) than being linked (10.12)
ld: warning: object file (/Users/buildslave/jenkins/workspace/lldb-cmake-standalone/clang-build/lib/libLLVMDebugInfoPDB.a(PDBSymbolUsingNamespace.cpp.o)) was built for newer OSX version (10.14) than being linked (10.12)
ld: warning: object file (/Users/buildslave/jenkins/workspace/lldb-cmake-standalone/clang-build/lib/libLLVMDebugInfoPDB.a(PDBSymbolTypeFunctionArg.cpp.o)) was built for newer OSX version (10.14) than being linked (10.12)
ld: warning: object file (/Users/buildslave/jenkins/workspace/lldb-cmake-standalone/clang-build/lib/libLLVMDebugInfoPDB.a(PDBSymbolTypeVTableShape.cpp.o)) was built for newer OSX version (10.14) than being linked (10.12)
ld: warning: object file (/Users/buildslave/jenkins/workspace/lldb-cmake-standalone/clang-build/lib/libLLVMDebugInfoPDB.a(PDBSymbolCompilandDetails.cpp.o)) was built for newer OSX version (10.14) than being linked (10.12)
ld: warning: object file (/Users/buildslave/jenkins/workspace/lldb-cmake-standalone/clang-build/lib/libLLVMSupport.a(ARMBuildAttrs.cpp.o)) was built for newer OSX version (10.14) than being linked (10.12)
ld: warning: object file (/Users/buildslave/jenkins/workspace/lldb-cmake-standalone/clang-build/lib/libLLVMBitReader.a(BitcodeReader.cpp.o)) was built for newer OSX version (10.14) than being linked (10.12)
ld: warning: object file (/Users/buildslave/jenkins/workspace/lldb-cmake-standalone/clang-build/lib/libLLVMObject.a(ModuleSymbolTable.cpp.o)) was built for newer OSX version (10.14) than being linked (10.12)
ld: warning: object file (/Users/buildslave/jenkins/workspace/lldb-cmake-standalone/clang-build/lib/libLLVMRuntimeDyld.a(RTDyldMemoryManager.cpp.o)) was built for newer OSX version (10.14) than being linked (10.12)
ld: warning: object file (/Users/buildslave/jenkins/workspace/lldb-cmake-standalone/clang-build/lib/libLLVMRuntimeDyld.a(RuntimeDyld.cpp.o)) was built for newer OSX version (10.14) than being linked (10.12)
ld: warning: object file (/Users/buildslave/jenkins/workspace/lldb-cmake-standalone/clang-build/lib/libLLVMDebugInfoCodeView.a(DebugChecksumsSubsection.cpp.o)) was built for newer OSX version (10.14) than being linked (10.12)
ld: warning: object file (/Users/buildslave/jenkins/workspace/lldb-cmake-standalone/clang-build/lib/libLLVMDebugInfoPDB.a(NativeSession.cpp.o)) was built for newer OSX version (10.14) than being linked (10.12)
ld: warning: object file (/Users/buildslave/jenkins/workspace/lldb-cmake-standalone/clang-build/lib/libLLVMDebugInfoPDB.a(GenericError.cpp.o)) was built for newer OSX version (10.14) than being linked (10.12)
ld: warning: object file (/Users/buildslave/jenkins/workspace/lldb-cmake-standalone/clang-build/lib/libLLVMDebugInfoPDB.a(ModuleDebugStream.cpp.o)) was built for newer OSX version (10.14) than being linked (10.12)
ld: warning: object file (/Users/buildslave/jenkins/workspace/lldb-cmake-standalone/clang-build/lib/libLLVMDebugInfoPDB.a(PDBFile.cpp.o)) was built for newer OSX version (10.14) than being linked (10.12)
ld: warning: object file (/Users/buildslave/jenkins/workspace/lldb-cmake-standalone/clang-build/lib/libLLVMDebugInfoPDB.a(TpiStream.cpp.o)) was built for newer OSX version (10.14) than being linked (10.12)
ld: warning: object file (/Users/buildslave/jenkins/workspace/lldb-cmake-standalone/clang-build/lib/libLLVMSupport.a(Memory.cpp.o)) was built for newer OSX version (10.14) than being linked (10.12)
ld: warning: object file (/Users/buildslave/jenkins/workspace/lldb-cmake-standalone/clang-build/lib/libLLVMTextAPI.a(TextStubCommon.cpp.o)) was built for newer OSX version (10.14) than being linked (10.12)
ld: warning: object file (/Users/buildslave/jenkins/workspace/lldb-cmake-standalone/clang-build/lib/libLLVMTextAPI.a(InterfaceFile.cpp.o)) was built for newer OSX version (10.14) than being linked (10.12)
ld: warning: object file (/Users/buildslave/jenkins/workspace/lldb-cmake-standalone/clang-build/lib/libLLVMTextAPI.a(ArchitectureSet.cpp.o)) was built for newer OSX version (10.14) than being linked (10.12)
ld: warning: object file (/Users/buildslave/jenkins/workspace/lldb-cmake-standalone/clang-build/lib/libLLVMTextAPI.a(Platform.cpp.o)) was built for newer OSX version (10.14) than being linked (10.12)
ld: warning: object file (/Users/buildslave/jenkins/workspace/lldb-cmake-standalone/clang-build/lib/libLLVMTextAPI.a(Architecture.cpp.o)) was built for newer OSX version (10.14) than being linked (10.12)
ld: warning: object file (/Users/buildslave/jenkins/workspace/lldb-cmake-standalone/clang-build/lib/libLLVMDebugInfoCodeView.a(SymbolRecordHelpers.cpp.o)) was built for newer OSX version (10.14) than being linked (10.12)
ld: warning: object file (/Users/buildslave/jenkins/workspace/lldb-cmake-standalone/clang-build/lib/libLLVMDebugInfoCodeView.a(DebugSubsection.cpp.o)) was built for newer OSX version (10.14) than being linked (10.12)
ld: warning: object file (/Users/buildslave/jenkins/workspace/lldb-cmake-standalone/clang-build/lib/libLLVMDebugInfoCodeView.a(DebugLinesSubsection.cpp.o)) was built for newer OSX version (10.14) than being linked (10.12)
ld: warning: object file (/Users/buildslave/jenkins/workspace/lldb-cmake-standalone/clang-build/lib/libLLVMDebugInfoCodeView.a(DebugSubsectionRecord.cpp.o)) was built for newer OSX version (10.14) than being linked (10.12)
ld: warning: object file (/Users/buildslave/jenkins/workspace/lldb-cmake-standalone/clang-build/lib/libLLVMObject.a(IRSymtab.cpp.o)) was built for newer OSX version (10.14) than being linked (10.12)
ld: warning: object file (/Users/buildslave/jenkins/workspace/lldb-cmake-standalone/clang-build/lib/libclangAST.a(Descriptor.cpp.o)) was built for newer OSX version (10.14) than being linked (10.12)
ld: warning: object file (/Users/buildslave/jenkins/workspace/lldb-cmake-standalone/clang-build/lib/libclangAST.a(InterpBlock.cpp.o)) was built for newer OSX version (10.14) than being linked (10.12)
ld: warning: object file (/Users/buildslave/jenkins/workspace/lldb-cmake-standalone/clang-build/lib/libclangAST.a(Record.cpp.o)) was built for newer OSX version (10.14) than being linked (10.12)
ld: warning: object file (/Users/buildslave/jenkins/workspace/lldb-cmake-standalone/clang-build/lib/libclangAST.a(PrimType.cpp.o)) was built for newer OSX version (10.14) than being linked (10.12)
ld: warning: object file (/Users/buildslave/jenkins/workspace/lldb-cmake-standalone/clang-build/lib/libclangCodeGen.a(CGDebugInfo.cpp.o)) was built for newer OSX version (10.14) than being linked (10.12)
ld: warning: object file (/Users/buildslave/jenkins/workspace/lldb-cmake-standalone/clang-build/lib/libclangCodeGen.a(CodeGenModule.cpp.o)) was built for newer OSX version (10.14) than being linked (10.12)
ld: warning: object file (/Users/buildslave/jenkins/workspace/lldb-cmake-standalone/clang-build/lib/libclangCodeGen.a(CGVTables.cpp.o)) was built for newer OSX version (10.14) than being linked (10.12)
ld: warning: object file (/Users/buildslave/jenkins/workspace/lldb-cmake-standalone/clang-build/lib/libLLVMDebugInfoPDB.a(InfoStream.cpp.o)) was built for newer OSX version (10.14) than being linked (10.12)
ld: warning: object file (/Users/buildslave/jenkins/workspace/lldb-cmake-standalone/clang-build/lib/libLLVMDebugInfoPDB.a(SymbolStream.cpp.o)) was built for newer OSX version (10.14) than being linked (10.12)
ld: warning: object file (/Users/buildslave/jenkins/workspace/lldb-cmake-standalone/clang-build/lib/libLLVMDebugInfoPDB.a(DbiModuleList.cpp.o)) was built for newer OSX version (10.14) than being linked (10.12)
ld: warning: object file (/Users/buildslave/jenkins/workspace/lldb-cmake-standalone/clang-build/lib/libLLVMDebugInfoPDB.a(GlobalsStream.cpp.o)) was built for newer OSX version (10.14) than being linked (10.12)
ld: warning: object file (/Users/buildslave/jenkins/workspace/lldb-cmake-standalone/clang-build/lib/libLLVMDebugInfoPDB.a(DbiModuleDescriptor.cpp.o)) was built for newer OSX version (10.14) than being linked (10.12)
ld: warning: object file (/Users/buildslave/jenkins/workspace/lldb-cmake-standalone/clang-build/lib/libLLVMDebugInfoPDB.a(DbiStream.cpp.o)) was built for newer OSX version (10.14) than being linked (10.12)
ld: warning: object file (/Users/buildslave/jenkins/workspace/lldb-cmake-standalone/clang-build/lib/libLLVMRemarks.a(RemarkParser.cpp.o)) was built for newer OSX version (10.14) than being linked (10.12)
ld: warning: object file (/Users/buildslave/jenkins/workspace/lldb-cmake-standalone/clang-build/lib/libLLVMDebugInfoCodeView.a(DebugStringTableSubsection.cpp.o)) was built for newer OSX version (10.14) than being linked (10.12)
ld: warning: object file (/Users/buildslave/jenkins/workspace/lldb-cmake-standalone/clang-build/lib/libclangLex.a(PPConditionalDirectiveRecord.cpp.o)) was built for newer OSX version (10.14) than being linked (10.12)
ld: warning: object file (/Users/buildslave/jenkins/workspace/lldb-cmake-standalone/clang-build/lib/libLLVMCore.a(GVMaterializer.cpp.o)) was built for newer OSX version (10.14) than being linked (10.12)
ld: warning: object file (/Users/buildslave/jenkins/workspace/lldb-cmake-standalone/clang-build/lib/libLLVMBitReader.a(MetadataLoader.cpp.o)) was built for newer OSX version (10.14) than being linked (10.12)
ld: warning: object file (/Users/buildslave/jenkins/workspace/lldb-cmake-standalone/clang-build/lib/libLLVMObject.a(RecordStreamer.cpp.o)) was built for newer OSX version (10.14) than being linked (10.12)
ld: warning: object file (/Users/buildslave/jenkins/workspace/lldb-cmake-standalone/clang-build/lib/libLLVMRuntimeDyld.a(RuntimeDyldELF.cpp.o)) was built for newer OSX version (10.14) than being linked (10.12)
ld: warning: object file (/Users/buildslave/jenkins/workspace/lldb-cmake-standalone/clang-build/lib/libLLVMFrontendOpenMP.a(OMPIRBuilder.cpp.o)) was built for newer OSX version (10.14) than being linked (10.12)
ld: warning: object file (/Users/buildslave/jenkins/workspace/lldb-cmake-standalone/clang-build/lib/libLLVMRuntimeDyld.a(RuntimeDyldCOFF.cpp.o)) was built for newer OSX version (10.14) than being linked (10.12)
ld: warning: object file (/Users/buildslave/jenkins/workspace/lldb-cmake-standalone/clang-build/lib/libLLVMRuntimeDyld.a(RuntimeDyldMachO.cpp.o)) was built for newer OSX version (10.14) than being linked (10.12)
ld: warning: object file (/Users/buildslave/jenkins/workspace/lldb-cmake-standalone/clang-build/lib/libLLVMCore.a(AutoUpgrade.cpp.o)) was built for newer OSX version (10.14) than being linked (10.12)
ld: warning: object file (/Users/buildslave/jenkins/workspace/lldb-cmake-standalone/clang-build/lib/libLLVMTransformUtils.a(SanitizerStats.cpp.o)) was built for newer OSX version (10.14) than being linked (10.12)
ld: warning: object file (/Users/buildslave/jenkins/workspace/lldb-cmake-standalone/clang-build/lib/libLLVMBitReader.a(ValueList.cpp.o)) was built for newer OSX version (10.14) than being linked (10.12)
ld: warning: object file (/Users/buildslave/jenkins/workspace/lldb-cmake-standalone/clang-build/lib/libLLVMDebugInfoMSF.a(MappedBlockStream.cpp.o)) was built for newer OSX version (10.14) than being linked (10.12)
ld: warning: object file (/Users/buildslave/jenkins/workspace/lldb-cmake-standalone/clang-build/lib/libLLVMDebugInfoMSF.a(MSFCommon.cpp.o)) was built for newer OSX version (10.14) than being linked (10.12)
ld: warning: object file (/Users/buildslave/jenkins/workspace/lldb-cmake-standalone/clang-build/lib/libLLVMDebugInfoPDB.a(PDBInterfaceAnchors.cpp.o)) was built for newer OSX version (10.14) than being linked (10.12)
ld: warning: object file (/Users/buildslave/jenkins/workspace/lldb-cmake-standalone/clang-build/lib/libLLVMDebugInfoPDB.a(SymbolCache.cpp.o)) was built for newer OSX version (10.14) than being linked (10.12)
ld: warning: object file (/Users/buildslave/jenkins/workspace/lldb-cmake-standalone/clang-build/lib/libLLVMDebugInfoPDB.a(Hash.cpp.o)) was built for newer OSX version (10.14) than being linked (10.12)
ld: warning: object file (/Users/buildslave/jenkins/workspace/lldb-cmake-standalone/clang-build/lib/libLLVMDebugInfoPDB.a(PublicsStream.cpp.o)) was built for newer OSX version (10.14) than being linked (10.12)
ld: warning: object file (/Users/buildslave/jenkins/workspace/lldb-cmake-standalone/clang-build/lib/libLLVMDebugInfoPDB.a(TpiHashing.cpp.o)) was built for newer OSX version (10.14) than being linked (10.12)
ld: warning: object file (/Users/buildslave/jenkins/workspace/lldb-cmake-standalone/clang-build/lib/libLLVMDebugInfoPDB.a(NamedStreamMap.cpp.o)) was built for newer OSX version (10.14) than being linked (10.12)
ld: warning: object file (/Users/buildslave/jenkins/workspace/lldb-cmake-standalone/clang-build/lib/libLLVMDebugInfoPDB.a(PDBStringTable.cpp.o)) was built for newer OSX version (10.14) than being linked (10.12)
ld: warning: object file (/Users/buildslave/jenkins/workspace/lldb-cmake-standalone/clang-build/lib/libLLVMDebugInfoPDB.a(RawError.cpp.o)) was built for newer OSX version (10.14) than being linked (10.12)
ld: warning: object file (/Users/buildslave/jenkins/workspace/lldb-cmake-standalone/clang-build/lib/libLLVMDebugInfoPDB.a(NativeExeSymbol.cpp.o)) was built for newer OSX version (10.14) than being linked (10.12)
ld: warning: object file (/Users/buildslave/jenkins/workspace/lldb-cmake-standalone/clang-build/lib/libLLVMDebugInfoPDB.a(HashTable.cpp.o)) was built for newer OSX version (10.14) than being linked (10.12)
ld: warning: object file (/Users/buildslave/jenkins/workspace/lldb-cmake-standalone/clang-build/lib/libLLVMDebugInfoPDB.a(InjectedSourceStream.cpp.o)) was built for newer OSX version (10.14) than being linked (10.12)
ld: warning: object file (/Users/buildslave/jenkins/workspace/lldb-cmake-standalone/clang-build/lib/libLLVMDebugInfoPDB.a(NativeEnumInjectedSources.cpp.o)) was built for newer OSX version (10.14) than being linked (10.12)
ld: warning: object file (/Users/buildslave/jenkins/workspace/lldb-cmake-standalone/clang-build/lib/libLLVMSupport.a(Valgrind.cpp.o)) was built for newer OSX version (10.14) than being linked (10.12)
ld: warning: object file (/Users/buildslave/jenkins/workspace/lldb-cmake-standalone/clang-build/lib/libLLVMTextAPI.a(PackedVersion.cpp.o)) was built for newer OSX version (10.14) than being linked (10.12)
ld: warning: object file (/Users/buildslave/jenkins/workspace/lldb-cmake-standalone/clang-build/lib/libLLVMRemarks.a(YAMLRemarkParser.cpp.o)) was built for newer OSX version (10.14) than being linked (10.12)
ld: warning: object file (/Users/buildslave/jenkins/workspace/lldb-cmake-standalone/clang-build/lib/libLLVMRemarks.a(BitstreamRemarkParser.cpp.o)) was built for newer OSX version (10.14) than being linked (10.12)
ld: warning: object file (/Users/buildslave/jenkins/workspace/lldb-cmake-standalone/clang-build/lib/libLLVMDebugInfoCodeView.a(TypeRecordHelpers.cpp.o)) was built for newer OSX version (10.14) than being linked (10.12)
ld: warning: object file (/Users/buildslave/jenkins/workspace/lldb-cmake-standalone/clang-build/lib/libLLVMDebugInfoCodeView.a(StringsAndChecksums.cpp.o)) was built for newer OSX version (10.14) than being linked (10.12)
ld: warning: object file (/Users/buildslave/jenkins/workspace/lldb-cmake-standalone/clang-build/lib/libLLVMDebugInfoCodeView.a(LazyRandomTypeCollection.cpp.o)) was built for newer OSX version (10.14) than being linked (10.12)
ld: warning: object file (/Users/buildslave/jenkins/workspace/lldb-cmake-standalone/clang-build/lib/libLLVMDebugInfoCodeView.a(DebugFrameDataSubsection.cpp.o)) was built for newer OSX version (10.14) than being linked (10.12)
ld: warning: object file (/Users/buildslave/jenkins/workspace/lldb-cmake-standalone/clang-build/lib/libclangCodeGen.a(CodeGenPGO.cpp.o)) was built for newer OSX version (10.14) than being linked (10.12)
ld: warning: object file (/Users/buildslave/jenkins/workspace/lldb-cmake-standalone/clang-build/lib/libclangCodeGen.a(CodeGenTBAA.cpp.o)) was built for newer OSX version (10.14) than being linked (10.12)
ld: warning: object file (/Users/buildslave/jenkins/workspace/lldb-cmake-standalone/clang-build/lib/libclangCodeGen.a(CodeGenTypes.cpp.o)) was built for newer OSX version (10.14) than being linked (10.12)
ld: warning: object file (/Users/buildslave/jenkins/workspace/lldb-cmake-standalone/clang-build/lib/libclangCodeGen.a(CGCall.cpp.o)) was built for newer OSX version (10.14) than being linked (10.12)
ld: warning: object file (/Users/buildslave/jenkins/workspace/lldb-cmake-standalone/clang-build/lib/libclangCodeGen.a(CGObjCRuntime.cpp.o)) was built for newer OSX version (10.14) than being linked (10.12)
ld: warning: object file (/Users/buildslave/jenkins/workspace/lldb-cmake-standalone/clang-build/lib/libclangCodeGen.a(CGExprConstant.cpp.o)) was built for newer OSX version (10.14) than being linked (10.12)
ld: warning: object file (/Users/buildslave/jenkins/workspace/lldb-cmake-standalone/clang-build/lib/libclangCodeGen.a(CGDecl.cpp.o)) was built for newer OSX version (10.14) than being linked (10.12)
ld: warning: object file (/Users/buildslave/jenkins/workspace/lldb-cmake-standalone/clang-build/lib/libclangCodeGen.a(CGException.cpp.o)) was built for newer OSX version (10.14) than being linked (10.12)
ld: warning: object file (/Users/buildslave/jenkins/workspace/lldb-cmake-standalone/clang-build/lib/libclangCodeGen.a(TargetInfo.cpp.o)) was built for newer OSX version (10.14) than being linked (10.12)
ld: warning: object file (/Users/buildslave/jenkins/workspace/lldb-cmake-standalone/clang-build/lib/libclangCodeGen.a(CGDeclCXX.cpp.o)) was built for newer OSX version (10.14) than being linked (10.12)
ld: warning: object file (/Users/buildslave/jenkins/workspace/lldb-cmake-standalone/clang-build/lib/libclangCodeGen.a(CGObjC.cpp.o)) was built for newer OSX version (10.14) than being linked (10.12)
ld: warning: object file (/Users/buildslave/jenkins/workspace/lldb-cmake-standalone/clang-build/lib/libclangCodeGen.a(CGClass.cpp.o)) was built for newer OSX version (10.14) than being linked (10.12)
ld: warning: object file (/Users/buildslave/jenkins/workspace/lldb-cmake-standalone/clang-build/lib/libclangCodeGen.a(CGCXX.cpp.o)) was built for newer OSX version (10.14) than being linked (10.12)
ld: warning: object file (/Users/buildslave/jenkins/workspace/lldb-cmake-standalone/clang-build/lib/libclangCodeGen.a(ItaniumCXXABI.cpp.o)) was built for newer OSX version (10.14) than being linked (10.12)
ld: warning: object file (/Users/buildslave/jenkins/workspace/lldb-cmake-standalone/clang-build/lib/libclangCodeGen.a(CGOpenCLRuntime.cpp.o)) was built for newer OSX version (10.14) than being linked (10.12)
ld: warning: object file (/Users/buildslave/jenkins/workspace/lldb-cmake-standalone/clang-build/lib/libclangCodeGen.a(CGOpenMPRuntime.cpp.o)) was built for newer OSX version (10.14) than being linked (10.12)
ld: warning: object file (/Users/buildslave/jenkins/workspace/lldb-cmake-standalone/clang-build/lib/libclangCodeGen.a(CodeGenFunction.cpp.o)) was built for newer OSX version (10.14) than being linked (10.12)
ld: warning: object file (/Users/buildslave/jenkins/workspace/lldb-cmake-standalone/clang-build/lib/libclangCodeGen.a(CGExpr.cpp.o)) was built for newer OSX version (10.14) than being linked (10.12)
ld: warning: object file (/Users/buildslave/jenkins/workspace/lldb-cmake-standalone/clang-build/lib/libclangCodeGen.a(CGBuiltin.cpp.o)) was built for newer OSX version (10.14) than being linked (10.12)
ld: warning: object file (/Users/buildslave/jenkins/workspace/lldb-cmake-standalone/clang-build/lib/libclangCodeGen.a(CGStmt.cpp.o)) was built for newer OSX version (10.14) than being linked (10.12)
ld: warning: object file (/Users/buildslave/jenkins/workspace/lldb-cmake-standalone/clang-build/lib/libclangCodeGen.a(SanitizerMetadata.cpp.o)) was built for newer OSX version (10.14) than being linked (10.12)
ld: warning: object file (/Users/buildslave/jenkins/workspace/lldb-cmake-standalone/clang-build/lib/libclangCodeGen.a(CGCUDANV.cpp.o)) was built for newer OSX version (10.14) than being linked (10.12)
ld: warning: object file (/Users/buildslave/jenkins/workspace/lldb-cmake-standalone/clang-build/lib/libclangCodeGen.a(CGOpenMPRuntimeNVPTX.cpp.o)) was built for newer OSX version (10.14) than being linked (10.12)
ld: warning: object file (/Users/buildslave/jenkins/workspace/lldb-cmake-standalone/clang-build/lib/libclangCodeGen.a(CGObjCGNU.cpp.o)) was built for newer OSX version (10.14) than being linked (10.12)
ld: warning: object file (/Users/buildslave/jenkins/workspace/lldb-cmake-standalone/clang-build/lib/libclangCodeGen.a(CGObjCMac.cpp.o)) was built for newer OSX version (10.14) than being linked (10.12)
ld: warning: object file (/Users/buildslave/jenkins/workspace/lldb-cmake-standalone/clang-build/lib/libclangCodeGen.a(MicrosoftCXXABI.cpp.o)) was built for newer OSX version (10.14) than being linked (10.12)
ld: warning: object file (/Users/buildslave/jenkins/workspace/lldb-cmake-standalone/clang-build/lib/libclangCodeGen.a(ConstantInitBuilder.cpp.o)) was built for newer OSX version (10.14) than being linked (10.12)
ld: warning: object file (/Users/buildslave/jenkins/workspace/lldb-cmake-standalone/clang-build/lib/libclangCodeGen.a(CoverageMappingGen.cpp.o)) was built for newer OSX version (10.14) than being linked (10.12)
ld: warning: object file (/Users/buildslave/jenkins/workspace/lldb-cmake-standalone/clang-build/lib/libclangCodeGen.a(CGCXXABI.cpp.o)) was built for newer OSX version (10.14) than being linked (10.12)
ld: warning: object file (/Users/buildslave/jenkins/workspace/lldb-cmake-standalone/clang-build/lib/libLLVMTransformUtils.a(CodeExtractor.cpp.o)) was built for newer OSX version (10.14) than being linked (10.12)
ld: warning: object file (/Users/buildslave/jenkins/workspace/lldb-cmake-standalone/clang-build/lib/libLLVMTransformUtils.a(PromoteMemoryToRegister.cpp.o)) was built for newer OSX version (10.14) than being linked (10.12)
ld: warning: object file (/Users/buildslave/jenkins/workspace/lldb-cmake-standalone/clang-build/lib/libLLVMTransformUtils.a(ModuleUtils.cpp.o)) was built for newer OSX version (10.14) than being linked (10.12)
ld: warning: object file (/Users/buildslave/jenkins/workspace/lldb-cmake-standalone/clang-build/lib/libLLVMDebugInfoMSF.a(MSFError.cpp.o)) was built for newer OSX version (10.14) than being linked (10.12)
ld: warning: object file (/Users/buildslave/jenkins/workspace/lldb-cmake-standalone/clang-build/lib/libLLVMDebugInfoPDB.a(NativeTypeUDT.cpp.o)) was built for newer OSX version (10.14) than being linked (10.12)
ld: warning: object file (/Users/buildslave/jenkins/workspace/lldb-cmake-standalone/clang-build/lib/libLLVMDebugInfoPDB.a(NativeTypeEnum.cpp.o)) was built for newer OSX version (10.14) than being linked (10.12)
ld: warning: object file (/Users/buildslave/jenkins/workspace/lldb-cmake-standalone/clang-build/lib/libLLVMDebugInfoPDB.a(NativeEnumTypes.cpp.o)) was built for newer OSX version (10.14) than being linked (10.12)
ld: warning: object file (/Users/buildslave/jenkins/workspace/lldb-cmake-standalone/clang-build/lib/libLLVMDebugInfoPDB.a(NativeRawSymbol.cpp.o)) was built for newer OSX version (10.14) than being linked (10.12)
ld: warning: object file (/Users/buildslave/jenkins/workspace/lldb-cmake-standalone/clang-build/lib/libLLVMDebugInfoPDB.a(NativeTypeArray.cpp.o)) was built for newer OSX version (10.14) than being linked (10.12)
ld: warning: object file (/Users/buildslave/jenkins/workspace/lldb-cmake-standalone/clang-build/lib/libLLVMDebugInfoPDB.a(NativeEnumGlobals.cpp.o)) was built for newer OSX version (10.14) than being linked (10.12)
ld: warning: object file (/Users/buildslave/jenkins/workspace/lldb-cmake-standalone/clang-build/lib/libLLVMDebugInfoPDB.a(NativeEnumModules.cpp.o)) was built for newer OSX version (10.14) than being linked (10.12)
ld: warning: object file (/Users/buildslave/jenkins/workspace/lldb-cmake-standalone/clang-build/lib/libLLVMDebugInfoPDB.a(NativeTypeBuiltin.cpp.o)) was built for newer OSX version (10.14) than being linked (10.12)
ld: warning: object file (/Users/buildslave/jenkins/workspace/lldb-cmake-standalone/clang-build/lib/libLLVMDebugInfoPDB.a(NativeTypePointer.cpp.o)) was built for newer OSX version (10.14) than being linked (10.12)
ld: warning: object file (/Users/buildslave/jenkins/workspace/lldb-cmake-standalone/clang-build/lib/libLLVMDebugInfoPDB.a(NativeTypeTypedef.cpp.o)) was built for newer OSX version (10.14) than being linked (10.12)
ld: warning: object file (/Users/buildslave/jenkins/workspace/lldb-cmake-standalone/clang-build/lib/libLLVMDebugInfoPDB.a(NativeTypeVTShape.cpp.o)) was built for newer OSX version (10.14) than being linked (10.12)
ld: warning: object file (/Users/buildslave/jenkins/workspace/lldb-cmake-standalone/clang-build/lib/libLLVMDebugInfoPDB.a(NativeCompilandSymbol.cpp.o)) was built for newer OSX version (10.14) than being linked (10.12)
ld: warning: object file (/Users/buildslave/jenkins/workspace/lldb-cmake-standalone/clang-build/lib/libLLVMDebugInfoPDB.a(NativeTypeFunctionSig.cpp.o)) was built for newer OSX version (10.14) than being linked (10.12)
ld: warning: object file (/Users/buildslave/jenkins/workspace/lldb-cmake-standalone/clang-build/lib/libLLVMCoverage.a(CoverageMappingWriter.cpp.o)) was built for newer OSX version (10.14) than being linked (10.12)
ld: warning: object file (/Users/buildslave/jenkins/workspace/lldb-cmake-standalone/clang-build/lib/libLLVMCoverage.a(CoverageMapping.cpp.o)) was built for newer OSX version (10.14) than being linked (10.12)
ld: warning: object file (/Users/buildslave/jenkins/workspace/lldb-cmake-standalone/clang-build/lib/libLLVMCoverage.a(CoverageMappingReader.cpp.o)) was built for newer OSX version (10.14) than being linked (10.12)
ld: warning: object file (/Users/buildslave/jenkins/workspace/lldb-cmake-standalone/clang-build/lib/libclangCodeGen.a(CGRecordLayoutBuilder.cpp.o)) was built for newer OSX version (10.14) than being linked (10.12)
ld: warning: object file (/Users/buildslave/jenkins/workspace/lldb-cmake-standalone/clang-build/lib/libclangCodeGen.a(CGCleanup.cpp.o)) was built for newer OSX version (10.14) than being linked (10.12)
ld: warning: object file (/Users/buildslave/jenkins/workspace/lldb-cmake-standalone/clang-build/lib/libclangCodeGen.a(CGCUDARuntime.cpp.o)) was built for newer OSX version (10.14) than being linked (10.12)
ld: warning: object file (/Users/buildslave/jenkins/workspace/lldb-cmake-standalone/clang-build/lib/libclangCodeGen.a(CGBlocks.cpp.o)) was built for newer OSX version (10.14) than being linked (10.12)
ld: warning: object file (/Users/buildslave/jenkins/workspace/lldb-cmake-standalone/clang-build/lib/libclangCodeGen.a(CGLoopInfo.cpp.o)) was built for newer OSX version (10.14) than being linked (10.12)
ld: warning: object file (/Users/buildslave/jenkins/workspace/lldb-cmake-standalone/clang-build/lib/libclangCodeGen.a(CGVTT.cpp.o)) was built for newer OSX version (10.14) than being linked (10.12)
ld: warning: object file (/Users/buildslave/jenkins/workspace/lldb-cmake-standalone/clang-build/lib/libclangCodeGen.a(CGCoroutine.cpp.o)) was built for newer OSX version (10.14) than being linked (10.12)
ld: warning: object file (/Users/buildslave/jenkins/workspace/lldb-cmake-standalone/clang-build/lib/libclangCodeGen.a(CGExprAgg.cpp.o)) was built for newer OSX version (10.14) than being linked (10.12)
ld: warning: object file (/Users/buildslave/jenkins/workspace/lldb-cmake-standalone/clang-build/lib/libclangCodeGen.a(CGStmtOpenMP.cpp.o)) was built for newer OSX version (10.14) than being linked (10.12)
ld: warning: object file (/Users/buildslave/jenkins/workspace/lldb-cmake-standalone/clang-build/lib/libclangCodeGen.a(CGAtomic.cpp.o)) was built for newer OSX version (10.14) than being linked (10.12)
ld: warning: object file (/Users/buildslave/jenkins/workspace/lldb-cmake-standalone/clang-build/lib/libclangCodeGen.a(CGExprCXX.cpp.o)) was built for newer OSX version (10.14) than being linked (10.12)
ld: warning: object file (/Users/buildslave/jenkins/workspace/lldb-cmake-standalone/clang-build/lib/libclangCodeGen.a(CGExprScalar.cpp.o)) was built for newer OSX version (10.14) than being linked (10.12)
ld: warning: object file (/Users/buildslave/jenkins/workspace/lldb-cmake-standalone/clang-build/lib/libclangCodeGen.a(CGExprComplex.cpp.o)) was built for newer OSX version (10.14) than being linked (10.12)
ld: warning: object file (/Users/buildslave/jenkins/workspace/lldb-cmake-standalone/clang-build/lib/libclangCodeGen.a(CGNonTrivialStruct.cpp.o)) was built for newer OSX version (10.14) than being linked (10.12)
ld: warning: object file (/Users/buildslave/jenkins/workspace/lldb-cmake-standalone/clang-build/lib/libclangCodeGen.a(CGGPUBuiltin.cpp.o)) was built for newer OSX version (10.14) than being linked (10.12)
ld: warning: object file (/Users/buildslave/jenkins/workspace/lldb-cmake-standalone/clang-build/lib/libclangCodeGen.a(VarBypassDetector.cpp.o)) was built for newer OSX version (10.14) than being linked (10.12)
ld: warning: object file (/Users/buildslave/jenkins/workspace/lldb-cmake-standalone/clang-build/lib/libclangCodeGen.a(PatternInit.cpp.o)) was built for newer OSX version (10.14) than being linked (10.12)
ld: warning: object file (/Users/buildslave/jenkins/workspace/lldb-cmake-standalone/clang-build/lib/libclangCodeGen.a(SwiftCallingConv.cpp.o)) was built for newer OSX version (10.14) than being linked (10.12)
ld: warning: object file (/Users/buildslave/jenkins/workspace/lldb-cmake-standalone/clang-build/lib/libLLVMRuntimeDyld.a(RuntimeDyldELFMips.cpp.o)) was built for newer OSX version (10.14) than being linked (10.12)
ld: warning: object file (/Users/buildslave/jenkins/workspace/lldb-cmake-standalone/clang-build/lib/libLLVMTransformUtils.a(AMDGPUEmitPrintf.cpp.o)) was built for newer OSX version (10.14) than being linked (10.12)
ld: warning: object file (/Users/buildslave/jenkins/workspace/lldb-cmake-standalone/clang-build/lib/libLLVMDebugInfoPDB.a(NativeSymbolEnumerator.cpp.o)) was built for newer OSX version (10.14) than being linked (10.12)
ld: warning: object file (/Users/buildslave/jenkins/workspace/lldb-cmake-standalone/clang-build/lib/libclangAST.a(VTTBuilder.cpp.o)) was built for newer OSX version (10.14) than being linked (10.12)
Showing first 200 warnings only

Hide Details

PhaseScriptExecution CMake\ PostBuild\ Rules /Users/buildslave/jenkins/workspace/lldb-cmake-standalone/lldb-xcode-build/unittests/UnwindAssembly/x86/lldb.build/Release/UnwindAssemblyx86Tests.build/Script-812C29107D0F4D7EA95E2293.sh cd /Users/buildslave/jenkins/workspace/lldb-cmake-standalone/llvm-project/lldb /bin/sh -c /Users/buildslave/jenkins/workspace/lldb-cmake-standalone/lldb-xcode-build/unittests/UnwindAssembly/x86/lldb.build/Release/UnwindAssemblyx86Tests.build/Script-812C29107D0F4D7EA95E2293.sh /usr/local/Cellar/cmake/3.12.3/bin/cmake -E make_directory /Users/buildslave/jenkins/workspace/lldb-cmake-standalone/lldb-xcode-build/unittests/UnwindAssembly/x86/Release/Inputs

Hide Details

=== BUILD TARGET UtilityTests OF PROJECT lldb WITH CONFIGURATION Release ===

Hide Details

Check dependencies

Hide Details

Write auxiliary files write-file /Users/buildslave/jenkins/workspace/lldb-cmake-standalone/lldb-xcode-build/unittests/Utility/lldb.build/Release/UtilityTests.build/Script-A8F7A259282B42EE8455A97C.sh chmod 0755 /Users/buildslave/jenkins/workspace/lldb-cmake-standalone/lldb-xcode-build/unittests/Utility/lldb.build/Release/UtilityTests.build/Script-A8F7A259282B42EE8455A97C.sh

Hide Details

Ld /Users/buildslave/jenkins/workspace/lldb-cmake-standalone/lldb-xcode-build/unittests/Utility/Release/UtilityTests normal x86_64 cd /Users/buildslave/jenkins/workspace/lldb-cmake-standalone/llvm-project/lldb export MACOSX_DEPLOYMENT_TARGET=10.12 /Applications/Xcode.app/Contents/Developer/Toolchains/XcodeDefault.xctoolchain/usr/bin/clang++ -arch x86_64 -isysroot /Applications/Xcode.app/Contents/Developer/Platforms/MacOSX.platform/Developer/SDKs/MacOSX10.14.sdk -L/Users/buildslave/jenkins/workspace/lldb-cmake-standalone/lldb-xcode-build/unittests/Utility/Release -F/Users/buildslave/jenkins/workspace/lldb-cmake-standalone/lldb-xcode-build/unittests/Utility/Release -filelist /Users/buildslave/jenkins/workspace/lldb-cmake-standalone/lldb-xcode-build/unittests/Utility/lldb.build/Release/UtilityTests.build/Objects-normal/x86_64/UtilityTests.LinkFileList -mmacosx-version-min=10.12 -Wl,-dead_strip -Wl,-search_paths_first -Wl,-headerpad_max_install_names /Users/buildslave/jenkins/workspace/lldb-cmake-standalone/clang-build/lib/libLLVMSupport.a /Users/buildslave/jenkins/workspace/lldb-cmake-standalone/clang-build/lib/libLLVMSupport.a /Users/buildslave/jenkins/workspace/lldb-cmake-standalone/clang-build/lib/libgtest_main.a /Users/buildslave/jenkins/workspace/lldb-cmake-standalone/clang-build/lib/libgtest.a /Users/buildslave/jenkins/workspace/lldb-cmake-standalone/lldb-xcode-build/Release/lib/liblldbUtility.a /Users/buildslave/jenkins/workspace/lldb-cmake-standalone/lldb-xcode-build/Release/lib/liblldbUtilityHelpers.a /Users/buildslave/jenkins/workspace/lldb-cmake-standalone/clang-build/lib/libLLVMTestingSupport.a /Users/buildslave/jenkins/workspace/lldb-cmake-standalone/lldb-xcode-build/Release/lib/liblldbUtility.a /usr/lib/libxml2.dylib -framework Foundation -framework CoreFoundation -framework CoreServices -framework Security /Users/buildslave/jenkins/workspace/lldb-cmake-standalone/lldb-xcode-build/Release/lib/liblldbSymbolHelpers.a /Users/buildslave/jenkins/workspace/lldb-cmake-standalone/clang-build/lib/libLLVMObjectYAML.a /Users/buildslave/jenkins/workspace/lldb-cmake-standalone/clang-build/lib/libLLVMObject.a /Users/buildslave/jenkins/workspace/lldb-cmake-standalone/clang-build/lib/libLLVMBitReader.a /Users/buildslave/jenkins/workspace/lldb-cmake-standalone/clang-build/lib/libLLVMCore.a /Users/buildslave/jenkins/workspace/lldb-cmake-standalone/clang-build/lib/libLLVMRemarks.a /Users/buildslave/jenkins/workspace/lldb-cmake-standalone/clang-build/lib/libLLVMBitstreamReader.a /Users/buildslave/jenkins/workspace/lldb-cmake-standalone/clang-build/lib/libLLVMMCParser.a /Users/buildslave/jenkins/workspace/lldb-cmake-standalone/clang-build/lib/libLLVMMC.a /Users/buildslave/jenkins/workspace/lldb-cmake-standalone/clang-build/lib/libLLVMDebugInfoCodeView.a /Users/buildslave/jenkins/workspace/lldb-cmake-standalone/clang-build/lib/libLLVMDebugInfoMSF.a /Users/buildslave/jenkins/workspace/lldb-cmake-standalone/clang-build/lib/libLLVMTextAPI.a /Users/buildslave/jenkins/workspace/lldb-cmake-standalone/clang-build/lib/libLLVMBinaryFormat.a /Users/buildslave/jenkins/workspace/lldb-cmake-standalone/clang-build/lib/libgtest.a /Users/buildslave/jenkins/workspace/lldb-cmake-standalone/clang-build/lib/libLLVMSupport.a /usr/lib/libz.dylib -lcurses -lm /Users/buildslave/jenkins/workspace/lldb-cmake-standalone/clang-build/lib/libLLVMDemangle.a -lpthread -Xlinker -dependency_info -Xlinker /Users/buildslave/jenkins/workspace/lldb-cmake-standalone/lldb-xcode-build/unittests/Utility/lldb.build/Release/UtilityTests.build/Objects-normal/x86_64/UtilityTests_dependency_info.dat -o /Users/buildslave/jenkins/workspace/lldb-cmake-standalone/lldb-xcode-build/unittests/Utility/Release/UtilityTests ld: warning: object file (/Users/buildslave/jenkins/workspace/lldb-cmake-standalone/clang-build/lib/libLLVMSupport.a(APFloat.cpp.o)) was built for newer OSX version (10.14) than being linked (10.12) ld: warning: object file (/Users/buildslave/jenkins/workspace/lldb-cmake-standalone/clang-build/lib/libLLVMSupport.a(Error.cpp.o)) was built for newer OSX version (10.14) than being linked (10.12) ld: warning: object file (/Users/buildslave/jenkins/workspace/lldb-cmake-standalone/clang-build/lib/libLLVMSupport.a(raw_ostream.cpp.o)) was built for newer OSX version (10.14) than being linked (10.12) ld: warning: object file (/Users/buildslave/jenkins/workspace/lldb-cmake-standalone/clang-build/lib/libLLVMSupport.a(Threading.cpp.o)) was built for newer OSX version (10.14) than being linked (10.12) ld: warning: object file (/Users/buildslave/jenkins/workspace/lldb-cmake-standalone/clang-build/lib/libLLVMSupport.a(StringMap.cpp.o)) was built for newer OSX version (10.14) than being linked (10.12) ld: warning: object file (/Users/buildslave/jenkins/workspace/lldb-cmake-standalone/clang-build/lib/libLLVMSupport.a(ManagedStatic.cpp.o)) was built for newer OSX version (10.14) than being linked (10.12) ld: warning: object file (/Users/buildslave/jenkins/workspace/lldb-cmake-standalone/clang-build/lib/libLLVMSupport.a(NativeFormatting.cpp.o)) was built for newer OSX version (10.14) than being linked (10.12) ld: warning: object file (/Users/buildslave/jenkins/workspace/lldb-cmake-standalone/clang-build/lib/libLLVMSupport.a(raw_os_ostream.cpp.o)) was built for newer OSX version (10.14) than being linked (10.12) ld: warning: object file (/Users/buildslave/jenkins/workspace/lldb-cmake-standalone/clang-build/lib/libLLVMSupport.a(SmallVector.cpp.o)) was built for newer OSX version (10.14) than being linked (10.12) ld: warning: object file (/Users/buildslave/jenkins/workspace/lldb-cmake-standalone/clang-build/lib/libLLVMSupport.a(FormatVariadic.cpp.o)) was built for newer OSX version (10.14) than being linked (10.12) ld: warning: object file (/Users/buildslave/jenkins/workspace/lldb-cmake-standalone/clang-build/lib/libLLVMSupport.a(StringRef.cpp.o)) was built for newer OSX version (10.14) than being linked (10.12) ld: warning: object file (/Users/buildslave/jenkins/workspace/lldb-cmake-standalone/clang-build/lib/libLLVMSupport.a(ErrorHandling.cpp.o)) was built for newer OSX version (10.14) than being linked (10.12) ld: warning: object file (/Users/buildslave/jenkins/workspace/lldb-cmake-standalone/clang-build/lib/libLLVMSupport.a(ABIBreak.cpp.o)) was built for newer OSX version (10.14) than being linked (10.12) ld: warning: object file (/Users/buildslave/jenkins/workspace/lldb-cmake-standalone/clang-build/lib/libLLVMSupport.a(APInt.cpp.o)) was built for newer OSX version (10.14) than being linked (10.12) ld: warning: object file (/Users/buildslave/jenkins/workspace/lldb-cmake-standalone/clang-build/lib/libLLVMSupport.a(Regex.cpp.o)) was built for newer OSX version (10.14) than being linked (10.12) ld: warning: object file (/Users/buildslave/jenkins/workspace/lldb-cmake-standalone/clang-build/lib/libLLVMSupport.a(Chrono.cpp.o)) was built for newer OSX version (10.14) than being linked (10.12) ld: warning: object file (/Users/buildslave/jenkins/workspace/lldb-cmake-standalone/clang-build/lib/libLLVMTestingSupport.a(Error.cpp.o)) was built for newer OSX version (10.14) than being linked (10.12) ld: warning: object file (/Users/buildslave/jenkins/workspace/lldb-cmake-standalone/clang-build/lib/libLLVMSupport.a(Optional.cpp.o)) was built for newer OSX version (10.14) than being linked (10.12) ld: warning: object file (/Users/buildslave/jenkins/workspace/lldb-cmake-standalone/clang-build/lib/libgtest.a(gmock-all.cc.o)) was built for newer OSX version (10.14) than being linked (10.12) ld: warning: object file (/Users/buildslave/jenkins/workspace/lldb-cmake-standalone/clang-build/lib/libgtest.a(gtest-all.cc.o)) was built for newer OSX version (10.14) than being linked (10.12) ld: warning: object file (/Users/buildslave/jenkins/workspace/lldb-cmake-standalone/clang-build/lib/libLLVMSupport.a(Twine.cpp.o)) was built for newer OSX version (10.14) than being linked (10.12) ld: warning: object file (/Users/buildslave/jenkins/workspace/lldb-cmake-standalone/clang-build/lib/libLLVMSupport.a(Triple.cpp.o)) was built for newer OSX version (10.14) than being linked (10.12) ld: warning: object file (/Users/buildslave/jenkins/workspace/lldb-cmake-standalone/clang-build/lib/libgtest_main.a(TestMain.cpp.o)) was built for newer OSX version (10.14) than being linked (10.12) ld: warning: object file (/Users/buildslave/jenkins/workspace/lldb-cmake-standalone/clang-build/lib/libLLVMSupport.a(MemoryBuffer.cpp.o)) was built for newer OSX version (10.14) than being linked (10.12) ld: warning: object file (/Users/buildslave/jenkins/workspace/lldb-cmake-standalone/clang-build/lib/libLLVMSupport.a(FoldingSet.cpp.o)) was built for newer OSX version (10.14) than being linked (10.12) ld: warning: object file (/Users/buildslave/jenkins/workspace/lldb-cmake-standalone/clang-build/lib/libLLVMSupport.a(Debug.cpp.o)) was built for newer OSX version (10.14) than being linked (10.12) ld: warning: object file (/Users/buildslave/jenkins/workspace/lldb-cmake-standalone/clang-build/lib/libLLVMSupport.a(CommandLine.cpp.o)) was built for newer OSX version (10.14) than being linked (10.12) ld: warning: object file (/Users/buildslave/jenkins/workspace/lldb-cmake-standalone/clang-build/lib/libLLVMSupport.a(ARMTargetParser.cpp.o)) was built for newer OSX version (10.14) than being linked (10.12) ld: warning: object file (/Users/buildslave/jenkins/workspace/lldb-cmake-standalone/clang-build/lib/libLLVMSupport.a(MD5.cpp.o)) was built for newer OSX version (10.14) than being linked (10.12) ld: warning: object file (/Users/buildslave/jenkins/workspace/lldb-cmake-standalone/clang-build/lib/libLLVMSupport.a(Signals.cpp.o)) was built for newer OSX version (10.14) than being linked (10.12) ld: warning: object file (/Users/buildslave/jenkins/workspace/lldb-cmake-standalone/clang-build/lib/libLLVMSupport.a(Program.cpp.o)) was built for newer OSX version (10.14) than being linked (10.12) ld: warning: object file (/Users/buildslave/jenkins/workspace/lldb-cmake-standalone/clang-build/lib/libLLVMSupport.a(Host.cpp.o)) was built for newer OSX version (10.14) than being linked (10.12) ld: warning: object file (/Users/buildslave/jenkins/workspace/lldb-cmake-standalone/clang-build/lib/libLLVMSupport.a(Path.cpp.o)) was built for newer OSX version (10.14) than being linked (10.12) ld: warning: object file (/Users/buildslave/jenkins/workspace/lldb-cmake-standalone/clang-build/lib/libLLVMSupport.a(Process.cpp.o)) was built for newer OSX version (10.14) than being linked (10.12) ld: warning: object file (/Users/buildslave/jenkins/workspace/lldb-cmake-standalone/clang-build/lib/libLLVMSupport.a(Errno.cpp.o)) was built for newer OSX version (10.14) than being linked (10.12) ld: warning: object file (/Users/buildslave/jenkins/workspace/lldb-cmake-standalone/clang-build/lib/libLLVMSupport.a(JSON.cpp.o)) was built for newer OSX version (10.14) than being linked (10.12) ld: warning: object file (/Users/buildslave/jenkins/workspace/lldb-cmake-standalone/clang-build/lib/libLLVMObjectYAML.a(yaml2obj.cpp.o)) was built for newer OSX version (10.14) than being linked (10.12) ld: warning: object file (/Users/buildslave/jenkins/workspace/lldb-cmake-standalone/clang-build/lib/libLLVMSupport.a(YAMLTraits.cpp.o)) was built for newer OSX version (10.14) than being linked (10.12) ld: warning: object file (/Users/buildslave/jenkins/workspace/lldb-cmake-standalone/clang-build/lib/libLLVMSupport.a(Hashing.cpp.o)) was built for newer OSX version (10.14) than being linked (10.12) ld: warning: object file (/Users/buildslave/jenkins/workspace/lldb-cmake-standalone/clang-build/lib/libLLVMSupport.a(regcomp.c.o)) was built for newer OSX version (10.14) than being linked (10.12) ld: warning: object file (/Users/buildslave/jenkins/workspace/lldb-cmake-standalone/clang-build/lib/libLLVMSupport.a(regerror.c.o)) was built for newer OSX version (10.14) than being linked (10.12) ld: warning: object file (/Users/buildslave/jenkins/workspace/lldb-cmake-standalone/clang-build/lib/libLLVMSupport.a(regexec.c.o)) was built for newer OSX version (10.14) than being linked (10.12) ld: warning: object file (/Users/buildslave/jenkins/workspace/lldb-cmake-standalone/clang-build/lib/libLLVMSupport.a(regfree.c.o)) was built for newer OSX version (10.14) than being linked (10.12) ld: warning: object file (/Users/buildslave/jenkins/workspace/lldb-cmake-standalone/clang-build/lib/libLLVMSupport.a(StringExtras.cpp.o)) was built for newer OSX version (10.14) than being linked (10.12) ld: warning: object file (/Users/buildslave/jenkins/workspace/lldb-cmake-standalone/clang-build/lib/libLLVMSupport.a(StringSaver.cpp.o)) was built for newer OSX version (10.14) than being linked (10.12) ld: warning: object file (/Users/buildslave/jenkins/workspace/lldb-cmake-standalone/clang-build/lib/libLLVMSupport.a(LineIterator.cpp.o)) was built for newer OSX version (10.14) than being linked (10.12) ld: warning: object file (/Users/buildslave/jenkins/workspace/lldb-cmake-standalone/clang-build/lib/libLLVMDemangle.a(ItaniumDemangle.cpp.o)) was built for newer OSX version (10.14) than being linked (10.12) ld: warning: object file (/Users/buildslave/jenkins/workspace/lldb-cmake-standalone/clang-build/lib/libLLVMSupport.a(ConvertUTF.cpp.o)) was built for newer OSX version (10.14) than being linked (10.12) ld: warning: object file (/Users/buildslave/jenkins/workspace/lldb-cmake-standalone/clang-build/lib/libLLVMSupport.a(SmallPtrSet.cpp.o)) was built for newer OSX version (10.14) than being linked (10.12) ld: warning: object file (/Users/buildslave/jenkins/workspace/lldb-cmake-standalone/clang-build/lib/libLLVMSupport.a(CrashRecoveryContext.cpp.o)) was built for newer OSX version (10.14) than being linked (10.12) ld: warning: object file (/Users/buildslave/jenkins/workspace/lldb-cmake-standalone/clang-build/lib/libLLVMSupport.a(circular_raw_ostream.cpp.o)) was built for newer OSX version (10.14) than being linked (10.12) ld: warning: object file (/Users/buildslave/jenkins/workspace/lldb-cmake-standalone/clang-build/lib/libLLVMSupport.a(ConvertUTFWrapper.cpp.o)) was built for newer OSX version (10.14) than being linked (10.12) ld: warning: object file (/Users/buildslave/jenkins/workspace/lldb-cmake-standalone/clang-build/lib/libLLVMSupport.a(VirtualFileSystem.cpp.o)) was built for newer OSX version (10.14) than being linked (10.12) ld: warning: object file (/Users/buildslave/jenkins/workspace/lldb-cmake-standalone/clang-build/lib/libLLVMObjectYAML.a(MachOEmitter.cpp.o)) was built for newer OSX version (10.14) than being linked (10.12) ld: warning: object file (/Users/buildslave/jenkins/workspace/lldb-cmake-standalone/clang-build/lib/libLLVMSupport.a(YAMLParser.cpp.o)) was built for newer OSX version (10.14) than being linked (10.12) ld: warning: object file (/Users/buildslave/jenkins/workspace/lldb-cmake-standalone/clang-build/lib/libLLVMObjectYAML.a(ObjectYAML.cpp.o)) was built for newer OSX version (10.14) than being linked (10.12) ld: warning: object file (/Users/buildslave/jenkins/workspace/lldb-cmake-standalone/clang-build/lib/libLLVMObjectYAML.a(MinidumpEmitter.cpp.o)) was built for newer OSX version (10.14) than being linked (10.12) ld: warning: object file (/Users/buildslave/jenkins/workspace/lldb-cmake-standalone/clang-build/lib/libLLVMObjectYAML.a(ELFEmitter.cpp.o)) was built for newer OSX version (10.14) than being linked (10.12) ld: warning: object file (/Users/buildslave/jenkins/workspace/lldb-cmake-standalone/clang-build/lib/libLLVMObjectYAML.a(COFFEmitter.cpp.o)) was built for newer OSX version (10.14) than being linked (10.12) ld: warning: object file (/Users/buildslave/jenkins/workspace/lldb-cmake-standalone/clang-build/lib/libLLVMObjectYAML.a(WasmEmitter.cpp.o)) was built for newer OSX version (10.14) than being linked (10.12) ld: warning: object file (/Users/buildslave/jenkins/workspace/lldb-cmake-standalone/clang-build/lib/libLLVMObject.a(ObjectFile.cpp.o)) was built for newer OSX version (10.14) than being linked (10.12) ld: warning: object file (/Users/buildslave/jenkins/workspace/lldb-cmake-standalone/clang-build/lib/libLLVMSupport.a(SourceMgr.cpp.o)) was built for newer OSX version (10.14) than being linked (10.12) ld: warning: object file (/Users/buildslave/jenkins/workspace/lldb-cmake-standalone/clang-build/lib/libLLVMSupport.a(regstrlcpy.c.o)) was built for newer OSX version (10.14) than being linked (10.12) ld: warning: object file (/Users/buildslave/jenkins/workspace/lldb-cmake-standalone/clang-build/lib/libLLVMObjectYAML.a(CodeViewYAMLDebugSections.cpp.o)) was built for newer OSX version (10.14) than being linked (10.12) ld: warning: object file (/Users/buildslave/jenkins/workspace/lldb-cmake-standalone/clang-build/lib/libLLVMObjectYAML.a(CodeViewYAMLTypeHashing.cpp.o)) was built for newer OSX version (10.14) than being linked (10.12) ld: warning: object file (/Users/buildslave/jenkins/workspace/lldb-cmake-standalone/clang-build/lib/libLLVMObjectYAML.a(CodeViewYAMLTypes.cpp.o)) was built for newer OSX version (10.14) than being linked (10.12) ld: warning: object file (/Users/buildslave/jenkins/workspace/lldb-cmake-standalone/clang-build/lib/libLLVMBinaryFormat.a(Magic.cpp.o)) was built for newer OSX version (10.14) than being linked (10.12) ld: warning: object file (/Users/buildslave/jenkins/workspace/lldb-cmake-standalone/clang-build/lib/libLLVMSupport.a(BinaryStreamWriter.cpp.o)) was built for newer OSX version (10.14) than being linked (10.12) ld: warning: object file (/Users/buildslave/jenkins/workspace/lldb-cmake-standalone/clang-build/lib/libLLVMMC.a(StringTableBuilder.cpp.o)) was built for newer OSX version (10.14) than being linked (10.12) ld: warning: object file (/Users/buildslave/jenkins/workspace/lldb-cmake-standalone/clang-build/lib/libLLVMSupport.a(ThreadLocal.cpp.o)) was built for newer OSX version (10.14) than being linked (10.12) ld: warning: object file (/Users/buildslave/jenkins/workspace/lldb-cmake-standalone/clang-build/lib/libLLVMSupport.a(Locale.cpp.o)) was built for newer OSX version (10.14) than being linked (10.12) ld: warning: object file (/Users/buildslave/jenkins/workspace/lldb-cmake-standalone/clang-build/lib/libLLVMSupport.a(Unicode.cpp.o)) was built for newer OSX version (10.14) than being linked (10.12) ld: warning: object file (/Users/buildslave/jenkins/workspace/lldb-cmake-standalone/clang-build/lib/libLLVMObjectYAML.a(MinidumpYAML.cpp.o)) was built for newer OSX version (10.14) than being linked (10.12) ld: warning: object file (/Users/buildslave/jenkins/workspace/lldb-cmake-standalone/clang-build/lib/libLLVMObjectYAML.a(ELFYAML.cpp.o)) was built for newer OSX version (10.14) than being linked (10.12) ld: warning: object file (/Users/buildslave/jenkins/workspace/lldb-cmake-standalone/clang-build/lib/libLLVMObjectYAML.a(COFFYAML.cpp.o)) was built for newer OSX version (10.14) than being linked (10.12) ld: warning: object file (/Users/buildslave/jenkins/workspace/lldb-cmake-standalone/clang-build/lib/libLLVMObjectYAML.a(WasmYAML.cpp.o)) was built for newer OSX version (10.14) than being linked (10.12) ld: warning: object file (/Users/buildslave/jenkins/workspace/lldb-cmake-standalone/clang-build/lib/libLLVMObjectYAML.a(MachOYAML.cpp.o)) was built for newer OSX version (10.14) than being linked (10.12) ld: warning: object file (/Users/buildslave/jenkins/workspace/lldb-cmake-standalone/clang-build/lib/libLLVMObject.a(ELFObjectFile.cpp.o)) was built for newer OSX version (10.14) than being linked (10.12) ld: warning: object file (/Users/buildslave/jenkins/workspace/lldb-cmake-standalone/clang-build/lib/libLLVMObject.a(COFFObjectFile.cpp.o)) was built for newer OSX version (10.14) than being linked (10.12) ld: warning: object file (/Users/buildslave/jenkins/workspace/lldb-cmake-standalone/clang-build/lib/libLLVMObject.a(WasmObjectFile.cpp.o)) was built for newer OSX version (10.14) than being linked (10.12) ld: warning: object file (/Users/buildslave/jenkins/workspace/lldb-cmake-standalone/clang-build/lib/libLLVMObject.a(MachOObjectFile.cpp.o)) was built for newer OSX version (10.14) than being linked (10.12) ld: warning: object file (/Users/buildslave/jenkins/workspace/lldb-cmake-standalone/clang-build/lib/libLLVMObject.a(XCOFFObjectFile.cpp.o)) was built for newer OSX version (10.14) than being linked (10.12) ld: warning: object file (/Users/buildslave/jenkins/workspace/lldb-cmake-standalone/clang-build/lib/libLLVMObject.a(SymbolicFile.cpp.o)) was built for newer OSX version (10.14) than being linked (10.12) ld: warning: object file (/Users/buildslave/jenkins/workspace/lldb-cmake-standalone/clang-build/lib/libLLVMObject.a(Error.cpp.o)) was built for newer OSX version (10.14) than being linked (10.12) ld: warning: object file (/Users/buildslave/jenkins/workspace/lldb-cmake-standalone/clang-build/lib/libLLVMDebugInfoCodeView.a(DebugSubsectionRecord.cpp.o)) was built for newer OSX version (10.14) than being linked (10.12) ld: warning: object file (/Users/buildslave/jenkins/workspace/lldb-cmake-standalone/clang-build/lib/libLLVMObjectYAML.a(DWARFEmitter.cpp.o)) was built for newer OSX version (10.14) than being linked (10.12) ld: warning: object file (/Users/buildslave/jenkins/workspace/lldb-cmake-standalone/clang-build/lib/libLLVMSupport.a(WithColor.cpp.o)) was built for newer OSX version (10.14) than being linked (10.12) ld: warning: object file (/Users/buildslave/jenkins/workspace/lldb-cmake-standalone/clang-build/lib/libLLVMObjectYAML.a(YAML.cpp.o)) was built for newer OSX version (10.14) than being linked (10.12) ld: warning: object file (/Users/buildslave/jenkins/workspace/lldb-cmake-standalone/clang-build/lib/libLLVMObjectYAML.a(CodeViewYAMLSymbols.cpp.o)) was built for newer OSX version (10.14) than being linked (10.12) ld: warning: object file (/Users/buildslave/jenkins/workspace/lldb-cmake-standalone/clang-build/lib/libLLVMSupport.a(TargetRegistry.cpp.o)) was built for newer OSX version (10.14) than being linked (10.12) ld: warning: object file (/Users/buildslave/jenkins/workspace/lldb-cmake-standalone/clang-build/lib/libLLVMSupport.a(LEB128.cpp.o)) was built for newer OSX version (10.14) than being linked (10.12) ld: warning: object file (/Users/buildslave/jenkins/workspace/lldb-cmake-standalone/clang-build/lib/libLLVMSupport.a(BinaryStreamError.cpp.o)) was built for newer OSX version (10.14) than being linked (10.12) ld: warning: object file (/Users/buildslave/jenkins/workspace/lldb-cmake-standalone/clang-build/lib/libLLVMMC.a(SubtargetFeature.cpp.o)) was built for newer OSX version (10.14) than being linked (10.12) ld: warning: object file (/Users/buildslave/jenkins/workspace/lldb-cmake-standalone/clang-build/lib/libLLVMSupport.a(ARMAttributeParser.cpp.o)) was built for newer OSX version (10.14) than being linked (10.12) ld: warning: object file (/Users/buildslave/jenkins/workspace/lldb-cmake-standalone/clang-build/lib/libLLVMSupport.a(BinaryStreamReader.cpp.o)) was built for newer OSX version (10.14) than being linked (10.12) ld: warning: object file (/Users/buildslave/jenkins/workspace/lldb-cmake-standalone/clang-build/lib/libLLVMDebugInfoCodeView.a(DebugChecksumsSubsection.cpp.o)) was built for newer OSX version (10.14) than being linked (10.12) ld: warning: object file (/Users/buildslave/jenkins/workspace/lldb-cmake-standalone/clang-build/lib/libLLVMDebugInfoCodeView.a(DebugInlineeLinesSubsection.cpp.o)) was built for newer OSX version (10.14) than being linked (10.12) ld: warning: object file (/Users/buildslave/jenkins/workspace/lldb-cmake-standalone/clang-build/lib/libLLVMDebugInfoCodeView.a(DebugCrossImpSubsection.cpp.o)) was built for newer OSX version (10.14) than being linked (10.12) ld: warning: object file (/Users/buildslave/jenkins/workspace/lldb-cmake-standalone/clang-build/lib/libLLVMSupport.a(BinaryStreamRef.cpp.o)) was built for newer OSX version (10.14) than being linked (10.12) ld: warning: object file (/Users/buildslave/jenkins/workspace/lldb-cmake-standalone/clang-build/lib/libLLVMBinaryFormat.a(Wasm.cpp.o)) was built for newer OSX version (10.14) than being linked (10.12) ld: warning: object file (/Users/buildslave/jenkins/workspace/lldb-cmake-standalone/clang-build/lib/libLLVMObjectYAML.a(DWARFYAML.cpp.o)) was built for newer OSX version (10.14) than being linked (10.12) ld: warning: object file (/Users/buildslave/jenkins/workspace/lldb-cmake-standalone/clang-build/lib/libLLVMSupport.a(APSInt.cpp.o)) was built for newer OSX version (10.14) than being linked (10.12) ld: warning: object file (/Users/buildslave/jenkins/workspace/lldb-cmake-standalone/clang-build/lib/libLLVMObject.a(IRObjectFile.cpp.o)) was built for newer OSX version (10.14) than being linked (10.12) ld: warning: object file (/Users/buildslave/jenkins/workspace/lldb-cmake-standalone/clang-build/lib/libLLVMObject.a(Minidump.cpp.o)) was built for newer OSX version (10.14) than being linked (10.12) ld: warning: object file (/Users/buildslave/jenkins/workspace/lldb-cmake-standalone/clang-build/lib/libLLVMObject.a(ELF.cpp.o)) was built for newer OSX version (10.14) than being linked (10.12) ld: warning: object file (/Users/buildslave/jenkins/workspace/lldb-cmake-standalone/clang-build/lib/libLLVMObject.a(Binary.cpp.o)) was built for newer OSX version (10.14) than being linked (10.12) ld: warning: object file (/Users/buildslave/jenkins/workspace/lldb-cmake-standalone/clang-build/lib/libLLVMDebugInfoCodeView.a(CodeViewError.cpp.o)) was built for newer OSX version (10.14) than being linked (10.12) ld: warning: object file (/Users/buildslave/jenkins/workspace/lldb-cmake-standalone/clang-build/lib/libLLVMDebugInfoCodeView.a(DebugSubsection.cpp.o)) was built for newer OSX version (10.14) than being linked (10.12) ld: warning: object file (/Users/buildslave/jenkins/workspace/lldb-cmake-standalone/clang-build/lib/libLLVMDebugInfoCodeView.a(TypeRecordMapping.cpp.o)) was built for newer OSX version (10.14) than being linked (10.12) ld: warning: object file (/Users/buildslave/jenkins/workspace/lldb-cmake-standalone/clang-build/lib/libLLVMDebugInfoCodeView.a(DebugLinesSubsection.cpp.o)) was built for newer OSX version (10.14) than being linked (10.12) ld: warning: object file (/Users/buildslave/jenkins/workspace/lldb-cmake-standalone/clang-build/lib/libLLVMDebugInfoCodeView.a(SimpleTypeSerializer.cpp.o)) was built for newer OSX version (10.14) than being linked (10.12) ld: warning: object file (/Users/buildslave/jenkins/workspace/lldb-cmake-standalone/clang-build/lib/libLLVMDebugInfoCodeView.a(DebugSubsectionVisitor.cpp.o)) was built for newer OSX version (10.14) than being linked (10.12) ld: warning: object file (/Users/buildslave/jenkins/workspace/lldb-cmake-standalone/clang-build/lib/libLLVMDebugInfoCodeView.a(DebugSymbolsSubsection.cpp.o)) was built for newer OSX version (10.14) than being linked (10.12) ld: warning: object file (/Users/buildslave/jenkins/workspace/lldb-cmake-standalone/clang-build/lib/libLLVMDebugInfoCodeView.a(CVTypeVisitor.cpp.o)) was built for newer OSX version (10.14) than being linked (10.12) ld: warning: object file (/Users/buildslave/jenkins/workspace/lldb-cmake-standalone/clang-build/lib/libLLVMDebugInfoCodeView.a(DebugFrameDataSubsection.cpp.o)) was built for newer OSX version (10.14) than being linked (10.12) ld: warning: object file (/Users/buildslave/jenkins/workspace/lldb-cmake-standalone/clang-build/lib/libLLVMDebugInfoCodeView.a(DebugSymbolRVASubsection.cpp.o)) was built for newer OSX version (10.14) than being linked (10.12) ld: warning: object file (/Users/buildslave/jenkins/workspace/lldb-cmake-standalone/clang-build/lib/libLLVMDebugInfoCodeView.a(AppendingTypeTableBuilder.cpp.o)) was built for newer OSX version (10.14) than being linked (10.12) ld: warning: object file (/Users/buildslave/jenkins/workspace/lldb-cmake-standalone/clang-build/lib/libLLVMDebugInfoCodeView.a(ContinuationRecordBuilder.cpp.o)) was built for newer OSX version (10.14) than being linked (10.12) ld: warning: object file (/Users/buildslave/jenkins/workspace/lldb-cmake-standalone/clang-build/lib/libLLVMDebugInfoCodeView.a(DebugStringTableSubsection.cpp.o)) was built for newer OSX version (10.14) than being linked (10.12) ld: warning: object file (/Users/buildslave/jenkins/workspace/lldb-cmake-standalone/clang-build/lib/libLLVMDebugInfoCodeView.a(DebugCrossExSubsection.cpp.o)) was built for newer OSX version (10.14) than being linked (10.12) ld: warning: object file (/Users/buildslave/jenkins/workspace/lldb-cmake-standalone/clang-build/lib/libLLVMDebugInfoCodeView.a(Line.cpp.o)) was built for newer OSX version (10.14) than being linked (10.12) ld: warning: object file (/Users/buildslave/jenkins/workspace/lldb-cmake-standalone/clang-build/lib/libLLVMDebugInfoCodeView.a(Formatters.cpp.o)) was built for newer OSX version (10.14) than being linked (10.12) ld: warning: object file (/Users/buildslave/jenkins/workspace/lldb-cmake-standalone/clang-build/lib/libLLVMObjectYAML.a(DWARFVisitor.cpp.o)) was built for newer OSX version (10.14) than being linked (10.12) ld: warning: object file (/Users/buildslave/jenkins/workspace/lldb-cmake-standalone/clang-build/lib/libLLVMSupport.a(DataExtractor.cpp.o)) was built for newer OSX version (10.14) than being linked (10.12) ld: warning: object file (/Users/buildslave/jenkins/workspace/lldb-cmake-standalone/clang-build/lib/libLLVMSupport.a(ARMBuildAttrs.cpp.o)) was built for newer OSX version (10.14) than being linked (10.12) ld: warning: object file (/Users/buildslave/jenkins/workspace/lldb-cmake-standalone/clang-build/lib/libLLVMBitReader.a(BitcodeReader.cpp.o)) was built for newer OSX version (10.14) than being linked (10.12) ld: warning: object file (/Users/buildslave/jenkins/workspace/lldb-cmake-standalone/clang-build/lib/libLLVMObject.a(ModuleSymbolTable.cpp.o)) was built for newer OSX version (10.14) than being linked (10.12) ld: warning: object file (/Users/buildslave/jenkins/workspace/lldb-cmake-standalone/clang-build/lib/libLLVMCore.a(Module.cpp.o)) was built for newer OSX version (10.14) than being linked (10.12) ld: warning: object file (/Users/buildslave/jenkins/workspace/lldb-cmake-standalone/clang-build/lib/libLLVMObject.a(TapiUniversal.cpp.o)) was built for newer OSX version (10.14) than being linked (10.12) ld: warning: object file (/Users/buildslave/jenkins/workspace/lldb-cmake-standalone/clang-build/lib/libLLVMObject.a(WindowsResource.cpp.o)) was built for newer OSX version (10.14) than being linked (10.12) ld: warning: object file (/Users/buildslave/jenkins/workspace/lldb-cmake-standalone/clang-build/lib/libLLVMObject.a(MachOUniversal.cpp.o)) was built for newer OSX version (10.14) than being linked (10.12) ld: warning: object file (/Users/buildslave/jenkins/workspace/lldb-cmake-standalone/clang-build/lib/libLLVMObject.a(Archive.cpp.o)) was built for newer OSX version (10.14) than being linked (10.12) ld: warning: object file (/Users/buildslave/jenkins/workspace/lldb-cmake-standalone/clang-build/lib/libLLVMDebugInfoCodeView.a(EnumTables.cpp.o)) was built for newer OSX version (10.14) than being linked (10.12) ld: warning: object file (/Users/buildslave/jenkins/workspace/lldb-cmake-standalone/clang-build/lib/libLLVMDebugInfoCodeView.a(CodeViewRecordIO.cpp.o)) was built for newer OSX version (10.14) than being linked (10.12) ld: warning: object file (/Users/buildslave/jenkins/workspace/lldb-cmake-standalone/clang-build/lib/libLLVMDebugInfoCodeView.a(SymbolSerializer.cpp.o)) was built for newer OSX version (10.14) than being linked (10.12) ld: warning: object file (/Users/buildslave/jenkins/workspace/lldb-cmake-standalone/clang-build/lib/libLLVMDebugInfoCodeView.a(SymbolRecordMapping.cpp.o)) was built for newer OSX version (10.14) than being linked (10.12) ld: warning: object file (/Users/buildslave/jenkins/workspace/lldb-cmake-standalone/clang-build/lib/libLLVMObject.a(IRSymtab.cpp.o)) was built for newer OSX version (10.14) than being linked (10.12) ld: warning: object file (/Users/buildslave/jenkins/workspace/lldb-cmake-standalone/clang-build/lib/libLLVMSupport.a(ScopedPrinter.cpp.o)) was built for newer OSX version (10.14) than being linked (10.12) ld: warning: object file (/Users/buildslave/jenkins/workspace/lldb-cmake-standalone/clang-build/lib/libLLVMCore.a(Instructions.cpp.o)) was built for newer OSX version (10.14) than being linked (10.12) ld: warning: object file (/Users/buildslave/jenkins/workspace/lldb-cmake-standalone/clang-build/lib/libLLVMCore.a(BasicBlock.cpp.o)) was built for newer OSX version (10.14) than being linked (10.12) ld: warning: object file (/Users/buildslave/jenkins/workspace/lldb-cmake-standalone/clang-build/lib/libLLVMCore.a(Constants.cpp.o)) was built for newer OSX version (10.14) than being linked (10.12) ld: warning: object file (/Users/buildslave/jenkins/workspace/lldb-cmake-standalone/clang-build/lib/libLLVMCore.a(DataLayout.cpp.o)) was built for newer OSX version (10.14) than being linked (10.12) ld: warning: object file (/Users/buildslave/jenkins/workspace/lldb-cmake-standalone/clang-build/lib/libLLVMMC.a(MCStreamer.cpp.o)) was built for newer OSX version (10.14) than being linked (10.12) ld: warning: object file (/Users/buildslave/jenkins/workspace/lldb-cmake-standalone/clang-build/lib/libLLVMCore.a(Type.cpp.o)) was built for newer OSX version (10.14) than being linked (10.12) ld: warning: object file (/Users/buildslave/jenkins/workspace/lldb-cmake-standalone/clang-build/lib/libLLVMCore.a(TypeFinder.cpp.o)) was built for newer OSX version (10.14) than being linked (10.12) ld: warning: object file (/Users/buildslave/jenkins/workspace/lldb-cmake-standalone/clang-build/lib/libLLVMCore.a(Attributes.cpp.o)) was built for newer OSX version (10.14) than being linked (10.12) ld: warning: object file (/Users/buildslave/jenkins/workspace/lldb-cmake-standalone/clang-build/lib/libLLVMCore.a(Globals.cpp.o)) was built for newer OSX version (10.14) than being linked (10.12) ld: warning: object file (/Users/buildslave/jenkins/workspace/lldb-cmake-standalone/clang-build/lib/libLLVMCore.a(Instruction.cpp.o)) was built for newer OSX version (10.14) than being linked (10.12) ld: warning: object file (/Users/buildslave/jenkins/workspace/lldb-cmake-standalone/clang-build/lib/libLLVMCore.a(Metadata.cpp.o)) was built for newer OSX version (10.14) than being linked (10.12) ld: warning: object file (/Users/buildslave/jenkins/workspace/lldb-cmake-standalone/clang-build/lib/libLLVMCore.a(LLVMContext.cpp.o)) was built for newer OSX version (10.14) than being linked (10.12) ld: warning: object file (/Users/buildslave/jenkins/workspace/lldb-cmake-standalone/clang-build/lib/libLLVMMCParser.a(MCAsmParser.cpp.o)) was built for newer OSX version (10.14) than being linked (10.12) ld: warning: object file (/Users/buildslave/jenkins/workspace/lldb-cmake-standalone/clang-build/lib/libLLVMCore.a(Verifier.cpp.o)) was built for newer OSX version (10.14) than being linked (10.12) ld: warning: object file (/Users/buildslave/jenkins/workspace/lldb-cmake-standalone/clang-build/lib/libLLVMCore.a(GVMaterializer.cpp.o)) was built for newer OSX version (10.14) than being linked (10.12) ld: warning: object file (/Users/buildslave/jenkins/workspace/lldb-cmake-standalone/clang-build/lib/libLLVMBitReader.a(MetadataLoader.cpp.o)) was built for newer OSX version (10.14) than being linked (10.12) ld: warning: object file (/Users/buildslave/jenkins/workspace/lldb-cmake-standalone/clang-build/lib/libLLVMObject.a(RecordStreamer.cpp.o)) was built for newer OSX version (10.14) than being linked (10.12) ld: warning: object file (/Users/buildslave/jenkins/workspace/lldb-cmake-standalone/clang-build/lib/libLLVMCore.a(DebugInfo.cpp.o)) was built for newer OSX version (10.14) than being linked (10.12) ld: warning: object file (/Users/buildslave/jenkins/workspace/lldb-cmake-standalone/clang-build/lib/libLLVMBitstreamReader.a(BitstreamReader.cpp.o)) was built for newer OSX version (10.14) than being linked (10.12) ld: warning: object file (/Users/buildslave/jenkins/workspace/lldb-cmake-standalone/clang-build/lib/libLLVMMC.a(MCTargetOptions.cpp.o)) was built for newer OSX version (10.14) than being linked (10.12) ld: warning: object file (/Users/buildslave/jenkins/workspace/lldb-cmake-standalone/clang-build/lib/libLLVMCore.a(Value.cpp.o)) was built for newer OSX version (10.14) than being linked (10.12) ld: warning: object file (/Users/buildslave/jenkins/workspace/lldb-cmake-standalone/clang-build/lib/libLLVMMC.a(MCObjectFileInfo.cpp.o)) was built for newer OSX version (10.14) than being linked (10.12) ld: warning: object file (/Users/buildslave/jenkins/workspace/lldb-cmake-standalone/clang-build/lib/libLLVMCore.a(AutoUpgrade.cpp.o)) was built for newer OSX version (10.14) than being linked (10.12) ld: warning: object file (/Users/buildslave/jenkins/workspace/lldb-cmake-standalone/clang-build/lib/libLLVMCore.a(ValueSymbolTable.cpp.o)) was built for newer OSX version (10.14) than being linked (10.12) ld: warning: object file (/Users/buildslave/jenkins/workspace/lldb-cmake-standalone/clang-build/lib/libLLVMMCParser.a(AsmParser.cpp.o)) was built for newer OSX version (10.14) than being linked (10.12) ld: warning: object file (/Users/buildslave/jenkins/workspace/lldb-cmake-standalone/clang-build/lib/libLLVMCore.a(ModuleSummaryIndex.cpp.o)) was built for newer OSX version (10.14) than being linked (10.12) ld: warning: object file (/Users/buildslave/jenkins/workspace/lldb-cmake-standalone/clang-build/lib/libLLVMSupport.a(RandomNumberGenerator.cpp.o)) was built for newer OSX version (10.14) than being linked (10.12) ld: warning: object file (/Users/buildslave/jenkins/workspace/lldb-cmake-standalone/clang-build/lib/libLLVMBitReader.a(ValueList.cpp.o)) was built for newer OSX version (10.14) than being linked (10.12) ld: warning: object file (/Users/buildslave/jenkins/workspace/lldb-cmake-standalone/clang-build/lib/libLLVMCore.a(Mangler.cpp.o)) was built for newer OSX version (10.14) than being linked (10.12) ld: warning: object file (/Users/buildslave/jenkins/workspace/lldb-cmake-standalone/clang-build/lib/libLLVMCore.a(User.cpp.o)) was built for newer OSX version (10.14) than being linked (10.12) ld: warning: object file (/Users/buildslave/jenkins/workspace/lldb-cmake-standalone/clang-build/lib/libLLVMTextAPI.a(TextStub.cpp.o)) was built for newer OSX version (10.14) than being linked (10.12) ld: warning: object file (/Users/buildslave/jenkins/workspace/lldb-cmake-standalone/clang-build/lib/libLLVMTextAPI.a(Target.cpp.o)) was built for newer OSX version (10.14) than being linked (10.12) ld: warning: object file (/Users/buildslave/jenkins/workspace/lldb-cmake-standalone/clang-build/lib/libLLVMCore.a(Comdat.cpp.o)) was built for newer OSX version (10.14) than being linked (10.12) ld: warning: object file (/Users/buildslave/jenkins/workspace/lldb-cmake-standalone/clang-build/lib/libLLVMObject.a(TapiFile.cpp.o)) was built for newer OSX version (10.14) than being linked (10.12) ld: warning: object file (/Users/buildslave/jenkins/workspace/lldb-cmake-standalone/clang-build/lib/libLLVMCore.a(DebugLoc.cpp.o)) was built for newer OSX version (10.14) than being linked (10.12) ld: warning: object file (/Users/buildslave/jenkins/workspace/lldb-cmake-standalone/clang-build/lib/libLLVMCore.a(Function.cpp.o)) was built for newer OSX version (10.14) than being linked (10.12) ld: warning: object file (/Users/buildslave/jenkins/workspace/lldb-cmake-standalone/clang-build/lib/libLLVMDebugInfoCodeView.a(RecordSerialization.cpp.o)) was built for newer OSX version (10.14) than being linked (10.12) ld: warning: object file (/Users/buildslave/jenkins/workspace/lldb-cmake-standalone/clang-build/lib/libLLVMCore.a(InlineAsm.cpp.o)) was built for newer OSX version (10.14) than being linked (10.12) ld: warning: object file (/Users/buildslave/jenkins/workspace/lldb-cmake-standalone/clang-build/lib/libLLVMMC.a(MCContext.cpp.o)) was built for newer OSX version (10.14) than being linked (10.12) ld: warning: object file (/Users/buildslave/jenkins/workspace/lldb-cmake-standalone/clang-build/lib/libLLVMCore.a(Use.cpp.o)) was built for newer OSX version (10.14) than being linked (10.12) ld: warning: object file (/Users/buildslave/jenkins/workspace/lldb-cmake-standalone/clang-build/lib/libLLVMCore.a(DebugInfoMetadata.cpp.o)) was built for newer OSX version (10.14) than being linked (10.12) ld: warning: object file (/Users/buildslave/jenkins/workspace/lldb-cmake-standalone/clang-build/lib/libLLVMMC.a(MCFragment.cpp.o)) was built for newer OSX version (10.14) than being linked (10.12) ld: warning: object file (/Users/buildslave/jenkins/workspace/lldb-cmake-standalone/clang-build/lib/libLLVMMC.a(MCExpr.cpp.o)) was built for newer OSX version (10.14) than being linked (10.12) ld: warning: object file (/Users/buildslave/jenkins/workspace/lldb-cmake-standalone/clang-build/lib/libLLVMCore.a(LegacyPassManager.cpp.o)) was built for newer OSX version (10.14) than being linked (10.12) ld: warning: object file (/Users/buildslave/jenkins/workspace/lldb-cmake-standalone/clang-build/lib/libLLVMCore.a(LLVMContextImpl.cpp.o)) was built for newer OSX version (10.14) than being linked (10.12) ld: warning: object file (/Users/buildslave/jenkins/workspace/lldb-cmake-standalone/clang-build/lib/libLLVMCore.a(PassRegistry.cpp.o)) was built for newer OSX version (10.14) than being linked (10.12) ld: warning: object file (/Users/buildslave/jenkins/workspace/lldb-cmake-standalone/clang-build/lib/libLLVMCore.a(Statepoint.cpp.o)) was built for newer OSX version (10.14) than being linked (10.12) ld: warning: object file (/Users/buildslave/jenkins/workspace/lldb-cmake-standalone/clang-build/lib/libLLVMCore.a(ConstantRange.cpp.o)) was built for newer OSX version (10.14) than being linked (10.12) ld: warning: object file (/Users/buildslave/jenkins/workspace/lldb-cmake-standalone/clang-build/lib/libLLVMCore.a(IRBuilder.cpp.o)) was built for newer OSX version (10.14) than being linked (10.12) ld: warning: object file (/Users/buildslave/jenkins/workspace/lldb-cmake-standalone/clang-build/lib/libLLVMCore.a(Dominators.cpp.o)) was built for newer OSX version (10.14) than being linked (10.12) ld: warning: object file (/Users/buildslave/jenkins/workspace/lldb-cmake-standalone/clang-build/lib/libLLVMMC.a(MCSectionMachO.cpp.o)) was built for newer OSX version (10.14) than being linked (10.12) ld: warning: object file (/Users/buildslave/jenkins/workspace/lldb-cmake-standalone/clang-build/lib/libLLVMMC.a(MCSectionXCOFF.cpp.o)) was built for newer OSX version (10.14) than being linked (10.12) ld: warning: object file (/Users/buildslave/jenkins/workspace/lldb-cmake-standalone/clang-build/lib/libLLVMCore.a(PassManager.cpp.o)) was built for newer OSX version (10.14) than being linked (10.12) ld: warning: object file (/Users/buildslave/jenkins/workspace/lldb-cmake-standalone/clang-build/lib/libLLVMMC.a(MCCodeView.cpp.o)) was built for newer OSX version (10.14) than being linked (10.12) ld: warning: object file (/Users/buildslave/jenkins/workspace/lldb-cmake-standalone/clang-build/lib/libLLVMMC.a(MCDwarf.cpp.o)) was built for newer OSX version (10.14) than being linked (10.12) ld: warning: object file (/Users/buildslave/jenkins/workspace/lldb-cmake-standalone/clang-build/lib/libLLVMCore.a(AsmWriter.cpp.o)) was built for newer OSX version (10.14) than being linked (10.12) ld: warning: object file (/Users/buildslave/jenkins/workspace/lldb-cmake-standalone/clang-build/lib/libLLVMCore.a(FPEnv.cpp.o)) was built for newer OSX version (10.14) than being linked (10.12) ld: warning: object file (/Users/buildslave/jenkins/workspace/lldb-cmake-standalone/clang-build/lib/libLLVMSupport.a(Statistic.cpp.o)) was built for newer OSX version (10.14) than being linked (10.12) ld: warning: object file (/Users/buildslave/jenkins/workspace/lldb-cmake-standalone/clang-build/lib/libLLVMCore.a(LLVMRemarkStreamer.cpp.o)) was built for newer OSX version (10.14) than being linked (10.12) ld: warning: object file (/Users/buildslave/jenkins/workspace/lldb-cmake-standalone/clang-build/lib/libLLVMMCParser.a(ELFAsmParser.cpp.o)) was built for newer OSX version (10.14) than being linked (10.12) ld: warning: object file (/Users/buildslave/jenkins/workspace/lldb-cmake-standalone/clang-build/lib/libLLVMMCParser.a(COFFAsmParser.cpp.o)) was built for newer OSX version (10.14) than being linked (10.12) ld: warning: object file (/Users/buildslave/jenkins/workspace/lldb-cmake-standalone/clang-build/lib/libLLVMMCParser.a(WasmAsmParser.cpp.o)) was built for newer OSX version (10.14) than being linked (10.12) ld: warning: object file (/Users/buildslave/jenkins/workspace/lldb-cmake-standalone/clang-build/lib/libLLVMMCParser.a(DarwinAsmParser.cpp.o)) was built for newer OSX version (10.14) than being linked (10.12) ld: warning: object file (/Users/buildslave/jenkins/workspace/lldb-cmake-standalone/clang-build/lib/libLLVMCore.a(IntrinsicInst.cpp.o)) was built for newer OSX version (10.14) than being linked (10.12) ld: warning: object file (/Users/buildslave/jenkins/workspace/lldb-cmake-standalone/clang-build/lib/libLLVMCore.a(DiagnosticInfo.cpp.o)) was built for newer OSX version (10.14) than being linked (10.12) ld: warning: object file (/Users/buildslave/jenkins/workspace/lldb-cmake-standalone/clang-build/lib/libLLVMCore.a(ConstantFold.cpp.o)) was built for newer OSX version (10.14) than being linked (10.12) ld: warning: object file (/Users/buildslave/jenkins/workspace/lldb-cmake-standalone/clang-build/lib/libLLVMCore.a(Pass.cpp.o)) was built for newer OSX version (10.14) than being linked (10.12) ld: warning: object file (/Users/buildslave/jenkins/workspace/lldb-cmake-standalone/clang-build/lib/libLLVMTextAPI.a(TextStubCommon.cpp.o)) was built for newer OSX version (10.14) than being linked (10.12) ld: warning: object file (/Users/buildslave/jenkins/workspace/lldb-cmake-standalone/clang-build/lib/libLLVMTextAPI.a(InterfaceFile.cpp.o)) was built for newer OSX version (10.14) than being linked (10.12) ld: warning: object file (/Users/buildslave/jenkins/workspace/lldb-cmake-standalone/clang-build/lib/libLLVMTextAPI.a(ArchitectureSet.cpp.o)) was built for newer OSX version (10.14) than being linked (10.12) ld: warning: object file (/Users/buildslave/jenkins/workspace/lldb-cmake-standalone/clang-build/lib/libLLVMTextAPI.a(Platform.cpp.o)) was built for newer OSX version (10.14) than being linked (10.12) ld: warning: object file (/Users/buildslave/jenkins/workspace/lldb-cmake-standalone/clang-build/lib/libLLVMTextAPI.a(Architecture.cpp.o)) was built for newer OSX version (10.14) than being linked (10.12) ld: warning: object file (/Users/buildslave/jenkins/workspace/lldb-cmake-standalone/clang-build/lib/libLLVMBinaryFormat.a(XCOFF.cpp.o)) was built for newer OSX version (10.14) than being linked (10.12) ld: warning: object file (/Users/buildslave/jenkins/workspace/lldb-cmake-standalone/clang-build/lib/libLLVMMCParser.a(AsmLexer.cpp.o)) was built for newer OSX version (10.14) than being linked (10.12) ld: warning: object file (/Users/buildslave/jenkins/workspace/lldb-cmake-standalone/clang-build/lib/libLLVMMC.a(MCSymbol.cpp.o)) was built for newer OSX version (10.14) than being linked (10.12) ld: warning: object file (/Users/buildslave/jenkins/workspace/lldb-cmake-standalone/clang-build/lib/libLLVMCore.a(DIBuilder.cpp.o)) was built for newer OSX version (10.14) than being linked (10.12) ld: warning: object file (/Users/buildslave/jenkins/workspace/lldb-cmake-standalone/clang-build/lib/libLLVMMC.a(MCSection.cpp.o)) was built for newer OSX version (10.14) than being linked (10.12) ld: warning: object file (/Users/buildslave/jenkins/workspace/lldb-cmake-standalone/clang-build/lib/libLLVMCore.a(MDBuilder.cpp.o)) was built for newer OSX version (10.14) than being linked (10.12) ld: warning: object file (/Users/buildslave/jenkins/workspace/lldb-cmake-standalone/clang-build/lib/libLLVMMCParser.a(MCAsmLexer.cpp.o)) was built for newer OSX version (10.14) than being linked (10.12) ld: warning: object file (/Users/buildslave/jenkins/workspace/lldb-cmake-standalone/clang-build/lib/libLLVMMC.a(MCAsmMacro.cpp.o)) was built for newer OSX version (10.14) than being linked (10.12) ld: warning: object file (/Users/buildslave/jenkins/workspace/lldb-cmake-standalone/clang-build/lib/libLLVMCore.a(Operator.cpp.o)) was built for newer OSX version (10.14) than being linked (10.12) ld: warning: object file (/Users/buildslave/jenkins/workspace/lldb-cmake-standalone/clang-build/lib/libLLVMMC.a(MCSymbolELF.cpp.o)) was built for newer OSX version (10.14) than being linked (10.12) ld: warning: object file (/Users/buildslave/jenkins/workspace/lldb-cmake-standalone/clang-build/lib/libLLVMMC.a(MCRegisterInfo.cpp.o)) was built for newer OSX version (10.14) than being linked (10.12) ld: warning: object file (/Users/buildslave/jenkins/workspace/lldb-cmake-standalone/clang-build/lib/libLLVMMCParser.a(MCTargetAsmParser.cpp.o)) was built for newer OSX version (10.14) than being linked (10.12) ld: warning: object file (/Users/buildslave/jenkins/workspace/lldb-cmake-standalone/clang-build/lib/libLLVMMC.a(MCSectionELF.cpp.o)) was built for newer OSX version (10.14) than being linked (10.12) ld: warning: object file (/Users/buildslave/jenkins/workspace/lldb-cmake-standalone/clang-build/lib/libLLVMMC.a(MCSectionCOFF.cpp.o)) was built for newer OSX version (10.14) than being linked (10.12) ld: warning: object file (/Users/buildslave/jenkins/workspace/lldb-cmake-standalone/clang-build/lib/libLLVMMC.a(MCSectionWasm.cpp.o)) was built for newer OSX version (10.14) than being linked (10.12) ld: warning: object file (/Users/buildslave/jenkins/workspace/lldb-cmake-standalone/clang-build/lib/libLLVMMC.a(MCSubtargetInfo.cpp.o)) was built for newer OSX version (10.14) than being linked (10.12) ld: warning: object file (/Users/buildslave/jenkins/workspace/lldb-cmake-standalone/clang-build/lib/libLLVMCore.a(DiagnosticPrinter.cpp.o)) was built for newer OSX version (10.14) than being linked (10.12) ld: warning: object file (/Users/buildslave/jenkins/workspace/lldb-cmake-standalone/clang-build/lib/libLLVMSupport.a(Timer.cpp.o)) was built for newer OSX version (10.14) than being linked (10.12) ld: warning: object file (/Users/buildslave/jenkins/workspace/lldb-cmake-standalone/clang-build/lib/libLLVMMC.a(MCAssembler.cpp.o)) was built for newer OSX version (10.14) than being linked (10.12) ld: warning: object file (/Users/buildslave/jenkins/workspace/lldb-cmake-standalone/clang-build/lib/libLLVMMC.a(MCSchedule.cpp.o)) was built for newer OSX version (10.14) than being linked (10.12) ld: warning: object file (/Users/buildslave/jenkins/workspace/lldb-cmake-standalone/clang-build/lib/libLLVMCore.a(PassTimingInfo.cpp.o)) was built for newer OSX version (10.14) than being linked (10.12) ld: warning: object file (/Users/buildslave/jenkins/workspace/lldb-cmake-standalone/clang-build/lib/libLLVMSupport.a(ToolOutputFile.cpp.o)) was built for newer OSX version (10.14) than being linked (10.12) ld: warning: object file (/Users/buildslave/jenkins/workspace/lldb-cmake-standalone/clang-build/lib/libLLVMMC.a(MCObjectStreamer.cpp.o)) was built for newer OSX version (10.14) than being linked (10.12) ld: warning: object file (/Users/buildslave/jenkins/workspace/lldb-cmake-standalone/clang-build/lib/libLLVMMCParser.a(MCAsmParserExtension.cpp.o)) was built for newer OSX version (10.14) than being linked (10.12) ld: warning: object file (/Users/buildslave/jenkins/workspace/lldb-cmake-standalone/clang-build/lib/libLLVMSupport.a(TimeProfiler.cpp.o)) was built for newer OSX version (10.14) than being linked (10.12) ld: warning: object file (/Users/buildslave/jenkins/workspace/lldb-cmake-standalone/clang-build/lib/libLLVMSupport.a(PrettyStackTrace.cpp.o)) was built for newer OSX version (10.14) than being linked (10.12) ld: warning: object file (/Users/buildslave/jenkins/workspace/lldb-cmake-standalone/clang-build/lib/libLLVMCore.a(IRPrintingPasses.cpp.o)) was built for newer OSX version (10.14) than being linked (10.12) ld: warning: object file (/Users/buildslave/jenkins/workspace/lldb-cmake-standalone/clang-build/lib/libLLVMSupport.a(FormattedStream.cpp.o)) was built for newer OSX version (10.14) than being linked (10.12) ld: warning: object file (/Users/buildslave/jenkins/workspace/lldb-cmake-standalone/clang-build/lib/libLLVMCore.a(PassInstrumentation.cpp.o)) was built for newer OSX version (10.14) than being linked (10.12) ld: warning: object file (/Users/buildslave/jenkins/workspace/lldb-cmake-standalone/clang-build/lib/libLLVMTextAPI.a(PackedVersion.cpp.o)) was built for newer OSX version (10.14) than being linked (10.12) ld: warning: object file (/Users/buildslave/jenkins/workspace/lldb-cmake-standalone/clang-build/lib/libLLVMBinaryFormat.a(Dwarf.cpp.o)) was built for newer OSX version (10.14) than being linked (10.12) ld: warning: object file (/Users/buildslave/jenkins/workspace/lldb-cmake-standalone/clang-build/lib/libLLVMRemarks.a(RemarkFormat.cpp.o)) was built for newer OSX version (10.14) than being linked (10.12) ld: warning: object file (/Users/buildslave/jenkins/workspace/lldb-cmake-standalone/clang-build/lib/libLLVMRemarks.a(RemarkStreamer.cpp.o)) was built for newer OSX version (10.14) than being linked (10.12) ld: warning: object file (/Users/buildslave/jenkins/workspace/lldb-cmake-standalone/clang-build/lib/libLLVMRemarks.a(RemarkSerializer.cpp.o)) was built for newer OSX version (10.14) than being linked (10.12) ld: warning: object file (/Users/buildslave/jenkins/workspace/lldb-cmake-standalone/clang-build/lib/libLLVMCore.a(OptBisect.cpp.o)) was built for newer OSX version (10.14) than being linked (10.12) ld: warning: object file (/Users/buildslave/jenkins/workspace/lldb-cmake-standalone/clang-build/lib/libLLVMMC.a(MCObjectWriter.cpp.o)) was built for newer OSX version (10.14) than being linked (10.12) ld: warning: object file (/Users/buildslave/jenkins/workspace/lldb-cmake-standalone/clang-build/lib/libLLVMMC.a(MCInst.cpp.o)) was built for newer OSX version (10.14) than being linked (10.12) ld: warning: object file (/Users/buildslave/jenkins/workspace/lldb-cmake-standalone/clang-build/lib/libLLVMCore.a(DiagnosticHandler.cpp.o)) was built for newer OSX version (10.14) than being linked (10.12) ld: warning: object file (/Users/buildslave/jenkins/workspace/lldb-cmake-standalone/clang-build/lib/libLLVMSupport.a(Signposts.cpp.o)) was built for newer OSX version (10.14) than being linked (10.12) ld: warning: object file (/Users/buildslave/jenkins/workspace/lldb-cmake-standalone/clang-build/lib/libLLVMSupport.a(Watchdog.cpp.o)) was built for newer OSX version (10.14) than being linked (10.12) ld: warning: object file (/Users/buildslave/jenkins/workspace/lldb-cmake-standalone/clang-build/lib/libLLVMRemarks.a(YAMLRemarkSerializer.cpp.o)) was built for newer OSX version (10.14) than being linked (10.12) ld: warning: object file (/Users/buildslave/jenkins/workspace/lldb-cmake-standalone/clang-build/lib/libLLVMRemarks.a(BitstreamRemarkSerializer.cpp.o)) was built for newer OSX version (10.14) than being linked (10.12) ld: warning: object file (/Users/buildslave/jenkins/workspace/lldb-cmake-standalone/clang-build/lib/libLLVMMC.a(MCInstPrinter.cpp.o)) was built for newer OSX version (10.14) than being linked (10.12) ld: warning: object file (/Users/buildslave/jenkins/workspace/lldb-cmake-standalone/clang-build/lib/libLLVMRemarks.a(RemarkStringTable.cpp.o)) was built for newer OSX version (10.14) than being linked (10.12) ld: warning: object file (/Users/buildslave/jenkins/workspace/lldb-cmake-standalone/clang-build/lib/libLLVMRemarks.a(RemarkParser.cpp.o)) was built for newer OSX version (10.14) than being linked (10.12) ld: warning: object file (/Users/buildslave/jenkins/workspace/lldb-cmake-standalone/clang-build/lib/libLLVMRemarks.a(YAMLRemarkParser.cpp.o)) was built for newer OSX version (10.14) than being linked (10.12) ld: warning: object file (/Users/buildslave/jenkins/workspace/lldb-cmake-standalone/clang-build/lib/libLLVMRemarks.a(BitstreamRemarkParser.cpp.o)) was built for newer OSX version (10.14) than being linked (10.12) ld: warning: direct access in function 'llvm::yaml::needsQuotes(llvm::StringRef)' from file '/Users/buildslave/jenkins/workspace/lldb-cmake-standalone/lldb-xcode-build/Release/lib/liblldbUtility.a(Reproducer.o)' to global weak symbol 'llvm::yaml::needsQuotes(llvm::StringRef)::Indicators' from file '/Users/buildslave/jenkins/workspace/lldb-cmake-standalone/clang-build/lib/libLLVMObjectYAML.a(CodeViewYAMLDebugSections.cpp.o)' means the weak symbol cannot be overridden at runtime. This was likely caused by different translation units being compiled with different visibility settings. Showing first 200 warnings only

Hide Details

PhaseScriptExecution CMake\ PostBuild\ Rules /Users/buildslave/jenkins/workspace/lldb-cmake-standalone/lldb-xcode-build/unittests/Utility/lldb.build/Release/UtilityTests.build/Script-A8F7A259282B42EE8455A97C.sh cd /Users/buildslave/jenkins/workspace/lldb-cmake-standalone/llvm-project/lldb /bin/sh -c /Users/buildslave/jenkins/workspace/lldb-cmake-standalone/lldb-xcode-build/unittests/Utility/lldb.build/Release/UtilityTests.build/Script-A8F7A259282B42EE8455A97C.sh /usr/local/Cellar/cmake/3.12.3/bin/cmake -E make_directory /Users/buildslave/jenkins/workspace/lldb-cmake-standalone/lldb-xcode-build/unittests/Utility/Release/Inputs echo "Copying StructuredData-basic.json to binary directory." Copying StructuredData-basic.json to binary directory. /usr/local/Cellar/cmake/3.12.3/bin/cmake -E copy /Users/buildslave/jenkins/workspace/lldb-cmake-standalone/llvm-project/lldb/unittests/Utility/Inputs/StructuredData-basic.json /Users/buildslave/jenkins/workspace/lldb-cmake-standalone/lldb-xcode-build/unittests/Utility/Release/Inputs

Hide Details

=== BUILD TARGET debugserverTests OF PROJECT lldb WITH CONFIGURATION Release ===

Hide Details

Check dependencies

Hide Details

Write auxiliary files write-file /Users/buildslave/jenkins/workspace/lldb-cmake-standalone/lldb-xcode-build/unittests/debugserver/lldb.build/Release/debugserverTests.build/Script-EF809A839F60442896278329.sh chmod 0755 /Users/buildslave/jenkins/workspace/lldb-cmake-standalone/lldb-xcode-build/unittests/debugserver/lldb.build/Release/debugserverTests.build/Script-EF809A839F60442896278329.sh

Hide Details

Ld /Users/buildslave/jenkins/workspace/lldb-cmake-standalone/lldb-xcode-build/unittests/debugserver/Release/debugserverTests normal x86_64 cd /Users/buildslave/jenkins/workspace/lldb-cmake-standalone/llvm-project/lldb export MACOSX_DEPLOYMENT_TARGET=10.12 /Applications/Xcode.app/Contents/Developer/Toolchains/XcodeDefault.xctoolchain/usr/bin/clang++ -arch x86_64 -isysroot /Applications/Xcode.app/Contents/Developer/Platforms/MacOSX.platform/Developer/SDKs/MacOSX10.14.sdk -L/Users/buildslave/jenkins/workspace/lldb-cmake-standalone/lldb-xcode-build/unittests/debugserver/Release -F/Users/buildslave/jenkins/workspace/lldb-cmake-standalone/lldb-xcode-build/unittests/debugserver/Release -filelist /Users/buildslave/jenkins/workspace/lldb-cmake-standalone/lldb-xcode-build/unittests/debugserver/lldb.build/Release/debugserverTests.build/Objects-normal/x86_64/debugserverTests.LinkFileList -mmacosx-version-min=10.12 -Wl,-dead_strip -Wl,-search_paths_first -Wl,-headerpad_max_install_names /Users/buildslave/jenkins/workspace/lldb-cmake-standalone/clang-build/lib/libLLVMSupport.a /Users/buildslave/jenkins/workspace/lldb-cmake-standalone/clang-build/lib/libLLVMSupport.a /Users/buildslave/jenkins/workspace/lldb-cmake-standalone/clang-build/lib/libgtest_main.a /Users/buildslave/jenkins/workspace/lldb-cmake-standalone/clang-build/lib/libgtest.a /Users/buildslave/jenkins/workspace/lldb-cmake-standalone/lldb-xcode-build/lib/Release/liblldbDebugserverCommon.a /Users/buildslave/jenkins/workspace/lldb-cmake-standalone/lldb-xcode-build/Release/lib/liblldbHost.a -lpthread /Users/buildslave/jenkins/workspace/lldb-cmake-standalone/lldb-xcode-build/lib/Release/liblldbDebugserverArchSupport.a /Users/buildslave/jenkins/workspace/lldb-cmake-standalone/lldb-xcode-build/lib/Release/liblldbDebugserverDarwin_DarwinLog.a -lcompression -lxml2 /usr/lib/libedit.dylib /usr/local/lib/liblzma.dylib /usr/lib/libedit.dylib /usr/local/lib/liblzma.dylib /Users/buildslave/jenkins/workspace/lldb-cmake-standalone/lldb-xcode-build/Release/lib/liblldbHostMacOSXObjCXX.a /Users/buildslave/jenkins/workspace/lldb-cmake-standalone/lldb-xcode-build/Release/lib/liblldbUtility.a /usr/lib/libxml2.dylib -framework CoreFoundation -framework Foundation -framework CoreServices -framework Security /Users/buildslave/jenkins/workspace/lldb-cmake-standalone/clang-build/lib/libLLVMObject.a /Users/buildslave/jenkins/workspace/lldb-cmake-standalone/clang-build/lib/libLLVMBitReader.a /Users/buildslave/jenkins/workspace/lldb-cmake-standalone/clang-build/lib/libLLVMCore.a /Users/buildslave/jenkins/workspace/lldb-cmake-standalone/clang-build/lib/libLLVMRemarks.a /Users/buildslave/jenkins/workspace/lldb-cmake-standalone/clang-build/lib/libLLVMBitstreamReader.a /Users/buildslave/jenkins/workspace/lldb-cmake-standalone/clang-build/lib/libLLVMMCParser.a /Users/buildslave/jenkins/workspace/lldb-cmake-standalone/clang-build/lib/libLLVMMC.a /Users/buildslave/jenkins/workspace/lldb-cmake-standalone/clang-build/lib/libLLVMDebugInfoCodeView.a /Users/buildslave/jenkins/workspace/lldb-cmake-standalone/clang-build/lib/libLLVMDebugInfoMSF.a /Users/buildslave/jenkins/workspace/lldb-cmake-standalone/clang-build/lib/libLLVMTextAPI.a /Users/buildslave/jenkins/workspace/lldb-cmake-standalone/clang-build/lib/libLLVMBinaryFormat.a /Users/buildslave/jenkins/workspace/lldb-cmake-standalone/clang-build/lib/libLLVMSupport.a /usr/lib/libz.dylib -lcurses -lm /Users/buildslave/jenkins/workspace/lldb-cmake-standalone/clang-build/lib/libLLVMDemangle.a -Xlinker -dependency_info -Xlinker /Users/buildslave/jenkins/workspace/lldb-cmake-standalone/lldb-xcode-build/unittests/debugserver/lldb.build/Release/debugserverTests.build/Objects-normal/x86_64/debugserverTests_dependency_info.dat -o /Users/buildslave/jenkins/workspace/lldb-cmake-standalone/lldb-xcode-build/unittests/debugserver/Release/debugserverTests ld: warning: object file (/Users/buildslave/jenkins/workspace/lldb-cmake-standalone/clang-build/lib/libLLVMSupport.a(raw_ostream.cpp.o)) was built for newer OSX version (10.14) than being linked (10.12) ld: warning: object file (/Users/buildslave/jenkins/workspace/lldb-cmake-standalone/clang-build/lib/libLLVMSupport.a(raw_os_ostream.cpp.o)) was built for newer OSX version (10.14) than being linked (10.12) ld: warning: object file (/Users/buildslave/jenkins/workspace/lldb-cmake-standalone/clang-build/lib/libLLVMSupport.a(ABIBreak.cpp.o)) was built for newer OSX version (10.14) than being linked (10.12) ld: warning: object file (/Users/buildslave/jenkins/workspace/lldb-cmake-standalone/clang-build/lib/libgtest.a(gtest-all.cc.o)) was built for newer OSX version (10.14) than being linked (10.12) ld: warning: object file (/Users/buildslave/jenkins/workspace/lldb-cmake-standalone/clang-build/lib/libgtest_main.a(TestMain.cpp.o)) was built for newer OSX version (10.14) than being linked (10.12) ld: warning: object file (/Users/buildslave/jenkins/workspace/lldb-cmake-standalone/clang-build/lib/libLLVMSupport.a(Error.cpp.o)) was built for newer OSX version (10.14) than being linked (10.12) ld: warning: object file (/Users/buildslave/jenkins/workspace/lldb-cmake-standalone/clang-build/lib/libLLVMSupport.a(NativeFormatting.cpp.o)) was built for newer OSX version (10.14) than being linked (10.12) ld: warning: object file (/Users/buildslave/jenkins/workspace/lldb-cmake-standalone/clang-build/lib/libLLVMSupport.a(SmallVector.cpp.o)) was built for newer OSX version (10.14) than being linked (10.12) ld: warning: object file (/Users/buildslave/jenkins/workspace/lldb-cmake-standalone/clang-build/lib/libLLVMSupport.a(StringRef.cpp.o)) was built for newer OSX version (10.14) than being linked (10.12) ld: warning: object file (/Users/buildslave/jenkins/workspace/lldb-cmake-standalone/clang-build/lib/libLLVMSupport.a(ErrorHandling.cpp.o)) was built for newer OSX version (10.14) than being linked (10.12) ld: warning: object file (/Users/buildslave/jenkins/workspace/lldb-cmake-standalone/clang-build/lib/libLLVMSupport.a(FormatVariadic.cpp.o)) was built for newer OSX version (10.14) than being linked (10.12) ld: warning: object file (/Users/buildslave/jenkins/workspace/lldb-cmake-standalone/clang-build/lib/libLLVMSupport.a(CommandLine.cpp.o)) was built for newer OSX version (10.14) than being linked (10.12) ld: warning: object file (/Users/buildslave/jenkins/workspace/lldb-cmake-standalone/clang-build/lib/libLLVMSupport.a(Program.cpp.o)) was built for newer OSX version (10.14) than being linked (10.12) ld: warning: object file (/Users/buildslave/jenkins/workspace/lldb-cmake-standalone/clang-build/lib/libLLVMSupport.a(Signals.cpp.o)) was built for newer OSX version (10.14) than being linked (10.12) ld: warning: object file (/Users/buildslave/jenkins/workspace/lldb-cmake-standalone/clang-build/lib/libLLVMSupport.a(Path.cpp.o)) was built for newer OSX version (10.14) than being linked (10.12) ld: warning: object file (/Users/buildslave/jenkins/workspace/lldb-cmake-standalone/clang-build/lib/libLLVMSupport.a(Process.cpp.o)) was built for newer OSX version (10.14) than being linked (10.12) ld: warning: object file (/Users/buildslave/jenkins/workspace/lldb-cmake-standalone/clang-build/lib/libLLVMSupport.a(Errno.cpp.o)) was built for newer OSX version (10.14) than being linked (10.12) ld: warning: object file (/Users/buildslave/jenkins/workspace/lldb-cmake-standalone/clang-build/lib/libLLVMSupport.a(Regex.cpp.o)) was built for newer OSX version (10.14) than being linked (10.12) ld: warning: object file (/Users/buildslave/jenkins/workspace/lldb-cmake-standalone/clang-build/lib/libgtest.a(gmock-all.cc.o)) was built for newer OSX version (10.14) than being linked (10.12) ld: warning: object file (/Users/buildslave/jenkins/workspace/lldb-cmake-standalone/clang-build/lib/libLLVMSupport.a(APFloat.cpp.o)) was built for newer OSX version (10.14) than being linked (10.12) ld: warning: object file (/Users/buildslave/jenkins/workspace/lldb-cmake-standalone/clang-build/lib/libLLVMSupport.a(StringExtras.cpp.o)) was built for newer OSX version (10.14) than being linked (10.12) ld: warning: object file (/Users/buildslave/jenkins/workspace/lldb-cmake-standalone/clang-build/lib/libLLVMSupport.a(StringSaver.cpp.o)) was built for newer OSX version (10.14) than being linked (10.12) ld: warning: object file (/Users/buildslave/jenkins/workspace/lldb-cmake-standalone/clang-build/lib/libLLVMSupport.a(Threading.cpp.o)) was built for newer OSX version (10.14) than being linked (10.12) ld: warning: object file (/Users/buildslave/jenkins/workspace/lldb-cmake-standalone/clang-build/lib/libLLVMSupport.a(StringMap.cpp.o)) was built for newer OSX version (10.14) than being linked (10.12) ld: warning: object file (/Users/buildslave/jenkins/workspace/lldb-cmake-standalone/clang-build/lib/libLLVMDemangle.a(ItaniumDemangle.cpp.o)) was built for newer OSX version (10.14) than being linked (10.12) ld: warning: object file (/Users/buildslave/jenkins/workspace/lldb-cmake-standalone/clang-build/lib/libLLVMSupport.a(Debug.cpp.o)) was built for newer OSX version (10.14) than being linked (10.12) ld: warning: object file (/Users/buildslave/jenkins/workspace/lldb-cmake-standalone/clang-build/lib/libLLVMSupport.a(SmallPtrSet.cpp.o)) was built for newer OSX version (10.14) than being linked (10.12) ld: warning: object file (/Users/buildslave/jenkins/workspace/lldb-cmake-standalone/clang-build/lib/libLLVMSupport.a(CrashRecoveryContext.cpp.o)) was built for newer OSX version (10.14) than being linked (10.12) ld: warning: object file (/Users/buildslave/jenkins/workspace/lldb-cmake-standalone/clang-build/lib/libLLVMSupport.a(ConvertUTFWrapper.cpp.o)) was built for newer OSX version (10.14) than being linked (10.12) ld: warning: object file (/Users/buildslave/jenkins/workspace/lldb-cmake-standalone/clang-build/lib/libLLVMSupport.a(MD5.cpp.o)) was built for newer OSX version (10.14) than being linked (10.12) ld: warning: object file (/Users/buildslave/jenkins/workspace/lldb-cmake-standalone/clang-build/lib/libLLVMSupport.a(Host.cpp.o)) was built for newer OSX version (10.14) than being linked (10.12) ld: warning: object file (/Users/buildslave/jenkins/workspace/lldb-cmake-standalone/clang-build/lib/libLLVMSupport.a(VirtualFileSystem.cpp.o)) was built for newer OSX version (10.14) than being linked (10.12) ld: warning: object file (/Users/buildslave/jenkins/workspace/lldb-cmake-standalone/clang-build/lib/libLLVMSupport.a(APInt.cpp.o)) was built for newer OSX version (10.14) than being linked (10.12) ld: warning: object file (/Users/buildslave/jenkins/workspace/lldb-cmake-standalone/clang-build/lib/libLLVMSupport.a(Triple.cpp.o)) was built for newer OSX version (10.14) than being linked (10.12) ld: warning: object file (/Users/buildslave/jenkins/workspace/lldb-cmake-standalone/clang-build/lib/libLLVMSupport.a(Hashing.cpp.o)) was built for newer OSX version (10.14) than being linked (10.12) ld: warning: object file (/Users/buildslave/jenkins/workspace/lldb-cmake-standalone/clang-build/lib/libLLVMSupport.a(ManagedStatic.cpp.o)) was built for newer OSX version (10.14) than being linked (10.12) ld: warning: object file (/Users/buildslave/jenkins/workspace/lldb-cmake-standalone/clang-build/lib/libLLVMSupport.a(Twine.cpp.o)) was built for newer OSX version (10.14) than being linked (10.12) ld: warning: object file (/Users/buildslave/jenkins/workspace/lldb-cmake-standalone/clang-build/lib/libLLVMSupport.a(regcomp.c.o)) was built for newer OSX version (10.14) than being linked (10.12) ld: warning: object file (/Users/buildslave/jenkins/workspace/lldb-cmake-standalone/clang-build/lib/libLLVMSupport.a(regerror.c.o)) was built for newer OSX version (10.14) than being linked (10.12) ld: warning: object file (/Users/buildslave/jenkins/workspace/lldb-cmake-standalone/clang-build/lib/libLLVMSupport.a(regexec.c.o)) was built for newer OSX version (10.14) than being linked (10.12) ld: warning: object file (/Users/buildslave/jenkins/workspace/lldb-cmake-standalone/clang-build/lib/libLLVMSupport.a(regfree.c.o)) was built for newer OSX version (10.14) than being linked (10.12) ld: warning: object file (/Users/buildslave/jenkins/workspace/lldb-cmake-standalone/clang-build/lib/libLLVMSupport.a(MemoryBuffer.cpp.o)) was built for newer OSX version (10.14) than being linked (10.12) ld: warning: object file (/Users/buildslave/jenkins/workspace/lldb-cmake-standalone/clang-build/lib/libLLVMSupport.a(FoldingSet.cpp.o)) was built for newer OSX version (10.14) than being linked (10.12) ld: warning: object file (/Users/buildslave/jenkins/workspace/lldb-cmake-standalone/clang-build/lib/libLLVMSupport.a(ConvertUTF.cpp.o)) was built for newer OSX version (10.14) than being linked (10.12) ld: warning: object file (/Users/buildslave/jenkins/workspace/lldb-cmake-standalone/clang-build/lib/libLLVMSupport.a(circular_raw_ostream.cpp.o)) was built for newer OSX version (10.14) than being linked (10.12) ld: warning: object file (/Users/buildslave/jenkins/workspace/lldb-cmake-standalone/clang-build/lib/libLLVMSupport.a(ARMTargetParser.cpp.o)) was built for newer OSX version (10.14) than being linked (10.12) ld: warning: object file (/Users/buildslave/jenkins/workspace/lldb-cmake-standalone/clang-build/lib/libLLVMSupport.a(ThreadLocal.cpp.o)) was built for newer OSX version (10.14) than being linked (10.12) ld: warning: object file (/Users/buildslave/jenkins/workspace/lldb-cmake-standalone/clang-build/lib/libLLVMSupport.a(YAMLParser.cpp.o)) was built for newer OSX version (10.14) than being linked (10.12) ld: warning: object file (/Users/buildslave/jenkins/workspace/lldb-cmake-standalone/clang-build/lib/libLLVMSupport.a(SourceMgr.cpp.o)) was built for newer OSX version (10.14) than being linked (10.12) ld: warning: object file (/Users/buildslave/jenkins/workspace/lldb-cmake-standalone/clang-build/lib/libLLVMSupport.a(regstrlcpy.c.o)) was built for newer OSX version (10.14) than being linked (10.12) ld: warning: object file (/Users/buildslave/jenkins/workspace/lldb-cmake-standalone/clang-build/lib/libLLVMSupport.a(Locale.cpp.o)) was built for newer OSX version (10.14) than being linked (10.12) ld: warning: object file (/Users/buildslave/jenkins/workspace/lldb-cmake-standalone/clang-build/lib/libLLVMSupport.a(Unicode.cpp.o)) was built for newer OSX version (10.14) than being linked (10.12) ld: warning: object file (/Users/buildslave/jenkins/workspace/lldb-cmake-standalone/clang-build/lib/libLLVMSupport.a(WithColor.cpp.o)) was built for newer OSX version (10.14) than being linked (10.12)

Hide Details

PhaseScriptExecution CMake\ PostBuild\ Rules /Users/buildslave/jenkins/workspace/lldb-cmake-standalone/lldb-xcode-build/unittests/debugserver/lldb.build/Release/debugserverTests.build/Script-EF809A839F60442896278329.sh cd /Users/buildslave/jenkins/workspace/lldb-cmake-standalone/llvm-project/lldb /bin/sh -c /Users/buildslave/jenkins/workspace/lldb-cmake-standalone/lldb-xcode-build/unittests/debugserver/lldb.build/Release/debugserverTests.build/Script-EF809A839F60442896278329.sh /usr/local/Cellar/cmake/3.12.3/bin/cmake -E make_directory /Users/buildslave/jenkins/workspace/lldb-cmake-standalone/lldb-xcode-build/unittests/debugserver/Release/Inputs

Hide Details

=== BUILD AGGREGATE TARGET LLDBUnitTests OF PROJECT lldb WITH CONFIGURATION Release ===

Hide Details

Check dependencies

Hide Details

=== BUILD TARGET lit-cpuid OF PROJECT lldb WITH CONFIGURATION Release ===

Hide Details

Check dependencies

Hide Details

=== BUILD AGGREGATE TARGET lldb-test-deps OF PROJECT lldb WITH CONFIGURATION Release ===

Hide Details

Check dependencies

Hide Details

=== BUILD AGGREGATE TARGET check-lldb-shell OF PROJECT lldb WITH CONFIGURATION Release ===

Hide Details

Check dependencies

Hide Details

Write auxiliary files write-file /Users/buildslave/jenkins/workspace/lldb-cmake-standalone/lldb-xcode-build/test/Shell/lldb.build/Release/check-lldb-shell.build/Script-F53A625C68DD47ECB59ED9E9.sh chmod 0755 /Users/buildslave/jenkins/workspace/lldb-cmake-standalone/lldb-xcode-build/test/Shell/lldb.build/Release/check-lldb-shell.build/Script-F53A625C68DD47ECB59ED9E9.sh

Hide Details

PhaseScriptExecution CMake\ Rules /Users/buildslave/jenkins/workspace/lldb-cmake-standalone/lldb-xcode-build/test/Shell/lldb.build/Release/check-lldb-shell.build/Script-F53A625C68DD47ECB59ED9E9.sh cd /Users/buildslave/jenkins/workspace/lldb-cmake-standalone/llvm-project/lldb /bin/sh -c /Users/buildslave/jenkins/workspace/lldb-cmake-standalone/lldb-xcode-build/test/Shell/lldb.build/Release/check-lldb-shell.build/Script-F53A625C68DD47ECB59ED9E9.sh echo "Running lldb shell test suite" Running lldb shell test suite /usr/local/bin/python /Users/buildslave/jenkins/workspace/lldb-cmake-standalone/clang-build/bin/llvm-lit --param build_mode=Release /Users/buildslave/jenkins/workspace/lldb-cmake-standalone/lldb-xcode-build/test/Shell -- Testing: 312 tests, 16 workers -- llvm-lit: /Users/buildslave/jenkins/workspace/lldb-cmake-standalone/llvm-project/lldb/test/Shell/helper/toolchain.py:116: note: using SDKROOT: '/Applications/Xcode.app/Contents/Developer/Platforms/MacOSX.platform/Developer/SDKs/MacOSX10.14.sdk' llvm-lit: /Users/buildslave/jenkins/workspace/lldb-cmake-standalone/llvm-project/llvm/utils/lit/lit/llvm/config.py:342: note: using clang: /Users/buildslave/jenkins/workspace/lldb-cmake-standalone/clang-build/bin/clang UNSUPPORTED: lldb-shell :: Breakpoint/case-insensitive.test (1 of 312) UNSUPPORTED: lldb-shell :: Breakpoint/ppc64-localentry.test (2 of 312) UNSUPPORTED: lldb-shell :: BuildScript/toolchain-clang-cl.test (3 of 312) PASS: lldb-shell :: Breakpoint/debug_addrx.test (4 of 312) PASS: lldb-shell :: Breakpoint/debug_rnglist_rlestartend.test (5 of 312) PASS: lldb-shell :: Breakpoint/debug_rnglistx_rlex.test (6 of 312) PASS: lldb-shell :: Breakpoint/implicit_const_form_support.test (7 of 312) PASS: lldb-shell :: Breakpoint/debug_rnglist_offset_pair.test (8 of 312) UNSUPPORTED: lldb-shell :: BuildScript/toolchain-msvc.test (9 of 312) PASS: lldb-shell :: Breakpoint/debug_rnglist_basic.test (10 of 312) PASS: lldb-shell :: Breakpoint/split-dwarf-5-addrbase.test (11 of 312) PASS: lldb-shell :: Breakpoint/single-file-split-dwarf.test (12 of 312) PASS: lldb-shell :: Breakpoint/split-dwarf5-debug-stroffsets.test (13 of 312) PASS: lldb-shell :: Commands/command-regex-unalias.test (14 of 312) PASS: lldb-shell :: Commands/command-backtrace.test (15 of 312) PASS: lldb-shell :: Commands/command-regex-delete.test (16 of 312) PASS: lldb-shell :: Driver/TestCore.test (17 of 312) PASS: lldb-shell :: BuildScript/script-args.test (18 of 312) PASS: lldb-shell :: BuildScript/compiler-full-path.test (19 of 312) PASS: lldb-shell :: Breakpoint/case-sensitive.test (20 of 312) PASS: lldb-shell :: Driver/TestFile.test (21 of 312) PASS: lldb-shell :: BuildScript/toolchain-clang.test (22 of 312) PASS: lldb-shell :: Driver/TestNoUseColor.test (23 of 312) UNSUPPORTED: lldb-shell :: ExecControl/StopHook/stop-hook-threads.test (24 of 312) PASS: lldb-shell :: Driver/TestProcessAttach.test (25 of 312) PASS: lldb-shell :: Driver/TestRepl.test (26 of 312) UNSUPPORTED: lldb-shell :: Expr/TestIRMemoryMapWindows.test (27 of 312) PASS: lldb-shell :: Commands/command-source.test (28 of 312) PASS: lldb-shell :: Expr/TestMultilineExpr.test (29 of 312) PASS: lldb-shell :: Breakpoint/dummy-target.test (30 of 312) PASS: lldb-shell :: Driver/TestCommands.test (31 of 312) PASS: lldb-shell :: Expr/TestTypeOfDeclTypeExpr.test (32 of 312) UNSUPPORTED: lldb-shell :: Minidump/Windows/arm-fp-unwind.test (33 of 312) PASS: lldb-shell :: Minidump/Windows/Sigsegv/sigsegv.test (34 of 312) PASS: lldb-shell :: Minidump/Windows/broken-unwind.test (35 of 312) PASS: lldb-shell :: Commands/CommandScriptImmediateOutput/CommandScriptImmediateOutputConsole.test (36 of 312) PASS: lldb-shell :: Minidump/Windows/find-module.test (37 of 312) PASS: lldb-shell :: Minidump/disassemble-no-module.yaml (38 of 312) PASS: lldb-shell :: Minidump/breakpad-symbols.test (39 of 312) PASS: lldb-shell :: BuildScript/modes.test (40 of 312) PASS: lldb-shell :: Commands/CommandScriptImmediateOutput/CommandScriptImmediateOutputFile.test (41 of 312) PASS: lldb-shell :: Driver/LocalLLDBInit.test (42 of 312) PASS: lldb-shell :: Minidump/memory-region.yaml (43 of 312) PASS: lldb-shell :: Minidump/no-process-id.yaml (44 of 312) PASS: lldb-shell :: ObjectFile/Breakpad/discontiguous-sections.test (45 of 312) PASS: lldb-shell :: Minidump/memory-region-from-module.yaml (46 of 312) PASS: lldb-shell :: ObjectFile/Breakpad/sections-trailing-func.test (47 of 312) PASS: lldb-shell :: ObjectFile/Breakpad/sections.test (48 of 312) PASS: lldb-shell :: ObjectFile/Breakpad/uuid-matching-mac.test (49 of 312) PASS: lldb-shell :: ObjectFile/ELF/PT_LOAD-empty.yaml (50 of 312) PASS: lldb-shell :: ObjectFile/ELF/PT_LOAD-overlap-PT_INTERP.yaml (51 of 312) PASS: lldb-shell :: ObjectFile/ELF/PT_LOAD-overlap-section.yaml (52 of 312) PASS: lldb-shell :: Driver/TestSingleQuote.test (53 of 312) PASS: lldb-shell :: Driver/TestTarget.test (54 of 312) PASS: lldb-shell :: ObjectFile/ELF/PT_LOAD-overlap.yaml (55 of 312) PASS: lldb-shell :: ObjectFile/ELF/PT_LOAD-overlap-PT_TLS.yaml (56 of 312) PASS: lldb-shell :: ObjectFile/ELF/PT_LOAD.yaml (57 of 312) UNSUPPORTED: lldb-shell :: ObjectFile/ELF/basic-info.yaml (58 of 312) PASS: lldb-shell :: ObjectFile/ELF/aarch64-relocations.yaml (59 of 312) PASS: lldb-shell :: ObjectFile/Breakpad/breakpad-identification.test (60 of 312) PASS: lldb-shell :: ObjectFile/ELF/avr-basic-info.yaml (61 of 312) PASS: lldb-shell :: ObjectFile/ELF/base-address.yaml (62 of 312) PASS: lldb-shell :: ObjectFile/ELF/PT_TLS-overlap-PT_LOAD.yaml (63 of 312) PASS: lldb-shell :: ObjectFile/ELF/build-id-case.yaml (64 of 312) PASS: lldb-shell :: ObjectFile/ELF/compressed-sections.yaml (65 of 312) UNSUPPORTED: lldb-shell :: ObjectFile/ELF/minidebuginfo-no-lzma.yaml (66 of 312) UNSUPPORTED: lldb-shell :: ObjectFile/ELF/minidebuginfo-set-and-hit-breakpoint.test (67 of 312) PASS: lldb-shell :: ObjectFile/ELF/duplicate-section.yaml (68 of 312) PASS: lldb-shell :: ObjectFile/ELF/gnu-debuglink.yaml (69 of 312) PASS: lldb-shell :: ObjectFile/ELF/minidebuginfo-corrupt-xz.yaml (70 of 312) PASS: lldb-shell :: ObjectFile/ELF/minidebuginfo-find-symbols.yaml (71 of 312) PASS: lldb-shell :: ObjectFile/ELF/netbsd-core-amd64.test (72 of 312) PASS: lldb-shell :: ObjectFile/ELF/netbsd-exec-8.99.30-amd64.yaml (73 of 312) PASS: lldb-shell :: ObjectFile/ELF/section-addresses.yaml (74 of 312) PASS: lldb-shell :: ObjectFile/ELF/section-overlap.yaml (75 of 312) PASS: lldb-shell :: ObjectFile/ELF/section-types-edgecases.yaml (76 of 312) PASS: lldb-shell :: ObjectFile/ELF/section-permissions.yaml (77 of 312) PASS: lldb-shell :: ObjectFile/ELF/section-types.yaml (78 of 312) PASS: lldb-shell :: ObjectFile/ELF/short-build-id.yaml (79 of 312) PASS: lldb-shell :: Commands/command-script-import.test (80 of 312) PASS: lldb-shell :: ObjectFile/MachO/lc_build_version.yaml (81 of 312) PASS: lldb-shell :: ObjectFile/MachO/lc_version_min.yaml (82 of 312) PASS: lldb-shell :: ObjectFile/MachO/lc_build_version_notools.yaml (83 of 312) UNSUPPORTED: lldb-shell :: ObjectFile/PECOFF/dep-modules.yaml (84 of 312) UNSUPPORTED: lldb-shell :: ObjectFile/PECOFF/disassemble-thumb.yaml (85 of 312) UNSUPPORTED: lldb-shell :: ObjectFile/PECOFF/export-dllfunc.yaml (86 of 312) PASS: lldb-shell :: Breakpoint/jitbp_elf.test (87 of 312) PASS: lldb-shell :: ObjectFile/MachO/subsections.yaml (88 of 312) PASS: lldb-shell :: Driver/TestConvenienceVariables.test (89 of 312) PASS: lldb-shell :: Minidump/fb-dump.test (90 of 312) PASS: lldb-shell :: ObjectFile/PECOFF/basic-info-arm.yaml (91 of 312) PASS: lldb-shell :: ObjectFile/PECOFF/basic-info-arm64.yaml (92 of 312) UNSUPPORTED: lldb-shell :: ObjectFile/PECOFF/uuid.yaml (93 of 312) PASS: lldb-shell :: ObjectFile/PECOFF/basic-info.yaml (94 of 312) PASS: lldb-shell :: ObjectFile/PECOFF/section-types.yaml (95 of 312) PASS: lldb-shell :: ObjectFile/PECOFF/invalid-export-table.yaml (96 of 312) PASS: lldb-shell :: ObjectFile/PECOFF/sections-names.yaml (97 of 312) UNSUPPORTED: lldb-shell :: Process/Windows/exception_access_violation.cpp (98 of 312) PASS: lldb-shell :: Commands/command-breakpoint-col.test (99 of 312) PASS: lldb-shell :: ObjectFile/PECOFF/sections.yaml (100 of 312) PASS: lldb-shell :: ObjectFile/wasm/basic.yaml (101 of 312) PASS: lldb-shell :: ObjectFile/wasm/embedded-debug-sections.yaml (102 of 312) PASS: lldb-shell :: ObjectFile/PECOFF/symbol.yaml (103 of 312) PASS: lldb-shell :: ObjectFile/wasm/stripped-debug-sections.yaml (104 of 312) PASS: lldb-shell :: ObjectFile/MachO/symtab.yaml (105 of 312) PASS: lldb-shell :: ObjectFile/wasm/unified-debug-sections.yaml (106 of 312) PASS: lldb-shell :: Quit/TestQuitExitCode0.test (107 of 312) UNSUPPORTED: lldb-shell :: Register/aarch64-fp-read.test (108 of 312) UNSUPPORTED: lldb-shell :: Register/aarch64-gp-read.test (109 of 312) UNSUPPORTED: lldb-shell :: Register/arm-fp-read.test (110 of 312) UNSUPPORTED: lldb-shell :: Register/arm-gp-read.test (111 of 312) PASS: lldb-shell :: Quit/TestQuitExitCodeHex0.test (112 of 312) PASS: lldb-shell :: Quit/TestQuitExitCodeImplicit0.test (113 of 312) UNSUPPORTED: lldb-shell :: Register/x86-64-gp-write.test (114 of 312) PASS: lldb-shell :: Quit/TestQuitExitCodeNonInt.test (115 of 312) UNSUPPORTED: lldb-shell :: Register/x86-64-xmm16-read.test (116 of 312) UNSUPPORTED: lldb-shell :: Register/x86-64-xmm16-write.test (117 of 312) PASS: lldb-shell :: Quit/TestQuitExitCodeTooManyArgs.test (118 of 312) PASS: lldb-shell :: Quit/TestQuitExitCode-30.test (119 of 312) UNSUPPORTED: lldb-shell :: Register/x86-64-ymm16-read.test (120 of 312) UNSUPPORTED: lldb-shell :: Register/x86-64-ymm16-write.test (121 of 312) UNSUPPORTED: lldb-shell :: Register/x86-64-zmm-read.test (122 of 312) UNSUPPORTED: lldb-shell :: Register/x86-64-zmm-write.test (123 of 312) UNSUPPORTED: lldb-shell :: Register/x86-gp-read.test (124 of 312) UNSUPPORTED: lldb-shell :: Register/x86-gp-write.test (125 of 312) PASS: lldb-shell :: Quit/TestQuitExitCode30.test (126 of 312) PASS: lldb-shell :: Quit/TestQuitExitCodeHexA.test (127 of 312) UNSUPPORTED: lldb-shell :: Register/x86-ymm-read.test (128 of 312) UNSUPPORTED: lldb-shell :: Register/x86-ymm-write.test (129 of 312) UNSUPPORTED: lldb-shell :: Register/x86-zmm-read.test (130 of 312) UNSUPPORTED: lldb-shell :: Register/x86-zmm-write.test (131 of 312) PASS: lldb-shell :: Minidump/dump-all.test (132 of 312) PASS: lldb-shell :: Host/TestCustomShell.test (133 of 312) PASS: lldb-shell :: Register/x86-64-gp-read.test (134 of 312) PASS: lldb-shell :: Register/x86-64-read.test (135 of 312) PASS: lldb-shell :: Register/x86-64-ymm-read.test (136 of 312) XFAIL: lldb-shell :: Register/x86-mm-xmm-read.test (137 of 312) XFAIL: lldb-shell :: Register/x86-64-write.test (138 of 312) XFAIL: lldb-shell :: Register/x86-mm-xmm-write.test (139 of 312) PASS: lldb-shell :: Reproducer/TestCrash.test (140 of 312) PASS: lldb-shell :: Recognizer/assert.test (141 of 312) XFAIL: lldb-shell :: Register/x86-64-ymm-write.test (142 of 312) PASS: lldb-shell :: Reproducer/TestDriverOptions.test (143 of 312) PASS: lldb-shell :: Heap/heap-cstr.test (144 of 312) PASS: lldb-shell :: Reproducer/TestCaptureEnvOverride.test (145 of 312) PASS: lldb-shell :: ObjectFile/ELF/many-sections.s (146 of 312) PASS: lldb-shell :: Reproducer/TestDiscard.test (147 of 312) PASS: lldb-shell :: Reproducer/Functionalities/TestDataFormatter.test (148 of 312) PASS: lldb-shell :: Reproducer/TestSynchronous.test (149 of 312) UNSUPPORTED: lldb-shell :: ScriptInterpreter/Lua/bindings.test (150 of 312) UNSUPPORTED: lldb-shell :: ScriptInterpreter/Lua/breakpoint_callback.test (151 of 312) UNSUPPORTED: lldb-shell :: ScriptInterpreter/Lua/command_script_import.test (152 of 312) UNSUPPORTED: lldb-shell :: ScriptInterpreter/Lua/convenience_variables.test (153 of 312) UNSUPPORTED: lldb-shell :: ScriptInterpreter/Lua/independent_state.test (154 of 312) UNSUPPORTED: lldb-shell :: ScriptInterpreter/Lua/lua.test (155 of 312) UNSUPPORTED: lldb-shell :: ScriptInterpreter/Lua/nested_sessions.test (156 of 312) UNSUPPORTED: lldb-shell :: ScriptInterpreter/Lua/persistent_state.test (157 of 312) UNSUPPORTED: lldb-shell :: ScriptInterpreter/Lua/watchpoint_callback.test (158 of 312) PASS: lldb-shell :: ScriptInterpreter/None/import_module.test (159 of 312) PASS: lldb-shell :: ScriptInterpreter/None/none.test (160 of 312) PASS: lldb-shell :: Reproducer/Functionalities/TestImageList.test (161 of 312) PASS: lldb-shell :: ScriptInterpreter/Python/crashlog.test (162 of 312) PASS: lldb-shell :: Settings/TestDisableColor.test (163 of 312) PASS: lldb-shell :: Process/TestEnvironment.test (164 of 312) PASS: lldb-shell :: Reproducer/Functionalities/TestStepping.test (165 of 312) PASS: lldb-shell :: Settings/TestDisassemblyFormat.test (166 of 312) PASS: lldb-shell :: Reproducer/Modules/TestModuleCXX.test (167 of 312) PASS: lldb-shell :: ScriptInterpreter/Python/scripted_breakpoint.test (168 of 312) PASS: lldb-shell :: Reproducer/TestFileRepro.test (169 of 312) PASS: lldb-shell :: Settings/TestModuleCacheSanity.test (170 of 312) PASS: lldb-shell :: Settings/TestEchoCommands.test (171 of 312) PASS: lldb-shell :: Settings/TestSettingsSet.test (172 of 312) PASS: lldb-shell :: Reproducer/Functionalities/TestExpressionEvaluation.test (173 of 312) PASS: lldb-shell :: SymbolFile/Breakpad/line-table-discontinuous-file-ids.test (174 of 312) PASS: lldb-shell :: Reproducer/TestDump.test (175 of 312) PASS: lldb-shell :: SymbolFile/Breakpad/line-table-edgecases.test (176 of 312) PASS: lldb-shell :: SymbolFile/Breakpad/line-table-missing-file.test (177 of 312) PASS: lldb-shell :: Reproducer/TestRelativePath.test (178 of 312) PASS: lldb-shell :: SymbolFile/Breakpad/line-table-mixed-path-styles.test (179 of 312) PASS: lldb-shell :: SymbolFile/Breakpad/line-table.test (180 of 312) PASS: lldb-shell :: SymbolFile/Breakpad/stack-cfi-parsing.test (181 of 312) PASS: lldb-shell :: SymbolFile/Breakpad/symtab-macho.test (182 of 312) PASS: lldb-shell :: SymbolFile/Breakpad/symtab.test (183 of 312) PASS: lldb-shell :: Settings/TestStopCommandSourceOnError.test (184 of 312) PASS: lldb-shell :: SymbolFile/Breakpad/unwind-via-raSearch.test (185 of 312) PASS: lldb-shell :: SymbolFile/Breakpad/unwind-via-stack-cfi.test (186 of 312) PASS: lldb-shell :: Settings/TestSettingsWrite.test (187 of 312) PASS: lldb-shell :: SymbolFile/DWARF/DW_AT_loclists_base.s (188 of 312) PASS: lldb-shell :: SymbolFile/Breakpad/unwind-via-stack-win.test (189 of 312) UNSUPPORTED: lldb-shell :: SymbolFile/DWARF/array-sizes.s (190 of 312) PASS: lldb-shell :: SymbolFile/DWARF/DW_AT_low_pc-addrx.s (191 of 312) PASS: lldb-shell :: SymbolFile/DWARF/DW_OP_piece-smaller-than-struct.s (192 of 312) PASS: lldb-shell :: SymbolFile/DWARF/DW_OP_piece-struct.s (193 of 312) PASS: lldb-shell :: SymbolFile/DWARF/childless-compile-unit.s (194 of 312) UNSUPPORTED: lldb-shell :: SymbolFile/DWARF/debug-line-basic.s (195 of 312) UNSUPPORTED: lldb-shell :: SymbolFile/DWARF/debug-names-compressed.cpp (196 of 312) UNSUPPORTED: lldb-shell :: SymbolFile/DWARF/debug-types-address-ranges.s (197 of 312) UNSUPPORTED: lldb-shell :: SymbolFile/DWARF/debug-types-basic.test (198 of 312) PASS: lldb-shell :: SymbolFile/DWARF/apple-index-is-used.cpp (199 of 312) UNSUPPORTED: lldb-shell :: SymbolFile/DWARF/debug-types-dwo-cross-reference.cpp (200 of 312) UNSUPPORTED: lldb-shell :: SymbolFile/DWARF/debug-types-expressions.test (201 of 312) PASS: lldb-shell :: SymbolFile/DWARF/anon_class_w_and_wo_export_symbols.ll (202 of 312) PASS: lldb-shell :: SymbolFile/DWARF/clang-ast-from-dwarf-objc-property.m (203 of 312) UNSUPPORTED: lldb-shell :: SymbolFile/DWARF/debug-types-signature-loop.s (204 of 312) PASS: lldb-shell :: SymbolFile/DWARF/clang-ast-from-dwarf-unamed-and-anon-structs.cpp (205 of 312) PASS: lldb-shell :: SymbolFile/DWARF/debug-types-dwarf5.s (206 of 312) PASS: lldb-shell :: SymbolFile/DWARF/debug-types-line-tables.s (207 of 312) PASS: lldb-shell :: SymbolFile/DWARF/debug_aranges-empty-section.s (208 of 312) PASS: lldb-shell :: SymbolFile/DWARF/debug_line-relative_path.s (209 of 312) PASS: lldb-shell :: SymbolFile/DWARF/debug_loc-aslr.s (210 of 312) PASS: lldb-shell :: Reproducer/TestMultipleTargets.test (211 of 312) PASS: lldb-shell :: SymbolFile/DWARF/debug_loc_and_loclists.s (212 of 312) UNSUPPORTED: lldb-shell :: SymbolFile/DWARF/debug_ranges_and_rnglists.test (213 of 312) PASS: lldb-shell :: SymbolFile/DWARF/debug_loclists-dwo.s (214 of 312) PASS: lldb-shell :: SymbolFile/DWARF/debug_loc.s (215 of 312) PASS: lldb-shell :: SymbolFile/DWARF/debug_ranges-missing-section.s (216 of 312) UNSUPPORTED: lldb-shell :: SymbolFile/DWARF/dir-separator-no-comp-dir-relative-name.s (217 of 312) PASS: lldb-shell :: SymbolFile/DWARF/debug_ranges.s (218 of 312) UNSUPPORTED: lldb-shell :: SymbolFile/DWARF/dir-separator-no-comp-dir.s (219 of 312) UNSUPPORTED: lldb-shell :: SymbolFile/DWARF/dir-separator-posix.s (220 of 312) UNSUPPORTED: lldb-shell :: SymbolFile/DWARF/dir-separator-windows.s (221 of 312) PASS: lldb-shell :: SymbolFile/DWARF/debug_rnglists-dwo.s (222 of 312) UNSUPPORTED: lldb-shell :: SymbolFile/DWARF/dwarf5-index-is-used.cpp (223 of 312) PASS: lldb-shell :: SymbolFile/DWARF/compilercontext.ll (224 of 312) UNSUPPORTED: lldb-shell :: SymbolFile/DWARF/dwarf5-partial-index.cpp (225 of 312) UNSUPPORTED: lldb-shell :: SymbolFile/DWARF/dwarf5_locations.s (226 of 312) PASS: lldb-shell :: SymbolFile/DWARF/debug_rnglists.s (227 of 312) UNSUPPORTED: lldb-shell :: SymbolFile/DWARF/dwp-separate-debug-file.cpp (228 of 312) UNSUPPORTED: lldb-shell :: SymbolFile/DWARF/find-basic-function.cpp (229 of 312) PASS: lldb-shell :: Reproducer/TestWorkingDir.test (230 of 312) UNSUPPORTED: lldb-shell :: SymbolFile/DWARF/find-basic-namespace.cpp (231 of 312) UNSUPPORTED: lldb-shell :: SymbolFile/DWARF/find-basic-type.cpp (232 of 312) UNSUPPORTED: lldb-shell :: SymbolFile/DWARF/find-basic-variable.cpp (233 of 312) UNSUPPORTED: lldb-shell :: SymbolFile/DWARF/find-function-regex.cpp (234 of 312) UNSUPPORTED: lldb-shell :: SymbolFile/DWARF/find-inline-method.s (235 of 312) UNSUPPORTED: lldb-shell :: SymbolFile/DWARF/find-method.cpp (236 of 312) PASS: lldb-shell :: SymbolFile/DWARF/dwarf5-debug_line.s (237 of 312) UNSUPPORTED: lldb-shell :: SymbolFile/DWARF/find-type-in-function.cpp (238 of 312) UNSUPPORTED: lldb-shell :: SymbolFile/DWARF/find-variable-dwo.cpp (239 of 312) UNSUPPORTED: lldb-shell :: SymbolFile/DWARF/find-variable-file.cpp (240 of 312) PASS: lldb-shell :: SymbolFile/DWARF/dwarf5-atomic.s (241 of 312) PASS: lldb-shell :: Settings/TestFrameFormatColor.test (242 of 312) UNSUPPORTED: lldb-shell :: SymbolFile/DWARF/inline-function-address-shared.test (243 of 312) UNSUPPORTED: lldb-shell :: SymbolFile/DWARF/inline-function-address.ll (244 of 312) PASS: lldb-shell :: Settings/TestFrameFormatMangling.test (245 of 312) PASS: lldb-shell :: SymbolFile/DWARF/find-method-local-struct.cpp (246 of 312) PASS: lldb-shell :: SymbolFile/DWARF/find-qualified-variable.cpp (247 of 312) UNSUPPORTED: lldb-shell :: SymbolFile/DWARF/win-i386-line-table.s (248 of 312) UNSUPPORTED: lldb-shell :: SymbolFile/NativePDB/ast-functions-msvc.cpp (249 of 312) UNSUPPORTED: lldb-shell :: SymbolFile/NativePDB/ast-functions.cpp (250 of 312) UNSUPPORTED: lldb-shell :: SymbolFile/NativePDB/ast-methods.cpp (251 of 312) UNSUPPORTED: lldb-shell :: SymbolFile/NativePDB/ast-types.cpp (252 of 312) UNSUPPORTED: lldb-shell :: SymbolFile/NativePDB/bitfields.cpp (253 of 312) UNSUPPORTED: lldb-shell :: SymbolFile/NativePDB/break-by-function.cpp (254 of 312) UNSUPPORTED: lldb-shell :: SymbolFile/NativePDB/break-by-line.cpp (255 of 312) UNSUPPORTED: lldb-shell :: SymbolFile/NativePDB/disassembly.cpp (256 of 312) UNSUPPORTED: lldb-shell :: SymbolFile/NativePDB/function-types-builtins.cpp (257 of 312) UNSUPPORTED: lldb-shell :: SymbolFile/NativePDB/function-types-calling-conv.cpp (258 of 312) UNSUPPORTED: lldb-shell :: SymbolFile/NativePDB/function-types-classes.cpp (259 of 312) UNSUPPORTED: lldb-shell :: SymbolFile/NativePDB/global-classes.cpp (260 of 312) UNSUPPORTED: lldb-shell :: SymbolFile/NativePDB/globals-bss.cpp (261 of 312) UNSUPPORTED: lldb-shell :: SymbolFile/NativePDB/globals-fundamental.cpp (262 of 312) UNSUPPORTED: lldb-shell :: SymbolFile/NativePDB/local-variables.cpp (263 of 312) UNSUPPORTED: lldb-shell :: SymbolFile/NativePDB/nested-types.cpp (264 of 312) UNSUPPORTED: lldb-shell :: SymbolFile/NativePDB/s_constant.cpp (265 of 312) UNSUPPORTED: lldb-shell :: SymbolFile/NativePDB/source-list.cpp (266 of 312) UNSUPPORTED: lldb-shell :: SymbolFile/NativePDB/stack_unwinding01.cpp (267 of 312) UNSUPPORTED: lldb-shell :: SymbolFile/NativePDB/tag-types.cpp (268 of 312) UNSUPPORTED: lldb-shell :: SymbolFile/NativePDB/typedefs.cpp (269 of 312) UNSUPPORTED: lldb-shell :: SymbolFile/PDB/ast-restore.test (270 of 312) UNSUPPORTED: lldb-shell :: SymbolFile/PDB/calling-conventions.test (271 of 312) UNSUPPORTED: lldb-shell :: SymbolFile/PDB/class-layout.test (272 of 312) PASS: lldb-shell :: SymbolFile/DWARF/forward-declarations.s (273 of 312) UNSUPPORTED: lldb-shell :: SymbolFile/PDB/compilands.test (274 of 312) FAIL: lldb-shell :: SymbolFile/DWARF/dwp-debug-types.s (275 of 312) UNSUPPORTED: lldb-shell :: SymbolFile/PDB/enums-layout.test (276 of 312) UNSUPPORTED: lldb-shell :: SymbolFile/PDB/expressions.test (277 of 312) UNSUPPORTED: lldb-shell :: SymbolFile/PDB/function-level-linking.test (278 of 312) UNSUPPORTED: lldb-shell :: SymbolFile/PDB/func-symbols.test (279 of 312) UNSUPPORTED: lldb-shell :: SymbolFile/PDB/function-nested-block.test (280 of 312) UNSUPPORTED: lldb-shell :: SymbolFile/PDB/pointers.test (281 of 312) UNSUPPORTED: lldb-shell :: SymbolFile/PDB/type-quals.test (282 of 312) UNSUPPORTED: lldb-shell :: SymbolFile/PDB/typedefs.test (283 of 312) UNSUPPORTED: lldb-shell :: SymbolFile/PDB/udt-layout.test (284 of 312) UNSUPPORTED: lldb-shell :: SymbolFile/PDB/variables-locations.test (285 of 312) UNSUPPORTED: lldb-shell :: SymbolFile/PDB/variables.test (286 of 312) UNSUPPORTED: lldb-shell :: SymbolFile/PDB/vbases.test (287 of 312) UNSUPPORTED: lldb-shell :: SymbolFile/dissassemble-entry-point.s (288 of 312) UNSUPPORTED: lldb-shell :: SymbolFile/target-symbols-add-unwind.test (289 of 312) UNSUPPORTED: lldb-shell :: Unwind/eh-frame-small-fde.test (290 of 312) PASS: lldb-shell :: SymbolFile/DWARF/dwp.s (291 of 312) PASS: lldb-shell :: SymbolFile/DWARF/gnu-style-compression.cpp (292 of 312) PASS: lldb-shell :: SymbolFile/DWARF/split-dwarf-multiple-cu.ll (293 of 312) UNSUPPORTED: lldb-shell :: Unwind/unwind-plan-dwarf-dump.test (294 of 312) PASS: lldb-shell :: SymbolFile/DWARF/parallel-indexing-stress.s (295 of 312) PASS: lldb-shell :: ExecControl/StopHook/stop-hook.test (296 of 312) UNSUPPORTED: lldb-shell :: Watchpoint/netbsd-nouserdbregs.test (297 of 312) PASS: lldb-shell :: SymbolFile/DWARF/split-dwarf-inlining.cpp (298 of 312) PASS: lldb-shell :: VSCode/TestOptions.test (299 of 312) PASS: lldb-shell :: SymbolFile/symbol-binding.test (300 of 312) PASS: lldb-shell :: Settings/TestFrameFormatNoColor.test (301 of 312) PASS: lldb-shell :: SymbolFile/DWARF/debug-types-missing-signature.test (302 of 312) PASS: lldb-shell :: Reproducer/TestVersionCheck.test (303 of 312) PASS: lldb-shell :: SymbolFile/DWARF/deterministic-build.cpp (304 of 312) PASS: lldb-shell :: Expr/TestIRMemoryMap.test (305 of 312) PASS: lldb-shell :: Unwind/eh-frame-dwarf-unwind.test (306 of 312) PASS: lldb-shell :: Unwind/thread-step-out-ret-addr-check.test (307 of 312) PASS: lldb-shell :: Unwind/trap_frame_sym_ctx.test (308 of 312) PASS: lldb-shell :: Reproducer/TestGDBRemoteRepro.test (309 of 312) PASS: lldb-shell :: Reproducer/TestReuseDirectory.test (310 of 312) XFAIL: lldb-shell :: Unwind/prefer-debug-over-eh-frame.test (311 of 312) PASS: lldb-shell :: Watchpoint/SetErrorCases.test (312 of 312)

Hide Details

Testing Time: 6.05s ******************** Failing Tests (1): lldb-shell :: SymbolFile/DWARF/dwp-debug-types.s

Hide Details

Expected Passes : 193 Expected Failures : 5 Unsupported Tests : 113 Unexpected Failures: 1 make: *** [/Users/buildslave/jenkins/workspace/lldb-cmake-standalone/lldb-xcode-build/test/Shell/CMakeFiles/check-lldb-shell] Error 1

Hide Details

** BUILD FAILED **

Hide Details

Hide Details

The following build commands failed: PhaseScriptExecution CMake\ Rules /Users/buildslave/jenkins/workspace/lldb-cmake-standalone/lldb-xcode-build/test/Shell/lldb.build/Release/check-lldb-shell.build/Script-F53A625C68DD47ECB59ED9E9.sh (1 failure) Command failed: Command '['/usr/bin/env', 'TERM=vt100', '/usr/local/bin/cmake', '--build', '.', '--config', 'Release', '--target', 'check-lldb-shell']' returned non-zero exit status 65. Command: ['/usr/bin/env', 'TERM=vt100', '/usr/local/bin/cmake', '--build', '.', '--config', 'Release', '--target', 'check-lldb-shell'] [Pipeline] } [Pipeline] // timeout [Pipeline] } [Pipeline] // stage [Pipeline] stage [Pipeline] { (Declarative: Post Actions) [Pipeline] emailext Not sending mail to unregistered user sguelton@redhat.com because your SCM claimed this was associated with a user ID ‘sguelton' which your security realm does not recognize; you may need changes in your SCM plugin Not sending mail to unregistered user thakis@chromium.org because your SCM claimed this was associated with a user ID ‘thakis' which your security realm does not recognize; you may need changes in your SCM plugin Not sending mail to unregistered user sd.fertile@gmail.com because your SCM claimed this was associated with a user ID ‘sd.fertile' which your security realm does not recognize; you may need changes in your SCM plugin Not sending mail to unregistered user peter@pcc.me.uk because your SCM claimed this was associated with a user ID ‘peter' which your security realm does not recognize; you may need changes in your SCM plugin Not sending mail to unregistered user llvm-dev@redking.me.uk because your SCM claimed this was associated with a user ID ‘llvm-dev' which your security realm does not recognize; you may need changes in your SCM plugin Not sending mail to unregistered user sguelton@redhat.com because your SCM claimed this was associated with a user ID ‘sguelton' which your security realm does not recognize; you may need changes in your SCM plugin Not sending mail to unregistered user thakis@chromium.org because your SCM claimed this was associated with a user ID ‘thakis' which your security realm does not recognize; you may need changes in your SCM plugin Not sending mail to unregistered user sd.fertile@gmail.com because your SCM claimed this was associated with a user ID ‘sd.fertile' which your security realm does not recognize; you may need changes in your SCM plugin Not sending mail to unregistered user peter@pcc.me.uk because your SCM claimed this was associated with a user ID ‘peter' which your security realm does not recognize; you may need changes in your SCM plugin Not sending mail to unregistered user llvm-dev@redking.me.uk because your SCM claimed this was associated with a user ID ‘llvm-dev' which your security realm does not recognize; you may need changes in your SCM plugin

Hide Details

Begin Pre-Send Script... Sending email to: mschifer@apple.com ldionne@apple.com Erik Pilkington <epilkington@apple.com> Azhar Mohammed <azhar@apple.com>
[Pipeline] } [Pipeline] // stage [Pipeline] } [Pipeline] // withEnv [Pipeline] } [Pipeline] // node [Pipeline] End of Pipeline ERROR: script returned exit code 1 Finished: FAILURE