Failed

Clangd Unit Tests._/ClangdTests.FindExplicitReferencesTest.All (from Clangd Unit Tests)

Failing for the past 4 builds (Since Failed#15350 )
Took 0.82 sec.

Stacktrace

Note: Google Test filter = FindExplicitReferencesTest.All
[==========] Running 1 test from 1 test case.
[----------] Global test environment set-up.
[----------] 1 test from FindExplicitReferencesTest
[ RUN      ] FindExplicitReferencesTest.All
/Users/buildslave/jenkins/workspace/clang-stage1-cmake-RA-expensive/llvm-project/clang-tools-extra/clangd/unittests/FindTargetTests.cpp:981: Failure
      Expected: ExpectedRefs
      Which is: "0: targets = {ns1::func, ns2::func}\n1: targets = {t}\n"
To be equal to: Actual.DumpedReferences
      Which is: "0: targets = {ns2::func, ns1::func}\n1: targets = {t}\n"
With diff:
@@ -1,2 +1,2 @@
-0: targets = {ns1::func, ns2::func}
+0: targets = {ns2::func, ns1::func}
 1: targets = {t}\n


            namespace ns1 { void func(char*); }
            namespace ns2 { void func(int*); }
            using namespace ns1;
            using namespace ns2;

            template <class T>
            void foo(T t) {
              $0^func($1^t);
            }
        
[  FAILED  ] FindExplicitReferencesTest.All (728 ms)
[----------] 1 test from FindExplicitReferencesTest (728 ms total)

[----------] Global test environment tear-down
[==========] 1 test from 1 test case ran. (729 ms total)
[  PASSED  ] 0 tests.
[  FAILED  ] 1 test, listed below:
[  FAILED  ] FindExplicitReferencesTest.All

 1 FAILED TEST
Building first preamble for /clangd-test/TestTU.cpp
Built preamble of size 204288 for file /clangd-test/TestTU.cpp
Building first preamble for /clangd-test/TestTU.cpp
Built preamble of size 204288 for file /clangd-test/TestTU.cpp
Building first preamble for /clangd-test/TestTU.cpp
Built preamble of size 204288 for file /clangd-test/TestTU.cpp
Building first preamble for /clangd-test/TestTU.cpp
Built preamble of size 204288 for file /clangd-test/TestTU.cpp
Building first preamble for /clangd-test/TestTU.cpp
Built preamble of size 204288 for file /clangd-test/TestTU.cpp
Building first preamble for /clangd-test/TestTU.cpp
Built preamble of size 204288 for file /clangd-test/TestTU.cpp
Building first preamble for /clangd-test/TestTU.cpp
Built preamble of size 204288 for file /clangd-test/TestTU.cpp
Building first preamble for /clangd-test/TestTU.cpp
Built preamble of size 204288 for file /clangd-test/TestTU.cpp
Building first preamble for /clangd-test/TestTU.cpp
Built preamble of size 204288 for file /clangd-test/TestTU.cpp
Building first preamble for /clangd-test/TestTU.cpp
Built preamble of size 204288 for file /clangd-test/TestTU.cpp
Building first preamble for /clangd-test/TestTU.cpp
Built preamble of size 204460 for file /clangd-test/TestTU.cpp
Building first preamble for /clangd-test/TestTU.cpp
Built preamble of size 204288 for file /clangd-test/TestTU.cpp
Building first preamble for /clangd-test/TestTU.cpp
Built preamble of size 204288 for file /clangd-test/TestTU.cpp
Building first preamble for /clangd-test/TestTU.cpp
Built preamble of size 204288 for file /clangd-test/TestTU.cpp
Building first preamble for /clangd-test/TestTU.cpp
Built preamble of size 204288 for file /clangd-test/TestTU.cpp
Building first preamble for /clangd-test/TestTU.cpp
Built preamble of size 204288 for file /clangd-test/TestTU.cpp
Building first preamble for /clangd-test/TestTU.cpp
Built preamble of size 204288 for file /clangd-test/TestTU.cpp
Building first preamble for /clangd-test/TestTU.cpp
Built preamble of size 204288 for file /clangd-test/TestTU.cpp
Building first preamble for /clangd-test/TestTU.cpp
Built preamble of size 204288 for file /clangd-test/TestTU.cpp
Building first preamble for /clangd-test/TestTU.cpp
Built preamble of size 204288 for file /clangd-test/TestTU.cpp
Building first preamble for /clangd-test/TestTU.cpp
Built preamble of size 204288 for file /clangd-test/TestTU.cpp
Building first preamble for /clangd-test/TestTU.cpp
Built preamble of size 204288 for file /clangd-test/TestTU.cpp
Building first preamble for /clangd-test/TestTU.cpp
Built preamble of size 204288 for file /clangd-test/TestTU.cpp
Building first preamble for /clangd-test/TestTU.cpp
Built preamble of size 204288 for file /clangd-test/TestTU.cpp